##TITLE=AC1561_ROEFFECT0018_8270796_OJMknnd640
##JCAMPDX= 6.0         $$ Bruker NMR JCAMP-DX V2.0
##DATA TYPE= NMR SPECTRUM
##DATA CLASS= NTUPLES
##ORIGIN= BRUKER
##OWNER= Administrator
$$ 1.72 TOPSPIN		Version 2.1
$$ 2013-10-12 21:00:22.950 -0700  Administrator@X
$$ Compression mode = diff/dup
##.OBSERVE FREQUENCY= 400.02188249412
##.OBSERVE NUCLEUS= ^1H
##.ACQUISITION MODE= SIMULTANEOUS (DQD)
##.ACQUISITION SCHEME= undefined
##.AVERAGES= 64
##.DIGITISER RES= 22
##SPECTROMETER/DATA SYSTEM= spect
##.PULSE SEQUENCE= noesygpps1d.comp
##.SOLVENT NAME= COFFEE_meoh
##.SHIFT REFERENCE= INTERNAL, COFFEE_meoh, 1, 14.96105
##AUDIT TRAIL= $$ (NUMBER, WHEN, WHO, WHERE, PROCESS, VERSION, WHAT)
$$ ##TITLE= Audit trail, TOPSPIN		Version 2.1
$$ ##JCAMPDX= 5.01
$$ ##ORIGIN= Bruker BioSpin GmbH
$$ ##OWNER= Administrator
$$ $$ E:\/data/COFFEE/nmr/AC1561_ROEFFECT0018_8270796_OJMknnd640/12/pdata/1/auditp.txt
$$ ##AUDIT TRAIL=  $$ (NUMBER, WHEN, WHO, WHERE, PROCESS, VERSION, WHAT)
(   1,<2013-10-12 21:00:17.124 -0700>,<Administrator>,<X>,<go>,<TOPSPIN 2.1>,
      <created by zg
	started at 2013-10-12 20:48:46.756 -0700,
	POWCHK enabled, PULCHK disabled,
       configuration hash MD5:
       C8 4E 4E 5D D3 5C D8 9E 9F 52 82 E0 59 8A DE 15
       data hash MD5: 64K
       48 A2 83 C2 63 CF A4 0B 7C C7 70 A7 27 D4 92 D8>)
(   2,<2013-10-12 21:00:20.492 -0700>,<Administrator>,<X>,<proc1d>,<TOPSPIN 2.1>,
      <Start of raw data processing
       efp LB = 0.3 FT_mod = 6 PKNL = 1 PHC0 = 0 PHC1 = 0 SI = 128K 
       data hash MD5: 128K
       C4 92 10 74 45 14 17 0D 67 70 8A B2 49 C9 F9 C4>)
(   3,<2013-10-12 21:00:21.781 -0700>,<Administrator>,<X>,<proc1d>,<TOPSPIN 2.1>,
      <pk PHC0 = -80.97473 PHC1 = 0 
       data hash MD5: 128K
       AE 27 29 50 D2 C7 20 0B A7 F9 B6 4A 34 18 59 09>)
(   4,<2013-10-12 21:00:22.297 -0700>,<Administrator>,<X>,<proc1d>,<TOPSPIN 2.1>,
      <abs ABSG = 1 
       data hash MD5: 128K
       3C A3 3C EC 5D 1F E9 73 C4 BD 7F 1E 3D 77 3F 95>)
(   5,<2013-10-12 21:00:22.452 -0700>,<Administrator>,<X>,<proc1d>,<TOPSPIN 2.1>,
      <abs ABSG = 2 
       data hash MD5: 128K
       AE 40 A0 1F 22 66 F7 9A C3 8D 7E AA 9A 8A D8 B8>)
(   6,<2013-10-12 21:00:22.520 -0700>,<Administrator>,<X>,<proc1d>,<TOPSPIN 2.1>,
      <abs ABSG = 3 
       data hash MD5: 128K
       94 CB 54 D5 25 C7 41 10 3A C4 7E 2B 1E 5C 72 30>)
(   7,<2013-10-12 21:00:22.624 -0700>,<Administrator>,<X>,<proc1d>,<TOPSPIN 2.1>,
      <abs ABSG = 4 
       data hash MD5: 128K
       17 FA EF B2 D8 21 43 32 9C 10 90 26 FA 87 02 73>)
(   8,<2013-10-12 21:00:22.709 -0700>,<Administrator>,<X>,<proc1d>,<TOPSPIN 2.1>,
      <abs ABSG = 5 
       data hash MD5: 128K
       CF 4E 91 CF 4F 46 A7 75 D4 84 77 C8 07 76 08 37>)
$$ ##END=
$$ 
$$ $$ hash MD5
$$ $$ DE 44 5A 90 10 E0 F6 FD 0A FD D9 A5 74 58 F0 E9
##$RELAX= 
##$RELAX= 
##$RELAX= 
##$RELAX= 
##$RELAX= 
##$RELAX= 
##$RELAX= 
##$RELAX= 
$$ Bruker specific parameters
$$ --------------------------
##$DU= <E:\>
##$EXPNO= 12
$$ [...]
##$TP07= 0
##$TPNAME0= <>
##$TPNAME1= <>
##$TPNAME2= <>
##$TPNAME3= <>
##$TPNAME4= <>
##$TPNAME5= <>
##$TPNAME6= <>
##$TPNAME7= <>
##$TPOAL= (0..7)
0.5 0.5 0.5 0.5 0.5 0.5 0.5 0.5
##$TPOFFS= (0..7)
0 0 0 0 0 0 0 0
##$TUNHIN= 0
##$TUNHOUT= 0
##$TUNXOUT= 0
##$USERA1= <user>
##$USERA2= <user>
##$USERA3= <user>
##$USERA4= <user>
##$USERA5= <user>
##$V9= 5
##$VALIST= <valist>
##$VCLIST= <CCCCCCCCCCCCCCC>
##$VD= 0
##$VDLIST= <DDDDDDDDDDDDDDD>
##$VPLIST= <PPPPPPPPPPPPPPP>
##$VTLIST= <TTTTTTTTTTTTTTT>
##$WBST= 1024
##$WBSW= 4
##$XGAIN= (0..3)
0 0 0 0
##$XL= 0
##$YL= 0
##$YMAX_a= 6138638
##$YMIN_a= -13547207
##$ZGOPTNS= <>
##$ZL1= 120
##$ZL2= 120
##$ZL3= 120
##$ZL4= 120
##$ABSF1= 14.96105
##$ABSF2= -5.597132
##$ABSG= 5
##$ABSL= 3
##$ALPHA= 0
##$AQORDER= 0
##$ASSFAC= 0
##$ASSFACI= 0
##$ASSFACX= 0
##$ASSWID= 0
##$AUNMP= <proc_prof1d_extract.lims>
##$AXLEFT= 0
##$AXNAME= <>
##$AXNUC= <1H>
##$AXRIGHT= 0
##$AXTYPE= 0
##$AXUNIT= <>
##$AZFE= 0.1
##$AZFW= 0.1
##$BCFW= 0
##$BC_mod= 0
##$BYTORDP= 0
##$COROFFS= 0
##$CY= 15
##$DATMOD= 1
##$DC= 0
##$DFILT= <>
##$DTYPP= 0
##$F1P= 0
##$F2P= 0
##$FCOR= 0.5
##$FTSIZE= 131072
##$FT_mod= 6
##$GAMMA= 0
##$GB= 0
##$INTBC= 1
##$INTSCL= 1
##$ISEN= 128
##$LB= 0.3
##$LEV0= 0
##$LPBIN= 0
##$MAXI= 10000
##$MC2= 0
##$MEAN= 0
##$ME_mod= 0
##$MI= 0
##$NCOEF= 0
##$NC_proc= -2
##$NLEV= 6
##$NOISF1= 0
##$NOISF2= 0
##$NSP= 0
##$NTH_PI= 0
##$NZP= 0
##$OFFSET= 14.96105
##$PC= 1
##$PHC0= -80.97473
##$PHC1= 0
##$PH_mod= 1
##$PKNL= yes
##$PPARMOD= 0
##$PPDIAG= 0
##$PPIPTYP= 0
##$PPMPNUM= 2147483647
##$PPRESOL= 1
##$PSCAL= 4
##$PSIGN= 0
##$PYNMP= <proc.py>
##$REVERSE= no
##$SF= 400.020009615166
##$SI= 131072
##$SIGF1= 0
##$SIGF2= 0
##$SINO= 400
##$SIOLD= 131072
##$SPECTYP= <>
##$SREGLST= <1H.CDCl3>
##$SSB= 0
##$STSI= 131072
##$STSR= 0
##$SW_p= 8223.68421052631
##$SYMM= 0
##$S_DEV= 0
##$TDeff= 65536
##$TDoff= 0
##$TI= <>
##$TILT= no
##$TM1= 0
##$TM2= 0
##$TOPLEV= 0
##$USERP1= <user>
##$USERP2= <user>
##$USERP3= <user>
##$USERP4= <user>
##$USERP5= <user>
##$WDW= 1
##$XDIM= 131072
##$YMAX_p= 440742772
##$YMIN_p= -14125
##$CURPLOT= <Network HP LaserJet P1505>
##$CURPRIN= <$Network HP LaserJet P1505>
##$DFORMAT= <normdp>
##$LAYOUT= <+/1D_H.xwp>
##$LFORMAT= <normlp>
##$PFORMAT= <normpl>
##$SURQMSG= 1
$$ End of Bruker specific parameters
$$ ---------------------------------
##NTUPLES= NMR SPECTRUM
##VAR_NAME=  FREQUENCY,     SPECTRUM/REAL,   SPECTRUM/IMAG
##SYMBOL=    X,             R,               I
##VAR_TYPE=  INDEPENDENT,   DEPENDENT,       DEPENDENT
##VAR_FORM=  AFFN,          ASDF,            ASDF
##VAR_DIM=   131072,        131072,          131072
##UNITS=     HZ,            ARBITRARY UNITS, ARBITRARY UNITS
##FACTOR=    0.0627417313425164, 1,          1
##FIRST=     8223.62146879497, 1962,         -65825
##LAST=      0,             3985,            -66055
##MIN=       0,             -14125,          0
##MAX=       8223.62146879497, 440742772,    0
$$ Real data points
##PAGE= N=1
##DATA TABLE= (X++(R..R)), XYDATA
$$ [...]
63813F81985l0638l0386k9190k7223k5045k2890k0524j8074j6245j5313j4372
63802D32085j2370r589p408o646o811o989o918o881o970o885o402n725n221m905
63788C32365m419l600k861k729l141l490l340k823k319k019j916j983k261k795
63774B92669l416l622k923j586o51p88j423j507r32n09o60r55j008j043j245j248
63758B69153p29k4K94J63p6k69n88j157j746j879j243j34O64O33R5k83l60m47
63740B62067n73l55L97J464K594L509L761L160K366K279K786K926K394J956K156
63725B92887K528K613K832L692M754N201N015M868N085N390N492N378N088M619
63711C55442M007L256K230Q62o53k008k994l511l595l501l482l444l105k480j872
$$ y = [681985, 651347, 620961, 591771, 564548, 539503, 516613, 496089, 478015, 461770, 446457, 432085, 419715, 410126, 402718, 396072, 389261, 382272, 375354, 368473, 361503, 354618, 348216, 342491, 337270, 332365, 327946, 324346, 321485, 318756, 315615, 312125, 308785, 305962, 303643, 301624, 299708, 297725, 295464, 292669, 289253, 285631, 282708, 281122, 280471, 279683, 278260, 276753, 275821, 275312, 274652, 273697, 272689, 271646, 270401, 269153, 268424, 268400, 268694, 268857, 268781, 268512, 267924, 266767, 265021, 263142, 261899, 261765, 262429, 263062, 263157, 262874, 262514, 262067, 261494, 261139, 261536, 263000, 265594, 269103, 272864, 276024, 278390, 280669, 283455, 286381, 288775, 290731, 292887, 295415, 298028, 300860, 304552, 309306, 314507, 319522, 324390, 329475, 334865, 340357, 345735, 350823, 355442, 359449, 362705, 364935, 365797, 365144, 363136, 360142, 356631, 353036, 349535, 346053, 342609, 339504, 337024, 335152]
63696C35152j432j148j155j453j402k73J627L092L516L505L783M227M365M126
63682C56530L678L065K437K035J652P81l74p72OR95J172Q68J062J781K152J790
63666C78858J297J379K005K533K372J571Q78Q93J217Q88l01j558k336k984l867
63651C82845m687n220n864o843p519p214o057m409k238J66J669J575Q23R23K073
63636C40023L402M500N578O364O168N148M411M596N201N480N327N040M828M724
63622D10790M636M392M001L785L920M148M337M952O438Q419J0177J1581J2997
63609D94573J4570J6247J8216K0615K3073K5225K7356K9865L2410L4255L5126
63598G71531L4941L3133K9243K3808J7700J1020L772k776o880q427q865q953q127
$$ y = [335152, 333720, 332572, 331417, 329964, 328562, 328289, 329916, 333008, 336524, 340029, 343812, 348039, 352404, 356530, 360208, 363273, 365710, 367745, 369397, 370178, 369804, 369032, 369038, 370033, 371205, 372073, 373135, 374916, 377068, 378858, 380155, 381534, 383539, 386072, 388444, 390015, 390893, 391786, 393003, 393891, 393590, 392032, 389696, 386712, 382845, 378158, 372938, 367074, 360231, 352712, 345498, 339441, 335032, 332794, 332960, 334629, 336204, 337027, 337950, 340023, 343425, 347925, 353503, 359867, 366035, 371183, 375594, 380190, 385391, 390871, 396198, 401238, 406066, 410790, 415426, 419818, 423819, 427604, 431524, 435672, 440009, 444961, 451399, 459818, 469995, 481576, 494573, 509143, 525390, 543606, 564221, 587294, 612519, 639875, 669740, 702150, 736405, 771531, 806472, 839605, 868848, 892656, 910356, 921376, 925148, 922372, 915492, 907065, 898200, 889247, 881120]
63585H81120o437n517o814r935j3610j7329k1112k4509k6818k7905k7996k7031
63573F66107k4896k1995j8995j6245j3840j1925j0382q551n843k535M90K639L901
63560E37930M414M244L591K913K739L356M587N840O519O601O720P684R916J3233
63546F20287J6981K0557K4057K8297L3927M0665M7769N4827O1255O4984O2743
63535A076349N2402L5107J4941l331j6436k3392k5018k2844j8346j2979q336n649
63523A042468n163o421r138j3358j8753k4378k9312l3183l5942l7504l7803l6865
63511G54648l4779l1828k8626k5743k3190k0702j8378j6587j5269j3995j2735
63500E12816j1911j1497j0811r536q327p970q338q642q320p321n882m441l567
$$ y = [881120, 874683, 869166, 862352, 852417, 838807, 821478, 800366, 775857, 749039, 721134, 693138, 666107, 641211, 619216, 600221, 583976, 570136, 558211, 547829, 539278, 533435, 530900, 531390, 534029, 537930, 542344, 546588, 550179, 553092, 555831, 559187, 563774, 569614, 576133, 582734, 589454, 597138, 607054, 620287, 637268, 657825, 681882, 710179, 744106, 784771, 832540, 887367, 948622, 1013606, 1076349, 1128751, 1163858, 1178799, 1175468, 1159032, 1135640, 1110622, 1087778, 1069432, 1056453, 1048117, 1042468, 1037305, 1030884, 1021746, 1008388, 989635, 965257, 935945, 902762, 866820, 829316, 791513, 754648, 719869, 688041, 659415, 633672, 610482, 589780, 571402, 554815, 539546, 525551, 512816, 500905, 489408, 478597, 469061, 460734, 452764, 444426, 435784, 427464, 420143, 414261, 409820, 406253]
63487D06253l445l564l247k483j914j973k218j680R6K392L936M291M332N112O483
63472D12371P372P192O457N884N492M746L299J364l96j391j692j967k561k893
63458D43277k333j401j276k103k645j858k06R79R07j73j410j942j437l28O42J234
63442D29927J752K349K833L299M313O247Q815J1460J3836J5811J7579J9915K3776
63429E61912K9484L6684M4840N2697N7181N4423M3209K6832J0605k150j1053j6508
63417H88156j8240j6060j0832l943L659J1495J9057K5781L1350L5597L8106L8211
63405A042337L5506L0304K3431J5670P615Q0n772r135j0238j0027r270q486q519
63392A093496j0451j4603k0116k5799l1003l5461l8718m0261m0041l8577l6509
$$ y = [406253, 402808, 399244, 395997, 393514, 391600, 389627, 387409, 385729, 385825, 388217, 392153, 396444, 400776, 405888, 412371, 419743, 426935, 433392, 439276, 444768, 449514, 452813, 454177, 453781, 452390, 450698, 448731, 446170, 443277, 440944, 439543, 438267, 436164, 433519, 431661, 431455, 432434, 433341, 433168, 431758, 429816, 428379, 428051, 428693, 429927, 431679, 434028, 436861, 440160, 444473, 450720, 459535, 470995, 484831, 500642, 518221, 538136, 561912, 591396, 628080, 672920, 725617, 782798, 837221, 880430, 907262, 917867, 915717, 904664, 888156, 869916, 853856, 843024, 839081, 842740, 854235, 873292, 899073, 930423, 966020, 1004126, 1042337, 1077843, 1108147, 1131578, 1147248, 1154863, 1154943, 1149171, 1140036, 1129798, 1119771, 1110501, 1102015, 1093496, 1083045, 1068442, 1048326, 1022527, 991524, 956063, 917345, 877084, 837043, 798466, 761957]
63381G61957l4233l1817k9185k6379k3649k1158j8695j6010j3275j0870q762o573
63369E21351m245k067j5K301M849O894P920Q396R311J1190J3825J6680J9309K1653
63355F37352K4155K7318L1138L5122L8820M2023M4481M5950M6437M5859M3571
63344A062226L8883L2024K3930J5148N912k670q774j1681j2467j2344j1427r814
63332A108946q753r586j2286j6082k0836k6634l2434l6495l8140l8095l7153l5375
63320G97077l2568k8636k3468j7239j0747m629J568Q322J3949J4773Q302m128
63308G22576j8267k9892l6724l8462l6142l1507k6331k1792j8267j5517j3103
63297D36572j0831q878p416o224n046m090l769l938l916l400k791k447k138j531
$$ y = [761957, 727724, 695907, 666722, 640343, 616694, 595536, 576841, 560831, 547556, 536686, 527924, 521351, 517106, 515039, 515024, 517325, 522174, 529068, 536988, 545384, 554695, 565885, 579710, 596390, 615699, 637352, 661507, 688825, 719963, 755085, 793905, 835928, 880409, 926359, 972796, 1018655, 1062226, 1101109, 1133133, 1157063, 1172211, 1178123, 1175453, 1166679, 1154998, 1142531, 1130187, 1118760, 1108946, 1100193, 1090607, 1078321, 1062239, 1041403, 1014769, 982335, 945840, 907700, 869605, 832452, 797077, 764509, 735873, 712405, 695166, 684419, 679790, 681358, 689680, 703629, 718402, 726704, 722576, 704309, 674417, 637693, 599231, 563089, 531582, 505251, 483459, 465192, 449675, 436572, 425741, 416863, 409447, 403223, 398177, 394087, 390318, 386380, 382464, 379064, 376273, 373826, 371688, 370157]
63283C70157q79p13j106j711k319k987l543l471k523j256o34j070j974k284j456
63268C42231Q6J412J936J862J835K184K627K750K658K815L259L414K928K328K390
63253C76715L085L752M130M607N334N809N655N291N371N926O489O847P246P963
63239D54220Q999J0132J1109J1883J2746J4093J5959J7989J9862K1502K2792K3539
63227F44825K3872K4271K4895K5256K4855K3893K3009K2574K2512K2615K2781
63216I05358K3061K3728K5027K6720K8056K8364K7460K5390K2229J8280J3974
63205A167647R223L321m119j2341k0042k6457l1566l5465l8015l8971l8177l5792
63193H99246l2537k9373k6687k4017k0846j7231j3425r417n271j455J709M609
$$ y = [370157, 369278, 368565, 367459, 365748, 363429, 360442, 356899, 353428, 350905, 349649, 349015, 347945, 345971, 343687, 342231, 342317, 343729, 345665, 347527, 349362, 351546, 354173, 356923, 359581, 362396, 365655, 369069, 371997, 374325, 376715, 379800, 383552, 387682, 392289, 397623, 403432, 409087, 414378, 419749, 425675, 432164, 439011, 446257, 454220, 463219, 473351, 484460, 496343, 509089, 523182, 539141, 557130, 576992, 598494, 621286, 644825, 668697, 692968, 717863, 743119, 767974, 791867, 814876, 837450, 859962, 882577, 905358, 928419, 952147, 977174, 1003894, 1031950, 1060314, 1087774, 1113164, 1135393, 1153673, 1167647, 1176870, 1180191, 1176072, 1163731, 1143689, 1117232, 1085666, 1050201, 1012186, 973215, 935038, 899246, 866709, 837336, 810649, 786632, 765786, 748555, 735130, 725713, 720442, 718987, 720696, 725305]
63181G25305P790J1173J4312J7063J9439K1172K2045K2391K2648K2656K2039K0996
63169I49029K0013J9005J7497J5559J3745J2206J0558Q621O467L762j29n217j0761
63156A060355j6180k1414k6224k9962l2381l3969l5115l5537l4949l3739l2431
63145G28454l0860k8419k4914k0813j6912j3989j2412j1710j0744q720o017l692
63133E39252k354j753j351j033j151j994l285m217m143l203k095j278o49o8K47
63118E10925J07j75J2R42K345L724M676N012M788M269L743L355L127L057L090
63103E52997L059K781K261J733J470J581J928K232K284K119K011K211K727L338
63089E84732L913M545N236N625N321M502L735L091J896k18k479l738l804l344
$$ y = [725305, 733095, 744268, 758580, 775643, 795082, 816254, 838299, 860690, 883338, 905994, 928033, 949029, 969042, 988047, 1005544, 1021103, 1034848, 1047054, 1057612, 1066233, 1072700, 1076462, 1076333, 1071116, 1060355, 1044175, 1022761, 996537, 966575, 934194, 900225, 865110, 829573, 794624, 760885, 728454, 697594, 669175, 644261, 623448, 606536, 592547, 580135, 568425, 557681, 548961, 542944, 539252, 536898, 535145, 533794, 532761, 531610, 529616, 526331, 522114, 517971, 514768, 512673, 511395, 510746, 510678, 510925, 511032, 510857, 510869, 511811, 514156, 517880, 522556, 527568, 532356, 536625, 540368, 543723, 546850, 549907, 552997, 556056, 558837, 561098, 562831, 564301, 565882, 567810, 570042, 572326, 574445, 576456, 578667, 581394, 584732, 588645, 593190, 598426, 604051, 609372, 613874, 617609, 620700, 622596, 622378, 619899, 616161, 612357, 609013]
63075F09013k690j578o9J282K389L926O083P801Q020P201O918Q100J0253J2260
63061F78909J3452J4021J4716J6112J7997J9773K1573K4395K8722L3564L7549
63050I20783M0479M3189M6230M9505N2931N6601O0169O2918O4514O5226O5339
63039A527884O4946O4271O3716O3390O3127O3050O3627O5027O6791O8288O9044
63028B243161O8586O6254O1432N3763M3216L0200J5565J26j5799l2077m8081o2688
63016B423658p4977q4534r1146r4571r4755r1986q6827q0080p2672o5172n7417
63005A529521m8927l9648l0051k0614j1585l182M378J1054J6898K1815K5672K8458
62993A483789L0187L0772L0463L0034L0101L0433L0417L0090L0054L0495L0819
$$ y = [609013, 606323, 604745, 604676, 605958, 608347, 612273, 618356, 626157, 634177, 641378, 648296, 656396, 666649, 678909, 692361, 706382, 721098, 737210, 755207, 774980, 796553, 820948, 849670, 883234, 920783, 961262, 1004451, 1050681, 1100186, 1153117, 1209718, 1269887, 1332805, 1397319, 1462545, 1527884, 1592830, 1657101, 1720817, 1784207, 1847334, 1910384, 1974011, 2039038, 2105829, 2174117, 2243161, 2311747, 2378001, 2439433, 2493196, 2536412, 2566612, 2582177, 2582303, 2566504, 2534427, 2486346, 2423658, 2348681, 2264147, 2173001, 2078430, 1983675, 1891689, 1804862, 1724782, 1652110, 1586938, 1529521, 1480594, 1440946, 1410895, 1390281, 1378696, 1375514, 1379892, 1390946, 1407844, 1429659, 1455331, 1483789, 1513976, 1544748, 1575211, 1605245, 1635346, 1665779, 1696196, 1726286, 1756340, 1786835, 1817654]
62982A817654L0274K8449K5145K0295J4137P042q59r575j8860k8287l7652m6760
62970A801003n4911o1119o4915o6606o6777o5910o4248o1591n7455n1987m6446
62959A139038m2065l8700l5372l1947k9210k7316k5382k2951k0820j9812j9570
62948H25893j9205j8510j7833j7185j6238j4989j3901j3411j3584j3994j3849
62937F53194j2615j0759r474r264r260q330o507m754l583k552j156L40J224J269
62923E77773J013J089J428J398O60l95j233j827k412k908l094l145l429l814l767
62908E57337l184k564k243j966j437q73p53j280k201l017l300l058k758k734k690
62893E23279k108r81K27J206J883K159K022J747J390L68j629l520l665j950p2
$$ y = [1817654, 1847928, 1876377, 1901522, 1921817, 1935954, 1942996, 1942137, 1932562, 1913702, 1885415, 1847763, 1801003, 1746092, 1684973, 1620058, 1553452, 1486675, 1420765, 1356517, 1294926, 1237471, 1185484, 1139038, 1096973, 1058273, 1022901, 990954, 961744, 934428, 909046, 886095, 865275, 845463, 825893, 806688, 788178, 770345, 753160, 736922, 721933, 708032, 694621, 681037, 667043, 653194, 640579, 629820, 620346, 611082, 601822, 593492, 586985, 582231, 578648, 576096, 574940, 575280, 576504, 577773, 578786, 579875, 581303, 582701, 583361, 582966, 581733, 579906, 577494, 574586, 571492, 568347, 564918, 561104, 557337, 554153, 551589, 549346, 547380, 545943, 545070, 544317, 543037, 540836, 537819, 534519, 531461, 528703, 525969, 523279, 521171, 520190, 520417, 521623, 523506, 525665, 527687, 529434, 530824, 531192, 529563, 526043, 522378, 520428, 520356]
62878E20356N49K48J90Q02J744K628L124K810J601O6j146j967k642l166l341l194
62862E18662l008l046l372l718l532k569j432j055j535j983j682q65j65J43J64
62847D91007J44M17J083J603J286L80p3L39Q23O04mk69j44%J23L76N56L73Qj34
62827D98498k3J05K37N40J025J651K524L617M508M749M374L746L149K764K760
62812E34224L085L392L419L296L258L320L385L413L358L229L328M005N126O178
62798E86016P031Q058R355J0425J0952J1311J1987J2944J3899J4744J5432J5956
62786G28110J6772J8732K2149K6369L0646L5000L9882M5444N1552N8078O4873
62775A137607P1769P8853Q6274R3564R9787J04623J08517J11377J11941J08944
$$ y = [520356, 520905, 521153, 521343, 522145, 523889, 526517, 529641, 532451, 534052, 534118, 532972, 531005, 528363, 525197, 521856, 518662, 515654, 512608, 509236, 505518, 501986, 499417, 497985, 496930, 495395, 493412, 491730, 490865, 490700, 490843, 491007, 491151, 491568, 492651, 494254, 495540, 495920, 495847, 496186, 497009, 497613, 497609, 497340, 497196, 497196, 497319, 497695, 498251, 498624, 498632, 498498, 498475, 498580, 498817, 499357, 500382, 502033, 504557, 508174, 512682, 517431, 521805, 525551, 528700, 531464, 534224, 537309, 540701, 544120, 547416, 550674, 553994, 557379, 560792, 564150, 567379, 570707, 574712, 579838, 586016, 593047, 601105, 610460, 620885, 631837, 643148, 655135, 668079, 681978, 696722, 712154, 728110, 744882, 763614, 785763, 812132, 842778, 877778, 917660, 963104, 1014656, 1072734, 1137607, 1209376, 1288229, 1374503, 1468067, 1567854, 1672477, 1780994, 1892371, 2004312, 2113256]
62765B113256J02364R2847Q0703O6118M9809L2610J4758l761k2495m0684n7736
62754B427789p2910q5080r3540r8820j02021j03617j03392j01255r7550r2833
62744A476771q7737q2728p7575p1579o4769n8250n2818m7939m2765l7506l2932
62733H20173k9156k5845k3134k1278j9749j7714j5189j2863j0979r327p986p178
62721F19775o571n635m497l518k366n26J494K686L190M129N761P063P518Q088
62707F36591R814J2397J4886J6982J9070K1414K4017K6908L0155L3797L7980M2806
62695I26817M7885N2467N6323O0055O4275O8780P2783P5723P7531P8245P7539
62684A658423P4605O8539N9068M6910L3239J8862M097j0813k5430l9180n1367
$$ y = [2113256, 2215620, 2308467, 2389170, 2455288, 2505097, 2537707, 2552465, 2548704, 2526209, 2485525, 2427789, 2354879, 2269799, 2176259, 2077439, 1975418, 1871801, 1768409, 1667154, 1569604, 1476771, 1389034, 1306306, 1228731, 1157152, 1092383, 1034133, 981315, 933376, 890611, 853105, 820173, 791017, 765172, 742038, 720760, 701011, 683297, 668108, 655245, 644266, 634939, 626953, 619775, 613204, 607569, 603072, 599554, 597188, 596662, 598156, 600842, 604032, 608161, 613922, 620985, 628503, 636591, 646405, 658802, 673688, 690670, 709740, 731154, 755171, 782079, 812234, 846031, 884011, 926817, 974702, 1027169, 1083492, 1143547, 1207822, 1276602, 1349385, 1425108, 1502639, 1580884, 1658423, 1733028, 1801567, 1860635, 1907545, 1940784, 1959646, 1963743, 1952930, 1927500, 1888320, 1836953]
62673A836953o1277o8643p3881p7537p9679q0045p8540p5295p0518o4796n9179
62662A047563n4351n0019m5602m1263l7597l4566l1556k8439k5749k3726k1871
62651F52824j9640j7077j4585j2530j1068j0079r221q405q013q239q471p908o576
62638E11012n175m097l255k708k654k813k591j882j063j94R57K004J915L01j892
62623D87865l367l695l299k668j965j190l93K02L52J36KK41P12J281K198L548
62607D79960M758N268N363N706O333O854P405Q528J0316J2357J4500J6837J9144
62594F03329K1151K3274K6160K9701L3332L7114M1443M5817M9167N1386N3188
62583A015062N4324N3399M9905M4972L9402L2383K3105J2457J932q219j8429k8119
$$ y = [1836953, 1775676, 1707033, 1633152, 1555615, 1475936, 1395891, 1317351, 1242056, 1171538, 1106742, 1047563, 993212, 943193, 897591, 856328, 818731, 784165, 752609, 724170, 698421, 674695, 652824, 633184, 616107, 601522, 588992, 577924, 567845, 558624, 550219, 542206, 533967, 525496, 517588, 511012, 505837, 501740, 498485, 495777, 493123, 490310, 487719, 485837, 484774, 484580, 485537, 487541, 489456, 489757, 487865, 484498, 480803, 477504, 474836, 472871, 471681, 471288, 471490, 471842, 471978, 471980, 472221, 472933, 474214, 476412, 479960, 484718, 489986, 495349, 501055, 507388, 514242, 521647, 530175, 540491, 552848, 567348, 584185, 603329, 624480, 647754, 673914, 703615, 736947, 774061, 815504, 861321, 910488, 961874, 1015062, 1069386, 1122785, 1172690, 1217662, 1257064, 1289447, 1312552, 1325009, 1326941, 1318722, 1300293, 1272174]
62571A272174l5914m1348m5149m7897m9381m9408m8390m6857m4921m2413l9273
62560G81223l5685l2073k8863k6098k3421k0599j7905j5720j4016j2466j0866
62549E43511r249p754o606o016n878n781n409m785m004l076k140j428q85j15J026
62534D81411K110K605K454J972J446R87N74J32k59k11O12K008L439M675N865P122
62518E16942Q510J0310J2707J5228J7255J9070K1641K5202K8883L1986L4803L7761
62506G80298M0574M2789M4539M6055M6915M6364M3989L9751L3804K6637J9010
62495A210725J1193K845n972j4158k0510k4797k7326k8019k6692k3887k0549j7011
62483A015842j2975q403l756N85M553Q053J0986J3688J6725J9917K1807K0568
$$ y = [1272174, 1236260, 1194912, 1149763, 1101866, 1052485, 1003077, 954687, 907830, 862909, 820496, 781223, 745538, 713465, 684602, 658504, 635083, 614484, 596579, 580859, 566843, 554377, 543511, 534262, 526508, 519902, 513886, 508008, 502227, 496818, 492033, 488029, 484953, 482813, 481385, 480500, 480385, 481411, 483521, 486126, 488580, 490552, 491998, 492985, 493559, 493691, 493432, 493221, 493833, 495841, 499280, 503955, 509820, 516942, 525452, 535762, 548469, 563697, 580952, 600022, 621663, 646865, 675748, 707734, 742537, 780298, 820872, 863661, 908200, 954255, 1001170, 1047534, 1091523, 1131274, 1165078, 1191715, 1210725, 1221918, 1224763, 1218791, 1204633, 1184123, 1159326, 1132000, 1103981, 1077289, 1053402, 1032853, 1015842, 1002867, 994464, 990708, 991293, 995846, 1003899, 1014885, 1028573, 1045298, 1065215, 1087022, 1107590]
62471A107590J5618Q466J809k571n345q929j5088k3328l1521l7645m0869m1578
62459I26609m1017m0577m0795m0970m0044l7719l4458l0710k6630k2460j8636
62448E52593j5384j2534r835p303n185l672k697j952j143j81Q73J978L058L879
62434E02495M293M606N345O514P388P163N643L213M48k087l992n179n835o185
62420E23830o473p028p975q875r012q202o972n835m793l700k737k223k193k411
62406D45401k671k933l202l412l388l026k570k415k540k425j770r29k16O50J895
62391D16449K974L356L573M448N526N468M033K530K059K413K956L554M160M505
62377D68004M630N030N803O498O988P603Q062P542O274N871P202R049R794R503
$$ y = [1107590, 1123208, 1131674, 1133483, 1130912, 1125567, 1116638, 1101550, 1078222, 1046701, 1009056, 968187, 926609, 885592, 845015, 804220, 763250, 723206, 685487, 651029, 620319, 593689, 571229, 552593, 537209, 524675, 514840, 507537, 502352, 498680, 495983, 494031, 492888, 492707, 493580, 495558, 498616, 502495, 506788, 511394, 516739, 523253, 530641, 537804, 543447, 546660, 547108, 545021, 541029, 535850, 530015, 523830, 517357, 510329, 502354, 493479, 484467, 476265, 469293, 463458, 458665, 454965, 452228, 450005, 447812, 445401, 442730, 439797, 436595, 433183, 429795, 426769, 424199, 421784, 419244, 416819, 415049, 414120, 413904, 414554, 416449, 419423, 422779, 426352, 430800, 436326, 441794, 445827, 448357, 450416, 452829, 455785, 459339, 463499, 468004, 472634, 477664, 483467, 489965, 496953, 504556, 512618, 520160, 526434, 532305, 539507, 548556, 558350, 567853]
62363E67853R300R562J0038J1047J3211J6330J9594K2770K6234L0100L4296L9183
62351H09518M5104N1394N6759O0594O3051O3981O2666N8708N2391M4109L4149
62340A402424K3197J2512L299l962r702j5010k0852k7121l2763l7067m0335m2831
62328A211789m3917m3046m0984l8946l6909l3965l0132k6640k4282k2662k1332
62317H48974k0713k1333k2814k4084k4307k3408k2032k1017k0547j9888j8339
62306F10492j6226j4381j2902j1243r401q040p278o355m895l665l443l773l534
62293E05356k386j071l88m09o33n77j14N59J241J938K714L372L589L431L387L720
62277E23729M021L643K502J162J65m43q09p17K13J775L067L494L605M360N802
$$ y = [567853, 577153, 586715, 596753, 607800, 621011, 637341, 656935, 679705, 705939, 736039, 770335, 809518, 854622, 906016, 962775, 1023369, 1086420, 1150401, 1213067, 1271775, 1324166, 1368275, 1402424, 1425621, 1438133, 1441432, 1437470, 1427768, 1412758, 1391906, 1364785, 1332022, 1294955, 1254620, 1211789, 1167872, 1124826, 1083842, 1044896, 1007987, 974022, 943890, 917250, 892968, 870306, 848974, 828261, 806928, 784114, 760030, 735723, 712315, 690283, 669266, 648719, 628831, 610492, 594266, 579885, 566983, 555740, 546339, 538299, 531021, 524666, 519771, 516106, 512663, 508890, 505356, 502970, 501899, 501511, 501102, 500469, 499892, 499778, 500337, 501578, 503516, 506230, 509602, 513191, 516622, 520009, 523729, 527750, 531393, 533895, 535057, 535222, 534779, 533970, 533253, 533466, 535241, 538308, 541802, 545407, 549767, 555569]
62262E55569P127Q076R502J2179J5674J8948K1714K4693K8717L3938L9800M5541
62250H21478N0862N6116O1595O6587O9622O9670O6642O0653N1771M0816K9519
62239A445331J9134R476l0r031j6911k4125l1822m0240m8406n5226o0053o2280
62227A125817o1474n8197n3979n0009m6299m2328l8048l3884l0040k6254k2317
62216F62988j8658j6114j4918j4131j2565j0300q620q293q596q386p545o748o315
62203E21799n948n359m571l769l196k957k635j603NJ184J441J600K630M193N234
62188E08048N537N814O497P333Q072Q819R659J0378J0662J0310R492Q892R054
62175F18567R375Q485O087L566K202J677J235J315K842N605Q658J1861J5690J9979
$$ y = [555569, 562696, 570772, 580274, 592453, 608127, 627075, 648789, 673482, 702199, 736137, 775937, 821478, 872340, 928456, 990051, 1056638, 1126260, 1195930, 1262572, 1323225, 1374996, 1415812, 1445331, 1464465, 1473941, 1473911, 1464880, 1447969, 1423844, 1392022, 1351782, 1303376, 1248150, 1188097, 1125817, 1064343, 1006146, 952167, 902158, 855859, 813531, 775483, 741599, 711559, 685305, 662988, 644330, 628216, 613298, 599167, 586602, 576302, 567682, 559389, 550793, 542407, 534862, 528114, 521799, 515851, 510492, 505921, 502152, 498956, 495999, 493364, 491761, 491766, 492950, 494391, 495991, 498621, 502814, 508048, 513585, 519399, 525896, 533229, 541301, 550120, 559779, 570157, 580819, 591129, 600621, 609513, 618567, 627942, 636427, 642514, 646080, 648282, 649959, 651194, 652509, 655351, 660956, 669614, 681475, 697165, 717144]
62161G17144K4177K8618L4056M0034M5056M8386N0373N0942M9111M4358L7381
62150A169636K9256K0769J2723N852J20n079r917j4227j8474k3457k8834l3030
62138A105338l4964l4848l3121k9686k4693j9043j3588q457l526J151N588R799
62126I19950J3372J5874J7704J9598K1252K1595K0594J9520J9080J8548J7234
62115A124321J5617J4241J2592R986O737L602P78j900m573p820j2584j8643k3782
62102A118572k5557k3594j9435j4588r608m832r91J118J276J24r89p86Q97L052
62088A024659M613N361N612N578N342N006M510L697K812K564L368M977P031R476
62074A094606J2171J4660J6635J8209J9377J9718J8967J7466J5796J4289J3071
$$ y = [717144, 741321, 769939, 803995, 844029, 889085, 937471, 987844, 1038786, 1087897, 1132255, 1169636, 1198892, 1219661, 1232384, 1238236, 1238356, 1233277, 1223360, 1209133, 1190659, 1167202, 1138368, 1105338, 1070374, 1035526, 1002405, 972719, 948026, 928983, 915395, 906938, 903412, 904563, 910151, 919950, 933322, 949196, 966900, 986498, 1007750, 1029345, 1049939, 1069459, 1088539, 1107087, 1124321, 1139938, 1154179, 1166771, 1176757, 1183494, 1187096, 1187874, 1185974, 1181401, 1173581, 1160997, 1142354, 1118572, 1093015, 1069421, 1049986, 1035398, 1025790, 1020958, 1019967, 1021085, 1022361, 1022485, 1021496, 1020710, 1021607, 1024659, 1029272, 1034633, 1040245, 1045823, 1051165, 1056171, 1060681, 1064378, 1067190, 1069754, 1073122, 1078099, 1085130, 1094606, 1106777, 1121437, 1138072, 1156281, 1175658, 1195376, 1214343, 1231809, 1247605, 1261894, 1274965]
62063A274965J2049J0773Q946P361P639J0642J5563K0769K4977K7489K8093K7190
62051A476456K5409K2769J8841J3912R090M837K77n451j2051j8877k6042l3776
62039A475394m1356m7707n2635n6556n9302o0167n9066n6769n3983n0813m7182
62028H89858m3178l8878l4281k9556k5140k1464j8708j6748j5200j3722j2302
62017F20681j1139j0330r844r746r997j0129r642q718p985p567o961n949m844
62004E07830l754k372p39N81J438K430L922N409O307O712O898O709N921M714L301
61989E55307J653r0j482k455l488m764n862o644p658r140j0365j0665j0356j0015
61975D73976r504q416o952n586m397l411l016l326l591l049j893q32j31K35P6
$$ y = [1274965, 1287014, 1297787, 1306733, 1314094, 1321733, 1332375, 1347938, 1368707, 1393684, 1421173, 1449266, 1476456, 1501865, 1524634, 1543475, 1557387, 1566477, 1571314, 1571591, 1566140, 1554089, 1535212, 1509170, 1475394, 1434038, 1386331, 1333696, 1277140, 1217838, 1157671, 1098605, 1041836, 987853, 937040, 889858, 846680, 807802, 773521, 743965, 718825, 697361, 678653, 661905, 646705, 632983, 620681, 609542, 599212, 589368, 579622, 569625, 559496, 549854, 541136, 533151, 525584, 518623, 512674, 507830, 504076, 501704, 500965, 501546, 502984, 505414, 509336, 514745, 521052, 527764, 534662, 541371, 547292, 552006, 555307, 556960, 556870, 555388, 552933, 549445, 544681, 538819, 532175, 524517, 515377, 505012, 494347, 483991, 473976, 464472, 456056, 449104, 443518, 439121, 435710, 432694, 429368, 425777, 422728, 420835, 420003, 419872, 420107, 420183]
61960D20183n61r03k72R22J806K275K777L243L203K761K652L272M388N725P176
61945D58647Q472R278R681J0130J0853J1714J2572J3471J4563J6015J7786J9371
61933F12553K0192K0385K0683K1245K1228J9923J7741J5549J3681J2072J0785
61922H06037R673Q089N542K346r22m079o993r196j0476j1271j1904j1925j0844
61909G54077q849o227k773J440N511Q750J1621J4673J7276J8464J8385J7709J6194
61896H66251J3063Q511L585j151n686r619j2444j4509j6508j8146j8610j8180
61884G76557j8008j8313j8163j7125j5796j4488j2790j0861r840j0258j1120j1221
61872F08574j0547r725q917p928o774n567m201k672j245N1J569L416N181O642
$$ y = [420183, 419622, 418719, 418447, 419369, 421175, 423450, 426227, 429470, 432673, 435434, 438086, 441358, 445746, 451471, 458647, 467119, 476397, 486078, 496208, 507061, 518775, 531347, 544818, 559381, 575396, 593182, 612553, 632745, 653130, 673813, 695058, 716286, 736209, 753950, 769499, 783180, 795252, 806037, 815710, 823799, 829341, 831687, 830765, 826686, 819693, 810497, 800021, 788750, 776846, 764921, 754077, 745228, 739001, 736228, 737668, 743179, 751929, 763550, 778223, 795499, 813963, 832348, 850057, 866251, 879314, 887825, 891410, 890259, 884573, 874954, 862510, 848001, 831493, 813347, 794737, 776557, 758549, 740236, 722073, 704948, 689152, 674664, 661874, 651013, 641173, 630915, 619795, 608574, 598027, 588302, 579385, 571457, 564683, 559116, 554915, 552243, 550998, 551049, 552618, 556034, 561215, 567857]
61858E67857Q161R938J1449J2187J2583J3620J5646J8111K0381K2442K4670K7175
61846G64220K9572L1485L3100L4881L6686L7600L6809L4373L0769K6084K0163
61835A115742J3226N912j111p256j2063j5536j8084j9682j9528j7068j2958q337
61823A003257l573J522O685J1244J4955J7869J9622J9672J8106J5306J1061M966
61811A140692k354r446j5538k0887k5639k9343l1808l3365l3988l3131l0855k8266
61799H46072k6245k4456k2113j9284j6819j5295j4459j3581j2234j0804j0103
61788F60679j0281j0365r430p810o532n799m933l750k913k767k737k276j639j322
61774E88125j336j448j567j594j344r13p41j044j578k022k233k082j506p72k48
$$ y = [567857, 576018, 585956, 597405, 609592, 622175, 635795, 651441, 669552, 689933, 712375, 737045, 764220, 793792, 825277, 858377, 893258, 929944, 967544, 1004353, 1038726, 1069495, 1095579, 1115742, 1128968, 1134880, 1133769, 1126513, 1114450, 1098914, 1080830, 1061148, 1041620, 1024552, 1011594, 1003257, 999684, 1001206, 1007891, 1019135, 1034090, 1051959, 1071581, 1091253, 1109359, 1124665, 1135726, 1140692, 1138338, 1128892, 1113354, 1092467, 1066828, 1037485, 1005677, 972312, 938324, 905193, 874338, 846072, 819827, 795371, 773258, 753974, 737155, 721860, 707401, 693820, 681586, 670782, 660679, 650398, 640033, 630603, 622793, 616261, 610462, 605529, 601779, 598866, 596099, 593362, 591086, 589447, 588125, 586789, 585341, 583774, 582180, 580836, 579923, 579182, 578138, 576560, 574538, 572305, 570223, 568717, 567945, 567697]
61759E67697L9K12P4n81j280j297p13k76k05%M85O48J44n69r57j040j024r35r11
61740E59511j216j693j769j238m98J37P53J341J609J531J443J526J713K159L067
61725E68376M055M577M974O097P691Q377P629O713O928P934Q520Q228P419O407
61711F63925N364M560L988L145J792M18o06j700l238m598m952m580m587n433o531
61696F46967p186p314p196p034o795o265n283m099l253k972k940k844k723k629
61682E78434k433k262k596l548m490m773m450l883l197k485k086k071j912j247
61668E37001n39l61m50j77K34j32j509k926l281k531j577j187j265j128m40K23
61652E19955K4j007j857j754j048n69m78k30M54J135J233P70L98O79J433J874
$$ y = [567697, 567736, 567948, 568022, 567441, 566161, 564864, 564151, 563875, 563670, 563670, 564155, 564803, 564947, 564378, 563421, 562381, 561357, 560422, 559511, 558295, 556602, 554833, 553595, 553097, 553234, 553987, 555328, 556937, 558468, 559911, 561437, 563150, 565309, 568376, 572431, 577008, 581982, 588079, 595770, 604147, 611776, 618489, 625417, 633351, 641871, 650099, 657518, 663925, 669289, 673849, 677837, 680982, 682774, 683192, 682586, 680886, 677648, 673050, 668098, 663518, 658931, 653498, 646967, 639781, 632467, 625271, 618237, 611442, 605177, 599894, 595795, 592542, 589570, 586630, 583786, 581063, 578434, 576001, 573739, 571143, 567595, 563105, 558332, 553882, 549999, 546802, 544317, 542231, 540160, 538248, 537001, 536462, 536101, 535651, 535474, 535708, 535576, 534067, 531141, 527860, 525329, 523752, 522565, 521300, 520172, 519732, 519955, 519979, 518972, 517115, 515361, 514313, 513744, 513266, 513036, 513490, 514625, 515858, 516628, 517026, 517705, 519138, 521012]
61636E21012J543Q99O92Q97P56j37j373k428l244l883m110l777l225k952l080
61621D97590l410l668l569k944k048j429j165o75M34J650K053J340m0j528k874
61606D79717m013m955n746o379o688o528o044n641n670n988n968n080l633k578
61592D04806k404k626k692k882l635m411m226l161k380k519k988l114l035l060
61578C61673k992k588k056j556q63k8K26o07j926k653k445j789j180p61n76o28
61562C39251p44p32o04m62l20j97j81k22k8N50J243J613J450R15M08K69M30M72
61544C43111K13J0J25J49l58r55q27j7O54Q94J207J822K300K444K692L221L581
61527C60266L505L277K853J570o78k757l570l406l403l975m507m248l072j599
$$ y = [521012, 522555, 523454, 524146, 525043, 525799, 525662, 524289, 521861, 518617, 514734, 510624, 506847, 503622, 500670, 497590, 494180, 490512, 486943, 483999, 481951, 480522, 479357, 478682, 479116, 480766, 482819, 484159, 484119, 482591, 479717, 475704, 470749, 465003, 458624, 451936, 445408, 439364, 433723, 428053, 422065, 416097, 411017, 407384, 404806, 402402, 399776, 397084, 394202, 390567, 386156, 381930, 378769, 376389, 373870, 370882, 367768, 364733, 361673, 358681, 356093, 354037, 352481, 351618, 351590, 351816, 351209, 349283, 346630, 344185, 342396, 341216, 340455, 339879, 339251, 338507, 337775, 337171, 336709, 336389, 336192, 336011, 335789, 335761, 336311, 337554, 339167, 340617, 341532, 341940, 342209, 342639, 343111, 343324, 343334, 343459, 343608, 343250, 342295, 341468, 341451, 342105, 342999, 344206, 346028, 348328, 350772, 353464, 356685, 360266, 363771, 367048, 369901, 371471, 370793, 368036, 364466, 361060, 357657, 353682, 349175, 344927, 341855, 340256]
61513C40256q16j224k144k291j269O1P57P61M13j08o03p60p36j084j771k019j515
61496C25908r86j049j338j424j671k429l066k732j626o27q9K57N53O80O23M10
61480C11394K6k40J85J277K092J935J339J275J864K478K689K483J966J420J267
61465C33450J430J204L10m85m37P1K06m6o6L15O50O08J87m61r36p42k0M05K03
61446C35846J45Q72J750J796J129N65K81j23n66n47k7O53J541K855M152M617M157
61429C59096L470L054K832K622K355J865J088L33p4j89j05M45J526K479K678K415
61413C85890K441K871L283L495L539L161K130P87l76j406k467l204l273l152l512
61398C90207m103m138l536k886k442j995j599j499j505j255r19q61q49m61pq5
$$ y = [340256, 339440, 338216, 336072, 333781, 332512, 332573, 333330, 334091, 334504, 334396, 333793, 333033, 332297, 331213, 329442, 327423, 325908, 324922, 323873, 322535, 321111, 319440, 317011, 313945, 311213, 309587, 308960, 308871, 309128, 309681, 310361, 310984, 311394, 311420, 311180, 311365, 312642, 314734, 316669, 318008, 319283, 321147, 323625, 326314, 328797, 330763, 332183, 333450, 334880, 336084, 336394, 335909, 335472, 335543, 335749, 335703, 335637, 335952, 336602, 337210, 337397, 336936, 336000, 335258, 335238, 335643, 335846, 335991, 336863, 338613, 340409, 341538, 342103, 342384, 342261, 341695, 341148, 341121, 341774, 343315, 346170, 350322, 354939, 359096, 362566, 365620, 368452, 371074, 373429, 375294, 376382, 376715, 376641, 376452, 376347, 376792, 378318, 380797, 383475, 385890, 388331, 391202, 394485, 397980, 401519, 404680, 406810, 407597, 407221, 405815, 403348, 400144, 396871, 393719, 390207, 386104, 381966, 378430, 375544, 373102, 371107, 369508, 368009, 366504, 365249, 364330, 363469, 362620, 362159, 362152, 362067]
61382C62067m33k98J99J33p03j492j644j383r49j34R90J829K002J787J592J571
61366C65134J839K431K892K606J649P76N13P46J210J772K207K366K509K950L436
61351C95036L563L678M598O315P818Q374Q357Q583R330J0220J0679J0416R694
61338D96661R095Q756Q178P158O361O303O299N334L626K306J698J029k14j643
61324E60947k797l680m251m260l809l379l062k463j473m84K99J056J746K001J847
61309E38238J871K444L338M271N322O657Q279J0112J1984J3541J4598J5373J5905
61296F51933J5568J3781J0930P804M518Q18k766n212o373p087p906q698r475j0482
61282F47353j1343j1209j0102r029q432p563n882m079l009k451j609l18J009K157
$$ y = [362067, 361634, 361336, 361535, 361668, 360965, 359473, 357829, 356446, 355497, 355363, 356353, 358182, 360184, 361971, 363563, 365134, 366973, 369404, 372296, 374902, 376551, 377327, 377840, 378586, 379796, 381568, 383775, 386141, 388650, 391600, 395036, 398599, 402277, 406875, 413190, 421008, 429382, 437739, 446322, 455652, 465872, 476551, 486967, 496661, 505756, 514512, 522690, 529848, 536209, 542512, 548811, 554145, 557771, 560077, 561775, 562804, 562590, 560947, 558150, 554470, 550219, 545959, 542150, 538771, 535709, 533246, 531773, 531289, 531588, 532644, 534390, 536391, 538238, 540109, 542553, 545891, 550162, 555484, 562141, 570420, 580532, 592516, 606057, 620655, 636028, 651933, 667501, 681282, 692212, 700016, 704534, 705352, 702586, 697374, 691001, 683914, 676008, 667310, 657835, 647353, 636010, 624801, 614699, 605670, 597238, 589675, 583793, 579714, 576705, 574254, 572645, 572327, 573336, 575493]
61268E75493L204M042M401M268L994L934M140M342M276M086M228M895N863P129
61254F38295R062J1451J3095J3144J2369J2080J2185J1453R521P348N588L720
61242G59311J202j548l783n246o052o390o646p149p571p240o148n045m300l507
61228F89888k424j531j218r75R1K254M869O950P977Q326Q753R301R208Q251P434
61213G57154P559P827P037N652N276O283P347P379O557N318L676J936Q64P23J050
61198H31638J703L039M846O237P037Q230J0561J3650J6901K0198K3223K5186K5854
61185I98303K5944K5824K4725K1983J8306J5017J2599J0687Q953P349N831M398
61173A179919L191K167J020m30k088l952o125q399j0289j1650j2803j4056j5610
$$ y = [575493, 578697, 582739, 587140, 591408, 595402, 599336, 603476, 607818, 612094, 616180, 620408, 625303, 631166, 638295, 647357, 658808, 671903, 685047, 697416, 709496, 721681, 733134, 742655, 750003, 755591, 759311, 760513, 758965, 755182, 749936, 743884, 737494, 730848, 723699, 716128, 708888, 702740, 697695, 693395, 689888, 687464, 685933, 684715, 683740, 683831, 686085, 690954, 697904, 705881, 714207, 722960, 732261, 741469, 749720, 757154, 764713, 772540, 779577, 785229, 790505, 796788, 804135, 811514, 818071, 823389, 827065, 829001, 829865, 830588, 831638, 833341, 836380, 841226, 847463, 854500, 862730, 873291, 886941, 903842, 924040, 947263, 972449, 998303, 1024247, 1050071, 1074796, 1096779, 1115085, 1130102, 1142701, 1153388, 1162341, 1169690, 1175521, 1179919, 1183110, 1185277, 1186297, 1185867, 1183779, 1179827, 1173702, 1165303, 1155014, 1143364, 1130561, 1116505, 1100895]
61160A100895j7720k0326k2611k3742k3922k3995k4174k4076k3762k3519k2762
61149H50286k0423j6643j2857j0032p899o051m525l051j148O34P93j170m004o339
61135G57571p905q782q655p534o095m713l086j254J40J152K831N593Q417J0447
61121G38127J2198J4455J7053J9637K2538K5955K9180L1660L4026L7015M0134
61110A021978M2301M3291M3691M3914M3978M3786M2994M1107L8238L5131L2088
61099A472497K8582K4351K0005J5952J1653O553R17m966j1466j8696k5687l1358
61087A488337l5688l9108m1454m2350m2225m2010m2125m2277m1964m0759l8525
61076A039852l5754l3207l1066k8903k6588k4505k2683k0629j8215j5852j3582
$$ y = [1100895, 1083175, 1062849, 1040238, 1016496, 992574, 968579, 944405, 920329, 896567, 873048, 850286, 829863, 813220, 800363, 790331, 782432, 776381, 771856, 768805, 767657, 768291, 769084, 767914, 763910, 757571, 749666, 740884, 732229, 724695, 718600, 713887, 710801, 709547, 709687, 710839, 713670, 719263, 727680, 738127, 750325, 764780, 781833, 801470, 824008, 849963, 879143, 910803, 944829, 981844, 1021978, 1064279, 1107570, 1151261, 1195175, 1239153, 1282939, 1325933, 1367040, 1405278, 1440409, 1472497, 1501079, 1525430, 1545435, 1561387, 1573040, 1579593, 1580510, 1575544, 1564078, 1545382, 1519695, 1488337, 1452649, 1413541, 1372087, 1329737, 1287512, 1245502, 1203377, 1161100, 1119136, 1078377, 1039852, 1004098, 970891, 939825, 910922, 884334, 859829, 837146, 816517, 798302, 782450, 768868]
61065G68868j0973q247o406n760n354m316k859j474j18J303K496L313L970M512
61051G38955M930N811P757J0103J1517J2026J2998J4885J6677J7912J9545K2112
61039H95228K4701K6551K8186L0119L1879L3133L4423L6028L7294L7760L7743
61028A253045L7424L6775L6645L8144M0576M1935M1947M2472M4308M5832M5667
61017A704770M4399M2789M0816L9537M1332M6890N4307O2306P1782Q2954R3971
61006B325853J03964J14775J28314J45437J68943K03785K52378L13762L89317
60997D146528M84426O02459P44136R16303J132172J395776J695869K022835K369646
60988A5510150K681229K806528K557070J870490R22254M2773m99431o38048m61190
$$ y = [768868, 757895, 749648, 743242, 737482, 732128, 727812, 724953, 723479, 723361, 724664, 727160, 730473, 734443, 738955, 743885, 749696, 757453, 767556, 779073, 791099, 804097, 818982, 835659, 853571, 873116, 895228, 919929, 946480, 974666, 1004785, 1036664, 1069797, 1104220, 1140248, 1177542, 1215302, 1253045, 1290469, 1327244, 1363889, 1402033, 1442609, 1484544, 1526491, 1568963, 1613271, 1659103, 1704770, 1749169, 1791958, 1832774, 1872311, 1913643, 1960533, 2014840, 2077146, 2148928, 2231882, 2325853, 2429817, 2544592, 2672906, 2818343, 2987286, 3191071, 3443449, 3757211, 4146528, 4630954, 5233413, 5977549, 6893852, 8026024, 9421800, 11117669, 13140504, 15510150, 18191379, 20997907, 23554977, 25425467, 26347721, 26390494, 25891063, 25253015, 24791825]
60979B4791825q6356L71937P40808P88021L59434m71214j418801k172555k574393
60970B0328706k645356k492194k218865j901407j592620j320840j090732q97218
60962F169474p37608o09394n05438m18618l47456k92507k50654k17097j89891
60953B600811j68670j51348j35609j21575j09966r9412q8292p7352o7921n9362
60943A521304n0854m4072m1321m2141m4093m5718m6707m6301m3937m0739l8362
60932A037059l6876l5250l3211l1161k8992k6445k3967k2045k0411j8765j7471
60921G42465j6658j5694j4380j3479j3199j2452j0617q649p443o499n240m192
60909F13963l656k732j013K60J77j15O80J799J877J412J822K926L318K671J865
$$ y = [24791825, 24705469, 25077406, 25818214, 26606235, 26965669, 26494455, 25075654, 22903099, 20328706, 17683350, 15191156, 12972291, 11070884, 9478264, 8157424, 7066692, 6169474, 5431866, 4822472, 4317034, 3898416, 3550960, 3258453, 3007799, 2790702, 2600811, 2432141, 2280793, 2145184, 2023609, 1913643, 1814231, 1725939, 1648587, 1580666, 1521304, 1470450, 1426378, 1385057, 1342916, 1298823, 1253105, 1206398, 1160097, 1116160, 1075421, 1037059, 1000183, 964933, 931722, 900561, 871569, 845124, 821157, 799112, 778701, 759936, 742465, 725807, 710113, 695733, 682254, 669055, 656603, 645986, 637337, 629894, 623395, 618155, 613963, 610307, 607575, 606562, 606822, 606999, 606884, 607564, 609363, 611240, 612652, 614474, 617400, 620718, 623389, 625254]
60894F25254J250L97p34j745k707l905n009n545n747o003n980n346m759n042n897
60879E68482o451o563o565o371n829n401n420n232m173k906k657l455m172m013
60865D99274l077j750m03N13Q47J030J525K337L403M843O381P321P509P622P942
60850E45317P836P005O214O010N792N032M497N130O545P590P713O882M937K126
60836F28626n10k228l493m897n967o027n462n110n046m983n077n343n018l676
60822E65789k298k051k655l025k950k948l087l222l827n204o327n904m399l575
60808E14317m088m738m273k872j597j194j586j990j514j04J278J806J757J770
60794D96972J773J329O67N17J075J911K622L038L028K705K583L000L674M233M784
$$ y = [625254, 626504, 626901, 626167, 624422, 621715, 617810, 612801, 607256, 601509, 595506, 589526, 584180, 579421, 574379, 568482, 562031, 555468, 548903, 542532, 536703, 531302, 525882, 520650, 516477, 513571, 510914, 507459, 503287, 499274, 496197, 494447, 494044, 494557, 495404, 496434, 497959, 500296, 503699, 508542, 514923, 522244, 529753, 537375, 545317, 553153, 560158, 566372, 572382, 578174, 583206, 587703, 592833, 599378, 606968, 614681, 621563, 626500, 628626, 628116, 625888, 622395, 617498, 611531, 605504, 600042, 594932, 589886, 584903, 579826, 574483, 569465, 565789, 563491, 561440, 558785, 555760, 552810, 549862, 546775, 543553, 539726, 534522, 528195, 522291, 517892, 514317, 510229, 505491, 501218, 498346, 496749, 495555, 493969, 491979, 490465, 490361, 491639, 493445, 495202, 496972, 498745, 500074, 500741, 501258, 502333, 504244, 506866, 509904, 512932, 515637, 518220, 521220, 524894, 529127, 533911]
60779E33911N523O190O492O588O705O719O555O503O756P080P340P663P903P670
60765F29598P236P465Q418R006Q586P856P580P507P304P374P880Q031P395O900
60751G38136P426Q286Q339P769P557P943Q540R357J0458J1192J0919J0079R538
60738H55539R343R043Q661Q386P936P172O719P021P426P204O768O877P347P541
60724I62983P436P193O449N078L857L257K409N35j577k778l419m498n834o686
60710I74405p420q898j0695j1685j1909j2236j2606j2349j1905j2333j3353j3598
60698H35418j2921j2602j3150j3549j3059j2286j2054j2427j3145j3951j4246
60687F92028j3501j2195j1318j0922j0204r072q466q895r656r783q950p370n587
$$ y = [533911, 539434, 545624, 552116, 558704, 565409, 572128, 578683, 585186, 591942, 599022, 606362, 614025, 621928, 629598, 636834, 644299, 652717, 661723, 670309, 678165, 685745, 693252, 700556, 707930, 715810, 723841, 731236, 738136, 745562, 753848, 762187, 769956, 777513, 785456, 793996, 803353, 813811, 825003, 835922, 846001, 855539, 864882, 873925, 882586, 890972, 898908, 906080, 912799, 919820, 927246, 934450, 941218, 948095, 955442, 962983, 970419, 977612, 984061, 989139, 992996, 996253, 998662, 999197, 997620, 994842, 991423, 986925, 981091, 974405, 966985, 958087, 947392, 935707, 923798, 911562, 898956, 886607, 874702, 862369, 849016, 835418, 822497, 809895, 796745, 783196, 770137, 757851, 745797, 733370, 720225, 706274, 692028, 678527, 666332, 655014, 644092, 633888, 624816, 616350, 607455, 597799, 588016, 579066, 571696, 566109]
60674E66109m356l997l932l518l080l284l910m242m262m426m524l900k644j522
60660E14512r23q09j381k685l876m007l245k349j410k48N57M63L45J463L408M652
60644E04467M902N191N728N446L958K254J086Q6j101k038k284j854p41R51K293
60629E28344K156P78l22j68Q67K000K648K208N05j423k236j956j669j757j739
60614E28236j648k052k747k958k874l437m505m853m222l696l766l654k946k294
60600D82584k006j536r43j238k644l900m048l563l098k470j619j206j417j315
60586D51581k83R01J229P55P6n44r68r83p83p76o66K43J532J854R87L45Q76J835
60568D57211K344K785L788N084O233P442Q754R642J0210J1599J4088J5974J5505
$$ y = [566109, 561753, 557756, 553824, 550306, 547226, 543942, 540032, 535790, 531528, 527102, 522578, 518678, 516034, 514512, 513589, 512780, 511399, 508714, 504838, 500831, 497586, 495237, 493827, 493579, 494136, 494599, 494944, 496407, 499815, 504467, 509369, 514560, 520288, 525734, 529692, 531946, 533032, 533118, 532017, 529979, 527695, 525841, 525100, 526051, 528344, 530500, 531278, 530956, 530788, 531655, 533655, 536303, 538511, 539016, 537593, 535357, 533401, 531732, 529975, 528236, 526588, 524536, 521789, 518831, 515957, 512520, 508015, 503162, 498940, 495244, 491478, 487824, 484878, 482584, 480578, 479042, 478099, 476861, 474217, 470317, 466269, 462706, 459608, 457138, 455519, 454313, 452896, 451581, 451298, 452199, 453428, 454183, 454259, 453715, 452747, 451764, 450981, 450205, 449539, 449782, 451314, 453168, 454155, 454500, 455376, 457211, 459555, 462340, 466128, 471212, 477445, 484887, 493641, 503283, 513493, 525092, 539180, 555154, 570659]
60555E70659J2993R910O736L051r24m209o297p496q172q408q204p467o002l950
60541E42220j803J83K141L907M946N330O023P720J0012J2044J3267J3261J1695
60528F30946Q966O132L748J415j212l716n556o535o420n028l066j834j682j705
60514F14453j340j122j414j596j165n44r0N97J623K226K040J879K369K878K835
60499F23629L030M508O946R329J1581J4494J8517K3501K9110L4766L9716M3827
60487H62954M7544N0360N0270M5697L7276K6784J5101K342j0770k2987l3688m2745
60475A028138m9461n2745n2343m9194m4549l9359l4302k9753k5754k2307j9513
60464F08858j7289j5387j3882j3016j2426j1340r752q469p629o336m339k838k745
$$ y = [570659, 583652, 593562, 600298, 603349, 602425, 598216, 591919, 584423, 576251, 567843, 559639, 552172, 546170, 542220, 540417, 540600, 542741, 546648, 551594, 556924, 562947, 570667, 580679, 592723, 605990, 619251, 630946, 639912, 646044, 649792, 651207, 649995, 646279, 640723, 634188, 627768, 622740, 619674, 617840, 616158, 614453, 613113, 611991, 610577, 608981, 607816, 607272, 607182, 607779, 609402, 611628, 613668, 615547, 617916, 620794, 623629, 626659, 631167, 638113, 647442, 659023, 673517, 692034, 715535, 744645, 779411, 819127, 862954, 910498, 960858, 1011128, 1056825, 1094101, 1120885, 1135986, 1138328, 1127558, 1104571, 1070883, 1028138, 978677, 925932, 873589, 824395, 779846, 740487, 706185, 676432, 650678, 628371, 608858, 591569, 576182, 562300, 549284, 536858, 525518, 515766, 507297, 499668, 493332, 488993, 486155, 483410]
60451D83410l263l226k858l038l625l770l398l112l027k741k163j494p39j2J82
60436D47126k92o95n05l72j040j958k061j430j006j023q81l56Q1O1m29j344k285
60419D31591k244o46J551K751K604K086J905J826J554J329J381J509J402J014
60405D49613N89N24J004J469R80m40j394p25R51K037J897J191O54M71O91J309
60389D60821J991K319K349K375K341K030J617J444J471J475J519J691J647J092
60375D86182L98J18J92K51M44J137K034K403K145J942K247K730K833K407J795
60360E09258J499J711J982J629P24K02P16J734K270K065J597J342J567K447L781
60345E34524M916N462N874O805Q263R811J1292J2782J4035J4486J3678J1459Q101
$$ y = [483410, 480147, 476921, 474063, 471025, 467400, 463630, 460232, 457120, 454093, 451352, 449189, 447695, 446956, 446944, 447126, 446834, 446139, 445634, 445262, 444222, 442264, 440203, 438773, 437767, 436744, 435863, 435507, 435588, 435649, 435220, 433876, 431591, 429347, 428701, 430252, 433003, 435607, 437693, 439598, 441424, 442978, 444307, 445688, 447197, 448599, 449613, 450202, 450726, 451730, 453199, 454179, 453739, 452345, 451620, 452571, 454608, 456505, 457696, 458350, 458821, 459512, 460821, 462812, 465131, 467480, 469855, 472196, 474226, 475843, 477287, 478758, 480233, 481752, 483443, 485090, 486182, 486580, 486698, 486890, 487141, 487585, 488722, 490756, 493159, 495304, 497246, 499493, 502223, 505056, 507463, 509258, 510757, 512468, 514450, 516079, 516803, 517005, 517721, 519455, 521725, 523790, 525387, 526729, 528296, 530743, 534524, 539440, 544902, 550776, 557581, 565844, 575655, 586947, 599729, 613764, 628250, 641928, 653387, 661488]
60332F61488M322P78k569o078r334j1312j1853j1936j2081j1552r869p992p016
60319E64996o546n518l941k679k040j679j555j805j975j387j90Q53J514K262L429
60304E43739M927O638Q448J0100J1622J3638J6607J9900K2171K2436K0532J6921
60292G17679J2454P895L207k172p954j2589j4667j4078j1389p100k171J707L425
60279F74247L336K166j27l495o869r245j0953j2699j4122j4472j3973j3211j1948
60266E68635r902q069p636q074p752o233m508l274k388j845j819j828j158j28
60252E04021K98O3n6J46K23K54P05J228R98K34qM02N13L4k35N4J98j74m46j50
60232E08302L44P71J425K249K494J875J178J170J642K052K399K932L541L911L858
$$ y = [661488, 665810, 666588, 664019, 657941, 648607, 637295, 625442, 613506, 601425, 589873, 580004, 572012, 564996, 558450, 552932, 548991, 546312, 544272, 542593, 541038, 539233, 537258, 535871, 535681, 536534, 538048, 540310, 543739, 548666, 555304, 563752, 573852, 585474, 599112, 615719, 635619, 657790, 680226, 700758, 717679, 730133, 738028, 741235, 739063, 731109, 718520, 703853, 689775, 678386, 671286, 669115, 670822, 674247, 677583, 679749, 679622, 676127, 669258, 660013, 649060, 636361, 622239, 607767, 593794, 580583, 568635, 558733, 550664, 543028, 534954, 527202, 520969, 516461, 513187, 510799, 508954, 507135, 505307, 504149, 504021, 504319, 504382, 504326, 504472, 504695, 504949, 505654, 506882, 507880, 508114, 508106, 508508, 509021, 509055, 508820, 508874, 509072, 508898, 508452, 508302, 508646, 509417, 510842, 513091, 515585, 517460, 518638, 519808, 521450, 523502, 525901, 528833, 532374, 536285, 540143]
60217E40143L356K523J756J445J592K060K975M313N422N764N809O370P241P523
60203E98292P148O985P418P841P700P157O514N801N084M467L693K424R45j08o15
60188F70746q61p85j88N21O47J75m88j422k813l945l809k758k256k910l908m512
60172F41434m855n034m602l458k276j617j438j630k112k273j337L59J449J249
60158F13859N37L39Q11J615K510L170L202K765K524K675K604J825O53k47m54J06
60142F38494J149K060K475K720L252L961M652N751P577R431J0406J0782J1379
60129G14089J1920J1425R940Q445P047M840J620j673m323o264p054o034l858k231
60115G37889j761j459p82n01r91j261n73M09R19J257J751J751P00p95j906k722
$$ y = [540143, 543499, 546022, 547778, 549223, 550815, 552875, 555850, 560163, 565585, 571349, 577158, 583528, 590769, 598292, 605440, 612425, 619843, 627684, 635384, 642541, 649055, 654856, 659940, 664407, 668100, 670524, 671469, 671361, 670746, 669885, 669100, 668912, 669433, 670080, 670255, 669767, 668345, 665532, 661587, 657778, 655020, 652764, 649854, 645946, 641434, 636579, 631545, 626943, 623485, 621209, 619592, 618154, 616524, 614412, 612139, 610802, 611161, 612610, 613859, 614396, 614735, 615546, 617161, 619671, 622841, 626043, 628808, 631332, 634007, 636611, 638436, 639089, 638842, 638388, 638494, 639643, 641703, 644178, 646898, 650150, 654111, 658763, 664514, 672091, 681522, 691928, 702710, 714089, 726009, 737434, 747374, 755819, 762866, 767706, 769326, 767653, 763330, 757066, 750012, 743978, 740120, 737889, 736128, 734669, 733887, 733386, 732395, 731134, 730561, 730970, 731889, 733146, 734897, 736648, 737348, 736553, 734647, 731925]
60099G31925l647m497m987n313n593n471m910m503m413l888k387l57J652L611
60085F87222N260N869N465N248N944O815P057P125P634P968P162N395L515J704
60071G69383l71k625m713o680q565r945j0582j0990j1531j1670j0962j0082r856
60058F60811r838q957p228n742n170n164n203n171n115n010m815m347l321j806
60044E83924l53P16J688K819L769M190M438N119O272P405Q106Q131P356O035M788
60029F54403M015L470K734J623L7k097m424o274p410q255r166j0059j0899j1820
60015E95878j2550j2484j1583j0473r379p902o147m966m543l802j975J01J099
60002E11274Q61K06k19j08P64K122L042L088L105M021N357N838N143M217L989
$$ y = [731925, 728278, 723781, 718794, 713481, 707888, 702417, 697507, 693004, 688591, 684703, 682316, 681959, 683611, 687222, 692482, 698351, 703816, 709064, 715008, 721823, 728880, 736005, 743639, 751607, 758769, 764164, 767679, 769383, 769012, 766387, 761674, 754994, 746429, 736484, 725902, 714912, 703381, 691711, 680749, 670667, 660811, 650973, 642016, 634788, 629046, 623876, 618712, 613509, 608338, 603223, 598213, 593398, 589051, 585730, 583924, 583571, 584287, 585975, 588794, 592563, 596753, 601191, 606310, 612582, 619987, 628093, 636224, 643580, 649615, 654403, 658418, 661888, 664622, 666245, 666282, 664185, 659761, 653487, 646077, 637822, 628656, 618597, 607698, 595878, 583328, 570844, 559261, 548788, 539409, 531507, 525360, 520394, 515851, 512049, 510074, 510175, 511274, 512135, 512341, 512122, 512014, 512778, 514900, 517942, 521030, 524135, 528156, 533513, 539351, 544494, 548711, 552700]
59987E52700M502N174N383M851L898L202L020K919K506J963J486P36o62k381l684
59972E85613m250m408m701n331n883n617m424l183k616k082n21J631K770K508
59958E49506K305L246M524M914M553M199L746K610J004k18p17q56j001j179j227
59943E75409r08k28K31j98j303k157k388k522k985l658m541n687o376n649m048
59928E32992l349l996m317l110j437p87q68n51J93P54J283K110K623K140J333
59913E25013J363K166K825L158L610M073M174M331N275O659P419P303O978O706
59899E91053O045M796L344K061J146Q56J261J860K162K371K940L767M480N129
59885F33271N876O413O354N844N197M337L273K563K704L482M532N888P324P895
$$ y = [552700, 557202, 562376, 567759, 572610, 576508, 579710, 582730, 585649, 588155, 590118, 591604, 592340, 591678, 589297, 585613, 581363, 576955, 572254, 566923, 561040, 555423, 550999, 547816, 545200, 543118, 542597, 544228, 546998, 549506, 551811, 555057, 559581, 564495, 569048, 573247, 576993, 579603, 580607, 580389, 579672, 578816, 577815, 576636, 575409, 574501, 574273, 574504, 574306, 573003, 570846, 568458, 565936, 562951, 559293, 554752, 549065, 542689, 537040, 532992, 529643, 525647, 521330, 518220, 516783, 515996, 515128, 514577, 514770, 515524, 516807, 518917, 521540, 523680, 525013, 526376, 528542, 531367, 534525, 538135, 542208, 546382, 550713, 555988, 562647, 570066, 577369, 584347, 591053, 597098, 601894, 605238, 607299, 608445, 609301, 610562, 612422, 614584, 616955, 619895, 623662, 628142, 633271, 639147, 645560, 651914, 657758, 662955, 667292, 670565, 673128, 675832, 679314, 683846, 689734, 697058, 704953]
59871G04953O993N202L345J285j421m367o751q439r602r982r430q656q344q110
59857F46676p353o546o509o841o387m942l407k344j447l07J134K851M649O118
59843F15345P186Q330R696J0631J0746J0589J0360Q919N349Q88k134k765j698
59830F91442L72L220O186Q211Q718P529M285q38o275j0226j2562j4368j5937j6518
59816F53239j5918j4878j3848j2613j1256j0221r267p539m965k613j373j067j048
59803E46633r45o28j42K31L00L36N56O07Q1p59j474k214l228m036l976l264k603
59786E25475k096j480j017j157j587j547r46l36j17m39j386k480k585j350j6J85
59770E07121k47j90J22k21p95l05J185K271K434K585L248L797L810L820M292M885
$$ y = [704953, 711946, 717148, 720493, 721778, 720357, 715990, 709239, 700800, 691198, 681216, 671786, 663130, 654786, 646676, 639323, 632777, 626268, 619427, 613040, 608098, 604691, 602347, 600900, 600593, 601727, 604578, 609227, 615345, 622531, 630861, 640557, 651188, 661934, 672523, 682883, 691802, 697151, 698039, 695905, 693140, 691442, 691814, 695034, 701220, 709431, 718149, 725678, 729963, 729125, 722850, 712624, 700062, 685694, 669757, 653239, 637321, 622443, 608595, 595982, 584726, 574505, 565238, 557699, 552734, 550121, 548748, 547681, 546633, 545688, 545060, 544918, 545149, 545449, 545785, 546341, 546948, 547029, 546270, 544796, 542582, 539354, 535318, 531342, 528078, 525475, 523379, 521899, 520882, 519725, 518138, 516591, 515645, 515309, 515192, 514753, 513367, 510887, 508302, 506952, 506936, 507121, 506874, 506684, 506806, 506585, 505790, 505485, 506670, 508941, 511375, 513960, 517208, 521005, 524815, 528635, 532927, 537812]
59754E37812N170N161M969M718M785N369N956O044O039O509P030O924O607O809
59740F19902O966N954M130K921K521J797N07k76j86k25q91j348j047o79p44o43
59724F38659M1N88L46j53j51K12M53O82J158J605J533Q65j66j191j644j178l28
59707F41331l5l60m51Q8O51O97M85L83K56j16n70r19j132j078o03j2J88Q4L36
59688F39223J212K177K492J811K74j437k359k115j353r06q21p62p31q10p45n87
59672F34563r74j985k548k091j790k816m263m481l711l495l989l958l197k894
59658E92371l438l818l496k997k402j017R39K072J829J379J817K862L802M466
59644E94369M741M256L063J610j06k272m142m541l663k976l167l483l307k853
$$ y = [537812, 542982, 548143, 553112, 557830, 562615, 567984, 573940, 579984, 586023, 592532, 599562, 606486, 613093, 619902, 626868, 632822, 636952, 639873, 642394, 644191, 644698, 644422, 644236, 644011, 643120, 641772, 640725, 640046, 639302, 638659, 638700, 639288, 639634, 639481, 639330, 639542, 639995, 640677, 641835, 643440, 644973, 645838, 645672, 644481, 642837, 641659, 641331, 641296, 640936, 640485, 640573, 641224, 641921, 642406, 642789, 643045, 642929, 642359, 641440, 640308, 639230, 638627, 638615, 638803, 638887, 639223, 640435, 642612, 645104, 646915, 647189, 645752, 643393, 641278, 639925, 639019, 638198, 637436, 636705, 635895, 635150, 634563, 633589, 631604, 629056, 626965, 625175, 622359, 618096, 613615, 609904, 606409, 602420, 598462, 595265, 592371, 588933, 585115, 581619, 578622, 576220, 575203, 576142, 578214, 580043, 581422, 583239, 586101, 589903, 594369, 599110, 603366, 606429, 608039, 607933, 605661, 601519, 596978, 593315, 590339, 587172, 583689, 580382, 577529]
59630E77529k119p07R23J545R65L42L72M66J37k80o09j171j702j326m1J131J741
59613E77196K256K642K168R86K55L14L67L11J098K726L725L372K742K705K586
59598F05449J703O67J56k10q46j314j300j235j338j296j349k213l469l707k870
59583E86828k581l431l931l090k062k029k302j948j541j820k096j583r31r93j316
59568E55174j239j263j824j995r07O16J305J286J310J240P90O81J502K311J944
59553E60931R56P14J268J575J378J330J649J891J805J447P70On5J042K715M224
59537E83646N630P287R082J0915J3236J6527K0676K4913K7418K5264J6801M760
59525G66155m958q666p647m909j432K834O621Q408Q685Q934R111Q020N487K373
$$ y = [577529, 575410, 574703, 575626, 577171, 578136, 578478, 578850, 579316, 579453, 579173, 578564, 577393, 575691, 574365, 574324, 575455, 577196, 579452, 582094, 584262, 585248, 585503, 585817, 586184, 586495, 587593, 590319, 594044, 597416, 600158, 602863, 605449, 607152, 607819, 607975, 607765, 606919, 605605, 604305, 603070, 601732, 600436, 599087, 596874, 593405, 589698, 586828, 584247, 580816, 576885, 573795, 571733, 569704, 567402, 565454, 563913, 562093, 559997, 558414, 557483, 556490, 555174, 553935, 552672, 550848, 548853, 547946, 548562, 549867, 551153, 552463, 553703, 554493, 555174, 556676, 558987, 560931, 561887, 562601, 563869, 565444, 566822, 568152, 569801, 571692, 573497, 574944, 575714, 575720, 575665, 576707, 579422, 583646, 589276, 596563, 605645, 616560, 629796, 646323, 666999, 691912, 719330, 744594, 761395, 766155, 761197, 752531, 744884, 739975, 738543, 741377, 747998, 756406, 765091, 774025, 783136, 791156, 796643, 799016]
59511G99016j070n121r302j2615j4796j6135j6616j6313j5928j5784j5012j2995
59499F47329j0696r279q264o556m470l197k804k411j797j364q54K87J583J943
59485E99450J323P42Q08J317K047K940L693M172M931O484Q391R907J1051J2271
59471F69527J3490J4303J4575J4135J2518R683O372L114k17l282m885m569l458
59458G41306k469r41J882N215Q055J0878J4531J8316K0863K2119K2980K3571K3483
59445I09789K3088K3108K3284K2723K0998J7739J1920K974p782j8094k6524l2223
59433I71000l4110l1966k7707k3896k1236j8854j6421j4528j3276j2019j0385
59422G46602q394n749k150J941N744R108J2338J5505J8578K1640K4368K6035K6479
$$ y = [799016, 797946, 792825, 783523, 770908, 756112, 739977, 723361, 707048, 691120, 675336, 660324, 647329, 636633, 627354, 619090, 612534, 608064, 604867, 602063, 599652, 597855, 596491, 595637, 595924, 597507, 599450, 600773, 601515, 602323, 603640, 605687, 608627, 612320, 616492, 621423, 627907, 636298, 646205, 657256, 669527, 683017, 697320, 711895, 726030, 738548, 748231, 754603, 757717, 757500, 754218, 749333, 744764, 741306, 738837, 737896, 739778, 744993, 753048, 763926, 778457, 796773, 817636, 839755, 862735, 886306, 909789, 932877, 955985, 979269, 1001992, 1022990, 1040729, 1052649, 1055623, 1047841, 1029747, 1003223, 971000, 936890, 904924, 877217, 853321, 832085, 813231, 796810, 782282, 769006, 756987, 746602, 738208, 732459, 730309, 732250, 737994, 747102, 759440, 774945, 793523, 815163, 839531, 865566, 892045]
59409H92045K6335K6074K5968K6787K8302K6742J6854j579k1541l5024l9690l7924
59397I33349l2160k3979j5386p416J085R955J4380Q955n212k0751l1297l5634
59385G95889l5248l1559k6343k1750j8496j5683j2853j0505q537o219l873k612
59373F02211k288j645n32lj76o2M59N14K14O83J990K992L445M205N277N726N763
59356F28773O740Q719J0120J0297J0521J1840J3756J5598J7561J9843K2183K4652
59344H00603K7483K9965L1028L0924L0792L0608K9329K6926K4342K1390J6763
59333A100153J0378L702k479q637j4542j8911k1558k3982k7039k9795l1189l1248
59321I04853l0159k7836k4905k2555k0834j8685j5939j3698j2336j0879q787o735
$$ y = [892045, 918380, 944454, 970422, 997209, 1025511, 1052253, 1069107, 1067528, 1045987, 1010963, 971273, 933349, 901189, 877210, 861824, 854408, 855493, 865448, 879828, 888783, 883571, 862820, 831523, 795889, 760641, 729082, 702739, 680989, 662493, 646810, 633957, 623452, 614915, 608696, 604823, 602211, 599923, 598278, 597746, 597743, 597567, 597505, 597964, 598478, 598692, 599375, 601365, 604357, 607802, 612007, 617284, 623010, 628773, 635513, 644232, 654352, 664649, 675170, 687010, 700766, 716364, 733925, 753768, 775951, 800603, 828086, 858051, 889079, 920003, 950795, 981403, 1010732, 1037658, 1062000, 1083390, 1100153, 1110531, 1114233, 1111754, 1103117, 1088575, 1069664, 1048106, 1024124, 997085, 967290, 936101, 904853, 874694, 846858, 821953, 799398, 778564, 759879, 743940, 730242, 717906, 707027, 698240, 691505]
59309F91505n206l955l187l466m094l411j269N59J058J305K549M569O632Q492
59295F92081R831J0272J0547J2252J5814J9938K3133K4250K1546J3551J762r352
59283H45625j6106j8216j7479j5475j3160j0990q526n066j105K051M315O912J0271
59270G63051J3479J6123J8869K1766K3677K3911K2857K0673J7080J2759R066N910
59258I69221J792l664r036j3380j7165k0435k2124k1978k1194k0454j9133j7082
59246G85368j5161j3432j0839p496n166m567m196k782q86Q81L143O125Q670J0068
59232G49730J1102J2238J2523J1372R636P867N371J984j126l451o070r459j2426
59219G89291j4311j6156j8362j9343j8083j6046j4819j3714j1554r101p705o956
$$ y = [691505, 686299, 682344, 679157, 675691, 671597, 668186, 666917, 667476, 668534, 669839, 672388, 676957, 683589, 692081, 701912, 712184, 722731, 734983, 750797, 770735, 793868, 818118, 839664, 853215, 854977, 845625, 829519, 811303, 793824, 778349, 765189, 754199, 745673, 740607, 739502, 741553, 745868, 752780, 763051, 776530, 792653, 811522, 833288, 856965, 880876, 903733, 924406, 941486, 954245, 963311, 969221, 971013, 967349, 958313, 944933, 927768, 907333, 885209, 863231, 842037, 821583, 802450, 785368, 770207, 756775, 745936, 738440, 733274, 728707, 724511, 721729, 720843, 721724, 724867, 730992, 739662, 749730, 760832, 773070, 785593, 796965, 806601, 814468, 819839, 821823, 820697, 817246, 811176, 801717, 789291, 774980, 758824, 740462, 721119, 703036, 686990, 672171, 658457, 646903, 637802, 630097, 623141]
59207F23141n622l828k605k176k190k687l505l785l179k496k198j528j37R24J001
59192E89130J079J987K896K964K932L717M789N370N901O898P688P664P485P799
59178F58299Q006P593P236P363P128O122N524O077O566N885N148N946P951R962
59164G54806J1989J4503J6735J7528J6964J5692J3676J0947Q367O254L555l03
59152H90713m121o909r559j2899j5700j6511j6040j5773j5553j4544j3282j2648
59140G37174j1970j0270q419p916q366q234p285o314n298l834k624k483k603j682
59126F49876j99M52L57O94J551K126K614L884N674O954P744Q793R850J0035R637
59111G20042R743J0319J0351R670Q991Q309O928N082L929L857M036L741L076K360
$$ y = [623141, 617519, 613691, 611086, 608910, 606720, 604033, 600528, 596743, 593564, 591068, 588870, 587342, 587205, 588129, 589130, 590209, 592196, 595092, 598056, 600988, 604705, 609494, 614864, 620765, 627663, 635351, 643015, 650500, 658299, 666305, 673898, 681134, 688497, 695625, 701747, 707271, 713348, 719914, 725799, 730947, 736893, 744844, 754806, 766795, 781298, 798033, 815561, 832525, 848217, 861893, 872840, 881207, 887461, 891016, 890713, 886592, 879683, 870124, 857225, 841525, 825014, 808974, 793201, 777648, 763104, 749822, 737174, 725204, 714934, 706515, 698599, 690233, 681999, 674714, 668400, 663102, 659268, 656644, 654161, 651558, 649876, 649677, 650129, 650486, 651180, 652731, 654857, 657471, 661355, 667029, 673983, 681727, 690520, 700370, 710405, 720042, 729785, 740104, 750455, 760125, 769116, 777425, 784353, 789435, 793364, 797221, 801257, 804998, 808074, 810434]
59097H10434J721J212O84k51j564k653l232l583l493k210j05J090O57N8M95Q77
59081H00137l10k575m582o400q751j1027j2032j1879j1495j1023j0245r724r862
59068F90232r766q635p359p040p018o120m851m386m279l244j546n93o72q89r64
59053F22870j310j835k210k758l607l742k505j114j010j519j071J14N55m2p81
59038F00035j379j990j838j60K020L017K947L160L737L688L220L654N162O596
59024F31869P521Q623J0129J1508J2768J4454J6382J7685J7999J7379J5463J2034
59012G93814P953M261Q70k600n435o693o760o508n775m097k143o76R78L740O802
58997G77731Q710R641J0790J2221J3089J3352J3409J2785J1022R191Q631Q797
$$ y = [810434, 812155, 813367, 814051, 813800, 812236, 809583, 806351, 802768, 799275, 797065, 796960, 798050, 798707, 798765, 799260, 800137, 799827, 797252, 792670, 786270, 777519, 766492, 754460, 742581, 731086, 720063, 709818, 700094, 690232, 680466, 671831, 664472, 657432, 650414, 644294, 639443, 635057, 630778, 627534, 625988, 625395, 624723, 623834, 622870, 621560, 619725, 617515, 614757, 611150, 607408, 604903, 603789, 602779, 601260, 600189, 600303, 600858, 600816, 600035, 598656, 596666, 594828, 594668, 596688, 599705, 602652, 605812, 609549, 613237, 616457, 620111, 625273, 631869, 639390, 648013, 658142, 669650, 682418, 696872, 713254, 730939, 748938, 766317, 781780, 793814, 801767, 806028, 806898, 804298, 798863, 792170, 785410, 778902, 773127, 769030, 766887, 766211, 767189, 770929, 777731, 786441, 796082, 806872, 819093, 832182, 845534, 858943, 871728, 882750, 891941, 900572, 909369]
58985I09369Q070N982K944j224o447j0969j2902j2586j1614j0428q669o835n432
58972H39259l558m93K463M050N694R402J4144J7248J8515J9912K1816K2731K2451
58959I93634K2343K2526K1549J8999J5846J2160P012O82n461j1092j6725k1672
58947A059801k4710k6443k8347k9795k8814k5672k2829k1276j9721j7414j5087
58936G99693j2865r953o674m274k670q29O43J28j747k438j405q34j915l191l297
58921G48372k795k511k338k334k908l469k922j702j274j519r05P96K277L108L984
58906G33860M681M377L873M822O828Q163R087J1461J5037J7531J8504J9856K2046
58893H80126K3300K3145K3312K4314K4660K4426K6195L0945L6216L9830M2540
$$ y = [909369, 917439, 923421, 926365, 925141, 918694, 907725, 894823, 882237, 870623, 860195, 851526, 844691, 839259, 835701, 835208, 837671, 841721, 847415, 856817, 870961, 888209, 906724, 926636, 948452, 971183, 993634, 1015977, 1038503, 1060052, 1079051, 1094897, 1107057, 1114069, 1114751, 1109290, 1098198, 1081473, 1059801, 1035091, 1008648, 980301, 950506, 921692, 896020, 873191, 851915, 832194, 814780, 799693, 786828, 776875, 770201, 765927, 763257, 762428, 763071, 763199, 761452, 759014, 757609, 756775, 754860, 751669, 748372, 745577, 743066, 740728, 738394, 735486, 732017, 729095, 727393, 726119, 724600, 723695, 724491, 726768, 729876, 733860, 738541, 742918, 746791, 751613, 758441, 766604, 775691, 787152, 802189, 819720, 838224, 858080, 880126, 903426, 926571, 949883, 974197, 998857, 1023283, 1049478, 1080423, 1116639, 1156469, 1199009]
58882A199009M5397M7163M6044M1883L5303K6830J7797R919L021m643j3334k1442
58870A432947k8491l5520m1911m5115m4516m2489m0506l7418l2759k8475k5613
58859A030134k2522j8249j4784j3917j4428j4447j4135j4151j3768j2559j1767
58848H65407j2088j2044j0392q274p294p221p148p144p369p269o901p305q528
58835G56430r210q958q940r368q867p268o385o822o769n280l938l820l556k119
58821F65130p25k04Q31L233N319N662N496O278P215P194O948P221P020N726M770
58806G37114N135N317L885J964J076M98j009k786l658l992m445m447l828m043
58792G26781n831p548p721p294p442p198n392l052j628o07J036K668L352L740
$$ y = [1199009, 1244406, 1291569, 1337613, 1379496, 1414799, 1441629, 1459426, 1469345, 1472366, 1467723, 1454389, 1432947, 1404456, 1368936, 1327025, 1281910, 1237394, 1194905, 1154399, 1116981, 1084222, 1055747, 1030134, 1007612, 989363, 974579, 960662, 946234, 931787, 917652, 903501, 889733, 877174, 865407, 853319, 841275, 830883, 822609, 815315, 808094, 800946, 793802, 786433, 779164, 772263, 764958, 756430, 747220, 738262, 729322, 719954, 711087, 703819, 697434, 690612, 683843, 678563, 674625, 670805, 667249, 665130, 664405, 664201, 665032, 668265, 673584, 679246, 684742, 691020, 698235, 705429, 712377, 719598, 726618, 732344, 737114, 742249, 747566, 751451, 753415, 754491, 754989, 753980, 751194, 747536, 743544, 739099, 734652, 730824, 726781, 720950, 713402, 705681, 698387, 690945, 683747, 678355, 675303, 673675, 673068, 674104, 676772, 680124, 683864]
58778F83864M595N124M686M371M906M785K672j11j660k466m036n993o799o241
58764F87697n208m043k851k342k754l098k699k202j921r54R24K387K835L577N335
58749F74683O727O647N989N546M541K880K401M024N994O794P440Q997J0244R976
58735G62883R162Q742P738N771M868O230P734P290O303O957Q332Q294P251O972
58721H64527P287O898O089N888N895N378N121N908O768O863P305Q890J0022R277
58707I62116P980P710P287M965J643r74l558p601j2305j5890j8511k1273k3839
58694H87750k5490k6846k8159k7753k4682k0906j8328j5838j2057q578p333p030
58682F64750n616m223n004o935p466o841o969p442o350m013k330j369O0J450J446
$$ y = [683864, 688459, 693583, 698269, 702640, 707546, 712331, 715003, 714892, 713232, 710766, 706730, 700737, 693938, 687697, 682489, 678446, 675595, 673253, 670499, 667401, 664702, 662500, 660579, 659625, 660549, 662936, 665771, 669348, 674683, 681410, 688057, 694046, 699592, 704133, 707013, 709414, 713438, 719432, 726226, 733666, 742663, 752907, 762883, 772045, 780787, 788525, 794296, 799164, 805394, 813128, 820418, 826721, 833678, 842010, 850304, 857555, 864527, 871814, 878712, 884801, 890689, 896584, 901962, 907083, 912991, 919759, 926622, 933927, 942817, 952839, 962116, 970096, 977806, 985093, 990058, 991701, 990727, 987169, 979568, 967263, 951373, 932862, 911589, 887750, 862260, 835414, 807255, 779502, 754820, 733914, 715586, 699748, 687691, 679113, 671780, 664750, 659134, 654911, 649907, 642972, 635506, 628665, 621696, 614254, 607904, 603891, 601561, 600192, 600252, 601702, 603148]
58667F03148Q36J520L417N237P273J0447J3721J5417J5944J6331J5422J1659O369
58654G26741K204n58l062m754m505l615m161n425n243l926l555m295m718m782
58640F76346n354n664m426k579j848j552R7K624M251N106O350P313O700N439N108
58625F97911M726K475n72j887j519j311j213J49K244L521M563O967J0059J2087
58611G38200J3613J6214J8858J9094J6924J4126J0824O193J430j550l431o010
58599H44485q500q893p893p882q997r721j0141j1048j1130q816n639m036l193
58586G38596r32J938L320M275P247J1210J3193J3499J4713J6569J6537J4696J3267
58573H68128J2071R228N650M167M692M876M919O952J0361J2531J3713J6354K0114
$$ y = [603148, 603984, 605504, 608921, 614158, 621431, 631878, 645599, 661016, 676960, 693291, 708713, 720372, 726741, 728945, 728387, 725325, 720571, 716066, 712451, 708290, 702865, 697622, 693696, 690141, 685846, 681128, 676346, 670992, 665328, 660902, 658323, 656475, 654923, 655020, 657644, 661895, 667001, 673351, 680664, 687364, 692803, 697911, 702637, 705112, 704540, 702653, 701134, 699823, 698610, 698759, 701003, 704524, 709087, 716054, 726113, 738200, 751813, 768027, 786885, 805979, 822903, 837029, 847853, 854046, 855476, 853926, 850495, 844485, 835985, 827092, 819199, 811317, 802320, 792599, 782458, 771410, 760280, 751464, 745825, 741789, 738596, 737664, 739602, 742922, 747197, 754444, 765654, 778847, 792346, 807059, 823628, 840165, 854861, 868128, 880199, 889427, 895077, 899244, 903936, 908812, 913731, 920683, 931044, 943575, 957288, 973642, 993756]
58560I93756K2474K3766K6488K9958L0740K8255K4993K1339J5321P427O25m519
58548A220623r788j4492j5763j3795j1814j0763q956o883p058r090j0137j0510
58536A091574j3380j8651k2578k3859k4739k5582k4014k0150j7158j5636j2764
58525H73063p966m100k161k2K643L586L060M229P316Q730P273N876N936N229K968
58510I15660J657K258K527J652J718L044K968P23j216j828k930m729n037l969
58496I12498m399o611p623o774o811q274q314o304n094n357m346j686o59k085
58482H38161k484j67K416M039O777J0934J3614J4309J6227J9975K1564J8892J4730
58469I78987J1134O418o7n660r123j2417j5769j6386j4014j2166j1890j0059n734
$$ y = [993756, 1016230, 1039996, 1066484, 1096442, 1127182, 1155437, 1180430, 1201769, 1217090, 1224517, 1225142, 1220623, 1210835, 1196343, 1180580, 1166785, 1154971, 1144208, 1135252, 1128369, 1121311, 1112221, 1102084, 1091574, 1078194, 1059543, 1036965, 1013106, 988367, 962785, 938771, 918621, 901463, 885827, 873063, 865097, 860997, 858836, 858814, 861457, 865043, 868103, 872332, 879648, 888378, 895651, 901527, 907463, 912692, 915660, 917317, 919575, 922102, 923754, 925472, 928516, 931484, 932207, 930991, 929163, 926233, 921504, 916467, 912498, 908099, 901488, 893865, 887091, 880280, 872006, 863692, 857388, 852294, 846937, 842591, 840905, 840246, 838161, 835677, 835510, 837926, 841965, 848742, 859676, 873290, 887599, 903826, 923801, 945365, 964257, 978987, 990121, 996539, 996472, 990812, 981689, 969272, 953503, 937117, 923103, 910937, 899047, 888988, 883254]
58456H83254k282j028J098N277Q362R044J0297J3052J3737J0886P889O401L312
58443I69299k703p899r957j1515j4040j4435j1245q075p169n651j722J413J619
58430H77920J853M363O564O527O819R228J1222J1322J2307J5484J7558J6632J5504
58417A013303J5559J3552Q119L227J354n22m325o767n906n332p636r913j0027
58404A004686j0859j4054j6007j4520j3001j3653j3097r349o306o457n999k231
58392H79153R54K40j221l64M1k317m051k739k221n385q290p282n487o293o885
58377H27853m226r43P13M079J1093J6789J7136J5768J6638J6848J3411J0170J0969
58364I56298J2562J1410J0843J4278J7905J7564J6473J8638K0924J9221J6293
$$ y = [883254, 880972, 879944, 881042, 886319, 894681, 903725, 914022, 927074, 940811, 951697, 959586, 965987, 969299, 966596, 958697, 948740, 937225, 923185, 908750, 897505, 889430, 882261, 876610, 874888, 876301, 877920, 879773, 884136, 890700, 897227, 904046, 913274, 924496, 935818, 948125, 963609, 981167, 997799, 1013303, 1028862, 1042414, 1050533, 1053760, 1055114, 1054592, 1050267, 1043500, 1037594, 1032262, 1024626, 1014713, 1004686, 993827, 979773, 963766, 949246, 936245, 922592, 909495, 900146, 893840, 887383, 881384, 879153, 880107, 880347, 879126, 878762, 878803, 876486, 872435, 869696, 867475, 862090, 853800, 846518, 841031, 834738, 827853, 823627, 822684, 823397, 827476, 838569, 855358, 872494, 888262, 904900, 921748, 935159, 945329, 956298, 968860, 980270, 991113, 1005391, 1023296, 1040860, 1057333, 1075971, 1096895, 1116116, 1132409]
58353A132409J5863J5110J0586N464L400J500l151o519m885k341l224l837J26
58340A160501M786N201M570P629J1415J1420J0539J3014J5863J5168J4387J7525
58328A292018K0576J8809J5920J6723J7629J3837R111Q610Q806M616j76J55K583
58315A429217J775N47L495P025O170M647P537J0952R724Q140J1891J6640J6102
58302A533862J4196J7252K1462K0280J7174J8506K0912J8388J4779J6356J9114
58291A732281J6603J3060J5483J9933J9411J7748K1634K6564K5223K2302K5874
58280A956116L1633L1053K7745K9917L4089L2451K9065L2185L7831L7615L5519
58269B315219L9835M6104M5604M3032M7675N4833N4711N1807N6279O3878O4401
$$ y = [1132409, 1148272, 1163382, 1173968, 1179432, 1182832, 1184332, 1181181, 1174662, 1169777, 1167436, 1164212, 1160375, 1160501, 1165287, 1170488, 1175058, 1182687, 1194102, 1205522, 1216061, 1229075, 1244938, 1260106, 1274493, 1292018, 1312594, 1331403, 1347323, 1364046, 1381675, 1395512, 1404623, 1413233, 1422039, 1426655, 1426479, 1426634, 1429217, 1430992, 1431539, 1435034, 1442059, 1448229, 1452876, 1460413, 1471365, 1481089, 1489229, 1501120, 1517760, 1533862, 1548058, 1565310, 1586772, 1607052, 1624226, 1642732, 1663644, 1682032, 1696811, 1713167, 1732281, 1748884, 1761944, 1777427, 1797360, 1816771, 1834519, 1856153, 1882717, 1907940, 1930242, 1956116, 1987749, 2018802, 2046547, 2076464, 2110553, 2143004, 2172069, 2204254, 2242085, 2279700, 2315219, 2355054, 2401158, 2446762, 2489794, 2537469, 2592302, 2647013, 2698820, 2755099, 2818977, 2883378]
58258B883378O2120O7342P5410P5169P0560P2363P6440P2420O5868O8824P6270
58247C666164P5685P1862P7708Q8612R1433R0704R9532J12747J16538J16633J28326
58236D735944J46523J55092J58012J70762J88922J97103K00982K17413K40693
58227F411446K52903K59647K79874L08476L26393L39384L67636M05314M31665
58218I382738M53747M94776N48660N91781O31157O92596P70111Q38517R07208
58209A5311291J006899J132299J256261J391149J573740J799997K042915K324272
58201B7838823K695341L159522L696733M352242N211450O301899P622632R254298
58193G0132940J1326496J3902201J7029946K0860910K5507804L0796220L6350433
$$ y = [2883378, 2945498, 3012840, 3088250, 3163419, 3233979, 3306342, 3382782, 3455202, 3521070, 3589894, 3666164, 3741849, 3813711, 3891419, 3980031, 4071464, 4162168, 4261700, 4374447, 4490985, 4607618, 4735944, 4882467, 5037559, 5195571, 5366333, 5555255, 5752358, 5953340, 6170753, 6411446, 6664349, 6923996, 7203870, 7512346, 7838739, 8178123, 8545759, 8951073, 9382738, 9836485, 10331261, 10879921, 11471702, 12102859, 12795455, 13565566, 14404083, 15311291, 16318190, 17450489, 18706750, 20097899, 21671639, 23471636, 25514551, 27838823, 30534164, 33693686, 37390419, 41742661, 46954111, 53256010, 60878642, 70132940, 81459436, 95361637, 112391583, 133252493, 158760297, 189556517, 225906950]
58186B25906950M1768975M6145449M7249771M1969129K8612419R090079j1569291
58179D29173481k8190674l8136264m1644759m0440601l6385694l0951025k5210275
58172A88214189j9993778j6010032j3711231j2956573j2972999j2875540j2249595
58165H7444441j1189014r922009q587336p293767o157325n215369m417762l733341
58157C0928518l180705k749528k383462k056172j788312j578718j389509j209410
58149A4592702j066159r65048q74392p81664p08459o60142o12298n56656n12276
58140G855608m82218m44448l94381l53677l28521k99675k61662k32733k18090
58131D840203k00734j76901j64679j68890j71133j63024j57373j58624j53224
$$ y = [225906950, 267675925, 313821374, 361071145, 403040274, 431652693, 440742772, 429173481, 400982807, 362846543, 321201784, 280761183, 244375489, 213424464, 188214189, 168220411, 152210379, 138499148, 125542575, 112569576, 99694036, 87444441, 76255427, 66333418, 57746082, 50452315, 44294990, 39079621, 34661859, 30928518, 27747813, 24998285, 22614823, 20558651, 18770339, 17191621, 15802112, 14592702, 13526543, 12561495, 11687103, 10905439, 10196980, 9536838, 8924540, 8367884, 7855608, 7373390, 6928942, 6534561, 6180884, 5852363, 5552688, 5291026, 5058293, 4840203, 4639469, 4462568, 4297889, 4128999, 3957866, 3794842, 3637469, 3478845, 3325621]
58122C325621j37573j26107j23584j17081j02730r3497r3387r0050p9705p4126
58112B287781p6354p4260o4602n9334o1734n9946n0577m5450m8370m7905m0041
58101A659208l5889l9868m1580l6419l3699l7230l7785l1909k8893l2153l2442
58090A271341k6291k2795k5434k5264j8873j5313j8411j9597j5180j3596j8486
58079A052101k1245j7558j5269j8609k0314j6587j4598j7921j9335j5195j2586
58068H62884j5268j6534j2900j0938j3785j4554r970p006r233r917n559l033o225
58055G27962q631o378n802j0599j3949j1154q187r890j1252q131n564p533r031
58042F11861o026l257m639n770l199j445l727n135k183R2k481n641n233m625p015
$$ y = [3325621, 3188048, 3061941, 2938357, 2821276, 2718546, 2625049, 2531662, 2441612, 2361907, 2287781, 2211427, 2137167, 2072565, 2013231, 1951497, 1891551, 1840974, 1795524, 1747154, 1699249, 1659208, 1623319, 1583451, 1541871, 1505452, 1471753, 1434523, 1396738, 1364829, 1335936, 1303783, 1271341, 1245050, 1222255, 1196821, 1171557, 1152684, 1137371, 1118960, 1099363, 1084183, 1070587, 1052101, 1030856, 1013298, 998029, 979420, 959106, 942519, 927921, 910000, 890665, 875470, 862884, 847616, 831082, 818182, 807244, 793459, 778905, 768935, 761929, 752696, 742779, 737220, 734187, 727962, 719331, 712953, 707151, 696552, 682603, 671449, 663262, 653372, 642120, 633989, 628425, 620892, 611861, 605835, 602578, 597939, 592169, 588970, 587525, 583798, 578663, 576480, 576572, 574091, 568450, 563217, 558592, 551577]
58027E51577q925p754p401j0169j1489q741o790q749r891o810m036n218o290l869
58013D45445k048m213o214m371k462m094n674l625j248j852k290L01K410J126
57999D11191J74K762N343M755M710Q769J3579J5230J5831J7618J7246J2184O419
57986E35811L663J259l186n870l780j038j839l256j598L35r89k807j588J00j125
57971E14092k729j486l3j610l451j980L37j54j418j70J556O01j013k69Q10o21
57955E02462k428j925j590m266p090o388m344m687n896m847l158l674m547k868
57941D44754n78p38j635l46J494J249Q83L174O000O210N572P109R070Q416O836
57926D97470P369Q406O955M616M428M873K873k10j334j590l607o010o107n322
$$ y = [551577, 542652, 534898, 527497, 517328, 505839, 497098, 490308, 481559, 471668, 464858, 460822, 455604, 449314, 445445, 443397, 439184, 432970, 428599, 426137, 422043, 416369, 412744, 411496, 409644, 407354, 407655, 410065, 411191, 411365, 414127, 419470, 424225, 428935, 437704, 451283, 466513, 482344, 499962, 517208, 529392, 535811, 539474, 540733, 537547, 531677, 527897, 526859, 525020, 521764, 520166, 520501, 519512, 516705, 515117, 515217, 514092, 511363, 509877, 509844, 508234, 504783, 502803, 503140, 502986, 501568, 501398, 502954, 503555, 502542, 502273, 503083, 502462, 500034, 498109, 496519, 492253, 485163, 478775, 474431, 469744, 463848, 459001, 455843, 452169, 447622, 444754, 444176, 443438, 441803, 441457, 442951, 444200, 445083, 448257, 454257, 460467, 466039, 473148, 482218, 490634, 497470, 504839, 513245, 520200, 524816, 529244, 534117, 536990, 536780, 535446, 533856, 530249, 524239, 518132, 512810]
57912E12810o421q091p717o660p374q168o410m053m369n891n362m043n290q190
57898D24771r300q613q437q484p273o150o765p033m658k085k628m448l818j753
57884C43326j624k690j930o8J48l87R31K797K164K39L88J733P72k058l268k567
57868C37906k443k798j590J71k69k059k086p28q76k179j639P18K127K387L746
57853C30388N936O481N550N689P066P557P033P142P463O350M858N328O781O263
57839D19885M034K887L109K579J145M26M7j527l270l125k299l462n705o011m700
57824D04013m515n186m059j522n85j364j086N41R35l25q48oL90J28Q81K407K725
57807C92524K024K188K568O75l063n630o428p531q995q549o162m417l993l041
$$ y = [512810, 506389, 498298, 490581, 483921, 476547, 468379, 461969, 457916, 453547, 447656, 442294, 438251, 432961, 424771, 415471, 406858, 398421, 389937, 382664, 376514, 369749, 362716, 358058, 355973, 353345, 348897, 345079, 343326, 341702, 339012, 337082, 337014, 337162, 336775, 337706, 340503, 342667, 342906, 343294, 345027, 345799, 343741, 340473, 337906, 335463, 332665, 331075, 331246, 330977, 328918, 326832, 326104, 325228, 323049, 321410, 322128, 324255, 326642, 330388, 336324, 342805, 348355, 354044, 361110, 368667, 375700, 382842, 390305, 396655, 401513, 406841, 413622, 419885, 423919, 426806, 429915, 432494, 433639, 434065, 434112, 432585, 429315, 426190, 423891, 420429, 414724, 408713, 404013, 399498, 394312, 390253, 388731, 388146, 386782, 385696, 386237, 387172, 386847, 385999, 385993, 386383, 386511, 387392, 389799, 392524, 394548, 396736, 399304, 399979, 396916, 391286, 384858, 377327, 368332, 359783, 353621, 349204, 345211, 342170]
57793C42170j333q08j656j950j497j984l181l075j958k124l414l309j678j061
57779C13142j813j504L47J274M58R7J248K318K602L478N109N656M677L780L238
57764C44107J503j212k578k127k069l365m448m601n084o117o119m811l894l932
57750B95253l622k664k255k325j542k90l12j206q06P16Q48q05j782j107o40j366
57734B76095j998k004k543l551l304j673n23k83N44J972K141R41M41J078J071
57719B68404K02M48J970K339P20p53r02j164k257k691j900j497k218k672k261
57704B55768k213k772k588j670j698k546k092k92J90j418k516j569l69l31j03
57689B33781J313K317J512%q22j165j244l46J270K163K317L315N200O222O403
$$ y = [342170, 340837, 340029, 338373, 336423, 334926, 332942, 329761, 326686, 324728, 322604, 319190, 315881, 314203, 313142, 311329, 309825, 310172, 311446, 311904, 312001, 313249, 315567, 318169, 321647, 326756, 332412, 337089, 340869, 344107, 345610, 344398, 341820, 339693, 337624, 334259, 329811, 325210, 320126, 314009, 307890, 303079, 299185, 295253, 291631, 288967, 286712, 284387, 282845, 282555, 282243, 281037, 280231, 280947, 281795, 280990, 279208, 278101, 277461, 276095, 274097, 272093, 269550, 265999, 262695, 261022, 260499, 260216, 260760, 262732, 264873, 265814, 266255, 267333, 268404, 268606, 269054, 271024, 273363, 274083, 273330, 272428, 271264, 269007, 266316, 264416, 262919, 260701, 258029, 255768, 253555, 250783, 248195, 246525, 244827, 242281, 240189, 239897, 240087, 238669, 236153, 234584, 234215, 233884, 233781, 235094, 237411, 238923, 238923, 238101, 236936, 235692, 235346, 236616, 238779, 241096, 244411, 249611, 255833, 262236]
57674B62236Q094J2021J6142J9536K4075L1043L9287M7999N8164O9886Q1027Q9052
57662G58562R0946Q1209N5027J5569k5623n7690p7146q5158q3299p4532o3959
57651E33906n4814m6142l6707k8279k2744j9036j5481j2556j0892r221o665m648
57639B66721m278m211l217k322k423k235p48O95Q41O84J217J453O20%N37R64J41
57622B54439j018j589k256l228l180j915j411k418k905j626l54n29p46K23Q76
57607B32363j02j148o31K72J0m96JN10r5p67m65k57r61j202k07J20j469k932k420
57588B20124j681k884m571m216k563j973k261j766r24j361k600k848k034j287
57574A87155n02Q26J576N02j338k162k259k771l027j807k7N02l3k48k00p71j428
$$ y = [262236, 270330, 282351, 298493, 318029, 342104, 373147, 412434, 460433, 518597, 588483, 669510, 758562, 849508, 930717, 985744, 1001313, 975690, 918000, 840854, 755696, 672397, 597865, 533906, 479092, 432950, 396243, 367964, 345220, 326184, 310703, 298147, 287255, 278034, 271369, 266721, 262443, 258232, 255015, 252693, 250270, 248035, 247287, 247982, 248823, 249507, 250724, 252177, 252797, 252797, 253334, 254298, 254439, 253421, 251832, 249576, 246348, 243168, 241253, 239842, 237424, 234519, 232893, 232539, 232010, 231264, 231487, 232363, 232261, 231113, 230482, 230754, 230764, 230268, 230269, 230779, 230684, 229917, 229452, 229195, 228234, 227032, 226825, 226945, 225476, 222544, 220124, 218443, 215559, 210988, 206772, 204209, 202236, 199975, 198209, 197285, 195924, 193324, 190476, 188442, 187155, 186653, 187479, 189055, 189557, 188219, 186057, 183798, 181027, 178000, 176193, 176166, 176668, 176635, 176387, 176187, 175416, 173988]
57557A73988j080k89k46n05Q4J027J035L60K66R21J659K400L093K864J397j3m02
57540A86559o59j519j760l90J157J183N50R99K175K552K048J467O03q96k051j942
57524A90076j432j564j714j094m77n24j55J310K283J421J31K04Q77P07M82J452
57508A91983K559K301J639K113K706J718J85J83J041O38p01r60k10k27j049j161
57492B02758o07q18j730k068k004k704l603l036j252j36j59k29j19n20j018o15
57476A82140Q4k71j136q20N28J167O88K32J08l98j111j224j104j621k129j411
57460A73722j27M1p46q71n2N99Q45J287J485N73o83p72J2J30n31q53q12j191j476
57441A70580n12J115J709J156O97N36J1l94K59J209R68P9L12J592K209J776J429
$$ y = [173988, 172908, 172619, 172373, 171868, 171952, 172979, 174014, 174374, 174640, 175561, 177220, 179620, 182713, 185577, 186974, 186961, 186559, 185900, 184381, 182621, 182231, 183388, 184571, 185121, 186120, 188295, 190847, 192895, 194362, 194965, 194069, 192018, 190076, 188644, 187080, 185366, 184272, 183795, 183271, 183116, 184426, 186709, 188130, 188261, 188465, 189342, 190049, 190531, 191983, 194542, 196843, 198482, 200595, 203301, 205019, 205204, 205387, 206428, 207066, 206365, 205405, 205195, 204968, 203919, 202758, 202151, 201333, 199603, 197535, 195531, 192827, 189224, 186188, 184936, 184800, 184641, 184412, 184293, 183773, 182755, 182140, 182224, 181953, 180817, 179997, 180525, 181692, 182380, 182612, 182720, 182322, 181211, 179987, 178883, 177262, 175133, 173722, 173595, 173636, 172890, 172019, 171967, 172566, 173411, 174698, 176183, 176756, 176073, 175301, 175313, 175443, 174912, 174059, 173247, 172056, 170580, 170068, 171183, 172892, 174048, 174745, 175281, 175292, 174898, 175157, 176366, 177334, 177413, 177725, 179317, 181526, 183302, 184731]
57424A84731J401R76M91R22J681J312J27k73K42M36J88L83P66L66l04J6Q60Q86
57406A95207N75J397K719K563J018O3K03K07m8N21J572J666J075J385K350K224
57390B14697J184J225K505L048K325J964K436K261J181J029K524M005M180L654
57376B48218L037K001Q08L88M05l77j527j278K84J083M03k66j20n0l17j5P58P70
57358B54205K31O80K031K522J982K172L414M005L549L662M615M567L102K302L114
57343B96153L796L226K714L120L197K290J829K578L047K291J611J950K149J449
57329C31400J180K244L269L041K503K639K575J617J013J856L034L128K602K558
57315C64659K839K855K780K693K103J367J805L430M421L878L120L248L455K966
$$ y = [184731, 186132, 187108, 187599, 188521, 190202, 191514, 191641, 191368, 191610, 192046, 192234, 192617, 193383, 193749, 193445, 193461, 194321, 195207, 195782, 197179, 199898, 202461, 203479, 203542, 203745, 203952, 203904, 204425, 205997, 207663, 208738, 210123, 212473, 214697, 215881, 217106, 219611, 222659, 224984, 226948, 229384, 231645, 232826, 233855, 236379, 240384, 244564, 248218, 251255, 253256, 254064, 254452, 254857, 254480, 252953, 251675, 251959, 253042, 253445, 253179, 253059, 253009, 252692, 252677, 253435, 254205, 254436, 255116, 257147, 259669, 261651, 263823, 267237, 271242, 274791, 278453, 283068, 287635, 290737, 293039, 296153, 299949, 303175, 305889, 309009, 312206, 314496, 316325, 318903, 321950, 324241, 325852, 327802, 329951, 331400, 332580, 334824, 338093, 341134, 343637, 346276, 348851, 350468, 351481, 353337, 356371, 359499, 362101, 364659, 367498, 370353, 373133, 375826, 377929, 379296, 381101, 384531, 388952, 392830, 395950, 399198, 402653, 405619]
57301D05619K575K961L409L477L983N230O075N808N148M533L516K659L586O046
57287D64625P484O752N761O215P227P599P833Q205P484N445M232N163O531O510
57273E57066N988O415P092O875O600P413Q528Q856R183J0514J1870J1982J1622
57260F70004J2066J2692J2266J1242J0726J0451R753R279R826J0694J1024J1409
57248H01432J2394J2904J2067J1166J1681J2824J3025J2652J3069J4194J5028
57237I42436J5600J6373J6732J6064J5314J5613J6291J6099J5443J5518J6150
57226A117633J6391J6402J6925J7655J7888J8075J9087K0645K1970K3212K4740
57215A330623K5911K6083K6044K6882K8175K8787K8698K8749K9244K9969L0809
$$ y = [405619, 408194, 411155, 414564, 418041, 422024, 427254, 433329, 439137, 444285, 448818, 452334, 454993, 458579, 464625, 472109, 478861, 484622, 490837, 498064, 505663, 513496, 521701, 529185, 534630, 538862, 544025, 550556, 557066, 563054, 569469, 576561, 583436, 590036, 597449, 605977, 614833, 624016, 634530, 646400, 658382, 670004, 682070, 694762, 707028, 718270, 728996, 739447, 749200, 758479, 768305, 778999, 790023, 801432, 813826, 826730, 838797, 849963, 861644, 874468, 887493, 900145, 913214, 927408, 942436, 958036, 974409, 991141, 1007205, 1022519, 1038132, 1054423, 1070522, 1085965, 1101483, 1117633, 1134024, 1150426, 1167351, 1185006, 1202894, 1220969, 1240056, 1260701, 1282671, 1305883, 1330623, 1356534, 1382617, 1408661, 1435543, 1463718, 1492505, 1521203, 1549952, 1579196, 1609165, 1639974]
57204A639974L1287L0521K8647K7176K6943K7022K6718K7047K8895L1234L2718
57193A958182L3667L4946L6143L6523L6502L6663L6475L5518L4848L5592L7294
57182B352353L8908M0294M1497M1929M1477M1089M1068M0464L9286L9385M1657
57171B799407M4365M5906M7170M9315N1239N1522N0960N0914N0732M9193M6937
57160C337660M5152M3388M0924L8855L8389L8499L7675L6565L6401L6257L4529
57149C764294L1876L0066K9000K7510K5907K5035K3849K0741J6431J2857J0046
57138D017612O817L796K839M005N768P811J0988J4967J8520K1821K6071L1046
57126D172061L5366L8773M1959M4560M5719M6179M7589N0193N3392N8015O5604
$$ y = [1639974, 1671261, 1701782, 1730429, 1757605, 1784548, 1811570, 1838288, 1865335, 1894230, 1925464, 1958182, 1991849, 2026795, 2062938, 2099461, 2135963, 2172626, 2209101, 2244619, 2279467, 2315059, 2352353, 2391261, 2431555, 2473052, 2514981, 2556458, 2597547, 2638615, 2679079, 2718365, 2757750, 2799407, 2843772, 2889678, 2936848, 2986163, 3037402, 3088924, 3139884, 3190798, 3241530, 3290723, 3337660, 3382812, 3426200, 3467124, 3505979, 3544368, 3582867, 3620542, 3657107, 3693508, 3729765, 3764294, 3796170, 3826236, 3855236, 3882746, 3908653, 3933688, 3957537, 3978278, 3994709, 4007566, 4017612, 4024429, 4028225, 4031064, 4035069, 4040837, 4048648, 4059636, 4074603, 4093123, 4114944, 4141015, 4172061, 4207427, 4246200, 4288159, 4332719, 4378438, 4424617, 4472206, 4522399, 4575791, 4633806, 4699410]
57115D699410P5836Q6974R8349J10206J21751J32078J42658J56439J74685J97034
57105E995420K24246K58340L00317L50379M10610M85320N78924O95631Q40975
57096A0140162J021310J241741J506140J818101K178987K584699L025939L490618
57088B7007697L963633M425341M853437N226355N523215N722274N802430N742962
57080F8267344N514615N070948M359403L353996K085304O42840q50668k273791
57072H6169991l531308m562506n336404n843398o091146o104072n920642n587047
57064D3193468n151270m659114m149877l652161l183601k754486k370712k034319
57056A5237928j744129j497266j289648j115617r69245q46220p43339o56622n81715
$$ y = [4699410, 4775246, 4862220, 4960569, 5070775, 5192526, 5324604, 5467262, 5623701, 5798386, 5995420, 6219666, 6478006, 6778323, 7128702, 7539312, 8024632, 8603556, 9299187, 10140162, 11161472, 12403213, 13909353, 15727454, 17906441, 20491140, 23517079, 27007697, 30971330, 35396671, 40250108, 45476463, 50999678, 56721952, 62524382, 68267344, 73781959, 78852907, 83212310, 86566306, 88651610, 89294450, 88443782, 86169991, 82638683, 78076177, 72739773, 66896375, 60805229, 54701157, 48780515, 43193468, 38042198, 33383084, 29233207, 25581046, 22397445, 19642959, 17272247, 15237928, 13493799, 11996533, 10706885, 9591268, 8622023, 7775803, 7032464, 6375842, 5794127]
57047E794127n15988m58527m08365l64352l26349k94614k68064k44820k24001
57038B689047k05420j88132j71174j55052j40583j26972j13078r9670q8172p7978
57028A322816o7476n6854m7331l8353k8171j6520m030J0213K7860M8995P2790
57017A223939R7653J16534J14860Q0905J9997m6382r7448j25887j34916j29846
57007A119409j15964r9348q4385p1555o0001n0368m3270l7407l1498k6286k2757
56996D76570k0142j7377j4806j2957j1333r753r079r333q819o374k859N84M009
56983C58331P461J0106J1493J1825J0278N194l004j1176j6758j9831k1254k1003
56971C21662j9296j7224j5101j2183q774o444n365l786r69J820M101P258J1746
$$ y = [5794127, 5278139, 4819612, 4411247, 4046895, 3720546, 3425932, 3157868, 2913048, 2689047, 2483627, 2295495, 2124321, 1969269, 1828686, 1701714, 1588636, 1488966, 1400794, 1322816, 1255340, 1198486, 1151155, 1112802, 1084631, 1068111, 1064081, 1074294, 1102154, 1151149, 1223939, 1321592, 1438126, 1552986, 1633891, 1653888, 1607506, 1510058, 1384171, 1249255, 1119409, 1003445, 904097, 819712, 748157, 688156, 637788, 594518, 557111, 525613, 499327, 476570, 456428, 439051, 424245, 411288, 399955, 390202, 381123, 371790, 362971, 356597, 353738, 354322, 358331, 365792, 375898, 387391, 399216, 409494, 414688, 411684, 400508, 383750, 363919, 342665, 321662, 302366, 285142, 270041, 257858, 249084, 242640, 237275, 233489, 232520, 234340, 238441, 245699, 257445]
56958B57445J5933J8999K2187K5588K6387K2178J3818L479p564j7676k4120k5888
56946C30766k5172k4074k2001j8132j3985j1203q814n221j156J791M072P331J1762
56933B25964J6500K1471K6946L2095L5507L6154L2615K3022P632r674k4004l2898
56921C91330l6389l5496l1941k7892k4358k0835j7277j4762j3410j1677q903o564
56909A41826n684n076l663k347k005j670n30L07j43q19o18l79r90j335j95J518
56893A18197K450L104M518O286P871J0236J4117J8241K1131K3106K4418K3236
56881B76911J7773R194K94p352j3115j5910j5419j3365j1449r174n617j799Q29
56868B11801K795N408Q554J1792J6102K2248K8741L3923L8766M5124N2058N5965
$$ y = [257445, 273378, 292377, 314564, 340152, 366539, 388717, 402535, 406014, 398450, 380774, 356654, 330766, 305594, 281520, 259519, 241387, 227402, 216199, 207385, 202164, 201008, 202799, 206871, 214202, 225964, 242464, 263935, 290881, 322976, 358483, 394637, 427252, 450274, 457906, 448232, 424228, 391330, 354941, 319445, 287504, 259612, 235254, 214419, 197142, 182380, 168970, 157293, 148390, 141826, 136142, 131066, 127403, 125056, 123051, 121381, 120851, 121158, 121015, 120196, 119578, 119199, 118209, 116874, 116679, 118197, 120647, 123751, 128269, 134555, 142426, 152662, 166779, 185020, 206151, 229257, 253675, 276911, 294684, 303878, 304172, 296820, 283705, 267795, 252376, 239011, 227562, 218388, 212771, 210972, 211801, 214596, 220004, 228558, 240350, 256452, 278700, 307441, 341364, 380130, 425254, 477312, 533277]
56856E33277N3580M3286K5301K969j7545l1493l8831m1759m0856l6030k9282k3248
56844C99369j7951j1829n023J148P092J4410K3050L1716M0587N0937O2557P3911
56832F69974Q4023R1146R0175P5082M5198P282k9090n6910p3423p9375p7655p1313
56820F75114o2267n2040m2494l4492k6904j8551j0163k870M069J2133K1210L0338
56808D93083L9730M9857N9205O4763O3902N4458L4951P365k1523m4409n8650o5574
56796F77158o6406o1718n3643m5200l7599l0546k4492j9948j5484r340k477K791
56784C13096O666J1472J7802K4011K9132L3134L4358K9960J9484N553r122k2909
56772D92637l3656l9036l9268l7034l4132l0304k5543k1066j7506j4320j1490
$$ y = [533277, 586857, 630143, 655444, 658413, 640868, 609375, 570544, 528785, 487929, 451899, 422617, 399369, 381418, 369589, 364566, 365714, 372806, 387216, 410266, 441982, 482569, 533506, 596063, 669974, 753997, 845143, 935318, 1010400, 1055598, 1062880, 1033790, 976880, 903457, 824082, 746427, 675114, 612847, 560807, 518313, 483821, 456917, 438366, 428203, 425333, 429402, 441535, 462745, 493083, 532813, 582670, 641875, 706638, 770540, 824998, 859949, 867314, 845791, 801382, 742732, 677158, 610752, 549034, 495391, 450191, 412592, 382046, 357554, 337606, 322122, 312782, 310305, 313096, 319762, 331234, 349036, 373047, 402179, 435313, 469671, 499631, 519115, 524668, 515546, 492637, 458981, 419945, 380677, 343643, 309511, 279207, 253664, 232598, 215092, 200772, 189282]
56761A89282r794r010p860o118m901m605m380l866l595l540l044k337k368l035
56747A20829l310l027k874k798k169j318j117j318j118r21j609k583k601k004
56733I2062j941k004j004M75Q25K62L41J026J000M67P90J525R21o24p48R11K081
56716I6365J670J240J912K613K394J938J821J505R21Q89J346J213N56O79J574
56701A18636J635M58l99q6L11k7m53n17p93j327j279o34l84n59j35P60P61k06
56683A15762n99O0M39j54p71q53r97j179n22P06J077N20N47J448J711Q28J49K49
56665A18421l9j065j431m97M82P65J289K464L084K459J562J033K99n25j80J328
56649A29449K268K028K096L067L307J889M46M79J043P53J07J01L78L10M09J156
$$ y = [189282, 179488, 170478, 162618, 156500, 151599, 146994, 142614, 138748, 135153, 131613, 128569, 126232, 123864, 120829, 117519, 114492, 111618, 108820, 106651, 105333, 104216, 102898, 101780, 100859, 99250, 96667, 94066, 92062, 90121, 88117, 87113, 87588, 88413, 88675, 89016, 90042, 91042, 91509, 92299, 93824, 94745, 94121, 93373, 94284, 96365, 98035, 99275, 101187, 103800, 106194, 108132, 109953, 111458, 112379, 113268, 114614, 115827, 116383, 117062, 118636, 120271, 120729, 120330, 120244, 120555, 120528, 120075, 119558, 118765, 117438, 116159, 115525, 115141, 114582, 114447, 115207, 115968, 115762, 115163, 115223, 115662, 115508, 114737, 113884, 112887, 111708, 111186, 111892, 112969, 113489, 114036, 115484, 117195, 118023, 118172, 118421, 118382, 117317, 115886, 115389, 115871, 116636, 117925, 120389, 123473, 125932, 127494, 128527, 128826, 128301, 128121, 129449, 131717, 133745, 135841, 138908, 142215, 144104, 144550, 145029, 146072, 146825, 146932, 147033, 147411, 147721, 148130, 149286]
56633A49286J845J850J657J659J363P54P90J627K034J455R44J172J292P79N41
56618A69048J087J371N60o18j301j706k055j861j118p38j019j222j093j150j143
56603A57042k34R69Q16m91p85O06J715J164K5m78p63j260j285p52q10j753k331
56586A51395k023j775j665m79J584K449J575J017J817K280J291M83J118J713Q72
56571A61652p7L86J154O42k76Q4J320J973K050K425L078L706M808O566Q014Q719
56555B06224R760J1563J2445J0809P297L496J00k405l097k057q19k12M76J322
56541B54902J012o68j934j935k106l299m108l658l375m139m380l012j740k162
56527B19398l019k683k041k417k782j656M8O27L27K31Or28j673j403j087j619
$$ y = [149286, 151131, 152981, 154638, 156297, 157660, 158414, 159204, 160831, 162865, 164320, 165264, 166436, 167728, 168507, 169048, 170135, 171506, 172066, 171448, 170147, 168441, 166386, 164525, 163407, 162669, 161650, 160428, 159335, 158185, 157042, 156808, 157777, 158593, 158102, 157317, 157923, 159638, 160802, 160827, 160349, 159586, 158326, 157041, 156289, 155479, 153726, 151395, 149372, 147597, 145932, 145453, 147037, 149486, 151061, 152078, 153895, 156175, 157466, 157949, 159067, 160780, 161652, 161575, 161961, 163115, 163757, 163481, 163565, 164885, 166858, 168908, 171333, 174411, 178117, 182925, 189491, 197505, 206224, 215984, 227547, 239992, 250801, 258098, 261594, 261694, 259289, 256192, 254135, 253316, 253104, 253580, 254902, 255914, 255246, 253312, 251377, 249271, 245972, 241864, 238206, 234831, 230692, 226312, 223300, 221560, 219398, 216379, 213696, 211655, 209238, 206456, 204800, 204848, 205475, 205802, 206033, 206039, 205111, 203438, 202035, 200948, 199329]
56511A99329k001j340p98j432k019j224j12j38o14l15N4n83j366j108n21o40p26
56494A84446P5O93Qr27p53j43j75j80N89J035K49m87QM92l31j176m44Q41R70M87
56474A85277O14O92j61p72o8N35l08j000L13K153K078Q09O45J426J406P47Q33
56457A95219J323J010M53P95J208M99k75L36J161L86r90q51K80M37j93j65P1p01
56439B00003j480n51J157J546R45R94J209J67j135o82Q05J155O54J091J885J066
56423B08829p54j174k16J0o81n76L62N56J07M93J376J162L58R02K401K526J005
56406B16686j38j02R5K73J077J704Q29n80n57L42O4j002p09P15R92L3P0J543K429
56387B23764J917J348J336J079O98J133J745J088j37J6J150J126k1j69J025J741
$$ y = [199329, 197328, 195988, 195190, 193758, 191739, 190515, 190403, 190265, 189651, 189336, 189390, 188807, 187441, 186333, 185812, 185172, 184446, 184521, 185214, 185222, 184295, 183542, 183399, 183224, 183044, 183633, 184668, 184917, 184430, 184438, 184930, 184599, 183423, 182979, 183820, 184790, 185277, 185891, 186583, 186422, 185650, 185582, 186117, 185809, 184809, 185122, 187275, 189353, 190162, 190807, 192233, 193639, 194386, 195219, 196542, 197552, 198005, 198800, 200008, 200507, 200232, 200568, 201729, 202115, 201125, 200274, 200554, 200991, 200798, 200633, 200704, 200003, 198523, 197972, 199129, 200675, 201620, 202614, 203823, 203990, 202855, 202173, 202978, 204133, 204787, 205878, 207763, 208829, 208075, 206901, 206685, 206695, 206014, 205438, 205800, 206356, 206463, 206956, 208332, 209494, 209852, 210754, 213155, 215681, 216686, 216548, 216446, 216541, 216814, 217891, 219595, 220424, 219844, 219287, 219629, 219693, 218691, 217982, 218697, 219689, 219722, 219792, 221335, 223764, 225681, 227029, 228365, 229444, 230142, 231275, 233020, 234108, 233971, 233987, 235137, 236263, 236242, 236073, 237098, 238839]
56371B38839J432J356J673J327P89J594L161L322K040J363J792J863J270J100
56357B62921J153K26j042q86K47M10j93K91J587J695P11N85J222P00p45q15O67
56340B68734J442Q56N43R80R99P39J487K635K483J819K850M797M735K691J618
56325B99408K230K321J499J958L906M597K901Q68q1o85j055j75J193R12p58j456
56309C17583q74p00p13P57K659K292N66J087L785M755L096K297L821M817L763
56294C48991K930L486L306J673J169K766L812K994K640L960M693L787L743N832
56280C95782P464O905O341P590Q773Q059O908P014P536P826R257J2048J3732J3148
56266E18383J2558J3739J5374J6327J7830K0418K2249K2646K3737K6707K9879
$$ y = [238839, 240271, 241627, 243300, 244627, 245416, 247010, 250171, 253493, 255533, 256896, 258688, 260551, 261821, 262921, 264074, 264300, 263258, 262372, 262619, 263029, 262836, 263127, 264714, 266409, 267120, 267705, 268927, 269627, 268882, 268067, 268734, 270176, 271032, 271575, 272555, 273554, 274293, 275780, 278415, 280898, 282717, 285567, 290364, 295099, 297790, 299408, 301638, 303959, 305458, 307416, 311322, 315919, 318820, 319688, 319607, 318922, 317867, 317692, 318885, 319797, 319039, 317583, 316709, 316009, 315296, 316053, 318712, 321004, 321570, 322657, 326442, 331197, 334293, 336590, 340411, 345228, 348991, 351921, 355407, 358713, 360386, 361555, 364321, 368133, 371127, 373767, 377727, 382420, 386207, 389950, 395782, 403246, 410151, 416492, 424082, 432855, 440914, 447822, 454836, 462372, 470198, 479455, 491503, 505235, 518383, 530941, 544680, 560054, 576381, 594211, 614629, 636878, 659524, 683261, 709968, 739847]
56255G39847L2292L5540M0253M4665M8517N4454O3484P3010Q1386R0450J01418
56244A405316J12256J21448J30511J40398J49108J55027J59032J61286J59683
56235B694065J53370J44046J31971J14753R1944O6621M0619J2606j7161m4935
56225C387899o8577q9930j09782j25250j34710j40583j44568j44886j41069j36538
56215B152006j33222j28311j19687j10032j02150r4661q5879p7668p1783o6380
56205A162233n9694n3397m9039m4983l9977l5852l3629l1049k6928k3766k2957
56194G40962k1799j8440j5355j4618j4149j2009j0042r783r225p077n727o495
56182E96243o586m249k315k946l647k283j193k319l138j593k81j437k471r43P82
$$ y = [739847, 772139, 807679, 847932, 892597, 941114, 995568, 1059052, 1132062, 1213448, 1303898, 1405316, 1517572, 1639020, 1769531, 1909929, 2059037, 2214064, 2373096, 2534382, 2694065, 2847435, 2991481, 3123452, 3238205, 3330149, 3396770, 3437389, 3449995, 3432834, 3387899, 3319322, 3229392, 3119610, 2994360, 2859650, 2719067, 2574499, 2429613, 2288544, 2152006, 2018784, 1890473, 1770786, 1660754, 1558604, 1463943, 1378064, 1300396, 1228613, 1162233, 1102539, 1049142, 1000103, 955120, 915143, 879291, 845662, 814613, 787685, 763919, 740962, 719163, 700723, 685368, 670750, 656601, 644592, 634550, 624767, 615542, 608465, 602738, 596243, 589657, 585408, 583093, 580147, 576500, 574217, 573024, 570705, 567567, 565974, 565693, 564256, 561785, 560842, 561624]
56167E61624J88o92L49J368P61J168M231O368M761K738M030O368O101M704N202
56152F09269O358N834N202O614Q294Q271Q575J1008J3071J2824J3275J7121K1770
56139G47486K4590K8126L5059M3079N0225N9922P4694Q9973J00299J06715J11779
56128A471947J12412J04660R1117P6965O2980M8860L8697L5942L6861L5522L1388
56117B147351K5949J6939K976j0609j7825k0107k1997k3684k4607k9327m1818
56106B003241n8042p1444q1529r0011r3689q9277q0698p3494o6231n5357m3868
56095A199601l6672l1759k4568j6983j3416j2087q783n247n151n911l209L89K13
56082A036417j302P99M402M454K692L931O659O569N498P521J0235R350P654R854
$$ y = [561624, 561812, 561120, 561469, 562837, 563598, 564766, 568997, 575365, 580126, 582864, 586894, 593262, 599363, 604067, 609269, 615627, 621461, 626663, 633277, 641571, 649842, 658417, 669425, 682496, 695320, 708595, 725716, 747486, 772076, 800202, 835261, 878340, 928565, 988487, 1063181, 1153154, 1253453, 1360168, 1471947, 1584359, 1689019, 1780136, 1857101, 1920081, 1968941, 2007638, 2043580, 2080441, 2115963, 2147351, 2173300, 2190239, 2193215, 2182606, 2164781, 2144674, 2122677, 2098993, 2074386, 2045059, 2003241, 1945199, 1873755, 1792226, 1702215, 1608526, 1519249, 1438551, 1365057, 1298826, 1243469, 1199601, 1162929, 1131170, 1106602, 1089619, 1076203, 1064116, 1055333, 1050086, 1044935, 1039024, 1035815, 1036204, 1036417, 1035115, 1035914, 1040316, 1044770, 1047462, 1051393, 1058052, 1064621, 1070119, 1077640, 1087875, 1097225, 1104879, 1114733]
56068A114733J2996J1878R414J1290J4932J4507J2415J4710J9343K0160J8594
56057A274972K0047K2683K1245J8091J8841K1042J8778J4514J4532J6816J5511
56046A477072J3049J5342J9392J8598J5871J8284K3190K3345K1322K4531L0342
56035A700338L0815K8136L0219L5022L4719L1578L3868L9624M0504L8244M0921
56024B083988M6494M6849M4549M8307N5304N5775N1852N3633N9802O0838N8240
56013B665631O1327O8041O8734O6149P1168Q1512Q5501Q4313Q9008R8077J00293
56002C539754R7582J02121J12771J17753J18624J27493J42469J50804J54399J66373
55992D830143J84337J94008J97431K09708K29539K42117K49452K67363K93913
$$ y = [1114733, 1127729, 1139607, 1149021, 1160311, 1175243, 1189750, 1202165, 1216875, 1236218, 1256378, 1274972, 1295019, 1317702, 1338947, 1357038, 1375879, 1396921, 1415699, 1430213, 1444745, 1461561, 1477072, 1490121, 1505463, 1524855, 1543453, 1559324, 1577608, 1600798, 1624143, 1645465, 1669996, 1700338, 1731153, 1759289, 1789508, 1824530, 1859249, 1890827, 1924695, 1964319, 2004823, 2043067, 2083988, 2130482, 2177331, 2221880, 2270187, 2325491, 2381266, 2433118, 2486751, 2546553, 2607391, 2665631, 2726958, 2794999, 2863733, 2929882, 3001050, 3082562, 3168063, 3252376, 3341384, 3439461, 3539754, 3637336, 3739457, 3852228, 3969981, 4088605, 4216098, 4358567, 4509371, 4663770, 4830143, 5014480, 5208488, 5405919, 5615627, 5845166, 6087283, 6336735, 6604098, 6898011]
55983F898011L12693L25946L51167L86266M13183M34746M70995N20103N62008
55974A0675118N99787O55907P28378P95060Q60867R53283J071431J190698J318044
55965A8848573J487633J701387J934123K199163K543951K979852L489448M106419
55957C9290549M909063N933657P185450Q737369J0714931J3187366J6198635J9886866
55949A26043886K4381650K9557561L5076652M0584561M5321990M7259564M3260974
55942C91486838L1184018J2288461q747509k6569269l8073744m3106677m3192687
55935B75269431m0145864l5509394l0440250k5623622k1326271j7627764j4564227
55928I0032039j2092266j0083963q432789p098487o034426n157059m411992l798232
$$ y = [6898011, 7210704, 7536650, 7887817, 8274083, 8687266, 9122012, 9593007, 10113110, 10675118, 11274905, 11930812, 12659190, 13454250, 14315117, 15268400, 16339831, 17530529, 18848573, 20336206, 22037593, 23971716, 26170879, 28714830, 31694682, 35184130, 39290549, 44199612, 50133269, 57318719, 66056088, 76771019, 89958385, 106157020, 126043886, 150425536, 179983097, 215059749, 255644310, 300966300, 348225864, 391486838, 422670856, 434959317, 426211808, 399642539, 361568795, 318462118, 275269431, 235123567, 199614173, 169173923, 143550301, 122224030, 104596266, 90032039, 77939773, 67855810, 59423021, 52324534, 46290108, 41133049, 36721057, 32922825]
55920C2922825l304855k885858k514594k203753j953627j733096j526829j351972
55912A5448241j213389j087653r64503q61264p83410p10899o35589n74157n32122
55903H085255m91065m43061m03714l79556l54831l21831k93834k76944k58117
55894D862302k31816k10949k00876j88873j69564j55504j52419j48141j36124
55885C268036j26860j25927j22866j11707j01658r7837r1431p8246o7743o4560
55875B279201n9589m8395m0748m3080m8178n0446n4967o3530o7777o4322o1448
55864A676721o3345o2573n5229m8746m7526m5285l8600l3896l4135l2543k6284
55853A188559k2606k4730k5277k0555j7891k1663k5110k3344k1774k4334k5522
$$ y = [32922825, 29617970, 26732112, 24217518, 22013765, 20060138, 18327042, 16800213, 15448241, 14234852, 13147199, 12182696, 11321432, 10538022, 9827123, 9191534, 8617377, 8085255, 7594190, 7151129, 6747415, 6367859, 6013028, 5691197, 5397363, 5120419, 4862302, 4630486, 4419537, 4218661, 4029788, 3860224, 3704720, 3552301, 3404160, 3268036, 3141176, 3015249, 2892383, 2780676, 2679018, 2581181, 2489750, 2411504, 2343761, 2279201, 2219612, 2171217, 2130469, 2087389, 2039211, 1988765, 1933798, 1870268, 1802491, 1738169, 1676721, 1613376, 1550803, 1495574, 1446828, 1399302, 1354017, 1315417, 1281521, 1247386, 1214843, 1188559, 1165953, 1141223, 1115946, 1095391, 1077500, 1055837, 1030727, 1007383, 985609, 961275, 935753]
55842I35753k1641j8371j9768k0824j7931j5942j7939j8621j4741j1772j3487
55831G44716j4982j2541j0535j2002j2156p946m500n596o871m921m108p814j1668
55818F29076j1802j1427j3275j3813j0904q900j0294j0561o955m210n669o996
55806E14270m563k054k758l230n50J801J252J664N627Q787P733O300P927R050
55792E51256O154K463J517P67k542n652o191p218j0718j2654j0238p501p856p791
55778D83796m144j071l281q190j1134j2828j5284j5965j2414p795n750m326n93
55765C81021L526N367O460Q063O967J329m315n460m278m406m180p93L584N662
55751C98547O673Q576Q940N247J43k918n262r088j2299j2531j2075j3444j4230
$$ y = [935753, 914112, 895741, 875973, 855149, 837218, 821276, 803337, 784716, 769975, 758203, 744716, 729734, 717193, 706658, 694656, 682500, 674554, 670054, 664458, 657587, 652666, 648558, 640744, 629076, 617274, 605847, 592572, 578759, 567855, 558955, 548661, 538100, 531145, 526935, 521266, 514270, 509707, 507653, 504895, 501665, 501115, 502916, 504168, 505832, 511459, 520246, 527979, 534279, 542206, 551256, 557410, 559873, 561390, 562157, 559615, 553963, 547772, 540554, 529836, 517182, 506944, 499443, 491587, 483796, 479652, 478581, 475300, 467110, 455976, 443148, 427864, 411899, 399485, 391690, 385940, 381614, 381021, 384547, 389914, 396374, 404437, 411404, 412733, 408418, 402958, 398680, 394274, 390094, 389301, 392885, 398547, 405220, 413796, 422736, 427983, 428126, 425208, 419946, 410858, 398559, 386028, 373953, 360509, 346279]
55738C46279j1730q595q319r052p426m718l796l528j675J03n71j986j800j779
55724B81407m111o556o384n543o707p779n757k717k375l733l579k329k185k234
55710B19418o07J191J125J080L516O527P067O253O457O128K747j776l915m259
55696B50952n472o972o690n684n993o256m343k042k172l430k929j537j704k355
55682A93373j038J113J563J369K989N160N085L649L489L823K306Q1j86M59p63
55667B22472k863k732q77l14j108r61p9m61j396n69J385J995J551K140L284L120
55651B24587K579L791N530N029L098K648L291K229l16j560j241j550k653k915
55637B42547k947m759p387p969o662o139o712o399n270n157n523m203j873j293
$$ y = [346279, 334549, 325954, 317635, 308583, 301157, 296439, 292643, 289115, 287440, 287543, 286972, 284986, 283186, 281407, 277296, 270740, 264356, 258813, 252106, 244327, 238570, 235853, 233478, 229745, 226166, 223837, 221652, 219418, 218811, 220002, 221127, 222207, 225723, 232250, 239317, 245570, 252027, 258155, 260902, 259126, 255211, 250952, 245480, 238508, 231818, 226134, 220141, 213885, 209542, 207500, 205328, 201898, 198969, 197432, 195728, 193373, 192335, 193448, 195011, 196380, 199369, 204529, 209614, 213263, 216752, 220575, 222881, 222962, 222776, 223235, 222472, 219609, 216877, 216000, 215686, 214578, 213617, 213538, 213077, 211681, 211112, 212497, 214492, 216043, 218183, 221467, 224587, 227166, 230957, 236487, 241516, 244614, 247262, 250553, 252782, 252466, 250906, 249665, 248115, 245462, 242547, 239600, 234841, 227454, 219485, 212823, 206684, 199972, 193573, 188303, 183146, 177623, 173420, 171547, 170254]
55623A70254k340k239n84L17q3o0M09l87k011k171j004q76j930j960q74r42k320
55606A51199k564j073%k28k65K83m3j283j646r53j006k067k391j670j500k069
55590A32724j773n63k57j032j007K27R08M01M1K33j56j132j325p13o27r13j53
55573A24883J199J200k2l86L33K44q61j026J71Q33L13J52Q93J241J005J557K717
55556A34446K487P15k82L23N11r01k323k306j641j331j057p00r54j584j349l67
55540A23687r3n01J10J855K601J394l6j79L62P43J305K123K315J707J287J311
55524A39991R00p0o02n21p28j342j568j612k463l689l711k454j514j525j637j487
55508A15968j518j384m73K61m87j651j094O69J157R8m12J20m0j217j537m54L15
$$ y = [170254, 167914, 165675, 165091, 165408, 165325, 165265, 165674, 165287, 163276, 161105, 160101, 159225, 157295, 155335, 154461, 153519, 151199, 148635, 147562, 147562, 147334, 147069, 147352, 147309, 146026, 144380, 143427, 142421, 140354, 137963, 136293, 134793, 132724, 130951, 130388, 130131, 129099, 128092, 128319, 129227, 129628, 129669, 129902, 129746, 128614, 127289, 126576, 125949, 125036, 124883, 126082, 127282, 127260, 126874, 127207, 127451, 126590, 125564, 125735, 126568, 126881, 127033, 127926, 129167, 130172, 131729, 134446, 136933, 137648, 137366, 137689, 138200, 137299, 134976, 132670, 131029, 129698, 128641, 127941, 126987, 125403, 124054, 123687, 123594, 123093, 123203, 125058, 127659, 129053, 129017, 128838, 129200, 129943, 131248, 133371, 135686, 137393, 138680, 139991, 140891, 140821, 140219, 139698, 138970, 137628, 136060, 134448, 131985, 128296, 124585, 122131, 120617, 119092, 117455, 115968, 114450, 113066, 112593, 112854, 112367, 110716, 109622, 110291, 111448, 111546, 111134, 111254, 111214, 109997, 108460, 108006, 108321]
55491A08321Q9J65P33J85j559k376j553r22j266r71N25J236J46q52k77O19N37
55474A02780M21J213J850J390Q62J193J374M31p19r73p52o79l65J56k22j601k244
55457A04115j152L59Q11N10J75m35j302j400m19M00K58k1L31Q34J052J322J560
55440A06998J101L84P48J959K152Q59k36k90n21j559k068j303n33o52o54J59O60
55423A07204O1n22n6P48J074J289J510Q57n45r94J72J348J317R43J056Q84M4j84
55405A16206Q21J478M97r84j357q83o00n96p90j644k748k602j040K1m93j183q12
55388A03291k99o14r03m07o0l83n7J526K433J128p87j064j97M1k45J68J041J307
55370A05919J232J665K075J465L90J16N30O13J99l08j027j922k008q18L66K90
$$ y = [108321, 108410, 108575, 109308, 109493, 107934, 105558, 104005, 103083, 101817, 100846, 101371, 102607, 102753, 101901, 101624, 102243, 102780, 103201, 104414, 106264, 107654, 108516, 109709, 111083, 111514, 110795, 109822, 109070, 108391, 108026, 108182, 107960, 106359, 104115, 102963, 103322, 104133, 104643, 104818, 104383, 103081, 101681, 101262, 101662, 101920, 101899, 102230, 103064, 104116, 105438, 106998, 108099, 108483, 109231, 111190, 113342, 114201, 113965, 113675, 113154, 111595, 109527, 108224, 107691, 107039, 106385, 106544, 107204, 107265, 106743, 106687, 107435, 108509, 109798, 111308, 112165, 111620, 110626, 110798, 112146, 113463, 114406, 115462, 116346, 116390, 116206, 117027, 118505, 119002, 118018, 116661, 115778, 115178, 114582, 113792, 112148, 109400, 106798, 105758, 105779, 105286, 104103, 103291, 102992, 102378, 101475, 101068, 101008, 100625, 100568, 102094, 104527, 105655, 104868, 103804, 103607, 103648, 103403, 103571, 104612, 105919, 107151, 108816, 110891, 112356, 112746, 112862, 113392, 114005, 114204, 113896, 112869, 110947, 108939, 108121, 108487, 108777]
55354A08777l72l58J10J38p6K9j1p16j265p04L39P20N57N73N51J9m89k90J74K28
55334A07934K31O79J012O27O1m6j61p77j278j080p57q28o32L03J051Q22M08O70
55316A08239R60M66j62p7J64k02n93l44j76p16r40J69J529J505M70o9N2r1n76
55297A09608p68p07p68o11L6L94p3l60N77J921K200J460P18J89l44l51N41J342
55279A15004J013J98P8L87J42n21q58j027j488j706j036j01K04K08N15N59k97
55262A11274j243j182m67P7P20J744K045P85o41l82J042J716J285Q59P22L27q2
55245A18599J13M05l3n80k09M40R2p16l91R25J582J129O67O46L36m46j012j217
55227A20330j507j659j072j61J29J3M19J210J434J097J014J164Q18M5n10r62j707
$$ y = [108777, 108405, 108047, 108157, 108295, 108219, 108248, 108237, 107521, 106256, 105552, 105891, 106611, 107168, 107741, 108292, 108311, 107822, 107532, 107706, 107934, 108165, 108844, 109856, 110483, 110544, 110498, 110337, 109560, 108282, 107202, 106445, 105617, 104985, 105288, 106339, 107161, 107569, 108239, 109199, 109665, 109503, 109426, 109590, 109388, 108795, 108451, 108275, 107559, 106619, 106788, 108317, 109822, 110292, 110223, 110275, 110184, 109608, 108840, 108133, 107365, 106754, 106790, 107184, 107111, 106751, 107328, 109249, 111449, 112909, 113627, 113816, 113472, 113121, 113662, 115004, 116017, 116215, 116293, 116680, 116822, 116301, 115443, 114416, 112928, 111222, 110186, 110085, 110289, 110497, 111012, 111571, 111274, 110031, 108849, 108382, 108459, 109179, 110923, 112968, 113753, 113112, 112730, 113772, 115488, 116773, 117632, 118354, 118681, 118599, 118712, 119117, 119084, 118504, 118295, 118735, 118827, 118111, 117720, 118645, 120227, 121356, 122023, 122669, 123005, 122559, 121547, 120330, 118823, 117164, 116092, 115931, 116060, 116073, 116492, 117702, 119136, 120233, 121247, 122411, 123229, 123274, 122764, 121802, 120095]
55210A20095k029j014N30R26K01j39L10M19k30o07o9P03R28O15K4o09q01l48Q2
55191A18987j33m84k30K15J17q0M28J098Q05k71j079j465j863j839q20L12K39
55174A13937n41m54N41J064P55N59P00M39j81k05M98J053J182J322J336O98j04
55157A22599j14L83L31j76k05J42K9k45K84J191J116J72k49P4N7m13l01L42K82
55138A25299n81r49m76j96k90K67J428J639M15p70q12l24J4M69R68O54m62j118
55120A25175p71l38l76k90J11N1n25n05M09R66M13l59m98m24n27k44O63J292R77
55101A25200K44k46m54j87R66K368K537J293J99K69O82N25J98L00N06M31L09J05
55083A35245o81j690j655l78O63M61k11l12M6N10J290K141K034Q54R5P38J699
$$ y = [120095, 118066, 117052, 117582, 118508, 118709, 118570, 118880, 119299, 119069, 118462, 118393, 119096, 120024, 120639, 120663, 120054, 119253, 118905, 118987, 118854, 118370, 118140, 118355, 118472, 118392, 118820, 119918, 120723, 120452, 119373, 117908, 116045, 114206, 113386, 113698, 113937, 113396, 112942, 113483, 114547, 115302, 115861, 116561, 117000, 116819, 116614, 117112, 118165, 119347, 120669, 122005, 122703, 122599, 122485, 122868, 123199, 123023, 122818, 122960, 122989, 122744, 123028, 124219, 125335, 125507, 125258, 125332, 125389, 124976, 124675, 125017, 125299, 124718, 123769, 123293, 123097, 122807, 123074, 124502, 126141, 126556, 125786, 124974, 124650, 124664, 125133, 126101, 126755, 126293, 125175, 124404, 124066, 123690, 123400, 123511, 123562, 123037, 122532, 122941, 123907, 124320, 123961, 123463, 123039, 122512, 122268, 122931, 124223, 125200, 125444, 125198, 124744, 124557, 125523, 127891, 130428, 131721, 131920, 132189, 132871, 133396, 133594, 133894, 134400, 134831, 135140, 135245, 134564, 132874, 131219, 130841, 131504, 131965, 131754, 131442, 131488, 131998, 133288, 135429, 137463, 138317, 138412, 139150, 140849]
55066A40849J424M7j135j397r12j92R1n17j466j671j011l71l4N56J218R28j98
55049A36209o05K74R81L95n72p29m68o51r78p93l58j10K19O85M25q88j999j648
55031A29389l16P15J057R95N53o3o1Q56J715J619J002O47L91j86o90o10l19l81
55013A36313n76n64p04j315j857j724j159n79J10P42M83q27j817j226L42J314
54997A26956J086K00o77j030m08R19J808J577Q86O22O45M62K47K99K27l16p47
54980A32756l39O24J297J404J212Q77N61N94R60J122Q54N85N76N07L13M42Q67
54963A45212Q81L81J69N01N19j02l69L45J149J148Q15P88N74k85r78o76pP7j48
54944A49994k8J4n98j183q09J8J80k25l44j92l36n44k51J14j78o08q2J171J927
$$ y = [140849, 142273, 142320, 141185, 139788, 138876, 138684, 138775, 138258, 136792, 135121, 134110, 133739, 133705, 134261, 135479, 136407, 136209, 135604, 135878, 136859, 137254, 136682, 135953, 135485, 134834, 133856, 133063, 132705, 132595, 132814, 133499, 133924, 133036, 131037, 129389, 129073, 129788, 130845, 131840, 132393, 132330, 132269, 133125, 134840, 136459, 137461, 138108, 138499, 138313, 137623, 137013, 136694, 136313, 135737, 135173, 134469, 133154, 131297, 129573, 128414, 127835, 127945, 128687, 129170, 128343, 126526, 125300, 125642, 126956, 128042, 128242, 127565, 126535, 126127, 127046, 128854, 130431, 131317, 131939, 132584, 133046, 133293, 133592, 133819, 133503, 132756, 132417, 133041, 134338, 135742, 136954, 137831, 138392, 138986, 139946, 141068, 141922, 142507, 143083, 143590, 143903, 144345, 145212, 146093, 146474, 146643, 147144, 147663, 147561, 147192, 147537, 148686, 149834, 150649, 151437, 152011, 151726, 150748, 150072, 150065, 150142, 149994, 149966, 149980, 149382, 148199, 147390, 147408, 147588, 147363, 147019, 146827, 146491, 145947, 145696, 145810, 145632, 145024, 144942, 146113, 148040]
54925A48040J959K168K838L268L212L359M099M998N687O344P066P592P838P951
54911B16419P764O840N087K826K84k392m798o518p510p825p268n917m562m032
54897A88398m305m756m919m586l654k465j778j874k095j774j044l53K01N32L97
54882A55925O8L39J290J985K016K319L590M984N493N580O234P277P923Q210Q521
54867B21754Q268O497L435J88k667n030o375o286n575n501o074o315n993n829
54853A84497o054n971n096l752k485j601j195j070p88m51q39k172l336l232k232
54838A44223j380q10j39L57K59J79R33J896J668J96j136j505j352j159p69j47
54822A41314L70O85R49R52M48j5L27J100J148L02k82J93J177J754J685J217N25
$$ y = [148040, 149999, 152167, 155005, 158273, 161485, 164844, 168943, 173941, 179628, 185972, 193038, 200630, 208468, 216419, 224183, 231023, 236110, 238936, 239220, 236828, 232030, 225512, 218002, 210177, 202909, 196992, 192430, 188398, 184093, 179337, 174418, 169832, 166178, 163713, 161935, 160061, 157966, 156192, 155148, 154795, 154996, 155528, 155925, 155993, 156332, 157622, 159607, 161623, 163942, 167532, 172516, 178009, 183589, 189823, 197100, 205023, 213233, 221754, 230022, 236519, 239954, 240142, 237475, 232445, 226070, 219784, 214209, 208708, 202634, 196319, 190326, 184497, 178443, 172472, 167376, 163624, 161139, 159538, 158343, 157273, 156485, 156034, 155195, 153023, 149687, 146455, 144223, 142843, 142033, 141894, 142251, 142510, 142689, 143622, 145518, 147186, 147382, 146246, 144741, 143389, 142230, 141461, 141314, 141684, 142369, 143318, 144270, 144718, 144703, 145030, 146130, 147278, 147580, 147298, 147491, 148668, 150422, 152107, 153324, 153849]
54805A53849j90n79m00K87J118J457Q15l77r55m64J56m6o46o52r7K94M37P74J095
54786A55876P50j02n37j84M14P46Q10P01M44K14J71J87K09N24J149J524J410J447
54768A65753K075K641K549K495L478N240O835Q105R315R963R402Q163P203O190
54754B49407M047R29j834l690n296o983q189q523q231p492o366n399n141n149
54740A82090m499l226k136j433p17j25j65n02k93L13L20m31j000q15k11N78J672
54723A69420K790L422L830M641N529N599N078N266O573P913Q221P408N648L015
54709B44353K4k534m499o161p313p578p445p657p753o733n005m060m121l917k918
54694A66683k036j784j461p07k38l78l63K00N94L48Rm8k85q67j132q35o85j014
$$ y = [153849, 153659, 153080, 152680, 152967, 154085, 155542, 156357, 155980, 155025, 154561, 154717, 154671, 154025, 153373, 153276, 153570, 154007, 154781, 155876, 156626, 156524, 155987, 155803, 156217, 156963, 157773, 158474, 158918, 159132, 159303, 159490, 159699, 160223, 161372, 162896, 164306, 165753, 167828, 170469, 173018, 175513, 178991, 184231, 191066, 199171, 208486, 218449, 227851, 236014, 243217, 249407, 253454, 254383, 252549, 248859, 243563, 236580, 228391, 219868, 211637, 204145, 197779, 192380, 187239, 182090, 177591, 174365, 172229, 170796, 170079, 169954, 169789, 169287, 168994, 169307, 169627, 169196, 168196, 167381, 167170, 167748, 169420, 172210, 175632, 179462, 184103, 189632, 195231, 200309, 205575, 212148, 220061, 228282, 235690, 241338, 244353, 244377, 241843, 237344, 231183, 223870, 216292, 208847, 201190, 193437, 186704, 181699, 177639, 173518, 169601, 166683, 164647, 162863, 161402, 160695, 160457, 160079, 159716, 159916, 160510, 160858, 160867, 160819, 160534, 159667, 158535, 157700, 157015, 156001]
54676A56001j172p96m42m47l70j46l72r10o46O38J559J122Q7n19q29j127q29L58
54658A51160J407J304M65j96o15j032j092o27l70p96j097m02P49J261J098R49
54642A52166R95J042J249J614J405J81j099j131m9Q20P06Mn96p99p01o97j125
54625A53985j657j464m58L09J7p69r42k66P19J540J906J489L83o65j053r18n60
54608A51596P7Q61J178P74K53J25Q5j70k11K81P29N10o5l72l84k49K61J009J084
54589A57372J00q32n83K74L73k91n83j83K1m12p90m81J72M80K73j62m91m92j70
54570A53595J11K5l30n78n26j90L66Q98J015O30J44q4j19j38j40j87m31n92o9
54551A53400J046J687J149R1l88j82m8l71p73p25p0R40J730J800J286P95N18M4
$$ y = [156001, 154829, 154033, 153591, 153144, 152774, 152628, 152256, 151346, 150700, 151338, 152897, 154019, 154106, 153587, 152758, 151631, 150802, 151160, 152567, 153871, 154336, 154140, 153525, 152493, 151401, 150774, 150404, 149608, 148511, 148109, 148858, 150119, 151217, 152166, 153161, 154203, 155452, 157066, 158471, 158652, 157553, 156422, 156373, 157193, 157899, 157903, 157307, 156508, 155807, 155110, 153985, 152328, 150864, 150406, 150715, 150732, 149963, 149021, 148755, 149474, 151014, 152920, 154409, 154792, 154127, 153074, 152156, 151596, 151673, 152534, 153712, 154486, 154739, 154864, 154949, 154779, 154568, 154849, 155578, 156088, 156023, 155651, 155267, 155018, 155279, 156288, 157372, 157472, 156640, 156057, 156331, 156704, 156413, 155830, 155647, 155668, 155256, 154466, 153985, 154157, 154637, 154910, 154748, 154257, 153765, 153595, 153706, 153731, 153401, 152823, 152297, 152107, 152473, 153371, 154386, 155016, 155160, 155076, 154957, 154819, 154679, 154492, 154061, 153469, 153400, 154446, 156133, 157282, 157373, 156985, 156803, 156755, 156384, 155611, 154886, 154816, 155756, 157486, 159286, 160572, 161367, 161885, 161929]
54533A61929o46p39K83J687K315J956J309Q92O37L37l3l86o03o59p08q34p15p9
54515A65943O28O27o3n79m67j37LK4r5n61j062r19j84L46M73P61J104N64q07j478
54495A64121o07O60J066J000J258J370O26l40o02p20j780l236l429j965o9J227
54479A58580J867J906J253L52j4K13M21M12O12J143J496J220L74n79r91m41O03
54462A68427J058O67M49J100J761J338K08m11k36J71N99J096J137K58q07r21l14
54445A75580k53j073j758j511o26K19O03K70o41j300j027l36k33p07q63m13Q2
54428A66013L72Q03J331J351O68j56o03o29k67M64J233J653J805J934J889J462
54412A79323R50O42K04n81j021n33J52Pn25k32P30J035M27Q5N39Q70L86l49o80
$$ y = [161929, 161283, 160544, 160827, 162514, 164829, 166785, 168094, 168986, 169623, 169960, 169927, 169541, 168938, 168279, 167571, 166737, 166022, 165943, 166571, 167198, 167135, 166556, 166089, 165952, 165955, 165979, 165884, 165323, 164261, 163342, 163158, 163504, 163977, 164738, 165842, 166406, 165599, 164121, 163514, 164174, 165240, 166240, 167498, 168868, 169494, 169154, 168552, 167832, 166052, 162816, 159387, 157422, 157353, 158580, 160447, 162353, 163606, 163958, 163944, 164157, 164578, 164990, 165602, 166745, 168241, 169461, 169835, 169256, 168265, 167824, 168427, 169485, 170152, 170601, 171701, 173462, 174800, 175008, 174597, 174361, 174532, 175131, 176227, 177364, 177622, 176815, 175894, 175580, 175327, 174254, 172496, 170985, 170359, 170578, 171181, 171451, 170810, 169510, 168483, 168147, 167914, 167207, 166344, 165931, 166013, 166385, 167188, 168519, 169870, 170538, 170382, 169779, 169150, 168883, 169347, 170580, 172233, 174038, 175972, 177861, 179323, 180273, 180915, 181119, 180538, 179517, 178984, 179136, 179143, 178618, 178386, 179116, 180151, 180578, 180663, 181202, 182072, 182458, 182109, 181429]
54393A81429p65p54k34Q34J641J608J133P66M58J24P4M19P23P01N70M13p3q25
54375A88242j234j071q61r99j208j212j127r12k40O88J048N63m8j48J6J56O61
54358A82314J777K795K846K033J082K91n08j246j538j222n46J03L93J71l53p29
54342A87663o86l02K68Q66J196R79L43l02q09j310j710j671j085j78P76J418J270
54325A86726L54l50M0R44R39j73r87m25R07J792J948J942K133K416K638K806L017
54308B06667L415M021M612N060N644O519P053O414M765L064J653l1k201m124n184
54293B47347n644n944n982n613n108m644l962l034k445k590k936k698j766o03
54279A94378L87R70R53M86J18J90M42M43J22m15j111j724j758j035o8M03J04o38
$$ y = [181429, 180664, 179910, 179676, 180510, 182151, 183759, 184892, 185658, 186116, 186240, 186314, 186733, 187456, 188157, 188727, 189140, 189067, 188242, 187008, 185937, 185076, 184077, 182869, 181657, 180530, 179618, 179378, 180066, 181114, 181677, 181629, 181481, 181497, 181653, 182314, 184091, 186886, 189732, 191765, 192847, 193138, 192630, 191384, 189846, 188624, 188078, 188181, 188574, 188745, 188392, 187663, 186977, 186675, 186943, 187809, 189005, 189984, 190327, 190025, 189216, 187906, 186196, 184525, 183440, 183262, 184038, 185456, 186726, 187080, 186730, 186770, 187714, 188653, 188480, 187493, 187068, 187975, 189767, 191715, 193657, 195790, 198206, 200844, 203650, 206667, 210082, 214103, 218715, 223775, 229419, 235938, 242991, 249405, 254170, 257234, 258887, 258856, 256655, 252531, 247347, 241703, 235759, 229777, 224164, 219056, 214412, 210450, 207416, 204971, 202381, 199445, 196747, 194981, 194378, 194765, 195735, 196688, 197174, 197292, 197482, 197924, 198367, 198489, 198074, 196963, 195239, 193481, 192446, 192378, 192781, 192885, 192247]
54261A92247j223j157m40L57O95O41M71K5q85j644j298R4J503K318K824L074K438
54244B00040P49r95j740j499r42n44n36r88j379q45N93J685J493N76M8R5J87K08
54226A96206M59Q41Q20J94p06j467j789j473o16K96P97Q13M52j36n93n05l3J10
54208A93670l28o86l63K70M13j22r11j542j767j457p86j94J97P13J388J691J394
54191A91580J100J296J473R23q1p07p47n82k80L86J123J197M57m61r93j184j282
54174A93218j371j530j829k020j616n49N77J063O98k18j155j540r86L58J718K212
54158A87030J630P00M58J224K307K840K700K317J842J071R7n32n54l58l51m84
54142B01937o75j148j934k406j898o85K18K01l08m71J8O77Q74N16N2j62k43m21
$$ y = [192247, 191024, 189867, 189427, 189784, 190479, 191120, 191591, 191616, 190731, 189087, 187789, 187883, 189386, 191704, 194528, 197602, 200040, 200789, 199794, 198054, 196555, 195613, 195069, 194533, 193545, 192166, 191321, 191914, 193599, 195092, 195668, 195716, 195811, 195998, 196206, 196665, 197506, 198326, 198520, 197814, 196347, 194558, 193085, 192469, 192765, 193562, 194375, 194827, 194691, 194098, 193593, 193560, 193670, 193342, 192656, 192293, 192563, 192976, 192854, 191943, 190401, 188634, 187177, 186391, 186197, 186394, 187107, 188495, 190186, 191580, 192680, 193976, 195449, 196372, 196291, 195584, 194837, 194255, 193975, 194361, 195484, 196681, 197138, 196677, 195684, 194500, 193218, 191847, 190317, 188488, 186468, 184852, 184303, 184880, 185943, 186641, 186423, 185268, 183728, 182742, 183100, 184818, 187030, 188660, 189360, 189818, 191042, 193349, 196189, 198889, 201206, 203048, 204119, 204216, 203684, 203130, 202772, 202421, 201937, 201262, 200114, 198180, 195774, 193876, 193191, 193409, 193610, 193302, 192831, 192849, 193526, 194400, 194916, 194968, 194806, 194563, 194142]
54124A94142n63l68J86Q61J441J663J237L92Q1Q77J943J868M88r53j435j081m24
54107B00355K77P17N28MmO64J109P15R3M7L95M70J55k40o14r01p63j21L97K87
54087B03570k0J44N06K48o34j197q15Q0O31N06M4j63K54J088J703J658J156P43
54069B09502P39J028J291J224P36N7m60o94p49o41k77K03M63L33m7m25n36j27
54051B11620O31J005N33j51k9R10J737J984K075K319K460K441K664L171L457L437
54035B40264L710M510N193N248M966M728M453M201M463N356O230O529O307N578
54021C11736M205K744K219K514K172O30o17j21J404K163J585L65r94k339l241
54006C24425l453l589m254m983n037m681m624m697m283l543k995k407j318l07
$$ y = [194142, 193579, 193211, 193397, 194258, 195699, 197362, 198599, 198991, 199072, 199949, 201892, 203760, 204248, 203295, 201860, 200779, 200355, 200632, 201349, 201877, 201881, 201877, 202541, 203650, 204365, 204458, 204505, 204900, 205370, 205525, 205285, 204671, 203770, 203007, 202886, 203283, 203570, 203550, 203694, 204200, 204448, 203814, 202617, 201802, 201882, 202513, 203019, 203063, 202900, 203154, 204242, 205945, 207603, 208759, 209502, 210241, 211269, 212560, 213784, 214520, 214577, 214117, 213423, 212674, 212033, 211756, 211959, 212422, 212755, 212708, 212283, 211747, 211620, 212251, 213256, 213789, 213638, 213609, 214519, 216256, 218240, 220315, 222634, 225094, 227535, 230199, 233370, 236827, 240264, 243974, 248484, 253677, 258925, 263891, 268619, 273072, 277273, 281736, 287092, 293322, 299851, 306158, 311736, 315941, 318685, 320904, 323418, 325590, 326220, 325603, 325482, 326886, 329049, 330634, 330999, 330005, 327666, 324425, 320972, 317383, 313129, 308146, 303109, 298428, 293804, 289107, 284824, 281281, 278286, 275879, 274561, 274254]
53992B74254l76j287j764j283m68J38O11R49R67R30J312K012K667L608N497Q155
53976B95922J0697J2814J4936J7325J9833K2272K3888K2764J7110P427l600j3320
53964D48068k0321k3886k3894k1565j8916j6877j4866j2395r993q188o732n347
53952B65088m262l455k355q46K30K33k64l43L4K84L01N70J421K633L723M392M698
53935B72082M929N215N366N252N131N272N461N277M627L649K420J199O07R21J556
53920C28964J906K235L037L952M285M192M326M699M956N393O460P535P628P168
53906C96736P441Q259P899N773L472K440K101J215k26j427k120k448k383k134
53892D24598k417l476m536n001n368o186o885o676n945n722o224o907p506p976
$$ y = [274254, 273878, 272591, 270827, 269544, 269076, 269214, 269825, 270774, 271741, 272671, 273983, 275995, 278662, 282270, 287767, 295922, 306619, 319433, 334369, 351694, 371527, 393799, 417687, 440451, 457561, 464988, 461388, 448068, 427747, 403861, 379967, 358402, 339486, 322609, 307743, 295348, 285355, 277167, 270435, 265088, 260826, 257371, 255016, 254170, 254400, 254633, 254369, 254026, 254060, 254344, 254645, 255215, 256636, 259269, 262992, 267384, 272082, 277011, 282226, 287592, 292844, 297975, 303247, 308708, 313985, 318612, 322261, 324681, 325880, 326487, 327408, 328964, 330870, 333105, 336142, 340094, 344379, 348571, 352897, 357596, 362552, 367945, 374405, 381940, 389568, 396736, 404177, 412436, 420335, 426108, 429580, 432020, 434121, 435336, 435110, 433683, 431563, 429115, 426732, 424598, 422181, 418705, 414169, 409168, 403800, 397614, 390729, 384053, 378108, 372386, 366162, 359255, 351749, 343773]
53878C43773p813o505m634l471l385l494l046k400k313k887l544l767l458k875
53864B90181k382k279k584k966k921k215j221p05j053j895k584k877k825k391
53850B59283j634j082j217j691j706j176p86q89j063r50p69p02n01j8M20N72O88
53833B46779R44J049P75M50M64O83P36N35J95k08m58j97N74J296J492J295J109
53816B57513J129J427K092K914L320L063K669K853L691M722N670O743Q243J0248
53802C16297J2631J5313J8429K2198K6591L1299L5997M0070M1678L7812K6561
53791F24876R610q141k1801k9262l1233k9690k6540k2977j9350j5660j2192r433
53779D08207p516o268n617n433n216m680m475n396o950p726p245o445o073n722
$$ y = [343773, 335960, 329455, 324821, 321350, 317965, 314471, 311425, 309025, 306712, 303825, 300281, 296514, 293056, 290181, 287799, 285520, 282936, 279970, 277049, 274834, 273613, 272908, 271855, 269960, 267376, 264499, 261674, 259283, 257649, 256567, 255350, 253659, 251953, 250777, 249991, 249102, 248039, 247089, 246320, 245618, 245117, 245099, 245519, 246091, 246779, 247723, 248772, 249547, 249997, 250461, 251144, 251880, 252415, 252610, 252402, 251944, 251747, 252321, 253617, 255109, 256404, 257513, 258642, 260069, 262161, 265075, 268395, 271458, 274127, 276980, 280671, 285393, 291063, 297806, 306049, 316297, 328928, 344241, 362670, 384868, 411459, 442758, 478755, 518825, 560503, 598315, 624876, 634486, 626345, 604544, 575282, 544049, 514359, 487819, 464842, 445492, 429832, 417640, 408207, 400691, 394423, 388806, 383373, 378157, 373477, 369002, 363606, 356656, 348930, 341685, 335240, 329167, 323445]
53765C23445m855l792l033k528k104j983k227k307j696m52J103K758M245N342
53751C11916O276P334Q061P723O632N775M967K770j152n022p135p836q368q907
53737C23034q911q396p682o533m818l297k672k434j770j014r27j193r03j43K53
53722B72594K57O14J428K070K412K952L607L571K549J174O0o86q87k43R57J869
53706B94298K110K053K004J868J697J787J999J795J199R98J599K378K572K326
53692C20683K363K928L487L415K658J760J281J239J225J085J082J227R18k77j806
53677C43268k668k596k141j803j566j248p88k49J49J04l15n04r7L80J64o98j419
53660C27973j477j004m03n2k45q26j111o97j07j08n85p59l60J55M08M45L30P2
$$ y = [323445, 318590, 314798, 311765, 309237, 307133, 305150, 302923, 300616, 298920, 298468, 299571, 302329, 306574, 311916, 318192, 325526, 333587, 341310, 347942, 353717, 358684, 361454, 360302, 355280, 348145, 340309, 331941, 323034, 314123, 305727, 298045, 291512, 286694, 283397, 280725, 278291, 276521, 275507, 274580, 273387, 272484, 272341, 272594, 272851, 273465, 274893, 276963, 279375, 282327, 285934, 289505, 292054, 293228, 293288, 292602, 291715, 291472, 292429, 294298, 296408, 298461, 300465, 302333, 304030, 305817, 307816, 309611, 310810, 311808, 313407, 315785, 318357, 320683, 323046, 325974, 329461, 332876, 335534, 337294, 338575, 339814, 341039, 342124, 343206, 344433, 345351, 345074, 343268, 340600, 338004, 335863, 334060, 332494, 331246, 330458, 330209, 330358, 330462, 330147, 329643, 329546, 329926, 330090, 329392, 327973, 326496, 325492, 325089, 325037, 324792, 323966, 322855, 322158, 322051, 321943, 321358, 320599, 320239, 320394, 320802, 321247, 321577, 321649]
53642C21649k7L89J120J562J477J116P18M07M70J048J664J679J267J265K014K944
53626C40762L342L010K268J732K031L110M014L972L454L447L929M011L438K905
53612C85425K824K804K618K684L245L896M313M621M783M427L716L485M059M641
53598D37541M424L604K784K063J337Q63Q38Q69N24n4o08j290k079k275j447m45
53582D46649m83j422j996j690j366j788k523k829k854l215l835m035l624l149
53568D11840k953k626j783q50m98o18n01%K30j86p01o80l07j11k9L71J033J483
53550D03114J598J624J572J287J056J328J824J732R91N66J114K153L024L836M846
53535D31665N628N702N537O027P158Q074Q373Q521Q950R508J0085J1089J2855
$$ y = [321649, 321622, 322011, 323131, 324693, 326170, 327286, 328004, 328411, 328881, 329929, 331593, 333272, 334539, 335804, 337818, 340762, 344104, 347114, 349382, 351114, 353145, 356255, 360269, 364241, 367695, 371142, 375071, 379082, 382520, 385425, 388249, 391053, 393671, 396355, 399600, 403496, 407809, 412430, 417213, 421640, 425356, 428841, 432900, 437541, 441965, 445569, 448353, 450416, 451753, 452616, 453454, 454323, 454847, 454793, 454185, 452895, 450816, 448541, 447094, 446649, 446166, 444744, 442748, 441058, 439692, 437904, 435381, 432552, 429698, 426483, 422648, 418613, 414989, 411840, 408887, 406261, 404478, 403628, 403130, 402512, 402011, 402011, 402241, 402055, 401354, 400674, 400367, 400256, 400227, 400598, 401631, 403114, 404712, 406336, 407908, 409195, 410251, 411579, 413403, 415135, 416126, 416692, 417806, 419959, 422983, 426819, 431665, 437293, 442995, 448532, 454559, 461717, 469791, 478164, 486685, 495635, 505143, 515228, 526317, 539172]
53522E39172J5090J7318J9496K1685K3418K4018K3481K2514K1555K0306J8463
53511G66516J6464J5118J4688J4778J5074J5680J6730J7984J9119K0104K1121
53500I53376K2197K3090K3441K3049K2101K1174K0807K0963K1083K0707J9901
53489A191889J9024J8373J8081J8161J8474J8816J9130J9427J9559J9305J8778
53478A399017J8365J8326J8607J9020J9150J8220J5729J2300R209O901M680K100
53466A561624k88k060l871o486r511j1978j3658j4914j5645j5441j4595j4036
53454A439141j4263j5080j6356j8154k0141k1558k2044k1933k1677k1432k1253
53443A225250k1210k1200k0948k0186j8640j6176j3252j0749q915o992m543k450
$$ y = [539172, 554262, 571580, 591076, 612761, 636179, 660197, 683678, 706192, 727747, 748053, 766516, 782980, 798098, 812786, 827564, 842638, 858318, 875048, 893032, 912151, 932255, 953376, 975573, 998663, 1022104, 1045153, 1067254, 1088428, 1109235, 1130198, 1151281, 1171988, 1191889, 1210913, 1229286, 1247367, 1265528, 1284002, 1302818, 1321948, 1341375, 1360934, 1380239, 1399017, 1417382, 1435708, 1454315, 1473335, 1492485, 1510705, 1526434, 1538734, 1547943, 1554844, 1559524, 1561624, 1561336, 1559276, 1555405, 1548919, 1539408, 1527430, 1513772, 1498858, 1483213, 1467772, 1453177, 1439141, 1424878, 1409798, 1393442, 1375288, 1355147, 1333589, 1311545, 1289612, 1267935, 1246503, 1225250, 1204040, 1182840, 1161892, 1141706, 1123066, 1106890, 1093638, 1082889, 1073974, 1066982, 1062439, 1059989]
53431A059989j681j574o03J401L120L807M138M785N399N548N613O160P216Q676
53417A111994J0707J3193J5412J6794J7565J8289J9253K0661K2766K5368K7669
53406A319671K9110K9944L0787L1984L3680L5942L8500M0812M2725M4644M6841
53395A724640M9118N1291N3426N5286N6255N6247N6112N6692N7860N8898N9363
53384B335188N9187N8348N6832N4707N2013M8902M5906M3496M1224L8059L3724
53373B867586K9011K4474J9806J4864J0393O878L541p23n981j1849j8665k6958
53361B912377l5953m3832m9549n3505n6377n8209n8903n8814n8393n7662n6416
53350B324764n4686n2697n0575m8275m5826m3556m2098m1960m2953m4159m4657
$$ y = [1059989, 1058308, 1056734, 1056131, 1057532, 1060652, 1064459, 1068597, 1073382, 1078781, 1084329, 1089942, 1096102, 1103318, 1111994, 1122701, 1135894, 1151306, 1168100, 1185665, 1203954, 1223207, 1243868, 1266634, 1292002, 1319671, 1348781, 1378725, 1409512, 1441496, 1475176, 1511118, 1549618, 1590430, 1633155, 1677799, 1724640, 1773758, 1825049, 1878475, 1933761, 1990016, 2046263, 2102375, 2159067, 2216927, 2275825, 2335188, 2394375, 2452723, 2509555, 2564262, 2616275, 2665177, 2711083, 2754579, 2795803, 2833862, 2867586, 2896597, 2921071, 2940877, 2955741, 2966134, 2973012, 2976553, 2975830, 2969849, 2958000, 2939335, 2912377, 2876424, 2832592, 2783043, 2729538, 2673161, 2614952, 2556049, 2497235, 2438842, 2381180, 2324764, 2270078, 2217381, 2166806, 2118531, 2072705, 2029149, 1987051, 1945091, 1902138, 1857979, 1813322]
53339A813322m4210m3053m1258l8665l5389l2075k9481k7806k6468k4623k1971
53328A448323j9035j6577j4879j3815j3349j3572j4306j5147j5869j6379j6350
53317A279045j5451j3981j2676j1746j0731r389q104p129o131m874l654k625j323
53304A171231N79K534L789M476N380O920Q883J1040J3355J5715J7804J9460K0839
53291A302005K2292K4058K6041K7816K9037K9764L0067K9579K7967K5761K3906
53280A598293K2506K0837J8690J6668J4870J2461R115N797L218N54l180p307j0341
53267A702181j2104j3699j5678j7559j9101k0726k2565k4134k5291k6505k7958
53256A476861k9145k9733l0033l0248k9982k8961k7764k7218k7361k7394k6679
$$ y = [1813322, 1769112, 1726059, 1684801, 1646136, 1610747, 1578672, 1549191, 1521385, 1494917, 1470294, 1448323, 1429288, 1412711, 1397832, 1384017, 1370668, 1357096, 1342790, 1327643, 1311774, 1295395, 1279045, 1263594, 1249613, 1236937, 1225191, 1214460, 1205071, 1196967, 1189838, 1183707, 1178833, 1175179, 1172554, 1171231, 1171810, 1174344, 1178133, 1182609, 1187989, 1194909, 1203792, 1214832, 1228187, 1243902, 1261706, 1281166, 1302005, 1324297, 1348355, 1374396, 1402212, 1431249, 1461013, 1491080, 1520659, 1548626, 1574387, 1598293, 1620799, 1641636, 1660326, 1676994, 1691864, 1704325, 1713440, 1719237, 1722455, 1723009, 1719829, 1712522, 1702181, 1690077, 1676378, 1660700, 1643141, 1624040, 1603314, 1580749, 1556615, 1531324, 1504819, 1476861, 1447716, 1417983, 1387950, 1357702, 1327720, 1298759, 1270995, 1243777, 1216416, 1189022, 1162343]
53245A162343k5473k4705k5018k6030k6672k6316k5307k4242k3176k1943k0815
53234H92646k0191j9848j9126j7832j6332j4902j3481j2099j0921r865q759p866
53222G21424p738q442r515j0695j2153j3801j5022j5369j5144j4916j4818j4552
53210E69259j3891j2867j1640j0379r231q325p825p805p974p710o803n940o050
53197D52819p165q361q837q675q392q196p861p110n972m814m082l822l639l286
53183C62607l137l588m236m150l106j965j601j848j879j377q54q84j320j507j075
53168C30080l62R3K40M51Q75J197J090N97p5p46j106p97oM56L8q26j258r52k58
53149C28731M76J082J355J144O63K54l7l26n10m32k49k24k49j00K6k26o88q40
$$ y = [1162343, 1136870, 1112165, 1087147, 1061117, 1034445, 1008129, 982822, 958580, 935404, 913461, 892646, 872455, 852607, 833481, 815649, 799317, 784415, 770934, 758835, 747914, 738049, 729290, 721424, 713686, 705244, 695729, 685034, 672881, 659080, 644058, 628689, 613545, 598629, 583811, 569259, 555368, 542501, 530861, 520482, 511251, 502926, 495101, 487296, 479322, 471612, 464809, 458869, 452819, 445654, 437293, 428456, 419781, 411389, 403193, 395332, 388222, 382250, 377436, 373354, 369532, 365893, 362607, 359470, 355882, 351646, 347496, 344390, 342425, 340824, 338976, 337097, 335720, 334866, 333982, 332662, 331155, 330080, 329718, 329811, 330051, 330502, 331377, 332574, 333664, 334261, 334186, 333440, 332334, 331537, 331531, 331987, 332025, 331199, 329941, 328989, 328731, 329207, 330289, 331644, 332788, 333451, 333705, 333668, 333342, 332832, 332400, 332151, 331927, 331678, 331578, 331604, 331378, 330690, 329850]
53131C29850o39n73q21r95r04r62j512k124k018j026J97Q64P98M16J10k59j005
53114C19397j894k184j608q48p06j077j235r02n08m72p40j077j398j763k164k433
53098B98388k232j351j33P05Q37N76K41k32p58q37l56nk37m34J04Q41P82J15q4
53079B95930L40M09l44j185j475j509j612j375m33O46J022O62K79M35J096J774
53063B94660J902J275L25l16n40o49o34j64O27J054Q13M27M57P98J035J080J099
53046C03249J204J419J697J771J382P52M11N10O87O33L37k33j053j616j282k30
53030C09638O11P66O91Q05Q15M03j65n49q43j139j224j160j507k377k864k147
53014B99754o97L01M50L54N54R55J233J262J069P27L53m2n85j265j743j611q33
$$ y = [329850, 329211, 328638, 327817, 326822, 325918, 324956, 323444, 321320, 319302, 318276, 318473, 319337, 320135, 320551, 320661, 320402, 319397, 317503, 315319, 313711, 312863, 312157, 311080, 309845, 308943, 308435, 307963, 307223, 306146, 304748, 302985, 300821, 298388, 296156, 294805, 294672, 295377, 296214, 296790, 297031, 296799, 296041, 295204, 294848, 294843, 294606, 294172, 294276, 295117, 295899, 296014, 295930, 296270, 296679, 296335, 295150, 293675, 292166, 290554, 289179, 288746, 289392, 290414, 291076, 291355, 291790, 292886, 294660, 296562, 297837, 298162, 297846, 297306, 296657, 296023, 295859, 296486, 297540, 298353, 298780, 299237, 300035, 301070, 302150, 303249, 304453, 305872, 307569, 309340, 310722, 311474, 311885, 312395, 313082, 313715, 314052, 313819, 312766, 311150, 309868, 309638, 310249, 311015, 311706, 312511, 313326, 313729, 313564, 313015, 312172, 311033, 309809, 308649, 307142, 304765, 301901, 299754, 299057, 299358, 299808, 300162, 300716, 301671, 302904, 304166, 305235, 305962, 306315, 306273, 305688, 304423, 302680, 301069, 300236]
52997C00236J85P50L02r51j887j493j64P47P39P29J504K458K528J692P29L8m73
52980C07669o16j6J074J765J505N69l92r35r93p47m06J10J017K084K593K253J707
52963C18241J641J739J225K09k99K92J477K368K580K160J219l6j210j930k101
52948C27575j862j432j080j033j299j544j354o53J32L80j33r80j569j716j696
52933C11736j761j952k116j953j194j27L30l51j427j694j094o36q06r84o57j69
52917B95145J36N24J001Q43k05j069p02L77Q84N97L04L10J61k46m47l52m73r68
52899B95820j244q27J2O95R34P35K18l50p18q18o41q6P34J294J238R44R30J015
52881B99885P05J55J2L46N85M41J50k21q87j612j713j000p5N02O98M93k95j351
$$ y = [300236, 300421, 301171, 301473, 300522, 298635, 297142, 296978, 297725, 298464, 299193, 300697, 303155, 305683, 307375, 308104, 308142, 307669, 307053, 307037, 308111, 309876, 311381, 311950, 311558, 310623, 309630, 308883, 308477, 308587, 309604, 311688, 314281, 316534, 318241, 319882, 321621, 322846, 323055, 322756, 323048, 324525, 326893, 329473, 331633, 332852, 332816, 331606, 329676, 327575, 325713, 324281, 323201, 322168, 320869, 319325, 317971, 317318, 317450, 317830, 317697, 316717, 315148, 313432, 311736, 309975, 308023, 305907, 303954, 302760, 302633, 302963, 302612, 301185, 299491, 298397, 297761, 296955, 295971, 295314, 295145, 295281, 295805, 296806, 297649, 297444, 296375, 295673, 296050, 296934, 297531, 297835, 298145, 298306, 298060, 297613, 297261, 296788, 295820, 294576, 293749, 293761, 294456, 295390, 296125, 296343, 295993, 295275, 294457, 293816, 293730, 294464, 295758, 296996, 297940, 298870, 299885, 300590, 300745, 300757, 301103, 301688, 302129, 302279, 302058, 301171, 299559, 297846, 296846, 296771, 297273, 297971, 298464, 298169, 296818]
52863B96818j785j198j92N53J090J660J995J833J647K082K943L347K835J785Q38
52848C16251L07N0m05j502l069m217m237l499l095l630m603n030m393l001j639
52833B74288q63n21n6O37R47M06m77o93L8R96J411J210P58K84p3q5K53M42j4q48
52813B78040j225q18k30j29l33j74N18J263J703K033K563L339M281N266N818N136
52797C07051K891j70k835m467n178n218m690l858l167k768k367j685q89l08J6
52782B72358L01O04P02L74k94r69j302j112m08O02J480J770J412Q95P71J076J371
52765B79631J303Q89K95k54l99J11R35J273Q11J04j31J10L53L75L13K36M1k94
52747B85702o44r05r94q33m53m1L75R82J734K119J714P85m0n11q14j074j172r49
$$ y = [296818, 295033, 293835, 293643, 294196, 295286, 296946, 298941, 300774, 302421, 304503, 307446, 310793, 313628, 315413, 316251, 316558, 316608, 316203, 314701, 311632, 307415, 303178, 299679, 296584, 292954, 288351, 283321, 278928, 275927, 274288, 273425, 272904, 272848, 273485, 274432, 274838, 274361, 273668, 273706, 274702, 276113, 277323, 278081, 278365, 278292, 278207, 278460, 278902, 278888, 278040, 276815, 275997, 275767, 275638, 275305, 275131, 275649, 276912, 278615, 280648, 283211, 286550, 290831, 296097, 301915, 307051, 309942, 309772, 306937, 302470, 297292, 292074, 287384, 283526, 280359, 277591, 275224, 273539, 272650, 272342, 272358, 272659, 273263, 273965, 274339, 274045, 273076, 271774, 270662, 270254, 270856, 272336, 274106, 275518, 276413, 277184, 278260, 279631, 280934, 281823, 282118, 281864, 281465, 281576, 282511, 283784, 284595, 284699, 284568, 284678, 285031, 285406, 285719, 285955, 285996, 285702, 285058, 284153, 283159, 282326, 281873, 281832, 282207, 283189, 284923, 287042, 288756, 289541, 289501, 288990, 288176, 287102, 285930, 284981]
52729B84981l62M22R29P01L2q5Q06J826J871J087N03M05P4q52j683j678r56j32
52711B87889L97M69K0n92o61P6J003J369J154Q49O75M31l4n72r62j102r98p21
52693B88690m17k26j61r9J19N06Q35Q97Q64J050J257Q14l52j165n92R05J890J767
52675B96582J247J027R64P76O79Q57R91R00R80J500J946J748J184R17Q86M57m91
52658C13150j304j457j166r21q69p92m32K62J086J675J879J931K067K076J528
52643C18713M29o30j126j200j441k108k758k652j614l47K32q4o57p40j44Q59J915
52626C06647K723L102L221L589M439N232N053L550J268r49k567l443l575l111
52612C25179k429j884j446q70k22K1l17o35k53N50Q46M68M19J455K904L521L092
$$ y = [284981, 284619, 285041, 285970, 286671, 286703, 286618, 287424, 289250, 291121, 292208, 292711, 293116, 293190, 292338, 290655, 288977, 288021, 287889, 288286, 288755, 288775, 288183, 287522, 287598, 288601, 289970, 291124, 291973, 292648, 293079, 293045, 292473, 291511, 290409, 289411, 288690, 288273, 288047, 287886, 287787, 287906, 288412, 289247, 290144, 291008, 292058, 293315, 294129, 293777, 292612, 292020, 292925, 294815, 296582, 297829, 298856, 299820, 300596, 301275, 302132, 303123, 304023, 305003, 306503, 308449, 310197, 311381, 312298, 313184, 313641, 313150, 311846, 310389, 309223, 308302, 307433, 306641, 306209, 306471, 307557, 309232, 311111, 313042, 315109, 317185, 318713, 319142, 318512, 317386, 316186, 314745, 312637, 309879, 307227, 305613, 305266, 305498, 305414, 304757, 304017, 303873, 304732, 306647, 309370, 312472, 315693, 319282, 323721, 328953, 334006, 337556, 338824, 337875, 335308, 331865, 328290, 325179, 322750, 320866, 319420, 318550, 318328, 318349, 318032, 317397, 317144, 317694, 318540, 319008, 319427, 320882, 323786, 327307, 330399]
52595C30399K476K304K403K429K256J743Q35m9m77q36j851l141l301j895l17K5
52579C33003m57m42L17J045J461J969K463K150Q75l85p71n68n55r12j240j266
52563C36687j035p04m54m28n30m51j16J75J88M5j39n42j176j527j176n78n78j143
52545C26518j224k19J076J433P53Lk16l10o90r14l56O43J020L71n31p32j99M14
52527C26840O84P36P56O85M30J49J47N86J334K068K421K202J575J043J038J481
52511C44175J815J650J233J139J553K189K837L525M025L724K325L37j476k860
52497C66191l871m352m206l882l875l847l100j796r11p80o94j83J87p9m33j66
52481C34203L64L51j07k35P1K04L4J66P57J101P31K25L08Q14J104J135J392J978
$$ y = [330399, 332875, 335179, 337582, 340011, 342267, 344010, 344845, 344796, 344319, 343483, 341632, 338491, 335190, 333295, 332978, 333003, 332546, 332104, 332421, 333466, 334927, 336896, 339359, 341509, 342384, 341999, 341228, 340660, 340105, 339193, 337953, 336687, 335652, 334948, 334494, 334066, 333536, 333085, 332969, 333144, 333332, 333377, 333238, 332696, 331520, 329993, 328817, 328239, 327661, 326518, 325294, 325075, 326151, 327584, 328337, 328340, 328124, 327814, 327124, 326210, 325854, 326497, 327517, 327888, 327357, 326625, 326426, 326840, 327524, 328260, 329016, 329701, 330131, 330280, 330427, 331013, 332347, 334415, 336836, 339038, 340613, 341656, 342694, 344175, 345990, 347640, 348873, 350012, 351565, 353754, 356591, 360116, 364141, 367865, 370190, 370527, 369051, 366191, 362320, 357968, 353762, 349880, 346005, 342158, 339058, 337262, 336351, 335571, 334877, 334694, 334881, 334802, 334369, 334203, 334567, 334918, 334811, 334576, 334647, 334851, 334885, 335051, 335808, 336909, 337640, 337865, 338173, 338987, 340091, 341226, 342618, 344596]
52463C44596K446K546K594K914L338L530L487L384L058J999M3k153l604l973l842
52448C60363l943m272m205l426k385j745j527j148l11M07J41j166k480k710j854
52433C29739r31p52j031q85oR02R61J23p94j030n69N8M67N76L59k15q66j014l75
52414C24717O22J302J465J440J595K002K541K996L229L489M377O117Q065R446
52400C73403J0482J2066J4283J5933J5750J3460R318L484l366r423j2841j3473
52388D29076j2765j1919j0853r166p175n485m069k512r29K8P5l38o07n32j17P29
52372C63441J963L182M041M708N495O161O106N331M643M560M472L375J189j144
52358D17523k727l345l103k093o31N48Q06J90o10q33j53J131K295K710K402K013
$$ y = [344596, 347042, 349588, 352182, 355096, 358434, 361964, 365451, 368835, 371893, 373892, 373935, 371782, 368178, 364205, 360363, 356420, 352148, 347943, 344517, 342132, 340387, 338860, 337712, 337401, 337808, 337949, 336783, 334303, 331593, 329739, 328808, 328056, 327025, 326140, 326134, 327036, 327997, 328120, 327326, 326296, 325727, 325785, 326252, 326828, 327187, 326972, 326106, 325092, 324717, 325339, 326641, 328106, 329546, 331141, 333143, 335684, 338680, 341909, 345398, 349775, 355892, 363957, 373403, 383885, 395951, 410234, 426167, 441917, 455377, 464695, 468179, 464813, 455390, 442549, 429076, 416311, 404392, 393539, 384373, 377198, 371713, 367644, 365132, 364203, 364231, 364306, 363968, 363361, 362829, 362712, 363441, 365404, 368586, 372627, 377335, 382830, 388991, 395097, 400428, 405071, 409631, 414103, 417478, 418667, 417523, 414796, 411451, 408348, 406255, 405624, 406172, 406978, 407168, 406558, 405725, 405572, 406703, 408998, 411708, 414110, 416123]
52342D16123K125K682L091K885K242J850K186K958L527L851M582N985P290P674
52328D69051P583Q199R798J1451J2480J3271J4319J5316J5789J6056J6714J7561
52316F27588J7810J7228J6387J5813J5444J5101J4988J5480J6692J8385K0133
52305H11049K1512K2291K2537K2479K2279K2012K1794K1672K1432K0696J9335
52294A049088J7678J6138J4704J2879J0234O906L438K34k610m993o713p802q545
52281A100636q944q598p558o749o918p478p267o236n431n200m535k628j11J807
52267A024790K853L625M586N821P421R438J1537J3323J4778J6020J6770J6652
52255A147614J5923J5401J5613J6321J6907J7018J6797J6626J6598J6193J4688
$$ y = [416123, 418248, 420930, 424021, 426906, 429148, 430998, 433184, 436142, 439669, 443520, 448102, 454087, 461377, 469051, 476634, 484833, 494631, 506082, 518562, 531833, 546152, 561468, 577257, 593313, 610027, 627588, 645398, 662626, 679013, 694826, 710270, 725371, 740359, 755839, 772531, 790916, 811049, 832561, 854852, 877389, 899868, 922147, 944159, 965953, 987625, 1009057, 1029753, 1049088, 1066766, 1082904, 1097608, 1110487, 1120721, 1127627, 1131065, 1131299, 1128689, 1123696, 1116983, 1109181, 1100636, 1091692, 1083094, 1075536, 1068787, 1061869, 1054391, 1047124, 1040888, 1035457, 1030257, 1025722, 1023094, 1022983, 1024790, 1027643, 1031268, 1035854, 1041675, 1049096, 1058534, 1070071, 1083394, 1098172, 1114192, 1130962, 1147614, 1163537, 1178938, 1194551, 1210872, 1227779, 1244797, 1261594, 1278220, 1294818, 1311011, 1325699]
52244A325699J1930Q472M961J762q53k649l823m909o056o923p455q146r135r778
52230A293097r633r302r618j0469j1085j1120j0814j0423j0148j0205j0379r925
52218A169976q580p225o733o615n834m545l823l782l246j533N75K033K843L616
52204A127127M655N946P447Q839R399Q647O924N082L807L306L330L406L388L766
52190A205069M934O238O507N661M953N238N759N282L798K262J038m73k656m937
52176A248673o520p396q172r165j0050j0441j0503j0688j1009j0872r706p562
52164A136589n017k695r97J5P34J823L579N609P304Q387Q779Q232O553L996J126
52149A184017j524l371l788k712j030K43J049J979L124L911M035L881L805L609
$$ y = [1325699, 1337629, 1346101, 1351062, 1352824, 1351971, 1349322, 1345499, 1340590, 1334534, 1327611, 1320156, 1312010, 1302875, 1293097, 1283464, 1274162, 1264544, 1254075, 1242990, 1231870, 1221056, 1210633, 1200485, 1190280, 1179901, 1169976, 1161396, 1154171, 1147438, 1140823, 1134989, 1130444, 1126621, 1122839, 1119593, 1118060, 1118635, 1120668, 1123511, 1127127, 1131782, 1137728, 1145175, 1154014, 1163413, 1172060, 1178984, 1184066, 1187873, 1191179, 1194509, 1197915, 1201303, 1205069, 1210003, 1216241, 1222748, 1228409, 1233362, 1238600, 1244359, 1249641, 1253439, 1255701, 1256739, 1256266, 1253610, 1248673, 1242153, 1234757, 1226585, 1217420, 1207370, 1196929, 1186426, 1175738, 1164729, 1153857, 1144151, 1136589, 1131572, 1128877, 1127880, 1127895, 1128629, 1130452, 1134031, 1139640, 1146944, 1155331, 1164110, 1172342, 1178895, 1182891, 1184017, 1182493, 1179122, 1175334, 1172622, 1171592, 1171835, 1172884, 1174863, 1177987, 1181898, 1185933, 1189814, 1193619, 1197228]
52135A197228K888J498l88k259l394l391k629j726o38J178L755O464Q947J1540
52121A219073J4580J7824K0797K3270K5260K6889K8370K9766L0792L1214L1250
52110A499085L1058L0089K7741K4595K1992K0335J8723J6579J4658J3887J4077
52099A732819J4408J4609J4951J5470J5832J5743J5044J3697J1932J0067P918
$$ y = [1197228, 1200116, 1201614, 1201226, 1198967, 1195573, 1192182, 1189553, 1187827, 1187189, 1188367, 1192122, 1198586, 1207533, 1219073, 1233653, 1251477, 1272274, 1295544, 1320804, 1347693, 1376063, 1405829, 1436621, 1467835, 1499085, 1530143, 1560232, 1587973, 1612568, 1634560, 1654895, 1673618, 1690197, 1704855, 1718742, 1732819, 1747227, 1761836, 1776787, 1792257, 1808089, 1823832, 1838876, 1852573, 1864505, 1874572, 1882490]
$$ [...]
##END NTUPLES=NMR SPECTRUM
##END=
