##TITLE=AC1562_ROEFFECT0018_8270840_BbXPOyvG72
##JCAMPDX= 6.0         $$ Bruker NMR JCAMP-DX V2.0
##DATA TYPE= NMR SPECTRUM
##DATA CLASS= NTUPLES
##ORIGIN= BRUKER
##OWNER= Administrator
$$ 1.72 TOPSPIN		Version 2.1
$$ 2013-10-18 16:29:13.737 -0700  Administrator@X
$$ Compression mode = diff/dup
##.OBSERVE FREQUENCY= 400.02188249412
##.OBSERVE NUCLEUS= ^1H
##.ACQUISITION MODE= SIMULTANEOUS (DQD)
##.ACQUISITION SCHEME= undefined
##.AVERAGES= 8
##.DIGITISER RES= 22
##SPECTROMETER/DATA SYSTEM= spect
##.PULSE SEQUENCE= zg30
##.SOLVENT NAME= COFFEE_meoh
##.SHIFT REFERENCE= INTERNAL, COFFEE_meoh, 1, 14.98509
##AUDIT TRAIL= $$ (NUMBER, WHEN, WHO, WHERE, PROCESS, VERSION, WHAT)
$$ ##TITLE= Audit trail, TOPSPIN		Version 2.1
$$ ##JCAMPDX= 5.01
$$ ##ORIGIN= Bruker BioSpin GmbH
$$ ##OWNER= Administrator
$$ $$ E:\/data/COFFEE/nmr/AC1562_ROEFFECT0018_8270840_BbXPOyvG72/10/pdata/1/auditp.txt
$$ ##AUDIT TRAIL=  $$ (NUMBER, WHEN, WHO, WHERE, PROCESS, VERSION, WHAT)
(   1,<2013-10-18 16:29:07.253 -0700>,<Administrator>,<X>,<go>,<TOPSPIN 2.1>,
      <created by zg
	started at 2013-10-18 16:28:01.221 -0700,
	POWCHK enabled, PULCHK disabled,
       configuration hash MD5:
       C8 4E 4E 5D D3 5C D8 9E 9F 52 82 E0 59 8A DE 15
       data hash MD5: 64K
       BA 43 6B 09 F3 C5 0F 6E 6C FB E7 4C 36 BE DC 21>)
(   2,<2013-10-18 16:29:10.159 -0700>,<Administrator>,<X>,<proc1d>,<TOPSPIN 2.1>,
      <Start of raw data processing
       efp LB = 0 FT_mod = 6 PKNL = 1 PHC0 = 0 PHC1 = 0 SI = 32K 
       data hash MD5: 32K
       AC BB B0 82 74 62 AC AA 4D 94 9D 0D 26 AC AB 47>)
(   3,<2013-10-18 16:29:10.550 -0700>,<Administrator>,<X>,<proc1d>,<TOPSPIN 2.1>,
      <pk PHC0 = 95.67993 PHC1 = 0 
       data hash MD5: 32K
       35 C4 A6 46 69 5A E3 56 9F 12 1B F8 6B 72 64 DE>)
(   4,<2013-10-18 16:29:10.643 -0700>,<Administrator>,<X>,<proc1d>,<TOPSPIN 2.1>,
      <abs ABSG = 1 
       data hash MD5: 32K
       3F F0 7C 39 8F CB B1 9A 47 87 E8 F5 99 9B 20 05>)
(   5,<2013-10-18 16:29:10.690 -0700>,<Administrator>,<X>,<proc1d>,<TOPSPIN 2.1>,
      <abs ABSG = 2 
       data hash MD5: 32K
       62 3F 1C 28 F7 5B 1E 3E AC C1 AA 2B BA 65 64 76>)
(   6,<2013-10-18 16:29:10.737 -0700>,<Administrator>,<X>,<proc1d>,<TOPSPIN 2.1>,
      <abs ABSG = 3 
       data hash MD5: 32K
       87 60 CD 09 34 AB F8 34 57 9D 99 1F 39 A9 A8 BD>)
(   7,<2013-10-18 16:29:10.784 -0700>,<Administrator>,<X>,<proc1d>,<TOPSPIN 2.1>,
      <abs ABSG = 4 
       data hash MD5: 32K
       C2 77 93 93 C1 58 DF BA 4A 0B BB 50 AD 32 BE F5>)
(   8,<2013-10-18 16:29:10.831 -0700>,<Administrator>,<X>,<proc1d>,<TOPSPIN 2.1>,
      <abs ABSG = 5 
       data hash MD5: 32K
       33 5A 59 22 FC 70 2D E8 90 81 6A 47 FD 46 97 0B>)
$$ ##END=
$$ 
$$ $$ hash MD5
$$ $$ 9B D9 B4 7D C3 93 A7 D4 E5 2F 0A DC 9C 40 A1 37
##$RELAX= 
##$RELAX= 
##$RELAX= 
##$RELAX= 
##$RELAX= 
##$RELAX= 
##$RELAX= 
$$ Bruker specific parameters
$$ --------------------------
##$DU= <E:\>
##$EXPNO= 10
$$ [...]
150 150 150 150 150 150 150 150
##$TP07= 0
##$TPNAME0= <>
##$TPNAME1= <>
##$TPNAME2= <>
##$TPNAME3= <>
##$TPNAME4= <>
##$TPNAME5= <>
##$TPNAME6= <>
##$TPNAME7= <>
##$TPOAL= (0..7)
0.5 0.5 0.5 0.5 0.5 0.5 0.5 0.5
##$TPOFFS= (0..7)
0 0 0 0 0 0 0 0
##$TUNHIN= 0
##$TUNHOUT= 0
##$TUNXOUT= 0
##$USERA1= <user>
##$USERA2= <user>
##$USERA3= <user>
##$USERA4= <user>
##$USERA5= <user>
##$V9= 5
##$VALIST= <valist>
##$VCLIST= <CCCCCCCCCCCCCCC>
##$VD= 0
##$VDLIST= <DDDDDDDDDDDDDDD>
##$VPLIST= <PPPPPPPPPPPPPPP>
##$VTLIST= <TTTTTTTTTTTTTTT>
##$WBST= 1024
##$WBSW= 4
##$XGAIN= (0..3)
0 0 0 0
##$XL= 0
##$YL= 0
##$YMAX_a= 639731
##$YMIN_a= -543743
##$ZGOPTNS= <>
##$ZL1= 120
##$ZL2= 120
##$ZL3= 120
##$ZL4= 120
##$ABSF1= 14.98509
##$ABSF2= -5.573092
##$ABSG= 5
##$ABSL= 3
##$ALPHA= 0
##$AQORDER= 0
##$ASSFAC= 0
##$ASSFACI= 0
##$ASSFACX= 0
##$ASSWID= 0
##$AUNMP= <proc_prof1d_extract_pilot.lims>
##$AXLEFT= 0
##$AXNAME= <>
##$AXNUC= <1H>
##$AXRIGHT= 0
##$AXTYPE= 0
##$AXUNIT= <>
##$AZFE= 0.1
##$AZFW= 0.1
##$BCFW= 0
##$BC_mod= 0
##$BYTORDP= 0
##$COROFFS= 0
##$CY= 15
##$DATMOD= 1
##$DC= 0
##$DFILT= <>
##$DTYPP= 0
##$F1P= 0
##$F2P= 0
##$FCOR= 0.5
##$FTSIZE= 32768
##$FT_mod= 6
##$GAMMA= 0
##$GB= 0
##$INTBC= 1
##$INTSCL= 1
##$ISEN= 128
##$LB= 0
##$LEV0= 0
##$LPBIN= 0
##$MAXI= 10000
##$MC2= 0
##$MEAN= 0
##$ME_mod= 0
##$MI= 0
##$NCOEF= 0
##$NC_proc= -8
##$NLEV= 6
##$NOISF1= 0
##$NOISF2= 0
##$NSP= 0
##$NTH_PI= 0
##$NZP= 0
##$OFFSET= 14.98509
##$PC= 1
##$PHC0= 95.67993
##$PHC1= 0
##$PH_mod= 1
##$PKNL= yes
##$PPARMOD= 0
##$PPDIAG= 0
##$PPIPTYP= 0
##$PPMPNUM= 2147483647
##$PPRESOL= 1
##$PSCAL= 4
##$PSIGN= 0
##$PYNMP= <proc.py>
##$REVERSE= no
##$SF= 400.02
##$SI= 32768
##$SIGF1= 0
##$SIGF2= 0
##$SINO= 400
##$SIOLD= 32768
##$SPECTYP= <>
##$SREGLST= <1H.CDCl3>
##$SSB= 0
##$STSI= 32768
##$STSR= 0
##$SW_p= 8223.68421052631
##$SYMM= 0
##$S_DEV= 0
##$TDeff= 65536
##$TDoff= 0
##$TI= <>
##$TILT= no
##$TM1= 0
##$TM2= 0
##$TOPLEV= 0
##$USERP1= <user>
##$USERP2= <user>
##$USERP3= <user>
##$USERP4= <user>
##$USERP5= <user>
##$WDW= 1
##$XDIM= 32768
##$YMAX_p= 457929883
##$YMIN_p= -949799
##$CURPLOT= <Network HP LaserJet P1505>
##$CURPRIN= <$Network HP LaserJet P1505>
##$DFORMAT= <normdp>
##$LAYOUT= <+/1D_H.xwp>
##$LFORMAT= <normlp>
##$PFORMAT= <normpl>
##$SURQMSG= 1
$$ End of Bruker specific parameters
$$ ---------------------------------
##NTUPLES= NMR SPECTRUM
##VAR_NAME=  FREQUENCY,     SPECTRUM/REAL,   SPECTRUM/IMAG
##SYMBOL=    X,             R,               I
##VAR_TYPE=  INDEPENDENT,   DEPENDENT,       DEPENDENT
##VAR_FORM=  AFFN,          ASDF,            ASDF
##VAR_DIM=   32768,         32768,           32768
##UNITS=     HZ,            ARBITRARY UNITS, ARBITRARY UNITS
##FACTOR=    0.250966925370066, 1,           1
##FIRST=     8223.43324360094, 88642,        -93048
##LAST=      0,             -32481,          -142111
##MIN=       0,             -949799,         0
##MAX=       8223.43324360094, 457929883,    0
$$ Real data points
##PAGE= N=1
##DATA TABLE= (X++(R..R)), XYDATA
$$ [...]
$$ plain form
19549 156756 10756 -137882 -5781 24016 -60375 88337 -76449 -28156 -123754 55569 -180986
19537 37800 -102164 -119121 36804 -131617 -12424 219458 -49815 -223104 -169966 30186 -159948
19525 -107027 -180686 -75304 -196987 331792 -336416 -54124 -190427 72581 -58603 121526
19514 -490247 -193721 -116951 -282454 32031 3039 55038 -221698 -339953 -74660 -134777 -21507
19502 -28983 -226263 89234 196215 -124539 -15015 81370 -279076 -70090 44615 173229 -1720
19490 96861 -232172 203834 -175851 -281910 -71767 246232 262494 45184 80594 163423 -121649
19478 25944 -242400 -212624 -482346 -89716 -75274 -185247 -125343 53962 -171352 -91564 -381212
19467 -381212 -132061 -104490 153437 67325 46326 -226451 -154714 -144564 -319576 17932 -78052
$$ packed form
19549A56756A0756a37882e781B4016f0375H8337g6449b8156r5598E5569a80986
19537C7800a02164j6957C6804a31617a2424B19458d9815j73289N3138C0186a59948
19525a07027p3659g5304j21683C31792c36416e4124j36303G2581e8603A21526
19514d90247a93721P6770j65503C2031C039N1999b21698j18255g4660o0117b1507
19502b8983j97280H9234J06981a24539a5015H1370b79076g0090D4615J28614a720
19490I6861b32172B03834a75851j06059g1767B46232J6262D5184L5410Q2829a21649
19478B5944b42400K9776k69722h9716J4442j09973N9904E3962a71352P9788k89648
19467c81212a32061K7571A53437F7325k0999b26451P1737J0150j75012A7932g8052
$$ plain form
19455 187193 135883 -156984 -67378 128720 165989 113495 140314 221490 -224613 -104032 -170878
19444 -170878 -176894 -148615 -197412 65994 12584 -128205 -77736 24754 -178905 30161 -80466
19432 -30933 -147992 -68870 161269 155073 -79464 151837 75979 128521 -299676 61251 250667
19421 250667 135403 137854 -99053 -15529 -140703 -72106 -123794 -98960 -65413 44155 -266897
19409 -39891 -136551 -68521 17092 -234977 -356982 -138763 74360 -258041 220024 41161 -103474
19397 -5146 -365374 108672 -129305 192231 -78695 -395706 -165235 326052 -12328 -192419
19387 -192419 -54726 48277 -134612 -251194 -45992 -233898 -89473 -50471 -152735 62654 -45783
19375 294335 73033 -179258 367903 97830 -50538 5393 182268 -186850 -107261 20421 145778
$$ packed form
19455A87193n1310a56984f7378A28720L7269n2494K6819Q1176b24613a04032o6846
19444a70878o016K8279m8797F5994A2584a28205N0469B4754a78905C0161h0466
19432c0933j17059f8870A61269o196g9464A51837p5858N2542b99676F1251J89416
19421B50667j15264K451i9053a5529j25174O8597n1688K4834L3547D4155b66897
19409c9891r6660O8030A7092b34977j22005a38763G4360b58041B20024D1161a03474
19397e146l60228A08672a29305A92231g8695l17011a65235C26052a2328j80091
19387a92419e4726D8277a34612j16582d5992j87906h9473L9002j02264F2654d5783
19375B94335G3033a79258C67903I7830e0538E393J76875a86850P9589B0421J25357
$$ plain form
19364 145778 115452 -439808 -40390 157040 -119548 161059 -75173 149053 68053 34907
19354 34907 -16920 95149 236720 -141597 11304 -268086 -65814 99303 -300327 -24490 -399187
19343 -399187 295817 -88023 86819 -13277 25838 -2045 116545 -10566 -548244 244492 155782
19332 155782 -62776 48089 -87225 -3408 -143588 127313 323117 -392252 -181283 -95225 -62729
19321 -62729 -90422 73543 -235215 -262681 -376925 43783 -151445 -246512 148298 -102971 131765
19309 -129777 -18641 89261 -240859 10737 -77313 -143426 -202008 -280996 171217 -104020 -39342
19297 11206 -102434 -363507 -66141 444454 129540 36604 119926 3700 130089 4485 43725
19286 43725 -41152 115285 -175574 -56090 295280 389 -125264 170665 74961 -1138 188063
$$ packed form
19364A45778l0326d39808d0390A57040a19548A61059g5173A49053F8053l3146
19354C4907a6920I5149J41571a41597A1304b68086f5814I9303c00327b4490l74697
19343c99187B95817h8023H6819a3277B5838b045A16545a0566n37678B44492q8710
19332A55782f2776D8089h7225c408j40180A27313J95804c92252a81283Q6058L2496
19321f2729k7693G3543b35215k7466j14244D3783a51445r5067A48298a02971A31765
19309a29777a8641H9261b40859A0737g7313o6113n8582p8988A71217a04020c9342
19297A1206a02434k61073f6141D44454A29540C6604Q3322C700J26389D485L9240
19286D3725d1152A15285a75574e6090B95280C89a25264A70665G4961a138A88063
$$ plain form
19274 -128844 -9011 -117598 -294507 158922 75556 -246660 -34947 -142033 -235953 -339104
19264 -339104 24115 -17748 -422265 -149516 -87290 -806 -167587 -32576 -9468 -221661 221360
19252 126586 78742 -118571 -51328 16384 81047 -81510 104790 -150406 11665 -158000 -150381
19241 -150381 -28502 -228255 130927 56033 -164339 -42384 -42600 50072 107815 153066 262813
19230 262813 -621817 -194260 -94479 83356 22573 -67046 -54006 -480274 34181 178569 19690
19218 286755 -23847 -296901 -114267 -26621 -75299 -58299 142438 -175779 99923 -64177 -121580
19207 -121580 236654 -8163 41194 -369200 -180350 365402 -84144 165467 25966 5467 73412
19196 73412 -45670 -150508 53314 -316060 6280 -18012 83973 -329710 -212255 -215009 -137272
$$ packed form
19274a28844i011j08587j76909A58922G5556b46660c4947j07086r3920j03151
19264c39104B4115a7748m04517a49516O2226h06j66781c2576i468k12193B21360
19252A26586m7844a18571e1328A6384O4663h1510A04790a50406A1665a58000P619
19241a50381b8502j99753A30927E6033a64339d2384k16E0072N7743M5251J09747
19230B62813f21817a94260i4479H3356B2573f7046J3040m26268C4181J44388A9690
19218B86755b3847k73054a14267b6621m8678J7000A42438a75779I9923f4177n7403
19207a21580B36654h163D1194c69200a80350C65402h4144A65467B5966E467O7945
19196G3412d5670j04838E3314c16060F280a8012H3973c29710J17455k754P7737
$$ plain form
19185 -137272 -266477 306216 150968 -280822 -81489 -51985 -101508 59768 -229517 263200
19174 -204509 130193 -154150 -246480 -109493 -28803 -119563 -182676 58329 -362114 -302727 -57699
19162 -75867 -177502 -52797 50445 83136 -220307 -132513 -233753 -176229 144364 119273 -111745
19150 -125064 -207245 -212599 28233 62474 32048 -153162 -248218 226588 -162303 -357811 -43806
19138 -209991 158237 -259520 54552 99213 -2286 -171937 30994 -106517 -200988 -298123 -41818
19126 81169 57744 -127545 -18801 -23240 -90770 38198 -43490 68941 107767 -86756 -278765
19115 -278765 182646 -101723 -202614 -124856 -290875 25478 31608 -70993 216581 -80732 4043
19103 -45260 86838 -290719 -156637 24288 -27077 -211846 -191089 98717 -41920 6961 99419
$$ packed form
19185a37272j29205C06216A50968b80822h1489K9504m9523E9768b29517B63200
19174b04509A30193a54150r2330a09493b8803r0760o3113E8329c62114N9387e7699
19162g5867j01635e2797E0445L2691b20307Q7794j01240N7524A44364k5091a11745
19150a25064q2181n354B8233L4241l0426a53162r5056B26588a62303j95508d3806
19138b09991A58237b59520E4552M4661b286j69651C0994a06517r4471r7135d1818
19126H1169k3425a27545a8801m439o7530C8198d3490F8941L8826h6756j92009
19115b78765A82646a01723j00891P7758j66019B5478O130g0993B16581h0732D043
19103d5260H6838b90719J34082B4288b7077j84769K0757I8717d1920F961R2458
$$ plain form
19092 99419 -172004 158197 -5506 140001 25667 31667 139705 -426794 -364309 -123848 394140
19080 67200 14555 -114864 -17230 -291611 -86129 -338969 -23177 -79248 -38116 107070 -285989
19068 -125562 -169071 -10543 18144 156267 -132308 -277601 -161150 87539 -62874 75172 303879
19057 303879 -327026 55728 -31965 -59482 -311844 -50576 40197 70685 268323 78219 1524
19045 67128 259447 117125 -39080 -237530 -297219 137690 109075 165683 239882 163740 123287
19034 123287 289731 -135477 23482 30502 -76166 -224603 -141543 -193320 -35208 194447 121082
19023 121082 360233 -14815 75811 184073 101012 -36980 255265 -153458 -71047 259880
19012 -371163 -156613 -251918 -143691 136252 27734 -95284 178706 -289330 161206 124639
$$ packed form
19092I9419a72004A58197e506A40001B5667O000J08038d26794O2485a23848C94140
19080F7200A4555a14864a7230k74381h6129k52840b3177n6071c8116A07070b85989
19068a25562m3509a0543A8144J38123a32308j45293J16451H7539f2874G5172K28707
19057C03879c27026E5728c1965k7517k52362e0576D0197L0488J97638G8219A524
19045F7128J92319A17125c9080j98450n9689A37690k8615N6608P4199p6142m0453
19034A23287J66444a35477B3482P020g6166j48437Q3060n1777c5208A94447p3365
19023A21082K39151a4815G5811J08262q3061c6980B55265a53458g1047B59880
19012c71163a56613r5305J08227A36252B7734i5284A78706b89330A61206l6567
$$ plain form
19002 124639 -217095 -412075 -76047 -192238 208373 -15267 -303748 -70084 -252393 -236834
18992 -236834 60272 -99733 -59197 -189222 -264589 -263196 -216144 296559 -273125 -267580 -151793
18981 -151793 331175 -443614 60626 -343943 27908 -235992 -65606 -136063 -28468 -194977
18971 -194977 242654 18238 278379 -115458 -22249 192906 -165967 -73172 7121 -17394 -344424
18960 -344424 103197 -156889 28939 -9846 -92233 -187753 -223093 497431 -160521 56188 20226
18948 -445462 -57374 -15398 5039 126278 76781 -96150 -8449 -57367 -229226 -23136 189050
18936 6561 200843 -160527 74965 158371 116876 219271 57515 -148830 -75349 -155154 -162115
18925 -162115 76665 -41664 185265 -365223 -64168 -171906 -77004 -246648 94457 -161641
$$ packed form
19002A24639b17095j94980g6047j16191B08373a5267k88481g0084j82309J5559
18992b36834F0272i9733M0536j30025p5367J393M7052B96559b73125N545J15787
18981a51793C31175d43614F0626c43943B7908b35992f5606p0457b8468j66509
18971a94977B42654A8238K60141a15458b2249A92906a65967g3172G121a7394l27030
18960c44424A03197a56889B8939i846q2387r5520l5340D97431a60521E6188B0226
18948d45462e7374a5398E039J21239m9497i6150h449m8918j71859b3136A89050
18936F561J94282a60527G4965Q3406m1495J02395E7515a48830P3481p9805o961
18925a62115G6665d1664A85265c65223f4168j07738g7004j69644I4457a61641
$$ plain form
18914 38034 -68266 -23338 -37939 -48992 -173100 -32645 89758 2535 -160940 43428 -38131
18902 4282 196683 -62944 -313166 -171733 -80681 145981 334314 193315 -20849 69286 -286199
18890 -26741 -325284 -79792 13281 -144868 272192 -104479 -71237 -227299 -135475 -175233 158594
18878 -184896 74668 -103638 -17180 260153 -139238 -143909 26857 -140853 47895 43450 -45258
18866 41749 -105683 -214886 -192549 -361536 -60699 230351 -440977 96955 -232530 30925
18855 -206646 -124080 -16269 -227932 -320569 -12017 277858 -1551 96569 137980 -194963 -187495
18844 -187495 -345174 -107606 -143989 -202277 -428518 -101112 13324 -344067 -45693 -236185
18834 -236185 193267 -159542 82222 121788 455663 152458 230821 60356 -285686 228034
$$ packed form
18914C8034f8266b3338j4601j1053j24108c2645H9758B535a60940D3428c8131
18902D282J92401f2944k50222J41433h0681A45981J88333j40999b0849F9286b86199
18890b6741k98543g9792A3281a44868B72192a04479L3242j56062R1824l9758A58594
18878a84896G4668a03638a7180B60153a39238m671B6857a40853D7895m445d5258
18866D1749a05683j09203K2337j68987f0699B30351d40977I6955b32530C0925
18855b06646Q2566a6269k11663r2637a2017B77858a551I6569M1411a94963P468
18844a87495j57679a07606l6383n8288k26241a01112A3324c44067d5693j90492
18834b36185A93267a59542H2222L9566L33875A52458P8363F0356b85686B28034
$$ plain form
18823 -379160 -79544 -169437 -144542 9586 -52940 75376 66585 -53287 349410 192039 272554
18812 272554 46299 -54520 40108 299690 72189 221448 50337 -214056 11785 -239876 -157619
18801 -157619 -324010 -338327 212401 -135338 -66178 68028 -149103 -28874 -173103 132478
18790 -22273 106757 -347814 -99517 30962 -233343 -84109 101496 11762 -552648 -264236
18779 198669 -166313 -170229 -38314 -26921 -133684 122973 -218197 -300072 -241957 -33348 -537812
18768 -537812 31352 -134816 120282 -201234 302627 -410389 -107005 -298639 388685 34617
18757 -150328 -2110 21031 -278621 -115994 -132731 50770 -270725 -29606 210693 -243007 -381287
18746 -381287 -482373 -264788 -47549 -130568 92130 4642 158294 280311 53083 -148015 47641
$$ packed form
18823c79160g9544q9893K4895I586e2940G5376q791e3287C49410j57371Q0515
18812B72554D6299e4520D0108K59582G2189J49259E0337b14056A1785b39876Q2257
18801a57619j66391j4317B12401a35338f6178F8028a49103b8874j44229A32478
18790b2273A06757c47814i9517C0962b33343h4109A01496A1762e52648b64236
18779A98669a66313l916c8314J1393j06763A22973b18197q1875N8115c3348n04464
18768e37812C1352a34816A20282b01234C02627d10389a07005j91634C88685C4617
18757a50328b110B1031b78621a15994j6737E0770b70725b9606B10693b43007j38280
18746c81287j01086K17585d7549q3019I2130D642J53652J22017E3083a48015D7641
$$ plain form
18734 -20063 42084 -293489 19534 -64950 -116340 -163450 235883 78614 -116844 5680 -243767
18722 -33572 -109514 54957 40497 -57382 -33408 -256749 -114413 -7526 167502 -128041 -111989
18711 -111989 97616 -73527 -143764 -299372 164163 -57334 224809 93151 112673 -233732 -240912
18700 -240912 77044 -95167 15670 -37566 47552 3535 -227789 -157188 -14312 -45227 -147883
18689 -147883 -444706 73565 10262 -90652 -179024 155321 -195059 53370 104841 95124 37435
18677 121353 -53451 -226507 98335 94232 -19803 109587 -240470 141504 229446 -49879 112938
18665 -310238 -174575 76974 -119294 51783 11059 -26094 -364307 -49058 -16606 13928 327023
18654 327023 240034 72945 -86887 -234321 2578 -166336 39346 -239455 130922 -69932 -256200
$$ packed form
18734b0063D2084b93489A9534f4950n1390m7110B35883G8614a16844E680b43767
18722c3572p5942E4957j4460e7382K3974k23341a14413g526A67502a28041J6052
18711a11989I7616g3527p0237j55608A64163e7334B24809I3151J9522b33732p180
18700b40912G7044i5167A5670c7566D7552C535b27789P0601a4312l0915j02656
18689a47883k96823G3565A0262i0652q8372A55321a95059E3370N1471r717C7435
18677A21353e3451j73056I8335m103a9803A09587b40470A41504Q7942d9879A12938
18665c10238J35663G6974a19294E1783A1059b6094l38213d9058a6606A3928L13095
18654C27023q6989G2945h6887j47434B578a66336C9346b39455A30922f9932j86268
$$ plain form
18643 -256200 145869 -77792 -66629 -57548 -16911 -221592 -218791 -9824 -210070 177800 224615
18632 224615 -327343 -38231 -61632 296881 -140712 181375 -37826 -33547 -271162 -49501 85106
18620 -74738 -53479 -113245 -253968 -74453 -339678 6316 178505 -63078 -48926 -15247 -182896
18609 -182896 -264329 -41705 51961 -187770 22763 -235229 108372 69090 172055 145978 155888
18598 155888 17226 -190575 157805 31777 -241325 -70154 -255862 69435 -197935 -256231
18588 -256231 -130827 14181 -140282 38866 71721 -227035 -149971 -191944 -212467 -389352 263310
18576 14521 26751 237008 -176827 -80166 82024 -109240 71820 -216335 102013 -37990 -213150
18565 -213150 -140325 -99457 66416 -289773 -315238 128776 380615 99589 -355533 -239266
$$ packed form
18643b56200A45869g7792J1163R081a6911k04681K801i824k00246A77800M6815
18632B24615c27343c8231k3401B96881a40712A81375c7826M279k37615d9501H5106
18620g4738K1259n9766j40723g4453k65225F316J72189f3078J4152a5247j67649
18609a82896q1433d1705E1961a87770B2763b35229A08372l9282J02965k6077R910
18598A55888A7226a90575A57805C1777b41325g0154j85708F9435a97935n8296
18588b56231J25404A4181a40282C8866L2855b27035P7064m1973k0523j76885B63310
18576A4521J2230K10257a76827h0166H2024a09240G1820b16335A02013c7990j75160
18565b13150P2825M0868F6416b89773k5465A28776K51839I9589c55533J16267
$$ plain form
18555 -239266 275593 289067 -11331 -636479 -630429 58913 267801 -117350 -247005 86899 314500
18544 314500 -30667 -141716 13017 -87373 -24521 -93760 -266951 230817 40564 83585 -48781
18532 -379113 -13859 -323301 98882 -193935 9071 40882 133577 -221382 95639 -296417 -294272
18521 -294272 -168870 -306615 -348009 124898 -199227 -37672 -251587 148940 -46413 69455
18510 -242778 -100940 4328 -131749 125372 -243059 -156169 23706 81676 -171545 53098 -174323
18498 -81970 -177007 -224590 2527 -243425 64978 75785 272788 -100507 210281 -322742 21167
18486 53780 70980 323852 86512 15495 78906 -217107 -261495 -526419 -163235 13025 -50076
18474 -319135 104589 205040 -192128 61718 45767 223350 71345 -254191 281926 -137440
$$ packed form
18555b39266B75593J3474a1331o25148O050E8913K08888a17350j29655H6899K27601
18544C14500c0667j11049A3017h7373b4521o9239j73191B30817D0564M3021d8781
18532c79113a3859l09442I8882a93935I071L1811R2695b21382I5639b96417K145
18521b94272J25402j37745m1394A24898a99227c7672k13915A48940d6413F9455
18510b42778a00940D328a31749A25372b43059Q6890B3706N7970a71545E3098a74323
18498h1970r5037m7583B527b43425F4978J0807J97003a00507B10281c22742B1167
18486E3780J7200K52872H6512A5495O3411b17107m4388k64924a63235A3025e0076
18474c19135A04589J00451a92128F1718j5951J77583G1345b54191B81926a37440
$$ plain form
18463 -169152 12581 33184 -119005 -85303 -409475 -264752 -11101 -151068 -159510 -298996 85728
18451 16098 80178 -23682 -29452 13106 -31147 -115385 124190 -86096 -192379 27475 -286204
18439 41189 -96186 98016 208063 173104 40875 -19363 -50975 18186 -99363 -78238 357709
18427 183204 29596 -175111 -373908 295673 -199855 -79760 -426441 157493 -2735 -196908
18417 -196908 -214191 -298930 -220052 -125934 -45901 13100 140171 -19315 -17688 80907 123281
18406 123281 -40605 284084 -156661 -70356 3903 -101975 -189549 60593 33258 -226368 -110630
18394 -149727 -225170 158474 53823 -289062 -332827 66584 -236295 387663 -135082 78084
18383 300726 207600 -83952 -74601 -209518 -257490 -108217 -106696 4828 75158 -241218 -150617
$$ packed form
18463a69152A2581K0603a19005L3702l24172J44723a1101j39967q442j39486H5728
18451A6098O4080b3682n770A3106c1147q4238A24190h6096j06283B7475b86204
18439D1189i6186I8016J10047l4959D0875a9363l1612A8186i9363K1125C57709
18427A83204B9596a75111j98797B95673a99855g9760l46681A57493b735j94173
18417a96908j7283q4739P8878R4118d5901A3100J27071a9315J627H0907M2374
18406A23281d0605B84084a56661g0356C903a01975q7574F0593k7335b26368a10630
18394a49727p5443A58474E3823b89062m3765F6584b36295C87663a35082G8084
18383C00726r3126h3952R351j34917m7972a08217J521D828P0330b41218R0601
$$ plain form
18372 -150617 -22299 -188522 232987 -68014 80003 -91333 102843 -37579 -58598 -25899 -14318
18361 -14318 -80719 183730 208038 -232101 -151775 149191 -182983 90839 46686 -24892 31792
18349 37153 184661 140752 180501 -85929 244109 20531 105559 47057 -51564 -142072 -79737
18338 -79737 -131594 -57073 -157625 101808 19835 -25718 -287249 115862 76865 -36443 -23987
18327 -23987 -99362 -91738 208124 170927 4176 -126927 -91373 67183 -343200 -527940 -86668
18315 -73357 66220 155308 -187245 -189522 -186309 -2822 -56374 -32118 -81096 -107267 62217 -55732
18302 -104590 16637 263841 -193608 -383171 -277734 -79276 136051 -177865 190800 -343422
18291 -61809 176425 -68363 -214664 -144455 284613 34754 -20433 -395291 -99998 -36888 -177327
$$ packed form
18372a50617b2299j66223B32987f8014H0003i1333A02843c7579k1019b5899J1581
18361a4318o6401A83730K4308b32101Q0326A49191a82983I0839m4153b4892C1792
18349C7153J47508m3909L9749h5929B44109B0531Q5028D7057e1564r0508O2335
18338g9737n1857e7073j00552A01808A9835b5718k61531A15862l8997c6443J2456
18327b3987p5375P624B08124l7197D176a26927L5554F7183c43200j84740h6668
18315g3357F6220Q9088a87245k277L213b822n3552K4256m8978k6171F2217e5732
18302a04590A6637K47204a93608j89563J05437g9276A36051a77865A90800c43422
18291f1809A76425f8363j46301P0209B84613C4754b0433l74858i9998c6888j40439
$$ plain form
18280 -177327 -300330 7438 44564 25049 -125671 216020 -1113 -325106 -125339 56330 45079
18269 45079 -130257 14666 275932 -77895 -71288 14640 -194411 59319 -83935 -78727 -173665
18258 -173665 169600 -57504 -140272 79677 -178264 -346963 -47036 342491 97950 86910 15070
18246 -14063 18700 -366291 -43534 67151 -247503 130297 338670 -105982 -155574 212840
18235 -38765 82243 92656 75163 188082 48821 -126419 -199535 -261849 -173009 -27633 201223
18223 47178 -171319 -190441 -66419 75089 84066 144133 421001 -96138 310871 -193227 -81443
18211 -142190 -156361 -190347 -53739 -39874 -364295 -532153 -86798 -398 -71230 -6898 -108232
18200 -108232 486220 -95009 -100049 -178430 -203703 -198199 30196 -114673 -64714 262472 -152955
$$ packed form
18280a77327j23003G438L7126j9515a25671B16020a113l23993a25339E6330j1251
18269D5079a30257A4666K61266g7895O607A4640a94411E9319h3935N208r4938
18258a73665A69600e7504q2768G9677a78264j68699d7036C42491I7950j1040A5070
18246a4063A8700c66291d3534F7151b47503A30297K08373a05982m9592B12840
18235c8765H2243J0413j7493J12919D8821a26419p3116o2314Q8840b7633B01223
18223D7178a71319j9122f6419G5089Q977O0067K76868i6138C10871a93227h1443
18211a42190j4171l3986e3739J3865l24421j67858h6798c98p0832f898j01334
18200a08232D86220i5009n040p8381k5273N504C0196a14673M9959B62472a52955
$$ plain form
18188 -168124 18016 -117219 -15848 -17972 159942 60836 87677 163331 193977 169778 84961
18177 84961 -209621 -159199 63295 275346 -154147 148041 -44237 115839 12108 97319 -313653
18165 -90653 -93226 63892 -8298 -295994 -7809 -101354 -79369 48344 107250 111602 -57937 170711
18152 -238214 48024 118344 -111690 -217184 27993 -179154 -86744 -32433 -225180 15647 234974
18141 234974 -56578 -128595 -272638 62920 99957 44012 99429 -178121 -406827 -51610 123483
18129 203155 -56159 -10414 -314529 -341534 -129790 -91498 -337443 -39581 -251470 -14042 236696
18117 -120976 -70442 -103703 -93667 -186308 155548 118798 150899 -223481 381066 73495 152101
18106 152101 282064 -96321 -114964 -101314 83707 39437 -393799 83635 178368 212238 -183227
$$ packed form
18188a68124A8016a17219a5848k124A59942F0836K6841P5654L0646k4199q4817
18177H4961b09621N0422F3295K12051a54147A48041d4237A15839A2108Q5211c13653
18165i0653k573F3892h298k87696g809r3545K1985D8344N8906M352e7937A70711
18152b38214D8024P0320a11690j05494B7993a79154h6744c2433j92747A5647K19327
18141B34974e6578p2017j44043F2920L7037D4012N5417a78121k28706e1610A23483
18129B03155e6159a0414l04115k7005a29790L8292k45945c9581k11889a4042B36696
18117a20976N0534l3261J0036r2641A55548l6750L2101b23481C81066G3495P8606
18106A52101J29963i6321j8643J3650H3707C9437c93799H3635R4733L3870a83227
$$ plain form
18094 -71553 -234262 19815 143431 -53176 -115423 -114606 -173640 -120744 126882 184344 275797
18083 275797 112471 -274679 196973 154675 -228310 73094 -48551 -24290 -16902 -56320 26490
18071 -138062 -114460 139141 -44804 -374092 -223546 -162929 -8895 253106 -87151 -75884 -256579
18060 -256579 72851 10512 298730 -433617 343358 -59049 -17031 417161 -132102 38453
18049 -76616 47619 270415 3404 -201243 -83873 -341127 -222343 15997 132759 213770 -23299
18037 44642 -168455 -198076 37627 -476420 201075 -61069 97626 82139 -170606 -87558 10113
18025 70798 -159189 -179022 115800 -247732 -47406 40462 14451 5345 78493 -194489 -258690
18014 -258690 -182753 -123151 48647 52070 96986 8694 164211 113107 -176078 -93265 -77705
$$ packed form
18094g1553j62709A9815J23616e3176o2247Q17n9034N2896A26882N7462R1453
18083B75797A12471b74679A96973m2298b28310G3094d8551K4261P388l9418B6490
18071a38062K3602A39141d4804l29288J50546O0617h895B53106h7151J1267j80695
18060b56579G2851A0512K88218d33617C43358e9049a7031D17161a32102C8453
18049g6616D7619K22796C404b01243h3873k57254J18784A5997J16762Q1011b3299
18037D4642a68455k9621C7627d76420B01075f1069I7626j5487a70606Q3048A0113
18025G0798a59189j9833A15800b47732d7406D0462A4451E345P3148a94489o4201
18014b58690P5937N9602D8647L423M4916H694J55517n1104a76078Q2813J5560
$$ plain form
18003 -77705 -194545 -62093 49042 37048 111968 -227440 -125461 -384394 -139658 -248545
17993 -248545 72380 -4594 41655 153908 -77825 -31058 4385 -189402 117652 49912 -66055
17981 -230399 -266045 131470 66086 -203066 273852 -348682 -256404 -322094 -133990 -57305
17970 -92367 81659 217712 283893 3808 111519 -175131 118037 64271 119764 -209598 -323391
17959 -323391 345493 -12523 -112904 -6846 59254 36552 -65020 -909 -79423 86895 -174583
17947 -11706 53152 -91276 -7380 -347040 -106959 -131321 -370191 192243 47894 -145780 -169567
17936 -169567 -79918 138380 -572850 -88951 -172073 278085 -193100 433805 13665 46916
17926 46916 -115685 188516 104863 53750 73124 -108022 89949 386797 -166167 24932 53074
$$ packed form
18003g7705j16840f2093D9042j1994P4920b27440J01979k58933a39658j08887
17993b48545G2380d594D1655J12253g7825c1058D385a89402A17652D9912f6055
17981b30399l5646A31470o5384b03066B73852c48682R2278o5690a33990e7305
17970i2367H1659J36053O6181C808J07711a75131A18037n3766N5493b09598j13793
17959c23391C45493a2523j00381f846E9254k2702f5020i09p8514H6895a74583
17947a1706E3152i1276g380l39660a06959k4362k38870A92243D7894a45780k3787
17936a69567g9918A38380e72850h8951q3122B78085a93100D33805A3665L3251
17926D6916a15685A88516q3653n1113J9374a08022H9949K96848a66167B4932K8142
$$ plain form
17915 53074 163043 -27085 -127937 52688 -192920 148119 -258050 -96363 -228106 -40855
17904 -103548 45969 -197533 226300 -292293 262360 -61749 101599 -28423 49439 166800
17894 166800 -27200 72189 -306380 -409457 5853 21558 -170950 9853 -153480 53306 -49504
17882 -197273 -267534 -158467 64915 -47620 -188296 239100 302975 -42867 -130601 110409 146402
17871 146402 116416 439619 -228138 -146068 64661 -40084 -232734 109026 8519 -115865 -436323
17860 -436323 192348 -104635 95892 -9220 -90932 -137581 119840 -129065 52727 -173411 -213148
17849 -213148 136296 -74547 -183869 -382887 18256 71879 -387985 -41000 164376 172056 -326503
17837 377161 73920 106552 168279 205063 -2597 357237 -154014 178685 284575 -117995 -126299
$$ packed form
17915E3074J09969b7085j00852E2688a92920A48119b58050i6363j31743d0855
17904a03548D5969a97533B26300b92293B62360f1749A01599b8423D9439J17361
17894A66800b7200G2189c06380j03077E853J5705a70950I853a53480E3306d9504
17882a97273p0261J09067F4915d7620j40676B39100O3875d2867q7734A10409L5993
17871A46402k9986L23203b28138Q2070F4661d0084j92650A09026H519a15865l20458
17860d36323A92348a04635I5892i220q1712m6649A19840a29065E2727a73411l9737
17849b13148A36296g4547j09322j99018A8256N3623c87985d1000A64376P680c26503
17837C77161G3920L2632O1727L6784b597C57237a54014A78685J05890a17995q304
$$ plain form
17826 -126299 251327 -65112 68958 23872 147084 262889 -108976 -379052 -111522 -34427
17815 -101937 17176 -51566 39835 170977 -82280 96346 -97925 -9100 -110244 260766 55078
17803 193940 119030 -74174 169484 -20488 220829 -42992 164577 -158449 -280968 -140291
17792 116439 27033 274381 -6383 -48141 -24959 -308638 108305 -175412 -32219 111613 238513
17781 238513 287233 211199 8049 -112431 238854 172449 -30274 44588 13153 -102483 -98879
17770 -98879 -266083 -161593 -138801 -60050 26431 -241954 174651 251538 -204949 -320022
17760 -320022 205842 -127991 175374 130590 200633 126826 -81593 14787 229274 -97553 449028
17748 -59717 -178435 -134534 266961 209815 283909 -137696 94165 -55351 4661 -166717 106165
$$ packed form
17826a26299B51327f5112F8958B3872J23212J15805a08976k70076a11522c4427
17815a01937A7176e1566C9835J31142h2280I6346i7925i100j01144B60766E5078
17803A93940p4910g4174A69484b0488B20829d2992A64577a58449j22519a40291
17792A16439B7033K47348f383m1758K3182k83679A08305a75412c2219A11613J26900
17781B38513M8720p6034H049a12431B38854o6405c0274D4588A3153a02483L604
17770i8879j67204J04490K2792f0050B6431b41954A74651P6887b04949j15073
17760c20022B05842a27991A75374m4784P0043p3807h1593A4787K14487i7553D49028
17748e9717j18718M3901B66961n7146P4094a37696I4165e5351D661a66717A06165
$$ plain form
17736 118842 -56049 -135263 -190311 259544 124450 -26878 -114392 179906 51976 -124669 -40585
17724 328386 58090 88602 231726 -35100 -63012 -97336 112429 31184 -13166 -224453 -105637
17712 47955 -254129 -214562 9103 -234870 -84926 246006 -221484 -94048 -1373 -108761 48480
17700 122463 -264226 -260805 -14733 -160235 105782 -118694 69188 137924 -120791 -2575 -94825
17689 -94825 28610 261524 -28749 157008 53749 -97939 55974 24268 87342 3045 -19032
17677 -139818 -103866 -10653 -269465 27097 58687 210454 -60088 -186133 26641 -497898 224621
17665 -263102 -85102 65599 54625 17429 -212881 140785 -74259 -154856 163169 -44100 65154
17653 37307 103750 10921 -236289 104192 -246255 331457 -94013 -50262 73742 92822 -71969
$$ packed form
17736A18842e6049p9214n5048B59544A24450b6878q7514A79906E1976a24669d0585
17724C28386E8090L0512J43124c5100k7912l4324A12429C1184a3166k11287a05637
17712D7955b54129L9567I103b34870h4926B46006b21484i4048a373j07388D8480
17700A22463b64226L421a4733j45502A05782a18694F9188O8736a20791b575r2250
17689i4825B8610K32914b8749A57008E3749i7939E5974B4268O3074C045a9032
17677a39818L5952a0653k58812B7097L1590J51767f0088j26045B6641d97898B24621
17665b63102h5102F5599j0974A7429b12881A40785g4259q0597A63169d4100F5154
17653C7307O6443A0921b36289A04192b46255C31457i4013M3751G3742J9080g1969
$$ plain form
17641 -173992 446180 48023 -283851 320109 50870 23964 193596 138950 226879 67451 64104
17630 64104 -67443 81004 43735 -139763 230538 155973 7107 -131777 134236 -391990 -87480
17618 -33437 35997 72704 71426 -135369 8515 255409 -88019 242371 411895 201855 8432
17606 248201 -78853 -376390 210635 38997 188762 33624 -55423 18331 196227 -71207 38244
17594 166880 184199 -34046 -60196 -100328 21501 -54202 -22330 -24522 321139 -174176 424988
17582 -121119 -28704 339571 -6242 25451 40486 67882 32135 174182 236473 -214383 -24487
17570 -39977 -116487 219822 -65449 -349791 -72771 34683 15424 -68194 132612 -120883 249410
17558 599446 99673 -355254 -188934 232611 327143 243305 90814 24325 145313 269933
$$ packed form
17641a73992D46180D8023b83851C20109E0870B3964J69632n4646Q7929F7451l347
17630F4104f7443H1004l7269a39763B30538p4565G107a31777A34236c91990h7480
17618c3437C5997L6707j278a35369H515K46894h8019B42371J69524B01855H432
17606B48201g8853k97537B10635C8997J49765C3624e5423A8331J77896g1207C8244
17594A66880J7319c4046k6150m0132B1501e4202b2330k192C21139a74176D24988
17582a21119b8704C39571f242B5451J5035K7396C2135J42047O2291b14383b4487
17570c9977p6510B19822f5449k84342g2771C4683A5424f8194A32612a20883B49410
17558E99446I9673c55254J66320B32611R4532q3838I0814B4325J20988J24620
$$ plain form
17548 269933 304709 108196 169472 168441 133595 396349 24664 86703 146808 -238165 56234
17536 253770 7991 239994 52426 308540 -103128 -130580 -139326 -258781 -1557 -66314 12724
17524 -32304 -92597 238640 19172 164914 272175 193073 380558 262116 136134 210152
17514 210152 112214 96289 -131884 143350 3012 177058 -66095 23788 70826 97823 -222154
17502 -80822 282474 -88178 -121914 171364 151635 35219 154739 38050 348714 -123342 17874
17490 149043 200708 611211 -78803 127893 256250 166853 -106805 36870 132911 291478
17480 291478 180844 145256 85654 96566 -218200 370973 214738 98937 68060 372747
17470 372747 -61444 138811 250561 -303503 -406841 92767 -108815 -60714 89514 175799
$$ packed form
17548B69933L4776A08196O1276j031l4846K62754B4664O2039O0105b38165E6234
17536B53770G991K32003E2426K56114a03128k7452q746j19455a557o4757A2724
17524c2304o0293B38640A9172J45742J07261p9102J87485j18442j25982P4018
17514B10152r7938j5925a31884A43350C012J74046f6095B3788M7038K6997b22154
17502h0822B82474h8178l3736A71364j9729C5219J19520C8050L10664a23342A7874
17490A49043N1665M10503g8803A27893J28357q9397a06805C6870R6041J58567
17480B91478j10634l5588n9602J0912b18200C70973j56235I8937l0877L04687
17470C72747f1444A38811J11750c03503j03338I2767a08815M8101H9514Q6285
$$ plain form
17460 175799 110637 -32372 -140646 104900 220638 -112774 -203649 285513 238741 78327
17449 11000 260125 122594 179656 285950 266662 8901 279861 269015 -8496 266479 448426
17438 448426 89380 244641 215138 104211 15318 309413 68131 153924 -58859 113737 -87279
17426 364905 160687 145520 375360 212332 183859 260890 320145 111728 365620 72794
17415 21073 566724 278031 478111 28591 657145 343658 91585 -200005 395816 324964
17405 324964 217081 -60941 2850 -45076 301267 2915 345018 139335 231144 -1936 349088
17393 168961 175230 94063 112551 -99185 350697 175500 579505 436147 162035 154633 320474
17382 320474 109329 228041 266073 -193383 -187974 193852 67398 167239 99793 99752 62350
$$ packed form
17460A75799o5162c2372j08274A04900J15738a12774r0875B85513m6772G8327
17449A1000K49125A22594N7062J06294j9288H901K70960j0846h496B66479J81947
17438D48426H9380J55261k9503A04211A5318K94095F8131Q5793e8859A13737h7279
17426C64905A60687j5167K29840j63028k8473P7031N9255A11728K53892G2794
17415B1073N45651B78031K00080B8591O28554l13487I1585b00005C95816p0852
17405C24964j07883f0941B850d5076C01267B915L42103A39335R1809a936C49088
17393A68961O269q1167J8488i9185C50697j75197M04005j43358A62035p402J65841
17382C20474A09329J18712L8032a93383N409A93852F7398R9841o7446m1l7402
$$ plain form
17371 62350 -32325 204561 -148776 375838 401464 34800 -382110 -18475 15933 290663 300462
17360 300462 267991 -81198 47813 43345 231072 101730 247270 177811 70988 330929 285609
17349 285609 21245 240120 81789 260544 226358 320360 26625 242452 363641 386007 20404
17337 141361 23974 236784 246161 1557 242205 228377 91105 -149989 6889 214501 89387
17325 246942 5480 93965 240380 -135016 334800 -33427 162650 24333 248575 -25922 219834
17313 151325 149169 202044 87320 47529 170204 226858 382592 -121209 -147 -86646 105873
17301 -69364 220754 256488 -262262 410434 6041 91159 -22013 376886 236757 128460 591627
17290 591627 220318 -122825 250034 220308 29291 222159 206777 256944 355992 -54437 363706
$$ packed form
17371F2350c2325B04561a48776C75838K5626C4800c82110a8475A5933K74730R799
17360C00462l2471h1198D7813m468J87727A01730J45540o9459G0988K59941m5320
17349B85609B1245K18875H1789J78755l4186R4002B6625K15827J21189K2366B0404
17337A41361B3974K12810R377A557K40648j3828I1105a49989F889K07612H9387
17325B46942E480Q8485J46415a35016C34800c3427A62650B4333K24242b5922B19834
17313A51325k156N2875H7320l9791J22675N6654J55734a21209a47q6499A05873
17301f9364B20754L5734b62262D10434F041Q5118b2013C76886j40129j08297M63167
17290E91627B20318a22825B50034k9726B9291J92868j5382N0167R9048e4437C63706
$$ plain form
17278 301390 163190 -51681 -67541 96897 478639 -31955 231028 69594 554803 193595
17267 126958 194947 107416 243753 -80331 65579 167012 365483 -65610 194881 165125 65737
17255 199325 27546 170083 -10482 292844 173308 234832 101910 121500 -51819 185424
17244 173535 36284 -117840 404566 40042 55202 92429 107796 349162 156422 179107 97760
17233 97760 159771 400305 264431 399597 244096 208055 51947 443426 176412 206553
17223 206553 88268 303500 390987 434545 255157 508226 -102656 139054 -98190 -13816
17212 287404 -14503 247453 67553 419559 104944 139669 87970 225104 -24672 27720 10987
17200 76293 291064 58725 282424 -135701 122796 208497 586241 400166 111507 147988
$$ packed form
17278C01390j38200e1681j5860I6897L81742c1955B31028F9594M85209A93595
17267A26958O7989q7531J36337h0331F5579J01433J98471f5610A94881k9756F5737
17255A99325B7546J42537a0482B92844j19536O1524A01910J9590e1819A85424
17244A73535C6284a17840D04566D0042J5160L7227J5367K41366A56422K2685q1347
17233I7760O2011K40534j35874J35166j55501l6041E1947L91479A76412L0141
17223B06553H8268K15232Q7487M3558j79388K53069a02656A39054i8190a3816
17212B87404a4503B47453F7553L52006A04944L4725n1699J37134b4672B7720A0987
17200G6293K14771E8725K23699a35701A22796Q5701L77744j86075A11507L6481
$$ plain form
17190 147988 -54272 96306 278927 -176850 391359 194109 88135 276792 105479 161175
17180 161175 -8072 349743 441208 421645 174588 69803 413415 90997 167721 406898 -33631
17168 199613 77884 169767 302478 203719 590150 332035 -24513 312628 394072 404502 65103
17156 203508 257967 273187 272565 286022 489704 177567 71104 168610 37588 493741 468416
17145 468416 324878 467727 -120848 604375 -52469 436037 411856 172834 316845 593809
17135 593809 235785 594664 102602 -136531 296098 279816 349100 162717 307628 517139
17125 517139 339759 350400 50145 9665 59341 261159 275594 -26179 138900 211217 124970
17114 124970 401309 134202 138120 222244 379399 563911 158299 357423 209030 368297
$$ packed form
17190A47988e4272I6306J82621a76850C91359A94109H8135J88657A05479N5696
17180A61175h072C49743R1465j9563A74588F9803L43612I0997P6724K39177c3631
17168A99613G7884R1883J32711r8759L86431k58115b4513C12628Q1444J0430F5103
17156B03508N4459J5220o22J3457K03682A77567G1104R7506C7588M56153k5325
17145D68416j43538J42849a20848F04375e2469D36037k4181A72834J44011K76964
17135E93809B35785L58879A02602a36531B96098j6282O9284A62717J44911K09511
17125E17139j77380J0641E0145I665M9676K01818J4435b6179A38900P2317q6247
17114A24970K76339A34202L918Q4124J57155J84512A58299J99124j48393J59267
$$ plain form
17104 368297 615060 261408 377812 68546 340566 189366 319024 253224 335654 54055
17093 235967 344828 198731 417893 252380 536531 262803 625637 488487 446373 344329
17083 344329 509485 399600 345845 368759 575663 111428 433147 125752 363984 503924
17073 503924 368681 274878 556064 355744 364818 387382 516171 356084 445763 477416 583240
17062 583240 431921 193773 266518 627499 660477 496449 709006 358016 699504 436720
17052 436720 539835 362400 364677 481230 768029 480456 501490 352318 459375 785499
17042 785499 439079 552226 847416 577939 463581 479756 559145 508914 707250 293639
17031 716770 855669 318300 642577 792479 544374 670193 653691 759799 347242 617138
$$ packed form
17104C68297K46763B61408J16404F8546K72020j51200J29658o5800Q2430E4055
17093B35967J08861j46097K19162j65513K84151B62803L62834j37150m2114j02044
17083C44329J65156j09885n3755K2914K06904A11428L21719A25752K38232J39940
17073E03924j35243r3803K81186k00320R074K2564J28789j60087Q9679L1653J05824
17062E83240j51319A93773P2745L60981L2978j64028K12557l50990L41488k62784
17052D36720J03115j77435K277J16553K86799k87573K1034j49172J07057L26124
17042G85499l46420J13147K95190k69477j14358J6175P9389n0231J98336B93639
17031G16770J38899C18300L24277J49902k48105J25819j6502J06108C47242K69896
$$ plain form
17021 617138 439796 765500 605171 512943 736134 808792 667316 581585 435093 493303
17011 493303 774575 571200 305710 764254 426776 779465 714686 616323 777665 185783
17000 498757 329579 755409 643300 868987 726023 1045392 728242 725550 911876 557986
16990 557986 952818 614754 723761 768338 700337 669625 868657 1116500 881860 651890
16980 651890 525659 777039 1060725 987023 904189 1020465 679850 1193602 707049 669889
16970 669889 779403 784451 671872 817404 682029 1038672 956923 870786 884452 819150 850712
16959 850712 884924 727350 1034722 808445 1047578 971197 746569 870615 874982 984977
16949 984977 1036761 624504 993271 1107571 843706 1111426 960140 1188612 1048431 901321
$$ packed form
17021F17138j77342L25704j60329r2228K23191P2658j41476q5731j46492N8210
17011D93303K81272k03375k65490M58544l37478L52689o4779r8363J61342A85783
17000D98757j69178M25830j12109K25687j42964L19369l17150k692J86326l53890
16990E57986L94832l38064J09007M4577o8001l0712J99032K47843k34640k29970
16980F51890j26231K51380K83686p3702q2834J16276l40615N13752m86553l7160
16970F69889J09514N048j12579J45532j35375L56643q1749q6137J3666o5302L1562
16959H50712L4212j57574L07372k26277K39133p6381k24628J24046M367J09995
16949I84977N1784m12257L68767J14300k63865K67720j51286K28472j40181j47110
$$ plain form
16939 901321 855932 1271642 911662 1113856 1100521 1191450 1074640 1338579 1127685 1331700
16929 1331700 1335755 1303024 1375947 976181 1364393 1400935 1411389 910843 1263260 1151397
16919 1151397 1263461 1332902 1382973 1194943 1283308 1363830 1591613 1541978 1399601 1361577
16909 1361577 1222964 1440884 1355765 1540331 1769873 1299663 1607668 1868334 1405787 1442168
16899 1442168 1794270 1712046 1872629 1772479 1852578 1858996 1574214 1910105 2032243 1574553
16889 1574553 1795899 1888009 2001056 1919590 1602307 1868711 2179677 1745531 2034771 2125865
16879 2125865 1942132 2038270 2271736 1926938 2074466 2179680 2125781 2221268 2395882 2095120
16869 2095120 2237868 2135979 2430084 2945532 1853308 2515764 2699902 2577133 2439506
$$ packed form
16939I01321m5389M15710l59980K02194j3335R0929j16810K63939k10894K04015
16929A331700M055l2731P2923l99766L88212L6542J0454n00546L52417j11863
16919A151397J12064O9441N0071j88030Q8365Q0522K27783m9635j42377l8024
16909A361577j38613K17920q5119J84566K29542m70210L08005K60666m62547L6381
16899A442168L52102q2224J60583j00150Q0099O418k84782L35891J22138m57690
16889A574553K21346R2110J13047q1466l17283K66404L10966m34146K89240R1094
16879B125865j83733R6138K33466l44798J47528J05214n3899R5487J74614l00762
16869B095120J42748j01889K94105N15448j092224O62456J84138j22769j37627
$$ plain form
16860 2439506 2622993 2459272 2558711 2784354 3012346 2665612 2482913 2528627 2751588 3026290
16850 3026290 2858023 3120679 3039016 3144420 3212369 3313579 3432370 3144272 3240751 3099677
16840 3099677 3650558 3407790 3231562 3761136 3618793 3814213 3944273 3745223 4284811
16831 4284811 4096549 3961752 4300284 4088291 3915256 4615274 4660077 4484155 4695420 4437879
16821 4437879 4680230 4696838 5103273 5167682 5257096 5350282 5460884 5399019 5547507 5736341
16811 5736341 5453366 6178047 6259074 5973556 6048738 6141039 6917768 6795039 6832593 6967364
16801 6967364 6962002 7382372 7590631 7549412 7880353 8124324 8501509 8544004 8716205 8761663
16791 8761663 9551630 9286800 9432506 9983569 10294667 10387996 10551834 11030676 11259733 11895291
$$ packed form
16860B439506J83487j63721R9439K25643K27992l46734j82699M5714K22961K74702
16850C026290j68267K62656q1663J05404O7949J01210J18791k88098R6479j41074
16840C099677N50881k42768j76228N29574j42343J95420J30060j99050N39588
16831D284811j88262j34797L38532k11993j73035P00018M4803j75922K11265k57541
16821D437879K42351J6608M06435O4409Q9414R3186J10602o1865J48488J88834
16811E736341k82975P24681Q1027k85518P5182R2301P76729j22729L7554J34771
16801F967364n362M20370K08259m1219L30941K43971L77185M2495J72201M5458
16791H761663P89967k64830J45706N51063L11098R3329J63838M78842K29057O35558
$$ plain form
16781 11895291 11851009 12571918 12705615 12997207 13257663 13761183 14305686 14740961 15033155
16772 15033155 15866641 16848625 16949295 17638732 17703477 18809102 19440165 20031469 20953180
16763 20953180 22042671 22830723 23450374 24937877 25469345 26514688 27567168 29061339
16755 29061339 30640554 31745685 33101775 34729219 36442611 37784492 39772223 41875884
16747 41875884 44206991 46566602 49052169 52075478 54981938 57928520 61018667 64825575
16739 64825575 68338400 72940867 77232327 82232325 87245388 92589857 98758588 104998292
16731 104998292 111606101 118735549 126286288 133551709 141858068 149747967 157993318 166066798
16723 166066798 173456518 180964579 187180991 192692909 196780278 199919814 201671547 201610170
$$ packed form
16781A1895291m4282P20909J33697K91592K60456N03520N44503M35275K92194
16772A5033155Q33486R81984J00670O89437O4745J105625O31063N91304R21711
16763B0953180J089491P88052O19651J487503N31468J045343J052480J494171
16755B9061339J579215J105131J356090J627444J713392J341881J987731K103661
16747D1875884K331107K359611K485567L023309K906460K946582L090147L806908
16739F4825575L512825M602467M291460M999998N013063N344469O168731O239704
16731A04998292O607809P129448P550739P265421Q306359P889899Q245351Q073480
16723A66066798P389720P508061O216412N511918M087369L139536J751733o1377
$$ plain form
16715 201610170 200307917 197714063 193851802 188233889 181994840 174623374 167195100 159184723
16707 159184723 150973886 142514560 134103360 126154148 118952241 111396473 104423821 98002866
16699 98002866 92003864 86285316 80701746 75882290 71063681 66972543 63203497 59527364
16691 59527364 56041173 53213577 50125383 47383461 44987867 42508844 39971044 38181859
16683 38181859 36692186 34546665 32903827 31353461 30141003 28579052 27315620 26079573
16675 26079573 25287838 24328996 23085327 22293726 21621004 20075704 19666285 19022771 18265922
16666 18265922 17607926 16632292 16389657 15815258 15236186 14544481 14310324 13385632 13081912
16657 13081912 12837425 12167464 12011341 11446601 11063080 10893848 10708877 10317795 9764380
$$ packed form
16715B01610170j302253k593854l862261n617913o239049p371466p428274q010377
16707A59184723q210837q459326q411200p949212p201907p555768o972652o420955
16699I8002866n999002n718548n583570m819456m818609m091138l769046l676133
16691E9527364l486191k827596l088194k741922k395594k479023k537800j789185
16683C8181859j489673k145521j642838j550366j212458j561951j263432j236047
16675B6079573p91735r58842j243669p91601o72722j545300m09419o43514p56849
16666A8265922o57996r75634k42635n74399n79072o91705k34157r24692l03720
16657A3081912k44487o69961j56123n64740l83521j69232j84971l91082n53415
$$ plain form
16648 9764380 9332449 9349981 8988664 8990345 8437052 8225980 8250257 7853107 7945241 7622092
16638 7622092 7480202 7236458 6796408 7071078 6682361 6240959 6329544 6166791 6191551 6036331
16628 6036331 6267139 5964351 5777461 5087155 5453612 5092179 5067816 4892766 4779014 4768958
16618 4768958 4420498 4755526 4090750 4125417 4228389 4190774 4233791 4094490 4439961 3987689
16608 3987689 3820447 3731882 4026022 3383843 3630668 3794632 3436541 3025685 3418492 3229844
16598 3229844 3286225 3315041 3126380 3232115 3172599 2986912 2954884 2638222 2757314 2831181
16588 2831181 2647283 2999693 2404022 2363474 2528367 2498508 2860824 2432630 2378804 2390081
16578 2390081 2340785 2560198 1813749 2306032 1859132 2351222 1809992 1794013 2242687 1929620
$$ packed form
16648I764380m31931J7532l61317J681n53293k11072K4277l97150R2134l23149
16638G622092j41890k43744m40050K74670l88717m41402Q8585j62753K4760j55220
16628F036331K30808l02788j86890o90306L66457l61433k4363j75050j13752j0056
16618D768958l48460L35028o64776L4667J02972l7615M3017j39301L45471m52272
16608C987689j67242q8565K94140o42179K46825J63964l58091m10856L92807j88648
16598C229844N6381K8816j88661J05735n9516j85687l2028l16662J19092P3867
16588B831181j83898L52410n95671m0548J64893k9859L62316m28194n3826J1277
16578B390081m9296K19413p46449M92283m46900M92090n41230j5979M48674l13067
$$ plain form
16568 1929620 1866141 1750823 1905896 1600314 1892438 1952861 1646927 1974459 1848028 1847515
16558 1847515 1850423 1701708 1439152 1666212 1812994 1471879 1468289 1580140 1360674 1505592
16548 1505592 1436263 1429989 1196516 1392488 1184949 1519605 1512667 1306165 1260328 1230967 1354215
16537 1354215 1521776 1090305 1353411 1283805 1473966 1618915 1609305 1358874 1368839 1413524
16527 1413524 1108320 1167991 1228935 1032190 913370 1148364 1009684 1263306 1159735 1146355
16517 1146355 844642 1192349 915043 989193 576771 1097536 1066102 760487 901020 855223
16507 855223 823823 1205656 608585 725404 560243 1012191 714615 577759 357245 705127
16497 705127 750199 790257 868199 990420 941493 816421 943937 737132 746316 1044653 917864
$$ packed form
16568A929620o3479j15318J55073l05582K92124O0423l05934L27532j26431n13
16558A847515K908j48715k62556K27060J46782l41115l590J11851k19466J44918
16548A505592o9329o274k33473J95972k07539L34656o938k06502m5837k9361J23248
16537A354215J67561m31471K63106o9606J90161J44949r610k50431R965M4685
16527A413524l05204N9671O0944j96745j18820K34994j38680K53622j03571j3380
16517A146355l01713L47707k77306P4150m12422N20765l1434l05615J40533m5797
16507H55223l1400L81833n97071J16819j65161M51948k97576j36856k20514L47882
16497G05127M5072M0058P7942J22221m8927j25072J27516k06805R184K98337j26789
$$ plain form
16486 917864 737528 915682 954531 725906 1011483 632170 397853 521849 505619 493162
16476 493162 647296 621546 473858 766232 815902 527712 622187 512338 777248 629547
16466 629547 656432 805161 504564 722169 344476 784343 581129 457372 518079 372475
16456 372475 558618 484276 136779 478839 483804 482983 871284 548759 459908 471448 658129
16445 658129 326466 241681 626186 215758 653738 508572 495933 312280 455506 374665
16435 374665 622084 638959 508734 489475 726630 284407 429725 276793 326089 342450
16425 342450 535632 461245 470146 287118 477858 310329 473911 532702 636118 492705
16415 492705 219037 288153 343986 277298 179226 543259 499655 359668 582520 186127
$$ packed form
16486I17864j80336J78154L8849k28625K85577l79313k34317J23996j6230j2457
16476D93162J54134k5750j47688K92374M9670k88190R4475j09849K64910j47701
16466F29547K6885J48729l00597K17605C44476M39867k03214j23757O0707j45604
16456C72475J86143p4342A36779L42060M965q21L88301l22525q8851J1540J86681
16445F58129C26466q4785L84505B15758M37980j45166j2639j83653J43226q0841
16435C74665K47419J6875j30225j9259K37155B84407J45318j52932M9296J6361
16425C42450J93182p4387Q901j83028J90740j67529J63582N8791J03416j43413
16415D92705B19037O9116N5833o6688r8072L64033m3604j39987K22852A86127
$$ plain form
16404 455218 156500 443321 403814 440025 192734 126707 612814 619599 249486 237946 443435
16393 443435 254899 175643 391062 573601 508491 397545 202944 323607 168823 272264
16383 272264 87588 320763 15428 305934 -190674 270840 289331 448180 173227 271303
16373 271303 231123 169666 187442 310161 214893 111693 250951 613196 318976 226829
16363 226829 148482 337756 95824 282642 363388 116498 275324 17727 352241 327460
16353 327460 174680 362911 244556 314516 62982 -17467 -110747 4338 14517 134546 470942
16342 470942 454318 129383 163807 96292 50967 31049 198959 298673 45862 230295 464549
16331 464549 343759 292284 118027 257409 150831 209363 15338 205236 161718 124238
$$ packed form
16404D55218A56500K86821l9507L6211A92734o6027M86107O785B49486j1540K05489
16393D43435j88536p9256K15419J82539o5110j10946j94601J20663j54784J03441
16383B72264H7588K33175A5428K90506a90674B70840J8491J58849A73227R8076
16373B71303m0180o1457J7776J22719r5268j03200J39258L62245k94220r2147
16363B26829p8347J89274I5824J86818Q0746A16498J58826A7727L34514k4781
16353C27460j52780J88231j18355O9960F2982a7467r3280D338J0179J20029L36396
16342D70942j6624A29383L4424o7515m5325j9918J67910R9714D5862J84433K34254
16331D64549j20790n1475A18027J39382j06578N8532A5338J89898m3518l7480
$$ plain form
16321 124238 234669 314668 203603 288281 314202 -36537 118027 -123324 284342 -189697
16310 -216921 240155 328991 259311 304572 118352 164782 111733 282776 -4278 419872 174339
16298 80714 -40050 -75995 89070 175483 23809 4739 417239 375467 214122 -85960 344879
16286 154737 -149462 -143080 45150 317612 177962 6924 167400 296841 200830 130099 188741
16275 188741 223332 109427 -150630 259766 -307 389988 59838 86832 -100500 168193 75914
16263 6278 97859 72392 -6519 249507 -66585 78579 190251 -241117 99231 -114782 245219
16251 86995 -11300 70525 447962 39562 189194 193219 38433 96295 61357 41838 202800
16240 202800 166348 77804 -48915 -194203 224721 83502 180904 -223076 121854 130281 -169411
$$ packed form
16321A24238J10431P9999j11065Q4678K5921c6537A18027a23324B84342a89697
16310b16921B40155Q8836o9680M5261A18352M6430n3049J71043d278D19872A74339
16298H0714d0050l5945H9070Q6413B3809D739M12500m1772j61345h5960C44879
16286A54737a49462O382D5150K72462j39650F924J60476J29441r6011p0731N8642
16275A88741L4591A09427a50630B59766c07C89988E9838K6994a00500A68193G5914
16263F278R1581k5467f519B49507f6585G8579J11672b41117I9231a14782B45219
16251H6995a1300G0525L77437C9562J49632M025C8433N7862l4938j9519J60962
16240B02800l6452G7804d8915j45288B24721H3502R7402b23076A21854Q427a69411
$$ plain form
16228 212351 95042 330672 136881 -167087 -168 146661 119462 5961 585213 148335 138103
16217 138103 153219 -125708 108195 -25140 205842 79459 -110950 -148270 191362 300062
16207 300062 -77361 239036 105654 104068 213119 -65623 259454 183633 177487 32176 -60965
16195 -23391 462845 45892 36059 -70817 225044 -128340 -301607 47049 -61731 131073 405981
16184 405981 28435 -74908 -75097 45548 211660 123446 100758 241732 231629 -378595 -9722
16172 -313016 -91179 -265879 338003 119928 157998 153396 -72213 -320720 -38956 131213 -150075
16160 -16679 96699 362508 226912 105816 -55669 -40329 154516 -33304 -26126 128426 -63070
16148 3749 15008 -30108 -69461 -60172 136101 -333484 -97284 5495 325585 -281563 -299574
$$ packed form
16228B12351I5042K35630A36881a67087a68A46661k7199E961N79252A48335j0232
16217A38103J5116a25708A08195b5140B05842G9459a10950l7320A91362J08700
16207C00062g7361B39036A05654j586J09051f5623B59454p5821o146C2176f0965
16195b3391D62845D5892r833g0817B25044a28340j73267D7049f1731A31073K74908
16184D05981B8435g4908j89D5548J66112q8214k2688J40974j0103c78595i722
16172c13016i1179j74700C38003A19928L8070m602g2213k48507c8956A31213a50075
16160a6679I6699K65809j35596A05816e5669J5340A54516c3304P178A28426f3070
16148C749J1259c0108l9353R289A36101c33484i7284E495L20090b81563j8011
$$ plain form
16137 -299574 15491 -293396 139050 72004 -226701 18991 333456 -40654 239127 102482
16126 100026 -9510 117104 139590 -124239 22542 118779 225479 68196 167015 93769 -58139
16114 -180520 -40811 276761 -337345 96058 165373 60592 167959 -102897 -3330 -72027 230995
16102 49103 171691 6665 175322 -70653 64943 17521 110964 -125491 -149536 -108279 186752
16090 -206885 151514 -147315 42505 -246560 -294068 -115401 92601 -665 -395651 -232475 46968
16078 61281 177062 147995 23107 150590 163403 159690 -110698 139103 97446 -113598 117205
16066 77568 11416 -45982 -52428 -128988 254718 55138 106687 -109117 -117475 -150109 -108241 -210949
16054 -210949 227616 -189719 232264 -172395 -28973 -256775 -160408 70869 38931 -23685
$$ packed form
16137b99574A5491b93396A39050o7046b26701A8991L14465d0654B39127A02482
16126A00026i510A17104K2486a24239B2542R6237J06700F8196R8819p3246e8139
16114a80520d0811B76761c37345I6058O9315F0592J07367a02897c330o8697B30995
16102D9103J22588F665J68657g0653F4943A7521R3443a25491k4045M1257A86752
16090b06885A51514a47315D2505b46560m7508a15401I2601f65l94986J63176D6968
16078F1281J15781k9067B3107J27483J2813l713a10698A39103m1657a13598A17205
16066G7568A1416d5982o446p6560B54718E5138N1549a09117q358l2634M1868j02708
16054b10949B27616a89719B32264a72395b8973k27802R6367G0869l1938b3685
$$ plain form
16043 -19932 -38406 323622 4438 -284922 166048 -67642 -27449 134359 -36884 -350388 120290
16031 288080 -162164 162467 306745 186397 -130007 238801 -19132 80534 -230838 -45640
16020 -102120 -239567 -318504 70263 175244 -194860 129438 287597 -144679 -47382 -3720
16009 -282882 107327 -233122 -61970 -104130 180205 63914 -166406 -27393 -23945 -378571 235316
15997 15437 -103816 -509392 -333310 62949 -12145 162737 46498 64407 113017 -53313 315117
15985 -83943 178346 99846 12698 304239 46168 -21251 121409 -111793 21909 32822 -289374
15973 121209 -294176 215462 57518 -95483 21754 290949 25301 185445 -67972 -32869 -125505
15962 -125505 277515 -148144 246655 -306785 -158189 -199109 -82444 145281 -139552 157717
$$ packed form
16043a9932j8474C23622D438b84922A66048f7642b7449A34359c6884l13504A20290
16031B88080a62164A62467J44278j20348a30007B38801a9132H0534b30838d5640
16020a02120j37447p8937G0263J04981a94860A29438J58159a44679d7382c720
16009b82882A07327b33122f1970m2160A80205F3914a66406b7393L448l54626B35316
15997A5437a03816m05576J76082F2949a2145A62737D6498J7909M8610e3313C15117
15985h3943A78346p8500A2698K91541D6168b1251A21409a11793B1909J0913b89374
15973A21209b94176B15462E7518i5483B1754K69195B5301J60144f7972c2869r2636
15962a25505B77515a48144B46655c06785J48596m0920h2444A45281a39552A57717
$$ plain form
15951 -112209 99289 -307021 -154007 -201900 -45857 -234762 167661 117592 44883 115080 93211
15940 93211 -88267 54458 -388409 -218236 -279806 -224323 188658 38906 -275650 -72608 63235
15928 -182103 -14710 -74871 -184717 330913 -46852 -93733 -21556 -26653 -4827 -4980 18785 -108942
15915 -6446 -78741 105361 -196291 215280 -22879 84497 -318787 -31657 -58691 -101213 -240903
15904 -240903 -59170 -96837 -80360 -227301 -24395 -130365 99005 94636 -19979 87805 -107093
15892 -96908 62950 -29310 -288304 -16761 -290952 -147172 -70646 -294725 -192893 11553 -216418
15880 -117953 -383497 62691 342803 -136828 -27753 -193262 7012 45853 -118453 26909 10635
15868 -395015 -149579 267931 81625 121229 34380 39129 -115956 -80607 -110116 -413717 257399
$$ packed form
15951a12209I9289c07021J53014m7893d5857j88905A67661n0069D4883P0197k1869
15940I3211h8267E4458c88409J70173o1570N5483A88658C8906b75650g2608F3235
15928a82103a4710o0161j09846C30913d6852m6881b1556n097d827j53A8785a08942
15915f446p2295A05361a96291B15280b2879H4497c18787c1657k7034m2522j39690
15904b40903e9170l7667J6477j46941b4395j05970I9005m369a9979H7805a07093
15892i6908F2950b9310k58994a6761k74191J43780g0646k24079J01832A1553b16418
15880a17953k65544F2691K80112a36828b7753j65509G012L8841a18453B6909A0635
15868c95015a49579B67931H1625L9604C4380M749a15956L5349k9509l03601B57399
$$ plain form
15856 -273109 -7177 -228592 -148625 -82924 2074 -94295 4036 171267 -74454 28337 35404 -49344
15843 16332 138113 38433 -134776 -201823 -282704 -273992 117951 -5362 -25989 -21934 97339 -1915
15830 -49321 -211922 -39259 133067 104389 -350278 -74631 41726 -151501 -166002 -247788 -194189
15819 -194189 -187918 -159347 -217639 -108072 144657 -191578 -106968 -77981 -949799 -172071 -184142
15808 -184142 -96455 -390219 -199035 -226354 30836 195666 164121 -52292 61319 -388620 -128884
15796 -137427 -55194 -162674 -4978 163114 -118264 -353879 -233882 -279738 -3413 67684 -2714
15784 95555 -357994 -187041 -211902 76813 -122632 -199699 -276474 -104567 -178030 248720 63991
15772 -148168 -50224 -40048 -287012 -245325 -118196 185210 -66118 -135648 51087 99920 54269
$$ packed form
15856b73109g177k21415P9967O5701B074i4295D036J67231g4454B8337P067d9344
15843A6332J21781C8433a34776o7047q0881Q712A17951e362k0627M055I7339a915
15830d9321j62601c9259A33067k8678c50278g4631D1726a51501j4501q1786N3599
15819a94189O271K8571n8292a08072A44657a91578Q4610K8987q71818a72071j2071
15808a84142Q7687k93764J91184k7319C0836J64830l1545e2292F1319c88620a28884
15796a37427e5194j07480d978A63114a18264k35615J19997m5856c413F7684b714
15784I5555c57994J70953k4861G6813a22632p7067p6775a04567p3463B48720F3991
15772a48168e0224J0176k46964M1687a18196A85210f6118o9530E1087M8833m5651
$$ plain form
15761 54269 -303314 100519 -177465 175009 -66298 116241 -89075 369958 213627 -60122
15750 -104847 65449 276161 -77722 90528 5819 -110796 -90612 -18796 46620 172456 -459567
15738 -64864 175921 258660 28848 -70677 -160480 -288214 -103773 -93095 353501 103053 -100519
15726 -248689 -213630 94104 -341417 146518 224276 -102326 111052 -19511 201661 -204191
15715 84577 -162136 58114 101792 -167119 -66450 32389 23867 -36379 -35198 -219311 -194989
15704 -194989 -36977 -238930 302395 64160 -51822 -111295 132874 313982 -196238 2326 -33256
15692 44382 43329 68549 103742 -174660 5363 -14676 53263 -123505 -287810 112603 -83214
15680 -19498 371389 -147718 286683 -14075 -178655 -4359 4375 60802 132772 -5787 45364
$$ packed form
15761E4269c03314A00519a77465A75009f6298A16241h9075C69958j56331f0122
15750a04847F5449K10712g7722I0528E819a10796K0184a8796D6620J25836d59567
15738f4864A75921Q2739B8848g0677q9803j27734a03773J0678C53501A03053a00519
15726b48689L5059I4104c41417A46518P7758a02326A11052a9511B01661b04191
15715H4577a62136E8114M3678a67119f6450C2389q522c6379J181j84113K4322
15704a94989c6977k01953C02395F4160e1822n9473A32874J81108a96238B326c3256
15692D4382j053K5220L5193a74660E363a4676E3263a23505j64305A12603h3214
15680a9498C71389a47718B86683a4075j64580d359D375N6427P1970e787D5364
$$ plain form
15668 62658 -244153 -199900 72475 126090 -362438 -368318 -124568 94867 295344 -166443 127426
15656 51118 117523 117789 -52315 -188444 146902 292388 -134956 320645 -106731 79987 31200
15644 271402 25218 -28419 -57228 273008 59513 28178 -2159 -381438 -290720 58793 -252287
15632 -160444 -220687 -187781 -129276 202090 421738 61285 432566 -223258 -7221 -222361 -40174
15620 -290752 -359046 -101827 -163051 -40580 173612 58837 -173591 14734 -253572 -380075
15610 -380075 42 -114619 -222121 89610 183116 -17368 -50458 3569 -24250 -77931 -52834 -300199
15598 -300199 -8394 -155988 -37203 139119 -47935 -258011 135067 -284040 151700 104487
15588 104487 -206810 106571 8688 -165721 -63100 -151387 177597 336586 44486 -245464
$$ packed form
15668F2658b44153M4253G2475N3615c62438n880a24568I4867K00477a66443A27426
15656E1118O6405K66e2315j36129A46902J45486a34956C20645a06731G9987C1200
15644B71402B5218b8419k8809B73008E9513B8178b159l79279R0718E8793b52287
15632a60444o0243L2906N8505B02090K19648F1285L71281b23258g221k15140d0174
15620b90752o8294a01827o1224d0580A73612E8837a73591A4734b53572j26503
15610c80075D2a14619j07502H9610R3506a7368l3090C569b4250n3681K5097k47365
15598c00199h394j47594c7203A39119d7935k10076A35067b84040A51700m7213
15588A04487b06810A06571H688a65721f3100q8287A77597J58989D4486b45464
$$ plain form
15577 275484 199742 290035 121129 -76487 -256547 -322241 -299758 1816 -50722 249055 -228325
15565 -113377 -112322 -221835 -142187 73238 -62881 -134493 -110636 17526 227109 150211 -153595
15553 48460 -141245 124836 -3762 -84087 265503 160562 -234257 -120876 19236 154978
15543 154978 -137213 -248148 38029 2436 -1875 51213 175373 -59882 -135470 -160231 -156317
15532 -156317 129638 223853 -182800 42193 108973 57991 232982 -387410 102496 -4562 105474
15520 19205 60613 -30499 -41537 29439 -85427 -232799 125357 -193554 -21523 395920 -287932
15508 -216223 -52510 236806 -197993 86882 -180667 -1810 -226912 -230169 -154673 196286 -166732
15496 20094 -144322 382722 73110 59225 -121693 -190114 -211087 -39346 -139270 -32526 -118108
$$ packed form
15577B75484p5742R0293A21129g6487j80060o5694K2483A816e0722B49055b28325
15565a13377J055j09513P9648G3238f2881p1612K3857A7526K09583p6898a53595
15553D8460a41245A24836c762q0325B65503j04941b34257J13381A9236J35742
15543A54978a37213j10935C8029B436a875E1213J24160e9882p5588k4761L914
15532a56317A29638R4215a82800D2193O6780n0982J74991c87410A02496d562A05474
15520A9205M1408c0499j1038B9439h5427j47372A25357a93554b1523C95920b87932
15508b16223e2510B36806a97993H6882a80667a810k25102l257P5496A96286a66732
15496B0094a44322C82722G3110j3885a21693o8421k0973c9346r9924c2526q5582
$$ plain form
15485 -118108 -726 106473 -121041 324347 -274353 -177664 -181431 28657 -201246 91322 -254794
15473 -361368 110627 -234555 -133585 -159391 -17755 -474745 -94032 108213 -79706 -212040
15463 -212040 -37691 -225025 -121875 -37997 -54451 146909 -221401 336117 379822 -98303
15452 215920 363700 44538 -64643 208491 82091 -166987 -20070 -119056 -3151 -70264 -4346
15440 -3864 -93635 -230628 -185511 129055 -287304 74509 225185 7773 33056 -83408 235411
15428 -7823 332039 -23786 158543 3226 12655 -102454 -265375 225526 -183504 51245 11506
15416 -238360 -3096 140033 88782 -3682 103180 173855 -211211 -63268 -299602 -96314 64058
15404 15605 99360 152855 58959 177246 -221780 -13457 436750 -208714 -64208 238213 110792
$$ packed form
15485a18108g26A06473a21041C24347b74353R6689l767B8657b01246I1322b54794
15473c61368A10627b34555J00970k5806a7755m56990i4032A08213g9706j32334
15463b12040c7691j87334J03150c7997j6454A46909b21401C36117M3705i8303
15452B15920J47780D4538f4643B08491H2091a66987b0070r8986c151o7113d346
15440c864q9771j36993M5117A29055b87304G4509J50676G773K5283h3408B35411
15428g823C32039b3786A58543C226R429a02454j62921B25526a83504E1245A1506
15416b38360c096A40033n1251c682A03180P0675b11211f3268k36334i6314F4058
15404A5605Q3755N3495E8959J18287b21780a3457D36750b08714f4208B38213A10792
$$ plain form
15392 154474 -60324 -62947 -27950 92881 -13682 104740 180786 -261909 -3704 171616 -89534
15380 -39810 63375 -219531 340838 225429 -81930 134072 -142935 -131694 -79081 -163010 74474
15368 292983 361379 -129868 272884 27428 80278 109763 -58535 369735 39504 64977 -18280
15356 37022 -143240 -238794 113903 -23000 -198370 -462460 29413 -192812 -104283 192944
15345 274366 -7962 340000 156290 -149760 -71376 216958 -8390 -227419 83197 214265 360286
15334 360286 -19927 32178 11926 -33362 -144100 115320 -52136 80835 119511 126301 124044
15323 124044 33818 -46648 -57414 -142932 -306010 174777 -19186 55614 54849 37676 422328
15312 422328 -35655 18082 200902 -10214 -267158 27985 -61477 -92555 -302402 -258696 231661
$$ packed form
15392A54474f0324k623b7950I2881a3682A04740P6046b61909c704A71616h9534
15380c9810F3375b19531C40838j15409h1930A34072a42935J1241N2613q3929G4474
15368B92983O8396a29868B72884B7428N2850K9485e8535C69735C9504K5473a8280
15356C7022a43240r5554A13903b3000j75370k64090B9413a92812Q8529A92944
15345B74366g962C40000A56290a49760g1376B16958h390k19029H3197J31068J46021
15334C60286a9927C2178A1926c3362j10738A15320e2136H0835L8676O790k257
15323A24044C3818d6648j0766q5518j63078A74777a9186E5614p65j7173L84652
15312D22328c5655A8082J82820a0214k56944B7985f1477l1078k09847M3706B31661
$$ plain form
15300 166818 -164069 -2859 -118124 -61989 120324 -53735 111453 46306 -226231 79070 38478
15288 283592 210531 135386 -272064 2490 -122682 60165 -417480 -35265 -168159 -311262 57722
15276 -141067 352039 121729 -270650 249715 301477 -145608 -347663 333931 71685 -172962
15265 13424 -4224 82119 -133825 58236 346706 -158874 293323 147691 341505 378332 -8692
15253 304984 367997 295422 278817 -228838 58895 558226 1349887 1353104 1194765 1838056 566447
15241 16949 389934 216741 -44740 22252 224029 95430 570456 44164 294164 169506
15231 169506 -267607 257610 180196 137174 217537 46184 90957 491326 15506 59236 52726
15220 52726 253876 343178 33019 168509 -113288 269733 156539 104947 91649 13857 138187
$$ packed form
15300A66818a64069b859j15265N6135A20324e3735A11453D6306b26231G9070C8478
15288B83592p3061p5145b72064B490a22682F0165d17480c5265j32894j43103E7722
15276a41067C52039A21729b70650B49715N1762a45608k02055C33931G1685a72962
15265A3424d224H2119a33825E8236K88470a58874B93323j45632J93814L6827h692
15253C04984O3013p2575j6605b28838E8895M99331P91661L217j58339O43291E66447
15241A6949L72985j73193d4740B2252K01777I5430M75026D4164K50000j24658
15231A69506b67607B57610p7414m3022Q0363D6184M4773M00369A5506M3730o510
15220E2726K01150Q9302C3019J35490a13288B69733j13194n1592j3298A3857J24330
$$ plain form
15209 138187 31407 -81437 -66409 -78549 132162 14852 -50699 7135 99186 181857 -26299
15197 -18976 20693 -167056 144715 143326 11371 -60329 156396 125766 290088 131406 254654
15186 254654 -38674 69457 249814 -116131 -211249 245580 23990 40668 105002 175446 191008
15175 191008 183498 145784 -250700 50916 73667 143362 225247 296407 113225 113302 -93303 399823
15162 74627 113351 57922 -9171 -89121 195958 162263 167896 78725 160024 -43478 146014 337949
15150 337949 173510 -263399 362691 257015 -188233 128037 16379 355493 321233 256730
15140 256730 357304 -286995 -65334 90853 194649 114773 4838 -161066 407429 50366 62997
15129 62997 138677 257813 87725 83630 238797 158504 40796 -76272 666981 157289 -111746
$$ packed form
15209A38187C1407h1437J5028j2140A32162A4852e0699G135R2051Q2671b6299
15197a8976B0693a67056A44715j389A1371f0329A56396l0630J64322A31406J23248
15186B54654c8674F9457J80357a16131r5118B45580B3990J6678O4334P0444J5562
15175A91008p510l7714b50700E0916K2751O9695Q1885P1160A13225P7i3303C99823
15162G4627L8724n5429i171p9950A95958l3695N633G8725Q1299d3478A46014J91935
15150C37949j64439b63399C62691j05676a88233A28037A6379L39114l4260o4503
15140B56730J00574b86995f5334I0853J03796p9876D838a61066D07429E0366J2631
15129F2997P5680J19136H7725m095J55167q0293D0796g6272F66981A57289a11746
$$ plain form
15117 21925 191534 144879 152942 -190628 35318 47910 176443 -21804 85539 98126 -148119
15105 325593 440622 321565 3683 -34790 213922 205981 128987 175919 114174 359806 187234
15094 187234 20899 78632 401936 246418 425482 -70353 -26597 423272 -146594 9440 4208
15082 166025 86887 21588 151595 122747 142397 -43164 -132244 106078 -40640 87644 191360
15071 191360 241578 33435 369017 104800 109777 9468 104143 -123454 187118 158268 277963
15060 277963 59002 -1141 322545 21661 -471932 335694 311413 7003 31513 149830 -126250
15048 31207 271405 -54984 -51248 217630 201059 164521 139352 326304 276973 -207690 86505
15036 212204 237217 272555 398347 -79860 191961 124039 -69273 366374 355680 15962 121403
$$ packed form
15117B1925J69609m6655Q063a90628C5318J2592J28533b1804H5539J2587a48119
15105C25593J15029j19057C683c4790B13922p941p6994M6932o1745K45632j72572
15094A87234B0899N7733L23304j55518J79064g0353b6597D23272a46594I440D208
15082A66025p9138B1588J30007k8848J9650d3164q9080A06078d0640H7644J03716
15071A91360N0218C3435L35582A04800M977I468R4675a23454A87118k8850J19695
15060B77963E9002a141C22545B1661d71932C35694k4281G003K4510J18317a26250
15048C1207K40198e4984L736B17630j6571l6538k5169J86952m9331b07690H6505
15036B12204K5013L5338J25792g9860A91961o7922f9273C66374j0694A5962J05441
$$ plain form
15025 121403 139136 21670 76061 549560 533408 264873 -81122 65063 331745 78755 319377
15014 319377 34640 229715 308774 313193 -4630 541173 44323 69374 2947 357290 257979
15003 257979 317010 -124332 87621 339406 376754 287731 159723 378536 219756 99415
14992 369812 229450 273152 194981 193118 215957 394535 71449 -25528 72625 -87078 66665
14980 240596 264684 237655 261253 135763 123584 106104 357911 156567 4682 453939 492454
14969 492454 219040 479855 295461 266354 126264 512159 528680 244218 193203 227310
14959 227310 519453 329146 129122 225504 280797 162660 242815 56937 284657 81579
14948 280339 361172 -14280 686 56357 -30747 529790 596941 447634 438574 545585 116979
$$ packed form
15025A21403J7733B1670N4391M73499j6152B64873h1122F5063K66682G8755K40622
15014C19377C4640J95075P9059M419d630E41173D4323K5051B947L54343r9311
15003B57979N9031a24332H7621K51785L7348q9023j28008K18813j58780I9415
14992C69812j40362M3702p8171j863K2839J78578G1449b5528G2625h7078F6665
14980B40596K4088k7029K3598j25490j2179j7480K51807A56567D682M49257L8515
14969D92454B19040K60815j84394k9107A26264L85895J6521B44218n1015L4107
14959B27310K92143j90307A29122R6382N5293j18137Q0155E6937K27720H1579
14948B80339Q0833a4280F86N5671c0747E29790O7151j49307r060J07011A16979
$$ plain form
14936 253657 330449 276363 243460 337041 546200 232338 89935 329141 273538 531522 514022
14925 514022 483766 282506 512793 310822 -114777 103548 427013 371391 313050 177314
14915 177314 557625 509203 236251 406624 313902 271096 452322 271318 151771 -4967
14904 130655 235132 254814 75391 291928 352075 171591 50993 319267 258031 289265 349063
14893 349063 473027 202756 520082 539224 263803 304561 240380 -1825 189356 138709 688766
14882 688766 549737 414201 348146 165920 491843 543350 234512 455291 512723 415294
14872 415294 341225 322027 304918 -40862 318116 372263 611442 215663 523894 381607
14862 381607 410436 343943 280727 504756 488037 426995 603685 189598 779137 454552
$$ packed form
14936B53657P6792n4086l2903R3581K09159B32338H9935K39206n5603K57984j7500
14925E14022l0256k01260K30287k01971a14777A03548L23465n5622n8341j35736
14915A77314L80311m8422B36251J70373r2722m2806J81226j81004j19547d967
14904A30655J04477J9682G5391K16537O0147A71591E0993K68274o1236L1234N9798
14893C49063J23964B02756L17326J9142B63803M0758o4181a825A89356n0647N50057
14882F88766j39029j35536o6055A65920L25923N1507B34512K20779N7432r7429
14872D15294p4069j9198j7109d0862C18116N4147K39179B15663L08231j42287
14862C81607K8829o6493o3216K24029j6719o1042J76690A89598N89539l24585
$$ plain form
14852 454552 385269 295202 517732 598106 530656 451591 372406 475988 448131 656024 307625
14840 575397 623022 365098 351838 164713 428464 158030 292223 280913 324655 393961
14830 393961 216674 557144 504575 602679 520446 150623 521348 743965 589027 332238
14820 332238 529806 709110 593312 447489 214440 595680 408084 544946 382980 233133
14810 233133 487627 368920 579942 390113 333774 424654 671148 491902 605248 455057
14800 455057 645736 433050 477329 340007 686068 387644 445208 712941 371277 493122
14790 493122 619445 730683 364190 423800 465177 439107 450605 506932 670176 824078
14780 824078 492449 438403 483467 294328 378678 601388 641949 707157 432099 656874
$$ packed form
14852D54552o9283r0067K22530Q0374o7450p9065p9185J03582k7857K07893C07625
14840E75397M7625k57924j3260A64713K63751A58030J34193j1310M3742O9306
14830C93961j77287L40470n2569R8104q2233A50623L70725K22617j54938k56789
14820C32238J97568J79304j15798j45823B14440L81240j87596J36862j61966j49847
14810B33133K54494j18707K11022j89829n6339R0880K46494j79246J13346j50191
14800D55057J90679k12686M4279j37322L46061k98424N7564K67733l41664J21845
14790D93122J26323J11238C64190N9610M1377k6070J1498N6327J63244J53902
14780H24078l31629n4046M5064j89139Q4350K22710M0561O5208k75058K24775
$$ plain form
14770 656874 294014 722664 527081 897911 383591 740541 572353 874810 267165 758823
14760 758823 442955 803867 606285 606675 619973 903030 562934 715051 563031 503219
14750 503219 735115 463290 778920 471217 732503 768455 561146 1006232 816715 736415
14740 736415 967499 744576 691644 770807 296277 746244 978297 618433 627757 1048176
14730 1048176 511752 797517 543033 877704 860311 719455 769792 793088 1340349 786369
14720 786369 1045678 948011 926049 603197 973982 604554 905432 856306 1195166 522571
14709 372122 1015181 768411 985724 1071810 970259 590442 1032879 628109 916794 935693
14699 935693 755097 907072 1150132 858426 833972 937955 784149 1178410 882716 856916
$$ packed form
14770F56874B94014M28650j95583L70830C83591L56950j68188L02457B67165M91658
14760G58823l15868L60912j97582L90J3298K83057l40096J52117j52020n9812
14750E03219K31896k71825L15630l07703K61286L5952k07309M45086j89517q0300
14740G36415K31084k22923n2932P9163B96277M49967K32053l59864R324M20419
14730A048176E11752K85765k54484L34671j7393j40856N0337K3296N47261n53980
14720G86369K59309r7667k1962l22852L70785l69428L00878m9126L38860E22571
14709C72122O43059k46770K17313Q6086j01551l79817M42437m04770K88685J8899
14699I35693j80596J51975K43060k91706k4454J03983j53806L94261k95694k5800
$$ plain form
14689 856916 881433 1099386 1021321 959162 779303 1116013 971281 1121657 963749 880049
14679 880049 822491 924186 914447 1111600 1135791 950221 1012567 1168387 784389 962514
14669 962514 1259490 1374265 656766 814971 1238691 978817 812670 953001 1008005 1407212
14659 1407212 1661694 914063 1564663 884426 1412752 1465224 1111182 1094781 1121308 1101458
14649 1101458 1229428 1041169 1324110 1272929 1411704 1214617 1237218 1045986 1193013 1590977
14639 1590977 1561594 1062197 1372066 1280349 1349232 1275128 993386 1032433 1341543 1305205
14629 1305205 1158424 1592701 1161158 1423415 1556474 1054633 1591242 1414023 1409283 1358928
14619 1358928 1331988 1693955 1624078 1606161 1334489 1494115 1419811 1311335 1288530 1648574
$$ packed form
14689H56916K4517K17953p8065o2159j79859L36710j44732J50376j57908q3700
14679H80049n7558J01695r739J97153K4191j85570O2346J55820l83998J78125
14669I62514K96976J14775F56766J58205M23720k59874j66147J40331N5004L99207
14659A407212K54482p47631O50600o80237N28326N2472l54042j6401K6527j9850
14649A101458J27970j88259K82941n1181J38775j97087K2601j91232J47027L97964
14639A590977k9383m99397L09869r1717O8883p4104k81742L9047L09110l6338
14629A305205j46781M34277m31543K62257J33059n01841N36609j77219m740n0355
14619A358928k6940L61967o9877j7917k71672J59626p4304j08476k2805L60044
$$ plain form
14609 1648574 1367357 1492602 1502869 1537958 1515771 1851245 1918990 1602585 1620513 1826253
14599 1826253 1802173 1387515 1668102 2112847 1646874 1958281 1592444 1558235 1728624 1882601
14589 1882601 1764167 1922022 2194376 1753713 1786931 1929886 1981242 1885990 1990662 1686186
14579 1686186 2060653 1929860 2118014 2055553 2054715 1997287 2168867 2568471 2345282 2315426
14569 2315426 1912469 2369377 2227890 2337435 2668352 2396294 2453989 2501362 2644735 2799957
14559 2799957 2767714 3084029 3181351 3459177 3374795 3633717 3731194 4478812 4655758 5701488
14549 5701488 8120586 11800939 20697307 38725533 46088401 19360779 10634559 5693052
14541 5693052 3197912 2674928 2264098 2020245 1849942 1787462 1866619 2189627 2263274 2065397
$$ packed form
14609A648574k81217J25245J0267L5089k2187L35474O7745l16405J7928K05740
14599A826253k4080m14658K80587M44745m65973L11407l65837l4209J70389J53977
14589A882601j18434J57855K72354m40663L3218J42955N1356r5252J04672l04476
14579A686186L74467j30793J88154o2461q38n7428J71580L99604k23189k9856
14569B315426m02957M56908j41487J09545L30917k72058N7695M7373J43373J55222
14559B799957l2243L16315R7322K77826q4382K58922R7477P47618J76946J045730
14549E701488K419098L680353Q896368J8028226P362868A9360779q726220m941507
14541E693052k495140n22984m10830k43853j70303o2480P9157L23008P3647j97877
$$ plain form
14531 2065397 2001099 1966347 2260182 2363906 2321761 2421954 2578278 2586101 2236471 2654303
14521 2654303 2517447 2670355 2379827 2477276 2686348 2692104 2435572 2550418 2703595 2631235
14511 2631235 2818041 3036919 2907966 2716269 2865153 2941035 2892595 3115317 3048511 3276267
14501 3276267 3309275 3415552 3222588 3179687 3388403 2945496 3184097 3120471 3331678 3590890
14491 3590890 3623645 3555976 3299910 3472884 3498246 3365075 3745279 3748814 3628807 3606199
14481 3606199 3683604 3427159 3893403 4079328 3982127 3904411 4130224 3985703 3786027 3885069
14471 3885069 4398924 4131537 4359487 4257563 4405007 4522112 4344657 4609973 4699540 4716027
14461 4716027 4878291 4453593 4945556 5110114 4861356 4959353 4996444 5227836 5068800 5310236
$$ packed form
14531B065397o4298l4752K93835J03724m2145J00193J56324P823l49630M17832
14521B654303j36856J52908k90528R7449K09072N756k56532J14846J53177p2360
14511B631235J86806K18878j28953j91697J48884P5882m8440K22722o6806K27756
14501C276267L3008J06277j92964m2901K08716m42907K38601o3626K11207K59212
14491C590890L2755o7669k56066J72974K5362j33171L80204L535j20007k2608
14481C606199P7405k56445M66244J85925r7201p7716K25813j44521j99676R9042
14471C885069N13855k67387K27950j01924J47444J17105j77455K65316Q9567J6487
14461D716027J62264m24698M91963J64558k48758R7997L7091K31392j59036K41436
$$ plain form
14451 5310236 5328628 5682564 5287932 5510802 5616459 5307068 5508310 5946468 5477108 5763583
14441 5763583 6246377 6245301 6057258 6129987 6031230 6396324 6250904 6490236 6566850 6693931
14431 6693931 6483947 6800300 7008329 7145660 7239951 7130808 7244113 7420682 7131072 7566936
14421 7566936 7615315 7573792 8101240 7738368 8166794 8217671 8139449 8628842 8870175 8650613
14411 8650613 8627933 9036249 8931779 9492757 9232478 9262066 9645441 9742469 10103473 10199138
14401 10199138 10456695 10735389 10696778 10703569 10863704 11253708 11520330 11509944 11338360 11641283
14391 11641283 12240601 12361400 12303930 12542946 12852307 13041438 13168427 13568550 13861417
14382 13861417 14222765 14228589 14597945 15205344 15271544 15220706 15697774 15859156 16196271 16837428
$$ packed form
14451E310236J8392L53936l94632K22870J05657l09391K01242M38158m69360K86475
14441E763583M82794j076j88043P2729r8757L65094j45420K39332P6614J27081
14431F693931k09984L16353K08029J37331R4291j09143J13305J76569k89610M35864
14421G566936M8379m1523N27448l62872M28426N0877p8222M89393K41333k19562
14411H650613k2680M08316j04470N60978k60279K9588L83375R7028L61004R5665
14401A0199138K57557K78694l8611O791J60135L90004K66622j0386j71584L02923
14391A1641283N99318J20799n7470K39016L09361J89131J26989M00123K92867
14382A3861417L61348N824L69356O07399O6200n0838M77068J61382L37115O41157
$$ plain form
14372 16837428 17031942 17246493 17412242 17761133 18215568 18469650 19025635 19579190 19740539
14363 19740539 20456754 20571941 21203581 21515554 22554911 22553594 23385456 23786128 24259509
14354 24259509 24952978 25679688 25854769 26351328 27389318 28284133 28619430 29430997 30120905
14345 30120905 30681737 31913478 32323660 32981407 33958406 35171746 35911024 37244679 38355740
14336 38355740 39038925 40060362 41929680 42781238 44390281 45638597 46691868 48064032
14328 48064032 49880539 51397886 53077725 55003778 56813615 58681664 60565692 62489579
14320 62489579 64795542 67450157 69846934 72458516 75309121 77970680 81234425 84300728
14312 84300728 87646637 91083140 94939880 98978728 103330252 107507883 112408433 117569786
$$ packed form
14372A6837428J94514K14551J65749L48891M54435K54082N55985N53555J61349
14363A9740539P16215J15187O31640L11973J039357j317Q31862M00672M73381
14354B4259509O93469P26710J75081M96559J037990Q94815L35297Q11567O89908
14345C0120905N60832J231741M10182O57747R76999J213340P39278J333655J111061
14336C8355740O83185J021437J869318Q51558J609043J248316J053271J372164
14328D8064032J816507J517347J679839J926053J809837J868049J884028J923887
14320F2489579K305963K654615K396777K611582K850605K661559L263745L066303
14312H4300728L345909L436503L856740M038848M351524M177631M900550N161353
$$ plain form
14304 117569786 122823374 127979139 134459364 140342645 147349945 154789574 162057279 170264195
14296 170264195 178398499 187603732 197107366 207225935 217878338 229116997 240625217
14289 240625217 253208492 266073378 279670359 293528360 307711318 322653388 337343501
14282 337343501 352187333 367030896 381565792 395327998 408549545 420970056 432002832
14275 432002832 441916216 449884076 455762272 457929883 457643700 457055292 457339046 455144682
14267 455144682 449483339 441995463 433006316 421984337 409958005 396520019 382130903
14260 382130903 367104835 351615701 335922497 320647471 305534566 290808314 277281102
14253 277281102 264344649 251223521 238846740 226928395 215532769 204818397 194727315
$$ packed form
14304A17569786N253588N155765O480225N883281P007300P439629P267705Q206916
14296A70264195Q134304R205233R503634J0118569J0652403J1238659J1508220
14289B40625217J2583275J2864886J3596981J3858001J4182958J4942070J4690113
14282C37343501J4843832J4843563J4534896J3762206J3221547J2420511J1032776
14275D32002832R913384P967860N878196K167611k86183n88408K83754k194364
14267D55144682n661343p487876q989147j1021979j2026332j3437986j4389116
14260C82130903j5026068j5489134j5693204j5275026j5112905j4726252j3527212
14253B77281102j2936453j3121128j2376781j1918345j1395626j0714372j0091082
$$ plain form
14246 194727315 185254448 176321081 168309435 159980594 152366722 145469318 138753405 132590096
14238 132590096 127222383 121369060 116390215 111405401 106506661 101952046 98013828 94583164
14230 94583164 90651952 86776261 83528517 80029831 77399307 74385105 71705528 69213111
14222 69213111 67109282 64430031 62517706 60163654 58113412 56659841 54390753 52549044
14214 52549044 51471442 50060202 48658051 46885935 44968357 43826263 42926319 42252228
14206 42252228 41066877 39802976 38455419 37369396 36253576 35460341 34909455 33861743
14198 33861743 32929766 31702100 31116464 30391026 29608738 28845923 28435294 27408027 26539075
14189 26539075 25886885 25181718 25058915 24267918 23647788 23230392 22947419 22393695 21797989
$$ packed form
14246A94727315r472867q933367q011646q328841p613872o897404o715913o163309
14238A32590096n367713n853323m978845m984814m898740m554615l938218l430664
14230I4583164l931212l875691l247744l498686k630524l014202k679577k492417
14222F9213111k103829k679251j912325k354052k050242j453571k269088j841709
14214E2549044j077602j411240j402151j772116j917578j142094q99944o74091
14206D2252228j185351j263901j347557j086023j115820p93235n50886j047712
14198C3861743r31977j227666n85636p25438p82288p62815m10629j027267q68952
14189B6539075o52190p05167j22803p90997o20130m17396k82973n53724n95706
$$ plain form
14180 21797989 21404705 20925335 20994782 19724898 19584359 19139244 18821598 18653781 18212498
14171 18212498 17639854 17369158 17255128 16642538 16543869 16166943 16000459 15583189 15587208 14890368
14161 14890368 14724151 14749267 14463625 14064657 13826514 13876393 13554011 13106464 12714928 12617598
14151 12617598 12736562 12314121 12091501 11936049 11577891 11541717 11291715 11080724 10880933
14142 10880933 10991606 10780149 10468314 10121146 10131215 10087834 9818544 9514077 9479472 9681936
14132 9681936 9498806 9062173 9311525 8466547 8642705 8797179 8696003 8351188 8367886 8440257
14122 8440257 8199797 7755223 8118999 8065392 7823899 7648031 7366655 7247500 7267753 7296943
14112 7296943 7056632 6746309 7076201 6780936 6584916 6778198 6465656 6307250 6836112
$$ packed form
14180B1797989l93284m79370O9447j269884j40539m45115l17646j67817m41283
14171A8212498n72644k70696j14030o12590r8669l76926j66484m17270M019o96840
14161A4890368j66217K5116k85642l98968k38143M9879l22382m47547l91536r7330
14151A2617598J18964m22441k22620j55452l58158l6174k50002k10991j99791
14142A0880933J10673k11457l11835l47168J0069m3381k69290l04467l4605K02464
14132I681936j83130m36633K49352q44978J76158J54474j01176l44815J6698P2371
14122H440257k40460m44574L63776n3607k41493j75868k81376j19155K0253K9190
14112G296943k40311l10323L29892k95265j96020J93282l12542j58406N28862
$$ plain form
14103 6836112 6463615 6129678 6029621 6033745 6084066 5927051 5997250 5806137 5851026 5723706
14093 5723706 5774425 5854674 5392557 5529233 5399628 5431988 5171264 5280275 5015072 4948042
14083 4948042 4954678 5120233 5199587 4848652 4864045 4766063 4360580 4628931 4676315 4804296
14073 4804296 4309589 4430008 4438187 4495934 4191941 4455681 4187649 4078954 4412192 4033097
14063 4033097 4439736 4070434 4038991 3884663 3903179 4178576 4272645 4063132 3857361 4033984
14053 4033984 3492044 3555729 3633597 3344495 3440311 3643348 3805669 3066529 3454895 3352973
14043 3352973 3375651 3404768 3488085 3214502 3392691 2893915 3268631 2970323 3257821 3240126
14033 3240126 3131562 3015305 3205562 3065168 2894140 2880522 3025620 3028865 2848285 2719800
$$ packed form
14103F836112l72497l33937j00057M124N0321j57015P0199j91113M4889j27320
14093E723706N0719Q0249m62117J36676j29605L2360k60724J09011k65203o7030
14083D948042O636J65555P9354l50935J5393r7982m05483K68351M7384J27981
14073D804296m94707J20419Q179N7747l03993K63740k68032j08695L33238l79095
14063D033097M06639l69302l1443j54328J8516K75397R4069k09513k05771J76623
14053D033984n41940O3685P7868k89102R5816K03037J62321p39140L88366j01922
14043C352973K2678K9117Q3317k73583J78189m98776L74716k98308K87498j7695
14033C240126j08564j16257J90257j40394j71028j3618J45098L245j80580j28485
$$ plain form
14023 2719800 2910075 2779485 2774626 2670809 2540475 2695437 2587378 2700404 2574936 2190490
14013 2190490 2487736 2231208 2197548 2373875 2465534 2194808 2580662 2192036 2250096 2242500
14003 2242500 2024889 2291021 1984592 2229494 2368771 2066571 2185801 1994700 2058815 2147910
13993 2147910 2004875 2150729 2428092 2746096 3874264 6397341 13940755 31833340 47728989
13984 47728989 24528376 12103225 7742004 5761262 4749402 4057782 3678169 3303426
13976 3303426 3296195 2762026 2746561 2879869 2770476 2568020 2550333 2257406 2572769 2141278
13966 2141278 2080493 2153719 2234799 2310998 2110331 2133413 2162271 1949944 2067342 2310184
13956 2310184 1951334 2052010 1911614 1878788 1943083 2247558 2007773 1726099 1851889 1892536
$$ packed form
14023B719800J90275j30590m859j03817j30334J54962j08059J13026j25468l84446
14013B190490K97246k56528l3660J76327R1659k70726L85854l88626N8060p596
14003B242500k17611K66132l06429K44902J39277l02200J19230j91101O4115Q9095
13993B147910j43035J45854K77363L18004J128168K523077P543414J7892585J5895649
13984D7728989k3200613A2103225m361221j980742j011860o91620l79613l74743
13976C303426p231n34169j5465J33308j09393k02456j7687k92927L15363m31491
13966B141278o0785P3226Q1080P6199k00667K3082K8858k12327J17398K42842
13956B310184l58850J00676j40396l2826O4295L04475k39785k81674J25790M0647
$$ plain form
13946 1892536 1952966 1744688 1857370 1991444 2031608 1723025 2020887 1688456 1580582 1551321
13936 1551321 1847160 1772323 1917656 1888421 1623058 1448516 1580991 1461196 1521204 1338882
13926 1338882 1553828 1320431 1992234 1605230 1621071 1431695 1399887 1673852 1249514 1187001
13916 1187001 1527771 1631788 1670072 1320729 1426890 1842038 1472903 1387809 1314341 1592853
13906 1592853 1239199 1496378 1225909 1238448 1534687 1118676 1320654 1685865 1311133 1178004
13896 1178004 1480307 1180037 1499749 1111200 1491493 1360507 1387993 1263850 1485042 1142107
13886 1142107 1274521 1080139 1203196 1357051 1312690 1442141 1351196 1338477 1067410 1326803
13876 1326803 1291913 1243462 1279821 1198385 1219750 961418 1303160 1177007 830824 1002812
$$ packed form
13946A892536O0430k08278J12682J34074M0164l08583K97862l32431j07874k9261
13936A551321K95839p4837J45333k9235k65363j74542J32475j19795O0008j82322
13926A338882K14946k33397O71803l87004J5841j89376l1808K73965m24338o2513
13916A187001L40770J04017L8284l49343J06161M15148l69135q5094p3468K78512
13906A592853l53654K57179k70469J2539K96239m16011K01978L65211l74732j33129
13896A178004L02303l00270L19712l88549L80293j30986K7486j24143K21192l42935
13886A142107J32414j94382J23057J53855m4361J29451r0945j2719k71067K59393
13876A326803l4890m8451L6359q1436K1365k58332L41742j26153l46183J71988
$$ plain form
13866 1002812 1213720 1264907 1134542 801114 1149147 1320645 839420 658359 1113516 1024108
13856 1024108 958209 1128408 1148305 1180124 1076113 1200933 1005215 748139 1220920 928108
13846 928108 810696 970049 895412 1006463 754991 796666 786208 960274 832677 877846
13836 877846 1048851 776380 837398 1213885 1143432 972250 693290 1052637 975471 1115993
13826 1115993 1124429 982819 1026164 800119 1185070 1039383 847482 737221 771184 686973
13816 686973 585568 891982 1093735 980473 761658 779036 812448 675561 800731 713990
13806 713990 804678 823787 540317 923740 735674 645598 752553 678133 854222 780375
13796 780375 915009 652121 832778 961728 774776 1194939 762002 692174 863774 898023
$$ packed form
13866A002812K10908N1187j30365l33428L48033J71498m81225j81061M55157q9408
13856A024108o5899J70199J9897L1819j04011J24820j95718k57076M72781k92812
13846I28108j17412J59353p4637J11051k51472M1675j0458J74066j27597M5169
13836H77846J71005k72471O1018L76487p0453j71182k78960L59347p7166J40522
13826A115993Q436j41610M3345k26045L84951j45687j91901j10261L3963q4211
13816F86973j01405L06414K01753j13262k18815J7378L3412j36887J25170q6741
13806G13990R0688J9109k83470L83423j88066r0076J06955p4420J76089p3847
13796G80375J34634k62888J80657J28950j86952M20163m32937o9828J71600L4249
$$ plain form
13786 898023 501743 690870 750598 1003354 881908 746955 525110 581302 755689 691163
13776 691163 777801 739915 936215 690591 649590 611757 631936 805306 599123 596381 453363
13765 453363 735809 869459 704606 597387 562954 389199 497487 449329 878838 323443
13754 787041 189064 444558 664103 547737 744716 848682 570625 787728 623347 615989
13744 615989 641061 610475 713557 761240 721218 585843 535150 625890 674926 630039 583007
13733 583007 625082 625329 519125 232589 312629 684104 472094 717105 465304 732084
13723 732084 593401 454956 432636 623434 842940 713882 695896 723143 221402 626168
13713 626168 454198 389588 424593 423542 763272 424104 288775 387638 544470 373163
$$ packed form
13786H98023l96280J89127N9728K52756j21446j34953k21845N6192J74387o4526
13776F91163Q6638l7886J96300k45624m1001l7833K0179J73370k06183k742j43018
13765D53363K82446J33650j64853j07219l4433j73755J08288m8158M29509C23443
13754G87041A89064K55494K19545j16366J96979J03966k78057K17103j64381p358
13744F15989K5072l0586J03082M7683m0022j35375n0693R0740M9036m4887m7032
13733E83007M2075K47j06204B32589Q0040L71475k12010K45011k51801K66780
13723G32084j38683j38445k2320J90798K19506j29058j7986K7247B21402M04766
13713F26168j71970o4610L5005j051L39730l39168j35329R8863J56832j71307
$$ plain form
13703 373163 659610 593113 781197 881578 371576 295443 461938 418942 468324 515421
13693 515421 581894 370096 468645 765505 120606 346406 314946 440683 377980 370112 321068
13682 321068 550483 301853 705433 507187 291181 944684 551563 305930 441097 549823
13672 549823 604098 473863 346825 246766 786297 500048 254372 579435 615480 536284
13662 536284 437630 563084 204627 680192 361676 414758 296331 101125 466718 169685
13651 179112 119567 453807 306347 230466 667550 520606 398109 126967 742386 194408
13640 355230 726258 613209 500400 388140 594150 600955 426295 467100 497143 252152
13630 252152 531394 323723 522101 153568 434595 345139 213111 547158 346576 372419
$$ packed form
13703C73163K86447o6497J88084J00381C71576p6133J66495m2996M9382M7097
13693E15421O6473k11798R8549K96860A20606K25800l1460J25737o2703p868m9044
13682C21068K29415k48630M03580j98246k16006O53503l93121k45633J35167J08726
13672E49823N4275j30235j27038j00059N39531k86249k45676L25063L6045p9196
13662E36284r8654J25454B04627M75565l18516N3082j18427A01125L65593A69685
13651A79112n9545L34240j47460p5881M37084j46944j22497A26967O15419A94408
13640C55230L71028j13049j12809j12260K06010O805j74660M0805L0043k44991
13630B52152K79242k07671J98378A53568K81027q9456j32028L34047k00582K5843
$$ plain form
13620 372419 436026 330942 208371 544342 512309 479511 432267 406644 332366 804686 395599
13608 359391 527896 354682 173249 288666 157726 577103 176817 324489 332783 503422
13598 503422 620468 334466 336374 340225 493982 454281 496099 149169 475713 252216 143307
13587 143307 335613 259445 287872 333205 529849 324513 311514 323755 477035 429467 590057
13576 590057 326106 395244 385645 79825 75890 -18721 203190 93333 193311 55721 146276
13565 146276 300383 270505 538685 480265 93309 337398 419298 263288 208809 223576 608474
13554 608474 118532 360670 289134 204782 29060 360168 251808 178310 127308 357786
13544 357786 356269 354680 358427 370262 -16138 543069 22190 339613 261031 -45692 317890
$$ packed form
13620C72419O3607j05084j22571L35971l2033l2798m7244k5623p4278M72320C95599
13608C59391J68505j73214A73249J15417j30940M19377A76817J47672Q294J70639
13598E03422J17046k86002J908L851J53757l9701M1818A49169L26544k23497j08909
13587A43307J92306p6168K8427M5333J96644k05336j2999J2241J53280m7568J60590
13576E90057k63951O9138r599G9825l935a8721B03190I3333R9978E5721R0555
13565A46276J54107k9878K68180n8420I3309K44089Q1900j56010n4479J4767L84898
13554F08474A18532K42138p1536q4352B9060L31108j08360p3498n1002K30478
13544C57786j517j589L747J1835a6138E43069B2190L17423p8582d5692C17890
$$ plain form
13532 491751 98425 151311 421813 65134 392670 88028 329730 360374 208402 79205 -202203
13520 234360 10254 244941 68781 102291 -244172 55620 227949 247515 225151 336696 300258
13509 300258 187025 218047 459660 101137 289931 423890 411221 146397 363722 320599
13499 320599 89430 110234 256296 163418 431241 212185 138066 117175 258804 172053 426013
13488 426013 195332 179853 268099 318970 448014 90029 162146 249606 283097 120550 149856
13477 149856 260517 222754 91675 379648 342933 479457 -108113 302871 326433 180275
13467 180275 -42024 261527 291932 125329 120286 737259 203120 408242 388515 315173 124045
13455 17919 63774 376571 532425 310002 126188 266341 179346 -64343 101812 88935
$$ packed form
13532D91751I8425N2886K70502F5134L27536H8028K41702L0644j51972G9205b02203
13520B34360A0254K34687F8781L3510b44172E5620J72329J9566k2364J11545l6438
13509C00258j13233L1022K41613A01137J88794J33959j2669A46397K17325m3123
13499C20599H9430K0804J46062r2878K67823B12185p4119k0891J41629q6751K53960
13488D26013A95332j5479Q8246N0871J29044I0029P2117Q7460L3491A20550K9306
13477A49856J10661l7763I1675K87973l6715J36524a08113C02871K3562j46158
13467A80275d2024B61527L0405A25329n043O16973B03120K05122j9727p3342A24045
13455A7919M5855L12797J55854k22423A26188J40153q6995f4343A01812j2877
$$ plain form
13445 88935 276330 324169 412442 278027 140916 109793 146876 279635 293277 134330 76536
13434 76536 65428 24528 40455 418841 246413 -208389 125057 340037 343141 390364 273989
13423 273989 105305 391975 438058 510072 123114 261823 114281 244182 121518 157398
13413 157398 35082 173806 266856 65795 66893 -179674 13635 40255 -138127 215004 244580
13402 244580 512396 322289 174033 320690 7149 186597 -35432 214219 93424 88125 -29712
13390 646828 192183 68904 459980 8534 443056 149538 316789 145037 652824 374165
13380 374165 59460 445466 -475 239911 173245 284223 145401 255400 41694 -114009 155995
13368 317946 101054 296561 71445 345751 293071 281959 223090 457601 327935 409519
$$ packed form
13445H8935J87395M7839Q8273j34415j37111l1123L7083J32759J3642A34330n7794
13434G6536j1108B4528J5927L78386j72428b08389A25057K14980L104M7223j16375
13423B73989A05305K86670M6083P2014A23114J38709A14281J29901A21518L5880
13413A57398C5082J38724R3050F5795J098a79674A3635K6620a38127B15004K9576
13402B44580K67816j90107j48256J46657G149J79448c5432B14219I3424n299b9712
13390F46828A92183F8904L91076H534M34522A49538J67251A45037N07787k78659
13380C74165E9460L86006d75B39911o6666J10978j38822J09999D1694a14009A55995
13368C17946A01054J95507G1445K74306n2680j1112n8869K34511j29666Q1584
$$ plain form
13358 409519 350140 -53314 224721 -49524 148126 143297 564487 255120 208384 358032 209567
13347 209567 591131 342091 403980 85619 632739 353057 387459 271225 327367 300749
13337 300749 417696 341610 -261202 424418 345847 284999 -250518 181092 114709 121133 221997
13326 221997 9651 571595 84048 37775 335417 120919 450372 322480 -77894 425806
13315 135459 105862 107515 159762 363600 218997 277773 247241 128 130088 442865 208399
13303 -2789 216853 505786 191668 37853 -12334 271582 186647 132355 255054 218807 155122
13292 155122 91952 -111467 -37902 187219 224725 91355 394010 396149 186526 276990 201397
13281 201397 55623 -91097 -32144 -136059 75501 373378 65487 512064 63828 19523 59262
$$ packed form
13358D09519n9379e3314B24721d9524A48126m829M21190B55120m6736J49648j48465
13347B09567L81564k49040O1889H5619N47120k79682L4402j16234N6142k6618
13337C00749J16947p6086b61202D24418p8571o0848b50518A81092o6383O424J00864
13326B21997I651N61944H4048C7775K97642A20919L29453j27892g7894D25806
13315A35459k9597J653N2247K03838j44603N8776l0532A28J29960L12777B08399
13303b789B16853K88933A91668C7853a2334B71582q4935n4292J22699l6247o3685
13292A55122o3170a11467c7902A87219L7506I1355L02655K139A86526R0464p5593
13281B01397E5623i1097c2144j03915G5501K97877F5487M46577F3828A9523L9739
$$ plain form
13270 59262 -124757 344045 18308 79144 -244992 229832 103669 85586 -143546 127667
13259 -25530 109875 96669 1903 253425 586243 -126080 94726 -83139 268218 221092 205777
13248 205777 97781 188130 257295 -145328 322451 34726 -132874 44957 276229 376913
13238 376913 4699 364148 -51621 288119 102853 312958 -185293 57877 403914 98765
13227 -71998 212826 343943 32296 348468 -226398 -104651 527003 -225664 -8858 -12919 3490
13215 114043 39951 18275 24334 -107607 -154241 393303 230035 -122843 -131109 255820 140718
13204 140718 205282 411864 -61858 104484 4332 34929 17749 -254606 -121259 353404 235833
13193 235833 186922 -131216 1941 -13087 -151327 345766 178766 91824 176164 352802 -48431
$$ packed form
13270E9262a24757C44045A8308O0836b44992B29832A03669j8083a43546A27667
13259b5530A09875j3206A903K51522L32818a26080I4726h3139B68218m7126j5315
13248B05777I7781R0349O9165a45328C22451C4726a32874D4957K31272J00684
13238C76913D699L59449e1621B88119A02853K10105a85293E7877L46037I8765
13227g1998B12826J31117C2296L16172b26398a04651E27003b25664h858m061C490
13215A14043C9951A8275O059a07607m6634C93303j63268a22843q266B55820j15102
13204A40718O4564K06582f1858A04484D332L0597j7180b54606a21259C53404j17571
13193B35833m8911a31216A941a3087j38240C45766j67000q6942Q4340J76638d8431
$$ plain form
13181 -295550 188991 268940 122870 -268588 -97333 -245490 32082 42673 279511 391822
13171 391822 133816 199040 -60659 -192269 299277 87249 217169 64149 -136040 -135291 108691
13159 -139361 -14349 -40883 -273205 88983 473215 -77941 -162492 33727 174531 8921 118648
13148 118648 188763 470353 197350 141513 -35814 59110 319796 -27919 209447 160225 -43038
13136 184269 -13657 77593 75054 -80074 -140256 91123 141832 -180136 226106 158503 442006
13125 442006 39104 461643 -77212 5493 11065 115858 117931 207698 -68383 -62594 -23172 77412
13112 148460 -101680 -136171 312324 -183134 -21197 126216 70481 -105328 312429 -157461
13101 34855 154846 -95621 46044 57000 364953 321966 -62553 42213 87123 239042 185366
$$ packed form
13181b95550A88991P9949A22870b68588i7333j48157C2082J0591K36838J12311
13171C91822A33816O5224f0659j31610B99277H7249J29920F4149a36040P49A08691
13159a39361a4349k6534k32322H8983L84232g7941q4551C3727J40804H921J09727
13148A18648P0115K81590A97350n5837c5814E9110K60686b7919B09447m9222d3038
13136A84269a3657G7593k539h0074o0182I1123N0709a80136B26106o7603K83503
13125D42006C9104M22539g7212E493N572J04793K073Q9767f8383N789b3172G7412
13112A48460a01680l4491C12324a83134b1197A26216n5735a05328C12429a57461
13101C4855J19991i5621D6044J0956L07953m2987f2553D2213M4910J51919n3676
$$ plain form
13090 185366 97252 252346 193838 -238276 124769 183896 505989 -60842 -71562 78955 -215747
13078 -110360 25752 307986 -76500 215793 8793 77160 58317 148705 -118471 4786 -205315
13066 216719 63640 303900 169493 352447 -40231 118626 -160705 -78760 172028 63293
13055 108603 -134238 441581 -42744 -201181 271608 274428 -192623 678344 138850 119459
13045 119459 278492 104817 32452 459095 191338 -29695 212110 338511 29683 364528
13035 364528 -46943 57586 243707 3011 155282 9885 208060 -109044 -152321 101708 -92497
13023 201510 219822 -56578 246685 -183001 189981 1640 -5587 55234 39533 194855 335886
13012 335886 210071 169243 539315 7229 112842 210286 347129 162826 135372 29143 222641
$$ packed form
13090A85366q8114J55094n8508b38276A24769N9127L22093f0842j0720G8955b15747
13078a10360B5752K82234g6500B15793H793O8367j8843R0388a18471D786b05315
13066B16719F3640K40260j34407J82954d0231A18626a60705g8760A72028F3293
13055A08603a34238D41581d2744j58437B71608K820a92623F78344A38850j9391
13045A19459J59033A04817C2452M26643A91338b9695B12110J26401B9683L34845
13035C64528d6943E7586J86121C011J52271I885J98175a09044m3277A01708i2497
13023B01510J8312e6578B46685a83001A89981A640e587E5234j5701J55322J41031
13012C35886j25815m0828L70072G229J05613R7444J36843A62826k7454B9143J93498
$$ plain form
13001 222641 17511 73718 45815 252801 97838 23916 -121543 28063 92882 366454 172899
12989 -293515 353122 6106 311283 6472 201291 -144623 228339 -155808 -183435 -64255 -17624
12977 124949 40128 204296 -43892 138085 5946 -95492 -324847 53465 21998 140591 36778
12965 -297552 327419 96933 124419 44264 -129546 -83041 116768 -176117 64205 51565 251932
12954 251932 43979 -9706 209741 118274 -17373 194624 258281 14632 -9505 256177 30987
12942 -102893 26914 49480 -227741 87485 143365 -125981 110312 115108 144109 306723 154418
12931 154418 301170 -193952 -56457 -46470 -56780 -46105 -308226 -87933 -51252 -17281 53818
12919 28510 -16712 190643 53989 -3213 -241385 35440 169403 -118996 51299 -192799 -65051
$$ packed form
13001B22641A7511N6207k7903K06986I7838B3916a21543B8063O4819K73572A72899
12989b93515C53122F106L05177F472J94819a44623B28339a55808k7627f4255a7624
12977A24949D0128J64168d3892A38085E946i5492k29355E3465B1998J18593C6778
12965b97552C27419I6933K7486D4264a29546M6505A16768a76117F4205j2640K00367
12954B51932D3979i706B09741r1467a7373A94624O3657A4632i505B56177C0987
12942a02893B6914K2566b27741H7485N5880a25981A10312M796K9001J62614j52305
12931A54418J46752a93952e6457R987j0310J0675k62121h7933L6681a7281E3818
12919B8510a6712A90643E3989c213k38172C5440J33963a18996E1299a92799f5051
$$ plain form
12907 317265 -15750 46490 -77240 92308 139377 45446 111767 -11423 159620 60584 -255390
12895 130524 169671 -52357 -145958 -117500 -207171 188227 192328 137843 276214 197288 67318
12883 82641 -75972 -95340 112574 -169694 392671 -166079 -48213 220152 240972 68671 -417298
12871 174867 -61703 179991 127633 -159372 -339627 45210 -221607 274501 -209939 325251
12860 24229 239330 176872 149640 301034 -243015 134017 -50045 70212 -196291 -89414 29401
12848 522137 83997 -114074 31143 201106 266207 163331 180818 84963 176525 38731 205476
12837 205476 -139684 -49482 -97114 55183 -54297 161410 -14036 122848 -26439 89083 -13697
12825 269548 372364 39701 -36732 129216 -74257 343388 96010 -56273 -241434 302206
$$ packed form
12907C17265a5750D6490g7240I2308M7069D5446O6321a1423A59620F0584b55390
12895A30524L9147e2357r3601K8458q9671A88227M101n4485J38371p8926F7318
12883H2641g5972j9368A12574a69694C92671a66079d8213B20152K0820F8671d17298
12871A74867f1703A79991n2358a59372j80255D5210b21607B74501b09939C25251
12860B4229K15101o2458k7232J51394b43015A34017e0045G0212a96291h9414B9401
12848E22137H3997a14074C1143J69963O5101j02876J7487H4963R1562C8731J66745
12837B05476a39684d9482m7632E5183e4297A61410a4036A22848b6439H9083a3697
12825B69548J02816C9701c6732A29216g4257C43388I6010e6273j85161C02206
$$ plain form
12814 -136470 -42295 94111 149719 -191051 -248463 -314212 193196 -279547 73336 292266 73123
12802 -16587 14106 -47387 174745 52318 -83246 221423 -116298 277220 118769 67333 -114646
12790 -73850 150406 50513 -102782 448047 -142482 -57456 -54307 -20623 228060 225960 -36103
12778 136087 -184553 124462 -141983 286775 110438 208174 -185273 -85278 186151 233540
12768 233540 119000 -334004 154357 -62248 50993 -10057 -189304 101649 -79486 -71709 -76535
12757 -76535 189105 -187535 -118736 48239 193645 142532 275541 -4652 -10971 22338 -78307
12745 203192 132386 204226 90841 103091 194615 -77148 -180504 -218805 280208 150253 107765
12734 107765 276891 300627 -153490 -5590 151635 143748 251029 -4743 112906 -14114 467165
$$ packed form
12814a36470d2295I4111N5608a91051n7412o5749A93196b79547G3336K18930G3123
12802a6587A4106d7387A74745E2318h3246B21423a16298B77220A18769n1436a14646
12790g3850A50406E0513a02782D48047a42482e7456L149b0623B28060k100c6103
12778A36087a84553A24462a41983B86775A10438R7736a85273h5278A86151M7389
12768B33540j14540c34004A54357f2248E0993a0057j79247A01649g9486P777m826
12757g6535A89105a87535O8799D8239J45406n1113J33009d652o319B2338g8307
12745B03192p0806P1840I0841J2250R1524g7148j03356l8301B80208j29955m2488
12734A07765J69126K3736a53490e590A51635p887J07281d743A12906a4114D67165
$$ plain form
12722 178241 347075 -244117 351704 77117 126474 -125159 -53280 -61806 -90144 277269 264865
12711 264865 239223 -77708 312533 147362 365156 413064 -72608 152712 137546 -170253
12700 177712 225479 -173386 277992 73054 129542 -169688 7856 82874 202367 135379 95197
12689 95197 186235 -161104 -131286 8384 292502 83161 25004 172609 146349 7213 455742
12678 455742 -163471 346235 111317 72819 25789 -1122 -134885 -109622 67000 160536 -120368
12666 -124157 1841 19764 32017 -127477 -37375 102506 -82466 119135 320803 303695 -210944
12654 85024 255636 478920 -60355 80121 -77348 225775 293108 2241 257210 313882 -56044
12642 -230908 -10096 131233 69950 -159272 -356703 84352 93642 196252 -182117 70618 102738
$$ packed form
12722A78241J68834b44117C51704G7117M9357a25159e3280q526k8338B77269j2404
12711B64865k5642g7708C12533A47362K17794M7908g2608A52712j5166a70253
12700A77712M7767a73386B77992G3054N6488a69688G856P5018J19493o6988m0182
12689I5197R1038a61104K9818H384K84118H3161B5004J47605k6260G213M48529
12678D55742a63471C46235A11317l8498B5789a122j33763K5263F7000R3536a20368
12666a24157A841J7923J2253a27477c7375A02506h2466A19135K01668j7108b10944
12654H5024J70612K23284f0355H0121g7348B25775O7333B241K54969N6672e6044
12642b30908a0096A31233o1283a59272j97431H4352R290J02610a82117G0618L2120
$$ plain form
12631 102738 496 335369 -2320 386741 134177 -37473 341247 271065 -3866 178599 179779
12620 179779 372810 -11277 185758 -194687 83340 89281 186324 -331752 -249629 1366 228620
12609 228620 -23978 -110837 -142104 -263646 -39077 230505 -24808 153804 -44423 26978 -143990
12597 78592 213929 108610 367590 175179 20396 183723 193390 -155569 140752 143494 -151410
12585 156776 -17719 40058 -139755 147193 172053 -125618 63264 137823 -54878 -138646 184010
12573 197864 -296349 174261 -129412 91684 -33130 -175287 95236 -79159 236946 29721
12562 -187691 141204 -61158 53846 -100885 192226 -65277 104162 -105887 247426 -212518
12551 90836 410344 90135 -57199 68739 -261471 102784 24390 103214 18316 46223 365987
$$ packed form
12631A02738D96L34873b320C86741A34177c7473C41247p0182c866A78599J180
12620A79779J93031a1277A85758a94687H3340N941R7043c31752Q2123A366K27254
12609B28620b3978q6859l1267j21542c9077B30505b4808A53804d4423B6978a43990
12597G8592J35337j05319K58980A75179B0396J63327R667a55569A40752K742a51410
12585A56776a7719D0058a39755A47193K4860a25618F3264P4559e4878q3768A84010
12573A97864b96349A74261a29412I1684c3130j42157I5236g9159B36946B9721
12562a87691A41204f1158E3846a00885A92226f5277A04162a05887B47426b12518
12551I0836L19508I0135e7199F8739b61471A02784B4390P8824A8316K7907L19764
$$ plain form
12540 365987 -9369 -49135 -89688 9497 -320459 380224 88955 184452 -88987 -39136 -308389
12529 -308389 -244258 43440 353869 47180 -194830 -130783 1591 32720 136603 -11763 165878
12517 -146987 -81750 69328 -40861 7593 169771 11016 -245502 207321 109827 381950 -55909
12505 -161731 223166 211653 -72638 70408 -102898 51015 389252 37497 -166558 -139687 -205363
12494 -205363 -85696 -60801 -105363 170612 -42394 -104667 446165 180576 183900 -1725 -157324
12483 -157324 220569 73858 106520 -71098 -48954 360273 89686 -196344 -85497 190837 -119111
12471 285856 -117278 12391 139240 18026 48305 -26399 128121 -154492 -246266 -101045
12460 20593 -255216 347334 -329585 -82947 53096 -30871 176298 227458 -4244 -38325 -30987
$$ packed form
12540C65987i369l9766m0553I497c20459C80224H8955R5497h8987c9136k69253
12529c08389O4131D3440L10429D7180a94830O4047A591L1129J03883a1763A65878
12517a46987O5237F9328d0861G593J62178A1016b45502B07321r7494K72123e5909
12505a61731B23166j1513g2638G0408a02898E1015L38237C7497a66558K6871o5676
12494b05363h5696K4895m4562A70612d2394o2273D46165A80576L324a725j55599
12483a57324B20569G3858L2662g1098K2144C60273H9686a96344h5497A90837a19111
12471B85856a17278A2391J26849A8026L0279b6399A28121a54492r1774a01045
12460B0593b55216C47334c29585h2947E3096c0871A76298N1160d244l4081P338
$$ plain form
12449 -30987 67403 -91448 -80306 -157661 -208770 -396189 5039 128939 -207858 127130 145572
12438 145572 103324 -27725 272081 161545 78518 -39215 411400 -87150 -89765 180542 298715
12427 298715 -226387 524786 -430283 -377346 34911 12337 59997 -47250 -366169 -129594
12416 259765 -162785 -123999 -270498 92065 -48715 10306 136775 -239664 153834 -190035
12405 -270996 -265879 189701 133384 -251957 73896 -217774 119093 216251 -199956 -140190 222933
12393 -163840 55265 88846 -287123 -86156 -46827 63524 -12066 30037 230316 73114 258484
12382 258484 29017 -62284 89626 -292998 16661 -130291 272133 -72203 -123627 171909 -110645
12370 -129639 -50266 -141353 164011 151515 -285826 12005 37517 386263 47881 148328 -117751
$$ packed form
12449c0987F7403i1448J1142p7355n1109j87419E039J23900b07858A27130J8442
12438A45572m2248b7725B72081j10536G8518c9215D11400h7150k615A80542J18173
12427B98715b26387E24786d30283N2937C4911A2337M7660d7250l18919a29594
12416B59765a62785L8786j46499I2065d8715A0306J26469b39664A53834a90035
12405b70996N117A89701n6317b51957G3896b17774A19093R7158a99956N9766B22933
12393a63840E5265L3581b87123h6156L9329F3524a2066C0037K00279G3114J85370
12382B58484B9017f2284H9626b92998A6661a30291B72133g2203n1424A71909a10645
12370a29639e0266r1087A64011j2496b85826A2005K5512L48746D7881J00447a17751
$$ plain form
12358 323792 -135985 1903 138775 -70290 -16302 -201550 43263 -41892 155976 99803 51131
12347 51131 -187481 -196518 -4554 -42114 -23330 -67468 72309 -173460 -504010 -97164 -162274
12336 -162274 200249 95087 -257488 56542 39417 -4100 -54415 167940 -98799 152565 142163
12325 142163 -171367 -6080 -85459 351828 45599 192709 104329 -289738 -349984 -271724 7913
12313 180422 108081 17908 -114333 196289 -90028 -38154 -33729 -4095 107871 50016 14472
12301 -152475 -269893 134642 -96185 115395 129134 -110643 17434 -145625 54061 -295730
12290 129176 153861 286226 359757 275781 -26951 54773 -83336 -68895 393419 -186974 174434
12278 150130 -40463 -28440 509599 122152 88985 312759 -192168 79556 61458 -27277 14532
$$ packed form
12358C23792a35985A903J36872g0290a6302j85248D3263d1892A55976n6173m8672
12347E1131a87481r037d554l7560J8784m4138G2309a73460l30550i7164o5110
12336a62274B00249I5087b57488E6542j7125d100n0315A67940i8799A52565j0402
12325A42163a71367f080p9379C51828D5599J47110q8380b89738o0246P8260G913
12313A80422p2341A7908a14333A96289i0028c8154M425d095A07871E0016A4472
12301a52475j17418A34642i6185A15395J3739a10643A7434a45625E4061b95730
12290A29176K4685J32365P3531q3976b6951E4773h3336J4441C93419a86974A74434
12278A50130d0463J2023E09599A22152l3167K23774a92168G9556j8098b7277A4532
$$ plain form
12266 167096 -101559 337010 397617 190782 137011 -49757 -73168 185874 -247698 -163717
12256 -163717 -11710 -44309 -139899 143608 125623 187624 89059 113825 -18676 53415 290746
12245 290746 321126 26738 5591 198865 -54670 122520 164572 293861 167447 134819 188050
12234 188050 52206 142671 413884 143635 221519 -40635 37132 51514 557721 174306 -188391
12222 341932 284579 248165 217885 22319 235244 227477 44295 77890 24479 171581 300576
12211 300576 -145823 212993 159367 -44443 254455 -41128 227227 213670 183344 10714 291098
12200 291098 427050 158581 188872 -193744 562562 243375 429785 219452 386732 201721
12190 201721 150855 410090 513106 343217 114978 215837 210425 276880 52337 -7286 -11950
$$ packed form
12266A67096a01559C37010O0607A90782n3771d9757k3411A85874b47698Q3981
12256a63717a1710l2599r5590A43608j7985O2001H9059K4766a8676E3415K37331
12245B90746L0380B6738E591J93274e4670A22520M2052J29289j26414l2628N3231
12234A88050E2206R0465K71213A43635P7884d0635C7132J4382N06207A74306a88391
12222C41932n7353l6414l0280B2319K12925p767D4295L3595B4479J47102J28995
12211C00576a45823B12993n3626d4443B54455d1128B27227j3557l0326A0714K80384
12200B91098J35952A58581L0291a93744E62562B43375J86410k10333J67280j85011
12190B01721n0866K59235J03016j69889A14978J00859n412O6455E2337g286m664
$$ plain form
12179 -11950 -62152 -25905 131371 250592 240724 120750 -145216 364553 357785 244267 -222610
12167 335889 334884 200845 101152 -26853 449623 7096 132605 14292 122976 98222 -103111
12155 223095 146241 152887 34997 -61755 -86259 191626 110931 -100250 234745 262959 -149843
12143 -33003 -125639 23247 100036 -274715 321741 38349 44074 47720 -397118 -129440 265036
12131 22922 -99042 -58851 122184 -134023 -46037 15465 -134422 96267 -268188 -50070 137484
12119 -182091 -169816 332429 114761 -58575 -126567 319069 -206798 27913 58061 77292 102426
12108 102426 -141059 -292148 264372 -20378 -86170 -93667 -25147 298665 -107137 39307 -70817
12096 96437 -74481 -73822 29361 -74700 -260548 216203 -226288 -164978 -140248 -151207 -178994
$$ packed form
12179a1950n0202b5905A31371J19221r868j19974a45216C64553o768j13518b22610
12167C35889j005j34039r9693b6853D49623G096J25509A4292J08684k4754a03111
12155B23095p6854O646C4997f1755k4504A91626q0695a00250B34745K8214a49843
12143c3003r2636B3247P6789b74715C21741C8349N725L646c97118a29440B65036
12131B2922i9042M0191A22184a34023d6037A5465a34422I6267b68188e0070A37484
12119a82091J2275C32429A14761e8575o7992C19069b06798B7913L0148J9231K5134
12108A02426a41059j51089B64372b0378o5792p497b5147B98665a07137C9307g0817
12096I6437g4481O59B9361g4700j85848B16203b26288O1310K4730j0959k7787
$$ plain form
12085 -178994 -295424 -87064 56223 -29718 -157097 95581 -105377 27426 284800 -81422 198014
12073 -23076 -340074 247699 252145 158911 -7772 -218822 4706 -39575 54515 -37255 86289 184147
12061 184147 -35784 293978 250392 586018 1160890 2036569 526981 83459 364693 -25976
12050 -61454 -70502 116773 170457 359352 -380870 -433196 -24275 36190 23795 -121160 -123027
12039 -123027 127160 35591 -51371 -300891 100293 172255 -418991 -27893 85770 216649
12029 216649 290876 -92699 78474 214450 -197541 -62097 22353 35021 -320008 67410 -74477
12017 120534 -196093 175725 -101716 -279321 20889 11017 -6220 -300284 83358 -52160 -167456
12006 -167456 323725 39174 -365266 -41594 97108 -110744 -159776 101471 231671 -187041
$$ packed form
12085a78994j16430h7064E6223b9718j27379I5581a05377B7426K57374h1422A98014
12073b3076l16998B47699M446r3234g772k11050D706c9575E4515c7255H6289R7858
12061A84147c5784B93978m3586L35626N74872Q75679E26981H3459K81234b5976
12050f1454r048A16773N3684J88895c80870n2326b4275C6190j2395a21160j867
12039a23027A27160C5591e1371k49520A00293P1962d18991b7893H5770J30879
12029B16649P4227i2699G8474J35976a97541f2097B2353J2668c20008F7410g4477
12017A20534a96093A75725a01716j77605B0889r872f220k94064H3358e2160j15296
12006a67456C23725C9174c65266d1594I7108a10744m9032A01471J30200a87041
$$ plain form
11995 166512 -91888 -52080 -72177 -251919 97391 -165963 -85208 -333858 248864 -84102 -115503
11984 -115503 60563 -223053 -280529 -35956 150736 369467 451123 42048 -57359 138240 -132601
11972 9922 -115016 -97296 -259944 24148 -17092 -6885 -153143 -107475 30902 76840 -311290
11960 14376 -73736 15245 -29415 72098 234365 34174 -25227 286770 262070 54794 -26072
11948 -192623 -123268 -269779 -360355 124390 311943 78127 80584 37962 -213561 406716 -438700
11936 192391 -37523 -48511 301799 228671 -101060 -66972 60072 249367 -210120 176025
11925 130663 -22308 200573 -527182 20788 -416863 -78375 -121648 31364 -70501 -49976 118427
11913 53229 -123595 -47252 -151690 100900 -148836 85899 432 204141 213714 187483 111358
$$ packed form
11995A66512i1888L9808k0097j79742I7391a65963Q0755k48650B48864h4102l1401
11984a15503F0563b23053n7476c5956A50736K18731Q1656D2048e7359A38240a32601
11972I922a15016J7720j62648B4148a7092f885j46258M5668C0902M5938c11290
11960A4376g3736A5245b9415G2098J62267C4174b5227B86770k4700E4794b6072
11948a92623O9355j46511r0576A24390J87553G8127K457C7962b13561D06716d38700
11936A92391c7523j0988C01799p3128a01060L4088F0072J89295b10120A76025
11925A30663b2308B00573e27182B0788d16863g8375m3273C1364g0501K0525A18427
11913E3229a23595d7252j04438A00900a48836H5899D32K03709R573k6231p6125
$$ plain form
11902 111358 170013 -74290 168738 -70053 -196803 -153495 -174865 68406 -454051 -130577 -112899
11891 -112899 222159 78271 -8426 137127 -60280 -113000 -125800 -87204 207910 -40164 102664
11879 -81960 -216167 13365 -65015 -93748 308094 77879 -20341 -76691 -118253 155256 126763
11868 126763 -23590 -394569 -359839 119 59758 73542 -71131 -91031 -35524 -42143 184462 60937
11855 -146229 -16417 -96531 -86008 -285525 -190633 -212052 -301456 268479 -232206 24419 90009
11844 90009 -416120 -167621 84026 -392802 -68104 -176915 -302429 158508 444853 110981
11833 -293559 26629 -237529 28605 -116374 83752 -231991 -43263 -305144 -264690 106818
11822 71059 -79502 -147262 184369 43568 119470 178365 84262 42104 272095 311546 255985
$$ packed form
11902A11358N8655g4290A68738g0053j26750M3308k1370F8406d54051a30577J7678
11891a12899B22159G8271h426A37127f0280n2720j2800L8596B07910d0164A02664
11879h1960j34207A3365f5015k8733C08094G7879b0341n6350m1562A55256k8493
11868A26763b3590l70979L4730A19N9639J3784g1131j9900c5524o619A84462F0937
11855a46229a6417q0114J0523j99517R4892k1419q9404B68479b32206B4419O5590
11844I0009d16120a67621H4026c92802f8104j08811j25514A58508K86345A10981
11833b93559B6629b37529B8605a16374H3752b31991d3263k61881M0454A06818
11822G1059g9502o7760A84369D3568P5902N8895H4262D2104K29991L9451n5561
$$ plain form
11811 255985 234750 66441 104811 -17804 43854 -14398 -3622 -271616 201996 -219167 -15208
11799 -119663 46662 215711 -271484 -306058 -164572 -30414 81077 -154889 271045 159791
11789 159791 -206865 -134055 90969 -203361 18596 -37818 202358 -124271 278721 234641
11779 234641 -23830 5016 44332 -142457 192465 -289987 398908 -214632 134369 -160174
11768 57259 -15395 179664 171473 -152157 -42531 61099 -192554 82320 -510330 -55804 -143739
11757 -143739 16447 -165474 -75773 150375 219787 138431 85650 -11326 -140586 176443 61225
11745 221217 -26628 191493 62063 139079 135492 -210016 -209383 -57289 -148458 -4822 -332852 -57926
11732 101979 -56945 -72135 56239 -67301 -103655 256146 -190299 -115531 21570 -10527 169362
$$ packed form
11811B55985k1235F6441L8370a7804D3854a4398c622k67994B01996b19167a5208
11799a19663D6662J69049b71484l4574J41486c0414H1077a54889B71045j11254
11789A59791b06865P2810I0969b03361A8596c7818B02358a24271B78721m4080
11779B34641b3830E016L9316a42457A92465b89987C98908b14632A34369a60174
11768E7259a5395A79664q191a52157d2531F1099a92554H2320e10330e5804q7935
11757a43739A6447a65474g5773A50375O9412q1356n2781a1326j29260A76443F1225
11745B21217b6628A91493F2063P7016l587b10016O33e7289r1169d822l28030e7926
11732A01979e6945j5190E6239f7301l6354B56146a90299P4768B1570a0527A69362
$$ plain form
11720 321048 170796 123321 -89734 244430 55226 136854 -54133 -239621 18878 193522 -102047
11708 360306 326187 -112844 100003 49111 -19168 51158 -150594 -147548 314257 228302 -56055
11696 86270 193878 -193045 16836 -30584 24982 282484 119974 -7004 -162773 -86073 -442825
11685 -442825 -47639 12541 -189 -28449 15975 135987 254912 -30878 -48304 -149247 -51576
11673 158636 -16303 -159814 -84970 61477 31421 13105 -51480 198866 -287699 -29609 180376
11661 -183795 -93217 -254620 -85204 -335486 -154249 -156088 -40410 2203 -34591 566300 232189
11649 117845 19529 97801 -108570 44156 208956 8492 -28086 -211252 194098 97538 -39039
11637 -238185 122615 -173313 303507 13660 137076 61599 -1851 344820 131476 13632
$$ packed form
11720C21048j50252m7475h9734B44430E5226Q1628e4133j85488A8878J74644a02047
11708C60306l4119a12844A00003D9111a9168E1158a50594L046C14257q5955e6055
11696H6270J07608a93045A6836c0584B4982K57502A19974g004j55769P6700l56752
11685d42825d7639A2541a89k8260A5975J20012J18925c0878j7426j00943e1576
11673A58636a6303j43511P4844F1477l0056A3105e1480A98866b87699b9609A80376
11661a83795R0578j61403h5204k50282a54249j839d0410B203c4591E66300B32189
11649A17845A9529P8272a08570D4156J64800H492b8086j83166A94098r6560c9039
11637b38185A22615a73313C03507A3660J23416F1599a851C44820A31476A3632
$$ plain form
11626 198537 8449 288557 -99188 -76804 309079 -12786 -116080 151123 140012 113218 -151232
11614 196912 -123131 109637 -55587 -38311 77397 120437 57561 -42203 288644 -87542 -233758
11603 -233758 -122223 79049 401197 139790 -32823 -81967 86720 -36296 18154 303037 -39801
11591 -44401 -52171 -133015 175235 -102272 66568 220303 -167110 -89812 215986 6678 -956
11579 407425 -154949 -46660 291390 75465 -53178 -5171 39289 -116485 186882 360508 148311
11567 -112025 249249 40494 -35839 56078 383320 21616 350961 156236 208278 260607 225002
11556 225002 -237272 101641 -214102 134336 -161534 255347 61987 108580 467818 -9312
11545 288663 100603 438734 -103689 -37952 -327850 -141819 245676 488229 -31250 -94042
$$ packed form
11626A98537H449K80108i9188K2384C09079a2786j03294A51123j1111k6794a51232
11614A96912a23131A09637e5587J7276G7397M3040E7561d2203B88644h7542j46216
11603b33758J11535G9049L22148A39790c2823m9144H6720c6296A8154K84883c9801
11591d4401p770q0844A75235a02272F6568J53735a67110P7298B15986F678i56
11579D07425a54949d6660B91390G5465e3178e171C9289a16485A86882J73626A48311
11567a12025B49249D0494c5839E6078L27242B1616L29345A56236N2042N2329l5605
11556B25002b37272A01641b14102A34336a61534B55347F1987M6593L59238i312
11545B88663A00603L38131a03689c7952k89898a41819B45676K42553c1250o2792
$$ plain form
11535 -94042 25241 -375390 -80452 3340 -59057 219335 251754 64398 4152 318779 -77804
11523 395376 -96540 176104 133852 -22763 5660 -333876 200335 217884 205923 -188921 415607
11511 106351 -27351 85218 -33120 25985 234107 65084 232196 101098 37211 -264729 170416
11499 -57006 -95924 293161 297213 87417 -93169 -28404 183828 -134388 173968 285861 -16309
11487 39139 113199 170204 -25519 -14498 56923 -36941 66307 153580 -112423 5792 347458
11476 347458 -249 484927 87793 192611 -8779 -219757 366077 174834 49653 231460 -244389
11464 150297 32439 52249 -19244 251741 219463 305298 181803 158434 410405 16410 39889
11453 39889 -71693 274077 -210052 -66815 129271 -186505 -112942 -117967 241638 -60197 -84500
$$ packed form
11535i4042B5241c75390h0452C340e9057B19335L2419F4398D152L14627g7804
11523C95376i6540A76104m2252b2763E660c33876B00335J7549j1961a88921D15607
11511A06351b7351H5218c3120B5985K08122F5084J67112A01098C7211b64729A70416
11499e7006l8918B93161M052H7417i3169b8404A83828a34388A73968J11893a6309
11487C9139P4060N7005b5519J1021E6923c6941F6307Q7273a12423E792L41666
11476C47458b49D84927H7793J04818h779k10978C66077A74834D9653J81807b44389
11464A50297C2439J9810a9244B51741l2278Q5835j23495k3369K51971A6410K3479
11453C9889g1693B74077b10052f6815A29271a86505P3563n025B41638f0197k4303
$$ plain form
11442 -84500 219418 -103596 -228993 83748 166598 114654 244010 -38713 34389 291302 -6828
11430 216002 74631 176478 -55337 -5852 135533 -93066 337332 124362 46787 316439 -165737
11418 280148 71793 -61563 21915 -166323 58225 -18861 178823 96808 244785 42164 117481
11407 117481 -88318 29598 13983 -91136 235470 -63846 191214 -378712 -97875 29616 286673
11396 286673 -111269 137261 -164766 15336 18883 167390 -22022 284830 -163225 -256122
11386 -256122 18670 -182499 288063 128224 225499 -53565 -202427 35302 -208680 96862
11375 170105 -5741 -37072 -236199 288959 32976 40350 114102 258841 28509 -238730 -51202
11363 218914 33638 302757 112255 -117001 245051 227721 -299247 77688 80333 -16502 153376
$$ packed form
11442h4500B19418a03596j25397H3748Q2850n1944J29356c8713C4389K56913f828
11430B16002G4631J01847e5337e852A35533i3066C37332A24362D6787K69652a65737
11418B80148G1793f1563B1915a66323E8225a8861A78823q2015J47977D2164P5317
11407A17481h8318B9598A3983i1136B35470f3846A91214c78712i7875B9616K57057
11396B86673a11269A37261a64766A5336L547J48507b2022B84830a63225r2897
11386b56122A8670a82499B88063A28224R7275e3565j48862C5302b08680I6862
11375A70105e741l1331j99127B88959C2976P374P3752J44739B8509b38730e1202
11363B18914C3638K69119A12255a17001B45051j7330b99247G7688K645a6502A53376
$$ plain form
11351 101796 31460 -232354 170027 -108802 341039 30319 131465 159479 -83659 133875
11340 -82105 -83497 -66564 -75022 202845 137290 -166522 -249435 242938 138299 -395722 69717
11328 51990 -248807 -174030 -193430 -92365 183015 -108462 -7144 195948 -138399 -50268 -130238
11317 -130238 -29057 -150278 224353 -60158 212879 42907 -142051 -23296 -369333 159599
11306 113614 -132089 -38694 37 143616 -213209 -269442 -232769 192215 23365 -196048 117102
11294 -64588 -221517 -27732 -244228 -75875 -38133 -185287 -247155 31731 -161278 -267174 160346
11282 -223476 -238221 -203423 95819 -97651 666 10475 176287 -174749 64275 -360518 14263
11270 72295 -67372 -76001 179576 104913 206242 -169658 93944 -87033 134321 -165944 79824
$$ packed form
11351A01796C1460b32354A70027a08802C41039C0319J01146K8014h3659A33875
11340h2105j392J6933q458B02845o5555a66522q2913B42938j04639c95722F9717
11328E1990b48807P4777j9400i2365A83015a08462g144A95948a38399e0268p9970
11317a30238b9057j21221B24353f0158B12879D2907a42051b3296l46037A59599
11306A13614a32089c8694C7J43579b13209n6233L6673A92215B3365a96048A17102
11294f4588j56929b7732k16496g5875L7742j47154o1868C1731a61278j05896A60346
11282b23476j4745L4798I5819i7651F66R809J65812a74749F4275c60518A4263
11270G2295f7372q629A79576p4663J01329a69658I3944h7033A34321a65944G9824
$$ plain form
11258 -249403 -86477 107692 -47186 190427 -208939 55406 -349587 158849 165908 203542 -147045
11246 25807 -106918 -68459 -56104 -95151 -125028 -356550 11441 99917 -4927 -210776 -224933
11235 -224933 -286159 249221 102723 -24042 -373797 37315 -295859 -39205 -226951 -146916
11225 -146916 -75572 56444 109956 68443 26568 -147695 -257555 -245169 15110 7909 -229134
11213 90810 -193988 78316 -118368 344612 -324570 -138809 55504 117616 -23031 -49503 -93730
11202 -93730 -96392 237427 11434 -21629 172476 -49546 138613 172074 161782 68428 21955
11190 21898 -171226 -78119 119043 -158074 50099 -99301 -109821 125166 299180 -22519 -232758
11179 -232758 -76586 -265055 -53286 99662 -347229 -1159 -157986 52681 208957 -4075 16998
$$ packed form
11258b49403h6477A07692d7186A90427b08939E5406c49587A58849P059L7634a47045
11246B5807a06918L8459J2355l9047k9877k31522A1441Q8476d927k05849j4157
11235b24933o1226B49221A02723b4042l49755C7315b95859c9205j87746Q0035
11225a46916P1344E6444N3512m1513B6568a47695j09860J2386A5110p201b29134
11213I0810a93988G8316a18368C44612c24570a38809E5504O2112b3031k6472m4227
11202i3730k662B37427A1434b1629A72476d9546A38613L3461j0292F8428B1955
11190B1898a71226g8119A19043a58074E0099i9301j0520A25166J74014b2519k10239
11179b32758g6586j88469e3286I9662c47229a159j56827E2681J56276d075A6998
$$ plain form
11167 -115102 32075 -28616 135096 261173 -223446 100088 -41564 -116530 87471 77434 -138008
11155 7809 90418 31552 -229968 -121666 216893 -25322 61155 -5317 -102289 -254123 57284
11143 73103 219661 -107435 -140068 39612 -150733 1643 -8233 253425 225024 -103231 -103032
11132 -103032 -11485 -36510 -106331 306060 172323 -232757 29163 -184038 152011 152990 -299299
11120 352627 24362 -163549 158500 -53803 -82009 -25936 -191700 183870 50749 105471 62956
11109 62956 -197577 -16405 9027 134425 227887 317443 192594 533704 174357 52123 2541
11097 50812 -269200 290286 43886 201102 127801 -1542 97928 247494 -109851 497524 128131
11085 35277 334111 253050 98485 -117914 417499 443451 188512 71687 372127 183506
$$ packed form
11167a15102C2075b8616A35096J26077b23446A00088d1564p4966H7471j0037a38008
11155G809Q2609C1552b29968J08302B16893b5322F1155e317r6972j51834E7284
11143G3103J46558a07435l2633C9612a50733A643h233B53425k8401a03231J99
11132a03032a1485k5025o9821C06060j33737b32757B9163a84038A52011R79b99299
11120C52627B4362a63549A58500e3803k8206b5936j65764A83870E0749N4722m2515
11109F2956a97577a6405I027J25398R3462Q9556j24849L41110A74357E2123B541
11097E0812b69200B90286D3886J57216p3301a542I7928J49566a09851D97524A28131
11085C5277K98834q1061I8485a17914D17499K5952A88512G1687L00440A83506
$$ plain form
11074 155081 415162 357190 -3807 195688 280839 459604 259105 446339 490831 146440
11063 339217 398347 689006 583736 350556 247711 845940 575054 471714 617446 789793
11053 789793 488931 1004507 986414 600177 515138 898540 937837 846844 1004535 570226
11043 570226 821599 430883 654803 826351 933101 357291 985649 962629 624262 553215
11033 553215 765786 726788 858088 713387 682272 586442 636449 504885 610107 923048
11023 923048 977810 728132 733648 293297 545797 672427 603050 818383 859786 757570
11013 757570 616712 443581 754396 559881 672502 560969 609074 872970 460786 975069
11003 975069 703164 449740 509723 726170 886872 655225 500070 600926 551270 732729
$$ packed form
11074A55081K60081n7972c807A95688Q5151J78765k00499J87234M4492A46440
11063C39217N9130K90659j05270k33180j02845N98229k70886j03340J45732J72347
11053G89793l00862N15576j8093l86237q5039L83402L9297r0993J57691m34309
11043E70226K51373l90716K23920J71548J06750C57291O28358k3020l38367p1047
11033E53215K12571l8998J31300j44701l1115r5830N0007j31564J05222L12941
11023I23048N4762k49678N516B93297K52500J26630o9377K15333M1403j02216
11013G57570j40858j73131L10815j94515J12621j11533M8105K63896m12184N14283
11003I75069k71905k53424N9983K16447J60702k31647j55155J00856m9656J81459
$$ plain form
10993 732729 573896 932048 699484 439405 399176 896114 978764 906690 903899 1055411
10983 1055411 1303556 678832 1475940 1362638 1416484 1313184 1756870 2026644 2001899 2399494
10973 2399494 2777702 2812775 2588103 3190597 3054425 2468204 2429646 1904712 2256698 1666617
10963 1666617 1583595 1748158 1586961 1727840 1705742 1685110 1832826 1466730 1585910 1478803
10953 1478803 1667551 1310008 1034045 701952 823683 705791 606631 381005 413715 456247
10943 456247 102482 87321 136160 157232 267267 282768 175487 124705 -93364 83593 119900
10932 119900 199907 -31320 13327 174590 19966 356907 -165270 285218 -29007 208108
10921 -547128 93130 -91966 -286644 -39797 -30080 -118780 281317 -81148 288702 138694 -149702
$$ packed form
10993G32729j58833L58152k32564k60079m0229M96938Q2650p2074k791J51512
10983A055411K48145o24724P97108j13302N3846j03300M43686K69774k4745L97595
10973B399494L78208L5073k24672O02494j36172n86221l8558n24934L51986n90081
10963A666617q3022J64563j61197J40879k2098k0632J47716l66096J19180j07107
10953A478803J88748l57543k75963l32093J21731j17892r9160k25626L2710M2532
10943D56247A02482j5161M8839K1072J10035J5501j07281n0782i3364H3593L6307
10932A19900Q0007c1320A3327J61263A9966L36941a65270B85218b9007B08108
10921e47128I3130i1966j94678c9797R717q8700B81317h1148B88702A38694a49702
$$ plain form
10909 -7060 -46721 57896 -414546 -56026 321427 -135188 -116631 -376868 -160577 44195 -35684
10897 107704 247206 114437 241068 -6785 -114530 141879 209425 40334 18800 12820 -40453
10885 80643 17965 -87736 -85469 65545 20910 -79921 183840 -113297 -121887 135343 283878
10874 283878 120868 -16525 -138414 -79650 71193 -132992 385051 -156962 -210213 15778
10863 -260714 -202969 -117685 -948 83573 78362 -382723 178425 -70578 -627 58559 124935 -233138
10850 100383 38792 -110425 -210808 -44799 -41350 154788 -106971 -84548 26783 133297 -157887
10838 -116694 219433 -128346 -11137 -56003 -173401 -81799 3843 -88783 -244125 180833 -246421
10826 68124 89116 -139050 189321 4544 -303734 -246385 -128061 98431 201444 -84938 -99604
$$ packed form
10909g060l9661E7896d14546e6026C21427a35188J8557k60237a60577D4195c5684
10897A07704J39502A14437J26631f785j07745A41879O7546D0334A8800n980d0453
10885H0643A7965h7736K267F5545B0910g9921A83840a13297q590A35343J48535
10874B83878A20868a6525j21889N8764G1193a32992C85051a56962n3251A5778
10863b60714N7745Q5284i48H3573n211c82723A78425g0578f27E8559O6376b33138
10850A00383C8792a10425j00383d4799L449A54788a06971K2423B6783J06514a57887
10838a16694B19433a28346a1137m4866j17398h1799C843h8783j55342A80833b46421
10826F8124K0992a39050A89321D544c03734N7349J18324I8431J03013h4938j4666
$$ plain form
10815 -99604 -3424 -207112 -9143 69656 12162 -216087 -150307 -139281 186753 -282642 -174549
10804 -174549 101495 -107667 11976 -53656 -3368 -350639 187294 -74695 -43935 -128774 -17907
10792 -25803 -143210 -196192 143059 -58072 35357 -126190 48685 214782 -164713 -187665 -213841
10781 -213841 -171127 301000 -230036 175418 -91246 -188488 95493 -362562 -123072 -121939 -172012
10770 -172012 -329490 172102 -308455 340006 107361 -34511 59142 -226859 -335503 -54128
10759 -46462 21676 -160287 156120 74158 -95863 51179 137791 -26029 -3240 -340123 131485
10747 36438 -1076 -70051 411505 14939 -121756 -266753 -327286 -113878 -39539 -182178 -288348
10736 -288348 153179 -150603 -144810 -52031 -300828 -14506 -178304 -176789 -127442 14539 89554
$$ packed form
10815i9604c424k03688i143F9656A2162b16087O5780J1026A86753b82642J08093
10804a74549A01495a07667A1976e3656c368l47271A87294g4695L0760q4839a7907
10792b5803j17407n2982A43059e8072C5357a26190D8685J66097a64713k2952k6176
10781b13841M2714C01000b30036A75418i1246r7242I5493c62562a23072J133n0073
10770a72012j57478A72102c08455C40006A07361c4511E9142b26859j08644e4128
10759d6462B1676a60287A56120G4158i5863E1179Q6612b6029c240l36883A31485
10747C6438a076o8975D11505A4939a21756j44997o0533a13878c9539j42639j06170
10736b88348A53179a50603N793e2031k48797a4506j63798J515M9347A4539P5015
$$ plain form
10725 89554 -37516 -86551 2169 -31723 18915 -104392 52273 102204 -105083 -211484 -2631
10713 193271 -20203 71047 180037 -97405 -129532 -34559 18082 81602 109421 3949 -43023
10701 -73626 -78819 207955 -85256 -20749 140387 -134460 144674 65729 -140160 123 -260019
10689 -205656 36150 -342896 157993 137769 -130102 -53813 -308048 -226968 108946 -242363
10678 -40545 104091 -358215 -326470 -367641 -164039 193265 296920 96749 -214381 43910
10667 2247 -60467 -124162 -118057 -331859 -32161 -306887 -259532 -41345 -223725 33261 -163747
10655 113288 -132645 -146153 -69016 -328766 8370 -41819 136272 -213222 -227299 183368 -59132
10643 -198735 61254 -34722 -79799 170640 55354 -125241 -157346 1320 32032 246296 -151578
$$ packed form
10725H9554c7516m9035B169c1723A8915a04392E2273M9931a05083j06401b631
10713A93271b0203G1047J08990i7405l2127c4559A8082O3520K7819C949d3023
10701g3626n193B07955h5256b0749A40387a34460A44674F5729a40160A23b60019
10689b05656C6150c42896A57993k0224a30102e3813k54235Q1080A08946b42363
10678d0545A04091c58215L1745m1171a64039A93265J03655I6749b14381D3910
10667B247f0467o3695O105k13802c2161k74726M7355d1345j82380C3261a63747
10655A13288a32645j3508f9016k59750H370d1819A36272b13222j4077A83368e9132
10643a98735F1254c4722m5077A70640E5354a25241l2105A320L0712K14264a51578
$$ plain form
10631 -370009 104162 -5944 320604 -31016 -78144 -214822 -66447 131292 -375992 -140304
10620 225337 209938 222044 11015 43028 -342997 327956 -221791 9550 -420852 -68102 -188166
10609 -188166 -155746 -15139 -263787 82078 -456873 44266 244260 79912 54355 228491 115054
10598 115054 -123878 71071 -466416 32104 -192411 192223 -390755 -116661 -198306 130148
10587 -69257 -87082 69849 -46650 -39695 289431 151213 -52913 -62731 115387 -73866 -115831
10576 -115831 -98692 -68465 58620 -19988 146211 -169169 -258431 -6794 -309540 -354667 -256643
10565 -256643 -133820 107860 -187267 -38278 92070 74700 46532 -3803 -16974 107234 -150938
10553 156527 -116748 -226358 -203441 -45200 105384 29541 -312690 -142539 134318 211518
$$ packed form
10631c70009A04162e944C20604c1016m7128j36678f6447A31292c75992a40304
10620B25337j5399J2106A1015L2013c42997C27956b21791I550d20852f8102j20064
10609a88166L2420a5139k48648H2078d56873D4266J99994G9912k5557J74136j13437
10598A15054a23878G1071d66416C2104a92411A92223c90755a16661q1645A30148
10587f9257j7825F9849d6650O955B89431j38218e2913r818A15387g3866m1965
10576a15831J7139L0227E8620a9988A46211a69169q9262f794l02746m5127R8024
10565b56643J22823A07860a87267c8278I2070j7370k8168c803j3171A07234a50938
10553A56527a16748j09610K2917d5200A05384B9541c12690a42539A34318P7200
$$ plain form
10543 211518 17302 -160284 -179644 71455 -37815 -169754 -164990 -138166 13047 -60993 -511001
10532 -511001 -59986 104816 87566 -173749 -355270 -105276 1329 22842 236195 -485019
10521 -400597 -194259 -10907 -196026 88387 78955 -227788 -47242 131057 31952 -84962 309451
10509 -73952 89976 -57608 -11641 135552 63937 -177893 83873 268973 -261242 -156276 121790
10497 -198098 -143331 -165075 -275515 78921 94854 53703 29054 97203 -192947 203900 168158
10486 168158 270502 -21712 -167226 277032 45432 338480 567825 338258 257507 493346
10476 493346 341412 -207993 -175992 -45197 -132923 -175984 -282558 125038 -3643 -151118 243507
10464 -48710 -85822 -441453 310920 112303 94984 -249330 74544 61066 -190442 287512
$$ packed form
10543B11518A7302a60284j9360G1455c7815j31939M764K6824A3047f0993m50008
10532e11001e9986A04816j7250a73749j81521a05276A329K1513K13353d85019
10521d00597a94259a0907j85119H8387r432b27788d7242A31057C1952h4962C09451
10509g3952H9976e7608a1641A35552F3937a77893H3873J85100b61242J04966A21790
10497a98098N4767k1744j10440G8921J5933m1151k4649O8149a92947B03900l5742
10486A68158J02344b1712j45514B77032D5432K93048K29345k29567q0751K35839
10476D93346j51934b07993L2001d5197q7726m3061j06574A25038c643j47475B43507
10464d8710l7112l55631C10920A12303j7319b49330G4544j3478a90442B87512
$$ plain form
10453 56462 -203711 -61264 -134748 -490253 -32872 -180285 -302818 -16795 -53510 151072 24538
10441 35452 203558 -110664 156831 -82973 -107851 -1439 -34240 -78503 117476 -16532 76326
10429 12045 -312867 155856 -246993 -132581 112863 -151547 -224821 -179351 -192530 239575
10418 136973 28657 -74019 -204717 -40831 151392 -124519 202868 -197631 140409 89744
10408 89744 -25538 90186 585 -50521 68237 -32539 -299341 279237 70790 -10615 -37477 38634
10395 90833 -111601 271674 73401 385195 210388 -33914 147329 101746 -175805 -108182
10385 -108182 20138 249560 295083 87327 -155206 185806 317692 367675 258629 210146
10375 210146 230813 59730 347596 231111 373316 245140 157798 199177 422871 185679
$$ packed form
10453E6462b03711f1264p3484l55505c2872j47413j22533a6795l6715A51072B4538
10441C5452J68106a10664A56831h2973k4878a439l2801m4263A17476a6532G6326
10429A2045c12867A55856b46993J14412A12863a51547p3274M5470j3179B39575
10418A36973B8657g4019j30698d0831A51392a24519B02868a97631A40409n0665
10408H9744b5538I0186E85e0521F8237c2539k66802B79237G0790a0615k6862C8634
10395I0833a11601B71674G3401L11794j74807c3914A47329m5583a75805O7623
10385a08182B0138K29422M5523H7327a55206A85806J31886M9983j09046m8483
10375B10146K0667E9730K87866j16485J42205j28176q7342M1379K23694A85679
$$ plain form
10364 325692 553616 134283 378744 571395 440228 55111 478888 71727 27224 157783
10354 157783 49561 297856 158794 367623 478006 623372 243941 125012 336473 463973
10344 463973 529799 277177 378131 409472 57028 224114 367729 141822 -691 177673 111821
10333 111821 227619 258743 20080 -2279 404868 175942 86078 30577 306813 27911 423085
10322 423085 230801 140567 202520 -175262 51846 17601 91620 163600 -121376 44922 33938
10311 33938 -218220 -10130 -180398 -152015 222769 -131951 -161330 207976 -92817 -55244 97138
10299 -35957 -15391 -7722 -59123 139288 25522 207282 131155 204894 -125110 46051 393384
10288 393384 -232043 136815 -175958 -199202 4857 -186133 -420928 81386 -113851 343734
$$ packed form
10364C25692K27924A34283K44461J92651j31167E5111M23777G1727B7224J30559
10354A57783D9561K48295j39062K08829J10383J45366B43941j18929K11461J27500
10344D63973O5826k52622J00954L1341E7028J67086J43615A41822f91A77673o5852
10333A11821J15798L1124B0080b279D04868A75942H6078C0577K76236B7911L95174
10322D23085j92284r0234O1953a75262E1846A7601P4019P1980a21376D4922j0984
10311C3938b18220a0130j70268K8383B22769a31951k9379B07976i2817L7573I7138
10299c5957a5391P669n1401A39288B5522J81760p6127P3739a25110D6051L47333
10288C93384b32043A36815a75958k3244D857a86133k34795H1386a13851C43734
$$ plain form
10277 -222396 -409083 67511 -129264 -122103 114102 37490 16008 122896 113749 6579 405749
10266 405749 -11308 -29554 138831 -114244 112226 243009 337987 380437 346060 109233
10255 15441 362166 208883 235172 -39621 -32257 145398 194732 125773 72434 -45374 -188984
10244 -188984 -160398 -31593 -365100 -136762 177741 -76809 124538 28659 34919 62363 136024
10233 136024 -136060 147569 17405 -73939 -206331 -140440 -22447 95771 -96110 -164499 -201363
10222 -201363 -134200 138488 -28243 -188554 -344731 124428 268223 -172302 -139098 -260741
10212 -260741 -296722 137220 -217074 -397124 329668 -241609 -62596 -154918 -43537 -232557
10202 -232557 -155289 -64684 20875 -43573 18650 15040 -77728 -202300 81968 -254019 -193160
$$ packed form
10277b22396j86687F7511a29264P161A14102C7490A6008J06888r147F579L99170
10266D05749a1308j8246A38831a14244A12226J30783R4978M2450l4377A09233
10255A5441L46725j53283K6289c9621P364A45398M9334o8959n3339d5374j43610
10244a88984K8586c1593l33507a36762A77741g6809A24538B8659O260K7444P3661
10233A36024a36060A47569A7405g3939j32392O5891b2447I5771i6110o8389l6864
10222b01363O7163A38488b8243j60311j56177A24428J43795a72302L3204j21643
10212b60741l5981A37220b17074j80050C29668b41609f2596r2322d3537j89020
10202b32557P7268f4684B0875d3573A8650l610g7728j24572H1968b54019O0859
$$ plain form
10191 -193160 205347 160432 -137887 -77215 -406731 197085 205158 -388431 128368 276536
10181 276536 -58969 -261147 -253946 -227087 -60512 -137506 -505714 68728 -197527 -107066 -167925
10170 -167925 -262919 -178615 3258 30907 -92 -38210 72142 10634 -126872 -194691 -32463 -268477
10158 -268477 29516 -29608 -60436 7518 -27357 -240616 -128732 -201998 -49041 -311273 -268392
10147 -268392 -83510 -126805 87157 -175889 -115353 316408 68180 61237 193100 -359198 28041
10135 -239158 -209565 266976 46045 166448 -534805 -107484 -280993 148126 152578 163095
10125 163095 51885 -412874 179557 293419 -36254 -6049 -176383 -269186 -220035 -21190 -199570
10114 -199570 14215 206310 -132552 -291855 92553 -4546 -75134 288929 -68726 -81967 -228191
$$ packed form
10191a93160B05347m4915a37887O0672l29516A97085Q073c88431A28368J48168
10181B76536e8969k02178P201K6859f0512p6994l68208F8728a97527R0461o0859
10170a67925r4994Q4304C258K7649i2l8118G2142A0634a26872o7819c2463k36014
10158b68477B9516b9608l0828G518b7357k13259J11884p3266d9041k62232M2881
10147b68392h3510m3295H7157a75889O0536C16408F8180o943J31863c59198B8041
10135b39158K9593B66976D6045J20403e34805a07484j73509A48126M452J0517
10125A63095E1885d12874A79557J13862c6254f049j70334r2803M9151b1190j78380
10114a99570A4215J92095a32552j59303I2553d546p0588B88929f8726j3241j46224
$$ plain form
10103 -228191 -157890 309811 15091 219737 -130017 -185220 -38127 44766 86632 -34456 -161339
10092 -161339 -300338 -261839 15108 46507 68682 -457071 -133943 125800 -239155 22443
10081 -39927 -295657 845 -106221 -267381 -113335 -66443 80351 -343271 22121 -11817 -346089
10070 -346089 -342106 -226029 -325245 -230359 -152207 -139651 243059 66324 105169 -47472 -261649
10059 -261649 185980 -230642 -288585 -293164 51951 62008 235907 -351518 -98994 239246 96641
10047 162245 -201246 -64821 -574375 5560 -43158 -178539 -52167 13733 100378 26432 -216714
10035 -179057 -9519 -291340 -117868 18732 -96370 155953 54676 -122560 -251021 -162517 -138236
10024 -138236 74356 -165505 59160 108592 224730 145128 -42924 -260644 -134839 -357609
$$ packed form
10103b28191P0301C09811A5091K04646a30017n5203c8127D4766M1866c4456j26883
10092a61339j38999L8499A5108L1399K2175d57071a33943A25800b39155B2443
10081c9927k55730H45a06221j61160a13335M6892H0351c43271B2121a1817l34272
10070c46089L983J16077r9216R4886P8152J2556B43059F6324L8845d7472k14177
10059b61649A85980b30642n7943m579E1951J0057J73899c51518i8994B39246I6641
10047A62245b01246f4821n09554E560d3158j35381e2167A3733Q6645B6432b16714
10035a79057i519k81821a17868A8732i6370A55953E4676a22560j28461Q8504K4281
10024a38236G4356a65505E9160M9432J16138p9602d2924k17720J25805k22770
$$ plain form
10014 -357609 30740 -265374 -49257 46422 13435 -33824 -282751 267287 -12480 150734 18112
10002 -104257 18597 -123537 -121234 36972 -44688 -22960 -2401 57493 4703 -164516 619 158479
9990 158479 139413 -122252 -233563 109014 -225478 -355976 -172307 -149647 -268799 2186
9979 -226795 -8239 150859 -138203 -54942 -133707 127706 -27752 -43218 30742 167256 -98467
9967 -367078 151194 -49996 132339 52577 -480913 297957 191607 232930 536586 172409
9956 326990 63407 95345 -139579 -237381 330770 -256814 53760 -2246 27068 61566 -266781
9944 -256822 30380 -146037 -205268 136166 104740 -9758 81052 14683 -126480 -41523 -247556
9933 -247556 -252474 7063 313936 -122157 -113323 62433 17156 204967 -119544 -348245 -159493
$$ packed form
10014c57609C0740b65374d9257D6422A3435c3824k48927B67287a2480A50734A8112
10002a04257A8597a23537K303C6972d4688K1728b401E7493D703a64516F19J57860
9990A58479j9066a22252j11311A09014b25478j30498a72307K2660j19152B186
9979b26795h239A50859a38203e4942p8765A27706b7752j5466C0742J36514i8467
9967c67078A51194d9996A32339E2577d80913B97957j06350M1323L03656A72409
9956C26990F3407L1938a39579r7802C30770b56814E3760b246B7068L4498b66781
9944b56822C0380a46037n9231A36166l1426i758H1052A4683a26480d1523k06033
9933b47556m918G063L06873a22157Q834F2433A7156J87811a19544k28701a59493
$$ plain form
9921 -9954 57081 -114747 2695 54544 -262088 -46986 -413968 -26469 -381875 -674176 31262
9909 -173243 17606 -170536 -135690 176374 -236649 -43309 -123881 -221106 -395119 14027 -29693
9897 -119793 -58276 -58231 120853 55612 105696 256799 -11479 -24923 -17344 -138906 -88147 97703
9884 204644 -24775 -317131 75937 -239360 271169 -61421 95359 -30362 -93972 -174609 -29561
9872 -169569 124047 -287203 207112 44345 -153376 289208 303891 85044 -274865 -26321
9861 112243 -19214 -159835 -112953 -370048 48200 -245461 -6689 146051 199512 -338316 90753
9849 -558 110982 -113250 -166316 -336354 107890 86557 -119778 -152151 -217799 70894 16022
9837 -236726 -251795 -354233 87913 183995 -98637 -159544 -314230 -60060 -77810 -80338 79512
$$ packed form
9921i954E7081a14747B695N1849b62088d6986l66982b6469l55406k92301C1262
9909a73243A7606a70536L4846A76374b36649d3309q0572r7225j74013A4027b9693
9897a19793e8276M5A20853E5612N0084J51103a1479j3444P579j21562N0759I7703
9884B04644b4775k92356G5937b39360B71169f1421I5359c0362o3610q0637b9561
9872a69569A24047b87203B07112D4345a53376B89208J4683H5044b74865b6321
9861A12243a9214j40621M6882k57095D8200b45461f689A46051N3461c38316I0753
9849e58A10982a13250n3066j70038A07890k1333a19778l2373o5648G0894A6022
9837b36726j5069j02438H7913R6082i8637o0907j54686f0060j7750k528G9512
$$ plain form
9825 -53715 -125470 -222250 -520288 89807 60299 68501 -135693 -196059 63302 -173595 -12266
9813 -9232 -76206 2719 -398237 -138410 44478 128687 26313 -299931 64508 -34840 45531 -106021
9800 142932 -99633 -273021 -129586 98195 -29004 -213740 -314690 122448 99260 -165786
9789 -105717 -126850 -286119 -218437 45141 30002 62241 1905 -51740 -135418 73809 163463 -40951
9776 77817 -109562 285060 -273738 -162604 108003 47026 97817 40396 101619 -42587 -203929
9765 -203929 -224147 -221244 -79393 -82168 156861 -250838 -196467 13306 -200913 -49272 57064
9753 82867 -158163 -458301 130253 -24289 -307433 -15312 -78965 -60323 243156 -158784 59591
9741 -83455 166709 14503 -172854 -44008 -39005 -280144 -69388 -110558 -160621 -141616 219761
$$ packed form
9825e3715p1755r6780k98038H9807k9508Q202a35693o0366F3302a73595a2266
9813i232o6974B719c98237a38410D4478Q4209B6313b99931F4508c4840D5531a06021
9800A42932i9633j73388a29586I8195b9004j84736j00950A22448k3188a65786
9789a05717k1133j59269O7682D5141j5139L2239A905e1740q3678G3809Q9654d0951
9776G7817a09562B85060b73738J11134A08003D7026N0791D0396O1223d2587j61342
9765b03929k0218K903g9393k775A56861b50838N4371A3306b00913d9272E7064
9753H2867a58163l00138A30253b4289k83144a5312o3653J8642B43156a58784E9591
9741h3455A66709A4503a72854d4008N003k41139f9388m1170n0063J9005B19761
$$ plain form
9729 -85411 -116272 -450336 -199306 114661 -246513 15385 155572 21961 -69888 8074 -188744
9717 -232257 -304297 -48027 -116193 -274346 -163355 -65608 -200822 406140 87390 17769 -109095
9705 -60343 -12146 -109998 102368 -371326 87569 -33594 -120527 -274496 -152712 -84959 -429860
9694 -429860 16296 -32087 88432 -216476 44368 74427 -190213 22377 -173446 -41622 169388
9682 41805 186397 -62241 -130114 -25400 84599 348808 193550 -421314 -82617 -137684 -122487
9671 -122487 139933 -129838 -59335 -116414 -11977 -277027 -220649 -181833 -127835 -54874 293544
9659 -23840 -165080 -75622 -236754 -340067 -99316 77343 -259344 232241 115469 -383610
9648 -167480 51676 -339764 165517 -8660 -147060 -280035 -96884 -77977 -269911 241007 -29676
$$ packed form
9729h5411l0861l34064a99306A14661b46513A5385J40187B1961f9888H074a88744
9717b32257p2040d8027o8166j58153J10991f5608j35214D06140H7390A7769a09095
9705f0343a2146r7852A02368c71326H7569c3594q6933j53969J21784O7753l44901
9694d29860A6296c2087H8432b16476D4368L0059a90213B2377a73446d1622A69388
9682D1805J44592f2241o7873b5400H4599K64209j55258d21314h2617n5067J5197
9671a22487A39933a29838e9335n7079a1977k65050N6378L8816N3998e4874B93544
9659b3840j41240g5622j61132j03313i9316G7343b59344B32241A15469c83610
9648a67480E1676c39764A65517h660j38400j32975i6884J8907j91934B41007b9676
$$ plain form
9636 -134343 -222215 -35816 -203567 -64092 148006 350479 18488 182619 148092 -234071 20195
9624 52097 -143526 -200783 -192307 65686 105830 3638 91105 -177001 61134 354751 -119124
9612 -42790 151357 -212113 -163576 -351691 54575 -232361 -243260 -70500 -251965 -178835 238475
9600 -133042 -29737 103326 50584 -129182 134642 -154827 -122623 -114546 165671 279670 6200
9588 91129 19975 15429 -194311 -214773 -250153 103371 -211169 20120 -268789 125184 228108
9577 228108 -82309 -516822 85370 64746 -283321 -43244 -41707 -206686 -302127 -114986 -194598
9566 -194598 -114478 -134474 -78399 -225516 21652 -155993 -150170 190260 72145 -382732 19799
9554 -450477 -53470 -85719 -161564 92378 57991 -51338 -75502 -83828 169013 -106094 112123
$$ packed form
9636a34343q7872c5816j67751f4092A48006K02473A8488J64131l4527b34071B0195
9624E2097a43526n7257Q476F5686M0144C638Q7467a77001F1134K93617a19124
9612d2790A51357b12113M8537j88115E4575b32361j0899g0500j81465P3130B38475
9600a33042b9737A03326E0584a29182A34642a54827L2204Q077A65671J13999F200
9588I1129A9975m546a94311k0462l5380A03371b11169B0120b68789A25184J02924
9577B28108h2309m34513H5370k0624b83321d3244J537j64979r5441a14986p9612
9566a94598Q0120j9996N6075j47117B1652a55993N823A90260G2145c82732A9799
9554d50477e3470l2249p5845I2378l4387e1338k4164q326A69013a06094A12123
$$ plain form
9542 213998 -328847 64525 9602 -362579 -119870 -384543 56355 46723 374563 -146186 -215679
9531 -215679 -239685 -100784 -119068 -287865 30100 -171816 4419 -18535 -67946 -28053 24930
9519 -310653 207059 46053 -2822 45146 -128352 -230181 -425824 -93770 -87064 23614 -122921
9507 -341315 325143 105776 45758 -177176 -193626 181450 -98020 -108099 96446 13112 175067
9496 175067 -447710 113917 236569 77729 252669 -85565 49045 238821 -141495 121335
9485 114373 -212010 158167 -146656 -245752 -83759 168654 -133621 -88618 -31220 5449 -130229
9473 75081 -7668 140044 -98178 141697 41341 3112 -326824 -532572 134438 -110308 -9860
9461 -52052 -255414 197109 -253148 -208064 95088 -84221 -464231 -223641 180439 -190857
$$ packed form
9542B13998c28847F4525I602c62579a19870k64673E6355r632L27840a46186o9493
9531b15679k4006a00784j8284j68797C0100a71816D419a8535m9411b8053B4930
9519c10653B07059D6053b822D5146a28352j01829j95643i3770O706B3614a22921
9507c41315C25143A05776D5758a77176j6450A81450i8020j0079I6446A3112J61955
9496A75067d47710A13917J22652G7729J74940h5565D9045J89776a41495A21335
9485A14373b12010A58167a46656r9096h3759A68654a33621M5003c1220E449a30229
9473G5081g668A40044i8178A41697D1341C112c26824k05748A34438a10308i860
9461e2052k03362A97109b53148M5084I5088h4221l80010b23641A80439a90857
$$ plain form
9450 37431 -312816 -344365 -206159 -106420 -138727 -50850 -48283 -294573 -254403 -80439 -344152
9439 -344152 -227356 295425 -146008 -164692 260571 -492699 -74340 255951 -34311 -124233
9429 -124233 111460 -70952 22271 -274917 274402 -159063 -14314 -199667 -191896 -288185 113162
9417 -43407 -196762 -98701 -82681 -43024 50138 235994 -272547 180395 -289044 -179871 -83304
9405 -162499 85037 -17828 -192848 -219440 -56873 -117384 -30511 -277438 -15922 -46740 114792
9393 -62478 -330436 -21948 -65149 217229 -181174 116117 -213342 -137833 -290124 -111788
9382 -424059 -5640 -122285 -94134 -58457 76936 -211604 -91183 -106154 -30314 -123305 64722
9370 -219604 -28383 -100248 223766 88758 -41284 -281789 -67453 -113351 -138469 -148091 -45397
$$ packed form
9450C7431c12816l1549J38206R9739l2307e0850K567k46290M0170h0439k63713
9439c44152J16796B95425a46008j8684B60571d92699g4340B55951c4311q9922
9429a24233A11460g0952B2271b74917B74402a59063a4314j85353P771r6289A13162
9417d3407j53355R8061J6020L9657E0138J85856b72547A80395b89044J09173h3304
9405a62499H5037a7828j75020k6592e6873o0511c0511k46927a5922l0818A14792
9393f2478k67958b1948m3201B17229a81174A16117b13342P5509j52291a11788
9382d24059e640j16645K8151L5677G6936b11604i1183j4971c0314r2991F4722
9370b19604b8383p1865B23766H8758d1284k40505f7453m5898k5118r622d5397
$$ plain form
9358 -259405 -75329 -259521 151336 -423527 97585 -47766 227493 148070 -23591 -80846 -29579
9346 -164881 109167 -149708 49938 -182905 -4072 -262012 -83774 -155101 -47590 -429246 -127587
9334 36867 -102422 94100 -67987 176150 165168 -41643 -65412 -118626 -223782 15123 138158
9323 138158 -334648 34927 -156865 -237164 225043 13866 -100142 -63289 -226490 -186659 219542
9311 -278039 -335376 -43668 -37622 -287788 235846 -83806 -10871 107664 -131149 97595 -247182
9299 -445841 -130298 109636 -226809 -96068 178779 -174647 -18270 18261 -63787 -553022
9289 -553022 142739 -16186 59074 -141316 35324 -255925 -345109 -324151 265193 -116071 166574
9277 86321 -290463 105365 -231 -181191 -112598 -314100 -125689 -81356 67785 74305 -285716
$$ packed form
9358b59405g5329j84192A51336d23527I7585d7766B27493p9423b3591n7255b9579
9346a64881A09167a49708D9938a82905d072k57940h3774p1327d7590l81656a27587
9334C6867a02422I4100f7987A76150j0982d1643k3769n3214j05156A5123J23035
9323A38158c34648C4927a56865q0299B25043A3866a00142L6853j63201L9831B19542
9311b78039n7337d3668O046k50166B35846h3806a0871A07664a31149I7595b47182
9299d45841a30298A09636b26809i6068A78779a74647a8270A8261f3787m89235
9289e53022A42739a6186E9074a41316C5324b55925q9184K0958B65193a16071A66574
9277H6321b90463A05365b31j80960O8593k01502a25689M4333F7785O520b85716
$$ plain form
9265 -211829 -194678 -90931 -42493 107741 -161608 -171748 -447566 178687 -271425 -76315 228335
9253 169887 -119526 45376 -164809 -181715 675 66484 -153642 -499137 -129102 -328539 -99385
9241 -307922 -97294 203019 40137 76333 -82695 -346574 -221673 152035 -42477 -223723 72741
9229 -321435 6796 -25463 -79341 -364677 -229001 338485 -161632 24191 -279112 47899 40181
9218 40181 243691 235266 -315109 -171587 -305399 -193754 204460 -6091 47960 66864 290259
9207 290259 -178964 120111 -190587 -138653 -125986 369673 -322760 -115528 -263002 18423
9196 124206 152936 155745 -35859 164230 71366 201088 16313 28132 -239070 -301181 -120506
9184 174531 -187622 21457 -456472 126076 -185737 239806 114919 207686 -387498 -139127
$$ packed form
9265b11829J7151i0931d2493A07741a61608j0140k75818A78687b71425g6315B28335
9253A69887a19526D5376a64809j6906F75O5809a53642l45495a29102j99437i9385
9241c07922i7294B03019D0137L6196h2695k63879J24901A52035d2477j81246G2741
9229c21435F796b5463n3878k85336J35676C38485a61632B4191b79112D7899p718
9218D0181K03510q425c15109J43522j33812J11645B04460f091D7960J8904K23395
9207B90259a78964A20111a90587N1934J2667C69673c22760a15528j47474A8423
9196A24206K8730K809c5859A64230G1366J29722A6313J1819b39070o2111a20506
9184A74531a87622B1457d56472A26076a85737B39806A14919R2767c87498a39127
$$ plain form
9173 -310079 1977 -209871 -368820 -488035 108160 92901 -238405 -289756 29791 -107773 397242
9161 -488550 -448606 231794 -367997 -12761 252122 14267 -263517 116081 -367843 -104287
9150 -135472 -74115 -258831 -310226 247284 -37017 111767 -264643 30559 205456 68048 -114102
9138 -155306 -229899 -181269 281309 87170 210252 140451 21532 -176833 -318620 136845 -118339
9126 -30326 -157948 59743 185590 -50830 -66759 127899 -97588 -64115 343293 -379638 -251842
9115 -251842 -164948 -135730 105485 -42210 -195125 100457 226431 69546 -226737 -253509 -283558
9104 -283558 -93360 -56172 -117490 -25447 54271 168930 73482 101395 -212639 12475 -176230
9092 288317 254700 -87874 -46709 -47446 -314824 -78556 -212032 -314969 -254178 -184916 21701
$$ packed form
9173c10079A977b09871j58949j19215A08160j5259b38405n1351B9791a07773C97242
9161d88550L9944B31794c67997a2761B52122A4267b63517A16081c67843a04287
9150a35472O1357j84716n1395B47284c7017A11767b64643C0559J74897F8048a14102
9138a55306p4593M8630B81309H7170J23082o9801B1532a76833j41787A36845a18339
9126c0326j27622E9743J25847e0830j5929A27899i7588L3473C43293c79638J27796
9115b51842Q6894K9218A05485d2210j52915A00457J25974F9546b26737k6772l0049
9104b83558i3360L7188o1318b5447E4271J14659G3482K7913b12639A2475a76230
9092B88317l3617h7874M1165p37k67378g8556j33476j02937O0791O9262B1701
$$ plain form
9080 -159485 8353 169728 -133683 268854 -181592 92988 -73825 107477 127695 -324434 -258701
9069 -258701 -105481 -182855 -500999 -8897 62005 -110193 -157543 63111 -2050 22279 -2995 -158727
9057 -158727 242898 166882 -130574 -233427 -205188 -306106 17988 -246259 -90852 -15610 -223877
9046 -223877 -342948 87801 -134230 -338590 -370570 85813 -250606 183920 261958 -155822
9035 -251709 48583 -18826 79942 -183811 -167619 174284 93047 56990 -241612 -3042 -89476
9024 -89476 -166031 -260120 -206476 -115218 -48338 154286 -573562 119237 207 -47127 92641 -131569
9011 -237022 -54761 -193606 4340 -192718 -79547 -182594 -56479 -59712 -230866 63216 -142167
8999 220723 -35313 303250 -201636 -200360 -21848 150376 -253425 183480 -4153 -25449 -251668
$$ packed form
9080a59485H353J61375a33683B68854a81592I2988g3825A07477K0218c24434O5733
9069b58701a05481p7374l18144h897F2005a10193m7350F3111b050B2279b995j55732
9057a58727B42898p6016a30574j02853K8239j00918A7988b46259i0852a5610k08267
9046b23877j19071H7801a34230k04360l1980H5813b50606A83920P8038a55822
9035b51709D8583a8826G9942a83811J6192A74284q1237l6057b41612c042q6434
9024h9476p6555r4089N3644R1258d8338A54286e73562A19237B07d7127I2641a31569
9011b37022e4761j38845D340a92718g9547j03047e6479l233j71154F3216a42167
8999B20723c5313C03250b01636J276b1848A50376b53425A83480d153k1296k26219
$$ plain form
8988 -251668 138212 -136716 -196526 231902 -72674 35978 -91962 234776 -20345 -399627 -109423
8976 -27478 39616 -199586 142424 -418 -30980 -173625 -240787 -158466 11222 48967 -46618 -306016
8964 -306016 95295 70796 22959 -246573 52451 -174642 -447035 -199163 36262 -194845 -104972
8953 -104972 61386 -128258 -183114 26607 177740 -105326 212525 -141520 8891 142709 -102544
8941 -51086 74172 -411635 320274 102131 -21395 182509 -20795 279053 92542 204411 171277
8930 171277 162034 280637 47777 131108 225214 800035 1722168 4025493 13018398 11436902
8920 11436902 2147558 1063619 556748 349838 17790 -353061 38573 143414 138307 -255585
8909 7354 -192370 305721 -114861 -153218 -47465 -16061 -352560 50986 -11434 43912 668 65909
$$ packed form
8988b51668A38212a36716n9810B31902g2674C5978i1962B34776b0345l79282a09423
8976b7478C9616a99586A42424d18l0562j42645o7162Q2321A1222L7745d6618k59398
8964c06016I5295k4499B2959b46573E2451a74642k72393a99163C6262a94845Q9873
8953a04972F1386a28258n4856B6607J51133a05326B12525a41520H891J33818a02544
8941e1086G4172d11635C20274A02131b1395A82509b0795B79053I2542J11869l3134
8930A71277r243J18603D7777Q3331R4106N74821R22133K303325Q992905j581496
8920A1436902B147558A063619n06871k06910A7790c53061C8573J04841n107b55585
8909G354a92370C05721a14861l8357d7465a6061l36499E0986a1434D3912F68O5241
$$ plain form
8897 65909 -249875 137378 132433 -41784 121914 -24177 49995 -60515 -51428 -368210 -268988
8886 -268988 -269961 -448853 -26630 -25617 72357 88263 -7786 12099 -286730 39665 222641 184564
8874 184564 148940 250164 -91247 1608 21601 -244179 48970 24705 388227 -211502 24994
$$ packed form
8897F5909b49875A37378m945d1784A21914b4177D9995f0515R087l16782R9222
8886b68988r73j78892b6630J013G2357J5906g786A2099b86730C9665J82976l8077
8874A84564l5624J01224i1247A608J9993b44179D8970k4265L63522b11502B4994
$$ [...]
##END NTUPLES=NMR SPECTRUM
##END=
