##TITLE=AC1562_ROEFFECT0018_8270840_BbXPOyvG72
##JCAMPDX= 6.0         $$ Bruker NMR JCAMP-DX V2.0
##DATA TYPE= NMR SPECTRUM
##DATA CLASS= NTUPLES
##ORIGIN= BRUKER
##OWNER= Administrator
$$ 1.72 TOPSPIN		Version 2.1
$$ 2013-10-18 16:42:11.940 -0700  Administrator@X
$$ Compression mode = diff/dup
##.OBSERVE FREQUENCY= 400.02188249412
##.OBSERVE NUCLEUS= ^1H
##.ACQUISITION MODE= SIMULTANEOUS (DQD)
##.ACQUISITION SCHEME= undefined
##.AVERAGES= 64
##.DIGITISER RES= 22
##SPECTROMETER/DATA SYSTEM= spect
##.PULSE SEQUENCE= noesygpps1d.comp
##.SOLVENT NAME= COFFEE_meoh
##.SHIFT REFERENCE= INTERNAL, COFFEE_meoh, 1, 14.96084
##AUDIT TRAIL= $$ (NUMBER, WHEN, WHO, WHERE, PROCESS, VERSION, WHAT)
$$ ##TITLE= Audit trail, TOPSPIN		Version 2.1
$$ ##JCAMPDX= 5.01
$$ ##ORIGIN= Bruker BioSpin GmbH
$$ ##OWNER= Administrator
$$ $$ E:\/data/COFFEE/nmr/AC1562_ROEFFECT0018_8270840_BbXPOyvG72/12/pdata/1/auditp.txt
$$ ##AUDIT TRAIL=  $$ (NUMBER, WHEN, WHO, WHERE, PROCESS, VERSION, WHAT)
(   1,<2013-10-18 16:42:07.206 -0700>,<Administrator>,<X>,<go>,<TOPSPIN 2.1>,
      <created by zg
	started at 2013-10-18 16:30:37.503 -0700,
	POWCHK enabled, PULCHK disabled,
       configuration hash MD5:
       C8 4E 4E 5D D3 5C D8 9E 9F 52 82 E0 59 8A DE 15
       data hash MD5: 64K
       C7 D1 DE 52 08 92 5B DE 38 E4 04 9D D1 1A 6C 7A>)
(   2,<2013-10-18 16:42:10.112 -0700>,<Administrator>,<X>,<proc1d>,<TOPSPIN 2.1>,
      <Start of raw data processing
       efp LB = 0.3 FT_mod = 6 PKNL = 1 PHC0 = 0 PHC1 = 0 SI = 128K 
       data hash MD5: 128K
       DC C6 EC 4C A5 2E C9 EA 55 2A 53 25 CD 3F 11 22>)
(   3,<2013-10-18 16:42:11.050 -0700>,<Administrator>,<X>,<proc1d>,<TOPSPIN 2.1>,
      <pk PHC0 = -81.65039 PHC1 = 0 
       data hash MD5: 128K
       35 8E D1 E3 06 B0 18 5B 87 41 4C F6 27 B0 12 D6>)
(   4,<2013-10-18 16:42:11.456 -0700>,<Administrator>,<X>,<proc1d>,<TOPSPIN 2.1>,
      <abs ABSG = 1 
       data hash MD5: 128K
       B1 A7 34 AF 94 58 B3 03 49 30 E7 5D 19 DC 76 92>)
(   5,<2013-10-18 16:42:11.550 -0700>,<Administrator>,<X>,<proc1d>,<TOPSPIN 2.1>,
      <abs ABSG = 2 
       data hash MD5: 128K
       40 1C 3E D0 81 7A 48 34 48 2A B2 94 17 89 72 E7>)
(   6,<2013-10-18 16:42:11.643 -0700>,<Administrator>,<X>,<proc1d>,<TOPSPIN 2.1>,
      <abs ABSG = 3 
       data hash MD5: 128K
       E6 45 C1 42 9C E5 89 03 9E A2 19 41 89 97 53 78>)
(   7,<2013-10-18 16:42:11.706 -0700>,<Administrator>,<X>,<proc1d>,<TOPSPIN 2.1>,
      <abs ABSG = 4 
       data hash MD5: 128K
       ED EF 40 78 BE 69 F1 C4 94 75 6E 6B CA 5F 6F 83>)
(   8,<2013-10-18 16:42:11.768 -0700>,<Administrator>,<X>,<proc1d>,<TOPSPIN 2.1>,
      <abs ABSG = 5 
       data hash MD5: 128K
       D4 58 77 5F 44 DB 71 64 55 54 0C B8 50 A5 09 1D>)
$$ ##END=
$$ 
$$ $$ hash MD5
$$ $$ BA 9B 2B 2B C6 A0 3E 6B 02 28 82 F5 A3 0D 21 3D
##$RELAX= 
##$RELAX= 
##$RELAX= 
##$RELAX= 
##$RELAX= 
##$RELAX= 
##$RELAX= 
##$RELAX= 
$$ Bruker specific parameters
$$ --------------------------
##$DU= <E:\>
##$EXPNO= 12
$$ [...]
##$TP07= 0
##$TPNAME0= <>
##$TPNAME1= <>
##$TPNAME2= <>
##$TPNAME3= <>
##$TPNAME4= <>
##$TPNAME5= <>
##$TPNAME6= <>
##$TPNAME7= <>
##$TPOAL= (0..7)
0.5 0.5 0.5 0.5 0.5 0.5 0.5 0.5
##$TPOFFS= (0..7)
0 0 0 0 0 0 0 0
##$TUNHIN= 0
##$TUNHOUT= 0
##$TUNXOUT= 0
##$USERA1= <user>
##$USERA2= <user>
##$USERA3= <user>
##$USERA4= <user>
##$USERA5= <user>
##$V9= 5
##$VALIST= <valist>
##$VCLIST= <CCCCCCCCCCCCCCC>
##$VD= 0
##$VDLIST= <DDDDDDDDDDDDDDD>
##$VPLIST= <PPPPPPPPPPPPPPP>
##$VTLIST= <TTTTTTTTTTTTTTT>
##$WBST= 1024
##$WBSW= 4
##$XGAIN= (0..3)
0 0 0 0
##$XL= 0
##$YL= 0
##$YMAX_a= 6506491
##$YMIN_a= -13174734
##$ZGOPTNS= <>
##$ZL1= 120
##$ZL2= 120
##$ZL3= 120
##$ZL4= 120
##$ABSF1= 14.96084
##$ABSF2= -5.597342
##$ABSG= 5
##$ABSL= 3
##$ALPHA= 0
##$AQORDER= 0
##$ASSFAC= 0
##$ASSFACI= 0
##$ASSFACX= 0
##$ASSWID= 0
##$AUNMP= <proc_prof1d_extract.lims>
##$AXLEFT= 0
##$AXNAME= <>
##$AXNUC= <1H>
##$AXRIGHT= 0
##$AXTYPE= 0
##$AXUNIT= <>
##$AZFE= 0.1
##$AZFW= 0.1
##$BCFW= 0
##$BC_mod= 0
##$BYTORDP= 0
##$COROFFS= 0
##$CY= 15
##$DATMOD= 1
##$DC= 0
##$DFILT= <>
##$DTYPP= 0
##$F1P= 0
##$F2P= 0
##$FCOR= 0.5
##$FTSIZE= 131072
##$FT_mod= 6
##$GAMMA= 0
##$GB= 0
##$INTBC= 1
##$INTSCL= 1
##$ISEN= 128
##$LB= 0.3
##$LEV0= 0
##$LPBIN= 0
##$MAXI= 10000
##$MC2= 0
##$MEAN= 0
##$ME_mod= 0
##$MI= 0
##$NCOEF= 0
##$NC_proc= -2
##$NLEV= 6
##$NOISF1= 0
##$NOISF2= 0
##$NSP= 0
##$NTH_PI= 0
##$NZP= 0
##$OFFSET= 14.96084
##$PC= 1
##$PHC0= -81.65039
##$PHC1= 0
##$PH_mod= 1
##$PKNL= yes
##$PPARMOD= 0
##$PPDIAG= 0
##$PPIPTYP= 0
##$PPMPNUM= 2147483647
##$PPRESOL= 1
##$PSCAL= 4
##$PSIGN= 0
##$PYNMP= <proc.py>
##$REVERSE= no
##$SF= 400.020009701436
##$SI= 131072
##$SIGF1= 0
##$SIGF2= 0
##$SINO= 400
##$SIOLD= 131072
##$SPECTYP= <>
##$SREGLST= <1H.CDCl3>
##$SSB= 0
##$STSI= 131072
##$STSR= 0
##$SW_p= 8223.68421052631
##$SYMM= 0
##$S_DEV= 0
##$TDeff= 65536
##$TDoff= 0
##$TI= <>
##$TILT= no
##$TM1= 0
##$TM2= 0
##$TOPLEV= 0
##$USERP1= <user>
##$USERP2= <user>
##$USERP3= <user>
##$USERP4= <user>
##$USERP5= <user>
##$WDW= 1
##$XDIM= 131072
##$YMAX_p= 417412058
##$YMIN_p= -12730
##$CURPLOT= <Network HP LaserJet P1505>
##$CURPRIN= <$Network HP LaserJet P1505>
##$DFORMAT= <normdp>
##$LAYOUT= <+/1D_H.xwp>
##$LFORMAT= <normlp>
##$PFORMAT= <normpl>
##$SURQMSG= 1
$$ End of Bruker specific parameters
$$ ---------------------------------
##NTUPLES= NMR SPECTRUM
##VAR_NAME=  FREQUENCY,     SPECTRUM/REAL,   SPECTRUM/IMAG
##SYMBOL=    X,             R,               I
##VAR_TYPE=  INDEPENDENT,   DEPENDENT,       DEPENDENT
##VAR_FORM=  AFFN,          ASDF,            ASDF
##VAR_DIM=   131072,        131072,          131072
##UNITS=     HZ,            ARBITRARY UNITS, ARBITRARY UNITS
##FACTOR=    0.0627417313425164, 1,          1
##FIRST=     8223.62146879497, -972,         -63077
##LAST=      0,             200,             -63968
##MIN=       0,             -12730,          0
##MAX=       8223.62146879497, 417412058,    0
$$ Real data points
##PAGE= N=1
##DATA TABLE= (X++(R..R)), XYDATA
$$ [...]
63815F44732k2399k3173k3608k3475k2714k1516k0223j8935j7435j5569j3528
63804D22157j1647j0219r405r018q448p215n699m824n005n767o423o618o186n150
63790C20533m094l834m422m962m730l961l191k493j765j233j080j074j001j057
63776B81636j291j236n99J09K46j00n09r46j441j601j198q51j197j752j500m06
63760B67364N37O59J24o77j397j491p49Ll23j455j981j266j94L13M35P01J009
63743B61612J008P79O09N58P33J413K485L238L148K474J815J525J769K553L364
63728B89083L501L088L032L599L807K957J933K118L478M734N114M998M882M697
63714C41021M264L683K981J920M44j013j917k164k086k056k183k360k535k771
$$ y = [644732, 622333, 599160, 575552, 552077, 529363, 507847, 487624, 468689, 451254, 435685, 422157, 410510, 400291, 390886, 381868, 373420, 366205, 360506, 355682, 350677, 344910, 338487, 331869, 325683, 320533, 316439, 312605, 308183, 303221, 298491, 294530, 291339, 288846, 287081, 285848, 284768, 283694, 282693, 281636, 280345, 279109, 278510, 278619, 278865, 278765, 278256, 277310, 275869, 274268, 273070, 272219, 271022, 269270, 267770, 267364, 267901, 268560, 268684, 268007, 266610, 265119, 264370, 264373, 264050, 262595, 260614, 259348, 259154, 259467, 259902, 260603, 261612, 262620, 263399, 264008, 264566, 265299, 266712, 269197, 272435, 275583, 278057, 279872, 281397, 283166, 285719, 289083, 292584, 295672, 298704, 302303, 306110, 309067, 311000, 313118, 316596, 321330, 326444, 331442, 336324, 341021, 345285, 348968, 351949, 353869, 354313, 353300, 351383, 349219, 347133, 345077, 342894, 340534, 337999, 335228]
63700C35228k986k808k014r62j69M27J174J778J584R07J052K447L785L799L068
63685C46310K982L584L784L254K766K629K213J271N42M88M77r4o56k52J029K198
63669C72525K643K589K477K429K360K111J452L05r47j678j711j609k067l086l953
63654C73840m173m122m466n072n123m359l518l149k685j417J32Q33O45O33J300
63639C39299K002K327K914M362O147P362P889Q087P904P097N973N085M417L640
63625D14505K960L021L933N141O237P239Q024Q251Q100Q449R924J2156J4352J6209
63611E28501J7961J9794K1641K3375K4935K6330K7720K9321L1027L2292L2543
63600H15440L1517K9059K4893J9055J2364O005O17l840p349r465r971r527r259
$$ y = [335228, 332242, 329434, 327420, 326458, 326289, 326716, 327890, 329668, 331252, 332159, 333211, 335658, 339443, 343242, 346310, 349292, 352876, 356660, 359914, 362680, 365309, 367522, 368793, 369335, 369823, 370300, 370206, 369550, 369298, 370327, 372525, 375168, 377757, 380234, 382663, 385023, 387134, 388586, 388891, 387944, 386266, 384555, 382946, 380879, 377793, 373840, 369667, 365545, 361079, 356007, 350884, 346525, 343007, 339858, 337173, 335756, 335888, 336721, 337366, 337999, 339299, 341301, 343628, 346542, 350904, 357051, 364413, 372302, 380389, 388293, 395390, 401363, 406448, 410865, 414505, 417465, 420486, 424419, 429560, 435797, 443036, 451060, 459311, 467411, 475860, 485784, 497940, 512292, 528501, 546462, 566256, 587897, 611272, 636207, 662537, 690257, 719578, 750605, 782897, 815440, 846957, 876016, 900909, 919964, 932328, 938333, 938950, 935110, 927761, 918296, 908325, 898798, 889539]
63587H89539r796j1021j2644j4652j7122j9858k2405k4339k5447k5718k5315k4436
63575F56786k3129k1238j8650j5615j2673j0222q142n978l505j035R03K130K950
63562E42582L681M369M995N679O430O905O875O829P593R294J1226J2959J5037
63549F44454J8160K2068K5898K9412L3201L7696M2537M7080N0883N3301N2987
63538A057677M8352L8681K4886R369m802j5129k0637k1898k0287j7305j4344j2340
63526A052223j1385j1041j1353j3162j6988k2022k6773l0499l3454l5813l7077
63515H02656l6727l4971l2527k9930k7333k4752k2222j9766j7378j5082j3040
63504E28928j1594j1026j1080j0963j0159r131q756r124r425r043q191p292o303
$$ y = [889539, 879743, 868722, 856078, 841426, 824304, 804446, 782041, 757702, 732255, 706537, 681222, 656786, 633657, 612419, 593769, 578154, 565481, 555259, 547117, 541139, 537634, 536599, 537502, 539632, 542582, 546263, 550632, 555627, 561306, 567736, 574641, 581516, 588345, 595938, 605232, 616458, 629417, 644454, 662614, 684682, 710580, 739992, 773193, 810889, 853426, 900506, 951389, 1004690, 1057677, 1106029, 1144710, 1169596, 1178965, 1174163, 1159034, 1138397, 1116499, 1096212, 1078907, 1064563, 1052223, 1040838, 1029797, 1018444, 1005282, 988294, 966272, 939499, 909000, 875546, 839733, 802656, 765929, 730958, 698431, 668501, 641168, 616416, 594194, 574428, 557050, 541968, 528928, 517334, 506308, 495228, 484265, 474106, 464975, 456219, 447095, 437670, 428627, 420436, 413144, 406841]
63491D06841n029l605k313j272p10r96j885k272j327L89J637K059K281K733L330
63476C99861M127N340O498O660N732M698M138L475K241J068O08L21o67k032k658
63461D39410k268j590j164q71n94l96q7M59P12J19p07n44O20J528J662J984L156
63444D41429M334M654M849O179Q453J0417J1669J3046J5216J8044K1309K5108
63432E84707K9314L3543L7785M2193M5844M6415M1884L2440K0443Q702r96p930
63420I14344j1660j1703q174k430L611R051J4481K0552K6587L1193L3703L4319
63408A053874L3129K9857K4612J8005J0596K849m192r138j1532j2254j2442j2540
63396A110824j2703j3474j5479j8805k3019k7543l1771l5188l7661l9238l9633
$$ y = [406841, 401812, 398207, 395894, 394622, 393912, 392916, 391031, 388759, 387432, 387821, 389458, 391517, 393798, 396531, 399861, 403988, 409328, 415826, 422486, 428218, 432916, 437054, 440529, 442770, 443838, 444446, 444767, 444100, 442068, 439410, 437142, 435552, 434388, 433517, 432923, 432527, 432440, 432899, 433611, 433730, 433023, 432479, 433099, 434627, 436289, 438273, 441429, 445763, 450417, 455266, 461445, 469898, 480315, 491984, 505030, 520246, 538290, 559599, 584707, 614021, 647564, 685349, 727542, 773386, 819801, 861685, 894125, 914568, 923270, 922274, 914344, 902684, 890981, 882807, 880377, 883988, 893039, 907520, 928072, 954659, 985852, 1019555, 1053874, 1087003, 1116860, 1141472, 1159477, 1170073, 1172922, 1168730, 1159592, 1148060, 1135806, 1123364, 1110824, 1098121, 1084647, 1069168, 1050363, 1027344, 999801, 968030, 932842, 895181, 855943, 816310]
63385H16310l8397l5802l2893l0288k7543k4192k0769j8044j5773j3035r667o543
63373E43364m309k613p31J489L637N431P077Q948J0981J2612J3523J4330J6087
63360F29826J9044K2397K5427K8288L1329L4246L6585L8558M0622M2478M3215
63349I92015M2369M0175L6813L2033K5604J7741R135J000n218q926j1088j3041
63337A158612j4684j4757j3143j1810j2861j6314k0565k4465k8093l1709l4879
63326I35332l6810l7045l5571l2634k8693k4282j9677j4805r614m468l3L153M616
63313F99469L456j527j0455k1133k9899l4198l4192l1726k8268k4280j9980j5842
63301D51425j2316r680q111p438o940o002m900m330m263m021l440l077l110k922
$$ y = [816310, 777913, 742111, 709218, 678930, 651387, 627195, 606426, 588382, 572609, 559574, 549907, 543364, 539055, 536442, 535711, 537200, 540837, 546268, 553345, 562293, 573274, 585886, 599409, 613739, 629826, 648870, 671267, 696694, 724982, 756311, 790557, 827142, 865700, 906322, 948800, 992015, 1034384, 1074559, 1111372, 1143405, 1169009, 1186750, 1195885, 1196885, 1191667, 1182741, 1171653, 1158612, 1143928, 1129171, 1116028, 1104218, 1091357, 1075043, 1054478, 1030013, 1001920, 970211, 935332, 898522, 861477, 825906, 793272, 764579, 740297, 720620, 705815, 696201, 691733, 691700, 694853, 699469, 702925, 701398, 690943, 669810, 639911, 605713, 571521, 539795, 511527, 487247, 467267, 451425, 439109, 429429, 421318, 413880, 406940, 400938, 396038, 391708, 387445, 383424, 379984, 376907, 373797, 370875]
63287C70875k161j388j170j266j270j359j782k187k179k043k127k028j190o4L52
63272C49013o6m43k25J92L31L32N92J200J981K675K936K634K274K584L554M368
63256C73932M541M552M990N514N279M169L145L187M291N617O464O855P197P660
63242D47393Q184Q906J0122J1707J3052J3832J4465J5413J6505J7414J8353J9662
63230F15008K1034K1932K2600K3636K4760K4935K3992K2978K2632K2437K1815
63219H67759K1339K1823K2901K3509K3471K3594K4185K4379K3129K0340J6752
63208A113181J3004Q974L967k455r707j6503k2046k6602l0611l3719l5212l5126
63196I27145l4219l2914l0856k7629k3471j9100j5156j1798q672n282j641J675
$$ y = [370875, 368714, 367326, 366156, 364890, 363620, 362261, 360479, 358292, 356113, 354070, 351943, 349915, 348725, 348661, 349013, 348947, 348504, 348279, 348471, 348802, 349134, 349726, 350926, 352907, 355582, 358518, 361152, 363426, 366010, 369564, 373932, 378473, 383025, 388015, 393529, 398808, 402977, 406122, 409309, 413600, 419217, 425681, 432536, 439733, 447393, 455577, 464483, 474605, 486312, 499364, 513196, 527661, 543074, 559579, 576993, 595346, 615008, 636042, 657974, 680574, 704210, 728970, 753905, 777897, 800875, 823507, 845944, 867759, 889098, 910921, 933822, 957331, 980802, 1004396, 1028581, 1052960, 1076089, 1096429, 1113181, 1126185, 1135159, 1139126, 1136671, 1126964, 1110461, 1088415, 1061813, 1031202, 997483, 962271, 927145, 892926, 860012, 829156, 801527, 778056, 758956, 743800, 732002, 723330, 718048, 716407, 718082]
63184G18082M393P064J0205J3265J5238J6155J7045J8360J9386J9533J9309J9405
63172H97440J9536J8923J7482J5813J4290J2819J1355R980Q443O174K876j235
63160A033896n765j0379j4724j8540k1951k5301k8605l1398l3197l3863l3479
63149G76694l2235l0513k8744k6897k4426k1043j7357j4320j2152j0216q064o074
63137E44653m836m267l814l247k803k582k452k473k870l368l218k239j255r96
63123E04233j105q02r3N07R91J671K222K047J547J841L032L937L975M045M852
63108E32900N499M877L517K796K875K789K247J917K011J943J638J849K758L365
63094E72981K984K432K896M289N544O072O110N871N170L898K330P77o26j790k570
$$ y = [718082, 722475, 729539, 739744, 753009, 768247, 784402, 801447, 819807, 839193, 858726, 878035, 897440, 916976, 935899, 953381, 969194, 983484, 996303, 1007658, 1017638, 1026081, 1032255, 1035131, 1033896, 1028131, 1017752, 1003028, 984488, 962537, 937236, 908631, 877233, 844036, 810173, 776694, 744459, 713946, 685202, 658305, 633879, 612836, 595479, 581159, 569007, 558791, 550727, 544653, 539817, 535550, 531736, 528489, 525686, 523104, 520652, 518179, 515309, 511941, 508723, 506484, 505229, 504233, 503128, 502326, 502233, 502740, 503731, 505402, 507624, 509671, 511218, 513059, 516091, 520028, 524003, 528048, 532900, 538399, 543276, 546793, 549589, 552464, 555253, 557500, 559417, 561428, 563371, 565009, 566858, 569616, 572981, 575965, 578397, 581293, 585582, 591126, 597198, 603308, 609179, 614349, 618247, 620577, 621354, 620728, 618938, 616368]
63079F16368k870k640j842n40R64K278L210L847M424N216O411P975R660J1161
63065F63622J2246J2846J3197J3816J5038J6645J8266K0041K2414K5327K8224
63054H61682L1013L4277L8161M1751M4229M6149M8740N2231N5685N8424O0694
63043A373036O2772O4155O4184O3029O1576O0520N9904N9467N9142N9216N9988
63032B046989O1206O1853O0764N7536N2566M6111L7671K6640J3402o95j4423k7443
63020B422177l9962n2026o3315p3264q1050q5658q6470q3911p9229p3534o7254
63009A636504o0510n3540m6409l8739l0237k1366j3005n490J540Q322J4495J9535
62997A411100K3215K5537K6693K7260K7920K8679K8815K7963K6813K6283K6421
$$ y = [616368, 613498, 610858, 609016, 608476, 609440, 611718, 614928, 618775, 623199, 628415, 634826, 642801, 652461, 663622, 675868, 688714, 701911, 715727, 730765, 747410, 765676, 785717, 808131, 833458, 861682, 892695, 926972, 965133, 1006884, 1051113, 1097262, 1146002, 1198233, 1253918, 1312342, 1373036, 1435808, 1499963, 1564147, 1627176, 1688752, 1749272, 1809176, 1868643, 1927785, 1987001, 2046989, 2108195, 2170048, 2230812, 2288348, 2340914, 2387025, 2424696, 2451336, 2464738, 2464043, 2449620, 2422177, 2382215, 2330189, 2266874, 2193610, 2112560, 2026902, 1940432, 1856521, 1777292, 1703758, 1636504, 1575994, 1522454, 1476045, 1437306, 1407069, 1385703, 1372698, 1367208, 1368748, 1377070, 1391565, 1411100, 1434315, 1459852, 1486545, 1513805, 1541725, 1570404, 1599219, 1627182, 1653995, 1680278, 1706699]
62986A706699K6638K6598K6214K4963K2094J7549J2009N898j056r014j7440k5679
62974A815473l3626m1392m8536n4244n8160o0629o2004o2132o0717n7964n4540
62963A221529n0893m6924m2452l7813l3730l0628k8329k6387k4464k2408k0314
62952H57187j8673j8002j8178j8409j8129j7555j7097j6598j5621j4141j2538
62941F72246j1128j0184j0077j0797j1498j1223r956q386o764m821k845j804k001
62928E70762k396j880o53K32L17Q1lq0n47j460k441l058l199l054k730k085j176
62911E46630o23j039k099k803k734k430k349k207j770j610k268l167l156k014
62897E16361o58J00L73O85J236J877K408K635K310J326m5j224j697j481j151j178
$$ y = [1706699, 1733337, 1759935, 1786149, 1811112, 1833206, 1850755, 1862764, 1868662, 1867606, 1858592, 1841152, 1815473, 1781847, 1740455, 1691919, 1637675, 1579515, 1518886, 1456882, 1394750, 1334033, 1276069, 1221529, 1170636, 1123712, 1081260, 1043447, 1009717, 979089, 950760, 924373, 899909, 877501, 857187, 838514, 820512, 802334, 783925, 765796, 748241, 731144, 714546, 698925, 684784, 672246, 661118, 650934, 640857, 630060, 618562, 607339, 597383, 588997, 582233, 577412, 574567, 572763, 570762, 568366, 566486, 565833, 566065, 566382, 566463, 566460, 566380, 565833, 564373, 561932, 558874, 555675, 552621, 549891, 547806, 546630, 546007, 544968, 542869, 540066, 537332, 534902, 532553, 530346, 528576, 526966, 524698, 521531, 518375, 516361, 515703, 515803, 516176, 516861, 518097, 519974, 522382, 525017, 527327, 528653, 528608, 527384, 525687, 524206, 523055, 521877]
62881E21877j302q69J70J085J389J426J590J582J057N50P99J401J078o28k694
62866E28511l903m086l821l513l225k988k890k985l342l833l862k733o09J342
62852D88063K139J979J674J475J067M99L85R37J407R44k68j179j124m71J9J17
62836D97663J08J54J82K36N02Q26P54K42j35M8M74O72P48J083J635K184K927M081
62818E14384N047M891L725K767K776L198L233L045L345M265N265N868N976N703
62804E73488N351N350N882O667P427Q274R322J0268J0825J1274J2083J3136J3936
62791F93283J4431J5128J6328J7909J9958K3000K7291L2226L6871M0980M5195
62780I82600N0269N6285O2672O8930P5173Q1788Q8562R4434R8343J00146J00377
$$ y = [521877, 520575, 519706, 519876, 520961, 522350, 523776, 525366, 526948, 528005, 528555, 529354, 530755, 531833, 531205, 528511, 524608, 520522, 516701, 513188, 509963, 506975, 504085, 501100, 497758, 493925, 490063, 487330, 486721, 488063, 490202, 492181, 493855, 495330, 496397, 496896, 497281, 498218, 499625, 500569, 500301, 499122, 497998, 497527, 497546, 497663, 497771, 497925, 498107, 498343, 498845, 499671, 500425, 500667, 500532, 500580, 501054, 501726, 502474, 503557, 505192, 507376, 510303, 514384, 519431, 524322, 528047, 530814, 533590, 536788, 540021, 543066, 546411, 550676, 555941, 561809, 567785, 573488, 578839, 584189, 590071, 596738, 604165, 612439, 621761, 632029, 642854, 654128, 666211, 679347, 693283, 707714, 722842, 739170, 757079, 777037, 800037, 827328, 859554, 896425, 937405, 982600, 1032869, 1089154, 1151826, 1220756, 1295929, 1377717, 1466279, 1560713, 1659056, 1759202, 1859579]
62769A859579R9240R6217R0614Q2179P1133N7967M3296K7610J1082o152k3467
62758B409298l9763n4131o6312p6456q4724r1167r5725r8121r8058r5743r2039
62747A517059q7848q3421p8449p2728o6578o0620n5274n0407m5452m0104l4913
62736H41265l0902k8476k6891k5074k2674k0041j7466j4916j2421j0187q303o679
62724F17235n361m486l848k970j804q70l70L16J770L537M683N198O033P713R663
62709F36439J1223J2650J4576J7033J9614K2273K5235K8328L1173L3988L7497
62698H90029M1819M6194N0026N3609N7335O0821O3442O5341O7164O8862O9458
62687A534100O8013O4311N8511N0653M0823K9376J6775L338j0554k4158l6529
$$ y = [1859579, 1958819, 2055036, 2145650, 2227829, 2298962, 2356929, 2400225, 2427835, 2438917, 2432765, 2409298, 2369535, 2315404, 2249092, 2172636, 2087912, 1996745, 1901020, 1802899, 1704841, 1609098, 1517059, 1429211, 1345790, 1267341, 1194613, 1128035, 1067415, 1012141, 961734, 916282, 876178, 841265, 810363, 781887, 754996, 729922, 707248, 687207, 669741, 654825, 642404, 632217, 623914, 617235, 611874, 607388, 603540, 600570, 598766, 597896, 597526, 597842, 599612, 603149, 607832, 613030, 619063, 626776, 636439, 647662, 660312, 674888, 691921, 711535, 733808, 759043, 787371, 818544, 852532, 890029, 931848, 978042, 1028068, 1081677, 1139012, 1199833, 1263275, 1328616, 1395780, 1464642, 1534100, 1602113, 1666424, 1724935, 1775588, 1816411, 1845787, 1862562, 1865900, 1855346, 1831188, 1794659]
62676A794659m7002n5512o2423o8012p2009p3769p3106p0807o8040o5282o2145
62665A076552n8286n3966m9666m5527m1462l7482l3623k9875k6385k3469k1121
62654F55690j8840j6348j4199j3083j2686j1873j0127q274p453p713q016p438
62642E19640o110m962m758n327n754n266l947k507j414n17M60J347J672J258M79
62627D84294j32m28p55j449k301k664k238j502j126j046n97M59J538K083K337
62612D76473K867L677M280M524M780N346O111O867P593Q356R238J0442J2099J3941
62598E76594J5532J7048J9301K2708K6624L0123L3170L6473M0318M4087M6975
62587I08953M8682M9250M8652M6760M3518L8892L2847K5552J7444Q912J08q836
$$ y = [1794659, 1747657, 1692145, 1629722, 1561710, 1489701, 1415932, 1342826, 1272019, 1203979, 1138697, 1076552, 1018266, 964300, 914634, 869107, 827645, 790163, 756540, 726665, 700280, 676811, 655690, 636850, 620502, 606303, 593220, 580534, 568661, 558534, 550260, 542807, 535094, 527078, 519640, 513530, 508568, 503810, 498483, 492729, 487463, 483516, 481009, 479595, 479078, 479538, 480885, 482557, 483815, 484294, 484162, 483734, 482979, 481530, 479229, 476565, 474327, 472825, 471699, 470653, 470056, 470515, 472053, 474136, 476473, 479340, 483017, 487297, 491821, 496601, 501947, 508058, 514925, 522518, 530874, 540112, 550554, 562653, 576594, 592126, 609174, 628475, 651183, 677807, 707930, 741100, 777573, 817891, 861978, 908953, 957635, 1006885, 1055537, 1102297, 1145815, 1184707, 1217554, 1243106, 1260550, 1269462, 1269570, 1260734]
62575A260734j7506k5363l2095l7610m1796m4509m5775m5813m4879m3178m0968
62564H41242l8518l5974l3363l0701k7978k5139k2226j9506j7242j5321j3341
62553E61933j1150r112p705p015o755o607o376n908n160m314l652l209k721j961
62539D80288j052k88K59P93J448J977J958J313N18J55L15O32R37J632L147N154
62523D99186O735P431P788Q654J0220J2073J4047J6496J9575K2709K5183K7117
62511F77214K9428L2735L6490L9445M0869M1127M1027M0775L9740L7286L3521
62500A089657K8983K3808J7636J0456L079l619r606j5316k0543k4282k5810k5435
62488A049008k3923k1562j8187j3786q744l604J076M802P513R824J2526J5688
$$ y = [1260734, 1243228, 1217865, 1185770, 1148160, 1106364, 1061855, 1016080, 970267, 925388, 882210, 841242, 802724, 766750, 733387, 702686, 674708, 649569, 627343, 607837, 590595, 575274, 561933, 550783, 541671, 533966, 526951, 520196, 513589, 507213, 501305, 496145, 491831, 488179, 484970, 482249, 480288, 479236, 478948, 479207, 480000, 481448, 483425, 485383, 486696, 487214, 487369, 487684, 488316, 489253, 490885, 494032, 499186, 505921, 513352, 521140, 529794, 540014, 552087, 566134, 582630, 602205, 624914, 650097, 677214, 706642, 739377, 775867, 815312, 856181, 897308, 938335, 979110, 1018850, 1056136, 1089657, 1118640, 1142448, 1160084, 1170540, 1173619, 1170000, 1160394, 1145078, 1124535, 1100253, 1074443, 1049008, 1025085, 1003523, 985336, 971550, 962806, 959202, 960278, 965080, 972593, 982417, 994943, 1010631]
62476A010631J8502K0000J9689J7585J3961R265M007j415o719j1603j5960k0233
62464A057710k5169l0963l6750m1140m3112m2566m0355l7916l6315l5314l3636
62453F54474l0505k6554k2836j9396j5577j1495q275o627n910n018l666k295j123
62440D95197L8J259K299L044L694M449N246N771N605M452K561Q25Rj67p55k308
62424E31219m247n749o723p540q187q269p763p138o672o157n460m856m541m196
62410D43721l429k385j539j118j046j309j865k349k290j723j131p81m96j55J00
62395D22205L26R15J960K898L205L153L392L998M354L933K846J712J260J903L323
62380D61383M629N207N358N738O460P211P954Q866R681R876R582R564J0075J0526
$$ y = [1010631, 1029133, 1049133, 1068822, 1086407, 1100368, 1109633, 1113640, 1112225, 1105506, 1093903, 1077943, 1057710, 1032541, 1001578, 964828, 923688, 880576, 838010, 797655, 759739, 723424, 688110, 654474, 623969, 597415, 574579, 555183, 539606, 528111, 519836, 513209, 507299, 502281, 498615, 496320, 495197, 495235, 496494, 498793, 501837, 505531, 509980, 515226, 520997, 526602, 531054, 533615, 534440, 534449, 534282, 533527, 531219, 526972, 521223, 514500, 506960, 498773, 490504, 482741, 475603, 468931, 462774, 457314, 452458, 447917, 443721, 440292, 437907, 436368, 435250, 434204, 432895, 431030, 428681, 426391, 424668, 423537, 422756, 422260, 422105, 422205, 422531, 423446, 425406, 428304, 431509, 434662, 438054, 442052, 446406, 450339, 453185, 454897, 456157, 458060, 461383, 466012, 471219, 476577, 482315, 488775, 495986, 503940, 512806, 522487, 532363, 541945, 551509, 561584, 572110]
62366E72110J0632J1078J2473J4325J5827J7169J9274K2451K6162L0024L4214
62355G85739L8809M3421M7697N1680N5340N8226N9731N9449N7089N2471M5825
62344A355477L7786K8911J9479R919J051o471j2766j8543k4315k9994l5099l9132
62332A286303m1856m3335m3728m3065m1359l8835l5814l2416k8684k5103k2544
62321H89564k1440k1288k1289k1219k1392k1960k2669k3198k3301k2653k1032
62310F48123j8811j6935j5998j5482j4220j1702q773o804o282o342n818m493l163
62297E13300k622k870l329l471l088k263j266l74M31J424K698L875M470M386L946
62282E15247L575L556L899M251M095L295K296J628J356J314J575K301L229L895
$$ y = [572110, 582742, 593820, 606293, 620618, 636445, 653614, 672888, 695339, 721501, 751525, 785739, 824548, 867969, 915666, 967346, 1022686, 1080912, 1140643, 1200092, 1257181, 1309652, 1355477, 1393263, 1422174, 1441653, 1451572, 1452623, 1446152, 1433386, 1414843, 1390528, 1360534, 1325435, 1286303, 1244447, 1201112, 1157384, 1114319, 1072960, 1034125, 998311, 965895, 937211, 912108, 889564, 868124, 846836, 825547, 804328, 782936, 760976, 738307, 715109, 691808, 669155, 648123, 629312, 612377, 596379, 580897, 566677, 554975, 546202, 539398, 533116, 526774, 520956, 516463, 513300, 510678, 507808, 504479, 501008, 497920, 495657, 494391, 494017, 494448, 495872, 498570, 502445, 506915, 511301, 515247, 518822, 522378, 526277, 530528, 534623, 537918, 540214, 541842, 543198, 544512, 546087, 548388, 551617, 555512]
62268E55512M375N292O914Q653R830J0611J1842J4129J7372K1108K4975K8878
62256G19491L3014L7750M3195M8843N3838N7801O1095O4020O5860O5172O1066
62245A311145N3989M5049L4997K4215J3366L402n300j3259k1132k8926l6238m2887
62233A338421m8824n3680n6943n8577n8921n7982n5389n1200m6292m1555l7132
62222G71926l2754k8560k4978k1975j9033j6016j3570j2315j1936j1518j0617
62211E68654r580q773q017p012n952n290n061m865m503m158l871l276k082n24
62197D95690Q79J804K170K088K020K615L973N333O002O350P252Q717R785R919
62183E64597R771J0167J0944J1301J0940J0297R778R329Q682P726O479N063L816
$$ y = [555512, 559887, 565179, 572093, 580746, 590576, 601187, 613029, 627158, 644530, 665638, 690613, 719491, 752505, 790255, 833450, 882293, 936131, 993932, 1055027, 1119047, 1184907, 1250079, 1311145, 1365134, 1410183, 1445180, 1469395, 1482761, 1486163, 1480863, 1467604, 1446472, 1417546, 1381308, 1338421, 1289597, 1235917, 1178974, 1120397, 1061476, 1003494, 948105, 896905, 850613, 809058, 771926, 739172, 710612, 685634, 663659, 644626, 628610, 615040, 602725, 590789, 579271, 568654, 559074, 550301, 542284, 535272, 529320, 524030, 518969, 514104, 509601, 505443, 501572, 498296, 496214, 495690, 496569, 498373, 500543, 502631, 504651, 507266, 511239, 516572, 522574, 528924, 536176, 544893, 554678, 564597, 574368, 584535, 595479, 606780, 617720, 628017, 637795, 647124, 655806, 663532, 670011, 675074, 678890]
62170F78890L291M024O311J0020J4570J9183K3398K7357L1430L5618L9471M2529
62158I36092M4663M5858M5859M4101M0023L3517K5246J6485Q484J778l898r071
62146A229137j3979j8534k2626k6228k9226l1307l2175l1776l0274k7859k4694
62135I40459k0940j6647j1726o342j272K529M983P201J0389J4529J8381K0675
62123I62219K1158K0627K0272K0771K1708K1937K0796J8830J6944J5142J2664
62112A173068R277N630K123j820o840j2496j7551k1079k2753k2387j9961j6189
62100A049022j2489j0007q814q184p433o354m970l180q26J949M626O747Q180Q925
62086A017192Q880Q202P594P651P975P615O468N612N988P409R252J1399J3894
$$ y = [678890, 682181, 686205, 692516, 702536, 717106, 736289, 759687, 787044, 818474, 854092, 893563, 936092, 980755, 1026613, 1072472, 1116573, 1156596, 1190113, 1215359, 1231844, 1240328, 1242106, 1238208, 1229137, 1215158, 1196624, 1173998, 1147770, 1118544, 1087237, 1055062, 1023286, 993012, 965153, 940459, 919519, 902872, 891146, 884804, 883532, 886061, 891044, 898245, 908634, 923163, 941544, 962219, 983377, 1004004, 1024276, 1045047, 1066755, 1088692, 1109488, 1128318, 1145262, 1160404, 1173068, 1182345, 1187975, 1190098, 1188278, 1181438, 1168942, 1151391, 1130312, 1107559, 1085172, 1065211, 1049022, 1036533, 1026526, 1017712, 1009528, 1002095, 995741, 990771, 987591, 986765, 988714, 993340, 1000087, 1008267, 1017192, 1026072, 1034274, 1041868, 1049519, 1057494, 1065109, 1071577, 1077189, 1083177, 1090586, 1099838, 1111237, 1125131]
62073A125131J6230J7826J8878J9953K0858K0768J9478J7788J6523J5848J5649
62062A324930J5977J6802J7885J9162K0801K2581K3620K3107K1023J7895J4158
62051A537941J0047N849J819k011n799r800j4417k0031k6492l2937l8445m2763
62039A362961m6257m9298n1849n3536n3892n2709n0353m7531m4643m1537l8110
62028H33246l4744l1716k8595k4820k0789j7615j5755j4532j3258j2158j1692
62017F07572j1587j1222j0651j0374j0249r464p838o312n731n745n393m347k941
62004E05718j368L37J802K599L057L938N155N661M936L810L252L053K413J270
61990E45633K34n97j746l362m917o021o870p653q143q165q004p999q084q032p844
$$ y = [1125131, 1141361, 1159187, 1178065, 1198018, 1218876, 1239644, 1259122, 1276910, 1293433, 1309281, 1324930, 1340907, 1357709, 1375594, 1394756, 1415557, 1438138, 1461758, 1484865, 1505888, 1523783, 1537941, 1547988, 1553837, 1555656, 1553645, 1547846, 1538046, 1523629, 1503598, 1477106, 1444169, 1405724, 1362961, 1316704, 1267406, 1215557, 1162021, 1108129, 1055420, 1005067, 957536, 912893, 871356, 833246, 798502, 766786, 738191, 713371, 692582, 674967, 659212, 644680, 631422, 619264, 607572, 595985, 584763, 574112, 563738, 553489, 544025, 536187, 529875, 524144, 518399, 513006, 508659, 505718, 504350, 504687, 506489, 509088, 512145, 516083, 521238, 526899, 531835, 535645, 538897, 541950, 544363, 545633, 545867, 545270, 543524, 540162, 535245, 529224, 522354, 514701, 506558, 498393, 490389, 482390, 474306, 466274, 458430]
61975D58430p576p058o144n046m124l446k828k208j747j503j313j014o84n16m69
61960D12754k20M84J439K149K402K464K682L090L559M028M393M501M582N348P160
61945D60815R319J0783J1472J2212J3489J4904J5966J6712J7317J7740J8118J8844
61933F37691J9865K0435K0040J9080J8142J7026J5156J2619J0127Q070O167M083
61921H08501J830m62k692m710o378p734q796r240q695p303n613l843j691J018
61907G44192L869O309Q298J0280J2515J4626J5805J5446J3571J0626P020L017
61895H65574j005m638p882j1052j4023j6096j7010j7572j8568j9475j9064j7263
61883G01926j5389j4424j3939j3061j1759j0561r626q796q143p858p756p488p046
$$ y = [458430, 450854, 443796, 437652, 432606, 428482, 425036, 422208, 420000, 418253, 416750, 415437, 414423, 413739, 413223, 412754, 412534, 413018, 414457, 416606, 419008, 421472, 424154, 427244, 430803, 434831, 439224, 443725, 448307, 453655, 460815, 470134, 480917, 492389, 504601, 518090, 532994, 548960, 565672, 582989, 600729, 618847, 637691, 657556, 677991, 698031, 717111, 735253, 752279, 767435, 780054, 790181, 798251, 804418, 808501, 810331, 809869, 807177, 802467, 796089, 788355, 779559, 770319, 761624, 754321, 748708, 744865, 743174, 744192, 748061, 754370, 762668, 772948, 785463, 800089, 815894, 831340, 844911, 855537, 862557, 865574, 864569, 859931, 852049, 840997, 826974, 810878, 793868, 776296, 757728, 738253, 719189, 701926, 686537, 672113, 658174, 645113, 633354, 622793, 613167, 604371, 596228, 588370, 580614, 573126, 566080]
61870E66080o531n625l948j889l94K05O26J722L599N812P937R667J0796J1552
61856E99609J2611J4391J6503J8338J9954K1909K4327K6706K8601L0104L1383
61845H44436L2281L2588L2399L1890L0838K8657K4936J9865J4221Q852L973r83
61833A103953o484j1837j5544j6850j6487j5440j3557j0051n063Q4M313P703J0760
61820A015500J3338J4798J4826J3592J1200P414K122m120j0222j5354j9527k3215
61808A020352k6406k8448k8995k8690k8378k7961k6729k4645k2535k0837j9032
61797G37696j6679j4312j2746j1958j1257j0322r447q928q657q324p649o511n115
61784F05791l931l253k909k624k427k399k291j827j200q53q38q55q68j273k279
$$ y = [566080, 559549, 553924, 549976, 548087, 547693, 547898, 548524, 550246, 553845, 559657, 567594, 577261, 588057, 599609, 612220, 626611, 643114, 661452, 681406, 703315, 727642, 754348, 782949, 813053, 844436, 876717, 909305, 941704, 973594, 1004432, 1033089, 1058025, 1077890, 1092111, 1100963, 1104936, 1103953, 1097469, 1085632, 1070088, 1053238, 1036751, 1021311, 1007754, 997703, 992640, 992724, 997037, 1004740, 1015500, 1028838, 1043636, 1058462, 1072054, 1083254, 1090668, 1092790, 1088670, 1078448, 1063094, 1043567, 1020352, 993946, 965498, 936503, 907813, 879435, 851474, 824745, 800100, 777565, 756728, 737696, 721017, 706705, 693959, 682001, 670744, 660422, 650975, 642047, 633390, 625066, 617417, 610906, 605791, 601860, 598607, 595698, 593074, 590647, 588248, 585957, 584130, 582930, 582077, 581239, 580384, 579516, 578243, 575964]
61769E75964l431l960l516k479j591j282j348j315j060q48q15p77o21m84l78j44
61753E51915R3j10o92q55j76N37K45q42j585j466j047r48j152j415j540j160o
61736E39796J351J795J021O9O6R66J924K499K965L655M516N204N482N488N692
61721E82489O371P147P421P195P074P357P655P568P175O528N280L312J281o7q49
61706F62937j731k813l531l626l617m070m865n423n486n368n517n997o422o365
61692E98106n756m907m206l856l845l953l841l304k579k159k229k453k432k212
61678E50374k127k324k603k686k462k070j809j909k285k562k403j805j101p22
61664E21506r16j487j904j811j399j089r35o54k06N3j44o35j104j324j085k59
$$ y = [575964, 572533, 568573, 565057, 562578, 560987, 559705, 558357, 557042, 555982, 555134, 554319, 553542, 552921, 552437, 552059, 551915, 552008, 551898, 551206, 550351, 550175, 550712, 550957, 550115, 548530, 547064, 546017, 545069, 543917, 542502, 540962, 539802, 539796, 541147, 542942, 543963, 544032, 544098, 545064, 546988, 549487, 552452, 556107, 560623, 565827, 571309, 576797, 582489, 588860, 596007, 603428, 610623, 617697, 625054, 632709, 640277, 647452, 653980, 659260, 662572, 663853, 663786, 662937, 661206, 658393, 654862, 651236, 647619, 643549, 638684, 633261, 627775, 622407, 616890, 610893, 604471, 598106, 592350, 587443, 583237, 579381, 575536, 571583, 567742, 564438, 561859, 559700, 557471, 555018, 552586, 550374, 548247, 545923, 543320, 540634, 538172, 536102, 534293, 532384, 530099, 527537, 525134, 523329, 522228, 521506, 520590, 519103, 517199, 515388, 513989, 512900, 511965, 511311, 511105, 511158, 511014, 510379, 509275, 507951, 506866, 506607]
61648E06607Q28J469J300P25L91N30R67J462J761J578R01J65j79j63j65m38j020
61631E16719j834k673l257l560l879m337m606m416m016l701l183k062p47k16p50
61616D73482j504j615j170p84o72o45p36j199j982k723l387m336n563o332o066
61601D34768n270m924n105m965m177l543l763m353m486m316m485m771m347l309
61587C72954k800l291l825l484k676k261k190j842j237j004j348j812k004j962
61573C41218j853j718j567j332r15m82m87j071j711j851j510r25o9Q56J054N9
61557C27696j222j373k34J016J500J459J341J069N42Q6o0r6j61J9N58J049J132
61540C34321R99R06O70J19l05O2J232K522L254L192K438J254Oq93j159p86k04
$$ y = [506607, 507435, 508904, 510204, 510929, 511320, 511850, 512817, 514279, 516040, 517618, 518519, 518684, 518505, 518342, 518177, 517739, 516719, 514885, 512212, 508955, 505395, 501516, 497179, 492573, 488157, 484141, 480440, 477257, 475195, 474448, 474232, 473482, 471978, 470363, 469193, 468409, 467737, 467092, 466356, 465157, 463175, 460452, 457065, 452729, 447166, 440834, 434768, 429498, 424574, 419469, 414504, 410327, 406784, 403021, 398668, 394182, 389866, 385381, 380610, 376263, 372954, 370154, 366863, 363038, 359554, 356878, 354617, 352427, 350585, 349348, 348344, 346996, 345184, 343180, 341218, 339365, 337647, 336080, 334748, 333833, 333351, 332864, 331793, 330082, 328231, 326721, 325796, 325727, 326583, 327637, 327696, 326474, 325101, 324867, 325883, 327383, 328842, 330183, 331252, 331794, 331880, 331820, 331724, 331563, 331582, 332140, 333189, 334321, 335320, 336226, 336896, 337015, 336710, 336772, 338004, 340526, 343780, 346972, 349410, 350664, 350670, 349777, 348618, 347832, 347628]
61523C47628j08q39j878k404k296k244k675l151l087k510j782j006k26J70n5l12
61507C23225K70J541K153J061j126k677k586j544r94j411j930j676r87q36j411
61492C11072j956j924j501q58J66J209J129m62k036j666M37K048J693K85l85J34
61476C07385R55J379J513J598J572J431J410J585J639J326Q22M82L75L39K67J90
61460C24268R6o6k54l48l46m05n94p03m29L22J258J853J744J108N60M89N56J65
61442C29274n81p81J24J501K246K179K166K846L769M055L561K943K732K772K620
61427C61426K231J952J908J753J155L52kL89J180J871K262K322J932J135M13L19
61411C82598R02J735K406K659K195Q37j063k692l446l312k684k077j936k333k834
$$ y = [347628, 347520, 346681, 344803, 342399, 340103, 337859, 335184, 332033, 328946, 326436, 324654, 323648, 323422, 323592, 323537, 323225, 323495, 325036, 327189, 328250, 327124, 324447, 321861, 320317, 319323, 317912, 315982, 314306, 313319, 312483, 311072, 309116, 307192, 305691, 304833, 304999, 306208, 307337, 306875, 304839, 303173, 303610, 305658, 307351, 307636, 307251, 307385, 308340, 309719, 311232, 312830, 314402, 315833, 317243, 318828, 320467, 321793, 322615, 323097, 323472, 323811, 324078, 324268, 324364, 324298, 324044, 323696, 323350, 322945, 322351, 321648, 321219, 321541, 322799, 324652, 326396, 327504, 328064, 328553, 329109, 329274, 328693, 327912, 328036, 329537, 331783, 333962, 336128, 338974, 342743, 346798, 350359, 353302, 356034, 358806, 361426, 363657, 365609, 367517, 369270, 370425, 370777, 370775, 371164, 372344, 374215, 376477, 378799, 380731, 381866, 382279, 382598, 383500, 385235, 387641, 390300, 392495, 393332, 392269, 389577, 386131, 382819, 380135, 378058, 376122, 373789, 370955]
61396C70955k969k799k690k615k255j731j582j807j672p89J64L23k23p07p29m30
61380C48444P5P75J385J514J238J069J227J448J533J641J843J805J196K69l48
61365C65114k99J95P53J285J890K419K432J824J249J540K664L672L886L747M218
61350C96589N554P024P780P695P390P616Q612R952J0960J1281J0931R934Q345
61337E09663O622N489N093M772L984L042K495K196J538M07p72j786k803l795m378
61322E31767m307l691k689j507o46n29p93n75L29J200J573K017L208M782N775
61307E35914N986O222P204Q769J0279J1370J2129J2745J3224J3415J3109J2153
61295F62519J0443P972M933J722j267l895o200q159r676j0745j1395j1500j0930
$$ y = [370955, 367986, 365187, 362497, 359882, 357627, 355896, 354314, 352507, 350835, 350046, 350210, 350533, 350310, 349603, 348874, 348444, 348519, 349294, 350679, 352193, 353431, 354500, 355727, 357175, 358708, 360349, 362192, 363997, 365193, 365462, 365114, 364815, 365010, 365763, 367048, 368938, 371357, 373789, 375613, 376862, 378402, 381066, 384738, 388624, 392371, 396589, 402143, 409167, 416947, 424642, 432032, 439648, 448260, 458212, 469172, 480453, 491384, 501318, 509663, 516285, 521774, 526867, 531639, 535623, 538665, 541160, 543356, 544894, 545301, 544529, 542743, 539940, 536145, 531767, 527460, 523769, 521080, 519573, 518927, 518398, 517605, 517030, 517359, 518559, 520132, 522149, 525357, 530139, 535914, 541900, 548122, 555326, 564095, 574374, 585744, 597873, 610618, 623842, 637257, 650366, 662519, 672962, 680934, 685867, 687589, 686322, 682427, 676227, 668068, 658392, 647647, 636252, 624752, 613822]
61282F13822r873q721p540o055m313k920k328k205j804q30M03J483K208K548K645
61267E76520K797L193L718M201M738N408N886N762N258N103N675O647P661Q855
61253F51422J0441J2093J3150J3213J2288J0489Q026N416L246J608J9j888l825
61240G35698n168n726n939o276o653o578n816m706l789l223k663j689k90J081
61226F78263J889K063K188L036M715O433P376P678Q165R051R485Q698P244O461
61212G62745O790P253O771N500M505M421M877N182N098M772M271L508K667K371
61198H30731L163M916O974Q910J0904J3288J5894J8156J9727K0783K1744K2861
61186I98051K3989K4478K3459K0656J6966J3829J1853J0441Q836P071N666M811
$$ y = [613822, 603949, 595228, 587688, 581633, 577320, 574400, 572072, 569867, 568063, 567233, 567636, 569119, 571327, 573875, 576520, 579317, 582510, 586228, 590429, 595167, 600575, 606461, 612223, 617481, 622584, 628259, 634906, 642567, 651422, 661863, 673956, 687106, 700319, 712607, 723096, 731122, 736538, 739784, 741392, 741411, 739523, 735698, 730530, 724804, 718865, 712589, 705936, 699358, 693542, 688836, 685047, 681824, 679161, 677472, 677182, 678263, 680152, 682215, 684403, 687439, 692154, 698587, 705963, 713641, 721806, 730857, 740342, 749040, 756284, 762745, 769535, 776788, 783559, 789059, 793564, 797985, 802862, 808044, 813142, 817914, 822185, 825693, 828360, 830731, 833894, 838810, 845784, 854694, 865598, 878886, 894780, 912936, 932663, 953446, 975190, 998051, 1022040, 1046518, 1069977, 1090633, 1107599, 1121428, 1133281, 1143722, 1152558, 1159629, 1165295, 1170106]
61174A170106M246L583K375J89k914o139q705j0625j2447j4392j6236j7843j9254
61161A071944k0312k0776k0830k1006k1573k2379k3199k3715k3322k1660j9325
61150H33847j7255j5380j2776r350o363m745l837k596j268q53j473k304k970l932
61136G48745n451p000p835p515n851l066j48J752K554L341M956P089R077J0940
61122G51588J3186J5952J8927K1884K4798K7593L0223L2816L5362L7457L8767
61111A048553L9654M0759M1951M2336M1459L9999L8814L7758L5910L2850K9042
61100A469085K5085K1104J7042J2981Q857M183j462p910j4601k1053k6884l1670
61088A454757l5299l8125m0369m1655m1773m1522m1846m2242m1142l8235l5239
$$ y = [1170106, 1174352, 1177935, 1180310, 1180499, 1177585, 1171446, 1162741, 1152116, 1139669, 1125277, 1109041, 1091198, 1071944, 1051632, 1030856, 1010026, 989020, 967447, 945068, 921869, 898154, 874832, 853172, 833847, 816592, 801212, 788436, 779086, 772723, 767978, 764141, 761545, 760277, 759424, 757951, 755647, 752677, 748745, 743294, 736294, 728459, 720944, 715093, 712027, 711879, 713631, 716185, 719526, 724482, 731571, 740648, 751588, 764774, 780726, 799653, 821537, 846335, 873928, 904151, 936967, 972329, 1009786, 1048553, 1088207, 1128966, 1170917, 1213253, 1254712, 1294711, 1333525, 1371283, 1407193, 1440043, 1469085, 1494170, 1515274, 1532316, 1545297, 1554154, 1558337, 1556875, 1548965, 1534364, 1513311, 1486427, 1454757, 1419458, 1381333, 1340964, 1299309, 1257536, 1216014, 1174168, 1131926, 1090784, 1052549, 1017310]
61077A017310l3781l3362l2246k9721k6558k3612k0974j8438j6026j3878j2135
61066G56579j0891r898q499o363m094k510j491j03K076M392N863O172N821N761
61052G42815O705Q475J0130J1072J1787J3052J4794J6485J8206K0484K3191K5603
61040I22799K7590K9701L1981L3700L4631L5589L7163L8760L9563L9794M0268
61029A311539M1263M2488M3822M5363M6929M8111M8802M9237M9616M9951N0188
61018A827309N0367N0835N2401N5996O2008P0163Q0118R1743J04816J18998J34460
61007B699214J52425J75157K05689K47125L01458L69271M51292N49675O66716
60998E818022Q03280R60570J142171J349863J576078J804125K015627K186844
$$ y = [1017310, 983529, 950167, 917921, 888200, 861642, 838030, 817056, 798618, 782592, 768714, 756579, 745688, 735790, 727291, 720928, 716834, 714324, 712833, 712730, 714806, 719198, 725061, 731233, 737054, 742815, 749520, 757995, 768125, 779197, 790984, 804036, 818830, 835315, 853521, 874005, 897196, 922799, 950389, 980090, 1012071, 1045771, 1080402, 1115991, 1153154, 1191914, 1231477, 1271271, 1311539, 1352802, 1395290, 1439112, 1484475, 1531404, 1579515, 1628317, 1677554, 1727170, 1777121, 1827309, 1877676, 1928511, 1980912, 2036908, 2098916, 2169079, 2249197, 2340940, 2445756, 2564754, 2699214, 2851639, 3026796, 3232485, 3479610, 3781068, 4150339, 4601631, 5151306, 5818022, 6621302, 7581872, 8724043, 10073906, 11649984, 13454109, 15469736, 17656580]
60990A7656580K267169K170797J820377J226959N29285o5526m01642m51272k93102
60981B4459625m1527J90569K84727J27748l24646r86468j663497k159609k379194
60972A7507728k346519k150175j879059j594364j330674j102968r12351p53597
60964E438021o21820n13674m25474l53414k95221k49698k14876j87906j66395
60955B409543j48739j33474j19386j06106r3886q2913p3348o5363n8567n1974
60945A475787m5445m0479l8560l9145m0217m0543m0322l9781l8489l6275l3915
60934A042616l2378l1861l1791l1303k9710k7028k4206k2331k1456k0592j8942
60923G51018j6690j4520j2869j1820j1268j0876j0169q980p618o423n406m492
$$ y = [17656580, 19923749, 22094546, 23914923, 25141882, 25671167, 25605641, 25203999, 24752727, 24459625, 24418098, 24608667, 24893394, 25021142, 24696496, 23710028, 22046531, 19886922, 17507728, 15161209, 13011034, 11131975, 9537611, 8206937, 7103969, 6191618, 5438021, 4816201, 4302527, 3877053, 3523639, 3228418, 2978720, 2763844, 2575938, 2409543, 2260804, 2127330, 2007944, 1901838, 1807952, 1725039, 1651691, 1586328, 1527761, 1475787, 1430342, 1389863, 1351303, 1312158, 1271941, 1231398, 1191076, 1151295, 1112806, 1076531, 1042616, 1010238, 978377, 946586, 915283, 885573, 858545, 834339, 812008, 790552, 769960, 751018, 734328, 719808, 706939, 695119, 683851, 672975, 662806, 653826, 646208, 639785, 634379, 629887]
60911F29887l847l705l909l861l039j485J87J338J797J770J424Q13K68L64J169
60896F19171J898J680N17r22k160l110l643l665l595m105n150n931n957n658n648
60881E73722n899o095o277o631o892o524n441m112l092k684k944l574l895l422
60867E06240k459j743j463j107l07O13J216J587K086K794L629M742O255P734Q443
60852E38260Q166P361O460N543M796M673N204N666N477N041N017N087M266K397
60838F13414M83p51j744l108m472m981m569l994l789l851l938l956l733l101k314
60823E65596j856j812j813j727j918k664l727m668n253n351m933m396m423n142
60809E15913n769n476m305k901j667o95j95l83r30j129o40J96Q45J004O62J09
$$ y = [629887, 626040, 622335, 618426, 614565, 611526, 610041, 610228, 611566, 613363, 615133, 616557, 617370, 617638, 618002, 619171, 621069, 622749, 623266, 622344, 620184, 617074, 613431, 609766, 606171, 602066, 596916, 590985, 585028, 579370, 573722, 567823, 561728, 555451, 548820, 541928, 535404, 529963, 525851, 522759, 520075, 517131, 513557, 509662, 506240, 503781, 502038, 500575, 499468, 499161, 499774, 500990, 502577, 504663, 507457, 511086, 515828, 522083, 529817, 538260, 546426, 553787, 560247, 565790, 570586, 575259, 580463, 586129, 591606, 596647, 601664, 606751, 611017, 613414, 613897, 613146, 611402, 608294, 603822, 598841, 594272, 590278, 586489, 582638, 578700, 574744, 571011, 567910, 565596, 563740, 561928, 560115, 558388, 556470, 553806, 550079, 545411, 540158, 534807, 529874, 525478, 521055, 515913, 510144, 504668, 500363, 497462, 495795, 495100, 494905, 494522, 493592, 492463, 491823, 492019, 492864, 493868, 494530, 494639]
60793D94639q2M19J198J527J351J317J735K159K243K431L215M197M531M170L931
60778E28981M372N123N539N542N571N957O587P169P568P903Q255Q397Q014P264
60764F22242O821P120P788Q153Q056P802P525P164O942P162P531P370O675O233
60750G24584O473O856O869O838P166P442P220P125Q131R836J0666R850Q254O979
60736H34289O130N447N272O019P212P914P893P712P812Q078Q255Q225P910P337
60722I35505O840O685O544N768M347L095K624K494J723p1k290m011m812n030n433
60707I53978o584q403j0253j1482j1908j1808j1624j1669j1962j2301j2529j2800
60695H20655j3379j4149j4532j4153j3404j3067j3391j3845j3813j3237j2408
$$ y = [494639, 494557, 494976, 496174, 497701, 499052, 500369, 502104, 504263, 506506, 508937, 512152, 516349, 520880, 525050, 528981, 533353, 538476, 544015, 549557, 555128, 561085, 567672, 574841, 582409, 590312, 598567, 606964, 614978, 622242, 629063, 636183, 643971, 652124, 660180, 667982, 675507, 682671, 689613, 696775, 704306, 711676, 718351, 724584, 731057, 737913, 744782, 751620, 758786, 766228, 773448, 780573, 788704, 798540, 809206, 819056, 827310, 834289, 840419, 845866, 851138, 857157, 864369, 872283, 880176, 887888, 895700, 903778, 912033, 920258, 928168, 935505, 942345, 949030, 955574, 961342, 965689, 968784, 971408, 973902, 975625, 975554, 973264, 969253, 964441, 959411, 953978, 947394, 938991, 928738, 917256, 905348, 893540, 881916, 870247, 858285, 845984, 833455, 820655, 807276, 793127, 778595, 764442, 751038, 737971, 724580, 710735, 696922, 683685, 671277]
60684F71277j1452j0370r411q941q892q752q260p743p444o967n899m693m275m693
60670E63485m900m174l175l123m240n510n835m975l541k472k429l202l769l341
60656E08799k319j735j788j641p66J75L55Q8M10J597K828L355L354L450L752L793
60640E23707L161J927N04p04j499j911k027j811j127n2R25J247R44P44J284K190
60624E27502K364J320l1l80L54R11K87j138k324k920l376l956m372m426m374m387
60608E01054m105l196k099j662k039k416k034j183q66j574k785l628l742l317
60594D66408k641j968j594j591j527q99O1N04N4o57q49n44k78k79m11o29q41n45
60576D51774O31K081K669K172J596J863K824L893M914N955O874P658Q731J0291
$$ y = [671277, 659825, 649455, 640044, 631103, 622211, 613459, 605199, 597456, 590012, 583045, 577146, 572453, 568178, 563485, 558585, 554411, 551236, 548113, 543873, 538363, 532528, 527553, 524012, 521540, 519111, 515909, 512140, 508799, 506480, 504745, 502957, 501316, 500550, 500725, 501080, 501168, 501578, 503175, 506003, 509358, 512712, 516162, 519914, 523707, 526868, 528795, 529299, 528595, 527096, 525185, 523158, 521347, 520220, 520168, 521093, 522340, 523284, 524028, 525312, 527502, 529866, 531186, 531155, 530775, 531129, 532040, 532327, 531189, 528865, 525945, 522569, 518613, 514241, 509815, 505441, 501054, 496949, 493753, 491654, 489992, 487953, 485537, 483503, 482320, 481454, 479880, 477095, 473467, 469725, 466408, 463767, 461799, 460205, 458614, 457087, 456188, 456249, 456753, 456807, 456150, 455301, 454757, 454479, 454200, 453789, 453160, 452319, 451774, 452405, 454486, 457155, 459327, 460923, 462786, 465610, 469503, 474417, 480372, 487246, 494904, 503635, 513926]
60562E13926J1725J2302J2144J1773J1005R168O349L543J374n70k884n392p409
60549E77054q450q395p380n796m014j976N11K943M251M176L867M524N969P203
60535E74487P964Q848J0029J0826J0599R397P478M896J838j123l516n308o473
60522F29942o672n748m183k670j430l91K20K8q14j560j548o60Q46K536L801M141
60506F15838L682L092K803K711K820L762O077R311J2417J5118J8213K2361K7103
60493G45308L1468L5130L8411M1318M3165M3133M0815L6064K8795J9235Q134l581
60481A107395j5255k6386l6184m3670m8291n0231m9916m7466m2950l7081l1289
60470F78676k6739k3467k0711j8081j5976j4775j4076j3099j1600r978q530p117
$$ y = [513926, 525651, 537953, 550097, 561870, 572875, 582043, 588392, 591935, 593309, 592739, 589855, 584463, 577054, 568604, 560209, 552829, 547033, 543019, 541043, 541554, 544497, 548748, 552924, 556791, 561315, 567284, 574487, 582451, 591299, 601328, 612154, 622753, 632150, 639628, 644524, 646362, 645239, 641723, 636415, 629942, 623270, 617522, 613339, 610669, 609239, 608848, 609068, 609096, 608282, 606722, 605174, 604514, 605360, 607896, 611697, 615838, 619520, 622612, 625415, 628126, 630946, 634708, 640785, 650096, 662513, 677631, 695844, 718205, 745308, 776776, 811906, 850317, 891635, 934800, 977933, 1018748, 1054812, 1083607, 1102842, 1110976, 1107395, 1092140, 1065754, 1029570, 985900, 937609, 887378, 837462, 789996, 747046, 709965, 678676, 651937, 628470, 607759, 589678, 573702, 558927, 544851, 531752, 520152, 510174, 501644, 494527]
60458D94527n655m481l930l849l776l474l079k845k890l103l129k620j684r48
60444D49064r43j477j867j741j330j002p34l18J02j5r24k070k467j799q77p81
60428D30821j602k376k267j465p46m37j65M98J418K012J855J101L34J1Q5K32L43
60411D29652N95J103J737K285K567K434J961J623J843K276K105J193L91L69P39
60396D52873P56M67M25O58O47K45o8J49Q94J954L011L553L269K531J968J537P10
60379D75579l80p85m7J010J329R99R31J535K275K485K137J696J526J571J494J086
60363D94441N39K55M38R52J543K014K240K311K529K989L235K745J813J439K219
60348E21702L734N169O078O424O465O834Q220J0479J2503J3327J3041J2102J0352
$$ y = [494527, 488872, 484391, 480461, 476612, 472836, 469362, 466283, 463438, 460548, 457445, 454316, 451696, 450012, 449064, 448121, 446644, 444777, 443036, 441706, 440704, 439970, 439652, 439754, 439739, 438815, 436745, 434278, 432479, 431602, 430821, 429219, 426843, 424576, 423111, 422365, 421928, 421763, 422261, 423679, 425691, 427546, 428647, 428981, 428992, 429077, 429309, 429652, 430247, 431350, 433087, 435372, 437939, 440373, 442334, 443957, 445800, 448076, 450181, 451374, 451765, 452134, 452873, 453629, 454096, 454521, 455179, 455826, 456071, 456003, 456152, 457046, 459000, 462011, 465564, 468833, 471364, 473332, 474869, 475579, 475199, 474414, 474367, 475377, 476706, 477705, 478636, 480171, 482446, 484931, 487068, 488764, 490290, 491861, 493355, 494441, 494980, 495235, 495673, 496625, 498168, 500182, 502422, 504733, 507262, 510251, 513486, 516231, 518044, 519483, 521702, 525436, 530605, 536683, 543107, 549572, 556406, 564626, 575105, 587608, 600935, 613976, 626078, 636430]
60335F36430P350L494j02k889n367q071j0592j1939j1687j0430r165q397p843
60322E60792o926n479l941k921k664k920l143k876k137j410j017n74M89J932K822
60307E30027K861L005M372O956R895J2578J4927J6904J8338J9057J8756J6924
60295F74600J3395Q848M259M8l818p081r176r868r313p594m847j816M24J454J641
60280F51156J164l49k995n979q354r940j1171j2296j3150j3433j2927j1608r849
60267E40269q288p176o091m650l306k913l503m021l531k332j434j156p80K11J183
60252D92482J178L18l73m70n76j070j354r13k60m0J75J109K284K512J765J294
60236D98061J721K165J733Q57N13Q94J541K194K786L063K891K660K808L190L391
$$ y = [636430, 643780, 647274, 647172, 644283, 638916, 630845, 620253, 608314, 596627, 586197, 577032, 568635, 560792, 553866, 548387, 544446, 541525, 538861, 535941, 532798, 529922, 527785, 526375, 525358, 524784, 525273, 527205, 530027, 532888, 535893, 540265, 547221, 557116, 569694, 584621, 601525, 619863, 638920, 657676, 674600, 687995, 696843, 701102, 701150, 697332, 690251, 681075, 671207, 661894, 654300, 649453, 647637, 648061, 649515, 651156, 652320, 651971, 648976, 642997, 634643, 624703, 613532, 601236, 588086, 574653, 561726, 550118, 540269, 531981, 524805, 518714, 514064, 510758, 507845, 504342, 500321, 496790, 494458, 493024, 491868, 491088, 491299, 492482, 493660, 493978, 493605, 493135, 492559, 491489, 490135, 489222, 488962, 488922, 489097, 490206, 492490, 495002, 496767, 498061, 499782, 501947, 503680, 504537, 505050, 505944, 507485, 509679, 512465, 515528, 518419, 521079, 523887, 527077, 530468]
60221E30468L304K958K126P96k56n9J394L076M071M367M512M877N384N776O008
60206E78802O363P081P830P915P154O203N746N708N558N093M497L971L582L294
60192F58797K818J816N80j1L14O19J4j036j517j599k389m097n593n998n673n270
60176F31775m824m286m064m348m510l907k810j947j582j567j855k257k088r45
60162E90785M69J090R18R13J449J857J695J542J995K584K456J742J408J832K268
60147F15003K001J445J572K525L366L308K788K894L987N343O263O966Q002R142
60133F74605R559R086Q558Q626Q720P711N405K800R14j65r18j553j848j715j485
60118G28300j608k113k509k204j072L72J437J817J642J096L00m47p09m70l23p46
$$ y = [530468, 533772, 536730, 538856, 539652, 539396, 539337, 540731, 543807, 547878, 552245, 556757, 561634, 567018, 572794, 578802, 585165, 592246, 600076, 607991, 615145, 621348, 627094, 632802, 638360, 643453, 647950, 651921, 655503, 658797, 661615, 663431, 664011, 664000, 664314, 664933, 664947, 663911, 662394, 660795, 658406, 654309, 648716, 642718, 637045, 631775, 626951, 622665, 618601, 614253, 609743, 605836, 603026, 601079, 599497, 597930, 596075, 593818, 591730, 590785, 591254, 592344, 593262, 594175, 595624, 597481, 599176, 600718, 602713, 605297, 607753, 609495, 610903, 612735, 615003, 617004, 618449, 620021, 622546, 625912, 629220, 632008, 634902, 638889, 644232, 650495, 657461, 665463, 674605, 684164, 693250, 701808, 710434, 719154, 726865, 732270, 735070, 735984, 735819, 734901, 733348, 731500, 729785, 728300, 726692, 724579, 722070, 719866, 718794, 719166, 720603, 722420, 724062, 725158, 725458, 725011, 724302, 723832, 723509, 722763]
60102G22763j462j897k122k741l863m787m910m469l987l493k757j970j560j436
60088F81309j009RJ283K482L728N193O607P488P702P524P212O734N882M508K704
60073G49356Q21q58k383l972n502o560p087p642q678r879j0559j0524j0062r283
60059F57188q124o950o531p066p792p890p402o840o303n465m237k871j530k49
60045E77938P57J287J620K279L271M104M684N526O771P679P557O717N928N290
60031F41408M326K998J846J124M22o84k162l850n736p600q893r374r536j0013
60017E94276j0753j1152j0890j0204r377q333o912n348m147l478k901j876n21
60004E08384M06M56R3J19O88J338J866K603L639M368M238L564L168L365L786M143
$$ y = [722763, 721301, 719404, 717282, 714541, 710678, 705891, 700981, 696512, 692525, 689032, 686275, 684305, 682745, 681309, 680300, 680309, 681592, 684074, 687802, 692995, 699602, 707090, 714792, 722316, 729528, 736262, 742144, 746652, 749356, 750177, 749319, 746936, 742964, 737462, 730902, 723815, 716173, 707495, 697616, 687057, 676533, 666471, 657188, 649064, 642114, 635583, 628517, 620725, 612835, 605433, 598593, 592290, 586825, 582588, 579717, 578187, 577938, 578695, 579982, 581602, 583881, 587152, 591256, 595940, 601466, 608237, 615916, 623473, 630190, 636118, 641408, 645734, 648732, 650578, 651702, 652124, 651440, 649278, 645428, 639692, 632092, 623199, 613825, 604289, 594276, 583523, 572371, 561481, 551277, 541900, 533567, 526655, 521307, 517160, 513682, 510781, 508905, 508384, 508790, 509246, 509339, 509458, 510146, 511484, 513350, 515953, 519592, 523960, 528198, 531762, 534930, 538295, 542081, 546224]
59988E46224M606N284N651M999L401J941J667K375K765J874J57j176j641j827
59974E76300k417l388m331m999n255m925l992k833j893j364j224j261q76N38K601
59959E40681L856L332J941J551K728M148M313L191J824R50M24j71r09j512j687
59944E64660j368o61J86P12L29j072k548k830j949j542k891n106o160n474m381
59929E29905m013l930l307k396j914j792j420q24n76p20o30L0R33J754K512L098
59913E16710L188K904K974L823M882N287M955M507M380M499M754N183N596N511
59899E79153M779L912L491L474L416L199L113L248L319L241L482M447N777O580
59885F34631O344N347M226L488L353L783M429M831M862M859N152N560N490M517
$$ y = [546224, 550830, 556114, 561765, 566764, 570165, 572106, 573773, 576148, 578913, 580787, 580944, 579768, 578127, 576300, 573883, 570495, 566164, 561165, 555910, 550985, 546993, 544160, 542267, 540903, 539679, 538418, 537542, 538080, 540681, 544537, 547869, 549810, 551361, 554089, 558237, 562550, 565741, 567565, 568515, 568939, 568768, 567859, 566347, 564660, 563292, 562631, 562817, 563529, 563858, 562786, 560238, 557408, 555459, 553917, 551026, 545920, 539760, 534286, 529905, 525892, 521962, 518655, 516259, 514345, 512553, 511133, 510309, 509733, 509013, 508383, 508413, 509346, 511100, 513612, 516710, 519898, 522802, 525776, 529599, 534481, 539768, 544723, 549230, 553610, 558109, 562863, 568046, 573642, 579153, 583932, 587844, 591335, 594809, 598225, 601424, 604537, 607785, 611104, 614345, 617827, 622274, 628051, 634631, 640975, 646322, 650548, 654036, 657389, 661172, 665601, 670432, 675294, 680153, 685305, 690865, 696355, 700872]
59871G00872K744O94j149k686m215n993p839r213r753r536q833p784o460n104
59857F25745m099l647l588l529l160k377j273M4J467K825L945M945O266Q128J0007
59842F41699J1046J0997J0321R190P000L383o43l252l579k332o16J194L052M344
59828F91804M114K153o90l385n543p309q842j0154j1179j1752j1753j1440j1413
59815F04611j1890j2184j1409r649p876o661n533l957k361j605j676j619p99L72
59801E27764J154J412J501J508J032j72j685k684k756k301k052k199k317k102
59787E16103j834j825j823j451r54r14j337j683j819k172k715k628j448Q6Q89
59772D94475Q14M53J47p6Q2R38K051K525K197J874K159K696K897K834K987L443
$$ y = [700872, 703616, 704310, 703161, 700475, 696260, 690267, 682428, 673215, 663462, 653926, 645093, 637309, 630849, 625745, 621646, 617999, 614411, 610882, 607722, 605345, 604072, 604116, 605583, 608408, 612353, 617298, 623564, 631692, 641699, 652745, 663742, 674063, 683253, 690253, 693636, 692993, 689741, 686162, 683830, 683214, 684408, 687460, 691804, 695918, 698071, 697381, 693996, 688453, 681144, 672302, 662148, 650969, 639217, 627464, 616024, 604611, 592721, 580537, 569128, 559479, 551603, 544942, 539409, 535452, 533091, 531486, 529810, 528191, 527392, 527764, 528918, 530330, 531831, 533339, 534371, 534199, 532514, 529830, 527074, 524773, 522721, 520522, 518205, 516103, 514269, 512444, 510621, 509170, 508216, 507302, 505965, 504282, 502463, 500291, 497576, 494948, 493500, 493586, 494475, 495289, 495742, 495889, 495813, 495895, 496833, 498884, 501409, 503606, 505480, 507639, 510335, 513232, 516066, 519053, 522496]
59756E22496L823L849L678L733M332N366O240O390N972N780O334P306P971P912
59742F01182P163N974M748L933L632L463L026K308J415K44j246k604l192k841
59728F27205j879p11K41M70j73r91r85q3P07N37l12r26q22k37L25M94K45m0J17
59709F23182O58R28N01j56k13M86J244J329O32l92j141j216o99j22pl38o64o24
59691F23388k05L67P64O54p7j120j989k424k394j907j079k54K78O55J087J228
59675F16972N00r68k228k689k829l383m236m691m509m116l868l608l142k692k656
59660E71857l065l462l334k621j710r18j10R89K233L129L460L506L492L268K741
59645E79455K202J921J678J067Jj345k788l959m234l387k102j292j089j018r07
$$ y = [522496, 526319, 530168, 533846, 537579, 541911, 547277, 553517, 559907, 565879, 571659, 577993, 585299, 593270, 601182, 608345, 614319, 619067, 623000, 626632, 630095, 633121, 635429, 636844, 637088, 635842, 633238, 630046, 627205, 625326, 624615, 624856, 625326, 625153, 624162, 623177, 623094, 623801, 624338, 624026, 623100, 622278, 622041, 622366, 622860, 623105, 623065, 623182, 623840, 624768, 625269, 625113, 624900, 625386, 626630, 627959, 628591, 628199, 627058, 625842, 625143, 625021, 625014, 624676, 624012, 623388, 623183, 623550, 624314, 624968, 624891, 623771, 621782, 619358, 616964, 615057, 613978, 613724, 614002, 614657, 615744, 616972, 617472, 616504, 614276, 611587, 608758, 605375, 601139, 596448, 591939, 587823, 583955, 580347, 577205, 574513, 571857, 568792, 565330, 561996, 559375, 557665, 556747, 556637, 557626, 559859, 562988, 566448, 569954, 573446, 576714, 579455, 581657, 583578, 585256, 586323, 586324, 584979, 582191, 578232, 573998, 570611, 568509, 567217, 566128, 565110, 564203]
59630E64203q70o22L37J657K173J312j60j205j644j787j568p11N00J341J388P48
59614E65092k87j365j992j832j097k93L45R32J538K175L063M409N850O514N870
59599E88922M265K432P62p28j947k580k487k005j718j886k257k412k298k156k098
59584E71809j964j706j581j718j763j348p51p22j541k658l368l556l556l542l358
59569E38677k828j975r07K29J134J473J306J222J758K670L106K540J396N72N36
59554E50909J041J549J689J449J172J302J887K391K248J586J081J197J875K978
59540E74354M487O258P982R597J1332J3223J5060J6917J8907J9996J7954J1583
59528G27650K775m658q230q205o062k752J179M891P594R201R943R716Q385O405
$$ y = [564203, 563333, 562711, 563048, 564705, 566878, 568190, 568030, 566825, 565181, 563394, 561826, 561115, 561615, 562956, 564344, 565092, 564805, 563440, 561448, 559616, 558519, 558226, 558571, 559503, 561041, 563216, 566279, 570688, 576538, 583052, 588922, 593187, 595619, 596381, 595653, 593706, 591126, 588639, 586634, 584916, 583030, 580773, 578361, 576063, 573907, 571809, 569845, 568139, 566558, 564840, 563077, 561729, 560978, 560256, 558715, 556057, 552689, 549133, 545577, 542035, 538677, 535849, 533874, 532967, 533196, 534330, 535803, 537109, 538331, 540089, 542759, 545865, 548405, 549801, 550373, 550909, 551950, 553499, 555188, 556637, 557809, 559111, 560998, 563389, 565637, 567223, 568304, 569501, 571376, 574354, 578841, 585099, 593081, 602678, 614010, 627233, 642293, 659210, 678117, 698113, 716067, 727650, 730425, 725767, 717537, 709332, 703270, 700518, 701697, 706588, 714182, 723383, 733326, 743042, 751427, 757832]
59514G57832M404K275n96m225p799j0616j2643j3956j4394j4088j3785j3992j4157
59501F44260j3366j1606r729q226o802n328m413m493m871m325k586o33M94O92
59487E69068N48M87M43K55J32O20K012L813N045N358N503O340P561P983P117N879
59471F28164N440N850O185N701M477L158K396K419K808K786K055J221J173K141
59457F75974L663N352P278R510J1736J3504J4740J5737J6663J7267J7146J6267
59445H24837J5052J3843J2367R915O060J007m663j0280j5089j8430k0143k0609
59433G93867k0125j8581j5991j3051j0763r542q929q086o356l597k26L092O051
59420F87763Q823J1574J4139J6456J8789K1193K3203K4601K5946K7596K8703K8121
$$ y = [757832, 762236, 764511, 763915, 759690, 751891, 741275, 728632, 714676, 700282, 686194, 672409, 658417, 644260, 630894, 619288, 609559, 601333, 594531, 589203, 584790, 580297, 575426, 571101, 568515, 567882, 568376, 569068, 569616, 570103, 570546, 570801, 570933, 571553, 573565, 577378, 582423, 587781, 593284, 599624, 607185, 615168, 622285, 628164, 633604, 639454, 645639, 651340, 655817, 658975, 661371, 663790, 666598, 669384, 671439, 672660, 673833, 675974, 679637, 684989, 692267, 701777, 713513, 727017, 741757, 757494, 774157, 791424, 808570, 824837, 839889, 853732, 866099, 876014, 882074, 883081, 878418, 868138, 853049, 834619, 814476, 793867, 773742, 755161, 739170, 726119, 715356, 705814, 696885, 688799, 682443, 678846, 678620, 681712, 687763, 696586, 708160, 722299, 738755, 757544, 778737, 801940, 826541, 852487, 880083, 908786, 936907]
59408I36907K5987K3106J8818J1084n87j3457k3654k9213l0311k7704k2329j5858
59396H52789r985n076q11J664k26p470j7410k5708k9903l0283k8073k4121j9353
59383F56034j5064j2045j0006q427p323o673n703l765j609p09j185j528p20L78
59369E81655N20R3M93J953L273L717L903M504N109N049M649M791N734P018Q319
59354F40780R732J1286J2812J4264J5728J7224J8819K0858K3544K6289K8042K8397
59342H67775K8014K7737K7607K6931K5122K2242J8794J5129J1039O041R4o087
59330A070438j1595j6073j9644k2385k4245k5454k6473k7412k7818k7155k5275
59319H16909k2424j9155j6292j4477j3526j2568j1016r178p652o505n369m047
$$ y = [936907, 962894, 986000, 1004818, 1015902, 1015315, 1001858, 978204, 948991, 918680, 890976, 868647, 852789, 842804, 837728, 836917, 838581, 838355, 830885, 813475, 787767, 757864, 727581, 699508, 675387, 656034, 640970, 628925, 618919, 610492, 603169, 596496, 590793, 587028, 585419, 584710, 583525, 581997, 581277, 581655, 582175, 582268, 582761, 584714, 587987, 591704, 595607, 600111, 605220, 610269, 614918, 619709, 625443, 632461, 640780, 650512, 661798, 674610, 688874, 704602, 721826, 740645, 761503, 785047, 811336, 839378, 867775, 895789, 923526, 951133, 978064, 1003186, 1025428, 1044222, 1059351, 1070390, 1076431, 1076525, 1070438, 1058843, 1042770, 1023126, 1000741, 976496, 951042, 924569, 897157, 869339, 842184, 816909, 794485, 775330, 759038, 744561, 731035, 718467, 707451, 698273, 690621, 684116, 678747, 674700]
59307F74700k673j437m41L19J079K213L783N388O777Q276J0236J2320J3912J5025
59293G49477J6144J7160J7011J4537R337J915o348j3289j6928j6992j5073j2892
59281G44059j0722p932m496j249J239L236N192P026Q414R474J0808J2874J5483
59268G93406J7946J9668K0509K0487J9396J6978J3470R559N704J816k212o125
59256I30602r687j3031j6213j8724j9960j9939j9170j7943j6280j4357j2438j0483
59244G42377q312o126m354l005j663j14J544L294N104O486O935O893P486Q942
59230G65487J0008R396P226M533J925o40l158n459p643j0038j2587j4710j5874
59217G28466j6037j5533j4705j3693j2514j1299j0386r872r247p860n852m166
$$ y = [674700, 672027, 670590, 670149, 670468, 671547, 673760, 677543, 682931, 689708, 697984, 708220, 720540, 734452, 749477, 765621, 782781, 799792, 814329, 823666, 825581, 819233, 805944, 789016, 772024, 756951, 744059, 733337, 725405, 720909, 719660, 720899, 724135, 729327, 736353, 744767, 754241, 765049, 777923, 793406, 811352, 831020, 851529, 872016, 891412, 908390, 921860, 931419, 937123, 938939, 936727, 930602, 920915, 907884, 891671, 872947, 852987, 833048, 813878, 795935, 779655, 765298, 752860, 742377, 734065, 727939, 723585, 720580, 718917, 718803, 720347, 723641, 728745, 735231, 742166, 749059, 756545, 765487, 775495, 784891, 792117, 796650, 798575, 797935, 794777, 789318, 781675, 771637, 759050, 744340, 728466, 712429, 696896, 682191, 668498, 655984, 644685, 634299, 624427, 615180, 607320, 601468, 597302]
59205E97302l449l444l591l670l546k900j750q20p22j061q41L44J971L218L585
59190E80626L154K644K959M269N739O514O637O648O717O793P120P926Q754Q926
59176F65426Q464P994P745P371O647N846N421N810P265R329J0819J1135J1240
59163G70512J2387J4078J4537J3242J1605J0726R710P115L096q36l702n765p701
59150H49004r816j2051j4124j5674j6538j6797j6439j5300j3621j2134j1208j0329
59138F84973q971p573o975p055o698n219l257j912j454j210n84K42P85J080J698
59123F37870K933M358N414O053O454O497O089N808O436P820Q979R461R851J0590
59109G34613J1086J0616R464Q451P666O494M744L050K068J771J718J550J092L09
$$ y = [597302, 593853, 590409, 586818, 583148, 579602, 576702, 574952, 574132, 573410, 572349, 571508, 571852, 573823, 577041, 580626, 583780, 586424, 589383, 593652, 599391, 605905, 612542, 619190, 625907, 632700, 639820, 647746, 656500, 665426, 673890, 681884, 689629, 697000, 703647, 709493, 714914, 720724, 727989, 737318, 748137, 759272, 770512, 782899, 796977, 811514, 824756, 836361, 847087, 856797, 863912, 867008, 866172, 862470, 856705, 849004, 839188, 827137, 813013, 797339, 780801, 764004, 747565, 732265, 718644, 706510, 695302, 684973, 676002, 668429, 661454, 654399, 647701, 642482, 639225, 637313, 635859, 634649, 634065, 634307, 635092, 636172, 637870, 640803, 645161, 650575, 656628, 663082, 669579, 675668, 681476, 687912, 695732, 704711, 714172, 724023, 734613, 745699, 756315, 765779, 774230, 781896, 788390, 793134, 796184, 798252, 800023, 801741, 803291, 804383, 804692]
59095H04692o28j416j952k497l303m153m450l853k688j582q62n40q23k069m079
59080G69797n915o911p527q634j0186j1265j1317j0702r991r304q554p798p181
59067F54512o786o594o302n421m030l074l204l624l008j432l15l31o71o06n76
59052F08538j160k006k551k875l103k874k129j610j678j547n64N37P28L02J74
59037E88182K32k03p05j23J444K560K544K347K935M043N114O419Q363J0384J1453
59022F44989J1502J1559J2432J3740J4400J3877J2713J1714J0883R473P086M222
59010G78590J557p69k809m301m988n012m519l326j534R0J107K294M631P751J0316
58995G79078J1690J2243J2298J1838J1259J1226J1534J1204R892Q263O606M186
$$ y = [804692, 804064, 802648, 800696, 798199, 794896, 790743, 786293, 782440, 779752, 778170, 777308, 776768, 775945, 773876, 769797, 763882, 756971, 749444, 740810, 730624, 719359, 708042, 697340, 687349, 678045, 669491, 661693, 654512, 647726, 641132, 634830, 629409, 625379, 622305, 619101, 615477, 612469, 611037, 610722, 610391, 609720, 609114, 608538, 607378, 605372, 602821, 599946, 596843, 593969, 591840, 590230, 588552, 587005, 586441, 586978, 587706, 588008, 588182, 588414, 588211, 587506, 587383, 588827, 591387, 593931, 596278, 599213, 603256, 608370, 614789, 623152, 633536, 644989, 656491, 668050, 680482, 694222, 708622, 722499, 735212, 746926, 757809, 767282, 774368, 778590, 780147, 779378, 776569, 772268, 767280, 762268, 757749, 754423, 752889, 752979, 754086, 756380, 761011, 768762, 779078, 790768, 803011, 815309, 827147, 838406, 849632, 861166, 872370, 882262, 890525, 897131, 901317]
58983I01317N64l330o153p605q264q506q252p396n970m059j947j16J352K994N300
58968H49929P994J0367J2108J3500J4949J6586J8187J9268J9427J8735J7650J6387
58956A035087J4560J1628P547K802k068o945j2084j7554k2669k6212k7486k6981
58944I29625k5747k4374k2813k0934j8709j6110j3304j0881r285q160o766n014
58932G47528l442k381j686j278j234j349j224q45n79o41j084k016l144l451k332
58917G20842q51o12j483j785q67L2%o0R06K346L220L804N027O792Q322R697J1651
58900G66981J4053J5877J6740J7366J8414J9687K0747K1552K2242K2881K3607
58889I80147K4668K6266K8612L1913L5871L9373M1292M1504M0564L8579L4965
$$ y = [901317, 901881, 898551, 892398, 884793, 876529, 868023, 859771, 852375, 846405, 842346, 840399, 840283, 841635, 844629, 849929, 857923, 868290, 880398, 893898, 908847, 925433, 943620, 962888, 982315, 1001050, 1018700, 1035087, 1049647, 1061275, 1068822, 1071624, 1069556, 1062611, 1050527, 1032973, 1010304, 984092, 956606, 929625, 903878, 879504, 856691, 835757, 817048, 800938, 787634, 776753, 767468, 759308, 752542, 747528, 744086, 741705, 740019, 738741, 737507, 736158, 734934, 734089, 733510, 732869, 731785, 729769, 726625, 723174, 720842, 719991, 719379, 717896, 716111, 715244, 715276, 715276, 715216, 716122, 718468, 721688, 725492, 730519, 737311, 745633, 755330, 766981, 781034, 796911, 813651, 831017, 849431, 869118, 889865, 911417, 933659, 956540, 980147, 1004815, 1031081, 1059693, 1091606, 1127477, 1166850, 1208142, 1249646, 1290210, 1328789, 1363754]
58878A363754K9350K2037J3664M896l518j1002j7650k3985l0123l5562l9727m2272
58866A229862m2843m1157l7532l2958k8452k4564k1526j9389j7905j6665j5526
58855I31345j4662j4110j3682j3321j3204j3244j2990j2158j0979r787q619p477
58843G87112o626o277o221o205o447p301q417q867q272p370p105p404p379o618
58829F86603n747n569n992o122n233l429j447n3N61R24J738L043M205M840N348
58814F73670O185P026P304P168P180P251O719N497M277L368K259O34r10j716j990
58799G33922k330k868l364l774m171m529m965n776o825p354o916o008n223m337
58785F65482k919j324j55Q82K579M728O098O046N265M672M302L688K717J583L04
$$ y = [1363754, 1393104, 1415141, 1428805, 1433701, 1430183, 1419181, 1401531, 1377546, 1347423, 1311861, 1272134, 1229862, 1187019, 1145862, 1108330, 1075372, 1046920, 1022356, 1000830, 981441, 963536, 946871, 931345, 916683, 902573, 888891, 875570, 862366, 849122, 836132, 823974, 812995, 803208, 794589, 787112, 780486, 774209, 767988, 761783, 755336, 748035, 739618, 730751, 722479, 715109, 708004, 700600, 693221, 686603, 680856, 675287, 669295, 663173, 657940, 654511, 653064, 653011, 653572, 654496, 656234, 659277, 663482, 668322, 673670, 679855, 686881, 694185, 701353, 708533, 715784, 722503, 728000, 732277, 735645, 737904, 738538, 737628, 735912, 733922, 731592, 728724, 725360, 721586, 717415, 712886, 707921, 702145, 695320, 687966, 681050, 675042, 669819, 665482, 662563, 661239, 661084, 661966, 664545, 669273, 675371, 681417, 686682, 691354, 695656, 699344, 702061, 703644, 703948]
58770G03948j234k903m363n317n610n227m410l616l212l168l133k770k050j280
58756F55655p73l78M62K085M104N807O844P334P359O781N616M355L696L983M914
58741G17844N822O292O522O939P552P945P919P749P629P313O588N795N459N612
58727H12980N933O351P108Q186R034R016P980O447N238M749M631M369M165M753
58713I00940O288P984R054R465R421Q793P536O129M873L206M48l163o831j0246
58699I53897j3549j6572j9025k1162k3346k5049k5318k4177k2640k1148j9064
58688G22847j6003j2753j0345q955q179p778p594p301o805o476o509o461n914
58675F11774n132m527l896k778j372l01M32J662L994O947R413J0748J1238J1611
$$ y = [703948, 702714, 699811, 695448, 690131, 684521, 679294, 674884, 671268, 668056, 664888, 661755, 658985, 656935, 655655, 654882, 654504, 654966, 657051, 661155, 666962, 673806, 681140, 688499, 695280, 700896, 705251, 708947, 712930, 717844, 723666, 729958, 736480, 743419, 750971, 758916, 766835, 774584, 782213, 789526, 796114, 801909, 807368, 812980, 818913, 825264, 832372, 840558, 849592, 858608, 866588, 873035, 878273, 883022, 887653, 892022, 896187, 900940, 907228, 915212, 924266, 933731, 943152, 951945, 959481, 965610, 970483, 973689, 974137, 970974, 964143, 953897, 940348, 923776, 904751, 883589, 860243, 835194, 809876, 785699, 763059, 741911, 722847, 706844, 694091, 683746, 674791, 666612, 658834, 651240, 643939, 637134, 630658, 624149, 617688, 611774, 606642, 602115, 598219, 595441, 594069, 593768, 594200, 595862, 599856, 606803, 616216, 626964, 638202, 649813]
58661F49813J2236J2839J2863J1986J0222P636M321P04k403m322n022m980m654
58648G01239m190l646l251l365m099n041n517n207m405l610k952k187j077M14
58634F53106K208M049N451O030N897N536N242M895M292L339J978K48j415k280
58620F98576j918n80J215L193N354P675J0062J2453J4701J6427J7223J7042J6153
58607H17576J4631J2084Q168L346j164m343o143p194p965q447q577q534q599q868
58593G85971r188r164q386o861n199l933k732p50K190N321P942J0130J2096J3566
58579G91003J4226J4297J4121J3539J2324J0850R713Q857P798O599N953O233P116
58566I22629Q329J0204J3112J6608J9646K1688K3253K5101K7010K7748K6524K3983
$$ y = [649813, 662049, 674888, 687751, 699737, 709959, 717595, 721916, 722620, 720217, 715895, 710873, 705893, 701239, 697049, 693403, 690152, 686787, 682688, 677647, 672130, 666923, 662518, 658908, 655956, 653769, 652692, 653106, 655314, 659363, 664814, 670844, 676741, 682277, 687519, 692414, 696706, 700045, 702023, 702271, 700856, 698576, 696658, 696078, 697293, 700486, 705840, 713515, 723577, 736030, 750731, 767158, 784381, 801423, 817576, 832207, 844291, 852459, 855805, 854641, 850298, 844155, 836961, 828996, 820549, 811972, 803438, 794839, 785971, 776783, 767619, 759233, 752372, 747173, 743240, 740508, 739758, 741948, 747269, 755211, 765341, 777437, 791003, 805229, 819526, 833647, 847186, 859510, 870360, 880073, 888930, 896728, 903327, 909280, 915513, 922629, 930958, 941162, 954274, 970882, 990528, 1012216, 1035469, 1060570, 1087580, 1115328, 1141852, 1165835]
58554A165835K1208J8067J3471P267Q77m296q182j1213j3102j3329j2284j1005
58542A153314j0110r671r820j0718j2167j3953j6237j8942k1135k1911k1584k1096
58530I65970k0472j8820j5858j2402r255o432l741j299P68K559M070N131N822
58517H96041O467P015O978O049M476K741J297N08M89R27J446J977K448K406J494
58502I42759O9j261k479l901n386o490p185p651p619o801n862n899o907p690p386
58487H60311o276m943l537k090p07P93K813N261P545R370J0953J2376J3417J4099
58473I19385J4653J4853J3992J1718Q279L977q58n422q754j0632j1482j1434j0298
58460I27977q453o797n674m600l112j115J570M946Q103R816J0018R715R355Q345
$$ y = [1165835, 1187043, 1205110, 1218581, 1225848, 1226725, 1222429, 1214247, 1203034, 1189932, 1176603, 1164319, 1153314, 1143204, 1133533, 1123713, 1112995, 1100828, 1086875, 1070638, 1051696, 1030561, 1008650, 987066, 965970, 945498, 926678, 910820, 898418, 889163, 882731, 878990, 877691, 878459, 881018, 885088, 890219, 896041, 902508, 909523, 916501, 922550, 927026, 929767, 931064, 931572, 932061, 932988, 934434, 936411, 938859, 941265, 942759, 942828, 941567, 939088, 935187, 929801, 923311, 916126, 908475, 900856, 894055, 888193, 882294, 875387, 867697, 860311, 854035, 849092, 845555, 843465, 842758, 843551, 846364, 851625, 859170, 868540, 879493, 891869, 905286, 919385, 934038, 948891, 962883, 974601, 982880, 986857, 985999, 980577, 971823, 961191, 949709, 938275, 927977, 919524, 912727, 907053, 902453, 899341, 898226, 899796, 904742, 912845, 922661, 932679, 942394, 951749, 960094]
58446I60094O303L613N21l091o717r218j0211j0377j0106r011p067m927k705J23
58432H97224L090M611M295L960N239P488R086R731J0222J0974J1941J3180J4366
58419A005407J4487J3116J1174R454P285L788l41l635n688o967p427o883o217
58406A027553o721q343r847j0588j0982j1246j0983j0092r053q100o896n255l466
58393I15981j798k53J102K071K637K939K991K803K587K495K321J856J272Q54N92
58378I40450M26N77J228K256L491M863O094O732O854P094P717Q317Q756R587J1012
58363A025454J2268J2690J2717J3138J3977J4826J5675J6595J7154J6824J5579
58352A186897J3593J0867P622M486J801n51k299k691j763o34J59J530M111O759
$$ y = [960094, 966397, 970010, 970531, 967440, 960723, 951505, 941294, 930917, 920811, 911800, 904733, 899806, 897101, 897224, 900314, 904925, 909220, 913180, 918419, 925907, 934993, 944724, 954946, 965920, 977861, 991041, 1005407, 1019894, 1033010, 1044184, 1053638, 1060923, 1064711, 1064370, 1060735, 1055047, 1048080, 1040653, 1033770, 1027553, 1020832, 1012489, 1002642, 992054, 981072, 969826, 958843, 948751, 939698, 931598, 924702, 919447, 915981, 914183, 913930, 915032, 917103, 919740, 922679, 925670, 928473, 931060, 933555, 935876, 937732, 939004, 939858, 940450, 940876, 941453, 942681, 944937, 948428, 953291, 959385, 966117, 972971, 980065, 987782, 996099, 1004855, 1014442, 1025454, 1037722, 1050412, 1063129, 1076267, 1090244, 1105070, 1120745, 1137340, 1154494, 1171318, 1186897, 1200490, 1211357, 1218979, 1223465, 1225266, 1224715, 1222416, 1219725, 1217962, 1217328, 1217487, 1219017, 1223128, 1229887]
58338A229887P974Q013Q350R674J1554J3546J5443J6833J7513J8017J8851J9541
58326A395196J9254J7934J6060J3852J1430R241P526N889M159K942K651K814L105
58313A512053M139O265Q476R698J0357J1546J3381J5332J7362J9481K0842K0664
58301A669596J9563J8825J8807J9067J9460K0001K0266K0013J9811K0139K0578
58290A886126K0866K1742K3619K5475K6332K6875K8150K9648L0236L0207L0700
58279B179976L1748L2445L2515L2388L2279L2333L2872L3365L2321K9575K7507
58268B529324K8402L1853L6391M2132M9633N7394O3096O6606O9459P2034P3626
58257C119950P4624P6230P8297P9686Q0408Q1390Q2529Q3093Q3642Q5556Q9013
$$ y = [1229887, 1237861, 1245874, 1254224, 1263898, 1275452, 1288998, 1304441, 1321274, 1338787, 1356804, 1375655, 1395196, 1414450, 1432384, 1448444, 1462296, 1473726, 1482967, 1490493, 1496382, 1500541, 1503483, 1506134, 1508948, 1512053, 1516192, 1522457, 1530933, 1540631, 1550988, 1562534, 1575915, 1591247, 1608609, 1628090, 1648932, 1669596, 1689159, 1707984, 1726791, 1745858, 1765318, 1785319, 1805585, 1825598, 1845409, 1865548, 1886126, 1906992, 1928734, 1952353, 1977828, 2004160, 2031035, 2059185, 2088833, 2119069, 2149276, 2179976, 2211724, 2244169, 2276684, 2309072, 2341351, 2373684, 2406556, 2439921, 2472242, 2501817, 2529324, 2557726, 2589579, 2625970, 2668102, 2717735, 2775129, 2838225, 2904831, 2974290, 3046324, 3119950, 3194574, 3270804, 3349101, 3428787, 3509195, 3590585, 3673114, 3756207, 3839849, 3925405, 4014418]
58246D014418R3316R8590J05220J12388J19263J26756J35955J45727J54318J62449
58236E268400J72169J83441J94622K05713K18291K32581K47413K62811K80057
58227G265498K99350L19942L42257L67595L96043M26853M60366M97606N38840
58218A0914350N84474O36135O94749P59129Q28836R06622R95764J097314J212796
58209A8630169J347129J505675J691130J907032K162041K467671K835086L278238
58201C5824171L817354M476087N279064O255990P443998Q881999J0605572J2647592
58193I5231827J5036491J7790464K0909914K4347942K7946900L1399635L4296600
58186B66959773L6164963L6330172L3717401K7076329J5878296J285124j3857790
$$ y = [4014418, 4107734, 4206324, 4311544, 4423932, 4543195, 4669951, 4805906, 4951633, 5105951, 5268400, 5440569, 5624010, 5818632, 6024345, 6242636, 6475217, 6722630, 6985441, 7265498, 7564848, 7884790, 8227047, 8594642, 8990685, 9417538, 9877904, 10375510, 10914350, 11498824, 12134959, 12829708, 13588837, 14417673, 15324295, 16320059, 17417373, 18630169, 19977298, 21482973, 23174103, 25081135, 27243176, 29710847, 32545933, 35824171, 39641525, 44117612, 49396676, 55652666, 63096664, 71978663, 82584235, 95231827, 110268318, 128058782, 148968696, 173316638, 201263538, 232663173, 266959773, 303124736, 339454908, 373172309, 400248638, 416126934, 417412058, 403554268]
58179D03554268k6298451l3970324l6664712l5536391l2202038k8144616k4455699
58172A86282037k1669718j9714294j8140232j6524062j4718520j2811538j0956229
58165G1747444r265982p798016o562567n536659m687469l988170l414411k939715
58157B7554455k542485k210191j932165j695509j491426j318134j173686j051760
58149A4139099r46841q57471p82010p16481o58503o08184n63537n19989m75928
58140H010155m34131l96460l61618l29071l00586k76552k55075k35960k21487
58131E199215k12056k04762j97464j90519j83554j74367j62498j50483j40114
58122C583398j30519j21065j13061j07086j01469r4945q8508q3342p9043p5008
$$ y = [403554268, 377255817, 343285493, 306620781, 271084390, 238882352, 210737736, 186282037, 164612319, 144898025, 126757793, 110233731, 95515211, 82703673, 71747444, 62481462, 54683446, 48120879, 42584220, 37896751, 33908581, 30494170, 27554455, 25011970, 22801779, 20869614, 19174105, 17682679, 16364545, 15190859, 14139099, 13192258, 12334787, 11552777, 10836296, 10177793, 9569609, 9006072, 8486083, 8010155, 7576024, 7179564, 6817946, 6488875, 6188289, 5911737, 5656662, 5420702, 5199215, 4987159, 4782397, 4584933, 4394414, 4210860, 4036493, 3873995, 3723512, 3583398, 3452879, 3331814, 3218753, 3111667, 3010198, 2915253, 2826745, 2743403, 2664360, 2589352]
58112B589352p1584o8844o5960o2578n9210n5799n1620m6885m2692l9263l6060
58101A988857l3744l3862l6428l9880m3519m7875n2459n5498n6228n5448n3492
58090A480424m9916m5410m1665l8857l5510l1347k7931k5878k3830k1102j8996
58079A119982j8450j8435j7975j7737j8356j8886j8415j7637j7459j7290j6122
58068I23220j4301j2969j2445j2223j1901j1313j0397r504r183r233q822p870
58056G93059p433q175r490j0479j0911j0798j0028q898q133p882p577p011o630
58043F79614o410n632m185l114l212l994m543m615m466m332m502n191o063o611
58029F12744p113q320j0070j1222j1242j0836j0624j0238r177p689o291n184m438
$$ y = [2589352, 2517768, 2448924, 2382964, 2320386, 2261176, 2205377, 2153757, 2106872, 2064180, 2024917, 1988857, 1955113, 1921251, 1884823, 1844943, 1801424, 1753549, 1701090, 1645592, 1589364, 1533916, 1480424, 1430508, 1385098, 1343433, 1304576, 1269066, 1237719, 1209788, 1183910, 1160080, 1138978, 1119982, 1101532, 1083097, 1065122, 1047385, 1029029, 1010143, 991728, 974091, 956632, 939342, 923220, 908919, 895950, 883505, 871282, 859381, 848068, 837671, 828167, 818984, 809751, 800929, 793059, 785626, 777451, 767961, 757482, 746571, 735773, 725745, 716847, 708714, 700832, 693255, 686244, 679614, 673204, 667572, 663387, 660273, 657061, 653067, 648524, 643909, 639443, 635111, 630609, 625418, 619355, 612744, 605631, 597311, 587241, 576019, 564777, 553941, 543317, 533079, 523902, 516213, 509922, 504738, 500300]
58016E00300m096l798l110k316k139k565k855k844l071l560l568k880k170j770
58002D59558j210l39K81N37J079J952K163J328N19P03J333J423J054R04J078J271
57986D73634J529J983K378K553K814L247L290K617J804J495J519J476J557K037
57972E03933K512K409J843J268P14K6n20n16q3K83L62K66J11m1j97n47j292k192
57954E08339k757l021l529m403n081n227n201n279n159m628l989l426k574j237
57940D52828J35J121J898K780L803N103O884Q656R434R174R035R522R508P993
57926E37874N867M660M329L595K008K63j269l008n047o719p527p639p400p043
57912E12944o981p603q586r080q715p903p094o323n665n461n836o402o668o506
$$ y = [500300, 496204, 492406, 489296, 486980, 484841, 482276, 479421, 476577, 473506, 469946, 466378, 463498, 461328, 459558, 458348, 458009, 458290, 458827, 459906, 461858, 464021, 465349, 465868, 466571, 467904, 469327, 470381, 471285, 472363, 473634, 475163, 477146, 479524, 482077, 484891, 488138, 491428, 494045, 495849, 497344, 498863, 500339, 501896, 503933, 506445, 508854, 510697, 511965, 512679, 512705, 512185, 511669, 511586, 511869, 512231, 512497, 512608, 512567, 512370, 511823, 510531, 508339, 505582, 502561, 499032, 494629, 489548, 484321, 479120, 473841, 468682, 464054, 460065, 456639, 454065, 452828, 452963, 454084, 455982, 458762, 462565, 467668, 474552, 483208, 492642, 501816, 510851, 520373, 529881, 537874, 543741, 548401, 552730, 556325, 558333, 558596, 557327, 554319, 549272, 542553, 535026, 527387, 519987, 512944, 505963, 498360, 489774, 480694, 471979, 464076, 456982, 450659, 444994, 439533, 433697, 427295, 420627, 414121]
57898D14121o065n599n425n736o245o267n342l672j963r21p67j048j069o62l70
57883C62970o13j001q54k06K47J83J7J15J35l88j232j672j544j473j931k437k179
57866C48137j222n48q28j689k419k758k601j570L45K166K868K793L168M292N217
57851C55351N456N808O985Q333Q675P831O591N683N310N330N260M476K941J394
57837D35424L78m92j692k808l167l094l574m739n660n685n155m539l663k299r42
57822C88293l11l23k17K70M18l95j523j563o5J798K635K383J976J840J497N46
57806C97259q10k358m172n989p003o804n964n215m523l583k701k444k680k744
57792C40269k465k304k450k421j832j035o71q37j037q28l14J2k04p90j172p95
$$ y = [414121, 408056, 402457, 397032, 391296, 385051, 378784, 373442, 369770, 367807, 366886, 366119, 365071, 364002, 363340, 362970, 362357, 361356, 360502, 360296, 360543, 360726, 360743, 360858, 360993, 360605, 359373, 357701, 356157, 354684, 352753, 350316, 348137, 346915, 346367, 345539, 343850, 341431, 338673, 336072, 334502, 334847, 337013, 339881, 342674, 345842, 350134, 355351, 360807, 366615, 373600, 381933, 390608, 398439, 405030, 410713, 416023, 421353, 426613, 431089, 434030, 435424, 435802, 435310, 433618, 430810, 427643, 424549, 420975, 416236, 410576, 404891, 399736, 395197, 391534, 389235, 388293, 387982, 387659, 387442, 387712, 388130, 387735, 386212, 384649, 384584, 386382, 389017, 391400, 393376, 395216, 396713, 397259, 396449, 394091, 389919, 383930, 376927, 370123, 364159, 358944, 354421, 350838, 348137, 345693, 343013, 340269, 337804, 335500, 333050, 330629, 328797, 327762, 327091, 326254, 325217, 324389, 324075, 324087, 323883, 323093, 321921, 321126]
57776C21126M04J825K549K165J340J193J960K656K434J700J311J085J10j721l499
57761C36638m645n447o071o123n599n292n643o002n635m741l874l052k146j505
57747B70863j370j238n87K40O07N66M96K34n36j382j573j168p88n62k15Pm00j081
57729B62113j026r1P21P21M19N02Q44R88R80J066J077O95L5n88j188j925k521
57712B62822k423j610q58r13j621k097j754r60n18p05j110j334j398j406j230
57697B42885q37n29n27n83l42J07M07M44L66K98L66P54J362J672J397J080J640
57680B49960L342N609P709R355J0811J2781J6046K0718K6060L1442L7230M4171
57668D75234N2124N9941O6449P0712P1150O5207N0596K7133k325l2385n6950p1799
$$ y = [321126, 321530, 323355, 325904, 328069, 329409, 330602, 332562, 335218, 337652, 339352, 340663, 341748, 341858, 340137, 336638, 331993, 326546, 320475, 314352, 308753, 303461, 297818, 291816, 286181, 281440, 277566, 274514, 272368, 270863, 269493, 268255, 267668, 267908, 268515, 269081, 269577, 269811, 269275, 267893, 266320, 265152, 264364, 263802, 263587, 263594, 263194, 262113, 261087, 260996, 261717, 262438, 262857, 263359, 264203, 265191, 266171, 267237, 268314, 269009, 269044, 268456, 267268, 265343, 262822, 260399, 258789, 257931, 257018, 255397, 253300, 251546, 250586, 250068, 249363, 248253, 246919, 245521, 244115, 242885, 242048, 241519, 240992, 240409, 240067, 240174, 240581, 241025, 241391, 241689, 242055, 242809, 244171, 245843, 247240, 248320, 249960, 253302, 258911, 266620, 275975, 286786, 299567, 315613, 336331, 362391, 393833, 431063, 475234, 527358, 587299, 653748, 724460, 795610, 860817, 911413, 938546, 936221, 903836, 846886, 775087]
57656G75087p6369p3296o6175n7678m9117m0929l3189k6075k0128j5917j3399
57645C02815j1818j0314q515o596n009m097l709l265k366j263m07J56O48R98R64
57630B48222O77N16N04L14j01m60p21j166j762k058j935j892k274k650k439j819
57614B30956j523j863k371k410j888j246r82j200j567j541p69N42J571J391q4
57599B17016j738k207j257N9P01N64K4q25j967k995l450l382l110k691k138j828
57583A90776k044k414k446k335k507k593j860n69R9k88q31p65o46j369k649l253
57567A64306k540j141j50j06p35j387j599j299o37J63P38P26L47M65J532K688
57551A61371K695J637Q95J304K184K517K174J520N67p24j832k195k043k023k088
$$ y = [775087, 698718, 625422, 559247, 501569, 452452, 411523, 378334, 352259, 332131, 316214, 302815, 290997, 280683, 272168, 265572, 260563, 256466, 252757, 249492, 247126, 245863, 245456, 245612, 246260, 247258, 248222, 248899, 249415, 249919, 250233, 250132, 249672, 248951, 247785, 246023, 243965, 242030, 240138, 237864, 235214, 232775, 230956, 229433, 227570, 225199, 222789, 220901, 219655, 218673, 217473, 215906, 214365, 213596, 214138, 215709, 217100, 217016, 215278, 213071, 211814, 211873, 212574, 213138, 213162, 212337, 210370, 207375, 203925, 200543, 197433, 194742, 192604, 190776, 188732, 186318, 183872, 181537, 179030, 176437, 174577, 174008, 174107, 173819, 172988, 172223, 171577, 170208, 167559, 164306, 161766, 160625, 160475, 160369, 159634, 158247, 156648, 155349, 154712, 154875, 155613, 156339, 156686, 157151, 158683, 161371, 164066, 165703, 166598, 167902, 170086, 172603, 174777, 176297, 176864, 176140, 174308, 172113, 170070, 168047, 165959]
57536A65959j571l58O49N74l65j127j037l54K18L59K80K73L63M84O66Q44P62L87
57518A67006J54M85J122J404J083M95Nk06K4O46J113Q72K44J46P62J218Q42N1
57500A77466l94m24l85l56k81m33j064j853k254k212k050j821j348p59m96p02
57484A60634j061j228j100o64N8Q64J422J631J655J625J394P38l18j408k070k152
57468A60020j973j951k121k223k188k195k121j401J73J875K589J899L90r80j524
57453A48269j077m3P97Q65K58m48p79o30j19N03Q98Q53M90R0j93l53l42j36R3
57434A48996J82K67O12J085J175O72K3k47k32l98p89r13n33j07j82o46r59q33
57416A47173l29N16J541K041J300k70j226p81L24J028J366J907K411K082R20j97
$$ y = [165959, 164388, 164030, 164679, 165253, 164888, 163761, 162724, 162370, 162588, 162947, 163227, 163500, 163863, 164347, 165013, 165857, 166619, 167006, 167160, 167645, 168767, 170171, 171254, 171749, 171754, 171548, 171572, 172218, 173331, 174203, 174447, 174593, 175355, 176573, 177415, 177466, 177072, 176648, 176263, 175907, 175626, 175193, 174129, 172276, 170022, 167810, 165760, 163939, 162591, 161832, 161336, 160634, 159573, 158345, 157245, 156581, 156639, 157503, 158925, 160556, 162211, 163836, 165230, 165968, 165650, 164242, 162172, 160020, 158047, 156096, 153975, 151752, 149564, 147369, 145248, 143847, 144020, 145895, 148484, 150383, 150773, 149793, 148269, 147192, 147149, 147946, 148811, 149069, 148621, 147842, 147212, 147093, 147596, 148494, 149347, 149837, 149927, 149734, 149381, 149039, 148903, 148996, 149178, 149445, 150057, 151142, 152317, 152989, 153012, 152765, 152533, 152135, 151346, 150433, 149900, 149793, 149611, 148965, 148006, 147173, 146844, 147360, 148901, 150942, 152242, 151972, 150746, 149965, 150289, 151317, 152683, 154590, 157001, 159083, 160003, 159806]
57400A59806p93j161j432j222m80J50K53J72K88M22L97N88J335K280K800K777
57384A66180K584K575K904L468L775L298K186J209P72M88qm55o15q21j349j786
57368A84405j690j350j290j415j379j344j603j807j425p33m48n42l12L55P57N70
57352A70749M41R85J927K552K568K116J370N01j58l41r0L07N88O77O89P79Q61
57335A86521O34O4l99l97j42k9K0K54M60K37k32m05l28n37r70q06K30J287J637
57316A87099J731K315L016K764J408L9m03j82j67o76j268j422j084n65q7M20J033
57299A93971J477J311N53j45j79L07O33M28pk02p0J52K25Q4k04m30l54M4M81O33
57279A98708N04L48L51N11P88J108J246J031Q21J394L005M779N497M948M038L501
$$ y = [159806, 159013, 157852, 156420, 155198, 154718, 154868, 155121, 155293, 155581, 156003, 156400, 156988, 158323, 160603, 163403, 166180, 168764, 171339, 174243, 177711, 181486, 184784, 186970, 188179, 188951, 189439, 189431, 188976, 188361, 187540, 186191, 184405, 182715, 181365, 180075, 178660, 177281, 175937, 174334, 172527, 171102, 170369, 169921, 169379, 169067, 169422, 170179, 170749, 171190, 172175, 174102, 176654, 179222, 181338, 182708, 183209, 183051, 182710, 182620, 182927, 183515, 184192, 184881, 185660, 186521, 187155, 187219, 186820, 186423, 186281, 186252, 186272, 186526, 186986, 187223, 186991, 186586, 186258, 185721, 184751, 183945, 184175, 185462, 187099, 188830, 191145, 194161, 196925, 198333, 198372, 197969, 197787, 197620, 196944, 195676, 194254, 193170, 192605, 192518, 192938, 193971, 195448, 196759, 197312, 197167, 196988, 197295, 197928, 198356, 198349, 198147, 198077, 198229, 198454, 198538, 198334, 197904, 197550, 197594, 198075, 198708, 199212, 199560, 199911, 200422, 201210, 202318, 203564, 204595, 205416, 206810, 209815, 214594, 220091, 225039, 229077, 232578]
57263B32578L077K211J132O85J252K313L051L059K420J487P52O36J108J618J645
57248B59024J242R50J087J372J327R08N16M10M11K31r1l03l00j33K35Q87J657
57231B69430K152K120J662J066O47O26R22J095Q24L85L40P58J177J398J771K499
57215B88872L081K919K141J459J299J491J746K058K589L298L869L970L640L321
57201C25753L377L672L854L920M120M342M154L626L558M543O185P590Q336Q584
57187C95614Q645Q876R691J1178J2832J4104J5029J5997J7133J8386J9978K2242
57175E69705K5121K8265L1477L4578L6999L8213L8541L8896L9497L9505L8171
57164I58968L5804L3289L1053K9004K7074K5348K3753K2119K0586J9617J9533
$$ y = [232578, 235655, 237866, 238998, 239683, 240935, 243248, 246299, 249358, 251778, 253265, 254017, 254653, 255761, 257379, 259024, 260266, 261216, 262303, 263675, 265002, 265910, 266426, 266836, 267247, 267478, 267387, 267084, 266784, 266651, 266886, 267773, 269430, 271582, 273702, 275364, 276430, 277077, 277703, 278625, 279720, 280544, 280929, 281269, 282027, 283204, 284602, 286373, 288872, 291953, 294872, 297013, 298472, 299771, 301262, 303008, 305066, 307655, 310953, 314822, 318792, 322432, 325753, 329130, 332802, 336656, 340576, 344696, 349038, 353192, 356818, 360376, 364919, 371104, 378694, 387030, 395614, 404259, 413135, 422826, 434004, 446836, 460940, 475969, 491966, 509099, 527485, 547463, 569705, 594826, 623091, 654568, 689146, 726145, 764358, 802899, 841795, 881292, 920797, 958968, 994772, 1028061, 1059114, 1088118, 1115192, 1140540, 1164293, 1186412, 1206998, 1226615, 1246148]
57153A246148K0167K1104K2146K3458K5305K7628K9978L1960L3828L6410M0221
57142A558353M4707M8518N0648N1117N0613M9777M9014M8721M9228N0530N2512
57131B103738N5439N9856O5773P2304P8411Q3739Q8415R2385R5405R7584R9427
57120B992476J01341J03434J05861J08999J13297J19053J26272J34420J42524
57111D047677J49937J57048J65069J75199J88216K04629K24985K50172K81633
57102E844565L21093L70049M30122N04115N95940P08915Q44629J003690J186183
57093A1809301J390292J611273J842779K078277K310515K531305K733325K910507
57085B9217574L055047L155797L199179L163417L004515K657266K073857J277660
$$ y = [1246148, 1266315, 1287419, 1309565, 1333023, 1358328, 1385956, 1415934, 1447894, 1481722, 1518132, 1558353, 1603060, 1651578, 1702226, 1753343, 1803956, 1853733, 1902747, 1951468, 2000696, 2051226, 2103738, 2159177, 2219033, 2284806, 2357110, 2435521, 2519260, 2607675, 2700060, 2795465, 2893049, 2992476, 3093817, 3197251, 3303112, 3412111, 3525408, 3644461, 3770733, 3905153, 4047677, 4197614, 4354662, 4519731, 4694930, 4883146, 5087775, 5312760, 5562932, 5844565, 6165658, 6535707, 6965829, 7469944, 8065884, 8774799, 9619428, 10623118, 11809301, 13199593, 14810866, 16653645, 18731922, 21042437, 23573742, 26307067, 29217574, 32272621, 35428418, 38627597, 41791014, 44795529, 47452795, 49526652, 50804312]
57077E0804312L74711n00588j257402j872395k358586k727756k982775l128791
57069C6350730l177856l144122l041193k883636k686602k463448k225794j985037
57061A4743042j751465j532331j332193j154244r99640q66441p51262o51799n66772
57052E136895m94372m32392l79404l34515k96286k63069k34079k09012j87035
57043B306731j67175j49344j33977j20929j09592r9712r1192q3397p5546o7614
57033A208253o0036n2761m5277l7367k9241k1087j2933m681L989J3298K2720L1273
57021A016150L8582M4439M6714M1179K5001P4k7897n2999p1176q0284q0400p4146
57009H25237o5133n5620m6220l7456l0223k4747k0316j6360j2940j0042p389n127
$$ y = [50804312, 51179023, 50678435, 49421033, 47548638, 45190052, 42462296, 39479521, 36350730, 33172874, 30028752, 26987559, 24103923, 21417321, 18953873, 16728079, 14743042, 12991577, 11459246, 10127053, 8972809, 7973169, 7106728, 6355466, 5703667, 5136895, 4642523, 4210131, 3830727, 3496212, 3199926, 2936857, 2702778, 2493766, 2306731, 2139556, 1990212, 1856235, 1735306, 1625714, 1526002, 1434810, 1351413, 1275867, 1208253, 1148217, 1095456, 1050179, 1012812, 983571, 962484, 949551, 944870, 948859, 962157, 984877, 1016150, 1054732, 1099171, 1145885, 1187064, 1212065, 1212139, 1184242, 1131243, 1060067, 979783, 899383, 825237, 760104, 704484, 658264, 620808, 590585, 565838, 545522, 529162, 516222, 506180, 498791, 493664]
56997D93664l886l832m361m940n613o515p420q063q427q570q543q459q249p454
56983C99332n766l716k303k081l130n594r398j3443j6018j6271j4716j2284r601
56970B85011p199n520m290k598m3K740N067P114R356J1591J3206J4200J5261J6736
56956C60632J7958J7633J4823R503K477n047j1889j7203k0584k2016k1684j9827
56944C04776j6879j3504j0201o891l276M04L479N893Q512J1961J5665J8604K0672
56931C39215K2587K4477K5156K2888J6649O778n077j6583k5651l1148l2949l1651
56919C14691k8349k4274k0248j6605j3652j1761j0709r473p248m399k028q37q45
56906A64263j741k890l328k463q20M80R41R97J311K183L527M939N955O594P508
$$ y = [493664, 489778, 485946, 481585, 476645, 471032, 464517, 457097, 449034, 440607, 432037, 423494, 415035, 406786, 399332, 393566, 389850, 387547, 385466, 382336, 376742, 367344, 353901, 337883, 321612, 306896, 294612, 285011, 277812, 272292, 268002, 265404, 265361, 268101, 273168, 280282, 289638, 301229, 314435, 328635, 343896, 360632, 378590, 396223, 411046, 420549, 423026, 417979, 406090, 388887, 368303, 346287, 324603, 304776, 287897, 274393, 264192, 257301, 254025, 254429, 257908, 263801, 272313, 284274, 299939, 318543, 339215, 361802, 386279, 411435, 434323, 450972, 457750, 452673, 436090, 410439, 379291, 346342, 314691, 286342, 262068, 241820, 225215, 211563, 199802, 189093, 179620, 172372, 167973, 165945, 165108, 164263, 162522, 159632, 156304, 153841, 153021, 153501, 154442, 155439, 156750, 158933, 162460, 167399, 173354, 179948, 187456]
56891A87456R181J1299J3322J5297J7519J9687K1054K1124J9613J6052J0287L232
56879C65123l546q971j2590j4081j3500j1790r975p828m370L21M935Q753J2504
56866C04985J6942K1710K6305L1208L7019M3013M7471M9329M8612M5196L7946
56855G09736K5596Q581j0198k6626l7658m2617m2571l8912l2782k5288j7435r758
56843D60068k382M623J1379J8533K6841L6296M6207N5980O5242P3127P8150P8988
56831I53052P4660O3884M5163J8569j2623m2612o5814p9310q3335p9962p1558
56820G20114o0279m8273l7318k7803j8685r096M12Q855J6465K4450L3248M1925
56808F44015M9248N4424N6657N4788M7686L4624J5520q119l2405n2284o4345o8363
$$ y = [187456, 196637, 207936, 221258, 236555, 254074, 273761, 294815, 315939, 335552, 351604, 361891, 365123, 361577, 352606, 340016, 325935, 312435, 300645, 290670, 282842, 278472, 278793, 283728, 292481, 304985, 321927, 343637, 369942, 401150, 438169, 481182, 528653, 577982, 626594, 671790, 709736, 735332, 743913, 733715, 707089, 669431, 626814, 584243, 545331, 512549, 487261, 469826, 460068, 457686, 462309, 473688, 492221, 519062, 555358, 601565, 657545, 722787, 795914, 874064, 953052, 1027712, 1091596, 1136759, 1155328, 1142705, 1100093, 1034279, 954969, 871634, 791672, 720114, 659835, 611562, 574244, 546441, 527756, 518660, 519072, 527927, 544392, 568842, 602090, 644015, 693263, 747687, 804344, 859132, 906818, 941442, 956962, 948843, 916438, 864154, 799809, 731446]
56796G31446o6341o0700n3375m5493l7328k8905k0780j3785p977k580K955Q506
56784D05643J3876J9035K3586K6806K8354K8099K5218J8453P706n384j8672l0366
56772E42354l8711m2308m1497l8416l4835l0857k6240k1867j8829j6917j5151
56761B16726j3215j1398r600p480n286l676k832k420k175j960j636j352j594k391
56747A49711k958k695j996j491j079m58j2k93j039j563j727j766j559r41l61l56
56731A29417o61o30k08K70Q59J701K302K131J636J574J681J108P3j84P38J730
56715A43537J681P44k18o84n91p6N62J049J412J736J773J401J161J580K141J884
56699A59092R00J51j68q48j986k428j518k57J44q2oL01L3q28j337r72l25j77n73
$$ y = [731446, 665105, 604405, 551030, 505537, 468209, 439304, 418524, 404739, 396762, 394182, 397137, 405643, 419519, 438554, 462140, 488946, 517300, 545399, 570617, 589070, 596776, 591392, 572720, 542354, 503643, 461335, 419838, 381422, 346587, 315730, 289490, 267623, 248794, 231877, 216726, 203511, 192113, 182513, 175033, 169747, 166071, 163239, 160819, 158644, 156684, 155048, 153696, 152102, 149711, 146753, 144058, 142062, 140571, 139492, 139034, 139022, 138729, 137690, 136127, 134400, 132634, 131075, 130134, 129773, 129417, 128756, 128126, 127918, 128188, 129047, 130748, 133050, 135181, 136817, 138391, 140072, 141180, 141253, 141069, 141807, 143537, 145218, 145962, 145744, 145060, 144469, 144393, 144955, 146004, 147416, 149152, 150925, 152326, 153487, 155067, 157208, 159092, 159992, 160143, 159975, 159127, 157141, 154713, 153195, 152938, 153082, 153000, 152994, 153295, 153328, 152500, 151163, 150191, 149866, 149689, 149116]
56680A49116j027j197j079p91m46j17J89N71J081J556J627J058J14n41n14j16
56664A49484K8k87o77o83j91N04R29Q25M85N53J217J916K136K110K226K141J222
56647A63938k33j137r93m51j90l6M33J013J171R26P95J032J286J115N57J43L44
56630A69713J104J893K301K322K038J356M01j41L12J317J791J350O50L28J72l03
56614A86604j058j666j897j807j441q27q6O99J462J909J540K82j140j789j451
56599A79334p39l36l50m30l79m29r08j648k050j774j142o37k08M96J339J660J122
56582A72921J99l29j83L16P03P85P08O75O60N06L25N30J253K075K629L090L670
56565A90533L972L562K982L354M876O514P363P680Q198Q971R359Q775P102M655
$$ y = [149116, 148089, 146892, 145813, 145022, 144576, 144459, 144648, 145219, 146300, 147856, 149483, 150541, 150655, 150114, 149600, 149484, 149512, 149225, 148548, 147865, 147674, 148178, 149107, 149932, 150417, 150970, 152187, 154103, 156239, 158349, 160575, 162716, 163938, 163705, 162568, 161575, 161124, 160934, 160898, 161331, 162344, 163515, 164441, 165236, 166268, 167554, 168669, 169226, 169369, 169713, 170817, 172710, 175011, 177333, 179371, 180727, 181128, 180987, 181299, 182616, 184407, 185757, 186407, 186735, 186907, 186604, 185546, 183880, 181983, 180176, 178735, 177908, 177822, 178521, 179983, 181892, 183432, 183714, 182574, 180785, 179334, 178595, 178259, 177909, 177479, 177100, 176671, 175763, 174115, 172065, 170291, 169149, 168512, 168304, 168800, 170139, 171799, 172921, 173120, 172791, 172608, 172924, 173627, 174412, 175120, 175795, 176455, 176961, 177286, 177816, 179069, 181144, 183773, 186863, 190533, 194505, 198067, 201049, 204403, 209279, 215793, 223156, 230836, 239034, 248005, 257364, 266139, 273241, 277896]
56551B77896K054o4j443k213k475k222j750j623k001k357k207j829j884k559l390
56536B51933l780l481k669j778j287j438k102k829l061k498j480p45o89r99j267
56521B21830j520j765j496m41N89M71o28j403j217p44o12n02q5J30l44j041j243
56504B09979j100j141j194o07O32J705J910J257K20o81j148j311j494j599j119
56489B04309o7O09J77p48r08pJ027J252N57n21j284j189l40M34N07L16P49J759
56471B06632K322J851R16L42K31J91Q7Q8L05O94J170J562J579J084L33j59n6M92
56453B19664R20P80K58L0L55O43K59n24q07k48N50Q78O44J84k25m56m83m73o36
56434B21313q20n65K27R96J186R16P16P76Q09O03K69l9l40n62m43R9N75L45n31
$$ y = [277896, 279950, 279886, 278443, 276230, 273755, 271533, 269783, 268160, 266159, 263802, 261595, 259766, 257882, 255323, 251933, 248153, 244672, 242003, 240225, 238938, 237500, 235398, 232569, 229508, 227010, 225530, 224785, 224096, 223097, 221830, 220310, 218545, 217049, 216608, 217197, 217668, 217040, 215637, 214420, 213676, 213064, 212562, 212477, 212607, 212263, 211222, 209979, 208879, 207738, 206544, 205937, 206569, 208274, 210184, 211441, 211661, 210980, 209832, 208521, 207027, 205428, 204309, 204242, 204851, 205028, 204280, 203372, 203365, 204392, 205644, 206201, 205680, 204396, 203207, 202867, 203301, 203808, 204124, 204873, 206632, 208954, 210805, 211721, 212063, 212294, 212485, 212572, 212660, 212965, 213659, 214829, 216391, 217970, 219054, 219387, 219228, 219172, 219664, 220584, 221364, 221622, 221652, 222007, 222650, 222909, 222385, 221578, 221330, 221880, 222758, 223402, 223586, 223361, 222905, 222422, 221949, 221313, 220493, 219928, 220155, 221151, 222337, 223253, 223969, 224745, 225554, 226157, 226426, 226387, 226047, 225485, 225042, 225141, 225716, 226061, 225530]
56415B25530j218j064l71J04K50O19J345J739J272N43N95J528K351K265J496P84
56399B37768N05N63P43Q11N59M9k65LO69J176J310J391J713K033J876J202N69
56382B52675N32J036J501J511J246J210J560J864J595P47j00m03j18M06R05J352
56366B67519J778K122K258K001J185L0o55r9J384K412J959N29m72l09N36J218
56350B83396J376J156Q97R39J339J626J235L32j61M00J603K489K610K370K408
56335C04015K935L610L957L881L781M052M574M803M372L395K277J461J277J645
56321C50035J977J677P99j38r03j672k372k454j630m33L07L07q3l12l0P33J502
56304C47310J785J664J738K295K905L078K940K933L157L357L413L507L850M455
$$ y = [225530, 224312, 223248, 222877, 222981, 223231, 223850, 225195, 226934, 228206, 228749, 229344, 230872, 233223, 235488, 236984, 237768, 238273, 238836, 239579, 240390, 240949, 240998, 240733, 240736, 241405, 242581, 243891, 245282, 246995, 249028, 250904, 252106, 252675, 253207, 254243, 255744, 257255, 258501, 259711, 261271, 263135, 264730, 265477, 265377, 264974, 264856, 265262, 266167, 267519, 269297, 271419, 273677, 275678, 276863, 276893, 276238, 276139, 277523, 279935, 281894, 282423, 281951, 281642, 282178, 283396, 284772, 285928, 286825, 287764, 289103, 290729, 291964, 292296, 292135, 292535, 294138, 296627, 299237, 301607, 304015, 306950, 310560, 314517, 318398, 322179, 326231, 330805, 335608, 339980, 343375, 345652, 347113, 348390, 350035, 352012, 353689, 354488, 354350, 353447, 351775, 349403, 346949, 345319, 344886, 345193, 345500, 345417, 345105, 345075, 345808, 347310, 349095, 350759, 352497, 354792, 357697, 360775, 363715, 366648, 369805, 373162, 376575, 380082, 383932, 388387]
56290C88387N093N338M880L916L100K985L638M761N945O849P411P919Q545Q922
56276D67689Q667Q190Q296Q940R298R228R796J1754J4312J6179J7147J7880J8674
56263F26050J9408K0362K2072K4445K6883K9308L2311L6161M0440M4853M9774
56252I72067N5729O2754P0597P9070Q7971R6922J05617J14075J22359J30172J36865
56241B034198J41868J44899J45691J43641J37993J28519J15767J00389Q2372O1403
56231C236740L7856J2946j2178l6824o0148q0823r7759j10813j20443j27099j31177
56220B510278j33075j32907j30571j26414j21273j15488j08503j00020r0980q2730
56210A368317p5599o9042o2779n7037n1911m7247m3012l9231l5665l2158k9016
$$ y = [388387, 393480, 398818, 403698, 407614, 410714, 413699, 417337, 422098, 428043, 434892, 442303, 450222, 458767, 467689, 476356, 484546, 492842, 501782, 511080, 520308, 530104, 541858, 556170, 572349, 589496, 607376, 626050, 645458, 665820, 687892, 712337, 739220, 768528, 800839, 837000, 877440, 922293, 972067, 1027796, 1090550, 1161147, 1240217, 1328188, 1425110, 1530727, 1644802, 1767161, 1897333, 2034198, 2176066, 2320965, 2466656, 2610297, 2748290, 2876809, 2992576, 3092965, 3175337, 3236740, 3274596, 3287542, 3275364, 3238540, 3178392, 3097569, 2999810, 2888997, 2768554, 2641455, 2510278, 2377203, 2244296, 2113725, 1987311, 1866038, 1750550, 1642047, 1542027, 1451047, 1368317, 1292718, 1223676, 1160897, 1103860, 1051949, 1004702, 961690, 922459, 886794, 854636, 825620]
56199H25620k6503k4163k1377j8352j5849j4067j2517j0935r583q610p796p068
56187F48800o633o460o097n271m205l259k525j888j300r27j064j733k286j883
56173F03269n63O21Q72N34L36M14O53J290K418L373L527L280L452M094M811N751
56157F38132P214Q598R033Q856R253J0441J1457J1881J2519J3995J5816J7336
56145G74531J8849K1143K4596K9054L4089L9150M4026M9186N5159O1626O7898
56134A219307P4121Q0975Q8001R3226R4755R1975Q5133P4893O2847N1425M2480
56123B059138L6400L2740L0776K8879K4480J5897M099p953j7640k4072k7852l0289
56111B124603l2944l7281m4281n3971o5055p5195q2163q4919q3562p8620p0896
$$ y = [825620, 799117, 774954, 753577, 735225, 719376, 705309, 692792, 681857, 672274, 663664, 655868, 648800, 642167, 635707, 629610, 624339, 620134, 616875, 614350, 612462, 611162, 610235, 609171, 607438, 605152, 603269, 602706, 603327, 604199, 604733, 605069, 605483, 606136, 607426, 609844, 613217, 616744, 620024, 623476, 627570, 632381, 638132, 645346, 653944, 662977, 671833, 681086, 691527, 702984, 714865, 727384, 741379, 757195, 774531, 793380, 814523, 839119, 868173, 902262, 941412, 985438, 1034624, 1089783, 1151409, 1219307, 1293428, 1374403, 1462404, 1555630, 1650385, 1742360, 1827493, 1902386, 1965233, 2016658, 2059138, 2095538, 2128278, 2159054, 2187933, 2212413, 2228310, 2232409, 2224456, 2206816, 2182744, 2154892, 2124603, 2091659, 2054378, 2010097, 1956126, 1891071, 1815876, 1733713, 1648794, 1565232, 1486612, 1415716]
56100A415716o1703n2481m3968l6194k9172k3159j8249j4250j0887p810m739j992
56088A111112m73m03n78L98K475M604O211P280P515O795O075O480P598Q120P969
56073A181178Q291R350J0117J0214J0631J1993J3590J4678J5456J6215J6745J7156
56061A335614J8066J9450K0465K0929K1743K3236K4335K4030K2699K1218J9867
56050A571652J8773J8502J9437K1222K3263K5067K5948K5403K4015K2968K2509
56039A818759K1928K1030K0281J9502J7958J5940J4544J3721J2341J0687J0860
56028A997551J4079J9378K5752L3564M2785N1687N8535O3197O6093O7231O7198
56017B507050O7492O8797P0333P1815P4299P8164Q2121Q5294Q8579R2763R7123
$$ y = [1415716, 1354013, 1301532, 1257564, 1221370, 1192198, 1169039, 1150790, 1136540, 1125653, 1117843, 1113104, 1111112, 1110639, 1110236, 1109658, 1110056, 1112531, 1117135, 1123346, 1130626, 1138141, 1144936, 1151011, 1157491, 1165089, 1173209, 1181178, 1189469, 1198819, 1208936, 1219150, 1229781, 1241774, 1255364, 1270042, 1285498, 1301713, 1318458, 1335614, 1353680, 1373130, 1393595, 1414524, 1436267, 1459503, 1483838, 1507868, 1530567, 1551785, 1571652, 1590425, 1608927, 1628364, 1649586, 1672849, 1697916, 1723864, 1749267, 1773282, 1796250, 1818759, 1840687, 1861717, 1881998, 1901500, 1919458, 1935398, 1949942, 1963663, 1976004, 1986691, 1997551, 2011630, 2031008, 2056760, 2090324, 2133109, 2184796, 2243331, 2306528, 2372621, 2439852, 2507050, 2574542, 2643339, 2713672, 2785487, 2859786, 2937950, 3020071, 3105365, 3193944, 3286707, 3383830]
56006C383830J01076J05376J10460J15423J19864J24930J31314J38142J44995
55997D475410J53005J62579J72238J81173J90860K02596K15594K29013K43646
55988F226114K60060K77417K95680L16606L40881L66858L93844M23924M58755
55979I360139M97391N39148N85680O38228O95995P59331Q31290R13952J006807
55970A5827961J111059J231795J373798J539503J733619J965389K244024K577273
55962B9604421K977688L465405M062502M790986N679521O765608Q087979R681745
55954G5115855J1579439J3806075J6372035J9274382K2479747K5859494K9134872
55947B13621899L1918716L3779420L4131398L2007782K6175680J5923281K055669
$$ y = [3383830, 3484906, 3590282, 3700742, 3816165, 3936029, 4060959, 4192273, 4330415, 4475410, 4628415, 4790994, 4963232, 5144405, 5335265, 5537861, 5753455, 5982468, 6226114, 6486174, 6763591, 7059271, 7375877, 7716758, 8083616, 8477460, 8901384, 9360139, 9857530, 10396678, 10982358, 11620586, 12316581, 13075912, 13907202, 14821154, 15827961, 16939020, 18170815, 19544613, 21084116, 22817735, 24783124, 27027148, 29604421, 32582109, 36047514, 40110016, 44901002, 50580523, 57346131, 65434110, 75115855, 86695294, 100501369, 116873404, 136147786, 158627533, 184487027, 213621899, 245540615, 279320035, 313451433, 345459215, 371634895, 387558176, 389613845]
55940C89613845j2908891k5790253l4305782l7928453l7581282l4733316l0690399
55933A75675469k6352085k2240793j8594710j5472546j2852931j0688702q917240
55926F0556462p468969o285252n321670m536360l888418l348278k898658k524160
55918B4284697k208106j938777j709885j514207j343304j193212j063846r52741
55910A2360619q54744p67422o91494o26270n69231n19521m77459m41247m08116
55901G005115l77890l51612l27881l04391k81897k62565k45589k28455k11533
55892D413302j97214j85238j73059j60347j49112j39646j30215j20684j12693
55883C045094j06093r8763r0319q2704p6716p1027o5178o0691n8704n8998o1538
$$ y = [389613845, 376704954, 350914701, 316608919, 278680466, 241099184, 206365868, 175675469, 149323384, 127082591, 108487881, 93015335, 80162404, 69473702, 60556462, 53087493, 46802241, 41480571, 36944211, 33055793, 29707515, 26808857, 24284697, 22076591, 20137814, 18427929, 16913722, 15570418, 14377206, 13313360, 12360619, 11505875, 10738453, 10046959, 9420689, 8851458, 8331937, 7854478, 7413231, 7005115, 6627225, 6275613, 5947732, 5643341, 5361444, 5098879, 4853290, 4624835, 4413302, 4216088, 4030850, 3857791, 3697444, 3548332, 3408686, 3278471, 3157787, 3045094, 2939001, 2840238, 2749919, 2667215, 2590499, 2519472, 2454294, 2393603, 2334899, 2275901, 2214363]
55872B214363o6317p1320p3444p2134o9671o7416o4236n9237n3544m8377m3568
55861A525099l9033l5822l4610l4645l5111l6110l7464l7956l6622l3848l0664
55850A133214k7902k6292k6218k6952k7238k6850k6586k6623k6158k4811k3058
55839H44526k1126j8793j6521j5356j5256j4868j3509j2079j1437j1103j0298
55828F84180r198q372p768p117o695p030q174r722j1172j2079j2259j2014j1732
55815E60848j1331j0530r538q737p887o460m734l563l055k393j138K20J254K215
55801D95171L383M626N864P281Q652R192Q467O926N261L690K115M34j492l753
55787E55817o056p860q953r460r385q650p584o877o949p900r812j2503j4989j5943
$$ y = [2214363, 2148046, 2076726, 2003282, 1931148, 1861477, 1794061, 1729825, 1670588, 1617044, 1568667, 1525099, 1486066, 1450244, 1415634, 1380989, 1345878, 1309768, 1272304, 1234348, 1197726, 1163878, 1133214, 1105312, 1079020, 1052802, 1025850, 998612, 971762, 945176, 918553, 892395, 867584, 844526, 823400, 804607, 788086, 772730, 757474, 742606, 729097, 717018, 705581, 694478, 684180, 674982, 666610, 658842, 651725, 645030, 638000, 629826, 620104, 608932, 596853, 584594, 572580, 560848, 549517, 538987, 529449, 520712, 512825, 506365, 501631, 498068, 495013, 492620, 491482, 491702, 492956, 495171, 498554, 503180, 509044, 516325, 524977, 534169, 542636, 549562, 554823, 558513, 560628, 561062, 559570, 555817, 549761, 541901, 532948, 523488, 514103, 505453, 497869, 490992, 484043, 476143, 466331, 453828, 438839, 422896]
55773D22896j4904j2558r892p535n811m729l886k938k125j837j863j743j581j740
55759C49754j955j684j198j360k319l352m027m556m894m635m014l990m915o011
55745C00844o531o622o587o230n423m579l995l322k188q92M5M95N52K18l24o69
55729B54792p37r29j480k065k347k454k658l019l533m135m474m215l671l469l475
55714B12131k857j424p8M40M31M77O32R21J805L342M543M393L068J519K14j009
55698B28548k225l304m296n214n631n096l886k755k033j447p93k57JJ56M72R39
55682A93179J283J311J223J466K137K730K786K602K676K703J871K44j106j673
55668B13432k243l484m632m444k887j040L05J036J130O38J85N63J628K362K178
$$ y = [422896, 407992, 395434, 385542, 378007, 372196, 367467, 363581, 360643, 358518, 356681, 354818, 353075, 351494, 349754, 347799, 346115, 344917, 343557, 341238, 337886, 333859, 329303, 324409, 319774, 315760, 311770, 306855, 300844, 294313, 287691, 281104, 274874, 269451, 264872, 260877, 257555, 255367, 254475, 254520, 255015, 255567, 255785, 255461, 254792, 254055, 253126, 251646, 249581, 247234, 244780, 242122, 239103, 235570, 231435, 226961, 222746, 219075, 215606, 212131, 209274, 207850, 207772, 208212, 208643, 209120, 209752, 210673, 212478, 215820, 220363, 224756, 227824, 229343, 229557, 228548, 226323, 223019, 218723, 213509, 207878, 202782, 198896, 196141, 194108, 192661, 191868, 191611, 191612, 191768, 192240, 193179, 194462, 195773, 196996, 198462, 200599, 203329, 206115, 208717, 211393, 214096, 215967, 216211, 215105, 213432, 211189, 207705, 203073, 198629, 195742, 194702, 195007, 196043, 197173, 197811, 197996, 198559, 200187, 202549, 204727]
55653B04727J666J767K613L495L703L206K530K056J500L39j284k495k745k524
55639B18554k670l369m249n081n789o085n810n408n393n468m900l701k692k271
55625A55668j955j417j141j572k205k179j437o42k20n5%j46m72p50r22j164j484
55608A37907j612j479j457j846k362k464k100j706j551j432j086n71j05K28M19
55593A18783M53M30N47P92Q13L71k80o69o39l70p9Q7n0n38j073j236r17l64J40
55574A16201N20R01J492K317L007L104K691K373K483K701K685K502K133J213j91
55559A46132j219j392j489k362l389l331k273j443j345j422j515k065k699k245
55545A17943o56N23L36l40m58l58o14o78Q9J047J241R72J112J591J838K060K605
$$ y = [204727, 206393, 208160, 210773, 214268, 217971, 221177, 223707, 225763, 227263, 227602, 226318, 223823, 221078, 218554, 215884, 212515, 208266, 203185, 197396, 191311, 185501, 180093, 174700, 169232, 164332, 160631, 157939, 155668, 153713, 152296, 151155, 149583, 147378, 145199, 143762, 143120, 142900, 142845, 142845, 142699, 142227, 141477, 140555, 139391, 137907, 136295, 134816, 133359, 131513, 129151, 126687, 124587, 122881, 121330, 119898, 118812, 118241, 118136, 118364, 118783, 119236, 119666, 120213, 121005, 121818, 122189, 121909, 121240, 120601, 120231, 120152, 120239, 120189, 119651, 118578, 117342, 116425, 116061, 116201, 116721, 117622, 119114, 121431, 124438, 127542, 130233, 132606, 135089, 137790, 140475, 142977, 145110, 146323, 146132, 144913, 143521, 142032, 139670, 136281, 132950, 130677, 129234, 127889, 126467, 124952, 122887, 120188, 117943, 117287, 117810, 118146, 117806, 117348, 116990, 116376, 115698, 115787, 116834, 118075, 119047, 120159, 121750, 123588, 125648, 128253]
55528A28253K762J661O0m50J46L34n02j323j379j282j647k017j900j664j653j415
55512A17984o45l1k93j034j350j132r26r49r03o50m06l52m25m66l12O1L59J86
55494A08716l98r05j123j296j504j356p12o3J50J24J37k4n72j055r17l50L0J39
55476I9021L62O80O57K86J64O23J219J310P28k57j240j750j401l51O38Q77M36
55459A02002n5j82p4p6k31l05j60J1k5j85j48J42L54K67J03J51K55Q8k20j75K63
55438A01800M26k15j217j572q59L40J157J299J064P62L63k42q93j211r88m27Q7
55421I9674L58M78N86O69O35M75K68J03J00M15J027J566J537Q94J76r3o6l50j152
55402A07300j914j934j201m00j37l06k97K49J013J297P51k43r20q61l40Qj94o99
$$ y = [128253, 131015, 132676, 132736, 132286, 132432, 132766, 132264, 130941, 129562, 128280, 126633, 124616, 122716, 121052, 119399, 117984, 117339, 117308, 117015, 115981, 114631, 113499, 112573, 111624, 110721, 110071, 109665, 109313, 108888, 108422, 108110, 108171, 108530, 108716, 108318, 107413, 106290, 104994, 103490, 102134, 101422, 101359, 101509, 101633, 101770, 101746, 101174, 100119, 99202, 98852, 98882, 99021, 99383, 100063, 100720, 101006, 101170, 101793, 103012, 104322, 105050, 104793, 103553, 101803, 100402, 100051, 100689, 101566, 102002, 101947, 101765, 101691, 101615, 101384, 101079, 100919, 100930, 100905, 100720, 100572, 100714, 101068, 101335, 101438, 101589, 101844, 101932, 101712, 101537, 101800, 102226, 102011, 100794, 99222, 98363, 98703, 99860, 101159, 102223, 102985, 103348, 103106, 102213, 101002, 100014, 99587, 99674, 100032, 100510, 101096, 101765, 102400, 102875, 103143, 103246, 103346, 103761, 104788, 106354, 107891, 108785, 108961, 108868, 108802, 108452, 107300, 105386, 103452, 102251, 101851, 101714, 101408, 101111, 101360, 102373, 103670, 104421, 104178, 103258, 102397, 102057, 102065, 101871, 101172]
55384A01172q92m05M68J037R04K73l96q27q99n33O8K70l92j455j818j004K24P55
55366I6550L78j31m9N31J036J221J325J472J216J52j183j605p54L10M73J2o6K82
55348A01170J76n17p87p7O90M30n97j319j306q68k20O07J216J141N76J64O3j67
55330A00375p21j199j173o96j88j35p37j529j572m89R06J549J399J128R33N46
55314I8397K52P65J872K339J610O37L87M16k04j219j484o72K78N40L98N71J140
55297A06023J500J164K90n28q47p44o06o01m90m6N16P82P06P21J132J661J694
55280A12327R86o5q43j063q94o77p22j174j843k176j782r73m39l54k53J10L64
55263A00529K78K39N40P51M94K83P57J443J346N67J91N93R81R25J093J829K144
$$ y = [101172, 100280, 99875, 100343, 101380, 102284, 102557, 102161, 101334, 100435, 99902, 99970, 100240, 99848, 98393, 96575, 95571, 95795, 96550, 96928, 96797, 96748, 97279, 98315, 99536, 100861, 102333, 103549, 103701, 102518, 100913, 100159, 100469, 100942, 100954, 100888, 101170, 101346, 100829, 100042, 99965, 100655, 101085, 100488, 99169, 97863, 96995, 96775, 97382, 98598, 99739, 100315, 100479, 100542, 100375, 99654, 98455, 97282, 96586, 96398, 96263, 95526, 93997, 92425, 91936, 92842, 94391, 95790, 96918, 97851, 98397, 98649, 99414, 101286, 103625, 105235, 105872, 106259, 106675, 106471, 105252, 103768, 103096, 103374, 103914, 104312, 104883, 106023, 107523, 108687, 108977, 108449, 107602, 106858, 106252, 105651, 105161, 105115, 105631, 106413, 107119, 107840, 108972, 110633, 112327, 113313, 113248, 112405, 111342, 110448, 109771, 109049, 107875, 106032, 103856, 102074, 101101, 100662, 100308, 100055, 100165, 100529, 100807, 101046, 101586, 102337, 102831, 103114, 103871, 105314, 106660, 107227, 107418, 108011, 108992, 109917, 111010, 112839, 114983]
55246A14983R97j006k236j963q63J36O95Q49O66L09kk07l84n39o60p72p51l52
55228A08900K88N21l0q34j089p60m22k87l7L85M81l7p71j132r66m43K72R19J069
55209A06027N65r3j89L91J093J473J661J945K139J728O02o94j480j584j299r73
55193A11312p53o19m34n8L97N44J79l90o90p14p85r08o85NO67P49K74k59m60l05
55173A07067k4J55J80J94K84L06J62R5L76P45O72K20K03J153K509L177K691J575
55155A21740O70L12J33l81j154j485r54j15J30l52r79j447j937k265j764l80Q71
55138A10643J064M45j21k94k59q8K56N74O49O12O81P47O70O57R08J113Q13P9n82
55119A18567p87n06N3M50L15m7J32R00J195K69j097j594j083m32m3L77P92P22
$$ y = [114983, 115980, 114974, 112738, 110775, 109912, 110048, 110743, 111592, 112258, 112567, 112565, 112358, 111974, 111435, 110775, 110003, 109252, 108900, 109188, 109709, 109679, 108845, 107756, 106996, 106574, 106287, 106250, 106635, 107116, 107079, 106308, 105176, 104210, 103767, 104039, 104958, 106027, 106592, 106499, 106310, 106701, 107794, 109267, 110928, 112873, 115012, 116740, 117342, 116648, 115168, 113584, 112285, 111312, 110559, 109940, 109506, 109448, 109845, 110389, 110568, 110178, 109488, 108774, 107989, 107081, 106396, 106401, 107068, 107817, 108091, 107832, 107372, 107067, 107043, 107198, 107378, 107572, 107856, 108162, 108324, 108419, 108795, 109540, 110212, 110432, 110635, 111788, 114297, 117474, 120165, 121740, 122410, 122722, 122855, 122474, 121320, 119835, 118881, 118766, 118896, 118544, 117565, 116118, 114181, 111916, 110152, 109772, 110643, 111707, 112152, 112031, 111737, 111478, 111390, 111646, 112220, 112869, 113481, 114162, 114909, 115579, 116236, 117144, 118257, 119070, 119149, 118567, 117780, 117274, 117327, 117777, 118092, 118045, 118177, 119077, 120272, 120541, 119444, 117850, 116767, 116335, 116292, 116669, 117461, 118183]
55101A18183K09j11L7K92N27J066J789J960J249K98j68j40O1L94Q50J169J187
55084A28852J076R24N08j66n82l75O9J01l53q06q78o08k25J14L49M52L48Nm12
55065A28393n51k64K35P57J332J782J527M01p59j081r14j168j672j334J9J135
55049A27838J058K47m46r55j456j643j291q69p64n72N5M88k5j045j458r78k39
55032A17945L83J026J550J446P31J16R5L97M91J88l90r25j015n74j73l92q97p75
55014A19227J23Q28N60k01m52k1L85K97Q6L04Q18J007O63L52O50J310J561J186
54996A28683P44P02Q18O95M17K49J07j50k13K99J090J427J049L95j10m57p46r21
54978A34078q89n83J10J118J910J911J196L82j29l74l28J58Q18R81M12k56l03
$$ y = [118183, 118392, 118281, 118318, 118610, 119137, 120203, 121992, 123952, 125201, 125499, 125331, 125191, 125252, 125646, 126496, 127665, 128852, 129928, 130852, 131360, 131194, 130612, 130237, 130306, 130407, 130054, 129248, 128370, 127762, 127537, 127651, 128000, 128452, 128800, 128805, 128393, 127842, 127578, 127813, 128570, 129902, 131684, 133211, 133612, 132853, 131772, 130858, 129690, 128018, 126684, 126703, 127838, 128896, 129143, 128697, 127742, 126286, 124643, 123352, 122483, 121719, 121147, 121202, 121690, 121665, 120620, 119162, 118184, 117945, 118328, 119354, 120904, 122350, 123081, 123197, 123292, 123689, 124180, 124368, 123978, 123053, 122038, 121464, 121291, 120899, 120002, 119227, 119350, 120178, 120738, 120537, 120085, 120064, 120449, 120746, 120832, 121136, 121954, 122961, 123624, 123976, 124626, 125936, 127497, 128683, 129427, 130129, 130947, 131642, 132059, 132308, 132415, 132265, 132052, 132351, 133441, 134868, 135917, 136312, 136202, 135745, 134999, 134078, 133189, 132606, 132716, 133834, 135744, 137655, 138851, 139233, 139104, 138730, 138402, 138560, 139378, 140359, 140771, 140515, 140212]
54961A40212K20O98P04L24j06k51J0M81Q07Q18N39n2q82j411r35M45J629J682
54943A44932Q94K93L69O60M96l03j374k109j997j003K71J014R03L63J28N77J389
54926A45503J867J684J313J567K693M135N254N948O482P003P468P773P713P019
54912B13422N707M157K602Q68j116k881l983m760n885p223p828p178n937n129
54898A74836n030n011m289k648p33L43k6j153j667j055j65R0p6J33P62J158J082
54881A56551J060J510K267L101M059N008N459N306N214N779O675P137O939O266
54867B22331M938K621k58k651m151n356o721p757p909p495p159o845o088n003
54853A62497m141l536k734j764j258j407j604j436j294j559j805j444o65j03J30
$$ y = [140212, 140432, 141130, 141834, 142158, 142052, 141801, 141811, 142292, 143099, 143917, 144456, 144404, 143522, 142111, 141176, 141621, 143250, 144932, 145826, 146119, 146488, 147148, 147644, 147341, 145967, 143858, 141861, 140858, 141129, 142143, 143046, 143409, 143537, 144114, 145503, 147370, 149054, 150367, 151934, 154627, 158762, 164016, 169964, 176446, 183449, 190917, 198690, 206403, 213422, 219129, 223286, 225888, 226756, 225640, 222759, 218776, 214016, 208131, 200908, 193080, 185902, 179965, 174836, 169806, 164795, 160506, 157858, 157125, 157468, 157442, 156289, 154622, 153567, 153402, 153492, 153416, 153549, 154311, 155469, 156551, 157611, 159121, 161388, 164489, 168548, 173556, 179015, 184321, 189535, 195314, 201989, 209126, 216065, 222331, 227269, 229890, 229632, 226981, 222830, 217474, 210753, 202996, 195087, 187592, 180433, 173588, 167500, 162497, 158356, 154820, 152086, 150322, 149064, 147657, 146053, 144617, 143323, 141764, 139959, 138515, 137850, 137747, 137877]
54838A37877L82O33M94Pk67p8J25r0n13o89n73m69n46o91p05m40J65R27J443J443
54818A38435J077P20N29L42k5m83o93l99K64Q22R38P47N91M64P2n88j013p61K3
54799A41062Q42J403J699J678J208L03p23j433j480q39R4P10O87K52j32k15m5
54782A45071K32M70N58N28N36O30O75O93R97J766K650L119L074K851K724K806
54766A69380L268M273N622O827P571P855P694P054O087N135M283L192J462r39
54752B38764l619n884p090p145o702o497o548o348n718m993m390l745l006k428
54738A64651k132j932j768j773j692r41M06J365J258O72O46J385K274K867L103
54723A68389K980K647K676L537M903O003O541O703O476N589M145K610J184l46
$$ y = [137877, 138259, 138892, 139386, 139393, 139126, 139048, 139173, 139083, 138570, 137881, 137308, 136839, 136293, 135602, 134897, 134457, 134622, 135549, 136992, 138435, 139512, 140232, 140761, 141103, 141078, 140595, 139902, 139503, 139767, 140589, 141527, 142274, 142865, 143329, 143401, 142813, 141800, 141039, 141062, 141904, 143307, 145006, 146684, 147892, 148195, 147472, 146039, 144559, 143720, 143814, 144524, 145211, 145463, 145331, 145116, 145071, 145303, 145773, 146331, 146859, 147395, 148025, 148700, 149393, 150390, 152156, 154806, 157925, 160999, 163850, 166574, 169380, 172648, 176921, 182543, 189370, 196941, 204796, 212490, 219544, 225631, 230766, 235049, 238241, 239703, 238764, 235145, 229261, 222171, 215026, 208324, 201827, 195279, 188931, 183213, 178220, 173830, 170085, 167079, 164651, 162519, 160587, 158819, 157046, 155354, 154413, 154819, 156184, 157442, 158114, 158760, 160145, 162419, 165286, 168389, 171369, 174016, 176692, 180229, 185132, 191135, 197676, 204379, 210855, 216444, 220589, 223199, 224383, 224037]
54709B24037k059l703n044n955o172n515m397l600l453l596l532l085k381j765
54695A69780j675k038k053j163j01j34j293k203j864q34k55m49q78j023q43o85
54679A52289r02j349j306m15N29M56l73o72n3N04M09L59Q06Q52k29j383j065M67
54661A48924J491J149J86m86p61p94n38j20P1q7l72o65r59r60l46O32J402J837
54643A49604K129K001R95m40j119o61l5k08r35j338j007j39R14J668J538M20r67
54626A52420j633j179K6J151J374N03n78n99O49J915J910P41n02j130j334j420
54610A52314j279o79K53J037J205P07K2k50JK77J46k37l96j63J86K75m3o12j048
54591A51716j018n80j24J14L17O55Q78O22o3p24j010q85m68L6K78nn46o90j97
$$ y = [224037, 221978, 218275, 213231, 207276, 201104, 195589, 191192, 187592, 184139, 180543, 177011, 173926, 171545, 169780, 168105, 166067, 164014, 162851, 162750, 162616, 161323, 159120, 157256, 156422, 156167, 155718, 154840, 153817, 152974, 152289, 151387, 150038, 148732, 148317, 148846, 149302, 148929, 148257, 148204, 148708, 149117, 149476, 150282, 151134, 150905, 149522, 148457, 148924, 150415, 151564, 151750, 151264, 150503, 149709, 149171, 149051, 149122, 149035, 148663, 147998, 147039, 146079, 145733, 146365, 147767, 149604, 151733, 153734, 154729, 154289, 153170, 152509, 152474, 152266, 151331, 149993, 148986, 148847, 149761, 151429, 152967, 153387, 152420, 150787, 149608, 149634, 150785, 152159, 152662, 152084, 151485, 152134, 154049, 155959, 156700, 156198, 155068, 153734, 152314, 151035, 150356, 150609, 151646, 152851, 153558, 153580, 153330, 153331, 153608, 153754, 153517, 153121, 152958, 153144, 153419, 153376, 152764, 151716, 150698, 150118, 149994, 150108, 150425, 151080, 151958, 152580, 152517, 151793, 150783, 149898, 149430, 149466, 149744, 149739, 149193, 148503, 148306]
54572A48306L05Q5n94o20N04J837K119J440J059J517J807Q85o68j357q07j23k15
54555A55480o64o05L3O48R06R67R33O47J9p00j116j033o46l44k07J17Q75J615
54537A56925J570O38l94p84n60j78J64N55J007J355J487J440J390J509J681J423
54521A69228M25q69j618j584j256r87o31k02r5l36l23J28K67l74r52m42O73J016
54503A62068L47k28k1M16M77L89L44j66j324k068j237P08K047J902J069O75P39
54486A66137N54p7o37p49o14n31m44k63j96l34j99O95J831K023R89p1N9J109J900
54467A71182J964J799J720J440Q40L18P3l03j083j810j885j331o50j78J9j1o7
54450A72037J25M41L42l52j002r75n52m42o46n00J97P88O93J07m47p96j005r09
$$ y = [148306, 148611, 148696, 148102, 147482, 147986, 149823, 151942, 153382, 154441, 155958, 157765, 158650, 157982, 156625, 155818, 155695, 155480, 154816, 154211, 154244, 154892, 155798, 156765, 157698, 158345, 158364, 157664, 156548, 155515, 154869, 154525, 154318, 154435, 155310, 156925, 158495, 159133, 158739, 157955, 157395, 157217, 157381, 157936, 158943, 160298, 161785, 163225, 164615, 166124, 167805, 169228, 169653, 168784, 167166, 165582, 164326, 163339, 162708, 162506, 162411, 162075, 161752, 161880, 162147, 161773, 160821, 160379, 161052, 162068, 162415, 162187, 162166, 162582, 163059, 163448, 163792, 163626, 162302, 160234, 158997, 159705, 161752, 163654, 164723, 165398, 166137, 166691, 166614, 165977, 165228, 164614, 164083, 163639, 163376, 163180, 162846, 162647, 163342, 165173, 167196, 168185, 168114, 168173, 169282, 171182, 173146, 174945, 176665, 178105, 178945, 179263, 179336, 179033, 177950, 176140, 174255, 172924, 172274, 172096, 172115, 172104, 172037, 172162, 172603, 172945, 172593, 171591, 170616, 170064, 169622, 168976, 168476, 168673, 169461, 170154, 170261, 169814, 169018, 168013, 167104]
54432A67104k74P06J383J229L28o74j088p73k52j60n72j033j152r38n26Q2Q02
54415A64192J306J353J103R02Q55Q43Q15Q08P86O86N79N34M10O1k54p7O13J234
54397A76749J239P15J81qJ53N06Q41Q80M77j00l03J06P25Q96L83m21r59j050q94
54378A80116p10n38l66k51k14k26l13n34o95l75N17J429J695J276O50J34k53l50
54360A80992P4P54J054Q33O06N93K25p87j588j159K07J220J225O45m6q47j519
54343A82482j341j43J106J383Q17K85J44N0k02l41j39K38N40O89O99N78M35L92
54325A87672M15L91L47L73L66J74j4K48J039J854K192K095K001K235K879L881
54309B08148M961N531N161M143L301L075L048K544J481L59m41j113k108l559n032
$$ y = [167104, 166830, 167536, 168919, 170148, 170476, 169802, 168714, 167941, 167689, 167529, 166957, 165924, 164772, 163834, 163308, 163390, 164192, 165498, 166851, 167954, 168856, 169711, 170554, 171369, 172177, 172963, 173649, 174228, 174762, 175172, 175233, 174979, 174902, 175515, 176749, 177988, 178703, 178884, 178876, 179029, 179535, 180376, 181256, 181733, 181633, 181330, 181436, 182161, 183057, 183440, 183019, 182060, 181010, 180116, 179406, 178868, 178502, 178251, 178037, 177811, 177498, 176964, 176269, 175894, 176411, 177840, 179535, 180811, 181461, 181595, 181342, 180992, 181066, 181820, 182874, 183707, 184313, 184906, 185131, 184344, 182756, 181597, 181804, 183024, 184249, 184894, 184848, 184001, 182482, 181141, 180998, 182104, 183487, 184304, 184589, 184733, 184783, 184581, 184240, 184101, 184339, 184879, 185568, 186267, 186845, 187280, 187672, 188087, 188478, 188825, 189198, 189564, 189738, 189724, 189972, 191011, 192865, 195057, 197152, 199153, 201388, 204267, 208148, 213109, 218640, 223801, 227944, 231245, 234320, 237368, 239912, 241393, 241752, 241311, 240198, 238090, 234531, 229499]
54294B29499n780n334m031k890k674l139l433l152k661k294j838j065l21n3p7
54279A90757J45N98O83J28n77q25n75k22j13l31o75p57l10L98P25L66l22p75p43
54260A87575k29O28J411J495O98l29p41m26L2K64N37J137J720J644Q47P9O4O50
54242A97056J037P79K03k78q18j690k486k373j228j2K85l07r45r28l37K11K03
54225A88372k41m48K8P40Q71L14j68l5L47L77Q0j70l20n59p87o86k68L6j42p88
54205A86553j490j603o97Q13J764J391K49m95m73l24n53q25n76J80Q81J073P86
54188A86654M18L43N87Q40Q14N20J41j79k72LM46M82j70r62j112n49Q5K72J8m58
54168A87921r08j010o43k31k04k16M49J550J845Q03l78k14J054J786J060l18j067
$$ y = [229499, 223719, 218385, 214354, 211464, 208790, 205651, 202218, 199066, 196405, 194111, 192273, 191208, 190887, 190834, 190757, 190902, 191500, 192183, 192311, 191734, 190909, 190334, 190112, 189999, 189668, 188993, 188236, 187926, 188324, 189049, 189415, 189093, 188318, 187575, 187346, 187974, 189385, 190880, 191578, 191249, 190508, 190082, 190114, 190378, 190915, 192052, 193772, 195416, 196263, 196342, 196406, 197056, 198093, 198872, 199075, 198797, 197979, 196289, 193803, 191430, 190202, 190190, 190475, 190168, 189223, 188295, 187958, 188169, 188372, 188131, 187683, 187711, 188451, 189322, 189636, 189468, 189433, 189780, 190157, 190237, 190067, 189747, 189188, 188401, 187715, 187447, 187483, 187341, 186553, 185063, 183460, 182763, 183576, 185340, 186731, 186980, 186485, 186012, 185688, 185135, 184310, 183734, 183914, 184795, 185868, 186654, 187072, 187415, 188002, 188842, 189656, 190176, 190317, 190138, 189866, 189869, 190315, 190797, 190627, 189665, 188553, 188004, 188089, 188361, 188379, 187921, 187013, 186003, 185360, 185129, 184925, 184709, 185158, 186708, 188553, 189356, 188978, 188764, 189818, 191604, 192664, 192346, 191279]
54151A91279r10m22J6N32J216J795J948J587Q03k46j245j782j734j430j275j325
54135A88807j346j127n60L81J394J795J201K32q0L66O08P5n18k51N55P24j13r86
54117A91157q43K42J284J493R90N27O53J165J439J246R28P54N06%m54n46n12p12
54099A99317r31p22k51j09m24p11o48l27J87Q87J350R28k88j317j386p46r0L43
54081A95062P91J357J849K010J707R94J35n52r34j007p32j45M50P78R70J259J392
54064B05384R60K10j11K09N97O96Q47J248J356O93k89p35m69k1K20L55O34J106
54046B12890J600J855J861K096L030M249M598L663K566K656L865M975N319N385
54032B60608N790O359O497O007N182M388L748L199K670K205J891J676J402J092
$$ y = [191279, 190369, 189947, 189963, 190495, 191711, 193506, 195454, 197041, 197844, 197598, 196353, 194571, 192837, 191407, 190132, 188807, 187461, 186334, 185774, 186155, 187549, 189344, 190545, 190777, 190697, 191063, 191671, 191746, 191228, 190977, 191532, 192256, 192143, 191157, 190314, 190556, 191840, 193333, 194323, 194850, 195503, 196668, 198107, 199353, 200281, 201035, 201541, 201541, 201087, 200541, 200029, 199317, 198386, 197664, 197413, 197304, 196880, 196169, 195521, 195194, 195381, 196268, 197618, 198546, 198258, 196941, 195555, 194809, 194719, 195062, 195853, 197210, 199059, 201069, 202776, 203770, 203905, 203353, 202419, 201412, 200680, 200535, 200985, 201763, 202733, 203992, 205384, 206344, 206554, 206443, 206652, 207249, 207945, 208792, 210040, 211396, 212089, 211800, 211065, 210596, 210575, 210795, 211150, 211784, 212890, 214490, 216345, 218206, 220302, 223332, 227581, 232179, 235842, 238408, 241064, 244929, 249904, 255223, 260608, 266398, 272757, 279254, 285261, 290443, 294831, 298579, 301778, 304448, 306653, 308544, 310220, 311622, 312714]
54018C12714R80J092J035M63m20j156j672k282l102l777l968l777l551l393l138
54003B86048k790k698l108l669l752l263k718k398j871q51K3o6q81j412j240p51
53987B54603j09R61K173K673K439K698M178N942O796P089Q004R754J1634J3455
53973C32290J5583J7637J8414J7278J4554J0364M189l789j1816j7745k0714k1169
53961C55076j9843j7324j4294j1448r054o974n142l783l064k738k292j490p20
53948B56910o26j270j825j345K05J970L121L507L449L293L261L452L768L983M023
53933B85876M087M372M759M861M397L521K741K476K668K918K935K715K375K049
53919C32750J945K197K622K946L275L983N044O007O658P143P258O454M909L805
$$ y = [312714, 313694, 314786, 315821, 316284, 315864, 314708, 313036, 310754, 307652, 303875, 299907, 296130, 292579, 289186, 286048, 283258, 280560, 277452, 273783, 270031, 266768, 264050, 261652, 259781, 258930, 258953, 258887, 258006, 256594, 255354, 254603, 254494, 255455, 257628, 260301, 262740, 265438, 269616, 275558, 282354, 289443, 297447, 307201, 318835, 332290, 347873, 365510, 383924, 401202, 415756, 426120, 430309, 426520, 414704, 396959, 376245, 355076, 335233, 317909, 303615, 292167, 283113, 276139, 270997, 267214, 264150, 261412, 259120, 257630, 256910, 256284, 255014, 253189, 251844, 252049, 254019, 257140, 260647, 264096, 267389, 270650, 274102, 277870, 281853, 285876, 289963, 294335, 299094, 303955, 308352, 311873, 314614, 317090, 319758, 322676, 325611, 328326, 330701, 332750, 334695, 336892, 339514, 342460, 345735, 349718, 354762, 360769, 367427, 374570, 381828, 388282, 393191, 396996]
53905C96996L798L904K813P75p80j193j091j180j538k124l012l890m221m065m095
53890C81097m557m993n116n236n525n611n256m820m791n213n793o137n791m645
53876C07613l341k651k437k038j626k079l300l917l221k280k262k717k558j881
53862B71305j561j683j644j483j769k297k173j299o60r11j621k192k519k430j458
53847B45605K33J509J573J012Q17Q96L86q02j711j711j358j536k188k377j439
53832B38909K76J798K457K348K022J823J594R85K9o87n73K93J180J485J340J284
53816B56563J496J683J725K016K955M305N404N903O108O585P696R514J2002J5082
53802C39037J8489K1761K4486K6704K8810L0812L1675K9684K3634J3715J409j1056
$$ y = [396996, 400794, 404698, 407511, 408286, 407506, 406313, 405222, 404042, 402504, 400380, 397368, 393478, 389257, 385192, 381097, 376540, 371547, 366431, 361195, 355670, 350059, 344803, 339983, 335192, 329979, 324186, 318049, 312258, 307613, 304272, 301621, 299184, 297146, 295520, 293441, 290141, 286224, 283003, 280723, 278461, 275744, 273186, 271305, 269744, 268061, 266417, 264934, 263165, 260868, 258695, 257396, 256736, 255825, 254204, 252012, 249493, 247063, 245605, 245838, 247347, 248920, 249932, 250749, 251645, 252031, 251229, 249518, 247807, 246449, 244913, 242725, 240348, 238909, 239185, 240983, 243440, 245788, 247810, 249633, 251227, 252212, 252241, 251554, 250981, 251274, 252454, 253939, 255279, 256563, 258059, 259742, 261467, 263483, 266438, 270743, 276147, 282050, 288158, 294743, 302439, 311953, 323955, 339037, 357526, 379287, 403773, 430477, 459287, 490099, 521774, 551458, 575092, 588807, 590216, 579160]
53790E79160k1224k7122k8252k5922k2284j8903j6217j4039j2139j0415q932p939
53778C65772p618p662p386o385m958l778l267l394l885m401m667m608m395m170
53764B95198l755k851j531l04M23O90P32O20M41N30J191K281L442M626N916O971
53748C14620P275O970O687O309M770J675j682l747m633n579o855p490p045o386
53734C04889o270o225n528m462l794l511k914j703k72R25J745K189K336K419K619
53719B82443K804K791K667K556K277J650R87P56Q39N99k32j108j322p99n7M45
53703B97296P17J085J732K479L054L468L973M610N026M867M138L067J822O39l0
53688C37943J44Q62J343J070K91l04l46k31o75j802k802k776j831r54p93r91r15
$$ y = [579160, 557936, 530814, 502562, 476640, 454356, 435453, 419236, 405197, 393058, 382643, 373711, 365772, 358154, 350492, 343106, 336721, 331763, 327985, 324718, 321324, 317439, 313038, 308371, 303763, 299368, 295198, 291443, 288592, 287061, 286757, 287180, 287870, 288602, 289222, 289663, 290193, 291384, 293665, 297107, 301733, 307649, 314620, 321895, 328865, 335552, 341861, 346631, 348306, 346624, 342877, 338244, 332665, 325810, 318320, 311275, 304889, 298619, 292394, 286866, 282404, 278610, 275099, 272185, 270482, 270210, 271135, 272880, 275069, 277405, 279824, 282443, 285247, 288038, 290705, 293261, 295538, 297188, 298175, 298931, 299770, 300369, 300137, 299029, 297707, 296908, 296851, 297296, 298013, 299098, 300830, 303309, 306363, 309831, 313804, 318414, 323440, 328307, 332445, 335512, 337334, 337973, 337943, 338087, 338949, 340292, 341362, 341653, 341349, 341003, 340772, 340097, 338295, 335493, 332717, 330886, 329932, 329139, 328148, 327233]
53671C27233n65l91n84r21j128j056o93k80k46p01j199j256r38o67o31p14q27
53654C14436r37r10o15j61K47N64Q36J038J134J153J045P31M08M52Q51J167J304
53637C22743J714K436K635J762O29M27J086J574J496J418J624J696J417J194J319
53622C45170J687K396L703N099N473M671L941M204M777M572L814L547L986M448
53608D01488M612M743M804M384L670L494M041M329L482J973R84Q83J028Q26L71
53593D45112o3n76j343k081k254j793j206r61j026j181j438j892k357k488k219
53578D22234j761j308r71r15j156j335j113p43p99j340j815j904j866j897j736
53563D01575j251q48q54r37o88l55l95n74j96Q46J901K438K515K338J912J329
$$ y = [327233, 326668, 326277, 325693, 324772, 323644, 322588, 321895, 321615, 321369, 320668, 319469, 318213, 317275, 316608, 315977, 315263, 314436, 313499, 312589, 311974, 311813, 312060, 312624, 313460, 314498, 315632, 316785, 317830, 318561, 318969, 319421, 320272, 321439, 322743, 324457, 326893, 329528, 331290, 331919, 332346, 333432, 335006, 336502, 337920, 339544, 341240, 342657, 343851, 345170, 346857, 349253, 352956, 358055, 363528, 368199, 372140, 376344, 381121, 385693, 389507, 393054, 397040, 401488, 406100, 410843, 415647, 420031, 423701, 427195, 431236, 435565, 439047, 441020, 442004, 442887, 443915, 444741, 445112, 445049, 444473, 443130, 441049, 438795, 437002, 435796, 434835, 433809, 432628, 431190, 429298, 426941, 424453, 422234, 420473, 419165, 418194, 417279, 416123, 414788, 413675, 412932, 412133, 410793, 408978, 407074, 405208, 403311, 401575, 400324, 399476, 398622, 397685, 396997, 396642, 396247, 395673, 395477, 396323, 398224, 400662, 403177, 405515, 407427, 408756]
53547D08756R66J067J453J781J984K288K950L957M869N056M482M103M991O944
53533D55647Q562Q974Q947R792J1556J3014J3398J3409J4236J6079J8004J9156
53521F10774J9686K0411K1727K3075K3432K2311K0168J7923J6185J5034J4389
53510H25115J4292J4857J6085J7821J9744K1335K2101K2045K1755K1771K1944
53499A038865K1708K0960K0279K0161K0403K0502K0347K0217K0199K0048J9607
53488A263296J8994J8389J7930J7829J8206J8669J8504J7515J6413J5957J5983
53477A457685J5636J4417J2634J0840R257P805O291M424K005p41l265n381p571
53464A524036j0266j3014j4851j5433j5382j5417j5563j5547j5543j6078j7297
$$ y = [408756, 409722, 410789, 412242, 414023, 416007, 418295, 421245, 425202, 430071, 435127, 439609, 443712, 448703, 455647, 464209, 473183, 482130, 491922, 503478, 516492, 529890, 543299, 557535, 573614, 591618, 610774, 630460, 650871, 672598, 695673, 719105, 741416, 761584, 779507, 795692, 810726, 825115, 839407, 854264, 870349, 888170, 907914, 929249, 951350, 973395, 995150, 1016921, 1038865, 1060573, 1081533, 1101812, 1121973, 1142376, 1162878, 1183225, 1203442, 1223641, 1243689, 1263296, 1282290, 1300679, 1318609, 1336438, 1354644, 1373313, 1391817, 1409332, 1425745, 1441702, 1457685, 1473321, 1487738, 1500372, 1511212, 1520469, 1528274, 1534565, 1538989, 1540994, 1540253, 1536988, 1531607, 1524036, 1513770, 1500756, 1485905, 1470472, 1455090, 1439673, 1424110, 1408563, 1393020, 1376942, 1359645]
53453A359645j8754k0008k1026k1891k2433k2387k1744k0702j9399j7922j6484
53442A136895j5351j4473j3436j1845r713p453n523m133l160k316j387l64O84
53429A048425J756K954M377N996P626R094J0455J1931J3522J4788J5297J5323
53417A161544J5704J6942J8739K0560K2292K4025K5611K6822K7778K8758K9821
53406A418596L1017L2756L5307L8058M0027M1230M2814M5525M8674N1089N2541
53395A877634N3667N4877N5994N6762N7172N7316N7323N7359N7283N6468N4511
53384B496366N1953M9773M8104M6097M3125L9512L5799L1943K7737K3502J9694
53373B913605J6090J1971P041J647l883r515j5097k0343k5473l1280l8056m4815
$$ y = [1359645, 1340891, 1320883, 1299857, 1277966, 1255533, 1233146, 1211402, 1190700, 1171301, 1153379, 1136895, 1121544, 1107071, 1093635, 1081790, 1072077, 1064624, 1059101, 1054968, 1051808, 1049492, 1048105, 1047741, 1048425, 1050181, 1053135, 1057512, 1063508, 1071134, 1080228, 1090683, 1102614, 1116136, 1130924, 1146221, 1161544, 1177248, 1194190, 1212929, 1233489, 1255781, 1279806, 1305417, 1332239, 1360017, 1388775, 1418596, 1449613, 1482369, 1517676, 1555734, 1595761, 1636991, 1679805, 1725330, 1774004, 1825093, 1877634, 1931301, 1986178, 2042172, 2098934, 2156106, 2213422, 2270745, 2328104, 2385387, 2441855, 2496366, 2548319, 2598092, 2646196, 2692293, 2735418, 2774930, 2810729, 2842672, 2870409, 2893911, 2913605, 2929695, 2941666, 2948707, 2950354, 2946471, 2936956, 2921859, 2901516, 2876043, 2844763, 2806707, 2761892]
53361B761892n0098n3419n5441n6901n7897n8267n8028n7232n5833n3934n1897
53350B152945m9934m7890m5693m3756m2571m2078m1813m1454m0948m0221l9147
53339A677440l7774l6176l4199l1677k8923k6511k4525k2440j9876j7103j4703
53328A383533j3113j2632j3296j4467j5022j4466j3594j3504j4149j4370j3320
53317A231600j1318r292p870p105o683o120n020l355j458L72K039L441M448N168
53303A188847N974P071Q296R590J1373J3974J6938J9318K0724K1678K2765K3947
53291A370495K4893K5678K6658K7731K8222K7614K6169K4605K3294K1995K0246
53280A647600J7853J4996J2031R228O573L741L29l648p604j0800j3019j4654j6149
$$ y = [2761892, 2711794, 2658375, 2602934, 2546033, 2488136, 2429869, 2371841, 2314609, 2258776, 2204842, 2152945, 2103011, 2055121, 2009428, 1965672, 1923101, 1881023, 1839210, 1797756, 1756808, 1716587, 1677440, 1639666, 1603490, 1569291, 1537614, 1508691, 1482180, 1457655, 1435215, 1415339, 1398236, 1383533, 1370420, 1357788, 1344492, 1330025, 1315003, 1300537, 1286943, 1273439, 1259290, 1244920, 1231600, 1220282, 1210990, 1203120, 1196015, 1189332, 1183212, 1178192, 1174837, 1173379, 1173751, 1175790, 1179231, 1183679, 1188847, 1194821, 1201892, 1210188, 1219778, 1231151, 1245125, 1262063, 1281381, 1302105, 1323783, 1346548, 1370495, 1395388, 1421066, 1447724, 1475455, 1503677, 1531291, 1557460, 1582065, 1605359, 1627354, 1647600, 1665453, 1680449, 1692480, 1701708, 1708281, 1712022, 1712351, 1708703, 1701099, 1690299, 1677280, 1662626, 1646477]
53267A646477j7554j8800k0150k2029k4370k6481k7701k7996k7799k7554k7550
53256A378493k7921k8511k8913k8930k8844k8881k8705k7854k6581k5672k5406
53245A072275k5267k4835k4363k4142k3846k3043k1936k1095k0613k0090j9333
53234H23712j8492j7541j6164j4316j2416j0810r440q269p659p878q477q626q145
53221F75479p847q658j0635j3011j4970j6105j6289j5556j4302j3128j2255j1340
53209E21383j0138q997q314p906p459p244p613p981p380o015n227n551n972n691
53195D19895n518o432p706p770o572n548n424n315m321k851j887j779k243k900
53181C53629l325l131k474k051k225k528k374j858j448j286j201j160j254j316
$$ y = [1646477, 1628923, 1610123, 1589973, 1567944, 1543574, 1517093, 1489392, 1461396, 1433597, 1406043, 1378493, 1350572, 1322061, 1293148, 1264218, 1235374, 1206493, 1177788, 1149934, 1123353, 1097681, 1072275, 1047008, 1022173, 997810, 973668, 949822, 926779, 904843, 883748, 863135, 843045, 823712, 805220, 787679, 771515, 757199, 744783, 733973, 724533, 716264, 708605, 700727, 692250, 683624, 675479, 667632, 658974, 648339, 635328, 620358, 604253, 587964, 572408, 558106, 544978, 532723, 521383, 511245, 502248, 493934, 486028, 478569, 471325, 463712, 455731, 448351, 442336, 437109, 431558, 425586, 419895, 414377, 407945, 400239, 392469, 385897, 380349, 374925, 369610, 365289, 362438, 360551, 358772, 356529, 353629, 350304, 347173, 344699, 342648, 340423, 337895, 335521, 333663, 332215, 330929, 329728, 328568, 327314, 325998]
53167C25998r75r0R81J617J476Q62M69N86P64N20J17J75O76R88P92L87M6k89n32
53148C34568l65J14K83j22n94o26m07l56m87o76j051j669k115j921j136j97N13
53131C23756O80Q4j031j852j806j178p22p53r89j041p84m24k77l66k38M47J191
53114C14697J109J93n79o28m60o61r61r05o74n75l48J55K80n80j774k090j458
53097C04741j021j511k364k593j866o73J34o7j042j707j227MQ81R16N42K88J91
53080B93626J3m52j166j605j046L91J434J098M6l15J81M79L4n37o85o72p54o49
53062B89421k45J4o4NM97Q64O44L07N30J143J478J447J492J698J682J330J009
53045C03252R31Q47N47L26N73J146J475J266Q27N57L52j18p32r60o93n11q15j225
$$ y = [325998, 325023, 324933, 325914, 327531, 329007, 329869, 330338, 330924, 331688, 332208, 332325, 332500, 333176, 334164, 334956, 335343, 335389, 335100, 334568, 334203, 334317, 334600, 334478, 333884, 333258, 332851, 332495, 332008, 331332, 330281, 328612, 326497, 324576, 323440, 323243, 323756, 324436, 324520, 323489, 321637, 319831, 318653, 317931, 317178, 316189, 315148, 314364, 313940, 313663, 313297, 313059, 313506, 314697, 315806, 315999, 315420, 314792, 314332, 313671, 312710, 311805, 311131, 310556, 310208, 310363, 310643, 310063, 308289, 306199, 304741, 303720, 302209, 299845, 297252, 295386, 294713, 294847, 294780, 293738, 292031, 290804, 290808, 291689, 292605, 293147, 293435, 293626, 293639, 293187, 292021, 290416, 289370, 289761, 291195, 292293, 292339, 292024, 292205, 292684, 292718, 292181, 291496, 290824, 290070, 289421, 289176, 289190, 289126, 289131, 289628, 290492, 291136, 291443, 291973, 293116, 294594, 296041, 297533, 299231, 300913, 302243, 303252, 304183, 305030, 305577, 305903, 306476, 307622, 309097, 310363, 311190, 311747, 312099, 311981, 311249, 310289, 309596, 309085, 308270, 307045]
53027C07045j250j115j307j592j268l02M83M48k60j119j725j699q24N17J506J694
53011B99232J331P79J53l84n11k25J8p3k14p4J61J27j60l81l99l84n01o76o00
52992B97219j9Q37J247P41j82m66K54J202J414P99R6j6M83J118J497J672J760
52975C09656J469M20q56j035L74K024K239J170M35Q37J537J626J313J158J073
52960C23440P63M79O49J132J396J110L38o26j319j407j153j193j737k350k652
52945C16870k632k249j346k29L33L1n79r05r67r75q56n87m56n92p66q64j016j090
52927C01125o87K5L00o4l59j90j78p89j378j169m92j84l49n39o02m91J41J282
52909B95402J957J339O3n60l32r8k02j89M9m7o09r64o87k40j58k42K6O88J258
$$ y = [307045, 305795, 304680, 303373, 301781, 300513, 300211, 300694, 301142, 300882, 299763, 298038, 296339, 295515, 296032, 297538, 299232, 300563, 301342, 301495, 301111, 300600, 300375, 300393, 300320, 300106, 300032, 300193, 300320, 300160, 299779, 299380, 298996, 298495, 297819, 297219, 297200, 298037, 299284, 300025, 299843, 299377, 299631, 300833, 302247, 303046, 303142, 303126, 303609, 304727, 306224, 307896, 309656, 311125, 311545, 310689, 309654, 310028, 312052, 314291, 315461, 315896, 316733, 318270, 319896, 321209, 322367, 323440, 324203, 324682, 325331, 326463, 327859, 328969, 329307, 328681, 327362, 325955, 324802, 323609, 321872, 319522, 316870, 314238, 311989, 310643, 310414, 310747, 310778, 310199, 309294, 308327, 307352, 306496, 305909, 305453, 304861, 304095, 303231, 302215, 301125, 300438, 300463, 300763, 300699, 300340, 300150, 299972, 299183, 297805, 296636, 296144, 295960, 295611, 295072, 294470, 293979, 294120, 295402, 297359, 298698, 298761, 298201, 297869, 297771, 297569, 297380, 297429, 297382, 296773, 295809, 295122, 294882, 294724, 294482, 294508, 295196, 296454]
52890B96454J246N76l04p13l57L91R68J131Q40M8r79j543j265o69m01k32M39J349
52872B96979J502N40p08j245r19l43k05o57j089o35P99K253K783K458J910J407
52856C04830J005J077J803K512K406J705J152P64l6j202k146k904m012n150n206
52841B96598l963k585k006j872j561j269j401j699j663j237o09J34O94N29l65
52826B77725j193j340j066q29n23Q4O56O82J89l82p23p09k65M69J150J657K128
52809B77710K381J949R84M74J061K176K913L155L260L082K082K04k017l960n132
52794B90322n172m233l111k471k136j625j038q28q96o72k0N55O45L54m0l49l74
52777B68911nM78O32M93N67J105J734J970J718J112K26p71j360j020J65J479K218
$$ y = [296454, 297700, 298276, 297972, 297259, 296902, 297293, 298261, 299392, 300232, 300280, 299301, 297758, 296493, 295824, 295423, 295191, 295630, 296979, 298481, 299021, 298313, 297068, 296149, 295806, 295601, 294944, 293855, 293220, 294019, 296272, 299055, 301513, 303423, 304830, 305835, 306912, 308715, 311227, 313633, 315338, 316490, 317254, 317218, 316016, 313870, 310966, 306954, 301804, 296598, 292635, 290050, 288044, 286172, 284611, 283342, 281941, 280242, 278579, 277342, 276733, 276867, 277561, 278090, 277725, 276532, 275192, 274126, 273297, 272774, 272858, 273514, 274196, 274385, 274003, 273280, 272571, 272306, 272775, 273925, 275582, 277710, 280091, 282040, 283024, 283498, 284559, 286735, 289648, 292803, 296063, 299145, 301227, 301431, 299414, 295454, 290322, 285150, 280917, 277806, 275335, 273199, 271574, 270536, 269708, 268812, 268140, 268120, 268675, 269320, 269674, 269634, 269285, 268911, 268906, 269384, 270016, 270509, 271076, 272181, 273915, 275885, 277603, 278715, 278941, 278170, 276810, 275790, 275955, 277434, 279652]
52760B79652K219J737J008J88m43n54j89J82J78p9k88l74l34l2M94P31K58n31
52742B83823q50n66k99m18n27q9R08J986K514K020O96m82o53r6K35P7k0J04q6
52723B88277o43p96k37K67J38k7M35J059J039N80M09M71J56m83p91n96l42k41
52705B88675j32n8k08l63j94k5m59j268j508p78L36J132J397J132N18J70O50J488
52687B90505J580O92j58j67L04O06Q22J273J689J646J354J289J335R83L09O9O89
52670C04820J692K229J953J196N37K58J97km48q30p04O3J118J762J417J09j468
52653C13899k484k627k143j344l77O29J431J773J453M14j000k018k028j254m92
52638C03832j77q0Q2K20K10J65J81J54J70O05J554K447K721K666L090M164N058
$$ y = [279652, 281871, 283608, 284616, 284804, 284361, 283807, 283618, 283800, 283978, 283899, 283611, 283237, 282903, 282871, 283365, 284096, 284354, 283823, 282973, 282407, 282108, 281690, 281163, 281074, 281982, 283968, 286482, 288502, 289198, 288716, 288063, 287967, 288202, 288279, 288259, 288363, 288277, 287634, 286838, 286601, 286868, 287006, 286979, 287414, 288473, 289512, 290092, 290501, 290972, 291128, 290645, 289854, 289258, 288916, 288675, 288543, 288485, 288277, 287914, 287720, 287695, 287236, 285968, 284460, 283682, 284018, 285150, 286547, 287679, 288197, 288367, 289017, 290505, 292085, 292777, 292619, 292452, 292756, 293362, 294184, 295457, 297146, 298792, 300146, 301435, 302770, 303753, 304062, 304131, 304820, 306512, 308741, 310694, 311890, 312427, 312685, 312882, 312880, 312432, 311602, 310898, 310961, 312079, 313841, 315258, 315367, 313899, 311415, 308788, 306645, 305301, 304924, 305553, 306984, 308757, 310210, 310624, 309624, 307606, 305578, 304324, 303832, 303655, 303575, 303657, 303877, 304087, 304252, 304433, 304587, 304757, 305362, 306916, 309363, 312084, 314750, 317840, 322004, 327062]
52621C27062M754L016M78j894l392l860l612l060k406j732j206r56q10m48J01
52606C12035M05K25p1J6M11N91L40N0J41N56J047J626K371L008L089K643K196
52589C30679K112K213K174J951J672J408J260J336J454J207N59O0O3O4o79k005
52573C45528k909k736j888j181r40r46r54r05p60m59j18j49r19k201l124k898
52557C22441j644l24K17k1m93p91q76q27o72m04J7N44Q93P41K43N0N05J110J160
52538C21869O97M29P70J377J634J297N58k58r26j405j691j637j091k54M18P38
52522C22525Q74Q18L25l95n13K80J123J161Q97J482K969M253M706M778M908M819
52506C55010M219L401K670J860Q32j14p43j336k287l595m922n735n365l652j623
$$ y = [327062, 331816, 334832, 335310, 333416, 330024, 326164, 322552, 319492, 317086, 315354, 314148, 313192, 312382, 311934, 312035, 312440, 312665, 312594, 312610, 313021, 313612, 313952, 314002, 314143, 314699, 315746, 317372, 319743, 322751, 325840, 328483, 330679, 332791, 335004, 337178, 339129, 340801, 342209, 343469, 344805, 346259, 347466, 348025, 348085, 348148, 348212, 347533, 345528, 342619, 339883, 337995, 336814, 335874, 334928, 333974, 333069, 332309, 331850, 331732, 331583, 330664, 328463, 325339, 322441, 320797, 320473, 320690, 320669, 320176, 319385, 318509, 317682, 317010, 316606, 316623, 317167, 318060, 318801, 319044, 319094, 319599, 320709, 321869, 322566, 322995, 323765, 325142, 326776, 328073, 328631, 328373, 327447, 326042, 324351, 322714, 321623, 321369, 321787, 322525, 323399, 324217, 324542, 324147, 323634, 323914, 325037, 326198, 327095, 328577, 331546, 335799, 340505, 345283, 350191, 355010, 359229, 362630, 365300, 367160, 367992, 367878, 367135, 365799, 363512, 359917, 354995, 349260, 343895, 340243, 338620]
52491C38620p98j397k047j713j018r50j161n73P45J561J234M75K08M50O75O63
52475C34974O06O97Q87R75P92M31K35M80J115J857K399K490K096J659J814K605
52459C56112L254L059K133J017m0r51j419j382j527k535l909m357l481k354k140
52444C41480k774l314l116k291j338p43p23j113j494j592j407r66k52N52J038
52429C21947J004O92M01R7l56p96q50m22J39M28L83K96M59Q77J328J637J814J973
52411C31051K197K562L117L763M334M941N981P628R450J0838J1624J1979J1819
52398D21284J0701Q246M442l39n190q807j0322j0204r706r379q671p181n533m425
52384C64916l518k012q6J137J076M35K61Q65J834K667L033K916K826L499M913
$$ y = [338620, 337822, 336425, 334378, 332665, 331647, 330697, 329536, 328963, 329708, 331269, 332503, 332978, 333186, 333636, 334311, 334974, 335580, 336277, 337164, 338139, 338931, 339362, 339597, 340077, 341192, 343049, 345448, 347938, 350034, 351693, 353507, 356112, 359366, 362425, 364558, 365575, 365535, 364584, 363165, 361783, 360256, 357721, 353812, 349455, 345974, 343620, 341480, 338706, 335392, 332276, 329985, 328647, 327904, 327181, 326068, 324574, 322982, 321575, 320609, 320357, 320909, 321947, 322951, 323643, 324044, 324141, 323785, 322989, 322139, 321717, 321856, 322284, 322667, 322963, 323422, 324299, 325627, 327264, 329078, 331051, 333248, 335810, 338927, 342690, 347024, 351965, 357946, 365574, 375024, 385862, 397486, 409465, 421284, 431985, 440231, 444673, 444334, 439144, 430337, 420015, 409811, 400105, 390726, 382055, 374874, 369341, 364916, 361398, 359386, 359300, 360437, 361513, 361948, 362209, 363074, 364908, 367575, 370608, 373524, 376350, 379849, 384762]
52369C84762N982N777M803M338M582M345K797P31n60j022j569k446k846k273j338
52354D06063q32o54k10O19J498K282K979L297K870J955J345J467J983K381K605
52339D29648K921L448M050M518M756M895N292O235P594Q895R802J0345J0808J1527
52325E24734J2752J4383J5881J6761J7157J7531J7943J8009J7686J7453J7509
52314G07799J7364J6661J5956J6089J7039J8064J8807J9603K0591K1239K1057
52303I10269K0352J9832J9650J9288J8339J7062J6011J5302J4384J2610R900O862
52291A099861M176J951k64k847n552p693q807r035q830q446p902p332p053p010
52277A025217o551n136l239j925j430p55R71L187M613M973N259O320P979R762
$$ y = [384762, 390744, 396521, 401324, 405662, 410244, 414589, 417386, 418117, 417557, 416535, 414966, 412520, 409674, 407401, 406063, 405231, 404577, 404367, 404986, 406484, 408766, 411745, 415042, 417912, 419867, 421212, 422679, 424662, 427043, 429648, 432569, 436017, 440067, 444585, 449341, 454236, 459528, 465763, 473357, 482252, 492054, 502399, 513207, 524734, 537486, 551869, 567750, 584511, 601668, 619199, 637142, 655151, 672837, 690290, 707799, 725163, 741824, 757780, 773869, 790908, 808972, 827779, 847382, 867973, 889212, 910269, 930621, 950453, 970103, 989391, 1007730, 1024792, 1040803, 1056105, 1070489, 1083099, 1092999, 1099861, 1104037, 1105988, 1105724, 1102877, 1097325, 1089632, 1080825, 1071790, 1062960, 1054514, 1046612, 1039280, 1032227, 1025217, 1018666, 1013530, 1010291, 1008366, 1006936, 1006181, 1007152, 1010339, 1014952, 1019925, 1025184, 1031504, 1039483, 1049245]
52263A049245J1704J3899J5733J6380J5919J5325J5330J5781J6155J6220J6000
52252A217691J5595J5216J5106J5073J4401J2577R868O922L956Q28k277m802o481
52239A313673p673q759r608r887r680r481r695j0341j1103j1514j1259j0506r843
52226A184324r687r815r727r259q589p792o781n674m752m037l271k429j806j377
52212A099328n85Q66K363L072L068L257M180N426O333O797P067P153O773N832
52198A160930M631L629L124L130L444L836M211M570M827M790M397L810L223K681
52184A215233K108J383L46j100k786m399n816p123q239q922r273r791j0520j0609
52170A140492r313p173n499m752m174l078j703m71Q19K471M082M966N171N410
$$ y = [1049245, 1060949, 1074848, 1090581, 1106961, 1122880, 1138205, 1153535, 1169316, 1185471, 1201691, 1217691, 1233286, 1248502, 1263608, 1278681, 1293082, 1305659, 1315527, 1322449, 1326405, 1327233, 1324956, 1320154, 1313673, 1306000, 1297241, 1287633, 1277746, 1268066, 1258585, 1248890, 1238549, 1227446, 1215932, 1204673, 1194167, 1184324, 1174637, 1164822, 1155095, 1145836, 1137247, 1129455, 1122674, 1117000, 1112248, 1108211, 1104940, 1102511, 1100705, 1099328, 1098743, 1099609, 1101972, 1105044, 1108112, 1111369, 1115549, 1120975, 1127308, 1134105, 1141172, 1148325, 1155098, 1160930, 1165561, 1169190, 1172314, 1175444, 1178888, 1182724, 1186935, 1191505, 1196332, 1201122, 1205519, 1209329, 1212552, 1215233, 1217341, 1218724, 1219070, 1217970, 1215184, 1210785, 1204969, 1197846, 1189607, 1180685, 1171412, 1161621, 1151101, 1140492, 1131179, 1124006, 1118507, 1113755, 1109581, 1106503, 1104800, 1104329, 1105148, 1107619, 1111701, 1116667, 1121838, 1127248]
52156A127248O035O594O446N343L409J050r94j958j693p67K03J081J970K757L178
52141A159902L199L051K935K765K288J338L5j202j907j861j152j0J380K991M979
52126A178731P466J0229J2745J4778J6785J9468K2905K6433K9279L1037L1648
52115A401504L1365L0893L0893L1067L0118K7227K3272K0111J8602J7899J6778
52104A679729J5101J3696J3084J2899J2490J1722J0968J0475J0043R267Q017O513
52092A814004N031L528J571j296n105r369j3493j7165k0248k2444k3337k2777
52080A688900k0955j8079j4318j0228o807m743l777l054k001o23Q62K352L989
52067A611518O176R157J2357J4509J5059J5024J5725J6909J6996J5323J3086J1784
$$ y = [1127248, 1133283, 1139877, 1146323, 1151666, 1155075, 1156125, 1155131, 1153173, 1151480, 1150713, 1150916, 1151997, 1153967, 1156724, 1159902, 1163101, 1166152, 1169087, 1171852, 1174140, 1175478, 1175513, 1174311, 1172404, 1170543, 1169391, 1169381, 1170761, 1173752, 1178731, 1186197, 1196426, 1209171, 1223949, 1240734, 1260202, 1283107, 1309540, 1338819, 1369856, 1401504, 1432869, 1463762, 1494655, 1525722, 1555840, 1583067, 1606339, 1626450, 1645052, 1662951, 1679729, 1694830, 1708526, 1721610, 1734509, 1746999, 1758721, 1769689, 1780164, 1790207, 1799474, 1807491, 1814004, 1819035, 1822563, 1824134, 1822838, 1817733, 1808364, 1794871, 1777706, 1757458, 1735014, 1711677, 1688900, 1667945, 1649866, 1635548, 1625320, 1618513, 1613770, 1609993, 1606939, 1604938, 1604315, 1605177, 1607529, 1611518, 1617694, 1626851, 1639208, 1653717, 1668776, 1683800, 1699525, 1716434, 1733430, 1748753, 1761839, 1773623]
52055A773623J1502J1334J0775R991R182Q370P587O667M986K049j715n158p483
$$ y = [1773623, 1785125, 1796459, 1807234, 1817225, 1826407, 1834777, 1842364, 1849031, 1854017, 1856066, 1854351, 1849193, 1841710]
$$ [...]
##END NTUPLES=NMR SPECTRUM
##END=
