##TITLE=AC1563_ROEFFECT0018_8270664_CdCpNi9t6f
##JCAMPDX= 6.0         $$ Bruker NMR JCAMP-DX V2.0
##DATA TYPE= NMR SPECTRUM
##DATA CLASS= NTUPLES
##ORIGIN= BRUKER
##OWNER= Administrator
$$ 1.72 TOPSPIN		Version 2.1
$$ 2013-10-12 22:31:23.695 -0700  Administrator@X
$$ Compression mode = diff/dup
##.OBSERVE FREQUENCY= 400.02188249412
##.OBSERVE NUCLEUS= ^1H
##.ACQUISITION MODE= SIMULTANEOUS (DQD)
##.ACQUISITION SCHEME= undefined
##.AVERAGES= 8
##.DIGITISER RES= 22
##SPECTROMETER/DATA SYSTEM= spect
##.PULSE SEQUENCE= zg30
##.SOLVENT NAME= COFFEE_meoh
##.SHIFT REFERENCE= INTERNAL, COFFEE_meoh, 1, 14.98509
##AUDIT TRAIL= $$ (NUMBER, WHEN, WHO, WHERE, PROCESS, VERSION, WHAT)
$$ ##TITLE= Audit trail, TOPSPIN		Version 2.1
$$ ##JCAMPDX= 5.01
$$ ##ORIGIN= Bruker BioSpin GmbH
$$ ##OWNER= Administrator
$$ $$ E:\/data/COFFEE/nmr/AC1563_ROEFFECT0018_8270664_CdCpNi9t6f/10/pdata/1/auditp.txt
$$ ##AUDIT TRAIL=  $$ (NUMBER, WHEN, WHO, WHERE, PROCESS, VERSION, WHAT)
(   1,<2013-10-12 22:31:16.476 -0700>,<Administrator>,<X>,<go>,<TOPSPIN 2.1>,
      <created by zg
	started at 2013-10-12 22:30:10.965 -0700,
	POWCHK enabled, PULCHK disabled,
       configuration hash MD5:
       C8 4E 4E 5D D3 5C D8 9E 9F 52 82 E0 59 8A DE 15
       data hash MD5: 64K
       25 F7 FC 53 DF 59 C9 E9 00 AB 2E 69 F3 E6 F9 B3>)
(   2,<2013-10-12 22:31:19.679 -0700>,<Administrator>,<X>,<proc1d>,<TOPSPIN 2.1>,
      <Start of raw data processing
       efp LB = 0 FT_mod = 6 PKNL = 1 PHC0 = 0 PHC1 = 0 SI = 32K 
       data hash MD5: 32K
       80 47 28 DE BD B2 7F D0 AE 5B F7 0C 5A BC 11 01>)
(   3,<2013-10-12 22:31:20.398 -0700>,<Administrator>,<X>,<proc1d>,<TOPSPIN 2.1>,
      <pk PHC0 = 97.02576 PHC1 = 0 
       data hash MD5: 32K
       2C 3E 9D 04 DB 43 CF 26 82 3C 6C 4C ED DB E3 74>)
(   4,<2013-10-12 22:31:20.491 -0700>,<Administrator>,<X>,<proc1d>,<TOPSPIN 2.1>,
      <abs ABSG = 1 
       data hash MD5: 32K
       BD 53 C4 63 2C B8 9F CA 63 84 46 F6 A3 B7 76 38>)
(   5,<2013-10-12 22:31:20.601 -0700>,<Administrator>,<X>,<proc1d>,<TOPSPIN 2.1>,
      <abs ABSG = 2 
       data hash MD5: 32K
       AA 83 FB 85 6D DF BE B7 36 74 E6 D1 57 97 C6 9F>)
(   6,<2013-10-12 22:31:20.663 -0700>,<Administrator>,<X>,<proc1d>,<TOPSPIN 2.1>,
      <abs ABSG = 3 
       data hash MD5: 32K
       39 B0 84 EA E7 A7 EB 24 CB 04 FC BB 74 53 BB A6>)
(   7,<2013-10-12 22:31:20.710 -0700>,<Administrator>,<X>,<proc1d>,<TOPSPIN 2.1>,
      <abs ABSG = 4 
       data hash MD5: 32K
       EE 7C 1C 03 A5 F7 7B 0B A0 7C DA 5F A3 FC 1D F5>)
(   8,<2013-10-12 22:31:20.804 -0700>,<Administrator>,<X>,<proc1d>,<TOPSPIN 2.1>,
      <abs ABSG = 5 
       data hash MD5: 32K
       0A F6 F6 BC F8 E7 92 59 A9 C1 69 AD F7 AB 3D EA>)
$$ ##END=
$$ 
$$ $$ hash MD5
$$ $$ 7B 14 CA 41 A1 4A 29 65 DD EB B5 59 2E 95 34 61
##$RELAX= 
##$RELAX= 
##$RELAX= 
##$RELAX= 
##$RELAX= 
##$RELAX= 
##$RELAX= 
$$ Bruker specific parameters
$$ --------------------------
##$DU= <E:\>
##$EXPNO= 10
$$ [...]
##$TP= (0..7)
150 150 150 150 150 150 150 150
##$TP07= 0
##$TPNAME0= <>
##$TPNAME1= <>
##$TPNAME2= <>
##$TPNAME3= <>
##$TPNAME4= <>
##$TPNAME5= <>
##$TPNAME6= <>
##$TPNAME7= <>
##$TPOAL= (0..7)
0.5 0.5 0.5 0.5 0.5 0.5 0.5 0.5
##$TPOFFS= (0..7)
0 0 0 0 0 0 0 0
##$TUNHIN= 0
##$TUNHOUT= 0
##$TUNXOUT= 0
##$USERA1= <user>
##$USERA2= <user>
##$USERA3= <user>
##$USERA4= <user>
##$USERA5= <user>
##$V9= 5
##$VALIST= <valist>
##$VCLIST= <CCCCCCCCCCCCCCC>
##$VD= 0
##$VDLIST= <DDDDDDDDDDDDDDD>
##$VPLIST= <PPPPPPPPPPPPPPP>
##$VTLIST= <TTTTTTTTTTTTTTT>
##$WBST= 1024
##$WBSW= 4
##$XGAIN= (0..3)
0 0 0 0
##$XL= 0
##$YL= 0
##$YMAX_a= 633495
##$YMIN_a= -539563
##$ZGOPTNS= <>
##$ZL1= 120
##$ZL2= 120
##$ZL3= 120
##$ZL4= 120
##$ABSF1= 14.98509
##$ABSF2= -5.573092
##$ABSG= 5
##$ABSL= 3
##$ALPHA= 0
##$AQORDER= 0
##$ASSFAC= 0
##$ASSFACI= 0
##$ASSFACX= 0
##$ASSWID= 0
##$AUNMP= <proc_prof1d_extract_pilot.lims>
##$AXLEFT= 0
##$AXNAME= <>
##$AXNUC= <1H>
##$AXRIGHT= 0
##$AXTYPE= 0
##$AXUNIT= <>
##$AZFE= 0.1
##$AZFW= 0.1
##$BCFW= 0
##$BC_mod= 0
##$BYTORDP= 0
##$COROFFS= 0
##$CY= 15
##$DATMOD= 1
##$DC= 0
##$DFILT= <>
##$DTYPP= 0
##$F1P= 0
##$F2P= 0
##$FCOR= 0.5
##$FTSIZE= 32768
##$FT_mod= 6
##$GAMMA= 0
##$GB= 0
##$INTBC= 1
##$INTSCL= 1
##$ISEN= 128
##$LB= 0
##$LEV0= 0
##$LPBIN= 0
##$MAXI= 10000
##$MC2= 0
##$MEAN= 0
##$ME_mod= 0
##$MI= 0
##$NCOEF= 0
##$NC_proc= -8
##$NLEV= 6
##$NOISF1= 0
##$NOISF2= 0
##$NSP= 0
##$NTH_PI= 0
##$NZP= 0
##$OFFSET= 14.98509
##$PC= 1
##$PHC0= 97.02576
##$PHC1= 0
##$PH_mod= 1
##$PKNL= yes
##$PPARMOD= 0
##$PPDIAG= 0
##$PPIPTYP= 0
##$PPMPNUM= 2147483647
##$PPRESOL= 1
##$PSCAL= 4
##$PSIGN= 0
##$PYNMP= <proc.py>
##$REVERSE= no
##$SF= 400.02
##$SI= 32768
##$SIGF1= 0
##$SIGF2= 0
##$SINO= 400
##$SIOLD= 32768
##$SPECTYP= <>
##$SREGLST= <1H.CDCl3>
##$SSB= 0
##$STSI= 32768
##$STSR= 0
##$SW_p= 8223.68421052631
##$SYMM= 0
##$S_DEV= 0
##$TDeff= 65536
##$TDoff= 0
##$TI= <>
##$TILT= no
##$TM1= 0
##$TM2= 0
##$TOPLEV= 0
##$USERP1= <user>
##$USERP2= <user>
##$USERP3= <user>
##$USERP4= <user>
##$USERP5= <user>
##$WDW= 1
##$XDIM= 32768
##$YMAX_p= 446266086
##$YMIN_p= -689050
##$CURPLOT= <Network HP LaserJet P1505>
##$CURPRIN= <$Network HP LaserJet P1505>
##$DFORMAT= <normdp>
##$LAYOUT= <+/1D_H.xwp>
##$LFORMAT= <normlp>
##$PFORMAT= <normpl>
##$SURQMSG= 1
$$ End of Bruker specific parameters
$$ ---------------------------------
##NTUPLES= NMR SPECTRUM
##VAR_NAME=  FREQUENCY,     SPECTRUM/REAL,   SPECTRUM/IMAG
##SYMBOL=    X,             R,               I
##VAR_TYPE=  INDEPENDENT,   DEPENDENT,       DEPENDENT
##VAR_FORM=  AFFN,          ASDF,            ASDF
##VAR_DIM=   32768,         32768,           32768
##UNITS=     HZ,            ARBITRARY UNITS, ARBITRARY UNITS
##FACTOR=    0.250966925370066, 1,           1
##FIRST=     8223.43324360094, 116742,       21128
##LAST=      0,             75952,           -106171
##MIN=       0,             -689050,         0
##MAX=       8223.43324360094, 446266086,    0
$$ Real data points
##PAGE= N=1
##DATA TABLE= (X++(R..R)), XYDATA
$$ [...]
19551b64498j1881a10070G4306a40319O710b931k3579m3953j1741J8655C2816
19539C5096f3144A65338a77293l18093F6256J31919a83539A90405a8486n1620
19529g0106a1871j64814I4542b12340D2377b28065A12864c4982j54725j19317
19519c09024i226k40992Q3482D53285A98264c7338k08357A96259K2056b91917
19508a54803j00544J4917R8125R600L2584A10019d8542l55877c4233j09380F7757
19496F8816K03058a67597j74744F0314b11968N4406A32957D4045a60728a1104
19485b23540n0974I0488B4395b59375c6714A74327i5416k23480a01284m11308
19475e12592a85507k41560a77036k51024E4169b78427P5015j9559C1271j1553
$$ y = [-264498, -276379, -110070, 74306, -140319, -133609, -2931, -26510, -70463, -82204, -63549, 32816, 35096, -63144, 165338, -177293, -495386, 66256, 198175, -183539, 190405, -18486, -70106, -11871, -176685, 94542, -212340, 42377, -228065, 112864, -34982, -189707, -309024, -9226, -250218, -166736, 453285, 198264, -37338, -245695, 196259, 218315, -291917, -154803, -255347, -240430, -142305, -132705, -100121, 110019, -48542, -404419, -34233, -143613, 67757, 68816, 271874, -167597, -342341, 60314, -211968, -157562, 132957, 44045, -160728, -11104, -223540, -274514, 90488, 24395, -259375, -36714, 174327, -95416, -318896, -101284, -512592, -185507, -427067, -177036, -428060, 54169, -278427, -203412, -222971, 31271, 19718]
19465A9718J33392O5967q4011i4282k7119A7388c21729a091j69066j46147B16918
19453A47259b3910p4029A71709A8521c2795C33564J11230A67155E7823h9945b0574
19441B35205a68976A16192b5090C2409c3484A88790A8047R2253c55160A21212
19430c8566A01048L776K60066a16170b989A40417d9415j1563A0745L0439I634
19418f3428C1550e6666H5611d9034p8233m5229k19099a80235m3033J9929Q6919
19407a16420k63423A16104j3692k5502a19823k82922G2648c93353a84955C4738
19396A45301J96457b09120c6081r4576C17556c7138C05782b0660A6140a89178
19385A49515a19697j149A47662j9266l5687D2627K98739j21214a55558o2625B4898
$$ y = [19718, 153110, 219077, 135066, -94282, -121401, 17388, -321729, -1091, -170157, -316304, 216918, 147259, -23910, -97939, 171709, 18521, -32795, 333564, 444794, 167155, 57823, -89945, -20574, 235205, -168976, 116192, -25090, 32409, -33484, 188790, 18047, 110300, -355160, 121212, -38566, 101048, 104824, 364890, -116170, -2989, 140417, -49415, -60978, 10745, 41184, 9634, -63428, 31550, -56666, 85611, -49034, -127267, -172496, -391595, -180235, -223268, -203339, -116420, -379843, 116104, 102412, 76910, -119823, -402745, 72648, -393353, -184955, 34738, 145301, 341758, -209120, -36081, -130657, 317556, -37138, 305782, -20660, 16140, -189178, 149515, -119697, -120846, 147662, 128396, 92709, 42627, 341366, 220152, -155558, -218183, 24898]
19373b4769q9102A41443a79681l15288a6741G0655b87528A10806A2968J17544
19363A30512D2818a538D5895a7470j95680E0409b46186A98171A5406g4576n5798
19352a30374m4514k47365d3727n29402D7741c99389a00413B9779J21474b67988
19341a94556P1528j1621A49551b10073g5796j83482j2999b7362A05301a07154
19330a74790O5094b8647j21942E4914M3497C0150a23602a6410r1174F3837Q5684
19319A49521e0618B1274a40132B6602K80092b77204i9463B8370h6001n9423L1845
19308a13579j82679e3342k26675C2189J56118m3024a71188B06606b7721j39478
19298a67199o6388D9725c92876g7738c1892B08489e5799A31150E5019a28055A64237
$$ y = [-24769, -113871, 141443, -179681, -494969, -16741, 70655, -287528, 110806, 12968, 130512, 42818, -1538, 45895, -17470, -213150, 50409, -246186, 198171, 15406, -74576, -130374, -174888, -422253, -43727, -573129, 47741, -399389, -100413, 29779, 151253, -267988, -194556, -123028, -134649, 149551, -210073, -75796, -259278, -272277, -27362, 105301, -107154, -174790, -109696, -28647, -150589, 54914, 98411, 30150, -123602, -16410, -107584, 63837, 149521, -50618, 21274, -140132, 26602, 306694, -277204, -99463, 28370, -86001, -145424, -113579, -296258, -53342, -280017, 32189, 188307, 145283, -171188, 206606, -27721, -167199, -233587, 49725, -392876, -77738, -31892, 208489, -55799, 131150, 55019, -128055, 164237]
19286G2178a93431E804a11865A7170P8462c88686b7296Q35r4954Q065A58522N7205
19274B15727a83797c135E9879a42851j94678f3437l3814k7251d0677A2686N8331
19263G1017a63604A08420e6148B73323K1244a39958k15172Q9549J13315C05204
19252c61507a34015f2231F0598K81556a22502k48687C174a00589d5815a7269k36225
19241b53494O7879b7459H082R7477a39931A71237F3231e4206a2044p049A50742
19229h0804B26914f3125Q540H4004K5909m9776a85615n516e9928l4347j38032
19218b32307A97296b08124e2098j96295a5172k65855a38669N2820l5996A99449
19207b37370a8197A35179h5687L1318a9197k86101g6485o2672n554B35449i8863
$$ y = [72178, -193431, 5804, -111865, 17170, 95632, -388686, -27296, -26461, -121415, -113350, 158522, 215727, -183797, -3135, 59879, -142851, -337529, -63437, -97251, -124502, -40677, 12686, 71017, -163604, 108420, -56148, 273323, 294567, -139958, -355130, -265581, -152266, 305204, -361507, -134015, -62231, 60598, 342154, -122502, -371189, 3174, -100589, -45815, -17269, -253494, -185615, -27459, 8082, 105559, -139931, 171237, 63231, -54206, -12044, -19093, 150742, -80804, 226914, -63125, -54585, 84004, 109913, 60137, -185615, -191131, -59928, -94275, -232307, 197296, -208124, -52098, -248393, -15172, -281027, -138669, -85849, -121845, 199449, -237370, -18197, 135179, -85687, -54369, -19197, -305298, -76485, -139157, -144711, 235449, -98863]
19195d4499j23813M2450B59567c3131j41338A64093a19106j1922A29262J83855
19185C13117G5043J96318a7729j12697D2759i3679m9519A74108b3211j31868k7194
19174a82273k67471A01460m8619d9288j59030j09609j34107b20370A79119A2932
19163b50616A67532N2980g7179l36900q8940a60497B19032b47099A27334L8628
19153A65962d4834k32534k35917H8783a5636A69017a91401A67848o8353h0285
19142a96368B7665K79893a2869k8494j01727B1215N2322C6120j3678e5122j30681
19131a85803I4348a7964m6333P335A56797a0872j4508J2182n8298G2714g6349
19119A11640d69054C363a63237N4633A1592M2502c89186e391l32477A52173L6147
$$ y = [-44499, -168312, -125862, 259567, -33131, -174469, 164093, -119106, -131028, 129262, 313117, 75043, 271361, -17729, -130426, 42759, -93679, -143198, 174108, -23211, -155079, -182273, -449744, 101460, 52841, -49288, -208318, -317927, -452034, -220370, 179119, 12932, -250616, 167532, 220512, -77179, -414079, -503019, -160497, 219032, -247099, 127334, 165962, -44834, -277368, -513285, 88783, -15636, 169017, -191401, 167848, 99495, -80285, -196368, 27665, 307558, -12869, -41363, -143090, 21215, 73537, 36120, 22442, -55122, -185803, 94348, -17964, -64297, -56962, 156797, -10872, -25380, -13198, -71496, 72714, -76349, 111640, -469054, 3363, -163237, -108604, 11592, 54094, -389186, -5391, -337868, 152173, 188320]
19108A88320a92614h9715j6102B59265f3543j43495F3964K90444A20399Q9626
19098B10025A04860B3414c3831B2694J3856d27153b10022G3522K3086m0057J52328
19087B08879e8150j63923f250l37595F7050b14087L0804A2962c10405C4871J54097
19076A88968H356b60619A8741c91398A08711J43646e12981J3995E2200b2123j18516
19065a40639p8208A1949R7707c21151a60440a9103C0493R997J98452L5862h5445
19053B22473a94580B40940b12155J7597D3633G628J09563c15581A8261h5596G8888
19041I4043I724b88823j203D1209j2142c22793A77650c35909B3377L4955O1453
19030A19785J36974b93879G9111C8099L24381n1177c41045g7708A69341O708d9927
$$ y = [188320, -192614, -89715, -105817, 259265, -63543, -207038, 63964, 354408, 120399, 210025, 104860, 23414, -33831, 22694, 36550, -427153, -210022, 73522, 96608, 56551, 208879, -58150, -222073, -6250, -343845, 67050, -214087, -183283, 12962, -310405, 34871, 188968, 8356, -260619, 18741, -391398, 108711, 252357, -512981, -498986, 52200, -22123, -140639, -218847, 11949, 109656, -321151, -160440, -19103, 30493, 40490, 238942, 274804, -85445, 222473, -194580, 240940, -212155, -194558, 43633, 7628, 117191, -315581, 18261, -85596, 78888, 94043, 9724, -288823, -290026, 41209, 29067, -322793, 177650, -335909, 23377, 58332, 119785, 256759, -293879, 79111, 38099, 362480, 311303, -341045, -77708, 169341, 176049, -49927]
19018a08847D4934c1583j47003h1234J7556A90749C4535a32308D07429i2235A06345
19006A62051l2537b23765A42779a39961j16588A18282C0478b72459J20234B35265
18995a78797F4319k6659H808i1822j06294N9711A27508O1796b26726K7509C8338
18983d66700A19107c64569C3434f2978a1611k15497Q429B20538c55207a35854
18972a78791F7595b74402A5410b75050a09714k61242m0859f6584A30151a4332
18961C1864b8291A68515q0288f229j82496k9249A09258a07103A72945m8048k9347
18950I5550K5827j8156e4058A09913h5898A00412g7806q3853B89702d6895k34620
18939b81515a20927E7280K2443b63401B4728b25210C4755K6988h8745l9209a7195
$$ y = [-108847, 44934, -31583, -178586, -81234, -63678, 190749, 34535, -132308, 407429, -92235, 106345, 162051, 129514, -223765, 142779, -139961, -256549, 118282, 30478, -272459, -152225, 235265, -178797, 64319, 37660, 8808, -91822, -198116, -138405, 127508, 189304, -226726, -199217, 38338, -466700, 119107, -364569, 33434, -62978, -11611, -227108, -218679, 220538, -355207, -135854, -178791, 67595, -274402, 15410, -275050, -109714, -370956, -411815, -66584, 130151, -14332, 31864, -28291, 168515, 88227, -6229, -188725, -217974, 109258, -107103, 172945, 124897, 95550, 121377, 103221, -54058, 109913, -85898, 100412, -77806, -161659, 289702, -46895, -281515, -120927, 57280, 79723, -263401, 24728, -225210, 34755, 61743, -88745, -127954, -17195]
18927A41913A7700b25433A08314d7752a5293A85763b24004C66660d93319J65792
18917c27527a16156p40j20076G0227g9657B42818C4287J10754d06294a61664d9562
18905g9183p0257C1331h3983B89024a27772f2427A68398b02675A3872b41165C07133
18893A70950a52736j3981B6123b64774a11702A08072k6675M9755J06215b83905
18882c7364B24595B4724a40815P0196e735A57931a01837j8688l4168A82890b03771
18870b41513R1329P0872A02562K107D6269a7443B85580D7007g375A88713e43312
18858a93796P2114A6134c0693j00207A99374a74281B19139b36409A54651b29172
18847b8011A26127A0196a13765c4513a5553o4434l4789B06182b08101h781m6261
$$ y = [141913, 17700, -225433, 108314, -47752, -15293, 185763, -224004, 366660, -493319, -327527, -116156, -116896, -236972, 70227, -79657, 242818, 34287, 145041, -406294, -161664, -49562, -79183, -149440, 31331, -83983, 289024, -127772, -62427, 168398, -202675, 13872, -241165, 307133, 170950, -152736, -166717, 26123, -264774, -111702, 108072, 81397, 131152, 237367, -283905, -37364, 224595, 24724, -140815, -70619, -5735, 157931, -101837, -120525, -154693, 182890, -203771, -241513, -150184, -79312, 102562, 104669, 46269, -17443, 285580, 47007, -7375, 188713, -543312, -193796, -121682, 16134, -30693, -130900, 199374, -174281, 219139, -236409, 154651, -229172, -28011, 126127, 10196, -113765, -34513, -15553, -79987, -114776, 206182, -208101, -8781, -55042]
18836e5042j74274j06875H4118J54645A10101n0520R4197e9825k64911J28700
18826a96036B5696L2209J14978O1144b03161B64284a09368I8649a08782L4035
18816g4747H4450J56535f2885A64505m704l5733a08010E1866A7736a79601G1665
18804E3521c4303n10l19386a48602k8528C3524J45637b37317i4639l658a4844
18792G9934g4512o7380a2016H0074b5452R766j35684a4680A16505g1776a683A11990
18779D1493b27325I9980c2043j03375F7285B2310J37248f0701r8033c6591a1865
18767A11530n3256e6124C75025b36977a00200A18952i1257l779M0462k837l0380
18756h7791g44j15113I3579a7367j29215c5411l58933A18749i4138k61019A45703
$$ y = [-55042, -229316, -336191, 84118, 238763, 110101, 59581, 153778, -59825, -324736, -196036, 25696, 57905, 172883, 234027, -203161, 264284, -109368, 98649, -108782, -74747, 84450, 240985, -62885, 164505, 159801, 124068, -108010, 51866, 17736, -179601, 71665, 53521, -34303, -34813, -354199, -148602, -177130, 33524, 179161, -237317, -94639, -98297, -14844, 79934, -74512, -141892, -12016, 80074, -25452, -15686, -151370, -14680, 116505, -71776, -1683, 111990, 41493, -227325, 99980, -32043, -135418, 67285, 22310, 159558, -60701, -158734, -36591, -11865, 111530, 58274, -56124, 375025, -236977, -100200, 118952, -91257, -95036, -54574, -57411, -87791, -744, -115857, 93579, -17367, -146582, -35411, -394344, 118749, -94138, -355157, 145703]
18744b69864J9430A7153M2825d5082l1763A48164c97714o0785e5353k25657i2405
18732g0483A04483j4475b39681J07743A78754K7795q7419b05989r7145C3943J61598
18721A95541a94161m5490j7083K244a11021A37808a00558k57463i2651N08n0667
18710a42810A6579e5944G9428C5567b51435D5077L6767f1020j65708j4498G7028
18698B20321b50289k8372a12654A3633K27457A3214h67o8011j3026j7952G2588
18686b59419A67675J67525a8960A25225c31923d7134B11371E3839a16566c1455
18675d08117A36604a69808c913p1147k03708F8080f8374k01A02075j2526a2577
18663a04423F971a37885d7256C63407B0506K51448a77055d2994G8632c34026b8906
$$ y = [-269864, -250434, 17153, 59978, -45082, -76845, 148164, -397714, -458499, -55353, -281010, -92405, -70483, 104483, 90008, -239681, -131938, 178754, 206549, 119130, -205989, -303134, 33943, 195541, -194161, -239651, -256734, -254490, -111021, 137808, -100558, -358021, -92651, -92143, -142810, 16579, -55944, 79428, 35567, -251435, 45077, 81844, -61020, -226728, -241226, 77028, 220321, -250289, -278661, -112654, 13633, 241090, 13214, -867, -68878, -81904, -99856, 72588, -259419, 167675, 335200, -18960, 125225, -331923, -47134, 211371, 53839, -116566, -31455, -408117, 136604, -169808, -3913, -75060, -278768, 68080, -68374, -68575, 102075, 89549, -12577, -104423, 6971, -137885, -47256, 363407, 20506, 271954, -177055, -42994, 78632, -334026, -28906]
18651i312B3087J85291f7595E4772J20389b22781e1987j14667j00013J20687N6694
18640h9286k8537c0791D1442L10575a68185A94791C0477J70835g6641B77281q2891
18629A94390H0269k0403a21782j74076P4117e5731q6779k2813g0736J7226Q292
18618d5218H8560b83601P5342c1487k328E3142B4267b2251a335p5912H2232b86409
18605A05817j3018O4393G894d54132a08277j3851C2569a20823r6440A61019a41043
18593g6618j52374e3060j5544B60953b17456g9482B7304L2704h8148r4815P9881
18582a03082k32071A10831e855p2057B93026b44632k26264a2272j32399l6536
18572a81207A92784I3871d20080a74579q6046j49143G9642N7099a52271k0171
$$ y = [-9312, 23087, 208378, -67595, 54772, 175161, -222781, -51987, -166654, -266667, -145980, -89286, -117823, -30791, 41442, 352017, -168185, 194791, 30477, 201312, -76641, 277281, 194390, 80269, 59866, -121782, -295858, -221741, -55731, -142510, -165323, -70736, -53510, -45218, 88560, -283601, -208259, -31487, -33815, 53142, 24267, -22251, -1335, -77247, 82232, -286409, 105817, 92799, 157192, 7894, -454132, -108277, -122128, 32569, -120823, -217263, 161019, -141043, -76618, -228992, -53060, -68604, 260953, -217456, -79482, 27304, 60008, -88148, -182963, -103082, -335153, 110831, -5855, -77912, 293026, -244632, -470896, -12272, -144671, -181207, 192784, 93871, -420080, -174579, -260625, -409768, 79642, 136741, -152271, -172442]
18562a72442b8190H5414f035A41256o9368b28222o0470A2707O4974c1724p6220
18551a07944C2018N1933d04636J00447A78411c07142p5867a45945K242l9547N9924
18540a23326i224A24530B0106K8320c02376A64939o8429J15084b21210i3706g222
18528a51787M3436j14462A2056b80767a30996f3865k53325g802D26762b91528
18517a06673A09835e4337j63333A18022a76326A1895a16687j9675q0258A76908
18506A71398N4798b82649J10965j08972a33464A2021J03490M9805G6389a85590
18495H6562J08840a01780A52149j6846D1768a86746B8904a4442j10989C63565
18484a74966K7261D98884b87162I494a99066R3747H3711L33490I1305b31543C8860
$$ y = [-172442, -28190, 85414, -6035, 141256, 71888, -228222, -288692, 12707, 77681, -31724, -107944, 32018, 83951, -404636, -304189, 178411, -307142, -383009, -145945, -143703, -183250, -123326, -9224, 124530, 20106, 48426, -302376, 164939, 96510, 211594, -221210, -93706, -7222, -151787, -108351, -222813, 12056, -280767, -130996, -63865, -317190, -7802, 426762, -291528, -106673, 109835, -54337, -217670, 118022, -176326, 11895, -116687, -136362, -216620, 176908, 171398, 226196, -282649, -171684, -280656, -133464, 12021, 115511, 165316, 76389, -185590, 86562, 195402, -101780, 152149, 135303, 41768, -186746, 28904, -14442, -125431, 363565, -174966, -147705, 498884, -287162, 9494, -199066, -105319, 83711, 417201, 91305, -231543, 38860]
18472d8983J6182C76417i5744j58896J17092H0654b04280C82811A87598i4505
18461c9073B6699a18139N8788A25148P8898B5509a16027k680l42074J16389C380
18449B78532D7433a11331B08085b26068A09598g9828k16023B53948G551f4530
18438E4367d08557J57862J01199l52444A75847f6699A57849h2312k2117b9049
18427H1376L131a95592h8503k32568D337Q4092h1031I5801e6789N185A69146a52495
18414a33210N6169A05306d39945a6900A394d64779a53771N8898j26509b079n3225
18403e5304j4477A11393J46918H258a07803o6810O8094o5500c5006j01497p5601
18392b12104d5108b2462r2636d0064m997C2030h3430A9401R553b08566i5119j02100
$$ y = [-48983, -32801, 376417, -95744, -254640, -137548, 80654, -204280, 382811, 187598, -94505, -39073, 26699, -118139, -59351, 125148, 204046, 25509, -116027, -118707, -460781, -344392, 3380, 278532, 47433, -111331, 208085, -226068, 109598, -79828, -295851, 253948, 7551, -64530, 54367, -408557, -250695, -149496, -501940, 175847, -66699, 157849, -82312, -104429, -29049, 81376, 84507, -195592, -88503, -321071, 4337, 88429, -81031, 95801, -56789, -51604, 169146, -152495, -133210, -77041, 105306, -439945, -16900, 1394, -464779, -153771, -94873, -221382, -2079, -55304, -69781, 111393, 258311, 8258, -107803, -174613, -106519, -172019, -35006, -136503, -212104, -45108, -22462, -115098, -40064, -45061, 32030, -83430, 19401, 28954, -208566, -95119, -197219]
18380a97219j6837M177N7129j03545h1700j89533p3488C042M5541b99926D3940
18368a52106B28334A6220a46831k1838k2559g7197A10790N7883p7139B5466a42931
18356b12575A7033a77930k5546e5783a6133j32828A51739D1495A1060b68339A40617
18344h4188a3542A11661b24733i0785E8949A4944d7238q9734c4626Q896A6165
18332f0996B23442a08459k13765I5706k3212J23412H9902K37791m4727b56984
18321c94809H6444a38984c3125F5244J66433b93905E0473H284c65485h4452j86190
18310b70642a4631D5180O9406c06069D2320b94316R1312q8660F161P7945a05520
18298c02271P8743j10931J64404c8288A78466b22423c385j89995B6924c17600
$$ y = [-197219, -214056, -209879, -152750, -256295, -81700, -271233, -344721, 3042, 48583, -299926, 43940, -152106, 228334, 16220, -146831, -168669, -191228, -77197, 110790, 168673, 91534, 25466, -142931, -212575, 17033, -177930, -203476, -55783, -16133, -148961, 151739, 41495, 11060, -268339, 140617, -84188, -13542, 111661, -224733, -90785, 58949, 14944, -47238, -136972, -34626, -25730, 16165, -60996, 223442, -108459, -322224, 95706, 72494, 195906, 89902, 327693, 282966, -256984, -394809, 86444, -138984, -33125, 65244, 231677, -293905, 50473, 8284, -365485, -84452, -270642, -14631, 45180, 114586, -306069, 42320, -294316, -203004, -291664, 6161, 84106, -105520, -302271, -223528, -334459, -170055, -38288, 178466, -222423, -3385, -193380, 26924, -317600]
18287a53527D5398a19746J9367d6403B29290a88186G006J58235B1837J07362o0921
18276F8278a82019G3701g7449C35702c9863j32512b0896j84206B6878J33150a01576
18264B30748c42672A80587A5496R27c696A28521g8041H1631Q4794a97304h3484
18252a37752K5582M2281k42735e1845G2514j9199K195r543d6525J8895A49853
18240e3158B88872a88273D6795J27005K1201k61a64755P159O905j09000a21929
18228D5179d8284D7514Q4172h1617k52288h1575c9610A56671p1846K0858K9637
18217A35320a35287G1317c23248f0598R126L133j6694C8150J09439j3178Q8337
18206B22748a73069N467a7592C53375c28656A5431a18661M4106l039k53394C164
$$ y = [-153527, 45398, -119746, -100379, -46403, 229290, -188186, 7006, 165241, 21837, 129199, 68278, -182019, 73701, -77449, 335702, -39863, -172375, -20896, -205102, 26878, 160028, -101576, 230748, -342672, 180587, 15496, 16423, -3696, 128521, -78041, 81631, 166425, -197304, -83484, -137752, -112170, -69889, -312624, -51845, 72514, 53315, 55510, 45967, -46525, -27630, 149853, -53158, 288872, -188273, 46795, 173800, 195001, 194740, -164755, -157596, -150691, -259691, -121929, 45179, -48284, 47514, 131686, -81617, -333905, -81575, -39610, 156671, 84825, 105683, 135320, -135287, 71317, -323248, -60598, -51472, -48339, -65033, 38150, 147589, 134411, 222748, -173069, -167602, -17592, 353375, -328656, 15431, -118661, -74555, -77594, -330988, 3164]
18194A22504a78016B16471a15834E9648a13456m5685j55624h1538j5701a4766
18183B06752f5372b3775k71014A14082D6839c2095k08020A30872Q6655a25176
18172b28067J6069n2918D44262a34833m1614g7305I2348c0685k29870J05248G0137
18160b6177m34109A82030c51419B37233b11655J6839C9332a73782B82650b9171
18149G0009a83155n1251j53299a35677O886e6204q519b3742l55051A09062b43399
18137b58677N7578D51383a00512G991a9892k20369M8138c3934c746B36962a72088
18125h2977k5478E1304b88861e82j0074j44478G1129J11179o5001E1119R6127
18114A47246d2947l3475k60830A00829K5341c1793h940o622k07046e7490K2689
$$ y = [122504, -178016, 216471, -115834, 59648, -113456, -159141, -314765, -81538, -97239, -14766, 206752, -65372, -23775, -294789, 114082, 46839, -32095, -240115, 130872, 217527, -125176, -228067, -211998, -264916, 444262, -134833, -176447, -77305, 92348, -30685, -260555, -155307, 70137, -26177, -460286, 182030, -351419, 237233, -211655, -194816, 39332, -173782, 282650, -29171, 70009, -183155, -234406, -387705, -135677, -128791, -56204, -64723, -23742, -378793, 109062, -243399, -258677, -201099, 451383, -100512, 7991, -19892, -240261, -192123, -33934, -3746, 236962, -172088, -82977, -108455, 51304, -288861, -582, -10656, -155134, 71129, 182308, 117307, 51119, 147246, -42947, -76422, -337252, 100829, 126170, -31793, -8940, -15562, -222608, -57490, -34801]
18103c4801G6743a48815b836B53943a7052k97772g2458B20292f117j67981j65826
18092c39924a10332k75224a42433B71266a43364j12107E6256J53286i2166C0293
18081a21129j9758j62016E0249J16273R0680D4867J3417j8441R4761h765j0291
18070a9056A47294D4640A9546g9713c8857C28147b80891r5467F9705k9921K9371
18059F9155c267k02920n2009R3017A2098a6221H9072b38400J10337C8524J34179
18048A72703a11578D3694a52473n7661J00545b4738B8939a37116j9702A9366a3622
18036B80457c8247A46164l138J9330D7113o144Q4747a05892k05461E6041a74323
18024g7534A88738b61540A83543J669C5426c25389h0203k8399D684b06046r2441
$$ y = [-34801, 76743, -148815, -2836, 253943, -17052, -314824, -72458, 220292, -6117, -174098, -339924, -110332, -385556, -142433, 271266, -143364, -255471, 56256, 209542, -92166, 30293, -121129, -140887, -302903, 50249, 166522, 257202, 44867, 58284, 39843, 134604, -8765, -19056, 147294, 44640, 19546, -79713, -38857, 328147, -280891, -376358, 69705, 39784, 69155, -3267, -206187, -258196, -165179, 12098, -16221, 89072, -238400, -128063, 38524, 172703, -111578, 43694, -152473, -210134, -109589, -24738, 28939, -137116, -156818, 19366, -13622, 280457, -38247, 146164, 143026, 162356, 47113, 40969, 125716, -105892, -311353, 56041, -174323, -77534, 188738, -261540, 183543, 185212, 35426, -325389, -80203, -108602, 4684, -206046, -298487]
18013b98487I7661d2234a826k17505P2967n2732A22392D3440A3016b95096g2417
18001b22237i3462j40128B21993M7265q5649B3396a59986E5642a53095d3880a2583
17989f6380k60141i9644j08944E8916h0999B4146a98624N4457B76746g2982G2306
17977H1088N5071a74500D4274e0418B63953b52909j52707a00754j38040A71803
17966a80424g7737H0529e1783o6060J2197F1466O8816J79986p3817c51925G5694
17954A60308D6815P6133a04320F261f3960B1735J09100e6785B7015l026r991a76005
17941a4077A86564d985k16568f3565j14417J0596A83878o8666e48550A9483R5919
17930A15402f3117B2630c65195N9698B5092K00337b09257B56792d9183B63374
$$ y = [-298487, 97661, -42234, -1826, -219331, -146364, -199096, 122392, 43440, 13016, -295096, -72417, -222237, -93462, -233590, 221993, 269258, 183609, 23396, -159986, 55642, -153095, -43880, -12583, -66380, -326521, -99644, -208588, 58916, -80999, 24146, -198624, -144167, 276746, -72982, 72306, 81088, 136159, -174500, 44274, -50418, 263953, -252909, -405616, -100754, -238794, 171803, -180424, -77737, 80529, -51783, -117843, -105646, 61466, 130282, 310268, 236451, -351925, 75694, 160308, 46815, 122948, -104320, 6261, -63960, 21735, 130835, -56785, 27015, 23989, 13998, -176005, -14077, 186564, -4985, -221553, -63565, -177982, -167386, 183878, 115212, -548550, 19483, 115402, -63117, 22630, -365195, -305497, 25092, 225429, -209257, 256792, -49183, 263374]
17919C28118c21681L5782a00306G0139M0776a08475J0409K738p412o3208a5414
17907a58771A86141c45441a22616a4281l2067B50651a6462A06810P2910G7297
17896C2428i8866r1474A73959A7180h9798H2951J56926b47202A34434c78126I6135
17884A38638h8426A90987I3578a04156k12726J22253d9027E8752k1614d34862
17873D8003B3999K30964G601J54430b38979P1858B56706d079k93480a1592q1814
17862i3406p5572n1625j93825a78312C48554a55776A86021l509a4721A83377A8718
17850a58581I5619I34a2706n393j01009o6826N988N4521Q856A22086N2968L3114
17838B08168a85193g1021l2255o4965D51776A93562b1478k73301J01278Q9043
$$ y = [328118, -321681, -285899, -100306, 70139, 110915, -108475, -98066, -95328, -102740, -165948, -15414, -158771, 186141, -345441, -122616, -14281, -46348, 250651, -16462, 106810, 179720, 77297, 32428, -98866, -190340, 173959, 17180, -89798, 82951, 239877, -247202, 134434, -378126, 96135, 138638, -88426, 190987, 93578, -104156, -316882, -194629, -49027, 58752, 37138, -434862, 48003, 23999, 254963, 7601, 162031, -238979, -167121, 256706, -4079, -297559, -11592, -93406, -168978, -220603, -414428, -178312, 348554, -155776, 186021, 182512, -14721, 183377, 18718, -158581, 95619, 934, -12706, -18099, -119108, -185934, -179946, -125425, -116569, 122086, 175054, 208168, -185193, -71021, -103276, -168241, 451776, 193562, -21478, -294779, -193501, -104458]
17828a04458L650J3687F0765e274B07328I8561f754q6077F9551B59R5770c11861
17815e6805A92523n2762a61689C27938j49186a14524L2902R8q2301N5212I0995
17803e93j10319A13224a22913A00948l5147c84731F6669k584l1598a45272r7565
17792b42837P6227C8561a97175L1100Q0090j6092A39925a53252A03582f9793p9870
17781a49663N9589j47986A12856f697A42538F2420J35256l4198b66313a17202
17770b44527H1467a8564p0889K0897A95836D4213a85464C21105a78896F7506K11094
17759B78600E6268J19690f5818P228J5771A66486c1898B13703a35336M85B78291
17747E6580b95258b3192o7111b1486E7700K40358r2358a33931F4213A3471M8202
$$ y = [-104458, -100808, -87121, 60765, -5274, 207328, 98561, -6754, -92831, 69551, 259, 96029, -311861, -56805, 192523, 139761, -161689, 327938, 178752, -114524, -81622, -81524, -163825, -108613, 90995, -593, -110912, 113224, -122913, 100948, 65801, -384731, 66669, 64085, 32487, -145272, -242837, -166610, 38561, -197175, -166075, -85985, -102077, 139925, -153252, 103582, -69793, -149663, -90074, -238060, 112856, -6697, 142538, 62420, 197676, 163478, -266313, -117202, -244527, 81467, -18564, -89453, -68556, 195836, 44213, -185464, 321105, -178896, 67506, 278600, 56268, 175958, -65818, -58590, -42819, 166486, -31898, 213703, -135336, -134851, 278291, 56580, -295258, -23192, -90303, -21486, 57700, 298058, 205700, -133931, 64213, 13471, 61673]
17736F1673k4639K63404A19110e5160q0310D7112b83614i7895r4985L3723G0014
17724A31254d7818r8744m9630d9384j59612B92143B6342b10402h1871a3549D8018
17712b06767b7422k68760B6218g9106A437J47562L3558J40305f0589A91903f3039
17700B4288G117g0191C11753I4237C5835Q3799C0823D639L96977b59221R3676
17689a65545P3688l9491H1766b99549A90024B177d3382j0735l13880G2041g9127
17677a22625C57348d1746p5723j66981B7020a29805A11876M80932b33497F6298
17666a9940o1321B15724a21633e4234A3944L51054d39018i8147G8533L0186a88224
17654d2808E7050a26025j71205A97104H6494b77285H6056L2856b20196F7699c12567
$$ y = [61673, 37034, 300438, 119110, -55160, -135470, 47112, -283614, -97895, -192880, -159157, 70014, 131254, -47818, -146562, -196192, -49384, -208996, 292143, 26342, -210402, -81871, -13549, 48018, -206767, -27422, -296182, 26218, -79106, 1437, 148999, 182557, 322862, -60589, 191903, -63039, 24288, 7117, -70191, 311753, 94237, 35835, 119634, 30823, 4639, 401616, -259221, -165545, -91857, -131348, 81766, -299549, 190024, 2177, -43382, -54117, -367997, 72041, -79127, -122625, 357348, -41746, -117469, -284450, 27020, -129805, 111876, 592808, -233497, 66298, -19940, -81261, 215724, -121633, -54234, 13944, 364998, -439018, -98147, 78533, 108719, -188224, -42808, 57050, -126025, -297230, 197104, 86494, -277285, 86056, 118912, -220196, 67699, -312567]
17642c625n1159A21271b17733N0312B33782H4867B2950J49103E8200b26777C50432
17630e3679D42975E4620J20091A605K87850J51352j86697A09405h9481j12294
17620b01775b3521B15401j06913J32092d9473A228b56273b4302q3712j13188B20554
17608I3852a3863j37298F0346J69121a2275j22268d7376K2504I3603J85839a76002
17596g887B19658b42210F0744f2370J6381j7723A72772i2331I9753o508M9431
17585A42676D0492J19657M6183j00930J37196b30590F8467J571a01611m2048e6653
17573D2450a92118E0668c5076D2554R3476c2788C50239c9000A72418b33905c6527
17561d5503C86126i0935A22675P1668a07807j56458i7620B91267b65973J5269
$$ y = [-3625, -54784, 121271, -217733, -167421, 233782, 84867, 22950, 172053, 58200, -226777, 350432, -53679, 442975, 54620, 174711, 1605, 289455, 440807, 254110, 109405, -89481, -201775, -23521, 215401, 108488, 240580, -49473, 1228, -256273, -24302, -108014, -221202, 220554, 93852, -13863, -151161, 60346, 229467, -12275, -134543, -47376, -24872, 93603, 279442, -176002, -7887, 219658, -242210, 60744, -62370, -45989, -63712, 172772, -92331, 99753, 93245, 142676, 40492, 160149, 206332, 105402, 242598, -230590, 68467, 70038, -101611, -143659, -56653, 42450, -192118, 50668, -35076, 42554, 136030, -32788, 350239, -39000, 172418, -233905, -36527, -45503, 386126, -90935, 122675, 194343, -107807, -264265, -97620, 291267, -265973, -250704]
17551b50704d0777A79865C6730K7732h4976A66183n360O355a37016B8249O9852
17540I8101a95271i3278B97663q1695e9952n3340B26331K157c1386B05427f1911
17528F9532N4773k736K17972F7229K73251f1396o3211c0897D8275J6912J18396
17517A83583P5998a04641B9799a5800A01954j0471R1539J7857h3382A28964E3391
17505A28073b6063A35939a15641C01174p8982r0335h3134A20529N7515C4496J55238
17494A89734b20872B13467f2366k9794B1656M7293j9149Q5971e9517B49320q9958
17483A59362B1947e62A47563J45842p2098M4099i0491A56148b03858B68684I4776
17471B63816N9700R9456A53897A4839n877N9182f9996j84287m9517a14845B59444
$$ y = [-250704, -40777, 179865, 36730, 64462, -84976, 166183, 160823, 167178, -137016, 28249, 98101, -195271, -93278, 297663, 215968, -59952, -113292, 226331, 228488, -31386, 205427, -61911, 69532, 124305, 121569, 339541, 67229, 340480, -61396, -124607, -30897, 48275, 65187, 183583, 259581, -104641, 29799, -15800, 101954, 91483, 183022, 200879, -83382, 128964, 53391, 128073, -26063, 135939, -115641, 301174, 222192, 131857, -83134, 120529, 178044, 34496, 189734, -220872, 213467, -62366, -92160, 21656, 68949, 49800, 135771, -59517, 249320, 159362, 21947, -562, 147563, 293405, 221307, 265406, -90491, 156148, -203858, 268684, 94776, 263816, 323516, 422972, 153897, 14839, 8962, 68144, -69996, -254283, -303800, -114845, 259444]
17459A5303b17534D96255a79556E6326J29353b49201A85695J85668L4540q5738
17449C20165r8136B9391N54395A15152J01313J53948j47111f8197D15998o2936
17439C53062m2905j43020R8962J19255j21708r8110n5351l4217K85277A69410
17428B2547c1353O55A38159g9487C17785j47954K85378A6639K12365M6005L27494
17417F02503A71214K28351q7232r2561p4908M93232B55214H0943L36158E6806
17406B71164a23217H02K04048q7661K14025F0816K5108F216L86267d44494B08104
17394b56637C53538B508a5825j83308B93661F6661M50042B28859C5854R405J94108
17383B39367j1554C9838Q7846D2201l443R9034f1616k37317A19039E4642J91063
$$ y = [15303, -217534, 496255, -179556, 56326, 185679, -249201, 185695, 371363, 405903, 320165, 222029, 29391, 583786, 115152, 216465, 370413, 223302, -68197, 415998, 353062, 310157, 167137, 266099, 385354, 263646, 165536, 110185, 75968, 361245, 169410, 22547, -31353, -30698, 138159, -79487, 317785, 169831, 455209, 16639, 229004, 275009, 602503, 171214, 399565, 312333, 219772, 144864, 638096, 255214, 80943, 417101, 56806, 271164, -123217, 802, 204850, 117189, 331214, 60816, 85924, 6216, 392483, -444494, 208104, -256637, 353538, 2508, -15825, -199133, 293661, 66661, 516703, 228859, 35854, 45259, 239367, 227813, 39838, 127684, 42201, 38758, 137792, -61616, -298933, 119039, 54642, 245705]
17372B45705J63364q8880A49421Q175J97193j67807a9263j37509A85046F4521
17361B66444I31K9866K58167G0915j9638J32415a97357C47277J59769j88482G4551
17349C43887A40835k6796K33452c67839a09508j28870A9027J67389C9842J97524
17339B37366o5816b5968D67648j92261c81679A28705B4287K1157L1945C4328P5534
17328A09862d7974C54240j22847b9405E2765J95639c9077A7846M41198B07529
17317c5405H0599j659a92728A69775N2104a28866B1068K13199E3985R6622K29369
17306C79976c8111B24151f8287n0290a5399E9406a12542B54983j15801a4828k197
17295a7025E05747A07072j7962B6082O8160a79785B07122C1975M0405J05052L2806
$$ y = [245705, 409069, 320189, 149421, 157596, 354789, 186982, -19263, -156772, 185046, 64521, 266444, 931, 30797, 288964, 70915, 51277, 183692, -197357, 347277, 507046, 318564, 74551, 343887, 140835, 114039, 347491, -367839, -109508, -238378, 19027, 186416, 39842, 237366, 171550, -25968, 467648, 275387, -381679, 128705, 24287, 45444, 77389, 34328, 109862, -47974, 354240, 231393, -29405, 52765, 248404, -39077, 17846, 459044, 207529, -35405, 80599, 78940, -192728, 169775, 221879, -128866, 21068, 234267, 53985, 150607, 379976, -38111, 224151, -68287, -118577, -15399, 59406, -112542, 254983, 139182, -14828, -17025, 505747, 107072, 89110, 26082, 94242, -179785, 207122, 31975, 72380, 177432, 210238]
17284B10238G689N2459L8997K42418c2187b620j90278B90670i402B4854K18937
17273B43791r4181O6505H4700b0078B02311K02778D0413J34698L79799A83890
17262a7738o026A02915K07974c47745A72663n9359m5400C1757a46772B36494m1359
17251A95135c33699B72104L7459H2666K91854e473K352C05104O494o3708R5074
17240C42964j65438n2127l9930L436a43936B76959J10952i5973A54509J29792
17230B84301I8861J28974a74966L3732B22142k6693p438j3633G1851N67287E5598
17218C623J39878F4587K3643J71283k5094E5571O087M76582A43630m6167L59776
17207D57239B15012J50976j64172J77713j64724J09032p6852K28768j57510M757
$$ y = [210238, 7689, 60148, 99145, 341563, -32187, -2620, -192898, 290670, -9402, 24854, 243791, 149610, 216115, 84700, -20078, 202311, 405089, 40413, 175111, 554910, 183890, -17738, -23764, 102915, 310889, -347745, 172663, 113304, 67904, 31757, -146772, 236494, 195135, -333699, 272104, 309563, 82666, 374520, -5473, -3121, 305104, 311598, 247890, 342964, 177526, 125399, 85469, 88905, -143936, 276959, 387911, -95973, 154509, 284301, 98861, 227835, -174966, -141234, 222142, 195449, 188011, 174378, 71851, 639138, 55598, 3623, 143501, 64587, 88230, 259513, 234419, 55571, 61658, 538240, 143630, 97463, 457239, 215012, 365988, 201816, 379529, 214805, 323837, 246985, 475753, 318243, 323000]
17197C23000K34826C2604N44886a83804I9849N5331m3788n243J2622J57061c264
17185d9044B58902b9876F0935a16844B5926L23242m2808I6450J59143e6975B64174
17173D10159c173B23351K30922B03048a7282G7040J68548K7859J23265D9918g2372
17161D19484j00597J06225A2022L88513A46630K28160i2612C59412r6604c9013
17150B98564j46583L58656A30336K10605P409I6495K10292A02225M82013H1008
17139B96164B6477N04301j20980A29593J90852R3351j69959N88607B06320M4535
17129B50855P4420o7334P3i4149C11686M0009A29154l30L99750j13703M3974B5209
17116C06935O4462J66574j13850j02547J8102j3720K57505B15158j07253J33286
$$ y = [323000, 557826, 32604, 577490, -183804, 99849, 155180, 111392, 106149, 118771, 275832, -3264, -49044, 258902, -29876, 60935, -116844, 25926, 349168, 306360, 96450, 255593, -56975, 264174, 410159, -3173, 223351, 454273, 203048, -17282, 77040, 245588, 273447, 396712, 49918, -72372, 419484, 318887, 425112, 12022, 400535, 146630, 374790, -92612, 359412, 262808, -39013, 298564, 151981, 510637, 130336, 340941, 348350, 96495, 306787, 102225, 584238, 81008, 296164, 26477, 530778, 409798, 129593, 320445, 413796, 243837, 832444, 206320, 250855, 325275, 257941, 258014, -94149, 311686, 351695, 129154, 128824, 528574, 414871, 458845, 25209, 306935, 371397, 537971, 424121, 321574, 339676, 325956, 583461, 215158, 107905, 241191]
17106B41191o5073J60245l8564K32499k27032g1957E42634N4536j83217j25754
17096B88199N8431J30363k08123R4097j27132m2686o0019K61248Q5685k32671
17086B47392L19495j81791j15160A16138K79013R1650j88110k542J10124K39456
17076F45729O297q6566j2395j74324j39336J92712j92100L21045G6405M45352
17066E21757C7718K15957n4969J58414k650K28228j9222m3734A73494N96120k33354
17055E36260B51173K42682j54504J40651J0585J2359L8440j85052m380J92315
17045E44269J0860k45996K93722o9417d8867D20174K24023K06533j6621l92582
17035D41527M58843B52156J42499K20354j09809K54106j789B59234K04619A45213
$$ y = [241191, 176118, 336363, 297799, 530298, 303266, -71957, 542634, 597170, 413953, 288199, 346630, 476993, 268870, 362967, 235835, 193149, 133130, 394378, 480063, 247392, 566887, 385096, 269936, 116138, 395151, 486801, 298691, 296149, 406273, 645729, 652026, 565460, 553065, 378741, 239405, 432117, 240017, 561062, 76405, 521757, 37718, 253675, 198706, 357120, 354470, 582698, 563476, 519742, 173494, 769614, 536260, 251173, 493855, 339351, 480002, 490587, 502946, 541386, 356334, 351954, 544269, 555129, 309133, 602855, 533438, -48867, 420174, 644197, 850730, 834109, 441527, 900370, 252156, 394655, 615009, 505200, 759306, 757517, 259234, 463853, 145213]
17024D39331K11347k42999J56M24390j16472Q2793L5389k43658R5880P3415m7759
17013G11813k08363m3731K04969j42204K17790P4582B15605M87766M5192j66873
17003E81690P4759K03784j74029J55208l06328J09976L03108j90394n964l68061
16993C83749N01844l05381J6373J7234p50K45170K15008D15348J06700L18517
16983H40565l6600j13715N3976j7627j96899L72887k06600o1822K38304l62945
16973E09524L64497j27504k03395J15362J27141J52024j35436r6510r487L54603
16963A050819r7587m55814L88157M69800k05216j94950O0485o111l64431N32444
16953A177596n16010M29286p4901k90077p630L08372k5396M3043m19762L92726
$$ y = [439331, 650678, 407679, 407835, 832225, 715753, 798546, 833935, 590277, 686157, 759572, 711813, 503450, 459719, 664688, 522484, 740274, 814856, 215605, 703371, 748563, 581690, 656449, 860233, 686204, 841412, 535084, 645060, 948168, 757774, 751810, 383749, 885593, 580212, 596585, 613819, 613069, 858239, 1073247, 415348, 522048, 840565, 803965, 690250, 744226, 726599, 529700, 902587, 695987, 634165, 872469, 509524, 874021, 746517, 543122, 658484, 785625, 937649, 802213, 705703, 696216, 1050819, 953232, 497418, 885575, 1355375, 1150159, 955209, 1015694, 1009583, 645152, 1177596, 661586, 1090872, 1015971, 725894, 718264, 1026636, 1001240, 1044283, 624521, 1017247]
16943A017247r0223j46763J89032J80822N402l50325M05386k00612j36825N65517
16933A438658n97570K61919M120R1941l92772M06856J86164q7130j08087J43703
16923A347802j05888j76336J96752l6983J15527P1259M072K67675n69082J23812
16913A238610N0669L05886l85606L14857k63871K43449q8718L65874n38217O9119
16903A312052K013j82130K25168J66861K67426l32445J48890L16317m85486L17656
16893A756322k10318K42546Q3314j86248p5427J01052K60910k28312K37618j01142
16883A880315n122K7761l70795M84140L34512l42885J16813k07064O6718K54153
16873B238546J15226k63654n4750M02264n86374L96832p182M14917k22329j15370
$$ y = [1017247, 927024, 780261, 969293, 1150115, 1155517, 805192, 1210578, 1009966, 873141, 1438658, 841088, 1103007, 1107127, 1199068, 806296, 1213152, 1399316, 1312186, 1204099, 1347802, 1241914, 1065578, 1262330, 1225347, 1340874, 1412133, 1416205, 1683880, 1114798, 1238610, 1289279, 1595165, 1209559, 1524416, 1260545, 1503994, 1415276, 1781150, 1242933, 1312052, 1314065, 1131935, 1357103, 1523964, 1791390, 1458945, 1607835, 1924152, 1438666, 1756322, 1546004, 1788550, 1871864, 1685616, 1610189, 1711241, 1972151, 1743839, 1981457, 1880315, 1875193, 1902954, 1532159, 2016299, 2350811, 2007926, 2124739, 1917675, 1984393, 2238546, 2353772, 2090118, 2035368, 2437632, 1851258, 2248090, 2240908, 2655825, 2433496, 2318126]
16863B318126K841K3563R3159P8557j65032L21082l9029j74286J85270J09693
16853B753944k53437K09170j67388K70963O4670J19381J68733k52876K61032Q0151
16843C254343k21039K09861p6204K45145M8212r2741J45863l48919N72896p2438
16833C664979J17676M29875o42281J54060K18522J62697J76266j34168o4611K04651
16823D287666J52688L29699m45438P31128O1875l33796K65548r4821O084J97817
16813E158450L6987M21328j46152K80627K17415j14155M79806k41537M44947q9379
16803F448337m8969M01223L45688q7912P2581L12190L0009K7157L34268R6544
16793G931116J64254L65758J61342J38054M23689j37075O68667K02809J96399
$$ y = [2318126, 2320967, 2344530, 2437689, 2516246, 2351214, 2672296, 2633267, 2458981, 2644251, 2753944, 2500507, 2709677, 2542289, 2813252, 2877922, 2997303, 3166036, 2913160, 3174192, 3254343, 3033304, 3243165, 3166961, 3412106, 3460318, 3367577, 3513440, 3164521, 3737417, 3664979, 3782655, 4212530, 3570249, 3724309, 3942831, 4105528, 4281794, 4147626, 4083015, 4287666, 4440354, 4770053, 4324615, 5055743, 5117618, 4783822, 5049370, 4954549, 4960633, 5158450, 5195437, 5616765, 5470613, 5751240, 5968655, 5854500, 6334306, 6092769, 6537716, 6448337, 6399368, 6800591, 7146279, 7058367, 7130948, 7443138, 7473147, 7500304, 7834572, 7931116, 8095370, 8461128, 8622470, 8760524, 9184213, 9047138, 9715805, 9918614, 10115013]
16784A0115013L15483N27014l1143K98037P27603M11779K38025L37644M57067
16775A3396522K85117K18062P64968O17471N99512M15429L08491O98349N94521
16766A7898442R06205N47578R19865N13500Q10341J139831Q12284J263928J008048
16757B5820022J115390J281812J139810J451705J556996J519719J745487J685190
16749C7316131J947713J786247K333075K472507K400553K967759K683267L440987
16741E7348239L247586L748448L996688M410513M780281M930193N787533N899343
16733I4148824N873756O767341P154555P672877P809264Q335166Q376715Q969865
16725A55108363Q617021Q667973Q041501P818945O523411N340304L986214K420234
$$ y = [10115013, 10430496, 10957510, 10926367, 11224404, 11952007, 12363786, 12601811, 12939455, 13396522, 13681639, 13899701, 14664669, 15282140, 15881652, 16297081, 16605572, 17303921, 17898442, 18804647, 19352225, 20272090, 20785590, 21595931, 22735762, 23548046, 24811974, 25820022, 26935412, 28217224, 29357034, 30808739, 32365735, 33885454, 35630941, 37316131, 39263844, 41050091, 43383166, 45855673, 48256226, 51223985, 53907252, 57348239, 60595825, 64344273, 68340961, 72751474, 77531755, 82461948, 88249481, 94148824, 100022580, 106789921, 113944476, 121617353, 129426617, 137761783, 146138498, 155108363, 163725384, 172393357, 180434858, 188253803, 194777214, 200117518, 204103732, 206523966]
16717B06523966Q49159m15289k533873l576159n248064o223197p385854q038089
16709A73952600q509437q630592r071162q233049q862875q022487p730620p482710
16701A07409668p141184o496925n884614n701336n178747m758495m758791m002823
16693F3486753m160707l303039l230704l097037k822122k377071k337583k433057
16685C9725433k055302j709480k093735j396356j688418j435427j289227j499595
16677B6557893r84823j080041j079767j067106r81817q92922p80713p11117k77861
16668A8701726j118663o47227r10297j80489p08709l04960p72692n70268j32636
16659A3355785o69382l32986o16263l28370l48937j16017k56213o66039l41765
$$ y = [206523966, 207373125, 206957836, 204423963, 200847804, 195599740, 189376543, 181990689, 173952600, 165443163, 156812571, 147741409, 139508360, 130645485, 122622998, 114892378, 107409668, 100268484, 93771559, 87886945, 82185609, 77006862, 72248367, 67489576, 63486753, 59326046, 56023007, 52792303, 49695266, 46873144, 44496073, 42158490, 39725433, 37670131, 35960651, 33866916, 32470560, 30782142, 29346715, 28057488, 26557893, 25573070, 24493029, 23413262, 22346156, 21364339, 20471417, 19690704, 18979587, 18701726, 17583063, 16935836, 16025539, 15845050, 15136341, 14831381, 14058689, 13488421, 13355785, 12686403, 12353417, 11737154, 11408784, 11059847, 10943830, 10687617, 10021578, 9679813]
16650I679813k12374k82133p737o65099R7311o62795L7946k53462J76728m53100
16640G455098n5185n7533n87795q9985k65110J34814j97370p6424j25343l55142
16630E780025o5302m20014l90845K85226k0933k71333K115L2101k62450O1492
16620D730082j57088k05339j85457k22347J30026k23973N2j6066K13662n19784
16610C543768L27684k20689m15062J82364l06283M40654l83692J38859j91059
16601C116544k41083J82467j14079j37518j9136N6921j60783j8502j34369o6613
16591B463849O7920r8565M3536j37227r4347k38663N74180n29547J60604J08597
16581B320337r8624j03721Q852j21126k74566L35969r9257m0456N8227r2639j49166
$$ y = [9679813, 9467439, 9185306, 9177569, 8512470, 8609781, 7946986, 7984932, 7731470, 7908198, 7455098, 7399913, 7342380, 6754585, 6664600, 6399490, 6534304, 6336934, 6260510, 6135167, 5780025, 5714723, 5294709, 4903864, 5189090, 5168157, 4896824, 4898939, 4931040, 4668590, 4730082, 4572994, 4367655, 4182198, 3959851, 4089877, 3865904, 3865956, 3849890, 4063552, 3543768, 3871452, 3650763, 3235701, 3418065, 3111782, 3552436, 3168744, 3307603, 3116544, 2875461, 3057928, 2943849, 2806331, 2787195, 2844116, 2683333, 2664831, 2530462, 2463849, 2531769, 2433204, 2476740, 2339513, 2245166, 2006503, 2580683, 2051136, 2211740, 2320337, 2221713, 2117992, 2126844, 2005718, 1731152, 2067121, 1967864, 1927408, 1985635, 1892996, 1743830]
16570A743830K2780K21082q4887j17348k25404J73192K5864l3993O3293l75393
16560A413016J52747R9705j40775R1863m90937M36429q5096J76313M9230k20740
16550A481755l85319L02683L43755l20032r2109O144j9178k53062L22868j49812
16540A237693l02221J94279j27755J36985l2838k21296L04721j62292p1707k6770
16530I28799M7746P9415j72761K50377l51701J48551m6241J94031p3251j90506
16520H14459J54800l7265k86775K3363K21130L92031k16041r3753l29879K75208
16510I17278R5334k13064J5210L29993j14470k62204J04761o4699j39979J07089
16500G75249n3328K68144k29866k11865j44206L00227j7874Q792o9243M3804K64525
$$ y = [1743830, 1766610, 1987692, 1902805, 1785457, 1560053, 1733245, 1759109, 1725116, 1788409, 1413016, 1565763, 1665468, 1524693, 1616556, 1125619, 1562048, 1476952, 1653265, 1702495, 1481755, 1096436, 1399119, 1742874, 1422842, 1330733, 1336877, 1317699, 1064637, 1387505, 1237693, 935472, 1129751, 1001996, 1138981, 1106143, 884847, 1189568, 1027276, 955569, 928799, 976545, 1055960, 883199, 1133576, 781875, 930426, 884185, 1078216, 1004965, 814459, 969259, 931994, 645219, 668582, 889712, 1281743, 1065702, 971949, 642070, 917278, 1012612, 799548, 814758, 1144751, 1030281, 768077, 872838, 808139, 668160, 775249, 721921, 990065, 760199, 548334, 404128, 704355, 686481, 695273, 626030, 669834, 934359]
16489I34359l40704o5363k40266N51162K84519l27096j5719M9028k73317J99357
16479G55960J14524C60817r9859L01752J38954p9716j91288M82171m16432M02980
16469H99379j51010j45415l0826r3033k126P9364J4220k0360K3931L02577D26362
16457C70535L23851l7855J4516j86432q5693k3505J29690Q9905k59029j54554
16447A81429L06835o7071J09084o3504K2228J41026j31114B36889L76104A84076
16436B67423K10495m3980r4644n4583K46729m4763j33537o5153J94222A17470
16425B94401A42430Q3175j01033L35045J05886n1771J12063B22560r2019O3232
16415A93773J62199j48669J39194A9225K25387J22454K19782B82846n2340P0017
$$ y = [934359, 593655, 528292, 288026, 839188, 1123707, 796611, 780892, 829920, 556603, 755960, 870484, 360817, 260958, 562710, 701664, 621948, 430660, 912831, 496399, 899379, 748369, 602954, 572128, 479095, 476969, 556333, 570553, 550193, 574124, 876701, 426362, 370535, 694386, 656531, 671047, 484615, 398922, 375417, 505107, 595012, 335983, 181429, 488264, 421193, 530277, 466773, 489001, 630027, 498913, 236889, 612993, 184076, 267423, 477918, 433938, 339294, 284711, 531440, 486677, 353140, 287987, 482209, 117470, 294401, 142430, 225605, 124572, 459617, 565503, 513732, 625795, 222560, 130541, 193773, 355972, 207303, 346497, 19225, 244612, 367066, 586848, 282846, 230506, 300523]
16405C00523K12455j31459j63907E4144j1966L39049K2305j5027C6138L46733
16395C82871K0972A25737j9383K52365j57752K97913q7363p4850J14373A94195
16384C51912j52263A8831L63676j63584o0297L0757a49648E24807A85895K54218
16374D40113a21295C32520H99M65956j67603o8417l561o1686L66624B14677J66879
16363C81556k3252j729n0095k5796H8538N56158k73034A9600M46788j27322o3545
16352B75521G3703d7983D078J81178b3968A06441a57830A04315D0585J96169J41785
16341C78539n1304n7048h1217C93452A05661a96711d6562C71934j67688J4499
16331B18745e2688A3380L72498a64337B41453J62449E2273P2865K6491M9545p8636
$$ y = [300523, 512978, 381519, 217612, 54144, 42178, 381227, 403532, 388505, 36138, 382871, 403843, 125737, 106354, 358719, 200967, 498880, 411517, 336667, 451040, 194195, 351912, 199649, 18831, 382507, 218923, 158626, 189383, -149648, 524807, 185895, 440113, -121295, 332520, 899, 466855, 299252, 230835, 227274, 165588, 532212, 214677, 381556, 358304, 356575, 306480, 280684, 88538, 644696, 371662, 19600, 466388, 339066, 275521, 73703, -47983, 4078, 185256, -23968, 106441, -157830, 104315, 40585, 236754, 378539, 327235, 270187, -81217, 393452, 105661, -196711, -46562, 371934, 204246, 218745, -52688, 13380, 385878, -164337, 241453, 403902, 52273, 125138, 151629, 201174, 122538]
16320A22538K52799c4214j18801c6628A67224a8721A78022D744J5698J30607m3535
16309A07514D4383J72361E0842J40732F3776J24330f796k9625m3483j3724a0129
16297B80459F061L77307f5709A36500L01735A14971j1658a3524D82340B9734f1170
16285g8663C32447j4053c0487A87272p3759a04530B50940K6039N9002b36174A78069
16273i468B68260o420E2256K10675e4392A88566J6514M7576p9033F2528a35628
16261I5017k0742J2618c3613A38367N8780k9316f2077I8863g6257j24303A2075
16249F3988h789B98967H8756K57133j33512p4756n3568L515J09346I2911D5569
16237H1565d8798m345l9448J5769B3548M1193c34200F3100C0319d1121l81873
$$ y = [122538, 375337, -34214, -153015, -36628, 167224, -18721, 178022, 4744, 20442, 151049, 107514, 44383, 216744, 50842, 191574, 63776, 188106, -6796, -36421, -79904, -93628, -10129, 280459, 6061, 383368, -65709, 136500, 438235, 114971, 103313, -13524, 482340, 29734, -61170, -78663, 332447, 318394, -30487, 187272, 113513, -104530, 250940, 276979, 335981, -236174, 178069, -9468, 268260, 261840, 52256, 262931, -54392, 188566, 205080, 252656, 173623, 62528, -135628, 95017, 74275, 86893, -33613, 138367, 197147, 167831, -62077, 98863, -76257, -200560, 12075, 63988, -8789, 298967, 88756, 345889, 212377, 137621, 84053, 87568, 196914, 92911, 45569, 81565, -48798, -53143, -92591, -76822, 23548, 64741, -334200, 63100, 30319, -41121, -422994]
16226d22994E8993c4836m044F9755h596A04154e6615C26773i116B00896e0640
16214A39072d3979I9977D9416L8111h2970G8989M409c686B46755J44201A83438
16202a15370A21192c03889A15635g2959m7062I9869m0296b4333m8068b6257A24314
16190A89902d2033H3682K14266p3209b3944F8037J37013o6033b77463A46283O3794
16179B10077C3102r266L1322K50089f9614A7469K25875h8154L2947n2608A28900
16167d2020B17591p7645C677g5265n693B77839B5614K2289J86083H1103d1884
16155D9453j5746J98275G7791p347K97649j02934l4815E0774a09099k0126A9199
16143a77496C09274H8611D2990K08641c08253B85361h9726B42166b54924b4216
$$ y = [-422994, 58993, -34836, -38880, 69755, -8596, 104154, -56615, 326773, -9116, 200896, -50640, 139072, -43979, 99977, 49416, 87527, -82970, 78989, 83398, -3686, 246755, 390956, 183438, -115370, 121192, -303889, 115635, -72959, -120021, 99869, 59573, -24333, -72401, -26257, 124314, 189902, -42033, 83682, 297948, 224739, -23944, 68037, 205050, 139017, -277463, 146283, 210077, 33102, 23836, 55158, 305247, -69614, 17469, 243344, -88154, -55207, -107815, 128900, -42020, 217591, 139946, 3677, -75265, -80958, 277839, 25614, 47903, 233986, 81103, -41884, 49453, 33707, 231982, 77791, 70444, 368093, 265159, 230344, 50774, -109099, -129225, 19199, -177496, 309274, 88611, 42990, 251631, -308253, 285361, -89726, 242166, -254924, -24216]
16132A01500a32666M8720A46535a02527j08055B01816c32332A55888J2431b93629
16121b83878P3660A46153L2386a76111d3904k16686a6648j94693G8171b7136A97624
16109h5765A59196a97380i3472C80447a9820p5089l3032B85068A31016F5219b75213
16097h2070D5079A1567g1634G8733C8053J63160b28103E141J0429a54719b6885
16085a69407A049Q597a90243j0521p5309I920a68428g3804C1118c78260B02990
16073f4860n3319M7369p4089A45433o8021h7273A30851i288A18660a07286B11586
16061h1423k50690I2994l7483f4597B21073a80870b898j19806k33663B28341a45460
16049F5858J62377i0581O537H1101I324a68465h3652k2483k7825B8198g2851b8058
$$ y = [101500, -132666, -83946, 146535, -102527, -210582, 201816, -332332, 155888, 168319, -293629, -283878, -210218, 146153, 178539, -176111, -43904, -260590, -16648, -211341, 78171, -27136, 197624, -85765, 159196, -197380, -93472, 380447, -19820, -94909, -127941, 285068, 131016, 65219, -275213, -82070, 45079, 11567, -71634, 78733, 38053, 201213, -228103, 5141, 15570, -154719, -26885, -169407, 1049, 9646, -190243, -200764, -276073, 9920, -168428, -73804, 31118, -378260, 202990, -64860, -118179, -70810, -144899, 145433, 77412, -87273, 130851, -9288, 118660, -107286, 211586, -81423, -332113, 92994, 55511, -64597, 221073, -180870, -2898, -122704, -356367, 228341, -145460, 65858, 228235, -90581, -84044, 81101, 9324, -168465, -83652, -106135, -133960, 28198, -72851, -28058]
16036a32032C9187P7824a01057A36685j8527N6707p9014m0804a2176A46663c00376
16024e02313b51076C68569j35048b08437P8688j68617R1880C20668H5931a01442
16013e2339j8937D8844a36333j2944j59108H8732J02495B1939g0705D684J36958
16002A41642l768b6483l28407A70767c72988a56410f919q5567J2017k8799j33936
15991b43204A19854l8726M9547b88251b5806k21672c8640B19418p9449a3855H9956
15979B01511I3894b44262B45835f952l36964A6232f3884B65648d39331B23739
15968a24393A08314B8708a96801a7525E1234A6372d4632A68027n5402A7854o335
15957A1519a01979A46820i6647d2416D98a21987j2916j33542J05441j55828K386
$$ y = [-132032, 39187, 117011, -101057, 136685, 118158, 174865, 95851, 55047, -12176, 146663, -300376, -502313, -251076, 368569, 233521, -208437, -129749, -298366, -206486, 320668, 85931, -101442, -52339, -71276, 48844, -136333, -149277, -308385, 88732, 191227, 21939, -70705, 4684, 141642, 137874, -26483, -354890, 170767, -372988, -156410, -6919, -92486, -80469, -109268, -243204, 119854, 81128, 130675, -288251, -25806, -247478, -38640, 219418, 139969, -13855, 89956, 201511, 93894, -244262, 245835, -6952, -343916, 16232, -63884, 265648, -439331, 223739, -124393, 108314, 28708, -196801, -17525, 51234, 16372, -44632, 168027, 112625, 17854, 11519, -101979, 146820, -96647, -42416, 498, -121987, -134903, -268445, -163004, -318832, -316446]
15946c16446i4477d5115d783j10909g365D1151f4908j14278j68011B15847f1158
15934A35727f3378k85525H0190n253k8615N9331d2539k36588A56266i6466H6301
15922I7664d1637k71686d6397j87573a2315m0251j2449n5887e4153G1468L2537
15911A04005D8789i2275b4314j62412j1989B9079K7159b23496B93342a11084C2949
15899A86563D363a82928k44263F9821a94797A63654b21975N3360L8003A63790
15888b6170C7539i1527A39588a75814B3061a66264M8510d9567E7269k0251N2792
15877H9810J25391N8302m4477E8709a9766A37916a53985B25557e896D0793a95874
15865b05064h7272q1638C8215b01997H9280O0262f725k01345n9391e6400j80802
$$ y = [-316446, -94477, -45115, -4783, -115692, -7365, 41151, -64908, -179186, -347197, 215847, -61158, 135727, -63378, -348903, 80190, 74937, 46322, 105653, -42539, -279127, 156266, -96466, 86301, 97664, -41637, -313323, -46397, -233970, -12315, -52566, -65015, -120902, -54153, 71468, 104005, 48789, -92275, -24314, -186726, -198715, 29079, 56238, -223496, 293342, -111084, 32949, 186563, 4363, -182928, -427191, 69821, -194797, 163654, -221975, -168615, -130612, 163790, -26170, 37539, -91527, 139588, -175814, 23061, -166264, -117754, -49567, 57269, 37018, 89810, 215201, 273503, 229026, 58709, -19766, 137916, -153985, 225557, -5896, 40793, -195874, -205064, -87272, -168910, 38215, -201997, 89280, 149542, -6725, -208070, -267461, -56400, -237202]
15854b37202A00210M0972F0340d3831l26522o4455B91780C5101P245L02921G5661
15842g2628J9697E147M2886Q7018F7263a6924A21645a7554j19585n0076H6990
15830C4753c46597J62510e458m942k9372G5824J1798i5807A80756b0723j88583
15819b09306J3352C2534g9018o4666n4784p8205D6983J51435b89651J11636a6116
15807b38793A18331E6878c18629B00117a19853d0163A31534d55814a13544C6781
15796a6391j01453k38031A60067n4366c41570J49205f0672G4089c12458A99590
15785a43551A7717c527A03804d2322A69166l7090b42053c7369l73893J89604g9076
15773g8824r4547H495a23740j33809O4274I7854b8470E1580a10271J0412d6393
$$ y = [-237202, 100210, 141182, 60340, -43831, -370353, -434808, 291780, 35101, 42346, 345267, 75661, -72628, -52931, 5147, 48033, 135051, 67263, -16924, 121645, -17554, -137139, -187215, 86990, 34753, -346597, -184087, -5458, -10400, -39772, 75824, 87622, -95807, 180756, -20723, -209306, -195954, 32534, -79018, -143684, -198468, -276673, 46983, 198418, -289651, -178015, -16116, -238793, 118331, 56878, -318629, 200117, -119853, -40163, 131534, -455814, -113544, 36781, -16391, -117844, -355875, 160067, 105701, -341570, -192365, -60672, 74089, -312458, 199590, -143551, 17717, -3527, 103804, -42322, 169166, 132076, -242053, -37369, -411262, -221658, -79076, -78824, -173371, 8495, -123740, -257549, -193275, 97854, -28470, 51580, -110271, -99859, -46393]
15761a57749A58438i5511C7715O6682h7167A75030c22962B57180b14580N6341
15751a58239F6874A701K92436I6041f2p8270c1064l79544a22885c8990C19954
15739a01565A4292J25862a0291j57788N100g2928C75964a8289A90075a83745d2715
15727a40035r3936n8175a01802A10153b91119D2248K8037i2629A15571a83501
15716c2493k2378k06028B27665j02291b40657L9425k6284c3678o7149h447n0602
15705e9049A28143h1901k58403d986F2329A0517c6816C320J80470a0841G0318
15693c9213C0777a03734A87973a67233A1699d66124e2292l43368I787J51430o2950
15682I8267J44432D8886a8173j63550A03572O386E0422b20018e7898G5746B4342
$$ y = [-157749, 158438, -95511, 37715, 104397, -87167, 175030, -322962, 257180, -214580, -158239, 66874, 1701, 294137, 96041, -62, -78332, -31064, -410608, -122885, -38990, 319954, -101565, 14292, 140154, -10291, -168079, -162979, -72928, 375964, -18289, 190075, -183745, -42715, -140035, -233971, -292146, -101802, 110153, -291119, 42248, 70285, -92629, 115571, -183501, -32493, -54871, -260899, 227665, 125374, -240657, -201232, -227516, -33678, -100827, -8447, -59049, 128143, -81901, -340304, -4986, 62329, 10517, -36816, 3320, 183790, -10841, 70318, -39213, 30777, -103734, 187973, -167233, 11699, -466124, -52292, -395660, 9787, 161217, 98267, 242699, 48886, -18173, -181723, 103572, 109958, 50422, -220018, -57898, 75746, 24342]
15670B11016a46770A6748h720A658a9263l09574e9834o3023F993L3304M3259d8954
15657d00851N4412J21408B43275b99101B12087b00398I529J71673b67019c4009
15646B8913a64200M2230a9608B01770I1809A1312O6727J82965A3038c2202k38237
15635b70439G2865a26762A41018f31841C73834A9090d5201A6256N844K48619d8327
15623A16750J01875G2849a10080G1808J98536A34993g0211J9767H1526l9163A2854
15611B58589f6941j60677k3925A21565J44034A7681b58282A66666g6085k21804
15601b97889B6926b03855A34987O47d4238A61795c3704a3257q7848D9713a2447
15589b22023D9261J97668E1214J9625A8144K82683J73570E3288A8366i4842j21704
$$ y = [211016, -146770, 16748, -8720, 1658, -19263, -328837, -59834, -122857, 6993, 40297, 83556, -48954, -400851, -346439, -225031, 243275, -299101, 212087, -200398, 9529, 181202, -267019, -34009, 28913, -164200, -121970, -19608, 201770, 91809, 11312, 78039, 261004, 13038, -32202, -270439, 72865, -126762, 141018, -631841, 373834, 19090, -45201, 16256, 22100, 270719, -48327, 116750, 218625, 72849, -110080, 71808, 270344, 134993, -70211, -50444, 81526, 42363, 12854, 258589, -66941, -227618, -251543, 121565, 265599, 17681, -258282, 166666, -76085, -297889, 26926, -203855, 134987, 135634, -44238, 161795, -33704, -13257, -101105, 49713, -12447, -222023, 49261, 246929, 51214, 70839, 18144, 300827, 474397, 53288, 18366, -94842, -216546]
15578b16546D8813a18836B22831c68121g2833F9520J32811B6102M996M05905d6871
15566B72409j6782b11906B16905a45304B09566h3466a3797A39908b39093O8175
15556a70918H1693C8416j3668N6945c7528q113l51226i5146K4864J0019j73935
15545b34198b9753k54577J41876C4J40904q943B7515a01267l7571o0096q0783
15534b79717b0655C94931A9394a30392B82859C5066J6319a67686D408f7700K4541
15523d3159o8450c9584A14775a66532j42774B40005i7779C5912J19089k6785j4588
15512A13628J91522j45686g6647A86730a5017p1943B29038F3691Q8318b88876
15501h5538D2305b19933I893L3239a7258C27641f8507A22316a42670J5354J9425
$$ y = [-216546, 48813, -118836, 222831, -368121, -72833, 69520, 202331, 26102, 31098, 437003, -46871, 272409, 255627, -211906, 216905, -145304, 209566, -83466, -13797, 139908, -239093, -170918, 81693, 38416, 24748, 81693, -37528, -45641, -396867, -95146, -70282, -60263, -234198, -29753, -284330, -142454, 34, 140938, 131995, 27515, -101267, -138838, -198934, -279717, -20655, 394931, 19394, -130392, 282859, 35066, 51385, -167686, 4408, -67700, -43159, -111609, -39584, 114775, -166532, -309306, 240005, -97779, 35912, 155001, 128216, 113628, 305150, 159464, -76647, 186730, -15017, -86960, 229038, 63691, 152009, -288876, -85538, 42305, -219933, 9893, 43132, -17258, 327641, -68507, 122316, -142670, -127316, -107891]
15490a07891c5674A71773b24635A7929c20463c0281A3351a7012e31k23535b9794
15478d3487C16980c328D6127Q6596M34834b15076E16350I8264m2898d2917B77656
15466E2361M4928b46592A82220c27907A49721b4520p4222b0824A1522K66584A30859
15454A41479a35560m7766D9483a93830B59983A21381b8247o9967D2420K8182b20415
15442b00823K5434E8064b34107P1456a1256j20797B268L39688H9817K42802E0349
15430G5254M579l213c57703D1376e0410a9106A79179e1702P72B3189b6634q42
15418b7476k83338B50508i092r1916m1258D1204K22053F9355J38059b82807A1047
15406b28792a0460B42849C3285i5904q7049B5480b0493b64l1752B26869a86635
$$ y = [-107891, -35674, 171773, -224635, 17929, -320463, -30281, 13351, -17012, -531, -224066, -29794, -43487, 316980, -3328, 46127, 132723, 567557, -215076, 516350, 98264, 55366, -42917, 277656, 52361, 97289, -246592, 182220, -327907, 149721, -24520, -98742, -20824, 11522, 278106, 130859, 141479, -135560, -183326, 49483, -193830, 259983, 121381, -28247, -98214, 42420, 70602, -220415, -200823, -175389, 58064, -234107, -162651, -11256, -132053, 2268, 341956, 89817, 332619, 50349, 75254, 79833, 76620, -357703, 41376, -50410, -19106, 179179, -51702, -50930, 23189, -26634, -27476, -310814, 250508, -9092, -101008, -142266, 41204, 263257, 69355, 207414, -282807, 11047, -228792, -10460, 242849, 33285, -95904, -182953, 25480, -20493, -264, -32016, 226869, -186635]
15394b41402D4442b70055a25115k16567R8777H7044C4321f1032F328L91504n3472
15383C44360I3102m053a24223k01597M6239B02212F5049g877B1619g691r0777
15372i8468j04011J7532O121j18900I5174a9734C1642a2289A27465o1812O4149
15361A29802o2411R0955C3610a87223f3409B03890b3426j10426G0580a54037A90382
15349a2607k03593e9704A69878b7550A22753m958N1426a88182O0941c762m0991
15338d4753a773o5270g662r8221n0167D19368b05730C3878K17486A2601a07455
15326a37446A78075a62010g7197p1190B38539A07226a68525J7306C68802A0709
15315A19385Q6935a37545K246j2537l228B32280a52943j14283F09520G2448j7852
$$ y = [-241402, 44442, -270055, -125115, -341682, -242905, 87044, 34321, -61032, 6328, 397832, 344360, 93102, 89049, -124223, -325820, -279581, 202212, 65049, -7877, 21619, -7691, -98468, -202479, -184947, -178826, -297726, 95174, -19734, 31642, -12289, 127465, 65653, 129802, 67391, 158346, 33610, -187223, -63409, 203890, -23426, -133852, 70580, -154037, 190382, -12607, -216200, -59704, 169878, -27550, 122753, 117795, 169221, -188182, -127241, -3762, -44753, -1773, -67043, -7662, -105883, -156050, 419368, -205730, 33878, 251364, 12601, -107455, -137446, 178075, -162010, -77197, -148387, 238539, 107226, -168525, -151219, 368802, 10709, 119385, 206320, -137545, -135299, -147836, -151064, 232280, -152943, -267226, 609520, 72448, 54596]
15304E4596M4745a42420K044A11046J48615B2954J34782M3476L95840A81546h4726
15292D47139G3788K1753J32264a40434B89303i7314P267C13840F6453b06190d9080
15280B5a27739A10009J03498J26196a07806J9095E8465a0103l89381f6848q3108
15269a49956f0017B82638j19798C0713h253D9271a83599Q2741A94584K81579j39100
15258C37063D8924L93804j41007b55877G6639J41343k8614j9783e1719C35174
15247A076108L53940k74038K96776j52843F48689k84577E5224K74931r7142K3118
15237B56131I7987k4711L0143J0381a90150E4128j3144a41869A98919j5047a66029
15225B5566L21057k222B9161b91085D25210a84624B78207b74212a1272H8511R8185
$$ y = [54596, 99341, -142420, -140376, 111046, 259661, 22954, 157736, 201212, 597052, 181546, -84726, 447139, 73788, 95541, 227805, -140434, 289303, -97314, -90047, 313840, 66453, -206190, -49080, 25, -127739, 110009, 213507, 339703, -107806, -88711, 58465, -10103, -399484, -66848, -149956, -60017, 282638, 162840, 30713, -8253, 49271, -183599, -100858, 194584, 476163, 337063, 48924, 442728, 301721, -255877, 76639, 217982, 189368, 169585, -51719, 335174, 1076108, 1430048, 1156010, 1452786, 1299943, 648689, 364112, 55224, 330155, 233013, 256131, 97987, 73276, 103419, 113800, -190150, 54128, 40984, -141869, 198919, 183872, -166029, 25566, 346623, 344401, 29161, -291085, 425210, -184624, 278207, -274212, -11272, 88511, 186696]
15214A86696A0258b83470G0109M94K87196m0634B3610J54300a00549j15694c3996
15202B85604a8206A29546R0277g7457l0276Q27k0694j38396A87121D7390J8471
15191F5861b6364j52260q4355a2719B67742m6846m4806b18950C9676b35914c6528
15179B36837b67626B81574n3327E8597K3593A4232L15662f5807C36385j21070
15169B15315l1885a44084C30863e7035G2111d6803B73649a16662j21151a195q4378
15158h5573B67472i3450E6475K16137h8034j08988B96045A43943f8079C9579R5494
15147A35073m654l2979h6648a435B33198a41967C9534J08773c68061B44478d924
15135B2625a4488C87663h5223B00249n1810K4091a72172j9467b2913A0172J31771
$$ y = [186696, 10258, -283470, 70109, 70603, 357799, 317165, 23610, 177910, -100549, -216243, -33996, 285604, -18206, 129546, 219823, -77457, -107733, -106906, -127600, -265996, 187121, 47390, 65861, -26364, -178624, -262979, -12719, 267742, 220896, 176090, -218950, 39676, -235914, -36528, 236837, -267626, 281574, 228247, 58597, 82190, 14232, 329894, -65807, 336385, 215315, 183430, -144084, 330863, -57035, 72111, -46803, 273649, -116662, -237813, -1195, -85573, 267472, -93450, 56475, 272612, -88034, -197022, 296045, 143943, -68079, 39579, 135073, 130419, 97440, -86648, -1435, 233198, -141967, 39534, 148307, -368061, 244478, -4924, 22625, -14488, 387663, -85223, 200249, 148439, 172530, -172172, -191639, -22913, 10172, 141943]
15124A41943A391L04251j38657p9693i5413L1401B54391a3498A84423D6587L99344
15113D45931f7214q4276D47054E4069L50406g3343B58515r514e178B1140K24110
15102B45250N1019m2407f0989B55918a71549k22605H8970J8605K44148b00396
15091a45719A12896J98868K02791A96784h8375D0717J22417e8013q1380E5656
15080G6845e73p8889A46215d0952A53577K90979c2970B11861j02958a10360B53305
15068e194B39210o0107l3339L00708G8347R9351K9667b3024A24846K29083J99530
15057E53459j95607A41886I498M8130L61718J34392q9963m5544A64176N5190J30416
15046C49782D4557M6089B4536K94342O3249E5507J07293a30982D72225j44460
$$ y = [141943, 1391, 305642, 166985, 87292, -95413, -64012, 254391, -13498, 184423, 46587, 445931, -67214, -151490, 447054, 54069, 404475, -73343, 258515, 249001, -5178, 21140, 245250, 296269, 253862, -60989, 255918, -171549, -394154, 88970, 107575, 351723, -200396, -145719, 112896, 311764, 514555, 196784, -88375, 40717, 163134, -58013, -139393, 55656, 76845, -573, -79462, 146215, -40952, 153577, 444556, -32970, 211861, 108903, -110360, 253305, -5194, 239210, 179103, 145764, 446472, 78347, 177698, 207365, -23024, 124846, 353929, 553459, 357852, 141886, 9498, 57628, 419346, 553738, 463775, 418231, 164176, 219366, 349782, 44557, 90646, 24536, 318878, 382127, 55507, 162800, -130982, 472225, 327765]
15036C27765A60656N7574L97379j55157H4214M8245R2612j953j0800N5897B4088
15024A91099K66224A65866p5991B337J79837D2175m297Q4459K52988A19337J4790
15013A34127N5783H8870B3702K54512J08527I6335J55022H2151L83805G8786K52973
15002C31759o8531J7960R1989D7727J11219J52647q4916j08779E2360O0091L1427
14991A43878J93948I8967C7855N16605e6734D00791n7164N77K23461G3462f1160
14979C16462L8010j01526A17956J49116c3475B61836M32427a90992C32449A41074
14968B88867r3317D5611J24546G7769K2877R0495F4336A2644L07117q4504K63839
14957D99096B04319q8321J54175A03852M87289B57409g7187C18757A14516b14616
$$ y = [327765, 160656, 218230, 615609, 460452, 84214, 132459, 225071, 223118, 212318, 268215, 24088, 191099, 457323, 165866, 89875, 2337, 182174, 42175, 37878, 122337, 375325, 119337, 134127, 189910, 88870, 23702, 278214, 386741, 96335, 251357, 82151, 465956, 78786, 331759, 263228, 281188, 373177, 47727, 158946, 311593, 226677, 117898, 52360, 112451, 143878, 337826, 98967, 37855, 554460, -56734, 400791, 343627, 344204, 567665, 73462, -61160, 316462, 354472, 252946, 117956, 267072, -33475, 261836, 694263, -190992, 332449, 141074, 288867, 195550, 45611, 170157, 77769, 100646, 191141, 64336, 12644, 319761, 235257, 499096, 204319, 115998, 270173, 103852, 591141, 257409, -77187, 318757, 114516, -214616]
14946D75142j62662A7772M69225A45530N9228K53320b022A13397n549n0313L59381
14935D16916k6082J4463p1459A2171M38482a67157A11617K89216q6469M233A03195
14923H9792L48680a13454D52746j12323A54221n7630R3631L2892K84499A79297
14912A88652J33808L0089N7104H0665M44090A60019J83047M1809j32627L20590
14902E72838G5175Q2388L17399a05712K4590C1190L64348O7988c77671A72365
14891D76859j0247j52235L51724j23184B13379h5184C89025k5840j62536L1109
14881B31758J32704j25149j8871M01079k87630m6004J05135A68787J24821K38291
14871E31899k06730J46379K0314o4888Q1418k47283r5316k0407J04856K53178
$$ y = [475142, 312480, 17772, 486997, 145530, 204758, 458078, -2022, 113397, 107848, 57535, 416916, 390834, 405297, 333838, 12171, 450653, -167157, 111617, 400833, 314364, 318597, 103195, 89792, 438472, -113454, 452746, 340423, 154221, 96591, 190222, 223114, 507613, 179297, 188652, 322460, 352549, 409653, 80665, 524755, 160019, 343066, 384875, 252248, 572838, 75175, 157563, 474962, -105712, -81122, 31190, 395538, 463526, -377671, 172365, 476859, 466612, 314377, 666101, 542917, 213379, -85184, 389025, 363185, 200649, 231758, 364462, 239313, 220442, 621521, 333891, 287887, 393022, 168787, 293608, 531899, 325169, 471548, 491862, 426974, 508392, 261109, 165793, 145386, 250242, 503420]
14861E03420k43888R9172j06538K95112j16000j69418K71779j72663J71835o3214
14851D69597k17967L62728k43249r1167a0041B25713J37632J87242p1187J02480
14841E81880k04761j33294O7470O1464A18311K67556r4413J66059R7795N8375
14831F13683k66777J64335j01071A52792L54191k29864L22769A16660l9889K79177
14821C55948K4246J10483k15902L13063R8283k01246k41581K05322J42529q4379
14811E06766k01195J88178N9821k56826L28414r0544J12833k14287J276J45122
14801E79558r2479n67j65429Q1765j52278K56407K4012k33669L87429j14016j38337
14790D32396O3517O5114q3626J82202k32750O4780J79202j97943M48091m50209
$$ y = [503420, 259532, 358704, 252166, 547278, 431278, 261860, 533639, 360976, 532811, 469597, 251630, 614358, 371109, 279942, -10041, 225713, 363345, 550587, 479400, 581880, 377119, 243825, 311295, 372759, 118311, 385867, 291454, 457513, 555308, 613683, 346906, 511241, 410170, 152792, 506983, 277119, 599888, 116660, 76771, 355948, 380194, 490677, 274775, 587838, 686121, 484875, 243294, 448616, 591145, 506766, 305571, 493749, 553570, 296744, 625158, 534614, 647447, 433160, 434436, 579558, 487079, 486512, 321083, 402848, 250570, 506977, 530989, 297320, 684749, 570733, 432396, 495913, 561027, 477401, 659603, 426853, 491633, 670835, 472892, 920983, 470774]
14780D70774K43109C43567n0688K55431J11869l9324m0919r4295J61429n5331
14770E91739j13450J57762K42282k95923Q5898l26774J3468K46352J74648r5823
14760F80179j6142j08188j44794K52619O4244l6797C02146K64097K53402j87363
14750F32282k58279P60906E63863K9748L3453K1733J11962p8285k79214L46923
14740G50183j82307L11271k51379O4204j50860J0613J2117n7037K45723r6993
14730F55535j51264J61049O8242K07261k79874j8912p3946j63699L40669j3862
14720G31199K94407l97851K12088n6303J18858Q211k19849J17928K059J11411
14710I22158j86602J84823J03655k44456o3708l10825K61794P2257j34476J69312
$$ y = [470774, 713883, 343567, 292879, 548310, 660179, 620855, 579936, 485641, 647070, 591739, 478289, 636051, 878333, 582410, 668308, 341534, 355002, 601354, 776002, 680179, 664037, 555849, 411055, 663674, 727918, 691121, 302146, 566243, 819645, 632282, 374003, 1134909, 563863, 593611, 627064, 648797, 760759, 682474, 403260, 750183, 567876, 879147, 627768, 691972, 541112, 551725, 563842, 506805, 752528, 655535, 504271, 665320, 733562, 940823, 660949, 642037, 568091, 404392, 745061, 731199, 1025606, 627755, 839843, 783540, 902398, 910609, 690760, 808688, 810747, 922158, 735556, 920379, 1024034, 779578, 715870, 405045, 666839, 739096, 604620, 773932]
14700G73932K76111k33012J04677j08003p8233K49740j84475J09984J77955k00454
14690H88222Q0454j42282J16129j42400K25935o8523J43550n15709L66908k64158
14680F88126K23479k0602K43045j8614l75245O15190n83873K69859l44340O30019
14670A327044n07551K08609P0206j61376L87180l45923K28853m05473O2277J53748
14660A017594R2356J95948m41813P8570l7202L1953R9150q9750q9187J03919J19867
14649A081405K49513l18326L85869j51854l08443L25699l71938M57400o8666J10808
14639A391467k76677J50955j45674Q0114R1560l20140L38892l32053L24841k17368
14629A085917K44708r6828K3793K29098r2370q375k70305k1409R6064O428N80138
$$ y = [773932, 1050043, 817031, 921708, 813705, 735472, 985212, 800737, 910721, 1088676, 888222, 968676, 826394, 942523, 800123, 1026058, 957535, 1101085, 585376, 952284, 688126, 911605, 891003, 1134048, 1115434, 740189, 1355379, 771506, 1041365, 697025, 1327044, 819493, 1028102, 1098308, 936932, 1324112, 978189, 1207042, 801569, 863846, 1017594, 1109950, 1305898, 864085, 942655, 905453, 937406, 1036556, 946806, 857619, 961538, 1081405, 1330918, 1012592, 1398461, 1246607, 938164, 1263863, 891925, 1349325, 1280659, 1391467, 1114790, 1265745, 1120071, 1200185, 1291745, 971605, 1310497, 978444, 1303285, 1085917, 1330625, 1233797, 1257590, 1486688, 1394318, 1385943, 1115638, 1094229, 1190293, 1196721, 1776859]
14618A776859l08124j05156J68813j14875m5641p6994J43745O676K40932l68203
14608A318032J68347j08801q1095M76482m23118M59618j84120J37541l051j92136
14598A567699j14676M5252K51777j26918j7741K7231M2649J58466k84839K06152
14588A755052j07152l03010L34558O8732M7945L96297k07611j59152L07443k18223
14578A914879L32689p3082m37194J91525R1499l7698j05725R3392J17228J48123
14568B235636K24394j20101j25601k33838J02090L87276K12507j11024J94725
14559B766064J12789L29702l92572q5040M12631J24016L71018K03334J011104
14550D853046R29884K408971N628862J0565200R070768M734264j8390271q268087
$$ y = [1776859, 1468735, 1363579, 1532392, 1417517, 1371876, 1294882, 1438627, 1445303, 1686235, 1318032, 1486379, 1377578, 1296483, 1772965, 1349847, 1809465, 1625345, 1762886, 1759835, 1567699, 1453023, 1498275, 1750052, 1623134, 1605393, 1632624, 1675273, 1833739, 1548900, 1755052, 1647900, 1344890, 1679448, 1748180, 1796125, 2192422, 1984811, 1825659, 2133102, 1914879, 2247568, 2174486, 1737292, 1928817, 2020316, 1982618, 1876893, 1970285, 2087513, 2235636, 2460030, 2339929, 2214328, 1980490, 2082580, 2469856, 2682363, 2571339, 2766064, 2878853, 3208555, 2815983, 2730943, 3143574, 3267590, 3638608, 3841942, 4853046, 5782930, 8191901, 13820763, 24385963, 33456731, 38190995, 19800724, 11532637]
14542A1532637n228326k372184p46648p21899j37787k17903l21340K88292l12087
14533A762755m7158N49765o14279K90070K03301J09870k01256J16492k69939L63272
14523B262893J8819J32914j53910K55192j10423J05512k01886J99975j86214L00018
14513B622890k6693J26262q807j15303J42488O6309j43042Q7183M5980J3121L43115
14502C153503k56355j80566L07610K01445k58787L6337M5785m1552N3011K75362
14492C335793k56416p8136O10957j84428k39803P9937J89500K8785K41731k15945
14482C511975J6920j14051P04691o93537K02470O6002K36670j57995k300M20272
14472D191117k5628K30808r1614n9092J49102j76207K51139K3259j16133j07681
$$ y = [11532637, 6304311, 3932127, 3185479, 2463580, 2325793, 2107890, 1786550, 2074842, 1762755, 1715597, 2265362, 1651083, 1941153, 2144454, 2254324, 2053068, 2169560, 1899621, 2262893, 2281712, 2414626, 2260716, 2515908, 2405485, 2510997, 2309111, 2509086, 2322872, 2622890, 2596197, 2722459, 2713652, 2598349, 2740837, 2807146, 2664104, 2751287, 2797267, 2810388, 3153503, 2897148, 2716582, 3024192, 3225637, 2966850, 3003187, 3048972, 3007420, 3060431, 3335793, 3079377, 3001241, 3612198, 3427770, 3187967, 3267904, 3457404, 3486189, 3727920, 3511975, 3528895, 3414844, 4119535, 3425998, 3628468, 3694470, 3931140, 3773145, 3770845, 4191117, 4165489, 4396297, 4304683, 4245591, 4394693, 4218486, 4469625, 4492884, 4376751, 4269070]
14462D269070l0445J17198K34588K84861p5216k83703J58055K72971K98705L86592
14452E632676l37601k03025J87491L6042K1569k8708n0376K00472j19613P1123
14442E410050N59540l39423M45518m2329m7084K79575o0219m4708L10982j41550
14432F330352J93241K34174M5178J46497j65460P2058j98093O84411l07573N70879
14422G605664j22132j27456L37341L09463j4099j31613o9834J15040M51936K00382
14412H554692l59731O89573J2452j93876J79218M66858J0705n3850J81518L99397
14402I886956J24193k23168N82471q6259J90006M01371J00674L470K95463k09171
14392A1066006N11267J44739K18219P5702M15841K03398O2322K01138K16487N89808
$$ y = [4269070, 4238625, 4355823, 4590411, 4875272, 4800056, 4516353, 4674408, 4947379, 5246084, 5632676, 5295075, 5092050, 5279541, 5315583, 5337152, 5308444, 5258068, 5458540, 5338927, 5410050, 5969590, 5630167, 6075685, 6033356, 5986272, 6265847, 6205628, 6160920, 6471902, 6330352, 6523593, 6757767, 6802945, 6949442, 6783982, 6856040, 6657947, 7342358, 7034785, 7605664, 7483532, 7356076, 7693417, 8002880, 7988781, 7857168, 7787334, 7902374, 8354310, 8554692, 8194961, 8884534, 8896986, 8703110, 8882328, 9349186, 9359891, 9306041, 9487559, 9886956, 10011149, 9787981, 10370452, 10284193, 10474199, 10875570, 10976244, 10979714, 11275177, 11066006, 11577273, 11722012, 11940231, 12015933, 12431774, 12635172, 12697494, 12898632, 13115119, 13704927]
14382A3704927L7187M24991k23703Q52228l78933M88645P43175M0372K33902K09952
14372A6132743K40482R94778j79036N96125O6497N91345j7159O54078J81111O86407
14362A9947371L41813K98073O45940O14824J91492N62374O84194L01306P75156
14353B4362543K53991R54401N47053O27663L43079R48848M06745R29472Q13427
14344C0187222N09844N96725R97677R16966J179044N62439J286409Q44996J069864
14335C8151186J290324P57205J329742J220235J415478J078760J692079J329665
14327D8264674J679448J346408K253618J495345J813257K136239J916063K039253
14319F2944305K472034K440368K333568L021516K493326K729253L335212L245693
$$ y = [13704927, 13742114, 14167105, 13943402, 14795630, 14416697, 14905342, 15648517, 15688889, 15922791, 16132743, 16373225, 17368003, 17188967, 17785092, 17851589, 18442934, 18425775, 19079853, 19260964, 19947371, 20289184, 20587257, 21233197, 21848021, 22039513, 22601887, 23286081, 23587387, 24362543, 24616534, 25570935, 26117988, 26745651, 27088730, 28037578, 28444323, 29373795, 30187222, 30697066, 31293791, 32291468, 33208434, 34387478, 34949917, 36236326, 37081322, 38151186, 39441510, 40198715, 41528457, 42748692, 44164170, 45242930, 46935009, 48264674, 49944122, 51290530, 53544148, 55039493, 56852750, 58988989, 60905052, 62944305, 65416339, 67856707, 70190275, 73211791, 75705117, 78434370, 81769582, 85015275]
14311H5015275L484433L522202M058915M219630M013397M812894M749578M907154
14303A18783478N705343N232492O292931O461015P221517P255351P297369Q255756
14295A72505252Q233472R566519R312326J0000856J0977366J1029125J1896943
14288B43521859J2429032J3019991J3357486J3980869J4323401J4865474J4436235
14281C39934347J4741762J4495909J4690179J3526527J3098060J2419353J0540404
14274D33446541P758438M689906L71201m363911J82355L994623l390265n987545
14266D36701343n586103n473078q021444j0099436j1244114j1978772j3519137
14259C70779259j4063841j4840410j5348347j4547981j5111522j3805171j3616284
$$ y = [85015275, 88499708, 92021910, 96080825, 100300455, 104313852, 109126746, 113876324, 118783478, 124488821, 129721313, 136014244, 142475259, 149696776, 156952127, 164249496, 172505252, 180738724, 190305243, 199617569, 209618425, 220595791, 231624916, 243521859, 255950891, 268970882, 282328368, 296309237, 310632638, 325498112, 339934347, 354676109, 369172018, 383862197, 397388724, 410486784, 422906137, 433446541, 441204979, 445894885, 446266086, 441902175, 442084530, 446079153, 442688888, 436701343, 431115240, 425642162, 417620718, 407521282, 396277168, 384298396, 370779259, 356715418, 341875008, 326526661, 311978680, 296867158, 283061987, 269445703]
14252B69445703j3303616j2780277j1762315j1612942j0794018j0389988r741808
14245A89060739r302014q160232q341810p677962p188717p043382o269060n918875
14237A29158687n117809n875626n098869m692961m319266m410304l256238m447081
14229I1940533l541381l396445l361323k718724l417259k651484k721319k098474
14221F8034124k679076j591623k306099k285396k015046j905921j489802j546632
14213E2214529j337205k092130j509323j422626j250056j275108n79922j453348
14205D1294811j222060j162802j110698j013645q12833q76222p75782j351950
14197C2968819o39637j258526l19714o53430q04108p45413p12181p58939r09464
$$ y = [269445703, 256142087, 243361810, 231599495, 219986553, 209192535, 198802547, 189060739, 179758725, 171598493, 163256683, 155578721, 148390004, 141346622, 135077562, 129158687, 124040878, 118165252, 113066383, 108373422, 104054156, 99643852, 96387614, 91940533, 88399152, 85002707, 81641384, 78922660, 75505401, 72853917, 70132598, 68034124, 65355048, 63763425, 61457326, 59171930, 57156884, 55250963, 53761161, 52214529, 50877324, 48785194, 47275871, 45853245, 44603189, 43328081, 42748159, 41294811, 40072751, 38909949, 37799251, 36785606, 35972773, 35096551, 34320769, 32968819, 32329182, 31070656, 30750942, 30097512, 29293404, 28547991, 27835810, 27076871, 26167407]
14188B6167407k57151q04196m90098o10828n25446n96567j43617o80929o69217
14179B1389358l87755k19386o61747o11928q6565n07665p45031o5628j15460l19806
14169A7668387o39546j07361n25328n17838K7597k64680n31401j19133m84108
14160A4506589k00379j79923n3341k05204j12311n24695o6934l31975j1942j59412
14150A2660473k08429l55855l53506M1342j67145l84426j49074o46770O22859
14141A1059469k09365m32327j96140k54019J13501k56541l67347M40646m91011
14132I406866o7120k28162K15737l2194l13686k22399l98058J97848j2755m43813
14122H102264L7023o4531p6618l47402J72696k28607N730m6336j79911k05388
$$ y = [26167407, 25910256, 25106060, 24615962, 24005134, 23479688, 22883121, 22739504, 22058575, 21389358, 21001603, 20782217, 20120470, 19508542, 19421977, 18914312, 18169281, 18103653, 17988193, 17668387, 17028841, 16921480, 16396152, 15878314, 15905911, 15641231, 15109830, 14990697, 14506589, 14306210, 14126287, 14072946, 13867742, 13755431, 13230736, 13163802, 12831827, 12819885, 12660473, 12452044, 12096189, 11742683, 11784025, 11616880, 11232454, 11083380, 10436610, 11059469, 10850104, 10417777, 10221637, 9967618, 10081119, 9824578, 9457231, 9897877, 9406866, 9339746, 9111584, 9327321, 9295127, 8981441, 8759042, 8360984, 8558832, 8546077, 8102264, 8139287, 8074756, 7998138, 7650736, 7823432, 7594825, 7600555, 7554219, 7374308, 7168920]
14112G168920q2042r6379K2102j32294l67036K12018J86410l00159m83426L23705
14102F451819K42484o05268j86379O4476p4035J92231J7861l02219K9084j15862
14092E714192K436j58176l45935L70108l44590o8877K62427n34632K29124M5266
14082E171343r8463k85371K94828j7789m29005O569n1800K55126m23312j0471
14072D411655J45208k07385q7017L65382n59086N8504K16854l00039N4268J66699
14062D265043j4518L6232l39191M0749L03594l09462R8214l91422P06109q28797
14052C566551P8588K8708O090j96851j25757M44198Q6280n65462J46203l29281
14042C139267N38173k86526j69805j8079K90637m01787L00233r6420j42379J57588
$$ y = [7168920, 7086878, 6990499, 7012601, 6880307, 6513271, 6725289, 6911699, 6611540, 6128114, 6451819, 6694303, 6089035, 5902656, 5967132, 5893097, 6085328, 6103189, 5800970, 5830054, 5714192, 5716628, 5558452, 5212517, 5582625, 5238035, 5169158, 5431585, 4896953, 5126077, 5171343, 5072880, 4787509, 5082337, 5064548, 4635543, 4642112, 4590312, 4845438, 4422126, 4411655, 4556863, 4349478, 4262461, 4627843, 4068757, 4127261, 4344115, 4044076, 4098344, 4265043, 4250525, 4286757, 3947566, 3988315, 4291909, 3982447, 4080661, 3689239, 4395348, 3566551, 3645139, 3673847, 3679937, 3483086, 3357329, 3801527, 3887807, 3322345, 3468548, 3139267, 3677440, 3390914, 3221109, 3203030, 3493667, 3091880, 3392113, 3295693, 3153314, 3310902]
14032C310902l18000J79252J4727K79508l41176j59905k3355J21454k74895J67517
14022B956029k16060J82846J12584p20038M65202j94228J37589l94429j3576M79267
14012B795186n20903K32105N3200K15446k92492n1341J3478J49773n6788k03983
14002B333681j72732J62506k90247J12129n0077M8322r3327O7772J17555j54491
13992B081091L25415L1654M73455J981310L586695J0468949J0260940R988893
13984C9198402j6132322r392445m238760k597972j328189q08679n79361r96313
13976C124361K02278Q5755m46505m8112m13704K61300j06720N1659l91523K142
13966B320931o3657K2848n6310Q6209l4632j72925J65060K8969l5797j32431K73479
$$ y = [3310902, 2992902, 3172154, 3186881, 3466389, 3125213, 2965308, 2941953, 3063407, 2788512, 2956029, 2739969, 2922815, 3035399, 2315361, 2780563, 2586335, 2723924, 2329495, 2315919, 2795186, 2274283, 2506388, 2559588, 2775034, 2482542, 2431201, 2444679, 2594452, 2537664, 2333681, 2160949, 2323455, 2033208, 2145337, 2095260, 2143582, 2050255, 2118027, 2235582, 2081091, 2406506, 2438160, 2911615, 4892925, 8479620, 18948569, 29209509, 39198402, 23066080, 13673635, 9434875, 6836903, 5508714, 4700035, 4120674, 3124361, 3326639, 3412394, 2965889, 2917777, 2504073, 2765373, 2658653, 2710312, 2318789, 2320931, 2257274, 2280122, 2223812, 2310021, 2275389, 2102464, 2267524, 2296493, 2260696, 2128265, 2401744]
13955B401744k72356j67809R1365q8521O2625j80233O965J75964J01838k65295
13945A866287M7512K19416j44211J2451m25375N22285l84963l0247J49808o8888
13935A764075r4269P5232j22427J23462j88452O3843R5224j47554J79397J89259
13925A937790k65571Q0323l42739L32458k25736K41778j01208k66725J59771n7584
13915A492557L66653m28579J9421J6635J05516J27797k10002k70826K61348l350
13905A477170j09661J29893Q1639M1380m54129L89003j67643M2115P9937l2243
13895A477461R4609l19517K43127k27647J69077J96054n35268K87820j74106j28031
13885A083579J35763J47060n6649j61136l47025K98572N3888j78875M10696k31087
$$ y = [2401744, 2129388, 1961579, 2052944, 1964423, 2027048, 1846815, 1853780, 2029744, 2131582, 1866287, 1913799, 2133215, 1989004, 2001455, 1576080, 2098365, 1713402, 1683155, 1832963, 1764075, 1669806, 1745038, 1622611, 1746073, 1557621, 1621464, 1716688, 1569134, 1748531, 1937790, 1672219, 1752542, 1409803, 1742261, 1516525, 1758303, 1657095, 1390370, 1550141, 1492557, 1859210, 1430631, 1450052, 1466687, 1572203, 1700000, 1489998, 1219172, 1480520, 1477170, 1367509, 1497402, 1579041, 1620421, 1166292, 1555295, 1387652, 1429767, 1509704, 1477461, 1572070, 1252553, 1495680, 1268033, 1437110, 1633164, 1097896, 1385716, 1211610, 1083579, 1219342, 1366402, 1309753, 1148617, 801592, 1100164, 1154052, 975177, 1385873, 1154786]
13875A154786O3661k26595J45026K4659J17588l50602K68695o8674j01057l8670
13865I88817J65030j62575O5599J83197p4286j20558q4361M0637K97417q9568
13855A209349k50027n8904l6923J72719j58966K75353q0160k97544L67447l10778
13845H31566P3081K30842K59405k00388P9675l61839J38590j10828j7541m8710
13835H73853K21812m76213K24515R7853j89901J94420K32778n13615J63382l3066
13825G95818J47773J10562j74333o0452O8822J4860k75020M22295l81385K42167
13815I11107o3416L12128j57457J69448j64924q8417J66130r5130J03365j95243
13805H97591K74027l67599O7625p7182l30301M08391j79048L3417J03329J82347
$$ y = [1154786, 1218447, 991852, 1136878, 1161537, 1279125, 928523, 1197218, 1128544, 1027487, 988817, 1153847, 991272, 1056871, 1240068, 1165782, 1045224, 960863, 1001500, 1298917, 1209349, 959322, 900418, 863495, 1036214, 877248, 1152601, 1072441, 774897, 1142344, 831566, 904647, 1135489, 1394894, 1194506, 1274181, 912342, 1050932, 940104, 922563, 873853, 1095665, 619452, 843967, 941820, 751919, 946339, 1179117, 665502, 828884, 795818, 943591, 1054153, 879820, 819368, 888190, 903050, 628030, 1050325, 668940, 911107, 847691, 1159819, 1002362, 1171810, 1006886, 918469, 1084599, 989469, 1092834, 897591, 1171618, 804019, 871644, 794462, 464161, 872552, 693504, 726921, 830250, 1012597]
13795A012597j62566j43765K26688l06340K73700l25635K20451R6125q9413k99272
13785E02570M79794k32524K45047o7782l82119K39016q7320J08727P0932l2730
13775H43611r4685k23115K77510J31269D37345K71780j54596J69014K0309J11272
13765H55124q9989O1202j64574L44999k15827K79232l83712k68833J39256K62235
13755H19113K0154j94787q0369O7797J80251j68691j01893L50319A05379N27793
13745F33172j96348L85527k04092l009k47147N73993l61008j52742L32846k98641
13735D62551A02094N50263R6986K251k31197k23305L01738k5334B32392K29803
13725D62195j42741N05115L8924k68710p2625J98331k6757j741J6587l2152l0393
$$ y = [1012597, 850031, 706266, 932954, 626614, 900314, 574679, 795130, 891255, 801842, 502570, 982364, 749840, 994887, 927105, 544986, 784002, 696682, 805409, 876341, 843611, 748926, 525811, 803321, 934590, 437345, 709125, 554529, 723543, 743852, 855124, 765135, 826337, 661763, 1006762, 790935, 1070167, 686455, 417622, 556878, 819113, 839267, 644480, 564111, 631908, 812159, 643468, 541575, 891894, 105379, 633172, 436824, 822351, 618259, 615250, 368103, 942096, 581088, 428346, 761192, 462551, 102094, 652357, 749343, 751594, 520397, 297092, 598830, 573496, 232392, 462195, 319454, 824569, 863493, 594783, 522158, 720489, 693732, 691991, 708578, 676426, 646033]
13714F46033j70710o6757J30944R0011j90483K06679n0173j1028j32692M0543
13704D92367J82597j91390k03785K10745K18712a7853G55741R9970C18418K72152
13694E90570O1475k37153K28019J95395j66304j60555K14002j92361j4349M8028
13684E66767k58677L22411o2303j16260K17864j59299j60305J96645M3135q9129
13674E00849N1551A71317M35983N6875B88498K69074J8022J56632C59586L01903
13664F61489A16055K70950Q0600K5461K91432j66518J74507j98893j67538o2941
13654C63115J31072q582B5581K51185K53337L0358j43268L73768l83462K14028
13644F21527j20061j95188o6077M12153M0698l35504J63078j76268K61575A35255
$$ y = [646033, 475323, 408566, 539510, 629521, 439038, 645717, 595544, 584516, 451824, 492367, 674964, 483574, 279789, 490534, 709246, -17853, 755741, 855711, 318418, 590570, 652045, 414892, 642911, 838306, 672002, 511447, 725449, 533088, 518739, 566767, 308090, 630501, 568198, 451938, 669802, 510503, 350198, 546843, 589978, 500849, 552400, 171317, 607300, 664175, 288498, 557572, 575594, 732226, 359586, 661489, 116055, 387005, 467605, 493066, 784498, 617980, 792487, 593594, 426056, 363115, 494187, 485605, 25581, 276766, 530103, 560461, 417193, 790961, 407499, 621527, 501466, 306278, 240201, 652354, 693052, 357548, 520626, 344358, 605933, 135255]
13633B94370L80926k25694K4413K6398k03377K94758k31503j09374D5170L18708
13623C63878J08036N4949R8055j80518q0326O0452K29345j31784j07324K22338
13613F37101l09636j53405K3598N0116M74918k84113B15804L11439A67890J46111
13603C14001K390O7528o3278j9801j06710J13336L58391A61219O3559J42484J98962
13592E66224p3321E771M67404R6390j53830r5131J23616j74312b7409B10612q7687
13581A22925K60314o1866j32447L54582k25846H6528M19656j98112J46960O3934
13571E18966j53950L8218p2726L26504j71798J90646k83213q3587j0275j41019
13561A57766N05348A96883K74877j60387j3838J85083G4677J94344J01534j31952
$$ y = [294370, 675296, 449602, 474015, 500413, 297036, 591794, 360291, 250917, 45170, 363878, 471914, 526863, 624918, 444400, 364074, 424526, 653871, 522087, 414763, 637101, 327465, 174060, 197658, 247774, 722692, 438579, 215804, 527243, 167890, 314001, 316391, 383919, 320641, 300840, 194130, 307466, 665857, 161219, 224778, 367262, 566224, 492903, 5771, 473175, 569565, 415735, 320604, 444220, 269908, -27409, 210612, 122925, 383239, 321373, 188926, 543508, 317662, 86528, 506184, 308072, 455032, 518966, 365016, 403234, 330508, 657012, 485214, 675860, 392647, 309060, 298785, 157766, 663114, 196883, 471760, 311373, 297535, 482618, 74677, 269021, 370555, 238603]
13551B38603J55613J23490A75359M1510n1199J0142L4960J59981P9336Q9012j17711
13540D21390o9690J58506j70339K87344B53179p3932J13863K06568j66272j03490
13530B29916J51663F703J92052J95018j04817K12947r7208k9459K27895A1689
13519d9048A31173D9283N86834C07266j52508J62528J10106A25699M12552B48593
13508B21524J08681A62115k6855Q5015m982k9758e5744B67413C7213K25061L73221
13497F35495B04608m0081n4192L43450A48663b0978E51672j20545J6024k00184
13487B46967J95847B2528L85475A8020K43070r3223K43022a32905C69602j34390
13477B35212c2819B05456L8041J46517A94461K76383j85154k243J51663J38850
$$ y = [238603, 394216, 517706, 175359, 216869, 165670, 175812, 210772, 370753, 450089, 539101, 421390, 351700, 510206, 339867, 627211, 253179, 179247, 293110, 499678, 333406, 229916, 381579, 6703, 198755, 393773, 288956, 501903, 404695, 375236, 603131, 11689, -49048, 131173, 49283, 636117, 307266, 154758, 317286, 427392, 125699, 538251, 248593, 221524, 330205, 162115, 135260, 220275, 215293, 185535, -55744, 267413, 37213, 262274, 635495, 204608, 164527, 110335, 453785, 148663, -20978, 551672, 431127, 447151, 246967, 442814, 22528, 408003, 18020, 261090, 167867, 410889, -132905, 369602, 235212, -32819, 205456, 243497, 390014, 194461, 470844, 285690, 283447, 435110, 573960]
13467E73960B8406K14004r495d7305A82108L71431G5452m866J79228o6304J82307
13456C65817j50105j2211J7644J55734A20876E9200K18096J54784A87258K09310
13446C96568j58745K17593l0605D966K11796P2577n2095F8596e2355C48687F6040
13434A62682L5519b31579A61461l1167J85493a06347A39921d8754B41475L77209
13424F18684k13848J01079r8130F8058Q1539E5982E083M27211C9132J8072L41928
13413C99132G7081L74924o2335P7635r8801A32124K06051A4067O2139j006L18257
13402C93457A52793b0369C31028a32401C23803J6255d4405A64025K17328j27509
13392B53844a6144B10359m7594P882K56653j52378a40312I261L53180J13O7063
$$ y = [573960, 28406, 242410, 232915, -47305, 182108, 553539, 75452, 70586, 249814, 183510, 365817, 215712, 203501, 221145, 376879, 120876, 59200, 277296, 432080, 187258, 396568, 237823, 455416, 424811, 4966, 216762, 289339, 237244, 68596, -52355, 348687, 66040, 162682, 198201, -231579, 161461, 130294, 315787, -106347, 139921, -48754, 241475, 618684, 404836, 505915, 407785, 68058, 149597, 55982, 5083, 432294, 39132, 57204, 399132, 77081, 452005, 389670, 467305, 368504, 132124, 338175, 14067, 76206, 75200, 393457, 152793, -20369, 331028, -132401, 323803, 340058, -44405, 164025, 381353, 253844, -16144, 210359, 162765, 170647, 427300, 274922, -140312, 9261, 362441, 362554, 429617]
13381D29617B0473d1299D00504j14086D6797J16865L5307M1714J83730n991J08384
13370E26806B26197I3334O14060G3598A0098K33506n8797j237J78362k8303j23522
13359B10107N2496k7179O6621j35779l0011m7309L29910a02611B18311J07695
13349C26006H0119J94982P0439A05723J30695J94308A56626K88272k00088n2943
13339A91867L7803O3132P6844A9666O26590j97333A88937J87566F3006J92532
13329B55538O4381K07873B44732G8240J33510n4852R4683r688j06968b09293D60386
13317B70854M4371r9412J10327A59031L09043j65602B1530i4086A28932K08090
13307C37022d0796A16078J00186E5205K44243p6015c6704B10501O6941q9565j9327
$$ y = [429617, 20473, -41299, 400504, 286418, 46797, 163662, 198969, 240683, 424413, 418422, 526806, 226197, 93334, 707394, 73598, 10098, 243604, 184807, 183570, 361932, 333629, 210107, 262603, 235424, 302045, 166266, 136255, 88946, 418856, -102611, 218311, 326006, 80119, 275101, 345540, 105723, 236418, 430726, 156626, 444898, 244810, 191867, 229670, 292802, 369646, 19666, 646256, 448923, 188937, 376503, 63006, 255538, 319919, 527792, 244732, 78240, 211750, 156898, 251581, 241893, 134925, -209293, 460386, 270854, 315225, 215813, 326140, 159031, 468074, 302472, 21530, -94086, 128932, 337022, -40796, 116078, 216264, 55205, 299448, 223433, -36704, 210501, 277442, 187877, 168550]
13296A68550h5236B28090D6237L29875A65827f9695C7115M34696d1134C10116
13285A60422M1497a00960r9878A58333K31610p0213a01086B81247j29814d2835
13274B13093B2153K74378m8943E4247c44547B7534J33430e5265A08663K58229
13264C66892q3805A08608R7886C202L34435A7145a42855C17836o9755a07291B23421
13252G3185R204j4149J65833a26728C21691j06635n8639J6205J22177K09636B51368
13240B55679r5287C3181K31685l7708a53882C01710d7416B43228K56294k00462
13230B99060A7640J45620j7862R0754a70293B24087i912G8382e4085A06960L59082
13219D66042E314J83861F4916J17652b63429E6861J20748J18656M0455A48944
$$ y = [168550, -85236, 228090, 46237, 376112, 165827, -69695, 37115, 471811, -41134, 310116, 160422, 201919, -100960, -200838, 158333, 389943, 319730, -101086, 281247, 151433, -42835, 213093, 22153, 296531, 247588, 54247, -344547, 27534, 160964, -55265, 108663, 366892, 283087, 108608, 206494, 3202, 337637, 17145, -142855, 317836, 248081, -107291, 223421, 73185, 82389, 68240, 234073, -126728, 321691, 215056, 156417, 172622, 294799, 504435, 251368, 255679, 160392, 33181, 264866, 227158, -153882, 301710, -47416, 243228, 499522, 299060, 17640, 163260, 145398, 236152, -170293, 224087, -9912, 78382, -54085, 106960, 466042, 5314, 189175, 64916, 182568, -263429, 56861, 177609, 296265, 336720, 148944]
13208A94855J27196A34766C7191J45155m458b27866i9403I3206f3665H1330J7279
13197I8609J92721H4807j3331R6222p6848Q6125A3473J06023K59901j24857h0048
13185a6520A14261O0220a24570J0271A31676L4198i3822J9017C27011Q6596A82782
13173D17429b5014A623L44343b26568J04964A36482L7716b54155M6691I0534K43286
13162C33820i563D2826a09985A64427K65207a21803A73236n4927J86004Q1507
13152C85820B8561f1398l2632M6757m9539H3766h675o6531C3569N7165K23382
13141C14116A44075k154a55038K5879A66202a61499r010A81373d794B51937A23474
13129C59549b1966k81929a29069B59425e1814B51054j02957g0328I6826A3423
$$ y = [194855, 322051, 134766, 37191, 182346, 177888, -227866, -99403, 93206, -63665, 81330, 98609, 291330, 84807, 71476, 167698, 90850, 176975, 13473, 119496, 379397, 254540, -80048, -16520, 114261, 174481, -124570, -114299, 131676, 165874, -93822, -74805, 327011, 413607, 182782, 417429, -25014, 1623, 345966, -226568, -121604, 136482, 174198, -254155, -207464, 90534, 333820, -9563, 42826, -109985, 164427, 429634, -121803, 173236, 118309, 304313, 385820, 28561, -61398, -94030, -47273, -96812, 83766, -8675, -75206, 33569, 90734, 314116, 144075, 141921, -155038, -129159, 166202, -161499, -170509, 181373, -4794, 251937, 123474, 359549, -21966, -303895, -129069, 259425, -51814, 251054, 148097, -70328, 96826, 13423]
13118F7470P0057J66027h9994b4095a535B5788J87395A6484a17061B70493A5512
13106G7104L09664H6991b6494p9169G9265c2259j06118C45677a73585A92170B8085
13094A96935F5742B3832J71880f1620j1505C16977J4113f2225j4299C04005L8375
13083C42380e0916A40637J09907j19158N5541J87580b20414B95230e311B34727
13072B46768r1824F3569L75842A26454E0034J9801K34548j25576J28725G0909
13061A23365a15441A0191J45342a43706A46875J7188a47257I4770J44739D1183
13050A0890L63254j30843o0249E9575R7894C0931a8699k3776D6839J12140R5862
13039B54841h9893j2033C61331A25195a17444A59591J8678H4242I834J1222J98658
$$ y = [67470, 137527, 303554, -89994, -24095, -1535, 25788, 213183, 16484, -117061, 270493, 15512, 77104, 386768, 86991, -26494, -105663, 79265, -32259, -138377, 345677, -173585, 192170, 28085, 196935, 65742, 23832, 195712, -61620, -73125, 316977, 331090, -62225, -76524, 304005, 342380, -50916, 140637, 250544, 131386, 186927, 374507, -220414, 295230, -5311, 234727, 246768, 154944, 63569, 439411, 126454, 50034, 69835, 304383, 178807, 307532, 70909, 123365, -115441, 10191, 155533, -143706, 146875, 164063, -147257, 94770, 239509, 41183, 10890, 374144, 243301, 183052, 59575, 157469, 30931, -18699, -42475, 46839, 158979, 254841, -89893, -101926, 361331, 125195, -117444, 159591, 178269, 84242, 9834, 21056, 219714]
13028B19714q412a58306A02588k152P891l6214N440Q812L17562n6346r2976q0205
13016A74400d91n6035C43864f7635E9689K66104j25663H9026L9226h9035I9303
13004E67058A25377B2224O6394J82514K9980e0694B30206J59403o7408F7589O7589
12993A35178F5929N3777L43696B9313L44273A74531M390a40007A5395Q4840R2028
12982A92263g8844j36102N6589b3974G3464A5320f1650A53678A2584L4896a32139
12970A95179I4536a34769C3914i3146e545j9152A49187J0304e0866o2511B21810
12958c7291l921l09471C85969j71452B7924O1608d43286F162K92090a33245D2851
12946D168K88872i446r8511D27821a34739C8232g7037k1308L0279l61826A27269
$$ y = [219714, 211302, -158306, 102588, 100436, 108327, 72113, 77553, 86365, 403927, 347581, 254605, 174400, -491, -56526, 343864, -67635, 59689, 325793, 200130, 89026, 128252, -89035, 99303, 567058, 125377, 22224, 88618, 271132, 301112, -50694, 230206, 389609, 322201, 67589, 135178, 65929, 119706, 463402, 29313, 373586, 174531, 178921, -140007, 15395, 100235, 192263, -78844, -214946, -158357, -23974, 73464, 15320, -61650, 153678, 12584, 47480, -132139, 195179, 94536, -134769, 33914, -93146, -5545, -24697, 149187, 159491, -50866, -113377, 221810, -37291, -41212, -350683, 385969, 214517, 27924, 89532, -443286, 6162, 298252, -133245, 42851, 4168, 293040, -9446, -107957, 427821, -134739, 38232, -77037, -98345, -68066, -429892, 127269]
12934B24527C7300J77127b82594D36390a08957A58652J991k7574j2207K51411
12924C72273A06443b37539A50454g1454j7683A10796d7077l496k7957A54554P9852
12913B34406b59381b3648r5780A58690k2025Q0749A8390O1834l4911I968h4140
12901i2069P454k0632c8528G7337c69361I7152a28907H3919B053a07218B28704
12889G7654L4203G175J64796f505A66131E5214a8593A00948j6881a53127N3884
12878i9243A38544a40691G0376O3171JE5867K07189k5601b77135f9417q8967L237
12866a55147A19723J05426l3269b7438B2578K98165c93282A6818n903a38552b4352
12854B360K99311A07681K4481F268K7158N9617H038g0471A89563a17929B84510
$$ y = [224527, 37300, 214427, -282594, 436390, -108957, 158652, 160643, 133069, 120862, 372273, 106443, -237539, 150454, -71454, -89137, 110796, -47077, -50573, -78530, 154554, 234406, -259381, -23648, -119428, 158690, 136665, 217414, 18390, 80224, 45313, 9968, -84140, -92069, -84615, -105247, -38528, 77337, -369361, 97152, -128907, 83919, 2053, -107218, 228704, 77654, 111857, 7175, 171971, -6505, 166131, 55214, -18593, 100948, 84067, -153127, -99243, 138544, -140691, 70376, 133547, 133548, 55867, 263056, 237455, -277135, -69417, -158384, -155147, 119723, 225149, 191880, -27438, 22578, 320743, -393282, 16818, 10915, -138552, -24352, 2360, 301671, 107681, 132162, 6268, 33426, 93043, 8038, -70471, 189563, -117929, 284510]
12842B39818C8414K04807J72851F4911K1166K1312h0865j59577G4697c3947j78311
12831b12258A05509a25836G3117b16741C69235j05148m7301M1159j14378h0022
12820a94839B16375b98706I2600i9331j8093B33377a5741j25310L8164C05169
12809i6966o486A05931g6113B65168a3657k5858f662B98399b71709C7889J01957
12798A39846R521a6650A64387Q075a5626A8322a14889B95713B3703d9066l6967
12787h6033A73267a72989Q094o1315B07803M481b70444E5622e0449A72165f4163
12775A39009L3673b062p9176B45501n6772a02940B8182J50116a29194B22564r3635
12764A28929J0500d5202K0858A63169Q5166r0915a27498c9606k46487B30767F5416
$$ y = [239818, 38414, 243221, 416072, 64911, 86077, 107389, -80865, -240442, 74697, -33947, -212258, 105509, -125836, 73117, -216741, 369235, 264087, 216786, 257945, 143567, -80022, -194839, 216375, -298706, 92600, -99331, -117424, 233377, -15741, -141051, -102887, 305169, -96966, -103452, 105931, -76113, 265168, -13657, -39515, -6662, 298399, -271709, 37889, 139846, 149367, -16650, 164387, 172462, -15626, 18322, -114889, 295713, 23703, -49066, -86033, 173267, -172989, -164895, -226210, 207803, 212284, -270444, 55622, -50449, 172165, -64163, 139009, 172682, -2062, -81238, 245501, 188729, -102940, 28182, 178298, -129194, 222564, 128929, 139429, -45202, -24344, 163169, 248335, 157420, -127498, -39606, -286093, 230767, 65416]
12752A47658m0626A8699a26030c9166k47389I6057f0065I2321k1472Q3618d9082
12740f0656j48464i0383A26392n5066J51967q0070e919B28312l0719b5955p8415
12729a04370M2283m3995B96059J36163B05548R5335g5257L0891F1337a45237M4075
12718a01162o6725b4704G6833J70072g7287D9477L18939j23969a202A12389J69894
12707B82283d4637C65810a56958A92009J04768G1408J83502d6096D9330J41101
12697A90431p6175R9849J2987J22974j02033b01174D45691A46489J114b70371
12686B65882a30915m0396A99967F3806j7028a48691K8441A21683m2364a88666
12675C0095e32D22906R9962C9678P9451J57415a38970D1692L2887J200R912J71675
$$ y = [147658, 107032, 18699, -126030, -39166, -286555, 96057, -60065, 92321, 70849, 154467, -49082, -60656, -209120, -90383, 126392, 71326, 223293, 143223, -5919, 228312, 197593, -25955, -104370, -62087, -106082, 296059, 432222, 205548, 300883, -75257, -44366, 61337, -145237, -101162, -167887, -24704, 76833, 246905, -77287, 49477, 368416, 244447, -1202, 112389, 282283, -44637, 365810, -156958, 192009, 296777, 71408, 254910, -46096, 49330, 190431, 114256, 214105, 227092, 350066, 248033, -201174, 445691, 146489, 147603, -270371, 265882, -130915, -171311, 199967, 63806, 46778, -148691, -120250, 121683, 79319, -188666, 30095, -532, 422906, 522868, 39678, 119129, 276544, -138970, 41692, 74579, 75779, 85691, 257366]
12663B57366I9607J53888j20501M995o4548Q1270E8802K80467A01339a50841F6421
12651A9985K8654L9132b6784j00825A8417i7194C34330J5694i2766n6743D2331
12639a7307O661k03064O0338A18839a8210j41548H6866O6854P8632J20839H0445
12627B50880D8075J03045j4665C2331a31144A29307F1064K84633k6195A19296
12616A34502J28687d0536D8173a12689a6336B33754q5040N2808b55602J06857
12606a48745A47332H911a34696C3271K45763A10995O4751k042L071k5164j1309
12595A40302i7837D0741O8206J52884a7032A49126J16346C9598a44659r0018h6680
12583f3938A96200h4820A71530i084I8335L39326I975K47155b78068i6516B80639
$$ y = [257366, 99607, 253495, 132994, 137989, 73441, 154711, 58802, 339269, 101339, -150841, 66421, 19985, 48639, 87771, -26784, -127609, 18417, -97194, 334330, 350024, -92766, -149509, 42331, -17307, -10646, -213710, -153372, 118839, -18210, -159758, 86866, 153720, 232352, 353191, 80445, 250880, 48075, 151120, 136455, 32331, -131144, 129307, 61064, 345697, 319502, 119296, 134502, 263189, -40536, 48173, -112689, -16336, 233754, 148714, 201522, -255602, -148745, 147332, 8911, -134696, 33271, 279034, 110995, 175746, 173704, 176775, 151611, 140302, -97837, 40741, 108947, 261831, -17032, 149126, 265472, 39598, -144659, -234677, -86680, -63938, 196200, -84820, 171530, -9084, 98335, 437661, 9975, 257130, -278068, -96516, 280639]
12571E3863a34826b3424D3485b24564f5568j77269b1480A17701m175l8630B6911
12559A87287L42812a5103q8782l3095M5314a6345l0703B32051d02057B38834M2099
12548B80933r4195p3262a34835N7914o5878K5858A09834d2273j59862b8426B35660
12536H22d7C5441L11942J2968d7930n2150A12993d8883A83163H9513A7637L27280
12524C44917H9690a99073h8988A23958J87842i9364D80661b00384D392M17036
12514D21428P7030A74010b45216C22170p5224c22877B13505a4118A838J90501
12504A92339O9144M7515D7355J8317a72761A1716J19991A8604e734H7729J2324
12493A00053a55461C5546K8464B2140c0642C6706i7422A03888O150E048K9658
$$ y = [53863, -134826, -23424, 43485, -224564, -65568, -242837, -21480, 117701, 113526, 74896, 26911, 187287, 530099, -15103, -103885, -136980, -91666, -16345, -47048, 232051, -402057, 238834, 280933, 186738, 113476, -134835, -76921, -142799, -116941, 109834, -42273, -202135, -28426, 235660, 822, -47, 35441, 347383, 360351, -47930, -100080, 112993, -48883, 183163, 89513, 17637, 344917, 89690, -199073, -88988, 123958, 311800, -99364, 480661, -200384, 4392, 421428, 498458, 174010, -245216, 322170, 246946, -322877, 213505, -14118, 1838, 192339, 261483, 308998, 47355, 65672, -172761, 11716, 131707, 18604, -5734, 87729, 100053, -155461, 35546, 64010, 22140, -30642, 36706, -97422, 103888, 110038, 5048, 34706]
12482C4706i5156B1461a05128A23507a4268j8111D916h048r2453A70656J39957
12471C10613A07403j2244a69658B24191O0816h7426L9746H7703D3464a21651m7668
12460a69319A0494R2607i0044j0346A73397C7507C074b157A30909O359a82814
12448e5444j79324O8425A3510a07821H0788h0959j769A92623k9656G7868O474
12437H4342I012h9417E6366k3268K48598p8861g3554A54848N5121d1506k66251
12426c07757I7436a1118k39371A16108B4257M5437N0885m3674P3306D7068a95907
12414G7155a32523K5681I9454N3332K9085E4954b21568A24861m5187K7114m2318
12403F4470K7050B3609J44762p5805J17889a77104B12803a22895N6987A40043
$$ y = [34706, -95156, 21461, -105128, 123507, -14268, -32379, 4916, -8048, -100501, 170656, 310613, 107403, 95159, -169658, 224191, 285007, -87426, -47680, 87703, 43464, -121651, -169319, 10494, 103101, -90044, -100390, 173397, 37507, 3074, -2157, 130909, 137268, -182814, -55444, -234768, -166343, 13510, -107821, 80788, -80959, -82728, 192623, 162967, 77868, 84342, 9012, -89417, 56366, 33098, 281696, 202835, -73554, 154848, 209969, -41506, -307757, 97436, -11118, -250489, 116108, 24257, 69694, 120579, 76905, 150211, 47068, -195907, 77155, -132523, -106842, 99454, 152786, 181871, 54954, -221568, 124861, 79674, 106788, 64470, 91520, 23609, 168371, 92566, 210455, -177104, 212803, -122895, -65908, 140043]
12392a94472a2634j69911B12063f1958B20162J82539A53264a53867E5731b52819
12381A16099E5932N683M7605J55149k7953n705G7362G312f9179n9006j74781B81807
12368b80633H037b89382A32031E7357F234K5808i8327A09484J01749n509k861
12357B02863b08007N6455N113B0570a00389B10644p1919K3964J16482A11938A5976
12345A88738c8490r8273C6569a41557L8674k65794A79764B7558l90L03089a70609
12333e1474H9723L5289h592j85434k41394A26035E7720a42827A19712a90492D3499
12321A767a26466A511g762I1926J53862H2667J22918j9129b5481r0954C09877
12309a44879A9317N3324A062d2005j84636A69179R0003C7279a6066j16188B55403
$$ y = [-194472, -12634, -182545, 212063, -61958, 220162, 402701, 153264, -153867, 55731, -252819, 116099, 55932, 61615, 109220, 264369, 236416, 230711, 77362, 7312, -69179, -128185, -302966, 281807, -280633, 8037, -289382, 132031, 57357, 6234, 32042, -98327, 109484, 211233, 205724, 202863, -208007, -151552, -146439, 20570, -100389, 210644, 138725, 162689, 279171, 111938, 15976, 188738, -38490, -136763, 36569, -141557, -102883, -368677, 179764, 27558, 27168, 330257, -170609, -51474, 89723, 125012, -8592, -194026, -435420, 126035, 57720, -142827, 119712, -190492, 43499, 1767, -126466, 1511, -7762, 91926, 245788, 82667, 205585, 186456, -25481, -116435, 309877, -144879, 19317, 72641, 1062, -42005, -226641, 169179, 259182, 37279, -16066, -132254, 255403]
12297B02043o1636c5843o6320A30267J34334R7525e3036K6442B78302a1454E298
12285A52776C9277J44405H898K91117D7072Q3937n796b8746A80324e1735I5554
12273A52450J8668H1969N8124f8391G7672k0077d7418a273A09812h6034C88953
12261C33748A7735K65268C5851a5991C62999A00654M8498k5532c0575B26172E3817
12249D8041K19281B0292L074O3637O271j2773a4686j31598F4817a54718A14014
12237g4183B32905G5217a9870A17281l1876f6285A5395Q3421l3758A1311J26832
12226A38143e6B21455o3494K47637H2338R9776n0500K25281p1368L3341o8932
12215B49936J15324A76884K54612a9847B36747O5528J2128b3257l4341C75170
$$ y = [202043, 140407, -35843, -102163, 130267, 264601, 362126, -53036, -26594, 278302, -11454, 5298, 152776, 39277, 183682, 8898, 300015, 47072, 131009, 125213, -28746, 180324, -51735, 95554, 152450, 171118, 81969, 140093, -68391, 77672, 57595, -47418, -1273, 109812, -86034, 388953, 333748, 17735, 283003, 35851, -15991, 362999, 100654, 149152, 123620, -30575, 226172, 53817, 48041, 267322, 20292, 23366, 87003, 93274, 80501, -14686, -146284, 64817, -154718, 114014, -74183, 232905, 75217, -19870, 117281, 85405, -66285, 15395, 98816, 65058, 11311, 138143, -56, 221455, 157961, 405598, 82338, 182114, 131614, 356895, 285527, 318868, 249936, 365260, 176884, 431496, -19847, 236747, 302275, 314403, -23257, -57598, 375170]
12204A04849J14833J22939j6331k8290c3607A81051o5168a44873A79495a15929
12193F2987O1641J8389J08604B1866K70764e41895d8095C60437j61162m4778J09214
12182B63711b7306G6500L26640A10079e9057H4562M6511A7481K07206J275E1089
12170I0400J22663k1246L5627C3076a05982A68139n0956b5862A71401J0317a75895
12158a78544A37397h0107B194N5213a70143A21129B8725J3405a02750E5159J53047
12147B08206l2378a58479C01484D5017J52518q9670i2230A72967B0794c11767
12136B08542a56239b12k6666r5069e649C5626e2665o0492C9051g2597B68755c79014
12123b52262j71751B37596e8470A9295M2445a12170M8388A68816R614R631r2040
$$ y = [104849, 219682, 342621, 326290, 298000, -33607, 181051, 115883, -144873, 179495, -115929, 62987, 124628, 143017, 251621, 21866, 292630, -541895, -48095, 360437, 199275, 154497, 263711, -27306, 76500, 403140, 110079, -59057, 84562, 131073, 17481, 224687, 225962, 51089, 90400, 213063, 191817, 227444, 33076, -105982, 168139, 117183, -25862, 171401, 181718, -175895, -178544, 137397, -80107, 2194, 57407, -170143, 121129, 28725, 42130, -102750, 55159, 208206, 175828, -158479, 301484, 45017, 197535, 107865, -92230, 172967, 20794, -311767, 208542, -156239, -212, -26878, -121947, -5649, 35626, -52665, -113157, 39051, -72597, 268755, -379014, -252262, -424013, 237596, -58470, 19295, 61740, -112170, -63782, 168816, 178430, 188061, 96021]
12112I6021D0436K8309c07293b0425o0372B61567D3461J72664j02910f4376B65822
12100A3691c5252g942A07647b08317B097J87460p3832l9501C4536M8959N1466
12089A34961c85854J55032F0310b654j91941F8307k5851J19618a3462B1358a67446
12077h302k5301q4411o4602j25449j0715O5259g7889B85212G8974a6782B09357
12065h6438C9328R540O3453L3414O10726L96389J72616o48909b5228p4784F02
12053H057K48451a48079F7720g0615j81168G4948i2670k42502i729j65650i664
12041g6991c8143H4791c70807b7971A94663D5968e0056G5634a32280A92798a59638
12029a23071I0829a74282I7941f7559H5920b95914B49934b88926e5804I1617R275
$$ y = [96021, 40436, 68745, -307293, -20425, -80797, 261567, 43461, 216125, 113215, -64376, 265822, 13691, -35252, -7942, 107647, -208317, 2097, 189557, 115725, 76224, 34536, 83495, 134961, -385854, -230822, 60310, -2654, -194595, 68307, 42456, 162074, -13462, 21358, -167446, -8302, -33603, -118014, -182616, -308065, -318780, -253521, -77889, 285212, 78974, -16782, 209357, -86438, 39328, 48868, 112321, 145735, 756461, 1152850, 1325466, 676557, -25228, -100012, 602, 8057, 256508, -148079, 67720, -70615, -251783, 74948, -92670, -335172, -9729, -175379, -9664, -76991, -38143, 84791, -370807, -27971, 194663, 45968, -50056, 75634, -132280, 192798, -159638, -123071, 90829, -174282, 97941, -67559, 85920, -295914, 249934, -288926, -55804, 91617, 100892]
12018A00892D5710a54359A50536i1755B34076a49842C11074j49958J75843C6519
12007G5377k8799a19166A04472a87234K0230a593B71714r3419a05351H2558g2359
11995b22746A20767a0220C34535q2289F4406P462b5642j58656G3118b24173B24137
11983a2480I0381K48346d6680A54892b5305j14775k508F7481c6096j239A98157
11971a48653C32069h7856g533L751B73398p1775i5009C9660i9190J1345B9589
11959b52356A72954i0745c1426B0308f7584k17218J13159c7419j07286k7568J6090
11948a56183B37749a65267A93413Q5184H4120a2369B30060c27645J62812A45033
11937a20906N7826k12664A62946C6310J55109n7855G728R8697e2022j23768B12166
$$ y = [100892, 45710, -154359, 150536, -91755, 234076, -149842, 311074, 161116, 336959, 36519, 75377, 46578, -119166, 104472, -187234, -167004, -1593, 271714, 178295, -105351, 82558, -72359, -222746, 120767, -10220, 334535, 252246, 64406, 71868, -25642, -184298, 73118, -224173, 224137, -12480, 90381, 338727, -46680, 154892, -25305, -140080, -142588, 67481, -36096, -37335, 198157, -148653, 332069, -87856, -7533, -3782, 273398, 201623, -95009, 39660, -99190, -87845, 29589, -252356, 172954, -90745, -31426, 20308, -67584, -284802, -171643, -37419, -144705, -172273, -156183, 237749, -165267, 193413, 278597, 84120, -12369, 230060, -327645, -164833, 145033, -120906, -63080, -275744, 162946, 36310, 191419, 133564, 7728, 106425, -52022, -175790, 212166]
11925B1294k012a4731D72174j45700j27322N6977m5385j2080l9072O1289h6730
11913a93742a7920f372m2587A10903b52808i7904j58916A46645b96213A40152
11902e3983A0780P705f7263A86601b35303a8458A88680a04148r9979g0395l1016
11891a01411A14320a74197A99485H1683g984n7022p4878K8585A04711d24836e8539
11879b94644R0642f7388k9204M2612K5160A53894A0255d0340l55762R3278B87501
11867a33139C32564j60123R98L08395h0426C82514a47652F9720f0552A68199A6349
11855C20680M6884i2334D01656I8755a44584B15496r2090a29972A57418j5a74281
11843b54918P9901j3928f2894j18768H0617a85469Q1848C36588a52052J3446M2926
$$ y = [21294, 19282, -14731, 472174, 326474, 199152, 256129, 210744, 198664, 159592, 220881, -86730, -193742, -17920, -6372, -48959, 110903, -252808, -97904, -256820, 146645, -296213, 140152, -53983, 10780, 18485, -67263, 186601, -235303, -18458, 188680, -104148, -204127, -70395, -101411, 114320, -174197, 199485, 81683, -7984, -65006, -139884, -111299, 104711, -424836, -58539, -294644, -204002, -67388, -96592, -53980, -28820, 153894, 10255, -40340, -396102, -302824, 287501, -133139, 332564, 172441, 173439, 481834, -80426, 382514, -147652, 69720, -60552, 168199, 16349, 320680, 367564, -92334, 401656, 98755, -144584, 215496, 123406, -129972, 157418, 157403, -174281, -254918, -175017, -188945, -62894, -181662, 80617, -185469, -103621, 336588, -152052, -138606, -95680]
11832i5680k42120I7549a34684D3474k749p375M8097b0815j2872A33450I753J18769
11820A28522a7914A12589D7021b59746J22867A0646M9388L2487l5156c36740H5433
11808I3417a65391d6536E9456f4267k53220A01633b48269B76230d63416b31592
11797b19610e183D98148D5345a02973j09387A26353D7355a77773j33891J04183
11787b07481A85231f9717l0097A12947b52860n1484D7922a72068p1964p144a01263
11775c84618a72417H4451L9568r244i4006b9920k45380J13122j64681e5178o082
11764f1260k54319B22191G8804g33k8712A88029c2428A53730n0837M7309I740
11752b64B12960d56534F1571P6998A1287e22116B511c6132B18009J98937d0164
$$ y = [-95680, -337800, 97549, -134684, 43474, 40725, 33350, 81447, -20815, -33687, 133450, 9753, 128522, -17914, 112589, 47021, -259746, -136879, 10646, 60034, 92521, 57365, -336740, 85433, 93417, -165391, -46536, 59456, -64267, -317487, 101633, -248269, 276230, -463416, -231592, -219610, -5183, 498148, 45345, -102973, -212360, 126353, 47355, -177773, -311664, -207481, 185231, -69717, -99814, 112947, -252860, -304344, 47922, -172068, -244032, -251176, -101263, -384618, -172417, 84451, 124019, 114775, -94006, -29920, -275300, -162178, -326859, -55178, -61260, -315579, 222191, 78804, -733, -29445, 188029, -32428, 153730, 102893, 150202, 9740, -264, 212960, -456534, 61571, 138569, 11287, -522116, 2511, -36132, 218009, 416946, -40164]
11740B73170b232j52048A75436M9209J8738H0014b4453A67795l2473a37423n9308
11729a96731A41042L9754R270h4309j55902k22911D0935K92871B2896a14769N2977
11718f1792A06971J48330b32293B9044f1501A21415F615b27293C3124Q1271K12262
11707C26657H0330b17680A14459J60490f7256b6152k6811A12182a2203l20440
11697c32643G8190a26398F5458f761q0160A02423L1728a22713F889a51718G7767
11685A81832A4736L5182J3376b52847c1509A94114b68796H5978J67442j22157
11675A31263a03491d2739D30407A8581g5959a0597q2188m7028e1484F7898h3571
11663f0082C2281a28003A92348c1534B99160b48662h5528B41292J14095A0301
$$ y = [273170, -2232, -154280, 175436, 224645, 243383, 80014, -24453, 167795, 135322, -137423, -196731, 141042, 180796, 190066, -84309, -240211, -463122, 40935, 333806, 22896, -114769, -61792, 106971, 255301, -232293, 29044, -61501, 121415, 6615, -227293, 33124, 114395, 326657, 80330, -217680, 114459, 274949, -67256, -26152, -52963, 112182, -12203, -332643, 78190, -126398, 65458, -6761, -86921, 102423, 134151, -122713, 6889, -151718, 77767, 181832, 14736, 49918, 63294, -252847, -31509, 194114, -268796, 85978, 253420, 131263, -103491, -42739, 430407, 18581, -75959, -10597, -92785, -139813, -51484, 67898, -83571, -60082, 32281, -128003, 192348, -31534, 299160, -248662, -85528, 241292, 355387, 10301]
11652c20429A2250a08700B84Q1436M2205a3044B43453A3980L27555A02055i1642
11640B29174i0222C45a17467j6773L9736o340A36270a71536a7710j2409J0087
11629b0032E8117J24507a13286b3373C30953A63214J94137F9839J12069A5397
11618D3368a71875F5806R880a83635h1397A4121a31782B34751A9315a39347r7304
11607b36651b2777F5661g886B6204a51135A78208M2544h0350L0910B39704b34047
11595E1996L13569a16965A25650h5244C4916c13572B61458P667j17147m7922j0662
11584I3394D2737N7085K28290H2579c6292B13564d3592C83042a93562A67850B9330
11572b31002B72531b1422j2951E9301K00476a7052B40132a15067E0737N8018a44166
$$ y = [-320429, 12250, -108700, 284, 81720, 123925, -13044, 243453, 13980, 341535, 102055, -91642, 229174, -90222, 345, -117467, -134240, -94504, -100844, 136270, -171536, -17710, -30119, -20032, 58117, 182624, -113286, -23373, 330953, 163214, 357351, 69839, 181908, 15397, 43368, -171875, 65806, 75686, -183635, -81397, 14121, -131782, 234751, 19315, -139347, -236651, -22777, 65661, -7886, 26204, -151135, 178208, 220752, -80350, -49440, 239704, -234047, 51996, 365565, -116965, 125650, -85244, 34916, -313572, 261458, 269125, 151978, 104056, 93394, 42737, 99822, 328112, 82579, -36292, 213564, -43592, 383042, -193562, 167850, 29330, -231002, 272531, -21422, -34373, 59301, 259777, -17052, 240132, -115067, 50737, 108755, -144166]
11560A44139A6928N01542B33988A16745a28867C27435b96816E6593L4788J1626
11550A03007K56837j70243H1655J03387l2165a94680p1172a21991q5331N6207
11540a51115B51343J5904e2219k43277B03197b4695D85103F268L56591F3653J35336
11529A98989b06511R0999a4352A62957j4267b1859H4103J8778f8210e297C29332
11517B18500J8832j3774C264J61718C1685g6418C53898a15124D2853g495B95844
11505B97665j48245J73146A16805C7456P0263Q5406o8885d527A39769J9108K10842
11494C69719A32330M003d8903B64627C9555J96398d2384A61349Q6466j22068J0758
11483A36505J4118j0634h0367A67681E1004O9818Q4545P8186k3549a70327B20629
$$ y = [144139, 16928, 518470, 233988, 116745, -128867, 327435, -296816, 56593, 91381, 103007, 359844, 189601, 81655, 185042, 152877, -194680, -265852, -121991, -207322, -151115, 251343, 267247, -52219, -295496, 203197, -24695, 485103, 6268, 362859, 63653, 198989, -206511, -115512, -14352, 162957, 148690, -21859, 84103, 102881, -68210, -5297, 329332, 218500, 237332, 223558, 3264, 164982, 31685, -76418, 353898, -115124, 42853, -7495, 295844, 297665, 149420, 322566, 116805, 37456, 107719, 193125, 124240, -4527, 139769, 158877, 369719, 132330, 136333, -48903, 264627, 39555, 235953, -42384, 161349, 247815, 125747, 136505, 150623, 139989, -80367, 167681, 51004, 120822, 205367, 283553, 260004, -170327, 220629]
11471A19024D3212D968N0457K7730L73325I3586P231a30286F6665J92884a28395
11459a59231F1352B5251M6853N6630h1610F3486J82113i8196r5832G3258K25105
11448B98363I4697M9662J40911L7137G6821j9062a74554c0450j63358p8598B03536
11436B08248b47824C3402Q6226d47988A17000f0234J8880K0557D52202A90226
11425D18805A60971k2684m6775E059j106h2374M0105m8125m1811d5098m0794F6448
11412D21260H8936A2752K29538f6140E2230p754f1290j1663A96634R1487a63057
11400b4939l39941a68212A04287i6037H7340b0178B43194d2761J6236j3155B04926
11388d6256j83432K6110j47699i0504F6960b10961j04402b1619A28208d7244A49389
$$ y = [119024, 43212, 4968, 55425, 83155, 456480, 93586, 100817, -130286, 66665, 259549, -128395, -159231, 61352, 25251, 72104, 128734, -81610, 63486, 245599, -98196, -194028, 73258, 298363, 94697, 144359, 285270, 322407, 76821, 57759, -174554, -30450, -193808, -272406, 203536, 208248, -247824, 33402, 119628, -447988, 117000, -60234, -41354, -20797, 452202, 190226, 418805, 160971, 138287, 91512, 5059, 3953, -82374, -42269, -90394, -132205, -45098, -85892, 66448, 421260, 88936, 12752, 242290, -66140, 52230, 44476, -61290, -72953, 196634, 288121, -163057, -24939, -364880, -168212, 104287, -96037, 87340, -20178, 243194, -42761, -26525, -39680, 204926, -46256, -229688, -203578, -351277, -90504, 66960, -210961, -315363, -21619, 128208, -47244, 149389]
11376B03358F7961b56891a17958A61911j1281M0863h0957I9422a67810B31331
11365b10463g8603i982m5799n6744A32135a94747A2161c04627c780A61020K7940
11354A88960a76955A44191J8177F119Q4001m4146a1359j34894A3004d8465A92270
11342A87578k2129R258a39224A54986B86K27064J36440e051o9501q3208f4542
11330B40969P6932a59772A74941M5633b10877M9773d196D7545J81277C7570L91889
11319D29459j54145F9022O9901P0899r6014F082a25837f1934k13414R5797A65802
11307a84511A22156D5410N5806k7856a08578b2614j50567F3603d1073f771n8948
11296f5719q7561B3450O5338c5608k77356E6972e6616G3067Q8951a17544j26697
$$ y = [203358, 67961, -256891, -117958, 161911, 150630, 191493, -80957, 99422, -167810, 231331, -210463, -78603, -9982, -55781, -112525, 132135, -194747, 12161, -304627, -3780, 161020, 188960, -176955, 144191, 162368, 6119, 90120, 45974, -11359, -146253, 13004, -48465, 192270, 187578, 165449, 174707, -139224, 154986, 286, 227350, 363790, -5051, -74552, -157760, -64542, 240969, 317901, -159772, 174941, 220574, -210877, -161104, -4196, 47545, 228822, 37570, 429459, 275314, 69022, 138923, 209822, 113808, 6082, -125837, -61934, -275348, -179551, 165802, -184511, 122156, 45410, 101216, 73360, -108578, -22614, -173181, 63603, -41073, -6771, -65719, -153280, 23450, 88788, -35608, -312964, 56972, -56616, 73067, 162018, -117544, -244241]
11285b44241a5764k75940J04055g5617k00927C69121A78875a25293k26962A98607
11274H4636B9129Q2019h6843A20312a28261C3282b8322n7190J682B01724b7106
11262e18B58415b43198a20042A92790K162C700b8364A34436a0524B78437F2830
11250a5230j54887A97776a29073m3852A1373b03124l0834j12905M8419R7472K3600
11239a77372B19623c5384A0951i1791F8403a12788p027C7421b01538d7137a8258
11227g3523D3379q139e2829C37220A19967b31797A25111A3109N9872a01717D7479
11215c15393g4994l8786L5607j00106a5477j68892c5055D141b33558A27201C469
11203B2992l412a71282H7401d3888a3701F8152J8584l20a59033a9879A86561a05272
$$ y = [-244241, -15764, -291704, -187649, -75617, -276544, 369121, 178875, -125293, -352255, 198607, 84636, 29129, 111148, -86843, 120312, -128261, 33282, -28322, -85512, -83830, 201724, -27106, -518, 258415, -243198, -120042, 192790, 194952, 3700, -28364, 134436, -10524, 278437, 62830, -15230, -170117, 197776, -129073, -172925, 11373, -203124, -233958, -346863, -298444, -200972, -177372, 219623, -35384, 10951, -91791, 68403, -112788, -119815, 37421, -201538, -47137, -18258, -73523, 43379, 35240, -52829, 337220, 119967, -231797, 125111, 13109, 72981, -101717, 47479, -315393, -74994, -113780, -78173, -178279, -15477, -184369, -35055, 4141, -233558, 127201, 3469, 22992, 19580, -171282, 87401, -43888, -13701, 68152, 86736, 86416, -159033, -19879, 186561, -105272]
11190F6379a09807d4408r543q495Q32j21145A17161b51551A7421b17499e2804
11178a57959P4624j2292F4948N9808R7319b02542j43381Q2782B16076a42335c5165
11166b42465H1637b10667E7450c06726B57431c3958C64548e0407C9369j5412a04991
11154h2112k43966F0556P3489P519k6367E3888g4233E3461B1343a08756H0108
11142c8551A06206r884i2149B46959a59080j35868I733i5939d7871B9915d2936
11130A14778J7665D38a3694D6774K50458G0788J60501j00668n2454L9633j8497
11119I9303g3097o4485D9273J22919a15797d7291F5533f6875C04497J22597j86573
11108B40521n5166a61187B24593J82784j88379A04855B1394J58985l7868l4893
$$ y = [66379, -109807, -44408, -53951, -62446, -61614, -182759, 117161, -251551, 17421, -217499, -52804, -157959, -83335, -95627, 64948, 124756, 222075, -202542, -345923, -263141, 216076, -142335, -35165, -242465, 81637, -210667, 57450, -306726, 257431, -33958, 364548, -50407, 39369, 23957, -104991, -82112, -326078, 60556, 134045, 141564, 115197, 53888, -74233, 53461, 21343, -108756, 80108, -38551, 106206, 96322, -92149, 246959, -159080, -294948, 9733, -95939, -47871, 29915, -42936, 114778, 132443, 438, -13694, 46774, 297232, 70788, 231289, 130621, 78167, 117800, 99303, -73097, -137582, 49273, 172192, -115797, -47291, 65533, -66875, 304497, 427094, 240521, 185355, -161187, 224593, 407377, 218998, 104855, 21394, 180379, 142511, 107618]
11098A07618a37607D43266l5529A877M06619d2796B73060k2074r1878C9215J94615
11087B33830K1722C0576O1710J80751a5692E830K75482j25932J81629j13998I0956
11075C81748j333m5232A49165K13851o5181K96716B09890j3663L5681J36523J9394
11064C87825K14535B88981L02997L22461m27782j68894N289J52424L7836K35971
11054G49283Q8086J12278D30706K91853j46651j65345K51340P7253K24868C93406
11043F55189k96991M20039M7006r2624J09703J79183j96119j68854K20471C34666
11032H46603C36109L91834r71l36900M66055k29892j49429R6381K78234l20110
11022E31311n0346K33660k29989M4029J15015k6206j55336K8429M5554l6619l1926
$$ y = [107618, -137607, 443266, 407737, 1877, 408496, -42796, 273060, 250986, 159108, 39215, 233830, 255552, 30576, 92286, 273037, -15692, 5830, 281312, 155380, 337009, 223011, 90956, 381748, 380415, 335183, 149165, 363016, 297835, 594551, 209890, 196227, 231908, 368431, 387825, 602360, 288981, 591978, 914439, 486657, 317763, 323052, 475476, 513312, 749283, 837369, 949647, 430706, 722559, 575908, 410563, 661903, 739156, 964024, 393406, 655189, 358198, 778237, 825243, 732619, 842322, 1021505, 825386, 656532, 877003, 334666, 846603, 336109, 727943, 726972, 390072, 856127, 626235, 476806, 573187, 851421, 531311, 480965, 714625, 484636, 528665, 643680, 617474, 462138, 490567, 536121, 499502, 467576]
11011D67576B16919K15089K885J2408P0232J1843M083J35572k8620k11633L23832
11000G52610o1042O6113l25523o8859L85714l2361J32424l22061K30373P9573
10990H36961j73927q2630L70320k88473l6424M97678k85801R9670K93644j59692
10980A071326K25321K08961j25882J37198M63647J41210n9551N62324J14968j22458
10970B617064K01703l16349J20743m30142Q824l08177K41978k55595P0668L26654
10960B277371k88909J59631j94648j42610L64187o66669K8337j12687R7747m32981
10950A088769j83628j42436B85417K29146R2665A4244J5314K14657F8666c4997
10939A6204J5404J42848K42547a58987C34503D4633a51269A71509L5632a387k6734
$$ y = [467576, 216919, 432008, 434893, 447301, 517533, 529376, 533459, 669031, 640411, 428778, 752610, 691568, 757681, 432158, 363299, 749013, 716652, 849076, 527015, 757388, 836961, 663034, 580404, 950724, 662251, 625827, 1123505, 837704, 937374, 1231018, 1071326, 1296647, 1505608, 1379726, 1516924, 1980571, 2121781, 2062230, 2624554, 2739522, 2617064, 2818767, 2502418, 2623161, 2193019, 2201843, 1893666, 2135644, 1880049, 1950717, 2277371, 1988462, 2148093, 1953445, 1810835, 2175022, 1508353, 1536690, 1424003, 1521750, 1088769, 905141, 762705, 285417, 514563, 607228, 14244, 29558, 244215, 68666, -34997, 16204, 31608, 174456, 417003, -158987, 334503, 44633, -151269, 171509, 207141, -1387, -28121]
10928b8121B35131h9149C17721J00208j00096j14270b8705B17412b27933A65489
10917b09868B85229A38980a80706D22748b8921k3587A63273o988a44832e4898
10906A76567a37715A58353B2133i7654c8103B49659l8100a55768A78183f1171
10895A44149h0666c7832D13060A54892H194b8758H1376i2501d2723G0826A1166
10883A47971a01964E4062b3938C50515h3776j0411j93465J13815B32872k7144
10873B05728c8800B3663a36596A9607Q9366e0345A35045A3621b4523k60688B06629
10861B61191e3280F9429a19231A97349j630b10702J7533o9222J5244f3893B655
10849A03918B8965d5332A66611N1130g9744r4525j5109j01104E100J21003D3528
$$ y = [-28121, 235131, -89149, 317721, 417929, 317833, 203563, -28705, 217412, -227933, 165489, -209868, 285229, 138980, -180706, 422748, -28921, -52508, 163273, 156285, -144832, -54898, 176567, -137715, 158353, 22133, -97654, -38103, 249659, 211559, -155768, 178183, -61171, 144149, -80666, -37832, 413060, 154892, 8194, -28758, 81376, -92501, -42723, 70826, 11166, 147971, -101964, 54062, -23938, 350515, -83776, -94187, -287652, -173837, 232872, 205728, -38800, 23663, -136596, 19607, 108973, -50345, 135045, 13621, -24523, -285211, 206629, 261191, -53280, 69429, -119231, 197349, 195719, -210702, -193169, -262391, -247147, -63893, 2655, 103918, 28965, -45332, 166611, 217741, -79744, -174269, -189378, -290482, 5100, 126103, 43528]
10837a37185k2204a7925q380g242o7223A97243a05338C7109b46884C7369J76224
10826B13593a05420a6817A53762e00153i5910D6661b07882g1925a3340D0295h6881
10814A86446p2468g7865k35607i496A27876J26673a72995c410i73A8831d5305
10802a30049j24936g6464q3492C33291c04054Q9493A61446c01320J08318c3641
10791I8251a17406N7685E5105J2767J34931a81466h5739o2795I1506a88036A82902
10779a5543o7105B51190p3269E1433b17062b9163l7346n5287C7076b6363l7477
10768f3840A42930R0646a53993m4031p2841d9914B61548g505A02301k0135e1937
10756A69129J82468b08736K8619g981q0664D19560a85062A38904D4454a96778
$$ y = [-137185, -159389, -17925, -26305, -7242, -74465, 197243, -105338, 37109, -246884, 37369, 213593, -105420, -16817, 153762, -500153, -95910, 46661, -207882, -71925, -13340, 40295, -86881, 186446, 113978, -77865, -313472, -9496, 127876, 254549, -172995, -3410, -973, 18831, -45305, -130049, -254985, -76464, -159956, 333291, -304054, -214561, 161446, -301320, -193002, -33641, 98251, -117406, -59721, 55105, 67872, 202803, -181466, -85739, -148534, 91506, -188036, 182902, -15543, -82648, 251190, 177921, 51433, -217062, -29163, -66509, -121796, 37076, -26363, -63840, 142930, 233576, -153993, -198024, -270865, -49914, 261548, -7505, 102301, 82166, -51937, 169129, 351597, -208736, -180117, -7981, -88645, 419560, -185062, 138904, 44454, -196778]
10745B0593P1290a58836A274g235m9136O464D5502b02021H7930c7629F4933H451
10732a94864j0400C9111K84167h0710j62175A84311b2833B4002a95265N6190k15176
10721c54251a517j01586n2919D099L5601d8505A67362N8420A4976R5157a39131
10709H3352J20382i9618k26892G7008b97845B39820J02134c3214m9811j10855
10699a93880L2532g522k1374p1608A28275a99148A56829b31524E9822a91702C7757
10687c50236A23945D3219J792a88626E7732L5577l253h0701c5581A53047f0901
10675a48872q3687C8204R8508k357b42483A44797f8640B01378D5617g7612j01886
10664a79498F2794h7992j80872A46922a15975B21365c49390n4407C67842b03542
$$ y = [20593, 91883, -158836, 1274, -7235, -56371, -49907, 45502, -202021, 87930, -37629, 64933, 8451, -194864, -205264, 39111, 323278, -80710, -242885, 184311, -22833, 24002, -195265, -139075, -354251, -1517, -103103, -156022, 4099, 39700, -48505, 167362, 225782, 14976, 110133, -139131, 83352, 203734, -99618, -326510, 77008, -297845, 239820, 341954, -33214, -83025, -193880, -161348, -7522, -28896, -100504, 128275, -199148, 156829, -231524, 59822, -191702, 37757, -350236, 123945, 43219, 45011, -188626, 57732, 93309, 90056, -80701, -35581, 153047, -60901, -148872, -232559, 38204, 136712, 134355, -242483, 144797, -68640, 201378, 45617, -77612, -179498, 62794, -87992, -268864, 146922, -115975, 221365, -349390, -403797, 367842, -203542]
10653C6700f8647D5785N5259h5288n6109j51268a34591C1108b47294b5937A81282
10641g8862j37994g7902j56829A06590b75129A92510G1235E806b444A81650Q7224
10630B68874H8130e070l21423a13089A07200a90357J1544a4930k49842B4846g1087
10618b44764A37802C845e6545l3674d2175k8962B57947d3089B15597J89676c26751
10606b04465P4756B39345a64026K9065p8926P194H1847c69296h0500a696q1987
10595h3683F2370c32004H0168b54726d2938A0195a42108A8598K72816b7166A8118
10583b38885R8510O1871j69462F4525h3752E418J35020a80196h4187A67439a88085
10571D6416d5608l45078A66948a33285A9769c19142c9032k10369K9602B16268
$$ y = [36700, -68647, 45785, 101044, -85288, -141397, -292665, -134591, 31108, -247294, -25937, 181282, -78862, -216856, -77902, -234731, 106590, -275129, 192510, 71235, 5806, -2444, 181650, 268874, 88130, -5070, -326493, -113089, 107200, -190357, -178813, -14930, -264772, 24846, -71087, -244764, 137802, 3845, -56545, -90219, -42175, -71137, 257947, -43089, 215597, 405273, -326751, -204465, -129709, 239345, -164026, -134961, -213887, -206693, 81847, -369296, -80500, -1696, -83683, 62370, -332004, 80168, -254726, -42938, 10195, -142108, 18598, 291414, -27166, 18118, -238885, -140375, -78504, -247966, 64525, -83752, 5418, 140438, -180196, -84187, 167439, -188085, 46416, -45608, -390686, 166948, -133285, 19769, -319142, -39032, -249401, -219799, 216268]
10560a1148A71801C5910K1631O346b41570j027M5107G3928a37125L5058I5793
10548b07699A63459c4407G3441k6801c66215A51222J88854A02082K9112a75609
10537G6011a50018B79355c60775C82778a04431C3898b7361l804j2969A32927j3341
10526A19586a7691n5034B3238h3482b5903Q14B66794b1051K164B77693j6612G8932
10513c23330h7933F0051h51m49545a92500A4173J80496D3085a6510r4770e3819
10501b0019A46392h7075j03844f4056q9688l96290a13653A62117b19743i67o5994
10490f6961m552A8320a14701r8775B6656O44b3513j9102C27060A55331J96025
10479C51356J87730A88643a14260I5941c7279B9652F239J83315p9629h2756D9479
$$ y = [-11148, 171801, 35910, 57541, 63887, -241570, -242597, -197490, 73928, -137125, -102067, 95793, -207699, 163459, -34407, 73441, 46640, -366215, 151222, 340076, 102082, 131194, -175609, 76011, -150018, 279355, -360775, 382778, -104431, 33898, -27361, -31165, -44134, 132927, 119586, -17691, -72725, 23238, -83482, -25903, -25089, 266794, -21051, -18887, 277693, 261081, 78932, -323330, -87933, 60051, -851, -450396, -192500, 14173, 194669, 43085, -16510, -111280, -53819, -20019, 146392, -87075, -190919, -64056, -153744, -550034, -113653, 162117, -219743, -967, -66961, -71513, 18320, -114701, -213476, 26656, 27300, -23513, -42615, 327060, 155331, 351356, 539086, 188643, -114260, 95941, -37279, 29652, 6239, 189554, 109925, -82756, 49479]
10467I5571d983A36849P6355a4344l5253A60349g869D456R432a33792E5676b92125
10454C7925K5969L83776b02361o7888A06985Q5898a68660B33169a14263F4484
10443A27504J69755E8066Q3951a1700B06637a38856H8750D2026b14891Q9385H4457
10431c4674I954M0191a97181B21467D7713P5094a96397g2021D44011k00544d375
10419A31912a9531k36363B49183A15932k91e0778j77989P7738f6536R982H263
10407a33366B70380D4950a64710f1286H3135b7006m380k33788B2522a65364A58438
10395f5927D19173A9261a00077A87275f5871B16835a11533q0672D12129H4956
10384A88259j3200a55787q3590a5205C28600k4356Q0144n0339J10904A94357m725
$$ y = [95571, -4983, 136849, 213204, -14344, -49597, 160349, -7869, 4456, 13888, -133792, 55676, -292125, 37925, 63894, 447670, -202361, -270249, 106985, 192883, -168660, 233169, -114263, 64484, 127504, 297259, 58066, 142017, -11700, 206637, -138856, 88750, 42026, -214891, -125506, 84457, -34674, 9954, 50145, -197181, 221467, 47713, 122807, -196397, -72021, 444011, 243467, -4375, 131912, -19531, -255894, 249183, 115932, 115641, -50778, -228767, -151029, -66536, -56554, 8263, -133366, 270380, 44950, -164710, -61286, 83135, -27006, -31386, -265174, 22522, -165364, 158438, -65927, 419173, 19261, -100077, 187275, -65871, 216835, -111533, -192205, 412129, 84956, 188259, 175059, -155787, -239377, -15205, 328600, 304244, 384388, 334049, 444953, 194357, 189632]
10373A89632J50258j36584K73771B36612K16525j06060O92L14121B45481L54944
10363F00425k84162P7807H4937a19591C24707a42217A8880a17147D24673q7913
10353C36760b38102B41845J69816n2731J23321B36056J21562J29023G9995d005
10342E9257k1872J42964J41798A18424L2900J68239b55196J09054A98056b72139
10331A78389J34822F5013E775P2208d9858B16097O6761r3981K1012c4605A06430
10319A06931j2157J48239H2777a99074G8543P8271E1855R9879J21268l2226a56074
10307b03119g6196E6474f2303j3755m3345n9614E1942L10280B421K43164j4485
10296B31100p4379l4426d0109k3286j4555o7487d2910I0970k9290l0057P663A1044
$$ y = [189632, 339890, 203306, 477077, 236612, 453137, 347077, 347769, 661890, 245481, 600425, 316263, 394070, 84937, -119591, 324707, -142217, 18880, -117147, 424673, 336760, -238102, 241845, 411661, 358930, 482251, 236056, 357618, 486641, 79995, -4005, 59257, 37385, 180349, 322147, 118424, 151324, 319563, -255196, -146142, 198056, -272139, 178389, 313211, 65013, 5775, 77983, -49858, 216097, 282858, 188877, 209889, -34605, 106430, 106931, 94774, 243013, 82777, -199074, 78543, 156814, 51855, 151734, 273002, 240776, -156074, -203119, -76196, 56474, -62303, -76058, -119403, -179017, 51942, 362222, 2421, 245585, 231100, 156721, 122295, -40109, -63395, -77950, -145437, -42910, 90970, 61680, 31623, 39286, 11044]
10283b45346b0888A12572e09433A73148a33875A31371i5800L1305B55126a01859
10272A14434F091J52596e3208B78117c8360B21091d5240r5418p1366B89144A16192
10260C82471j19137j06556M57670j49743l509j14584O0799A02531e2225A62099
10249A91660I4169e2523j65199A06145c6680q7801A12767a10052b4380G5524k451
10238G3073a60116P0260j21278Q6137M1787K0149k21007h4441j68976e3409k47241
10227c00650b6578R151m4291C262P4859L8364a19113K4300B4187O7770J3959f0170
10214b63236i4710d2156j04504c3106j45129q2703e9464D8023J13785a32008Q110
10203a23898N4875j92514C983c24313A32429a90694A97159C4039K37190b5936
$$ y = [-245346, -20888, 112572, -509433, 173148, -133875, 131371, -95800, -64495, 255126, -101859, 114434, 6091, 158687, -53208, 278117, -38360, 221091, -45240, -140658, -212024, 289144, 116192, 382471, 263334, 156778, 614448, 464705, 461196, 346612, 407411, 102531, -52225, 162099, 191660, 94169, -52523, -217722, 106145, -36680, -124481, 112767, -110052, -24380, 75524, 73073, -160116, -89856, -211134, -124997, -83210, -63061, -284068, -84441, -253417, -53409, -300650, -26578, -17427, -61718, 3262, 78121, 116485, -119113, -94813, 24187, 91957, 105916, -60170, -263236, -94710, -42156, -146660, -33106, -178235, -260938, -59464, 48023, 161808, -132008, -123898, -69023, -261537, 3983, -324313, 132429, -190694, 197159, 34039, 271229, -25936]
10192h898A01990Q7375a09103j31417L6359G6203c33870J09635L0153D5821J21901
10181A67722a0898n2739j00607j05735R5811j18866A28538c49711O4172A7475
10170A83539a71099Q2082l40280I4863O4165J3359n4191b65167A74863b50984
10159a33930A73320A6809d02939a4954H6264a55805A10321J1218B1920K45483
10149B67403h0269l4622J5602A58713b08790C58878b2266A62356d195j53914k8093
10138a86202h6681r2250m7305F0876b24644B27457a83745A24469b9693A37633
10127d359j13421B52449b02462M2420A37775m8599a74668C3912a68208B311b78064
10115c09749J27243C4731b46522g1124j46891k1166A69467J25487a9199j80289
$$ y = [-8898, 101990, 189365, -109103, -240520, -204161, 76203, -333870, -224235, -194082, 45821, 167722, -10898, -63637, -164244, -269979, -174168, -293034, 128538, -349711, -285539, 17475, 183539, -171099, -89017, -429297, 94863, 159028, 172387, 118196, -265167, 174863, -250984, -133930, 173320, 16809, -402939, -14954, 86264, -155805, 110321, 121539, 21920, 267403, -80269, -114891, -99289, 158713, -208790, 358878, -22266, 162356, -4195, -158109, -186202, -86681, -178931, -226236, 60876, -224644, 227457, -183745, 124469, -29693, 137633, -4359, -117780, 252449, -202462, -160042, 137775, 89176, -174668, 33912, -168208, 2311, -278064, -309749, -182506, 34731, -246522, -71124, -218015, -239181, 169467, 294954, -19199, -199488]
10105a99488c6591k01487P0893L4321a2139D7514b1124A75506K87189A31294J08204
10094B39498P7558a80955B36950b11578i4493r562B46658b18770C9815c91545
10083b24059a196p8385A10430a68975A5683a42952M9565A37914f3146K6063l6256
10072g3339j23254A29875d4048k28866A12279B9693M6781a88291e4786n3972r1103
10061a99861D5626c25978J29067E1694a02851a9344I6816K870a50554B3659n671
10050A7988a27698C4280a4110j77479j51972g7889l87682B1417N9595a34949A04504
10038e6240k12559B02761j4456b8876B0367a56234j21917A55509b11261C870J65202
10027A69072m4808K82414a20426A14927d002j26957n9310g2156A43893m3473c8991
$$ y = [-199488, -36591, -238078, -167185, -132864, -12139, 47514, -21124, 175506, 462695, 131294, 239498, 317056, -180955, 236950, -211578, -94493, -104055, 246658, -218770, 39815, -391545, -224059, -1196, -79581, 110430, -168975, 15683, -142952, -93387, 137914, -63146, -37083, -73339, -196593, 129875, -44048, -272914, 112279, 29693, 76474, -188291, -54786, -108758, -199861, 45626, -325978, -196911, 51694, -102851, -19344, 96816, 99686, -150554, 23659, 17988, -127698, 34280, -14110, -191589, -343561, -77889, -465571, 21417, 81012, -134949, 104504, -56240, -268799, 202761, 188305, -28876, 20367, -156234, -278151, 155509, -211261, 3870, 169072, 124264, 406678, -120426, 114927, -4002, -130959, -190269, -72156, 143893, 100420, -38991]
10015H2353k1628a64965a2813j35875K7203L8823j05486h0660k42422A14047J35399
10004B49446e7947A34911B5534J62669J27011a08859n1130E6830K14373d30207
9993c53370K9391n478G1397a68054O5678b8059j67247A07692c04752C2372i4515
9981A38203g2822n3308C8293M2642a23427r1069d5066A67688b94188A2862d2304
9969b06277f6457B77438i5757F5388g2394b7912n7834A4308J07684a71128A84915
9957a28013j58611O3039i3821k58240C19407b28811b7338M926A4878a07112p7616
9946a84728q9359i2861H9933e2133j1839E331Q2514M7160K95571b67273B24620
9934b25299A58933G7845f3434j54816A78082b49038B02645c0871r6408j96408
$$ y = [82353, 60725, -164965, -12813, -148688, -121485, -82662, -188148, -80660, -323082, 114047, 249446, -57947, 134911, 25534, 188203, 315214, -108859, -159989, 56830, 271203, -430207, -353370, -323979, -329457, 71397, -168054, -102376, -28059, -195306, 107692, -304752, 32372, -94515, 138203, -72822, -126130, 38293, 80935, -123427, -214496, -45066, 167688, -294188, 12862, -42304, -206277, -66457, 277438, -95757, 65388, -72394, -27912, -85746, 14308, 121992, -171128, 184915, -128013, -286624, -223585, -93821, -352061, 319407, -228811, -27338, -22412, 14878, -107112, -184728, -274087, -92861, 89933, -52133, -63972, 5331, 87845, 135005, 430576, -267273, 224620, -225299, 158933, 77845, -63434, -218250, 178082, -249038, 202645, -30871, -127279, -323687]
9924c23687A91840H5291J11898K09010a22857B8435a5533H5751K16144C0098b61082
9912f6203A3035R7973A4212g5845A3702b46924a22223c0176k39317E1643b19796
9900e8330E2266c93036a74234Q6611k23729C449b71761G2233m117a4714A1309
9888a56886c3248A054c10958A1279J78613f4776n234j87666f0789b5806A67300
9876a40161J7133b1343H1080e88910b65959J04024A47199C961a15853b5860g776
9864B60969d8687j17610A20804b29441a2110A4055J5809a40202O2124j29081a4736
9852i4699j89997F6228K4530a97662A14828a37903J9448l7888A64167c81368e641
9840g4428K2452C3936J11957b0850r4960m8055c8920A10043C6922J7691h4426
$$ y = [-323687, 191840, 85291, 197189, 406199, -122857, 28435, -15533, 85751, 301895, 30098, -261082, -66203, 13035, 111008, 14212, -75845, 13702, -246924, -122223, -30176, -269493, 51643, -219796, -58330, 52266, -393036, -174234, -87623, -311352, 3449, -271761, 72233, 68116, -14714, 11309, -156886, -33248, 1054, -310958, 11279, 189892, -64776, -70010, -257676, -60789, -25806, 167300, -140161, -123028, -21343, 81080, -588910, -265959, -161935, 147199, 3961, -115853, -25860, -7776, 260969, -48687, -166297, 120804, -229441, -12110, 14055, 29864, -140202, -78078, -207159, -14736, -94699, -284696, 66228, 90758, -197662, 114828, -137903, -118455, -156343, 164167, -381368, -5641, -74428, -51976, 33936, 145893, -20850, -115810, -163865, -38920, 110043, 36922, 54613, -84426]
9828C3078a68347H6616a49739n3694r1715F3537a86514B22595H1286O8083b07717
9816b64845D7875d9011D4758L895J59683b33887f5277n6324j31277j59998A43505
9804f1200k5503k7326e6411p8303n1106b1788j12135N4336j9438r1075G775A471
9791A697a42881K6490j9687H6346a9124j49560A94844a80490N0220p1938j25488
9780c27696C01812A04923b47951E4169e59989d3824r8975a1531o6788Q676k59729
9769c29372g1661k84543K5394f6436k95155a39885c6710l06714a03388a1021j48587
9758a59608O9811m6375B20361C6572K080a66859O4974C0616K86563b83218b5907
9746d1732p678n7082A282f4174a7438r3670j55106J22250A09021a12686o4330
$$ y = [33078, -168347, 86616, -149739, -203433, -295148, 63537, -186514, 222595, 81286, 149369, -207717, -264845, 47875, -49011, 44758, 48653, 208336, -233887, -65277, -121601, -252878, -412876, 143505, -61200, -86703, -114029, -56411, -134714, -185820, -21788, -133923, -79587, -99025, -190100, 7775, 1471, 1697, -142881, -116391, -136078, 86346, -19124, -168684, 194844, -180490, -130270, -202208, -327696, 301812, 104923, -247951, 54169, -559989, -43824, -142799, -11531, -78319, -69643, -329372, -71661, -356204, -330810, -66436, -361591, -139885, -36710, -343424, -103388, -11021, -159608, -89797, -136172, 220361, 36572, 38652, -166859, -101885, 30616, 317179, -283218, -25907, -41732, -49410, -106492, 1282, -64174, -17438, -111108, -266214, -143964, 109021, -112686, -177016]
9735a77016B5287a20197B37775a19965B1900e3239B9342d2805A29327j6451B3442
9723b6403B23303q6035c93649a234o7270j4476K0854m6313m0185A36982g3005
9711a50092e9462k24523k47562b6307l15728B33686i2597l1230H7532B856K77392
9700B80248j16637b37983P5581g9999p5607B61144j23129d3327B27835i1868j41514
9689b33382A58082a48971f6165A70410L7571a59508A2086d79448a20091G4687
9678b74175C0320g5535A73585a44343m8608r6262C3769g9985E2798c85779A55165
9666c0170A18450N725d81965A76499c00721J01159R0146j76496I9083a86981R2503
9655i4478p562A058Q5304P9807k7577c92703a32394C5165b13314L5422A74331
$$ y = [-177016, 25287, -120197, 237775, -119965, 21900, -53239, 29342, -42805, 129327, 112876, 23442, -26403, 223303, 137268, -393649, -1234, -68504, -82980, -62126, -108439, -148624, 136982, -73005, -150092, -59462, -283985, -531547, -26307, -342035, 233686, -92597, -123827, 87532, 2856, 280248, 163611, -237983, -162402, -79999, -155606, 261144, 138015, -43327, 227835, -91868, -233382, 158082, -148971, -66165, 170410, 207981, -159508, 12086, -479448, -120091, 74687, -274175, 30320, -75535, 173585, -144343, -192951, -289213, 33769, -79985, 52798, -385779, 155165, -30170, 118450, 124175, -481965, 176499, -300721, -199562, -109416, -285912, 99083, -186981, -94478, -102040, 1058, 86362, 166169, 138592, -392703, -132394, 35165, -213314, -177892, 174331]
9643a8959k19178j1063d1925q8321P538C9051a67996j345c5935k0292A36500E7042
9630b08971H3517J40980d2944F1735j0500c3798j5741i402k500E246J0005a95662
9617b81107i4823A34561K9055a45018e8442C07276b3011l03405B7863K81335b18679
9605B06050c75333o5787d4756j35622L1280B2007f4255a9694o2728B23160b2350
9593a344j26138E405K07822a80945O5081p509l991l3508A61154a86902Q7020I1443
9580A86661M7792a3780l7018j52338l711j89035A9712a61886M7417d6488k0240
9569f6728j07381O5849J5666K8336j85317K4041P6265A61044g9162C03638c5427
9557a34245l5060d8523n9463q7054N5284j0763l08905A20243e9000B51266c1760
$$ y = [-18959, -238137, -249200, -41925, -130246, -122708, 39051, -167996, -169341, -35935, -56227, 136500, 57042, -208971, 83517, 224497, -42944, 61735, 51235, -33798, -49539, -9402, -11902, 5246, 15251, -195662, -281107, -94823, 134561, 163616, -145018, -58442, 307276, -23011, -326416, 27863, 309198, -218679, 206050, -375333, -441120, -44756, -180378, -149098, 22007, -64255, -19694, -82422, 223160, -22350, -1344, -127482, 5405, 213227, -180945, -115864, -123373, -127364, -160872, 161154, -186902, -99882, 91443, 186661, 234453, -13780, -50798, -203136, -206847, -395882, 19712, -161886, -114469, -46488, -66728, -174109, -108260, -92594, -64258, -249575, -225534, -149269, 161044, -79162, 303638, -35427, -134245, -169305, -48523, -107986, -195040, -139756, -150519, -459424, 120243, -59000, 251266, -31760]
9545C59855g4064j82194j24030a60509J5795j49284a29210M5397c1219A33509
9534A10934b06380j31072c782A81423a54590J2199H0094g5042j75538i5035K1271
9523g3764K1745A0959J76391b9626A21725d10759f6748H7392j1891l4314a33942
9511G8227c7792m6631B36879D1372a90500k8496R2900M6124C5826n084J50074
9500A80816c96375A2268e855l78477g1388A26676a33754K1962H8397b85215L2907
9489b52308e926k35171d1240A37091R840E2323E163Q3681K2775b37960A28646
9477A04838a09595j26931j09080A40485a81206m9854C3715b64696a03934l885
9467a07819B61826c34446b9332G4488O6819a44255a5642j68012A16575a90251
$$ y = [359855, -74064, -256258, -380288, -160509, -144714, -293998, -129210, -83813, -31219, 133509, 110934, -206380, -337452, -3782, 181423, -154590, -142391, 80094, -75042, -250580, -95035, -73764, -52019, 10959, 187350, -29626, 121725, -410759, -66748, 87392, 75501, 41187, -133942, 78227, -37792, -84423, 236879, 41372, -190500, -218996, -126096, -79972, 35826, 30742, 180816, -396375, 12268, -5855, -384332, -71388, 126676, -133754, -111792, 88397, -285215, -252308, -5926, -241097, -41240, 137091, 146931, 52323, 5163, 88844, 111619, -237960, 128646, 104838, -109595, -236526, -345606, 140485, -181206, -231060, 33715, -264696, -103934, -107819, 261826, -334446, -29332, 74488, 141307, -144255, -15642, -183654, 116575, -190251]
9456B07406j444K2536A2851a33132q1181A28406m8672b57165A64646Q3687G2694
9444b1649j35515j77062a09639k08456p0040A61996I621O1999B8891a7820n6356
9433g4176j11476A54389c9270o467p8614l3419D9838d8298m8107B54853b52127
9421g8534J107k9028k71018j8316A26629N9561a25561l578A35836B7159P48J86758
9409B14665b9445k17283K7563c6708H2980b99672a33095M511A20701b00673H7169
9397B05219b02098d9077A2901i781j88886A13471b29851R3505j6493j48717p8241
9386c79797A1211a16727m3475J1604k43920A10650n2105b14954C50884h9674c6100
9374c79714F5203I945f7166j85513b2987j09947J6346d3882B24690a70481j12604
$$ y = [207406, 205962, 228498, 12851, -133132, -214313, 128406, 79734, -257165, 164646, 248333, 72694, -21649, -157164, -334226, -109639, -318095, -388135, 161996, 9621, 71620, 28891, -17820, -74176, -185652, 154389, -39270, -45737, -124351, -157770, 49838, -48298, -96405, 254853, -252127, -78534, -77427, -106455, -377473, -395789, 126629, 186190, -125561, -129139, 135836, 27159, 27907, 214665, -29445, -246728, -219165, -36708, 82980, -299672, -133095, -128584, 120701, -200673, 87169, 205219, -202098, -49077, 12901, -9781, -198667, 113471, -229851, -136346, -152839, -301556, -379797, 11211, -116727, -160202, -148598, -392518, 110650, 58545, -214954, 350884, -89674, -36100, -379714, 65203, 9945, -67166, -252679, -22987, -132934, -116588, -43882, 224690, -170481, -283085]
9363b83085A89793g1100L3355H5488E650J9458f7203k74043B5408a12505o0975
9352a73480E0386b84368I6059b72122C1116a29979c2767j38011d843q9946j32056
9341b26845c9675l21079a27741N7459A84903J932e4789k11485i2440B720K14003
9330B16723c71180a52674K0428A53066L1460C3062R2110c30365o3859J17443e2659
9318a37200A24989c11070e3583K3207a2344j95843A84712K9803C3483a2999j05804
9307a18803l6373j9105k1476g0248A72309a68256G0976A9827M7779a44272A69141
9295c2077F0674J39223a49962l7687e7630k1598e218A16359c2152o6286j11001
9284b09439g3119b5798A75676g1531m3026G1983d38779a55687E9671d8164R517
$$ y = [-283085, 189793, -71100, -37745, 85488, 5650, 25108, -67203, -341246, 25408, -112505, -173480, 50386, -284368, 96059, -272122, 31116, -129979, -32767, -170778, -4843, -94789, -226845, -39675, -360754, -127741, -70282, 184903, 186835, -54789, -266274, -92440, 2720, 216723, -371180, -152674, -132246, 153066, 184526, 33062, 125172, -330365, -394224, -276781, -52659, -137200, 124989, -311070, -53583, -30376, -12344, -208187, 184712, 214515, 33483, -12999, -118803, -155176, -174281, -195757, -70248, 172309, -168256, 70976, 19827, 67606, -144272, 169141, -32077, 60674, 199897, -149962, -187649, -57630, -79228, -5218, 116359, -32152, -98438, -209439, -73119, -25798, 175676, -71531, -114557, 71983, -438779, -155687, 59671, -48164, -38647]
9273c8647j52259n1421f4088A86587a51755E9037f5240K6824E7378J66223a87779
9261C957L00925e00796A18178A7800a98849b1150A85948a1754A9905b17826B2653
9249b73064C5167J45376a76012j38875i0031A31282a86383E6736J3180a34694
9238E8037b30066J13982j07744K4720R8359A07490m138J4336e3659n831k49840
9227c09330J34158O7158o9818O1084n5648b241E7383c29428C5193a4670j12612
9216a27282G4364a4522C8175a97021f7194j2524j60596o070E7260c52449a43183
9204A2102J83555A8247b37291J02249b1625o4599r6359k20407a67976C23423g4099
9192C9450a69127B58244B4012g5051C34299j48453Q1058a24309K3936k10201a23054
$$ y = [-38647, -190906, -242327, -64088, 186587, -151755, 59037, -65240, -38416, 57378, 223601, -187779, 3957, 304882, -500796, 118178, 17800, -198849, -21150, 185948, -11754, 19905, -217826, 22653, -273064, 35167, 180543, -176012, -314887, -90031, 131282, -186383, 56736, 69916, -134694, 58037, -230066, -116084, -223828, -199108, -100749, 107490, 103352, 117688, -53659, -59490, -309330, -175172, -108014, -177832, -116748, -172396, -2241, 57383, -329428, 35193, -14670, -127282, 74364, -14522, 38175, -197021, -67194, -79718, -240314, -246384, 57260, -352449, -143183, 12102, 195657, 18247, -237291, -135042, -21625, -86224, -182583, -402990, -167976, 323423, -74099, 39450, -169127, 258244, 24012, -75051, 334299, 185846, 266904, -124309, -100373, -310574, -123054]
9180a27180I1609J0472c26704B67271k3611G4256b76381d6445J5213j48050J5342
9169a63940f8640H6864a94211D9709b34464B07443L7503D3441b79172k5913c126
9157A29642L83968b38618B76654e6707A79601C220a81359O7263j39587p0758A03119
9145A98700f7558k33226J03463m6256F2248a11589A66841d09147J46553a2192
9134A03626B3256R3128c89524a48108j06j25602l6515P5166j28165a11075A89455
9122a991j42773C8996J35096a79794P3128c4703q6007A40911h1735C8887J791
9111D0678c91611J66305i4186O105A5849a42541B1546f162k02683G4507e6783
9099b84542g7964D1465K5580g843q7166d6601j0944j11630c8540q780C8388a26566
$$ y = [-127180, 91609, 102081, -326704, 267271, 243660, 74256, -276381, -46445, -31232, -179282, -163940, -68640, 86864, -194211, 49709, -234464, 207443, 244946, 43441, -279172, -305085, -3126, 129642, 513610, -238618, 276654, -56707, 179601, 3220, -181359, -114096, -253683, -324441, 103119, 198700, -67558, -300784, -197321, -243577, 62248, -111589, 166841, -409147, -262594, -12192, 103626, 23256, 116384, -389524, -148108, -148214, -273816, -310331, -235165, -363330, -111075, 189455, -1991, -144764, 38996, 174092, -179794, -106666, -34703, -120710, 140911, -81735, 38887, 40678, -391611, -225306, -94186, -88081, 15849, -142541, 21546, -6162, -208845, 74507, -56783, -284542, -77964, 41465, 67045, -7843, -95009, -46601, -57545, -169175, -38540, -47320, 38388, -126566]
9086F8379c66739M9538a20523o1661L2610j399E0545J31847c26256A07591A5120
9074c2357H8581d98205G3970K03406D78g6393j00000f4083n351C91754i1291J4021
9062g7270C7379e2579A06404K43366A73955j6651a88239R3994j11731D05861c07672
9050d95010B22949b3018j22167c0574j13489a5715j32401o0071A51284m3070C1467
9038a33705b6854A46059d4719A31434b25277B5642b84888B3709N4878j6400a15473
9026d32153g8800l26011J60970a1067F1396b39667A45978F8599a7069D0300g1737
9014b4056k2882j66932A02852f0581q0912A70550a77947P7269E4646a17338j51425
9003b68763K7734a12734C2630a39770q166a5565A6049N6747f5996j96806d9075
$$ y = [68379, -366739, -317201, -120523, -182184, -149574, -150973, 50545, 182392, -326256, 107591, 15120, -32357, 88581, -498205, 73970, 277376, 478, -76393, -176393, -64083, -69434, 391754, -91291, -77270, 37379, -52579, 106404, 349770, 173955, 157304, -188239, -94245, -205976, 405861, -307672, -495010, 222949, -23018, -145185, -30574, -144063, -15715, -148116, -208187, 151284, 108214, 31467, -133705, -26854, 146059, -44719, 131434, -225277, 25642, -284888, 23709, 78587, 62187, -115473, -432153, -78800, -404811, -243841, -11067, 61396, -239667, 145978, 68599, -17069, 40300, -71737, -24056, -46938, -213870, 102852, -60581, -141493, 170550, -177947, -100678, 54646, -117338, -268763, -241029, -112734, 32630, -139770, -147936, -15565, 16049, 72796, -65996, -262802, -49075]
8991a20503A97701g1869F5233k5618J9203A7774b01729A26126B0714N3203a32440
8979a33402r347k15522H2710a24676A34676a64153h0646B00819h5009b9206A39390
8967c92548A6295Q6281g7603B64243E837K84449c34680F780K0416b02191N635
8956a96556I2727i5297A66077E5461k491J04534A0423K87678c40346C4507c03323
8944b2127H8464K4211k8292a34929D3045g0325A76932d67807B92928a6049k2363
8933c8412k5531r4908G1869L26813b87253A63759J15020J69430N96386K523509
8923C568104L020442O035239E769243B293735j019400l52719C96519m3100j76062
8914A77357B8290g9959A25010J85558r2901M4699J625g0120j8416J6108B01167
$$ y = [-120503, 197701, -71869, 65233, 39615, 58818, 17774, -201729, 126126, 20714, 73917, -132440, -133402, -142749, -358271, 82710, -124676, 134676, -164153, -80646, 200819, -85009, -29206, 139390, -392548, 16295, 102576, -77603, 264243, 5837, 290286, -334680, 6780, 27196, -202191, -196556, 92727, -95297, 166077, 55461, 52970, 157504, 10423, 298101, -340346, 34507, -303323, -22127, 88464, 112675, 84383, -134929, 43045, -70325, 176932, -467807, 292928, -16049, -38412, -63943, -158851, 71869, 398682, -287253, 163759, 278779, 448209, 1044595, 3568104, 6588546, 12623785, 5769243, 2293735, 1274335, 921616, 396519, 353419, 177357, 28290, -79959, 125010, 310568, 217667, 262366, 263991, -70120, -88536, -72428, 201167]
8902A22554a68187H0963a59769O9649D7206a29919k7067e4063B16178c09307I6050
8890A88236c33379r0265A28505d51066A75691N615a43508B63045I5712p73f1472
8878b89014d4700A33405m9752F094P18J72435a87981C868a18867D8870Q4819A6402
8865b72843k1736c3200j95958f6508L2165j85253R9787p2149f2558A72382a62653
8853b16041b1811A65894d2358H6488b02781Q8488k5919A47443a00215M4542j03247
8842a58920A12254g9860H2953P4670j1216M6668Q6214d10040f7677a8271p7500
$$ y = [122554, -168187, 80963, -159769, -90120, 47206, -129919, -156986, -54063, 216178, -309307, 96050, 188236, -333379, -423644, 128505, -451066, 175691, 181306, -143508, 263045, 95712, 94939, -61472, -289014, -44700, 133405, 83653, 6094, 6812, 179247, -187981, 3868, -118867, 48870, 133689, 16402, -272843, -294579, -33200, -229158, -66508, -34343, -219596, -119809, -191958, -62558, 172382, -162653, -216041, -21811, 165894, -42358, 86488, -202781, -114293, -140212, 147443, -100215, -55673, -158920, 112254, -79860, 82953, 157623, 146407, 193075, 279289, -410040, -67677, -18271, -95771]
$$ [...]
##END NTUPLES=NMR SPECTRUM
##END=
