##TITLE=AC1563_ROEFFECT0018_8270664_CdCpNi9t6f
##JCAMPDX= 6.0         $$ Bruker NMR JCAMP-DX V2.0
##DATA TYPE= NMR SPECTRUM
##DATA CLASS= NTUPLES
##ORIGIN= BRUKER
##OWNER= Administrator
$$ 1.72 TOPSPIN		Version 2.1
$$ 2013-10-12 22:44:22.238 -0700  Administrator@X
$$ Compression mode = diff/dup
##.OBSERVE FREQUENCY= 400.02188249412
##.OBSERVE NUCLEUS= ^1H
##.ACQUISITION MODE= SIMULTANEOUS (DQD)
##.ACQUISITION SCHEME= undefined
##.AVERAGES= 64
##.DIGITISER RES= 22
##SPECTROMETER/DATA SYSTEM= spect
##.PULSE SEQUENCE= noesygpps1d.comp
##.SOLVENT NAME= COFFEE_meoh
##.SHIFT REFERENCE= INTERNAL, COFFEE_meoh, 1, 14.96057
##AUDIT TRAIL= $$ (NUMBER, WHEN, WHO, WHERE, PROCESS, VERSION, WHAT)
$$ ##TITLE= Audit trail, TOPSPIN		Version 2.1
$$ ##JCAMPDX= 5.01
$$ ##ORIGIN= Bruker BioSpin GmbH
$$ ##OWNER= Administrator
$$ $$ E:\/data/COFFEE/nmr/AC1563_ROEFFECT0018_8270664_CdCpNi9t6f/12/pdata/1/auditp.txt
$$ ##AUDIT TRAIL=  $$ (NUMBER, WHEN, WHO, WHERE, PROCESS, VERSION, WHAT)
(   1,<2013-10-12 22:44:17.410 -0700>,<Administrator>,<X>,<go>,<TOPSPIN 2.1>,
      <created by zg
	started at 2013-10-12 22:32:47.328 -0700,
	POWCHK enabled, PULCHK disabled,
       configuration hash MD5:
       C8 4E 4E 5D D3 5C D8 9E 9F 52 82 E0 59 8A DE 15
       data hash MD5: 64K
       AF A2 AF 18 5B 35 11 B9 FD D9 22 15 AA BD AE EC>)
(   2,<2013-10-12 22:44:20.394 -0700>,<Administrator>,<X>,<proc1d>,<TOPSPIN 2.1>,
      <Start of raw data processing
       efp LB = 0.3 FT_mod = 6 PKNL = 1 PHC0 = 0 PHC1 = 0 SI = 128K 
       data hash MD5: 128K
       1F EC 95 E8 DF 2B 3D B4 41 5F AF 39 FF 6B 68 B2>)
(   3,<2013-10-12 22:44:21.348 -0700>,<Administrator>,<X>,<proc1d>,<TOPSPIN 2.1>,
      <pk PHC0 = -80.40344 PHC1 = 0 
       data hash MD5: 128K
       79 EA 68 4E F9 D1 EE 2B 07 7E 1F EB B6 83 76 04>)
(   4,<2013-10-12 22:44:21.723 -0700>,<Administrator>,<X>,<proc1d>,<TOPSPIN 2.1>,
      <abs ABSG = 1 
       data hash MD5: 128K
       DA 5E D8 58 1E C1 FF 87 87 0B 1E E0 64 90 71 B0>)
(   5,<2013-10-12 22:44:21.816 -0700>,<Administrator>,<X>,<proc1d>,<TOPSPIN 2.1>,
      <abs ABSG = 2 
       data hash MD5: 128K
       99 EB 6C BD 27 D8 B6 46 A6 3B 4C 3E 3F 35 F9 54>)
(   6,<2013-10-12 22:44:21.894 -0700>,<Administrator>,<X>,<proc1d>,<TOPSPIN 2.1>,
      <abs ABSG = 3 
       data hash MD5: 128K
       C9 E0 3A 88 BA DC C6 51 8A F8 17 50 41 F8 D1 44>)
(   7,<2013-10-12 22:44:21.988 -0700>,<Administrator>,<X>,<proc1d>,<TOPSPIN 2.1>,
      <abs ABSG = 4 
       data hash MD5: 128K
       AC 5F A1 96 E8 36 73 1D 25 F7 6E 30 03 17 91 F2>)
(   8,<2013-10-12 22:44:22.098 -0700>,<Administrator>,<X>,<proc1d>,<TOPSPIN 2.1>,
      <abs ABSG = 5 
       data hash MD5: 128K
       41 F6 5F 79 F4 3E 62 AA 2B 62 38 19 C2 CE 43 27>)
$$ ##END=
$$ 
$$ $$ hash MD5
$$ $$ CD 54 A7 D7 2B F4 F6 41 D3 B7 AD 25 9C 24 E3 C6
##$RELAX= 
##$RELAX= 
##$RELAX= 
##$RELAX= 
##$RELAX= 
##$RELAX= 
##$RELAX= 
##$RELAX= 
$$ Bruker specific parameters
$$ --------------------------
##$DU= <E:\>
##$EXPNO= 12
$$ [...]
##$TP07= 0
##$TPNAME0= <>
##$TPNAME1= <>
##$TPNAME2= <>
##$TPNAME3= <>
##$TPNAME4= <>
##$TPNAME5= <>
##$TPNAME6= <>
##$TPNAME7= <>
##$TPOAL= (0..7)
0.5 0.5 0.5 0.5 0.5 0.5 0.5 0.5
##$TPOFFS= (0..7)
0 0 0 0 0 0 0 0
##$TUNHIN= 0
##$TUNHOUT= 0
##$TUNXOUT= 0
##$USERA1= <user>
##$USERA2= <user>
##$USERA3= <user>
##$USERA4= <user>
##$USERA5= <user>
##$V9= 5
##$VALIST= <valist>
##$VCLIST= <CCCCCCCCCCCCCCC>
##$VD= 0
##$VDLIST= <DDDDDDDDDDDDDDD>
##$VPLIST= <PPPPPPPPPPPPPPP>
##$VTLIST= <TTTTTTTTTTTTTTT>
##$WBST= 1024
##$WBSW= 4
##$XGAIN= (0..3)
0 0 0 0
##$XL= 0
##$YL= 0
##$YMAX_a= 6236080
##$YMIN_a= -12969988
##$ZGOPTNS= <>
##$ZL1= 120
##$ZL2= 120
##$ZL3= 120
##$ZL4= 120
##$ABSF1= 14.96057
##$ABSF2= -5.597611
##$ABSG= 5
##$ABSL= 3
##$ALPHA= 0
##$AQORDER= 0
##$ASSFAC= 0
##$ASSFACI= 0
##$ASSFACX= 0
##$ASSWID= 0
##$AUNMP= <proc_prof1d_extract.lims>
##$AXLEFT= 0
##$AXNAME= <>
##$AXNUC= <1H>
##$AXRIGHT= 0
##$AXTYPE= 0
##$AXUNIT= <>
##$AZFE= 0.1
##$AZFW= 0.1
##$BCFW= 0
##$BC_mod= 0
##$BYTORDP= 0
##$COROFFS= 0
##$CY= 15
##$DATMOD= 1
##$DC= 0
##$DFILT= <>
##$DTYPP= 0
##$F1P= 0
##$F2P= 0
##$FCOR= 0.5
##$FTSIZE= 131072
##$FT_mod= 6
##$GAMMA= 0
##$GB= 0
##$INTBC= 1
##$INTSCL= 1
##$ISEN= 128
##$LB= 0.3
##$LEV0= 0
##$LPBIN= 0
##$MAXI= 10000
##$MC2= 0
##$MEAN= 0
##$ME_mod= 0
##$MI= 0
##$NCOEF= 0
##$NC_proc= -2
##$NLEV= 6
##$NOISF1= 0
##$NOISF2= 0
##$NSP= 0
##$NTH_PI= 0
##$NZP= 0
##$OFFSET= 14.96057
##$PC= 1
##$PHC0= -80.40344
##$PHC1= 0
##$PH_mod= 1
##$PKNL= yes
##$PPARMOD= 0
##$PPDIAG= 0
##$PPIPTYP= 0
##$PPMPNUM= 2147483647
##$PPRESOL= 1
##$PSCAL= 4
##$PSIGN= 0
##$PYNMP= <proc.py>
##$REVERSE= no
##$SF= 400.020009810744
##$SI= 131072
##$SIGF1= 0
##$SIGF2= 0
##$SINO= 400
##$SIOLD= 131072
##$SPECTYP= <>
##$SREGLST= <1H.CDCl3>
##$SSB= 0
##$STSI= 131072
##$STSR= 0
##$SW_p= 8223.68421052631
##$SYMM= 0
##$S_DEV= 0
##$TDeff= 65536
##$TDoff= 0
##$TI= <>
##$TILT= no
##$TM1= 0
##$TM2= 0
##$TOPLEV= 0
##$USERP1= <user>
##$USERP2= <user>
##$USERP3= <user>
##$USERP4= <user>
##$USERP5= <user>
##$WDW= 1
##$XDIM= 131072
##$YMAX_p= 362599131
##$YMIN_p= -11312
##$CURPLOT= <Network HP LaserJet P1505>
##$CURPRIN= <$Network HP LaserJet P1505>
##$DFORMAT= <normdp>
##$LAYOUT= <+/1D_H.xwp>
##$LFORMAT= <normlp>
##$PFORMAT= <normpl>
##$SURQMSG= 1
$$ End of Bruker specific parameters
$$ ---------------------------------
##NTUPLES= NMR SPECTRUM
##VAR_NAME=  FREQUENCY,     SPECTRUM/REAL,   SPECTRUM/IMAG
##SYMBOL=    X,             R,               I
##VAR_TYPE=  INDEPENDENT,   DEPENDENT,       DEPENDENT
##VAR_FORM=  AFFN,          ASDF,            ASDF
##VAR_DIM=   131072,        131072,          131072
##UNITS=     HZ,            ARBITRARY UNITS, ARBITRARY UNITS
##FACTOR=    0.0627417313425164, 1,          1
##FIRST=     8223.62146879497, 1568,         -59969
##LAST=      0,             3361,            -60765
##MIN=       0,             -11312,          0
##MAX=       8223.62146879497, 362599131,    0
$$ Real data points
##PAGE= N=1
##DATA TABLE= (X++(R..R)), XYDATA
$$ [...]
63851A537819L6242L0741K4791J8564J2346O483Q25n247j1904j8428k4060k8888
63839A579284l3488l7975m1946m5159m7683m9380m9924m9541m9171m9545n0351
63828A075121n0665n0069m8912m7573m5858m3311l9923l6307l3156l0651k8492
63817F20204k6425k4586k3210k2126k0821j8999j6867j4803j2960j1307r868q729
63805D09503p908p407p226p150o741n870n074m996n485n723n290m662m408m404
63791C27159m177l704l395l412l512l499l433l381l330l353l537l640l240k371
63777B79175j615j400j491j425j169j007r91q95o20l09j00mp2l76p82r73p96m23
63759B64727j01O5K7k43o09p21m06K3O2l04m95o4O39Q44L74j05M3O36J091J326
$$ plain form
63851 1537819 1574061 1604802 1629593 1648157 1660503 1666986 1667811 1662564 1650660 1632232 1608172 1579284
63839 1579284 1545796 1507821 1465875 1420716 1373033 1323653 1273729 1224188 1175017 1125472 1075121
63828 1075121 1024456 974387 925475 877902 832044 788733 748810 712503 679347 648696 620204
63817 620204 593779 569193 545983 523857 503036 484037 467170 452367 439407 428100 418232 409503
63805 409503 401595 394188 386962 379812 373071 367201 362127 357131 351646 345923 340633 335971 331563 327159
63791 327159 322982 319278 315883 312471 308959 305460 302027 298646 295316 291963 288426 284786 281546 279175
63777 279175 277560 276160 274669 273244 272075 271068 270077 269182 268562 268253 268153 268149 268077 267701 266919 265946 265150 264727
63759 264727 264626 264691 264718 264475 263866 263145 262739 262762 262824 262520 262025 261961 262600 263444 263818 263713 263756 264392 265483 266809
63739B66809J750K388K631K116J369J205J772K562L125L386L416L292L196L271
63725C02288L362L207K877K799L271M171N093N635N556M915M012L069J998P22
63711C52975m75j231j597j878k070j957j669j679k036k221j895j432j332j462
63697C30041j278n42M23J136J329J144J054J503K406L189L391L061K504J953J589
63682C52903J537J623J414P99K30J56M30O46Q19J350K332L285L662L403K910K548
63666C80047K251J699R25M35N11O17Nj185k123k586l291m601n709n675m760l988
63650C52572l846m009m061l782l018j884r38n50k89M77J639K622L338M071M643
63635C46985M614M195M130M545M797M619M518M795N019M874M755N030N374N370
$$ plain form
63739 266809 268559 270947 273578 275694 277063 278268 280040 282602 285727 289113 292529 295821 299017 302288
63725 302288 305650 308857 311734 314533 317804 321975 327068 332703 338259 343174 347186 350255 352253 352975
63711 352975 352500 351269 349672 347794 345724 343767 342098 340419 338383 336162 334267 332835 331503 330041
63697 330041 328763 328221 328644 329780 331109 332253 333307 334810 337216 340405 343796 346857 349361 351314 352903
63682 352903 354440 356063 357477 358276 358506 358662 359092 359738 360557 361907 364239 367524 371186 374589 377499 380047
63666 380047 382298 383997 384922 385357 385868 386485 386490 385305 383182 380596 377305 372704 366995 361320 356560 352572
63650 352572 348726 344717 340656 336874 333856 331972 331034 330484 330195 330672 332311 334933 338271 342342 346985
63635 346985 351599 355794 359924 364469 369266 373885 378403 383198 388217 393091 397846 402876 408250 413620
63621D13620N248N521O279P304Q484R710J0718J1454J2245J3305J4452J5641J7244
63608E51225J9358K1357K2681K3610K4602K5268K4824K3307K1562J9947J7845
63597G95586J4621J0505O310K689j04j995k998l335l533m237n759p753r620j1310
63583G79067j3379j6061j8722k0555k1410k1616k1296k0385j9011j7316j5138
63572E74178j2427r773p883o648n370l822k406j271jJ598L078M030M627N229N863
63557E49002O474P181P953Q453Q646R240J1027J3932J7172K0236K3368K7011L1172
63544G40867L5349L8960M1640M3135M2948M0323L4771K6669J7139P400j491q440
63532A059270j2481j3508j2580j1129r971r243r057r782j1750j4946j8992k3243
$$ plain form
63621 413620 418868 424389 430668 437972 446456 456166 466884 478338 490583 503888 518340 533981 551225
63608 551225 570583 591940 614621 638231 662833 688101 712925 736232 757794 777741 795586
63597 795586 810207 820712 827022 829711 829607 827612 824614 821279 817746 813509 807750 799997 790377 779067
63583 779067 765688 749627 730905 710350 688940 667324 646028 625643 606632 589316 574178
63572 574178 561751 551978 544095 537447 532077 528255 525849 524578 524577 526175 529253 533283 537910 543139 549002
63557 549002 555476 562657 570610 579063 587709 596949 607976 621908 639080 659316 682684 709695 740867
63544 740867 776216 815176 856816 899951 942899 983222 1017993 1044662 1061801 1069201 1067710 1059270
63532 1059270 1046789 1033281 1020701 1009572 999601 990358 981301 971519 959769 944823 925831 902588
63520I02588k6985k9726l1356l1983l1710l0718k9341k7800k5987k3751k1328
63509E91903j9166j7375j5680j3995j2659j1921j1480j0836r955r263q967q697
63497D41909p990o914n975n474n194m784m219l694l170k310r71M34J226J148O61
63482C94683N57J231K300L009L060K936L278M002M334L761K664J784J372J092
63468D30063P07L08l6n41j350k180k583k450k022j509r01j87M04N34Q1o55j144
63451D16539j098p70o03n10J86J853L830N050N350N659O766Q412R933J1332J3235
63436D85164J5978J9245K2606K5957K9374L2860L6256L9061M0230L8591L3709
63425H19031K6328J7830R484K183l416o778p565n802k089K495O978J1072J4937
$$ plain form
63520 902588 875603 845877 814521 782538 750828 720110 690769 662969 636982 613231 591903
63509 591903 572737 555362 539682 525687 513028 501107 489627 478791 468836 459573 450606 441909
63497 441909 433919 427005 421030 415556 410362 405578 401359 397665 394495 392185 391214 391648 392874 394022 394683
63482 394683 395240 396471 398771 401780 404840 407776 411054 415056 419390 423151 425815 427599 428971 430063
63468 430063 430770 431078 431042 430501 429151 426971 424388 421938 419916 418407 417506 417319 417723 418257 418338 417683 416539
63451 416539 415441 414671 414068 413558 413744 415597 419427 424477 429827 435486 442252 450664 460597 471929 485164
63436 485164 501142 520387 542993 568950 598324 631184 667440 706501 746731 785322 819031
63425 819031 845359 863189 872673 874856 871440 864662 857097 851295 849206 851701 858679 869751 884688
63412H84688J8497K1281K2939K3377K2330J9355J4593R175M389O58k331m745o335
63399A027871o999p215p787r214j1431j4102j7147k0764k4739k8055k9773l0199
63387H20446l0450l0791l0293k8409k5976k3983k2225k0071j7833j6224j4915
63376E59276j2882j0055p415n406l457j255O82K094L565N476P325Q717J0192J2253
63362E69110J4357J5717J6650J8246K0957K4288K7497K9952L1092L0920L0435
63351H29221L0734L1669L1964L0638K7691K3486J8278J2589P319L057l51l242
63339A043053n509o830p234p201p371q370j0576j3829j7516k1054k4251k7050
63327H86262k9145l0069k9591k7895k5402k2445j9101j5261j0910o323k025J352
$$ plain form
63412 884688 903185 924466 947405 970782 993112 1012467 1027060 1036235 1040624 1041282 1038951 1034206 1027871
63399 1027871 1020872 1013657 1005870 996656 985225 971123 953976 933212 908473 880418 850645 820446
63387 820446 789996 759205 728912 700503 674527 650544 628319 608248 590415 574191 559276
63376 559276 546394 536339 528924 523518 520061 518806 519488 521582 525147 530623 537948 546665 556857 569110
63362 569110 583467 599184 615834 634080 655037 679325 706822 736774 767866 798786 829221
63351 829221 859955 891624 923588 954226 981917 1005403 1023681 1036270 1043589 1046646 1046295 1043053
63339 1043053 1037544 1030714 1023480 1016279 1008908 1000538 989962 976133 958617 937563 913312 886262
63327 886262 857117 827048 797457 769562 744160 721715 702614 687353 676443 670120 668095 669447
63315F69447L040K317r85o146j1971j7584k2464k5935k7164k5938k3103j9955
63303D93559j7340j5452j4092j2823j1162r061p115n975n647n634n638n710n772
63290C72138n464m606l488k556k033j906k033k158k115k091k355k624k201j027
63276C35481q3k31r63r99J9J121J394J071R17J135J298J137Q90R32J326J783J975
63259C48203J957K233L155M323M955M897M755M886M926M641M617N409O469O703
63245D12129N959N119M812M841N015N722P290R245J0735J1371J1438J1449J1748
63232E16873J2355J3073J3746J4390J4909J4934J4365J3897J4403J5741J6824
63221F75510J6994J6754J6815J7090J7072J6744J6444J6096J5139J3265J0817
$$ plain form
63315 669447 672487 674804 673819 667673 655702 638118 615654 589719 562555 536617 513514 493559
63303 493559 476219 460767 446675 433852 422690 413629 406514 400539 394892 389258 383620 377910 372138
63290 372138 366674 362068 358580 356024 353991 352085 350052 347894 345779 343688 341333 338709 336508 335481
63276 335481 335398 335167 334204 333205 333224 334345 335739 336810 337727 338862 340160 341297 342187 343119 344445 346228 348203
63259 348203 350160 352393 355548 359871 364826 369723 374478 379364 384290 388931 393548 398957 405426 412129
63245 412129 418088 423207 428019 432860 437875 443597 450887 460132 470867 482238 493676 505125 516873
63232 516873 529228 542301 556047 570437 585346 600280 614645 628542 642945 658686 675510
63221 675510 692504 709258 726073 743163 760235 776979 793423 809519 824658 837923 848740
63210H48740Q360O103L757R20k388n661q487j1026j3578j5821j6952j6691j5575
63197G61701j4134j2349j0110p617m969j992J137L626N068O247Q302J1435J4951
63184G61296J8262K1226K3711K5563K6963K8273K9506L0389L0762L0565K9605
63173A056121K7932K6203K5099K4447K3469K1763J9448J6430J2303P084J453m078
63161A257674r665j5643k1882k7829l2929l6892l9743m1715m2852m2895m1758
63150I03871l9910l7895l5693l3085l0355k8030k6009k3682k0929j8326j6265
63139E93692j4542j2919j1413r896q174o613n943o128o167n371m214l466l160
63126D95686k891k525k020j065M37J929K798L109L254L216K797K223J910J895
$$ plain form
63210 848740 857100 863203 866960 867880 865492 859831 851344 840318 826740 810919 793967 777276 761701
63197 761701 747567 735218 725108 717491 712522 710530 711667 715293 720361 726608 734910 746345 761296
63184 761296 779558 800784 824495 850058 877021 905294 934800 965189 995951 1026516 1056121
63173 1056121 1084053 1110256 1135355 1159802 1183271 1205034 1224482 1240912 1253215 1260299 1261752 1257674
63161 1257674 1248009 1232366 1210484 1182655 1149726 1112834 1073091 1031376 988524 945629 903871
63150 903871 863961 826066 790373 757288 726933 698903 672894 649212 628283 609957 593692
63139 593692 579150 566231 554818 544922 536748 530135 524192 518064 511897 506526 502312 498846 495686
63126 495686 492795 490270 488250 487185 487622 489551 492349 495458 498712 501928 504725 506948 508858 510753
63112E10753J964K172K637L113L260L210L224L077K414J612J495K128K600K210
63098E45869J378J027J483K285K783K797K742L185M114M780M444L232J879P69
63084E82767l88j843l260l983l643k393q02M36J002J234J684K442L123L547M007
63069E83930M781N728O609P478Q512R628J0562J1212J1776J2539J3712J5423J7682
63056G19572K0325K2925K5018K6529K7971K9961L2389L4389L5362L5822L6782
63045A047045L8460M0047M0812M0934M1054M1354M1478M1197M0843M0958M1600
63034A495782M2146M1861M0588L8668L6205L2787K8107K2445J6177R136J037p619
63022A797320j5739k2707k8702l3850l7732l9970m0736m0315l8613l5536l1442
$$ plain form
63112 510753 512717 514889 517526 520639 523899 527109 530333 533410 535824 537436 538931 541059 543659 545869
63098 545869 547247 548274 549757 552042 554825 557622 560364 563549 567663 572443 576887 580119 581998 582767
63084 582767 582379 580536 577276 573293 569650 567257 566455 566891 567893 569127 570811 573253 576376 579923 583930
63069 583930 588711 594439 601048 608526 617038 626666 637228 648440 660216 672755 686467 701890 719572
63056 719572 739897 762822 787840 814369 842340 872301 904690 939079 974441 1010263 1047045
63045 1047045 1085505 1125552 1166364 1207298 1248352 1289706 1331184 1372381 1413224 1454182 1495782
63034 1495782 1537928 1579789 1620377 1659045 1695250 1728037 1756144 1778589 1794766 1803902 1804939 1797320
63022 1797320 1781581 1758874 1730172 1696322 1658590 1618620 1577884 1537569 1498956 1463420 1431978
63011A431978k6771k1489j5415q898k653L100Q911J5381K2395K9139L4761L8987
62999A509426M2199M4919M7243M8876M9709N0086N0364N0532N0443N0195M9913
62988B043905M9317M7868M5316M1828L7496L2025K4929J6010N583n659j7074k8350
62976B293194l9324m9572n8461o5706p1552p6187p9280q0422p9763p7836p4899
62965A540192p0920o6159o1268n6706n2417m8218m4197m0567l7431l4807l2721
62954I94781l1042k9426k7599k5684k4080k3021k2265k1257j9736j8176j7389
62943G35106j7506j7575j6548j4517j2568j1483j1041j0663j0122r427q480p301
62931E87875o288n778n480m804l712k830k680l053l344l273l052k948k920k727
$$ plain form
63011 1431978 1405207 1383718 1368303 1359405 1356752 1359852 1368763 1384144 1406539 1435678 1470439 1509426
62999 1509426 1551625 1596544 1643787 1692663 1742372 1792458 1842822 1893354 1943797 1993992 2043905
62988 2043905 2093222 2141090 2186406 2228234 2265730 2297755 2322684 2338694 2344277 2338618 2321544 2293194
62976 2293194 2253870 2204298 2145837 2080131 2008579 1932392 1853112 1772690 1692927 1615091 1540192
62965 1540192 1469272 1403113 1341845 1285139 1232722 1184504 1140307 1099740 1062309 1027502 994781
62954 994781 963739 934313 906714 881030 856950 833929 811664 790407 770671 752495 735106
62943 735106 717600 700025 683477 668960 656392 644909 633868 623205 613083 603656 595176 587875
62931 587875 581587 575809 570329 565525 561813 558983 556303 553250 549906 546633 543581 540633 537713 534986
62917E34986k282j769j385j149r99r07p86l96L76J157J210J44j605l013l233k279
62901E18070j053n87j075j659j412k94R90J912K425K535K100J212K83m25j022
62886E22000j539j737j506j158r85q61m85J84R48J541J644J141M22L4j43p00j534
62869E17266j746j185j154k640m590n187m384l790m120m251l167j530n88n11o49
62854D77774o87p36p02m48k98n72q54m21O28J337J168P13Q47J550J977J554O36
62837D83466o7l96p82j418j862j712j216q20l87M93J583K115J919J694J871J924
62821D86405J262K96j1O84J905L015L613L431K505J447J049J482K144K391K253
62806E13871K274K778L508M030M409N154O379P418P734P870Q746J0183J0997J0744
$$ plain form
62917 534986 532704 530935 529550 528401 527402 526495 525709 525313 525689 526846 528056 528200 526595 523582 520349 518070
62901 518070 517017 516430 515355 513696 512284 511990 512980 514892 517317 519852 521952 523164 523447 523022 522000
62886 522000 520461 518724 517218 516060 515075 514214 513729 513913 514861 516402 518046 519187 519609 519643 519500 518800 517266
62869 517266 515520 514335 513181 510541 505951 500764 496380 492590 488470 484219 481052 479522 478934 478423 477774
62854 477774 477087 476351 475649 475201 474903 474331 473477 473056 473684 475021 476189 476902 477749 479299 481276 482830 483466
62837 483466 483399 483003 482221 480803 478941 477229 476013 475193 474806 475299 476882 478997 480916 482610 484481 486405
62821 486405 487667 487963 487952 488636 490541 493556 497169 500600 503105 504552 505601 507083 509227 511618 513871
62806 513871 516145 518923 522431 526461 530870 536024 542403 549821 557555 565425 574171 584354 595351 606095
62792F06095J0412J0976J2143J3183J4279J6162J8920K2016K5203K8617L2134
62781H10140L5466L8814M2702M7054N1120N4405N7142N9649O1703O2705O2245
62770A383145O0374N7395N3355M7679L9755L0003J9870J0356J086q570j8131k6540
62758A649777l3639m0030m5714m9948n2529n4156n5366n5985n5866n5249n4081
62747A097214n1809m8336m4478m1078l8128l5146l1938k8660k5590k3042k1061
62736G07948j9072j6454j3548j1414j0368r530q184o733n800n130m085k653j237
62723E93740P8J403K514L202L846N040O742Q382R689J0958J2542J4463J6514J8522
62709G07635K0630K3371K7114L1367L5149L8290M1778M6436N1890N7317O2631
$$ plain form
62792 606095 616507 627483 639626 652809 667088 683250 702170 724186 749389 778006 810140
62781 810140 845606 884420 927122 974176 1025296 1079701 1136843 1196492 1258195 1320900 1383145
62770 1383145 1443519 1500914 1554269 1601948 1641703 1671706 1691576 1701932 1703018 1694448 1676317 1649777
62758 1649777 1616138 1576108 1530394 1480446 1427917 1373761 1318395 1262410 1206544 1151295 1097214
62747 1097214 1045405 997069 952591 911513 873385 838239 806301 777641 752051 729009 707948
62736 707948 688876 672422 658874 647460 637092 627562 619378 612645 606845 601715 597630 594977 593740
62723 593740 593818 595221 597735 600937 604783 609823 616565 624947 634636 645594 658136 672599 689113 707635
62709 707635 728265 751636 778750 810117 845266 883556 925334 971770 1023660 1080977 1143608
62698A143608O8270P4199P9893Q4937Q9033R1762R2981R3206R2807R1089Q6915
62687B088700Q0063P1164O0447M7486L2291J5817q95j7414l3491m8532o1830p2997
62675B160809q1860q8227r1951r3101r2001q9354q6158q3108p9989p6027p0910
62664A228123o5188n9666n4759n0454m6584m3037l9854l7059l4291l0872k6655
62653G39704k2517j9580j8033j7221j6608j6033j5244j4029j2847j2437j2602
62642E62553j2157j0437q225o717o111n642m633l061j449m92n40j124j373j070
62628D99522q46j142j581j813k262l306m232l946k527j160n78m72m79p89j304
62613D73085j140K94K184L122K869K533L045M136N055N642O316P339Q540R640
$$ plain form
62698 1143608 1211878 1286077 1365970 1450907 1539940 1631702 1724683 1817889 1910696 2001785 2088700
62687 2088700 2168763 2239927 2300374 2347860 2380151 2395968 2395073 2377659 2344168 2295636 2233806 2160809
62675 2160809 2078949 1990722 1898771 1805670 1713669 1624315 1538157 1455049 1375060 1299033 1228123
62664 1228123 1162935 1103269 1048510 998056 951472 908435 868581 831522 797231 766359 739704
62653 739704 717187 697607 679574 662353 645745 629712 614468 600439 587592 575155 562553
62642 562553 550396 539959 531734 525017 518906 513264 508631 505570 504121 503629 503089 501965 500592 499522
62628 499522 498676 497534 495953 494140 491878 488572 484340 480394 477867 476707 476129 475657 475178 474389 473085
62613 473085 471945 472239 474423 477545 480414 482947 485992 490128 495183 500825 507141 514480 523020 532660
62599E32660J0551J1453J2786J4947J7752K0414K2379K3907K5463K6821K7429
62588G46562K7473K7676K7970K7221K4745K1261J7711J3856Q872K946k754p574
62576I35965j1882j5988j9432k1734k3189k4401k5423k5852k5500k4595k3439
62565F94530k2234k1175k0340j9423j7881j5559j3033j1101r873q683p049n471
62553E22708m768m816m607l730l056l432m260m187k925j540r18p48k54P42J902
62538D86111L047M236N293N677N026L709K722K863L929M944N269N296N790O943
62524E50855Q424J0174J2494J5378J8296K0837K3230K6010K9430L3247L6931M0075
62512H25381M2765M5469M8366N0993N2816N3814N4057N2983M9851M4866L9083
$$ plain form
62599 532660 543211 554664 567450 582397 600149 620563 642942 666849 692312 719133 746562
62588 746562 774035 801711 829681 856902 881647 902908 920619 934475 943347 946293 943539 935965
62576 935965 924083 908095 888663 866929 843740 819339 793916 768064 742564 717969 694530
62565 694530 672296 651121 630781 611358 593477 577918 564885 553784 543911 535228 528179 522708
62553 522708 517940 513124 508517 504787 501731 498299 494039 489852 486927 485387 484469 483721 483467 484209 486111
62538 486111 489158 493394 498687 504364 509390 513099 515821 518684 522613 527557 532826 538122 543912 550855
62524 550855 559279 569453 581947 597325 615621 636458 659688 685698 715128 748375 785306 825381
62512 825381 868146 913615 961981 1012974 1065790 1119604 1173661 1226644 1276495 1321361 1360444
62501A360444L3026K6096J7667Q224j010r152j6022k1711k6156k9136l0451l0164
62489A281655k8578k5926k2185j7436j2233p230k622J735N842R665J3481J7480
62477A213648K1113K3464K4209K3538K1302J7099J1301N072r41p068j3559j9914
62465A319264k5723l1364l7241m2929m7557n0514n1480n0415m8030m5570m3559
62454H44882m1343l8280l4725l1193k7471k3365j9629j7003j4891j2115q774o171
62442E69922m998m586m049l214k194r35M32J388J595J315J036Q88N74l18j923
62427E54933l822n283o039o522p098p412p055o463o441o921p015o251n095m160
62413D69356l624l448l553l599l177k461k096k239k306j913j496j577j903j860
$$ plain form
62501 1360444 1393470 1419566 1437233 1445457 1444447 1435295 1419273 1397562 1371406 1342270 1311819 1281655
62489 1281655 1253077 1227151 1204966 1187530 1175297 1168067 1165445 1167180 1173022 1182687 1196168 1213648
62477 1213648 1234761 1258225 1282434 1305972 1327274 1344373 1355674 1360746 1359805 1352737 1339178 1319264
62465 1319264 1293541 1262177 1224936 1182007 1134450 1083936 1032456 982041 934011 888441 844882
62454 844882 803539 765259 730534 699341 671870 648505 628876 611873 596982 584867 576093 569922
62442 569922 564924 560338 556289 553075 550881 549946 550378 551766 553361 554676 555712 556600 557174 556856 554933
62427 554933 551111 545828 539789 533267 526169 518757 511702 505239 498798 491877 484862 478611 473516 469356
62413 469356 465732 462284 458731 455132 451955 449494 447398 445159 442853 440940 439444 437867 435964 434104
62399D34104j374r74j030j273j080o7J502K796L107K539J879J738K054K423K642
62384D48986K759K827K860K843K772K814L393M767O440P454P459P170P493Q449
62370E18486R370R871J0183J0574J0975J1371J2078J3390J5175J7167J9460K2302
62358F80402K5516K8645L1688L5161L9106M2657M5027M6469M7548M7821M6185
62347A116225M2416L7468L2106K6129J9308J2231N685j84n573j0470j4914j9281
62335A241146k3670k7488l0196l1963l3046l3073l1693k9480k7356k5514k3685
62324I23982k2119k1319k1000k0364j9372j8815j9054j9545j9781j9882k0010
62313G02721j9922j9400j8586j7669j6642j5503j4291j2916j1353r912q806p657
$$ plain form
62399 434104 432730 431756 430726 429453 428373 428306 429808 432604 435711 438250 440129 441867 443921 446344 448986
62384 448986 451745 454572 457432 460275 463047 465861 469254 474021 480461 487915 495374 502544 510037 518486
62370 518486 527856 537727 547910 558484 569459 580830 592908 606298 621473 638640 658100 680402
62358 680402 705918 734563 766251 801412 840518 883175 928202 974671 1022219 1070040 1116225
62347 1116225 1158641 1196109 1228215 1254344 1273652 1285883 1291568 1291384 1285811 1275341 1260427 1241146
62335 1241146 1217476 1189988 1159792 1127829 1094783 1061710 1030017 1000537 973181 947667 923982
62324 923982 901863 880544 859544 839180 819808 800993 781939 762394 742613 722731 702721
62313 702721 682799 663399 644813 627144 610502 594999 580708 567792 556439 546527 537721 530064
62301E30064o078m517l713l445k812j727j133j476j983j872j361j002p57k86L96
62286D98298J095J797K488L065L596M253M766M584L662K550J560O16K1M35J730
62271E34516K854L261L611M566N814O893Q053R654J1429J3152J5250J7986K0834
62258F57873K3469K6581L0740L5214L8983M2266M5794M9073N0771N0559M9299
62247A100622M7388M4113L8889L2144K4751J7332J0195L279l815j1173j8030k3620
62235A262075k8325l3146l8145m2362m5206m6861m7301m5957m2817l8955l5567
62224H17433l2999l0922k8796k5984k2297j8600j6200j5342j5015j4383j3499
62213E83396j2430j0763q552o859o458o713o480n643m947m674m351l592k615j829
$$ plain form
62301 530064 523986 519469 515756 512311 509499 507772 506639 505163 503180 501308 499947 498945 498188 497902 498298
62286 498298 499393 501190 503678 506743 510339 514592 519358 523942 527604 530154 531714 532330 532351 532786 534516
62271 534516 537370 540631 544242 548808 554622 561515 569568 579222 590651 603803 619053 637039 657873
62258 657873 681342 707923 738663 773877 812860 855126 900920 949993 1000764 1051323 1100622
62247 1100622 1148010 1192123 1231012 1263156 1287907 1305239 1315434 1318713 1314898 1303725 1285695 1262075
62235 1262075 1233750 1200604 1162459 1120097 1074891 1028030 980729 934772 891955 853000 817433
62224 817433 784434 753512 724716 698732 676435 657835 641635 626293 611278 596895 583396
62213 583396 570966 560203 551651 544792 538334 531621 525141 519498 514551 509877 505526 501934 499319 497490
62199D97490j388j132o49M25J936L191L681L654L714M177N014O175P537Q828R823
62184E52476J0526J0944J0964J0693J0429J0059Q901O686M342L194L475M215M561
62171F51465M785N816Q077J1000J3635J5678J7747K0576K4083K7614L0856L3908
62159H65240L6408L7396L6450L4249L1551K8231K3878J8812J3772Q973M233k79
62147A138914m180p512j0577j3284j5383j7078j8634j9509j8893j7069j5241j3827
62135I67727j1983r176o319m617m112m008l879l783l588l033k361k138k442k697
62121I03591k382j516m30N95J432K170L023L967M462L857K102k00k434m422o156
62106I07659p379p703p088o020n130m620m170l464k680k229k018j332L56K635
$$ plain form
62199 497490 496102 494970 494321 494746 496682 499873 503554 507208 510922 515099 520113 526288 533825 542653 552476
62184 552476 563002 573946 584910 595603 606032 616091 624992 631678 636020 639214 642689 646904 651465
62171 651465 656250 662066 670143 681143 694778 710456 728203 748779 772862 800476 831332 865240
62159 865240 901648 939044 975494 1009743 1041294 1069525 1093403 1112215 1125987 1134960 1139193 1138914
62147 1138914 1134734 1127222 1116645 1103361 1087978 1070900 1052266 1032757 1013864 996795 981554 967727
62135 967727 955744 946568 940249 935632 931520 927512 923633 919850 916262 913229 910868 908730 906288 903591
62121 903591 901209 899693 899263 899858 901290 903460 906483 910450 914912 918769 920871 920671 918237 913815 907659
62106 907659 900280 892577 885489 879469 874339 869719 865549 862085 859405 857176 855158 853826 854182 856817
62092H56817M528N590O331P515R209J0711J1475J1868J2780J4493J6310J7538
62080I85165J8483K0011K2314K4705K6601K8079K9240K9692K9078K7684K6068
62069A267120K4388K2479K0347J8140J5884J3659J1836J0790J0574J1140J2531
62058A438888J4437J5938J6271J5634J4678J3504J1780R616P501N393K688r16
62046A565412n214j0185j6060k2538k8720l4066l8704m2594m5320m7071m8862
62035A226078n1060n2527n2011m9781m7012m4108m0660l6736l3125l0213k7619
62024G61226k5046k2753k0943j9323j7622j6026j4792j3795j2732j1582j0668
62013E75944j0345j0610j0879j0295q580o428m755l617k390q36N43J283J609K031
$$ plain form
62092 856817 861345 866935 873266 880781 889990 900701 912176 924044 936824 951317 967627 985165
62080 985165 1003648 1023659 1045973 1070678 1097279 1125358 1154598 1184290 1213368 1241052 1267120
62069 1267120 1291508 1313987 1334334 1352474 1368358 1382017 1393853 1404643 1415217 1426357 1438888
62058 1438888 1453325 1469263 1485534 1501168 1515846 1529350 1541130 1550746 1558247 1563640 1566328 1565412
62046 1565412 1560198 1550013 1533953 1511415 1482695 1448629 1409925 1367331 1322011 1274940 1226078
62035 1226078 1175018 1122491 1070480 1020699 973687 929579 888919 852183 819058 788845 761226
62024 761226 736180 713427 692484 673161 655539 639513 624721 610926 598194 586612 575944
62013 575944 565599 554989 544110 533815 525235 518807 514052 510435 508045 507209 507752 509035 510644 512675
61999E12675K700L348L613L332K722K310K380K484J871M76r28j665j914k353l399
61984E27652m907o386p336p632p616p629p509o876n818m787l869k782j646j061
61970D51798j171j216n07O73J611K133K489K644K297J514Q27P09J246K136K790
61955D69973K676J969J590K189L266L844L796L829M300M770N016N671P322R435
61941E29646J0891J1520J2395J4374J6857J8412J8415J7545J6675J5873J4781
61930F97384J3558J2787J2617J2491J1803J0438Q581O403M098J828m66k913n272
61917G83337p028q042q575q565p426m936j860Q43L042N195P453R518J1207J2581
61903G86744J3595J4063J3897J2986J1031P903M078K73l199o330q913j0695j1925
$$ plain form
61999 512675 515375 518723 522336 525668 528390 530700 533080 535564 537435 537911 536983 535318 533404 531051 527652
61984 527652 522745 516359 509023 501391 493775 486146 478637 471761 465943 461156 457287 454505 452859 451798
61970 451798 450627 449411 448904 449577 451188 453321 455810 458454 460751 462265 463092 463801 465047 467183 469973
61955 469973 472649 474618 476208 478397 481663 485507 489303 493132 497432 502202 507218 512889 520211 529646
61941 529646 540537 552057 564452 578826 595683 614095 632510 650055 666730 682603 697384
61930 697384 710942 723729 736346 748837 760640 771078 779659 786062 790160 791988 791522 788609 783337
61917 783337 776309 768267 759692 751127 743701 738765 736905 737748 740790 745985 753438 762956 774163 786744
61903 786744 800339 814402 828299 841285 852316 860219 864297 864570 861371 855041 846128 835433 823508
61890H23508j3112j4280j4978j5017j4606j3752j2236j0338q903q365q222p848
61878F81851p293o963o859o698o400o038n529m814m156l799l453k611j331k39
61864F15668L69R72K093L526M659N462O576Q332J0133J1226J1865J3175J5796
61851G09852J9131K2158K4508K6442K8124K9472L0432L0879L0329K8363K5398
61840A005088K2371J9564J6276J1921O953K351j335m035n680o283o196n791m879
61827A050325k982j70K854N543P939J0207J2088J3119J3026J1640Q673M056j564
61814A134754p098j1923j6247k0491k4581k8054l0557l1945l2079l0956k9093
61803H71730k7303k5963k4760k3256k1415j9427j7369j5339j3666j2631j2057
$$ plain form
61890 823508 810396 796116 781138 766121 751515 737763 725527 715189 706286 697921 689699 681851
61878 681851 674558 667595 660736 654038 647638 641600 636071 631257 627101 623302 619849 617238 615907 615668
61864 615668 616037 617009 619102 622628 627287 632749 639325 647657 657790 669016 680881 694056 709852
61851 709852 728983 751141 775649 802091 830215 859687 890119 920998 951327 979690 1005088
61840 1005088 1027459 1047023 1063299 1075220 1082173 1084524 1083189 1079154 1073474 1067191 1060995 1055204 1050325
61827 1050325 1047343 1047173 1050027 1055570 1063509 1073716 1085804 1098923 1111949 1123589 1132262 1136318 1134754
61814 1134754 1127656 1115733 1099486 1078995 1054414 1026360 995803 963858 931779 900823 871730
61803 871730 844427 818464 793704 770448 749033 729606 712237 696898 683232 670601 658544
61792F58544j1462j0536r307p991o901o344o264o187n728n091m663m387l914l289
61778E66480k872k621k066j165o32j007j810k101j613r59p60j001j256j235r27
61763E44455m16J85N94M41l37j223j532j103l48L93J188K014K440K236J919K125
61747E53031K619K623K055J743K242L046L313K884K301K123K514L215L691L573
61733E90973L145L077L554L970L729K984K354K188K329K378J997J271Q39J246
61719F26034K029K004P90n93j057p98p39j077j271j161j257j889k772l525m038
61704F10680m305m394m638n278n938o008n568n269n200m655l401k360k462l347
61690E47857l897l721l371l303l323l125k729k236j653j172j205j853k583k726
$$ plain form
61792 658544 647082 636546 627239 619248 612347 606003 599739 593552 587824 582733 578070 573683 569769 566480
61778 566480 563608 560987 558921 557756 557124 556117 554307 552206 550593 549634 548874 547873 546617 545382 544455
61763 544455 544039 544224 544818 545259 544922 543699 542167 541064 540716 541109 542297 544311 546751 548987 550906 553031
61747 553031 555650 558273 560328 562071 564313 567359 570672 573556 575857 577980 580494 583709 587400 590973
61733 590973 594118 597195 600749 604719 608448 611432 613786 615974 618303 620681 622678 623949 624788 626034
61719 626034 628063 630067 630857 630264 629207 628409 627670 626593 625322 624161 622904 621015 618243 614718 610680
61704 610680 606375 601981 597343 592065 586127 580119 574551 569282 564082 559427 556026 553666 551204 547857
61690 547857 543960 540239 536868 533565 530242 527117 524388 522152 520499 519327 518122 516269 513686 510960
61676E10960k188j512j273j602k166k519k534k468k584k663k264j453r48j214
61662D83572j797j968j800j954k488k597j837q63m75m32Q1J058J604J271P32P94
61646D72901J358J738J683J570J686J805J570J035O35O09P20N74J97m7j05m80
61630D87449j482k585l023k858k794l029l011k520k201k535k936k537j495q26
61616D53617j101j913k565k749k515k096j887k186k885l638m278m778m908m415
61602D11703l575l101l319l766l825l470l195l362l830m136l901l119k112j253
61588C65739p65q27j531k530l041k594j684j248j551k051k289k274k029j380n02
61573C39443j00n85j479k052k182k181k143j968j784j829j951j700r00J98J211
$$ plain form
61676 510960 508772 507260 505987 504385 502219 499700 497166 494698 492114 489451 487187 485734 484786 483572
61662 483572 481775 479807 478007 476053 473565 470968 469131 468268 467793 467361 467442 468500 470104 471375 472107 472901
61646 472901 474259 475997 477680 479250 480936 482741 484311 485346 485981 486590 487310 487884 488081 488034 487929 487449
61630 487449 485967 483382 480359 477501 474707 471678 468667 466147 463946 461411 458475 455938 454443 453617
61616 453617 452516 450603 448038 445289 442774 440678 438791 436605 433720 430082 425804 421026 416118 411703
61602 411703 408128 405027 401708 397942 394117 390647 387452 384090 380260 376124 372223 369104 366992 365739
61588 365739 364974 364147 362616 360086 357045 354451 352767 351519 349968 347917 345628 343354 341325 339945 339443
61573 339443 339343 338758 337279 335227 333045 330864 328721 326753 324969 323140 321189 319489 318589 318787 319998
61558C19998J718J336K20o91n05M91J109Q27L73N41J000R00J83l46j19N99J284
61541C28918J758K099K263K135J798J510J399J341J177R58Q62R17R40P94N38K50
61525C49657j48o55r98r99j033j573k258k092q35L75L55o21j321j247j029j191
61509C34387j382j162p74o94q67r31q76r55j167j250j145j075j154j281j407j625
61493C16642j907j952j444l98P61J491J578J311J094R17M38l44q57n95K64J123
61477C18122J626J795J678J307Q39N26M73O66J045J437J563J376J160J072Q77
61462C35562M89L36O77R09L14o72q71p4N78K42m14k47P37J553J604J230R54Q71
61444C43778P88N92L28J24J11K43K94J47J6J75O24J166J699K194K497K435K092
$$ plain form
61558 319998 321716 323052 323272 322581 322076 322567 323676 324503 324876 325417 326417 327317 327500 327154 327035 327634 328918
61541 328918 330676 332775 335038 337173 338971 340481 341880 343221 344398 345356 346218 347135 348075 348869 349407 349657
61525 349657 349509 348854 347856 346857 345824 344251 341993 339901 339066 339441 339796 339175 337854 336607 335578 334387
61509 334387 333005 331843 331069 330375 329508 328577 327701 326746 325579 324329 323184 322109 320955 319674 318267 316642
61493 316642 314735 312783 311339 310941 311702 313193 314771 316082 317176 318093 318531 318187 317330 316735 316999 318122
61477 318122 319748 321543 323221 324528 325367 325893 326366 327032 328077 329514 331077 332453 333613 334685 335562
61462 335562 336051 336387 337064 337973 338287 337615 336744 336670 337248 337490 337076 336829 337566 339119 340723 341953 342907 343778
61444 343778 344566 345158 345486 345610 345721 345964 346258 346405 346421 346596 347220 348386 350085 352279 354776 357211 359303
61427C59303J766J670J821K120K400K457K231J948J876K026K208K358K553K738
61413C89475K720K477K317K498K781K581J581J32j075j667j821j930k207k635
61399C95227l051l147k700j944j542j858k463k611k130j441r11n67l87l87l17
61384C69771J48Q23J052N59j28l42p6K33L08J67j17m19m31R4R69J619J602J021
61366C76853N13P05J552K319K397K037J901K103K200K088K246K913L712M353N079
61351D12971O039O753O808O643P025P978Q800R026Q905Q909R181R432R228Q470
61337E26168P615P141O778N777M141K847K436K134J072k54p45n57r66k405l744
61322E57438l860l060k410k277k159j572n11P64J977K844L217L339L759M823O186
$$ plain form
61427 359303 361069 362739 364560 366680 369080 371537 373768 375716 377592 379618 381826 384184 386737 389475
61413 389475 392195 394672 396989 399487 402268 404849 406430 406562 405487 403820 401999 400069 397862 395227
61399 395227 392176 389029 386329 384385 382843 380985 378522 375911 373781 372340 371429 370862 370475 370088 369771
61384 369771 369919 370742 371794 372353 372225 371883 371807 372040 372348 372515 372398 371979 371548 371642 372611 374230 375832 376853
61366 376853 377366 378071 379623 381942 384339 386376 388277 390380 392580 394668 396914 399827 403539 407892 412971
61351 412971 419010 425763 432571 439214 446239 454217 463017 472043 480948 489857 499038 508470 517698 526168
61337 526168 533783 540924 547702 553479 557620 560467 562903 565037 566109 565855 565110 564553 563587 561182 557438
61322 557438 553578 550518 548108 545831 543672 542100 541589 542353 544330 547174 550391 553730 557489 562312 568498
61307E68498P047P036O766P214Q569J0071J0986J1243J0998J0155Q712P039N346
61294F79680L316P98j624l363m668o091p420q004p862p608p454p150o844o970
61280F08736p220o651n092l581k931k694k043r33K11J405K919M510N512N624N107
61265F02879M318L445K767K744L641N105O310O663O470O732Q073J0007J1514J2100
61251F92768J1896J1005R423P572O206N474M631L014Q91r94k375l579m880o095
61237G34957o823o871o426n764m856l393j456K22R56R41Q69J015J202J563K531
61222G08667M044N444O325O886P232P100O504N992N828N506M572L492L130L703
61208G84425M628N158M814L539J910R49J295K587L927M865N665O782Q325J0008
$$ plain form
61307 568498 575545 582581 589347 596561 605130 615201 626187 637430 648428 658583 667295 674334 679680
61294 679680 682996 683794 682170 678807 674139 668048 660628 652624 644762 637154 629700 622550 615706 608736
61280 608736 601516 594865 589773 586192 583261 580567 578524 577591 577802 579207 582126 586636 592148 597772 602879
61265 602879 607197 610642 613409 616153 619794 624899 631209 637872 644342 651074 659147 669154 680668 692768
61251 692768 704664 715669 725092 732664 738870 744344 748975 751989 752880 751886 749511 745932 741052 734957
61237 734957 728134 721263 714837 709073 704217 700824 699368 699590 700546 701487 702356 703371 704573 706136 708667
61222 708667 712711 718155 724480 731366 738598 745698 752202 758194 764022 769528 774100 777592 780722 784425
61208 784425 789053 794211 799025 802564 804474 805423 806718 809305 813232 818097 823762 830544 838869 848877
61194H48877J1569J3169J5155J7342J8868J9261J9253J9850K0767K0707J9156
61183A043974J6966J5001J3200J1349R722Q444P075N495M409M182L998K937J197
61170A147949n70k467m909p538r686j1497j3548j5635j7069j7980j9160k0666
61158A007224k1626k1652k1367k1327k1247k0653j9518j7982j6114j4229j2771
61147G98738j1587r958p630n262l533k439j810j871k758l953m744n002n079n163
61133G27949n133m811m034k614n64J779M047O078P779R109J0372J2168J4768J7749
61119G94642K0615K3362K6161K8798L0960L2774L4521L6002L6818L7149L7626
61108A139428L8310L8494L7681L6149L4271L1946K9143K6373K3925K1107J7058
$$ plain form
61194 848877 860446 873615 888770 906112 924980 944241 963494 983344 1004111 1024818 1043974
61183 1043974 1060940 1075941 1089141 1100490 1110212 1118656 1125731 1131226 1135635 1139817 1143815 1146752 1147949
61170 1147949 1147379 1144912 1140003 1132465 1122779 1111282 1097734 1082099 1065030 1047050 1027890 1007224
61158 1007224 985598 963946 942579 921252 900005 879352 859834 841852 825738 811509 798738
61147 798738 787151 777193 769563 764301 760768 758329 756519 754648 751890 747937 743193 738191 733112 727949
61133 727949 722816 718005 713971 711357 710793 712572 716619 722697 730476 739585 749957 762125 776893 794642
61119 794642 815257 838619 864780 893578 924538 957312 991833 1027835 1064653 1101802 1139428
61108 1139428 1177738 1216232 1253913 1290062 1324333 1356279 1385422 1411795 1435720 1456827 1473885
61097A473885J2078P257K932j626o892j2442j7792k2879k7348l0379l1976l3418
61085A311400l5525l7297l7394l6300l5610l5626l5154l3619l1834l0381k8710
61074I33950k6420k4127k2313k0422j7958j5591j4201j3508j2548j0996r139p076
61062G39651m865l116k422k359j863n60R60K140L094M214N620P127Q448R493J0552
61047G76114J1991J3705J5287J6856J9066K1933K4450K5885K6824K8226L0078
61036A010415L1736L3062L4347L5540L6417L7248L8431L9796M0977M2172M3709
61025A423850M5232M6180M6744M7488M8343M8926M9558N1060N3784N7832O3824
61014A982821P2391Q3148R5291J09065J25554J45303J68542J96590K31781K76023
$$ plain form
61097 1473885 1485963 1493220 1496152 1494526 1487634 1475192 1457400 1434521 1407173 1376794 1344818 1311400
61085 1311400 1275875 1238578 1201184 1164884 1129274 1093648 1058494 1024875 993041 962660 933950
61074 933950 907530 883403 861090 840668 822710 807119 792918 779410 766862 755866 746727 739651
61062 739651 734786 731670 729248 726889 725026 724466 725426 727566 730660 734874 740494 747621 756069 765562 776114
61047 776114 788105 801810 817097 833953 853019 874952 899402 925287 952111 980337 1010415
61036 1010415 1042151 1075213 1109560 1145100 1181517 1218765 1257196 1296992 1337969 1380141 1423850
61025 1423850 1469082 1515262 1562006 1609494 1657837 1706763 1756321 1807381 1861165 1918997 1982821
61014 1982821 2055212 2138360 2233651 2342716 2468270 2613573 2782115 2978705 3210486 3486509
61004C486509L30674L97503M78225N73225O82275Q06044R44959J096996J258386
60995A0054796J423823J578850J690225J712053J611612J391668J086440P40732
60987B1290199M00492J18914m9418q1337j6182N5842M6152q6143l31144o53862
60977B0693513j010515j345754j595735j713028j693111j572957j403028j221428
60969I137957j048747q95121p64424o54842n62119m84006m20050l68106l24036
60960C616506k85032k51023k22435j98339j77282j58448j41425j25820j11611
60951A945091r9108q8338p8976p0887o4060n8185n3055m9154m6945m5751m4341
60940A246291m2444m0642l8954l6753l4175l2258l1360l0576k9172k7503k6126
$$ plain form
61004 3486509 3817183 4214686 4692911 5266136 5948411 6754455 7699414 8796410 10054796
60995 10054796 11478619 13057469 14747694 16459747 18071359 19463027 20549467 21290199
60987 21290199 21690691 21809605 21760187 21678850 21662668 21718510 21764662 21678519 21347375 20693513
60977 20693513 19682998 18337244 16741509 15028481 13335370 11762413 10359385 9137957
60969 9137957 8089210 7194089 6429665 5774823 5212704 4728698 4308648 3940542 3616506
60960 3616506 3331474 3080451 2858016 2659677 2482395 2323947 2182522 2056702 1945091
60951 1945091 1845983 1757645 1678669 1607782 1543722 1485537 1432482 1383328 1336383 1290632 1246291
60940 1246291 1203847 1163205 1124251 1087498 1053323 1021065 989705 959129 929957 902454 876328
60929H76328k4908k3595k2306k0977j9124j6801j4932j4116j3714j2793j1362
60918F81700j0031r054q256p539o828n980n185m875m857m189k492p33P4K82Q55
60903F12892J740K054J573R83P05M32o3n34q57j284j858k207k164k124k535l412
60887F03341m452n240n335m621l719l489m054m697m859m714m613m507m202l739
60873E41100l168k421j649j282j385j383p72J84R38J477K167L035L733M136M507
60858E49217N008N475N668N553N327N319N734O277O262N449M577M505N038N178
60844F24587M501L622L134K763J944P15m45j283j818j984j792j729k354l423l898
60829F22540l130j703p77p85j085r00k27L63N32M27K61J6k72k97J39P54J112J157
$$ plain form
60929 876328 851420 827825 805519 784542 765418 748617 733685 719569 705855 693062 681700
60918 681700 671669 662615 654359 646820 639992 634012 628827 623952 619095 614906 612414 611681 611755 612037 612892
60903 612892 614632 616686 618259 619242 619947 620379 620316 619782 618925 617641 615783 613576 611412 609288 606753 603341
60887 603341 598889 593649 588314 583693 579974 576485 572431 567734 562875 558161 553548 549041 544839 541100
60873 541100 537932 535511 533862 532580 531195 529812 529040 529224 530162 531639 533806 536841 540574 544710 549217
60858 549217 554225 559700 565368 570921 576248 581567 587301 593578 599840 605289 609866 614371 619409 624587
60844 624587 629088 632710 635844 638607 640551 641266 640821 639538 637720 635736 633944 632215 629861 626438 622540
60829 622540 619410 617707 616930 616145 615060 614160 613933 614296 614828 615255 615516 615532 615260 614963 615102 615856 616968 618125
60811F18125J120J075R51Q78J109J685K511L628M936N834N795N303N436O442P485
60796F72313Q005Q389Q899Q895P967P038P358Q800J0091J0494J0352J0163J0044
60783G88808J0084J0346J0504J0218R807R804R929R419Q438Q094Q750R341Q882
60770I12424P827P217P148O877O013M922M069L510K954J998M76j214k368k852
60756I59001l323m337n566o333o574o798p326q026q694r232r532r504r265r041
60742H55450q948r014r298r824j0496j1269j2153j2964j3330j3144j2762j2480
60730G19768j2098j1304j0243r400q995q804q472p812o955o318o205o303n931
60717F10928m987m270m452n137n314m588l490k733k595k950l439l622l322k849
$$ plain form
60811 618125 619245 620320 621271 622149 623258 624943 627454 631082 636018 641852 647647 652950 658386 664828 672313
60796 672313 680318 688707 697606 706501 714468 721506 728864 737664 747755 758249 768601 778764 788808
60783 788808 798892 809238 819742 829960 839767 849571 859500 868919 877357 885451 894201 903542 912424
60770 912424 920251 927468 934616 941493 947506 952428 956497 960007 962961 964959 965435 964221 961853 959001
60756 959001 955678 951341 945775 939442 932868 926070 918744 910718 902024 892792 883260 873756 864491 855450
60742 855450 846502 837488 828190 818366 807870 796601 784448 771484 758154 745010 732248 719768
60730 719768 707670 696366 686123 676723 667728 658924 650452 642640 635685 629367 623162 616859 610928
60717 610928 605941 601671 597219 592082 586768 582180 578690 575957 573362 570412 566973 563351 560029 557180
60703E57180k706l019l437l553l322l122l383m063m548m364l874l787m059l966
60689E05977l443l400m302n208m998l855k698j713m49Q87J465J109N88M98O47
60674D81105P04O86O55N14L36L09K71r2n48m98pJ36m08j038j230j274j581j873
60656D76167j636r17j40N12J080J509J741J908K091K237K458L046L902M437M314
60641E02709L823L162K030M17q69j175j005j218j627j388n70k32q41j556j483
60626E00177q66n96j019j633j727j015O9N99j7j304k208k353k340k615k755k205
60610D78192j255o67o81r11j040j070j030r21r38j276j769k063k044j781j182
60595D59564k11O20O17j90r55r92l37O86J801K422J736k12k039k378j456p04q97
$$ plain form
60703 557180 554474 551455 548018 544465 541143 538021 534638 530575 526027 521663 517789 514002 509943 505977
60689 505977 502534 499134 494832 489624 484626 480771 478073 476360 475911 476798 478263 479372 479960 480458 481105
60674 481105 481809 482495 483150 483664 484000 484309 484580 484488 483940 483442 483435 483571 483163 482125 480895 479621 478040 476167
60656 476167 474531 473614 473474 473986 475066 476575 478316 480224 482315 484552 487010 490056 493958 498395 502709
60641 502709 506532 509694 511724 512141 511272 510097 509092 507874 506247 504859 504289 504057 503216 501660 500177
60626 500177 499311 498715 497696 496063 494336 493321 493390 493989 493972 492668 490460 488107 485767 483152 480397 478192
60610 478192 476937 476270 475589 474678 473638 472568 471538 470617 469679 468403 466634 464571 462527 460746 459564
60595 459564 459353 459973 460590 460400 459445 458453 458116 458802 460603 463025 464761 464549 462510 460132 458676 457972 457075
60578D57075j430j454r22k26N91J694K896L772M325N028O118P142P545P510P872
60563E07536R014J0215J0345R111P168N164L199J269l54j530k489l338l784l756
60549E47770l772m065l882k473l83J191K072L088M444N287N174M874N207N966
60535E70498O585P019P288O845N297L267J704O42n59j931k733k520j749j170j099
60520E97384j358j591j529j202r44r68j028p02J03J057J721J814J421J058J267
60505E96503J990K748L512M887P090R469J1524J3858J7288K1443K5104K7743K9884
60492G73043L1945L3496L3824L2588K9688K5020J8640J0908K296o725j5553k3491
60480I45679k9925l4342l6409l6292l4758l2594l0126k7489k5050k3061k1188
$$ plain form
60578 457075 455645 454191 453269 453043 453634 455328 458224 461996 466321 471349 477467 484609 492154 499664 507536
60563 507536 516550 526765 537110 546221 553389 558553 561752 563021 562667 561137 558648 555310 551526 547770
60549 547770 543998 539933 536051 533578 533195 534386 536458 539546 543990 549277 554451 559325 564532 570498
60535 570498 577083 584102 591390 598235 603532 606799 608503 609145 608586 606655 603922 601402 599653 598483 597384
60520 597384 596026 594435 592906 591704 590760 589792 588764 588062 588165 589222 590943 592757 594178 595236 596503
60505 596503 598493 601241 604753 609640 616730 626199 637723 651581 668869 690312 715416 743159 773043
60492 773043 804988 838484 872308 904896 934584 959604 978244 989152 991448 984723 969170 945679
60480 945679 915754 881412 845003 808711 773953 741359 711233 683744 658694 635633 614445
60469F14445j8952j6503j4357j2633j1085r768q998q665q198p320o302n481m923
60456D81260m620m552m570m544m494m325l674k488j372q35n92k86m08j492k833
60441D40175l192k607k215k295j919p96m3m89j395j606j053l86Pr4r00j998k307
60424D16887j440l65%L6M51R06O99J74K36R17J563K058K708L175K777J840J475
60407D34097J901K107J488P47O89J082J275J204J184J214J145J141J371J573J401
60392D53619J079J130J577J906J839J747K048K533K608K117J581J463J501J111
60378D77859L32q7L09J082J534J590J624J759J824J817J868J771J146J31o08o93
60362D93258m31j55L09J151J920J934J274Q41J287K246K874K924K951L534M564
$$ plain form
60469 614445 595493 578990 564633 552000 540915 531147 522149 513484 505286 497966 491664 486183 481260
60456 481260 476640 472088 467518 462974 458480 454155 450481 447993 446621 445786 445194 444908 444500 443008 440175
60441 440175 436983 434376 432161 429866 427947 427151 427108 426619 425224 423618 422565 422179 422186 422092 421192 419194 416887
60424 416887 415447 415082 415082 415118 415569 416475 417174 417348 417584 418501 420064 422122 424830 428005 430782 432622 434097
60407 434097 435998 438105 439593 440340 441029 442111 443386 444590 445774 446988 448133 449274 450645 452218 453619
60392 453619 454698 455828 457405 459311 461150 462897 464945 467478 470086 472203 473784 475247 476748 477859
60378 477859 478191 478104 478413 479495 481029 482619 484243 486002 487826 489643 491511 493282 494428 494559 493951 493258
60362 493258 492827 492672 492981 494132 496052 497986 499260 500101 501388 503634 506508 509432 512383 515917 520481
60347E20481N454N790N658N434N481N899O416O494N807M561L207J838K22j600
60333E81142l154m110m697n289n858o118n978n526m771l784k956k702k842k723
60319E20634k043j205o60k43M61J330J738J458J124J564K923M649O210P520Q808
60304E54268J0407J2622J5358J7800J8811J7980J5991J3750J1432Q618N086J050
60292G03173l042o624r049j0017r868r123p897o170m473l641l918m786n708o536
60278F12321p202p597p885q403q988q983q125p006o284n838n143m181l491l438
60264E19757l659l450k555j560j321j976k696k618j749o82J82O92O34N1l50Q4
60248D98784R98J495J477J597J967J981J543J307J349Q12n89j718j510m34L52
$$ plain form
60347 520481 525935 531725 537383 542817 548298 554197 560613 567107 572914 577475 580682 582520 582742 581142
60333 581142 577988 573878 569181 563892 558034 551916 545938 540412 535641 531857 528901 526199 523357 520634
60319 520634 518591 517386 516726 516483 516944 518274 520012 521470 522594 524158 527081 531730 537940 545460 554268
60304 554268 564675 577297 592655 610455 629266 647246 663237 676987 688419 697037 702123 703173
60292 703173 700131 693507 684458 674441 664573 655450 647553 641383 636910 633269 629351 624565 618857 612321
60278 612321 605119 597522 589637 581234 572246 563263 555138 548132 541848 536010 530867 526686 523195 519757
60264 519757 516098 512648 510093 508533 507212 505236 502540 499922 498173 497491 497673 498365 498999 499050 498700 498784
60248 498784 499782 501277 502754 504351 506318 508299 509842 511149 512498 513310 512721 511003 509493 509059 509411
60233E09411N94P98J172J588K110K696K872K436K130K675L542L607K758J982J977
60218E42348K531L176L706M044M246M574N104N434N333N322O000P090P932Q458
60204F15298Q902Q919Q087P029O820P283P078N717M286L754L710L389K990L040
60190F96302L214K727J597N99M2o08j744k864l239l035l269m477n821o038n127
60175F68259m477n034o007o006m959m082m099m389l983k755j395o16n93p75k67
60160F18822J206K778L357K988K685K904K974K232J022J02l49o14o75k10P82J758
60144F41762K256K491L122M369N514N649M941M670N624P034P587P127O548O325
60130G15019O076N553N034M492L323J447j10l81K72P30N80L78O37J214J762K289
$$ plain form
60233 509411 510005 510803 511975 513563 515673 518369 521241 523677 525807 528482 532024 535631 538389 540371 542348
60218 542348 544879 548055 551761 555805 560051 564625 569729 575163 580496 585818 591818 598908 606840 615298
60204 615298 624200 633119 641206 648235 655055 662338 669416 675133 679419 683173 686883 690272 693262 696302
60190 696302 699516 702243 703840 704439 704481 703873 702129 699265 696026 692991 689722 685245 679424 673386 668259
60175 668259 663782 658748 652741 646735 641776 637694 633595 629206 625223 622468 621073 620457 619864 619089 618822
60160 618822 620028 622806 626163 629151 631836 634740 637714 639946 640968 641070 640721 640107 639432 639222 640004 641762
60144 641762 644018 646509 649631 654000 659514 665163 670104 674774 680398 687432 695019 702146 708694 715019
60130 715019 721095 726648 731682 736174 739497 740944 740834 740453 740725 741455 742035 742413 743050 744264 746026 748315
60114G48315K985L708L924L268K093J244J196J586J697J201J74j289l051m662
60100G62389n631n952o018o077o144o245o276n697l966j396R38K252K590K378
60086G17145J926J476J228J200J330J707K293K640K401K004K068K307J785L00
60072G41810j349k649l996n706p276q115q377q529q660q727q897r197r276q924
60058F42132q408p906p128n958m885m343m098l742l292k767j805k95J067J614
60044E90186J687K177L342M727N890O626O781O582O811P822Q622P784N335K870
60030F67242J676J437R92k47j961l558m795n908p283q900j0195j0743j0802j0846
60016E96109j0743j0005q752p769p459p334o767n775m763l841k818j626m39N28
$$ plain form
60114 748315 751300 755008 758932 762200 764293 765537 766733 768319 770016 771217 771391 770102 767051 762389
60100 762389 756758 750806 744788 738711 732567 726322 720046 714349 710383 708987 709925 712177 714767 717145
60086 717145 719071 720547 721775 722975 724305 726012 728305 730945 733346 735350 737418 739725 741510 741810
60072 741810 740461 737812 733816 728110 720834 712719 704342 695813 687153 678426 669529 660332 651056 642132
60058 642132 633724 625818 618690 612732 607847 603504 599406 595664 592372 589605 587800 587505 588572 590186
60044 590186 591873 594050 597392 602119 608009 614635 621416 627998 634809 642631 651253 659037 664372 667242
60030 667242 668918 670355 671347 671100 669139 665581 660786 654878 647595 638695 628500 617757 606955 596109
60016 596109 585366 575361 566609 558840 551381 544047 537280 531505 526742 522901 520083 518457 518018 518546
60002E18546J170J475J522J462J506J903K768L781M199L616K640K363L100M063
59988E54114M462M434M511M624M252L338K456J931J416N92k63p75j203k066l236
59973E78587m015m167m220m588m931m730m100l507l034k490j947j662j527j146
59959E32523m22L61J043J653J983J701J024O77R45J218Q63J47n6P43K201L454
59943E50058L699K783J410N60M61L94l52j680l052m179m992n255m758l793l028
59928E28276k818k927k923k611k064j407o75O2N31L71l71j023r08j16O71J133
59912E13201J625K475L453M162M524M585M249L593L064L040L368L674L876M052
59898E62941M127M072M188M715N295N278M551L713L397L736M432N026N088M524
$$ plain form
60002 518546 519716 521191 522713 524175 525681 527584 530352 534133 538332 541948 544588 546951 550051 554114
59988 554114 558576 563010 567521 572145 576397 579735 582191 584122 585538 586130 585867 585092 583889 581823 578587
59973 578587 574572 570405 566185 561597 556666 551936 547836 544329 541295 538805 536858 535196 533669 532523
59959 532523 532101 532462 533505 535158 537141 538842 539866 540543 541488 542706 543569 543716 543660 544403 546604 550058
59943 550058 553757 556540 557950 558510 558971 559365 559013 557333 554281 550102 545110 539855 535097 531304 528276
59928 528276 525458 522531 519608 516997 514933 513526 512851 512913 513444 513815 513444 512421 511513 511397 512068 513201
59912 513201 514826 517301 520754 524916 529440 534025 538274 541867 544931 547971 551339 555013 558889 562941
59898 562941 567068 571140 575328 580043 585338 590616 595167 598880 602277 606013 610445 615471 620559 625083
59884F25083L779L532M020M838N462N727N719N421M804M174L988M137L730J998
59870F86412p30l321n130o419p495q115q132q029q220q271p532o221n083m245
59856E99469l241j938p00L54J391K308K920L614M882O278O945P109P774Q852Q961
59841F54978P557N758M376K710K96j486j063R73K641L107L013K779K071P69p48
59826F87731k386m285o036o985p287p734q482q899q764q613q780q913q642p953
59812E83972o822n278l898l385l515l344k592j935j715j345m93J37p1n46m12M1
59796E48799l20j823l410l884l143k062j463j441j568j554j513j569j522j182
59782E22345q73j150j973k587k366j493o35k28l00p06j254j639j546q92N0Q24
$$ plain form
59884 625083 628862 632394 636414 641252 646714 652441 658160 663581 668385 672559 676547 680684 684414 686412
59870 686412 685682 682361 677231 670812 663317 655202 647070 639041 630821 622550 615018 608797 603714 599469
59856 599469 596228 594290 593590 593944 595335 597643 600563 604177 609059 615337 622282 629391 637165 646017 654978
59841 654978 662535 668293 672669 675379 675675 674189 673126 674099 676740 679847 682860 685639 687710 688479 687731
59826 687731 685345 681060 675024 668039 660752 653018 644536 635637 626873 618260 609480 600567 591925 583972
59812 583972 577150 571872 567974 564589 561074 557730 555138 553203 551488 550143 549650 549787 549716 549170 548758 548799
59796 548799 548479 546656 543246 539362 536219 534157 532694 531253 529685 528131 526618 525049 523527 522345
59782 522345 521472 520322 518349 515762 513396 511903 511268 511040 510740 510034 508780 507141 505595 504703 504753 505577
59766E05577J139J093J008J135J620K591L934M982M888L648K351K090K865L849
59752E42770M441M638M659M660M743M823M619M098L753M005M536M682M288L712
59738F04427L077K120Q67n9o2P39J536J534P29O3M98J808K650K156R76L46O34
59721F24039J348K082K631K533J545M06K18R72J579J468J211J350J591J614J750
59706F46337K153K009N71j452k434j831q05o06j009q88J2P29N61J19L28Q81O20
59689F45295o51j716j657j109j179j837k098j424j55J122J974K090J517P69K64
59674F41205j81q09j386j820k715m447o110o470n702n114n257n465n264m981m707
59659E80777l875k384j158r20j146q41K51J686K991L800L868L414L080L133L078
$$ plain form
59766 505577 506716 507809 508817 509952 511572 514163 518097 523079 527967 531615 533966 536056 538921 542770
59752 542770 547211 551849 556508 561168 565911 570734 575353 579451 583204 587209 591745 596427 600715 604427
59738 604427 607504 609624 610491 610432 610370 611109 612645 614179 614908 614971 615469 617277 619927 622083 623059 623405 624039
59721 624039 625387 627469 630100 632633 634178 634584 634802 635774 637353 638821 640032 641382 642973 644587 646337
59706 646337 648490 650499 651070 649618 647184 645353 644548 643942 642933 642045 642057 642786 643347 643466 643794 644675 645295
59689 645295 644644 642928 641271 640162 638983 637146 635048 633624 633469 634591 636565 638655 640172 640941 641205
59674 641205 641024 640215 638829 637009 634294 629847 623737 617267 611565 606451 601194 595729 590465 585484 580777
59659 580777 576902 574518 573360 572440 571294 570453 570704 572390 575381 579181 583049 586463 589543 592676 595754
59644E95754K409J337L93k99r44j569j997k130k040j833j585j249o45K19R63J255
59628E88039J304J498J718J556J075P36O04K98k18n06m12l44o51j270k012k572
59612E88843k390j236O3M08J4K57J725L406M109L776K951J926R36M15L86K41m07
59595F05423j199j738k122k368k156j573j359j766k051j711j388j746k304k326
59581E79616k135k412k763k252j064m14q05j499j813j938k171k187j578n63L14
59566E56336Q53J220J474J459J137Q39R75J528K031K207K350K720K830K025P10
59551E80694J96R86J993J964J140Q15J635K976L945M405M861N696O734P673Q756
59536F34469J0655J3349J5578J5977J4507J2110R228N670J814j141k395k102n24
$$ plain form
59644 595754 598163 599500 599893 599594 598650 597081 595084 592954 590914 589081 587496 586247 585602 585821 586784 588039
59628 588039 589343 590841 592559 594115 595190 595926 596530 596828 596610 596104 595692 595348 594697 593427 591415 588843
59612 588843 586453 585217 585280 585688 585702 585959 587684 591090 595199 598975 601926 603852 604788 605203 605589 605830 605423
59595 605423 604224 602486 600364 597996 595840 594267 592908 591142 589091 587380 585992 584246 581942 579616
59581 579616 577481 575069 572306 570054 568990 568576 567771 566272 564459 562521 560350 558163 556585 556022 556336
59566 556336 557189 558409 559883 561342 562479 563318 564293 565821 567852 570059 572409 575129 577959 579984 580694
59551 580694 580890 581876 583869 585833 586973 587788 589423 592399 596344 600749 605610 611306 618040 625713 634469
59536 634469 645124 658473 674051 690028 704535 716645 725873 731543 733357 732216 729821 727719 727195
59523G27195K249N450P638Q216P978P621O741M935K747O96j636m546p176q641
59509G59467r389j0311j1224j1445j1186j1089j0937j0215r479r635j0061r062
59497F35434o323l540k262k321k689k798k480j575k04J084J864K201K307K401
59483F21099K903M172N909P447Q703J0202J2022J3424J3851J3658J3458J3196
59471G40044J2318J0592Q422O364M582K768O78j321k419k219j106M48K478N082
59457G86711P763R856J1417J3134J5430J8067K0570K2565K3808K4207K3778K2433
59445I99739K0086J7063J3821J0003M466l064j1019j7359k1441k3864k5011k4787
59433I38633k3439k1645j9786j7976j6528j5611j4602j2647r767o637l529k94
$$ plain form
59523 727195 729444 734894 742532 750748 758726 766347 773088 778023 780770 781466 779830 775284 768108 759467
59509 759467 750078 739767 728543 717098 705912 694823 683886 673671 664192 654557 644496 635434
59497 635434 629111 625571 623309 620988 618299 615501 613021 611446 611242 612326 614190 616391 618698 621099
59483 621099 624002 628174 634083 641530 650233 660435 672457 685881 699732 713390 726848 740044
59471 740044 752362 762954 771376 777740 782322 785090 785768 784447 782028 779809 778703 779151 781629 786711
59457 786711 794474 804330 815747 828881 844311 862378 882948 905513 929321 953528 977306 999739
59445 999739 1019825 1036888 1050709 1060712 1065178 1062114 1051095 1033736 1012295 988431 963420 938633
59433 938633 915194 893549 873763 855787 839259 823648 809046 796399 786632 779995 776466 776172
59421G76172K878N647Q291J1354J4602J7254J9152K0744K2108K3019K3709K4382
59409I69312K3997K0938J5039P671j78q449j6331k1773k3462k2123j9018j4503
59397I11120r029m426k684l955o865j0455j4794j9832k4595k7629k7882k5377
59385G33597k1363j7571j4870j2836j0796q701o812n142l789l174l283l172j965
59372F20123q0J162J070K07l47J06J473K960L659L494L360M089N470O676P354
59357F60776P882Q720R937J1296J2501J3463J4512J6134J8283K0227K1410K2157
59345H37298K3162K4477K5432K5480K4713K3501K1863J9365J5626J0993O450K667
59333A061027q10m910r649j3939j6942j8962k0740k2439k3822k4880k5633k5566
$$ plain form
59421 776172 779050 784697 792988 804342 818944 836198 855350 876094 898202 921221 944930 969312
59409 969312 993309 1014247 1029286 1036957 1036779 1028330 1011999 990226 966764 944641 925623 911120
59397 911120 902091 897665 894981 891026 884161 873706 858912 839080 814485 786856 758974 733597
59385 733597 712234 694663 679793 666957 656161 647460 640648 635506 631717 628543 625260 622088 620123
59372 620123 620043 621205 622275 622482 622135 622241 623714 626674 630333 633827 637187 641276 646746 653422 660776
59357 660776 668658 677378 687315 698611 711112 724575 739087 755221 773504 793731 815141 837298
59345 837298 860460 884937 910369 935849 960562 984063 1005926 1025291 1040917 1051910 1058360 1061027
59333 1061027 1060217 1055307 1045658 1031719 1014777 995815 975075 952636 928814 903934 878301 852735
59321H52735k3991k1062j7932j5758j4726j4124j3150j1627r954q506p229n956
59309F88720m886m214l521k133j87J364K118K923M727P237R369J0612J1309J1804
59295G35242J1933J1353R864P397M036J38l804p319r813j0664r859q306o998n961
59281G17239m524k538o18R20K588M826P111Q661R699J1252J3659J5970J7165J7365
59267H18775J7366J7308J6584J4901J2644J0011O579K227k152n582q223j0935
59255H89503j3802j5989j6977j7122j6799j5826j4159j2482j1448j0730r447p389
59243G27333n264l709k511j023R84L151N075O708Q091Q993R192Q945Q715Q328
59229G83008P017M563J889kj315l061n665q583j1102j2827j3466j2933j1801j0978
$$ plain form
59321 852735 828744 807682 789750 773992 759266 745142 731992 720365 710411 701905 694676 688720
59309 688720 683834 679620 676099 673966 673779 675143 677261 680184 684911 692148 701517 712129 723438 735242
59295 735242 747175 758528 768392 775789 779825 779963 776159 768840 759027 748363 738504 730198 723200 717239
59281 717239 712715 710177 709559 710479 713067 717893 725004 733665 743364 754616 768275 784245 801410 818775
59267 818775 836141 853449 870033 884934 897578 907589 914168 916395 914243 908661 900438 889503
59255 889503 875701 859712 842735 825613 808814 792988 778829 766347 754899 744169 734722 727333
59243 727333 722069 718360 715849 714826 715810 718961 724036 730744 738835 747828 757020 765965 774680 783008
59229 783008 790025 794588 796477 796475 795160 792099 786434 777851 766749 753922 740456 727523 715722 704744
59215G04744j0744j0529r822q804p944p427p075o576n696m664m241m832n592n102
59201F05696l067o64Q98J563J918K285K728L329L976M240L940L464L217L098K909
59186F39530K858L229L796M058L868L477L039K458J689J044J078K160L988N641
59172F81913O394O462O727P804R571J1514J3061J3752J3546J3016J2788J2830
59160H09378J2652J2025J0943R089O133K516q24l642o472r426j1736j2843j3188
59147H04605j3466j3792j3950j3920j3730j3269j2558j1746j0687r096p302o075
59135F65014n551n093m453m107m111l654k452j509j643k071j476R9J547K402L252
59120F36194M548N985P088P727Q046Q317Q779R295R374Q886Q377Q251Q112P466
$$ plain form
59215 704744 694000 683471 673649 664845 656901 649474 642399 635823 630127 625463 621222 616390 610798 605696
59201 605696 602629 601965 602863 604426 606344 608629 611357 614686 618662 622902 626842 630306 633523 636621 639530
59186 639530 642388 645617 649413 653471 657339 660816 663855 666313 668002 669046 670124 672284 676272 681913
59172 681913 688307 694769 701496 709300 718871 730385 743446 757198 770744 783760 796548 809378
59160 809378 822030 834055 844998 854087 860220 862736 861912 858270 851798 842372 830636 817793 804605
59147 804605 791139 777347 763397 749477 735747 722478 709920 698174 687487 678391 671089 665014
59135 665014 659463 654370 649917 645810 641699 638045 635593 634084 632441 630370 628894 628993 630540 632942 636194
59120 636194 640742 646727 653815 661542 669588 677905 686684 695979 705353 714239 722616 730867 738979 746445
59106G46445O640O320O484O458N863M920L980L245K785K413J738P37m4k25j80
59091G97579l68n91m47q3P4l0l41j153k623m141n038n575o509p930r291j0326
59075G43207j1117j1426j0923r957r237q736p795o389n388n299n554n341m520
59062F41525l436k435j841j889k338k604k492k405k551k478j769p93l11n57j061
59047F12565j285j118p81n48o03r60j409j579j237n70o5K4QL54J071J763K191
59030F07821K449K611K719L076L998N194O041O687Q088J0443J2393J2534J1249
59017F95303J0177J0121J0295R553P695N409L460K084R61k97j506j986j372k7
59003G49870J580L446N627P662R018R786J0486J1300J1969J2265J2150J1706J1201
$$ plain form
59106 746445 753085 759405 765889 772347 778210 783130 787110 790355 793140 795553 797291 798028 797984 797759 797579
59091 797579 797211 796620 796173 796090 796164 796134 795793 794640 792017 787876 782838 777263 770754 762824 753533 743207
59075 743207 732090 720664 709741 699784 690547 681811 674016 667627 662239 656940 651386 646045 641525
59062 641525 638089 635654 633813 631924 629586 626982 624490 622085 619534 617056 615287 614494 614183 613626 612565
59047 612565 611280 610162 609381 608833 608230 607270 605861 604282 603045 602475 602410 602434 602442 602796 603867 605630 607821
59030 607821 610270 612881 615600 618676 622674 627868 633909 640596 648684 659127 671520 684054 695303
59017 695303 705480 715601 725896 735449 743144 748553 752013 754097 755058 754761 753255 751269 749897 749870
59003 749870 751450 754896 760523 768185 777203 786989 797475 808775 820744 833009 845159 856865 868066
58990H68066J1002J0991J0406Q756O509M425K444p8l237o246q234q901q540p692
58976H79671o718n440l390o42K044M148O057Q304J0715J2806J4538J6056J7138
58963I55287J7568J7726J8087J8384J7867J6199J3492R854N550J252k559o195
58951A082512j0128j4108j7576k0468k2852k4180k3957k2812k1851k1105j9714
58940H63761j7530j5407j3813j2240j0286q393p130o406n768m956l966l062k718
58927G52086l068l462l189k452j988j849j489r09p22j010j081n96K2N37J326K499
58911G34655L478L927M324N079N826O144O420P316Q803J0359J1839J3638J5995
58898H37803J8537K0491K1323K1200K0840K0814K1154K1867K3465K6360L0003
$$ plain form
58990 868066 879068 890059 900465 909221 915730 920155 922599 922521 919284 913038 904804 895903 887363 879671
58976 879671 872953 867513 864123 863481 865525 869673 875730 884034 894749 907555 922093 938149 955287
58963 955287 972855 990581 1008668 1027052 1044919 1061118 1074610 1084464 1090014 1091266 1088707 1082512
58951 1082512 1072384 1058276 1040700 1020232 997380 973200 949243 926431 904580 883475 863761
58940 863761 846231 830824 817011 804771 794485 786092 778962 772556 766788 761832 757866 754804 752086
58927 752086 749018 745556 742367 739915 737927 736078 734589 733680 732958 731948 730867 730271 730293 730830 732156 734655
58911 734655 738133 742060 746384 751463 757289 763433 769853 777169 785972 796331 808170 821808 837803
58898 837803 856340 876831 898154 919354 940194 961008 982162 1004029 1027494 1053854 1083857
58887A083857L3304L5881L8154M0189M1211M0520L8153L4407K9334K3053J6069
58876A454132Q887J650n525j2330j8565k4350k9740l4351l7575l8962l8404l6293
58864A188574l3520l0940k8729k6593k4500k2790k1550k0457j9304j8268j7494
58853I24429j6847j6184j5504j4772j3899j2961j2099j1227j0136q872p643o517
58841G77768n589n256n799o769p385p436p345p387p353o988o287n423m719m519
58827F89513m614m150k687r67P5O66J650K933L624L636L912M831N582N506N077
58812G14587N003N188N165M885M486L773K519R95j78o09m47k99q01j950k992l354
58796G35971l421l862m524m807m868n369o136o157n053l530k105m71J459K883
$$ plain form
58887 1083857 1117161 1153042 1191196 1231385 1272596 1313116 1351269 1385676 1415010 1438063 1454132
58876 1454132 1463019 1464669 1459144 1446814 1428249 1403899 1374159 1339808 1302233 1263271 1224867 1188574
58864 1188574 1155054 1124114 1095385 1068792 1044292 1021502 999952 979495 960191 941923 924429
58853 924429 907582 891398 875894 861122 847223 834262 822163 810936 800800 791928 784285 777768
58841 777768 772179 766923 761124 754355 746970 739534 732189 724802 717449 710461 704174 698751 694032 689513
58827 689513 684899 680749 678062 677095 677170 677836 679486 682419 686043 689679 693591 698422 704004 709510 714587
58812 714587 719590 724778 729943 734828 739314 743087 745606 746601 746423 745814 745367 745068 744267 742317 739325 735971
58796 735971 732550 728688 724164 719357 714489 709120 702984 696827 691774 688244 686139 685668 687127 690010
58782F90010L165K840K893L537M199M259L483K134R62N93P05L55p80k081l066
58767G13208l983m945n274m363k787j876k313l479m086l352j678k24M18Q42J868
58752F77976L338M485N159N846O645P133P195P104O755N827M786M737N943P415
58738G60344Q191Q245P918P339O783O744P246P688P640P251O758O278O134O611
58724H61170P311P551P409P439P440O621N157M338M808N766O312O558O892P221
58710I51993P394P501P261O014L773J384p27l047n870q752j1487j4477j7670k0192
58696I03098k1579k2315k2634k2019k0474j8999j7993j6496j3994j1719j0900
58685G03976j0857j0159q891q252q418q291p200n705m624m158m056l947l486k529
$$ plain form
58782 690010 693175 696015 698908 702445 706644 710903 714386 716520 717482 718075 718780 719135 718355 716274 713208
58767 713208 709225 704280 699006 694643 691856 689980 687667 684188 680102 676750 675072 674848 675266 676108 677976
58752 677976 681314 685799 690958 696804 703449 710582 717777 724881 731636 737463 742249 746986 752929 760344
58738 760344 768535 776780 784698 792037 798820 805564 812810 820498 828138 835389 842147 848425 854559 861170
58724 861170 868481 876032 883441 890880 898320 904941 910098 914436 919244 925010 931322 937880 944772 951993
58710 951993 959387 966888 974149 980163 983936 985320 984593 981546 975676 966924 955437 940960 923290 903098
58696 903098 881519 859204 836570 814551 794077 775078 757085 740589 726595 714876 703976
58685 703976 693119 682960 674069 665817 657399 649108 641908 636203 631579 627421 623365 619418 615932 613403
58671F13403j230K63J910L595N181O800Q559J0042J0803J1249J2070J2790J2103
58658G07538R832P253N148K964M19j504k079k069k471l122l486l750m145m213
58644G06315l746l532m122m737m468l666l072k426j081P30K366L818N237O148
58630F93764O126N670N349M794L517K040J130O29Q7q7O87K009L160M381O360Q887
58614G48503J1104J2701J3822J4333J4081J3441J2642J1080Q259M844J767j060
58602H65517m063o685q011q243q395q743q709q063p269o751o545o400n714l856
58588G68070j127J246K733M170O173P965Q797R407J0750J2217J2592J1972J1313
58575H66278J0692R633Q596Q514R194R670R913J0813J2592J4586J6449J8367K0204
$$ plain form
58671 613403 612173 612436 614346 617941 623122 629922 638481 648523 659326 670575 682645 695435 707538
58658 707538 717370 724623 729771 732735 733154 731650 729571 727502 725031 721909 718423 714673 710528 706315
58644 706315 702569 699037 694915 690178 685710 682044 678972 676546 675465 676195 678561 682379 687616 693764
58630 693764 699890 705560 710909 715703 719220 721260 722390 723019 723106 723019 723706 725715 728875 733256 739616 748503
58614 748503 759607 772308 786130 800463 814544 827985 840627 851707 859966 864810 866577 865517
58602 865517 861454 854769 846758 838515 830120 821377 812668 804605 797336 790585 784040 777640 771926 768070
58588 768070 766943 768189 770922 775092 781265 789230 798027 807434 818184 830401 842993 854965 866278
58575 866278 876970 886603 895199 903713 912907 922577 932490 943303 955895 970481 986930 1005297 1025501
58562A025501K1607K2780K4066K5012K4925K4078K3133K1628J8332J3140P454
58551A251656K632r73l579n513p202q794r843r965r563r240q999q768r172j0897
58537A151780j3689j6728j9504k1604k2350k1585k0151j8677j6674j3793j0968
58526I56057r104p500n005k029J12J246K242L283L731L490L117K755K097J226
58512I55718M58k99j120j533j307j136j592k144k258k533l537m550m698m489m733
58497I20247n008m709m595n561o755o769n906n348m883l478j487k59O5M79J240
58482H67273J991L175N470Q211J0233J1745J3501J4772J4345J2936J2248J1962
58470I87862J0136O429K568m46l263o134q188r007r078q460o853m991l993l365
$$ plain form
58562 1025501 1047108 1069888 1093954 1118966 1143891 1167969 1191102 1212730 1231062 1244202 1251656
58551 1251656 1254288 1253315 1249736 1244223 1237021 1228227 1218384 1208419 1198856 1189616 1180617 1171849 1162677 1151780
58537 1151780 1138091 1121363 1101859 1080255 1057905 1036320 1016169 997492 980818 967025 956057
58526 956057 946953 939453 934448 932419 932531 933777 936019 939302 943033 946523 949640 952395 954492 955718
58512 955718 956176 955877 954757 953224 951917 950781 949189 947045 944787 942254 938717 934167 929469 924980 920247
58497 920247 915239 910530 905935 900374 893619 886850 880944 875596 870713 867235 865748 865489 865554 866033 867273
58482 867273 869264 872439 877909 886120 896353 908098 921599 936371 950716 963652 975900 987862
58470 987862 997998 1004427 1006995 1006549 1003286 997152 988964 979957 970879 962419 955566 950575 946582 943217
58456I43217j597J244L596N034O567Q293Q973Q283P323O464M756J897j117l715
58442I99218o309q755j0089j0171r847r211p444m632k001j38J396K650L199L520
58428I41386M611O228P306P986R320J1084J1970J1871J1796J1655J0346Q022N964
58415A059545M158J456j810l938m786n999q016r356r396r320r781j0021r889j0302
58401I72545j1141j1021r782q859q579p514n171k994j954j360o83l82l05M84J765
58386I05049K152J488J045J168J040R51K147M198N299N425O269P698P506N321
58372I56756L512L310L265K607K879M850O849P680Q379R729J0774J1162J2229
58359A043981J4309J5656J5436J5133J5589J5288J3092J0130P569M875J734p67
$$ plain form
58456 943217 941620 942864 946460 951494 958061 966354 975327 983610 990933 997397 1002153 1004050 1002933 999218
58442 999218 992909 984154 974065 963894 954047 944836 937392 932760 930759 930621 932017 934667 937866 941386
58428 941386 945997 952225 959531 967517 976837 987921 999891 1011762 1023558 1035213 1045559 1053581 1059545
58415 1059545 1063703 1065159 1063349 1059411 1054625 1048626 1040610 1031254 1021858 1012538 1002757 992736 982847 972545
58401 972545 961404 950383 940601 931742 923163 915649 910478 907484 905530 904170 903487 903105 902800 903284 905049
58386 905049 907201 908689 909734 910902 911942 912893 915040 919238 924537 929962 936231 943929 951435 956756
58372 956756 960268 963578 966843 969450 972329 977179 984028 991708 1000087 1009816 1020590 1031752 1043981
58359 1043981 1058290 1073946 1089382 1104515 1120104 1135392 1148484 1158614 1166183 1171058 1172792 1172025
58347A172025k033k779k994j648P19J975J909K794N437P809Q735R678J1527J2914
58333A226068J3298J4340J6614J8073J7509J6471J6173J5636J4370J3634J3449
58322A395635J1739Q142N269M475L914K469J917L192M248L831L726N118O348O477
58308A466500P345R757J1459J1318J1687J4029J6043J5822J5116J5700J6310J5916
58296A627002J6163J7718J8148J6420J5489J7340J9506J9726J9903K1925K3778
58285A833118K3536K3314K5240K7391K7585K7570K9398L1331L1302L0934L2179
58274B142898L3505L3277L3325L5381L7652L8666M0579M4821M8515M9289M9509
58263B587417N1668N3963N4668N6312O0871O5303O6599O6955O9125P1183P0804
$$ plain form
58347 1172025 1169992 1167213 1164219 1162571 1163290 1165265 1167174 1169968 1175405 1183214 1191949 1201627 1213154 1226068
58333 1226068 1239366 1253706 1270320 1288393 1305902 1322373 1338546 1354182 1368552 1382186 1395635
58322 1395635 1407374 1415516 1420785 1425260 1429174 1431643 1433560 1436752 1441000 1444831 1448557 1453675 1460023 1466500
58308 1466500 1473845 1483602 1495061 1506379 1518066 1532095 1548138 1563960 1579076 1594776 1611086 1627002
58296 1627002 1643165 1660883 1679031 1695451 1710940 1728280 1747786 1767512 1787415 1809340 1833118
58285 1833118 1856654 1879968 1905208 1932599 1960184 1987754 2017152 2048483 2079785 2110719 2142898
58274 2142898 2176403 2209680 2243005 2278386 2316038 2354704 2395283 2440104 2488619 2537908 2587417
58263 2587417 2639085 2693048 2747716 2804028 2864899 2930202 2996801 3063756 3132881 3204064 3274868
58252C274868P0186P1751P3534P3805P5428Q0532Q5883Q8849R2620J00070J08022
58241D195548J13367J19066J27952J36640J42116J48273J58986J70882J80068
58232E492898J89683K03367K17846K29849K43541K62952K84021L02735L23768
58223G750660L51939L82819M11681M43818M85456N32515N79675O32430O98328
58214A2269321P74567Q56695R51134J066269J200318J351662J531675J753035
58206B1754676K016038K321899K687694L131104L653663M259288M976698N842741
58198E0643801O878086Q102005R553297J1267993J3251628J5498408J8007997
58191A33203215K0738176K3555415K6255005K8558823K9995693K9837305K7349303
$$ plain form
58252 3274868 3345054 3416805 3490339 3564144 3639572 3720104 3805987 3894836 3987456 4087526 4195548
58241 4195548 4308915 4427981 4555933 4692573 4834689 4982962 5141948 5312830 5492898
58232 5492898 5682581 5885948 6103794 6333643 6577184 6840136 7124157 7426892 7750660
58223 7750660 8102599 8485418 8897099 9340917 9826373 10358888 10938563 11570993 12269321
58214 12269321 13043888 13900583 14851717 15917986 17118304 18469966 20001641 21754676
58206 21754676 23770714 26092613 28780307 31911411 35565074 39824362 44801060 50643801
58198 50643801 57521887 65623892 75177189 86445182 99696810 115195218 133203215
58191 133203215 153941391 177496806 203751811 232310634 262306327 292143632 319492935
58184C19492935K2240315J4863163O002718l405431j2327475j9657877k4528076
58177C02680272k6721848k6735202k5399849k3458638k1396517j9453217j7663180
58170A41851821j5938884j4217687j2546532j1018203r670736q484791p440890
58163F2534098o531224n735238n027123m401729l864653l404883l001360k647488
58155B7920400k346437k090213j864249j665955j499769j359852j234608j122391
58147A4736926j026998r43363q62700p86377p20639o62715o05437n50549n04344
58138H073804m64794m25599l88679l60416l39164l18026k96721k79642k65267
58129D935496k48248k29350k13397j99810j84583j69008j57339j48274j37446
$$ plain form
58184 319492935 341733250 356596413 362599131 359193700 346866225 327208348 302680272
58177 302680272 275958424 249223222 223823373 200364735 178968218 159515001 141851821
58170 141851821 125912937 111695250 99148718 88130515 78459779 69974988 62534098
58163 62534098 56002874 50267636 45240513 40838784 36974131 33569248 30567888 27920400
58155 27920400 25573963 23483750 21619501 19953546 18453777 17093925 15859317 14736926
58147 14736926 13709928 12766565 11903865 11117488 10396849 9734134 9128697 8578148 8073804
58138 8073804 7609010 7183411 6794732 6434316 6095152 5777126 5480405 5200763 4935496
58129 4935496 4687248 4457898 4244501 4044691 3860108 3691100 3533761 3385487 3248041
58120C248041j25987j18065j12476j05067r7093r2720r0478q5484p8306p3475
58110B268890p0895o6715o1321n8615n8312n6405n2555n0078m9254m7284m4251
58099A653205m2875m2847m1357l8601l7092l6384l4064l1008l0082l0503k9015
58088A259377k5824k3889k3243k1405j8735j7991j9009j8966j7539j6995j7604
58077A038177j7634j7263j8022j8987j8035j6124j5882j6735j5973j3796j2753
58066H56973j2927j2292j1126j1370j2209j1000q243p112q177q958q521q335q740
58053G27963q528p973q410r135q373o823o486o716n466l638l933n877o376m894
58039F35335l824l917l655l081l873n518n625m377m537o679q380q547q660r249
$$ plain form
58120 3248041 3122054 3003989 2891513 2786446 2689353 2596633 2506155 2420671 2342365 2268890
58110 2268890 2197995 2131280 2069959 2011344 1953032 1896627 1844072 1793994 1744740 1697456 1653205
58099 1653205 1610330 1567483 1526126 1487525 1450433 1414049 1379985 1348977 1318895 1288392 1259377
58088 1259377 1233553 1209664 1186421 1165016 1146281 1128290 1109281 1090315 1072776 1055781 1038177
58077 1038177 1020543 1003280 985258 966271 948236 932112 916230 899495 883522 869726 856973
58066 856973 844046 831754 820628 809258 797049 786049 777806 770694 762517 753559 745038 736703 727963
58053 727963 719435 711462 703052 693917 685544 678721 672235 665519 660053 656415 652482 646605 640229 635335
58039 635335 631511 627594 623939 620858 616985 611467 605842 601465 596928 590249 581869 573322 564662 555413
58025E55413q987p861p530p961p332n752n448o695p188o153n479n962n976m833
58011D62256m121m576m769l972l407l685l786l442l748m577m216k443j262j610
57997D12642j977j213j97J96M59Q94R54Q40J646L271M330M450M519M476L303J482
57981D40075Q70J707K256J793J450J652J371M35J2K69N3o55n86J56L1q20l55J718
57963D51432L072K537J843K329K736J825O27M57P21L92k02m73p57j167r58j37
57947D64277l3j159k165j987j424j466j607r35L74J661K690L336L508L881N370
57932D74321P531Q834Q747Q045O993N123K941J780J508M99j616l242l480l447
57918E14537m167n117n719o344o963o696n513m703m786m712l918l325l492l493
$$ plain form
58025 555413 546426 538565 531035 523074 515742 509990 504542 497847 490659 484506 479027 473065 467089 462256
58011 462256 458135 453559 448790 444818 441411 437726 433940 430498 426750 422173 417957 415514 414252 412642
57997 412642 410665 409452 409255 409451 409910 410804 411758 412598 414244 417515 421845 426295 430814 435290 438593 440075
57981 440075 440945 442652 444908 446701 448151 449803 451174 451609 451621 451890 451943 451288 450702 450858 450889 450069 449714 451432
57963 451432 454504 457041 458884 461213 463949 465774 466401 466858 467579 467971 467769 467296 466539 465372 464414 464277
57947 464277 464244 463085 460920 458933 457509 456043 454436 453501 453875 455536 458226 461562 465070 468951 474321
57932 474321 481852 490686 499433 507478 514471 519594 522535 524315 525823 526322 524706 521464 517984 514537
57918 514537 510370 505253 499534 493190 486227 479531 474018 469315 464529 459817 455899 452574 449082 445589
57904D45589k658j740j514j767k357l669n281n924n459n242n768n810m632l240
57890C90528k545k103j642j979l284m166l631k462j689j159n69m27r46j366j275
57875C61285j341j977k633l006l450l728l049j889j869l168m021l474k593k094
57861C22993j113O08J632J332J302K662M027L952L420L958M922M891M349M783
57847C63718O092O910O826O503O155N461M555L794L029K099J408J122O11m27j230
57832D16626j206r33j089j462j808k490l352l249j770j67M93P82J496K115J941
57817D05927J430J152N92o50j689j732j522k076l066l825m697o023o890o563o044
57802C64324o576p428o965n208l636k941k567k139j876j754j424q78l26K11N95
$$ plain form
57904 445589 442931 441191 439677 437910 435553 431884 426603 420679 415220 409978 404210 398400 393768 390528
57890 390528 387983 385880 384238 382259 378975 374809 371178 368716 367027 365868 365299 364872 363926 362560 361285
57875 361285 359944 357967 355334 352328 348878 345150 342101 340212 338343 335175 331154 327680 325087 322993
57861 322993 321880 322488 324120 325452 326754 329416 333443 337395 340815 344773 349695 354586 358935 363718
57847 363718 369810 376720 383546 390049 396204 401665 406220 410014 413043 415142 416550 417672 418283 417856 416626
57832 416626 415420 414487 413398 411936 410128 407638 404286 401037 399267 399100 399593 400375 401871 403986 405927
57817 405927 407357 408509 409101 408451 406762 405030 403508 401432 398366 394541 389844 383821 376931 370368 364324
57802 364324 357748 350320 343355 338147 334511 331570 329003 326864 324988 323234 321810 320932 320606 320817 321412
57787C21412M14j81k92M44J261J654K241L436M439M563M362M412M218L515L268
57772C59166L997M433L357J683R54Q85J93j049j792k063k763l855m501m660m977
57757C49008n344n160m696m749n183n204m781m480m156l199j863j024p67m11K15
57742B98206O22O21L90j43j027j748j924k049k551k730j718n3R65J069J050J334
57726B90314J656J805J666J010J39Q7J151J948J213k75r93j029j534k410k539
57711B92209k025k219l382m147l719l065l292m079m396l922l164k652k397j966
57697B47784j083k69l39j056j065J84J462J475O77K22J12k18k87Q16K594L623
57681B54632L735M295O300R415J2935J6503J9877K3028K6538L1017L6245M1566
$$ plain form
57787 321412 321826 321645 321353 321797 323058 324712 326953 330389 334828 339391 343753 348165 352383 355898 359166
57772 359166 363163 367596 370953 372636 373590 374475 374668 373619 371827 369764 367001 363146 358645 353985 349008
57757 349008 343664 338504 333808 329059 323876 318672 313891 309411 305255 302056 300193 299169 298402 297991 298206
57742 298206 298828 299449 299839 299696 298669 296921 294997 292948 290397 287667 285949 285896 286861 287930 288980 290314
57726 290314 291970 293775 295441 296451 296590 296677 297828 299776 300989 300714 299721 298692 297158 294748 292209
57711 292209 290184 287965 284583 280436 276717 273652 270360 266281 261885 257963 254799 252147 249750 247784
57697 247784 246701 246432 246093 245037 243972 244156 245618 247093 247770 247992 248104 247886 247599 248415 251009 254632
57681 254632 258367 262662 268962 278377 291312 307815 327692 350720 377258 408275 444520 486086
57669D86086M6789N1681N4976N4885N0403M1391K7987J1038p294k4470l8751m8834
57657G05887n3323n2014m7029m1226l5837l0804k6488k3352k0669j7436j4261
57646C43448j2442j1589j0072p724n999n370m580k959j533j201j403j283q50l63
57632B76080K55P60N24m10j102j007n76m11o02j127j903k357j945j191j183k012
57616B61793k725k850k811k875k780k527k381k095j256l27j48m89m13K5q7p27
57600B37327r46p42j244k643l607l310k560k277k317k426k969l921m407m064l655
57585A96239l653l353k236j093q62j274j565j699k008k276k094j625j359j430
57571A69712j706k096k444k566k569k685k654k004r87l96l39n3P48J380J335J067
$$ plain form
57669 486086 532875 584556 639532 694417 744820 786211 814198 825236 817942 793472 754721 705887
57657 705887 652564 600550 553521 512295 476458 445654 419166 395814 375145 357709 343448
57646 343448 331006 319417 309345 301621 295622 290252 285672 282713 281180 279979 278576 277293 276443 276080
57632 276080 276335 277095 277619 277209 276107 275100 274524 274113 273511 272384 270481 268124 266179 264988 263805 261793
57616 261793 259068 256218 253407 250532 247752 245225 242844 240749 239493 239166 239018 238529 238116 238141 238054 237327
57600 237327 236381 235639 234395 231752 228145 224835 222275 219998 217681 215255 212286 208365 203958 199894 196239
57585 196239 192586 189233 186997 185904 185042 183768 182203 180504 178496 176220 174126 172501 171142 169712
57571 169712 168006 165910 163466 160900 158331 155646 152992 150988 150001 149605 149266 149213 149961 151341 152676 153743
57555A53743J132J371J395J273J304J602K088K488K335J523P55P04R38N93j92
57540A73052n67m49m62n06J41J221J526Q14K75O01J002P10J94K05N96P83N46m7
57522A79635p49r11j27R00J074N76N08R43Q83K56K78J311K104J771R11J17r07
57505A88573j960j783j16J258P82q28k013k548k994l177k728k232k425k916k914
57490A61979k577k446k270j576p84o49j008j171j029r17q11n89n10o88o31j08
57474A44215J41n97j863k639k600j996j010Q6P06O57M50L20k45j331j909j236
57458A31149p4M54M36N89Q49O59R2l47n86p58o14MO46R24J095J276R24o7o31M9
57438A36069J142J308O17J21J64K45J42O6M2Q1N19J340J672R07k48p31n57l26
$$ plain form
57555 153743 154875 156246 157641 158914 160218 161820 163908 166396 168731 170254 171009 171713 172651 173244 173052
57540 173052 172485 172036 171574 171068 171209 172430 173956 174770 175045 175646 176648 177358 177552 177757 178353 179136 179682 179635
57522 179635 178886 177975 177848 178748 179822 180398 180906 181849 182732 182988 183266 184577 186681 188452 189363 189480 188573
57505 188573 186613 184830 184714 185972 186754 185926 183913 181365 178371 175194 172466 170234 167809 164893 161979
57490 161979 159402 156956 154686 153110 152326 151677 150669 149498 148469 147552 146741 146152 145642 144954 144323 144215
57474 144215 144356 143759 141896 139257 136657 134661 133651 133737 134443 135100 135550 135870 135625 134294 132385 131149
57458 131149 131075 131529 131965 132554 133403 134062 134154 133807 133221 132463 131849 131853 132499 133423 134518 135794 136718 136651 136020 136069
57438 136069 137211 138519 139136 139257 139421 139666 139808 139874 139916 139997 140516 141856 143528 144435 144187 143456 142899 142573
57420A42573k6N89J075Q62K68j10m39j055j424r07pL41J65J0k43q37j040r6J233
57401A40932J552R47O29Q65Q19L64L41R15J205P87K67Q9Rl2L67J191J902K334
57383A55483K793L189L082K623K381K272J721R02O38R41Q58j5j000j539j854k104
57367A70371j962j440j114j178j089n70j23j18j86J17O49J090J348J354R93N07
57351A68649L94P55J231J593J873J931J594J187J239J604J654J286J050J175J281
57336A88496J111Q99Q16P50O30M59Q3m44n77k3M87J06p00p30J46Q76R52R80J364
57317A95681J647J461J127Q76N04R2J95Q57J297J014M02K7p6M7N49J280J647J360
57299B09987P46J67k51k86J97O96N63J37L70J227J606J139P88J139J358O54l15
$$ plain form
57420 142573 142547 143136 144211 145073 145341 145231 144792 143737 142313 141406 141399 141740 141905 141915 141672 140835 139795 139699 140932
57401 140932 142484 143431 144060 144925 145744 146108 146449 147364 148569 149356 149623 149712 149721 149689 150056 151247 153149 155483
57383 155483 158276 161465 164547 167170 169551 171823 173544 174446 175084 176025 176883 176868 175868 174329 172475 170371
57367 170371 168409 166969 165855 164677 163588 163018 162895 162777 162591 162708 163357 164447 165795 167149 168142 168649
57351 168649 169043 169798 171029 172622 174495 176426 178020 179207 180446 182050 183704 184990 186040 187215 188496
57336 188496 189607 190506 191322 192072 192702 193161 193244 192800 192223 192200 192687 192793 192093 191363 191509 192385 193337 194317 195681
57317 195681 197328 198789 199916 200792 201296 201388 201583 202440 203737 204751 205153 205180 205104 205151 205700 206980 208627 209987
57299 209987 210733 210900 210649 210363 210560 211256 211819 211956 212326 213553 215159 216298 217086 218225 219583 220237 219922
57282B19922m51J40N78O15O77Q86R69R25J025J194J043M72j45l68r7L31L79p5
57264B28020l36M06J923L008K967K432K413L023L626L831L917M357N235O048O126
57249B76996N426M734M765N247N431N264N404O137P009P571P784P700P451P587
57235C64506Q594J0001J0792J0762J0640J0789J0767J0353J0001R889R523Q802
57223D85419Q516R219J0348J1083J1409J1763J2249J2778J3444J4260J4968J5478
57211F30934J6040J6735J7404J8215J9560K1145K2111K2306K2549K3240K3750
57200H53989K3691K3687K4201K4626K4425K4188K4581K5089K5059K5097K6174
57189A124807K7826K8619K8194K7535K7237K6795K5736K4394K3203K2030K0603
$$ plain form
57282 219922 219471 219611 220189 220804 221481 222367 223336 224261 225286 226480 227523 227995 227850 227482 227385 227716 228095 228020
57264 228020 227684 228090 230013 233021 235988 238420 240833 243856 247482 251313 255230 259587 264822 270870 276996
57249 276996 282422 287156 291921 297168 302599 307863 313267 319404 326413 333984 341768 349468 356919 364506
57235 364506 373100 383101 393893 404655 415295 426084 436851 447204 457205 467094 476617 485419
57223 485419 493935 503154 513502 524585 535994 547757 560006 572784 586228 600488 615456 630934
57211 630934 646974 663709 681113 699328 718888 740033 762144 784450 806999 830239 853989
57200 853989 877680 901367 925568 950194 974619 998807 1023388 1048477 1073536 1098633 1124807
57189 1124807 1152633 1181252 1209446 1236981 1264218 1291013 1316749 1341143 1364346 1386376 1406979
57178A406979J9072J7788J6952J6621J6808J7475J8696K0803K3965K7673L0979
57167A633811L3310L4749L5679L6388L7020L7567L7886L7939L7845L7583L6875
57156B036652L5718L4798L4864L5723L6354L6193L5914L6624L8433M0214M0854
57145B442341M0470M0093M0395M1204M2192M3380M4609M5167M4489M2936M1245
57134B908521L9633L8056L6926L6676L6766L6120L4575L3182L3009L4363L7079
57123C304906M0734M4550M8050N1996N7897O6365P6606Q7553R8695J09778J20717
57112D107847J32120J45183J60833J79631K02482K30697K65342L07429L58733
57103F090297M21624M98264N90894P02559Q36332R94059J176990J387052J625670
$$ plain form
57178 1406979 1426051 1443839 1460791 1477412 1494220 1511695 1530391 1551194 1575159 1602832 1633811
57167 1633811 1667121 1701870 1737549 1773937 1810957 1848524 1886410 1924349 1962194 1999777 2036652
57156 2036652 2072370 2107168 2142032 2177755 2214109 2250302 2286216 2322840 2361273 2401487 2442341
57145 2442341 2482811 2522904 2563299 2604503 2646695 2690075 2734684 2779851 2824340 2867276 2908521
57134 2908521 2948154 2986210 3023136 3059812 3096578 3132698 3167273 3200455 3233464 3267827 3304906
57123 3304906 3345640 3390190 3438240 3490236 3548133 3614498 3691104 3778657 3877352 3987130 4107847
57112 4107847 4239967 4385150 4545983 4725614 4928096 5158793 5424135 5731564 6090297
57103 6090297 6511921 7010185 7601079 8303638 9139970 10134029 11311019 12698071 14323741
57094A4323741J891435K180284K487086K804810L121953L419874L665559L799137
57086C7693879L734938L397925K780794J968977J099879K87777m21391j038012
57078D9504766j588126k083057k510760k841696l044154l103950l035378k874051
57070B8423594k659094k420544k177760j942790j723118j523392j346673j194323
57062A3435900j065142r55584q61181p77720p01909o31968n67640n09125m56132
57053F909499m08135l65013l26899k93729k65398k41994k23390k08881j97689
57044D378371j89616j84721j82500j81648j80553j77948j73276j66660j58477
57035B782972j49073j39001j29239j20537j12667j04824r6696q8389p9366o8448
$$ plain form
57094 14323741 16215176 18395460 20882546 23687356 26809309 30229183 33894742 37693879
57086 37693879 41428817 44826742 47607536 49576513 50676392 50964169 50542778 49504766
57078 49504766 47916640 45833583 43322823 40481127 37436973 34333023 31297645 28423594
57070 28423594 25764500 23343956 21166196 19223406 17500288 15976896 14630223 13435900
57062 13435900 12370758 11415174 10553993 9776273 9074364 8442396 7874756 7365631 6909499
57053 6909499 6501364 6136351 5809452 5515723 5250325 5008331 4784941 4576060 4378371
57044 4378371 4188755 4004034 3821534 3639886 3459333 3281385 3108109 2941449 2782972
57035 2782972 2633899 2494898 2365659 2245122 2132455 2027631 1930935 1842546 1763180 1694732
57025A694732n5241m1047k7965j7784j2090j2628k0485l4712n2015o7979p8861
57014A273925q2968q0978p5051o7437n9668n2566m6457m1330l7174l4116l2015
57003F64165l0137k7715k4786k1985j9627j7546j5751j4530j3833j3122j1978
56992D53155j0404q488o351m505l476k942j938j99J348J762J127n4j825m417p379
56977D05414r773j1193j1961j2342j2105j1065r605q333p325o081m308k465j221
56964B97637m95N87K699N628Q676J1311J3235J4180J3964J2511R634N252Rm884
56950C89944q847j2308j5429j7242j6867j4970j2909j0896q179m853k111n03Q34
56937B65664K859N440P993J0489J3236J6133J8524J9446J7922J3609P349O21n781
$$ plain form
57025 1694732 1639491 1598444 1570479 1552695 1540605 1527977 1507492 1472780 1420765 1352786 1273925
57014 1273925 1190957 1109979 1034928 967491 907823 855257 808800 767470 730296 696180 664165
57003 664165 634028 606313 581527 559542 539915 522369 506618 492088 478255 465133 453155
56992 453155 442751 434263 427912 423407 419931 416989 415051 414852 416200 417962 419089 419035 417210 412793 405414
56977 405414 395641 384448 372487 360145 348040 336975 327370 319037 311712 305631 301323 298858 297637
56964 297637 297142 297729 300428 306056 314732 326043 339278 353458 367422 379933 389567 394819 394828 389944
56950 389944 381097 368789 353360 336118 319251 304281 291372 280476 272297 267444 265333 264830 265664
56937 265664 268523 273963 281956 292445 305681 321814 340338 359784 377706 391315 398664 399285 393504
56924C93504j1918j7532k1508k2985k2359k0731j8754j6527j4217j2247j0907
56913B03819j0117r570q921q005o912n848m986m532m713n373n836n518m585l618
56899A15285k866k190j444m21J271L654N973P555Q816J0635J2946J4830J5913
56886A89957J6676J7286J7083J5457J2489Q511L842q28m530o797p813p679o275
56873B47379l916j401R01L289N967Q748J1649J4922J8380K1558K4758K8884L3802
56860D14920L7803L9262L7938L4191K7858J8775P842l258j3023k0422k4759k5918
56848E31209k4522k1378j7018j1894o497j001M801J0924J7089K3332L0083L7486
56836E72614M5184N2827N9842O4540O4464N8249M6396L0088J0421j0604k9647
$$ plain form
56924 393504 381586 364054 342546 319561 297202 276471 257717 241190 226973 214726 203819
56913 203819 193702 184132 175211 167206 160294 154446 149460 144928 140215 134842 129006 123488 118903 115285
56899 115285 112419 110229 108785 108364 109635 113289 119262 126817 135633 146268 159214 174044 189957
56886 189957 206633 223919 241002 256459 268948 277459 281301 280473 275943 269146 261333 253654 247379
56873 247379 243463 242062 242963 246252 252219 260967 272616 287538 305918 327476 352234 381118 414920
56860 414920 452723 491985 529923 564114 591972 610747 618589 615331 602308 581886 557127 531209
56848 531209 506687 485309 468291 456397 449900 448899 453700 464624 481713 505045 535128 572614
56836 572614 617798 670625 730467 795007 859471 917720 964116 994204 1004625 994021 964374
56825I64374m3831n2423n6092n5366n0809m3912l6434k9067k1630j4244p442j311
56813E51813M613J0695J7127K4120L1390L7596M1040M0865L7089K9815J9140N769
56801H51072q963k3577l6472m5816n0238m9874m6220m0914l4951k8834k3004j7847
56789D44362j3551r882o187j852L057P854J2032J5586J8373J9670J8603J4751
56777E22816Q276Kq583j6099k2237k7265l0632l1197k9171k6534k4730k3122k0649
56764B70875j7910j6241j5532j4414j2339j0139q731q268q416q529p746n900m057
56751A32653l279l123k408j202p91j698k899l229k602j604p29l34o14j293j811
56736A05037j958j882j611j177r92j358j705j151J26J037J086R05J051J229J090
$$ plain form
56825 964374 920543 868120 812028 756662 705853 661941 625507 596440 574810 560566 553124 551813
56813 551813 556426 567121 584248 608368 639758 677354 718394 759259 796348 826163 845303 851072
56801 851072 842109 818532 782060 736244 686006 636132 589912 548998 514047 485213 462209 444362
56789 444362 430811 420929 414742 412890 415947 423801 435833 451419 469792 489462 508065 522816
56777 522816 531092 531094 522511 506412 484175 456910 426278 395081 365910 339376 314646 291524 270875
56764 270875 252965 236724 221192 206778 194439 184300 175569 167301 158885 150356 142610 136710 132653
56751 132653 129374 126251 123843 122641 121850 120152 117253 114024 111422 109818 109089 108755 108141 106848 105037
56736 105037 103079 101197 99586 98409 97417 96059 94354 93203 93329 94366 95452 96357 97408 98637 99727
56721I9727R83J358J978K194J707P00m14j119j012k19O40J011Q37L56r7j46M03
56704A08887J231J775J848J743J671J496J082N45M2l75o73p99q13q69j053j325
56688A14413j568j552j080l17K57M57N83P71O29m8o25l58N45J221J259Q73K46
56671A15706n21q97k53J111J995J664O84J80N82J332J555R16k6l43K38J055J390
56654A26368J315J292J327J111P24N91Q21J150J433J728J939J913J735J544J210
56639A46201P10N13R69J581J613J280J478K302K731K044P75r3l24l61m95n98n31
56622A59795m08m48p01j009j202j241j071m55P13J932K379J805P64j25o94r51
56606A59083r48j079j718k373k066r32l69j030j721j204RP30R49J299J440O50
$$ plain form
56721 99727 100710 102068 104046 106240 107947 108647 108233 107114 106102 105883 106523 107534 108371 108727 108630 108484 108887
56704 108887 110118 111893 113741 115484 117155 118651 119733 120278 120320 119945 119272 118473 117660 116791 115738 114413
56688 114413 112845 111293 110213 109896 110153 110610 111193 111964 112593 112545 111920 111562 112107 113328 114587 115460 115706
56671 115706 115185 114288 114035 115146 117141 118805 119489 119669 120251 121583 123138 124054 124028 123685 123923 124978 126368
56654 126368 127683 128975 130302 131413 132137 132728 133549 134699 136132 137860 139799 141712 143447 144991 146201
56639 146201 146911 147424 148393 149974 151587 152867 154345 156647 159378 161422 162197 162104 161780 161419 160924 160326 159795
56622 159795 159387 158939 158238 157229 156027 154786 153715 153260 153973 155905 158284 160089 160853 160728 160034 159083
56606 159083 158135 157056 155338 152965 150899 149967 149598 148568 146847 145643 145652 146382 147331 148630 150070 150720
56590A50720n48r23n13m71j054j250n31M03Q75J006R34M76j75m28k66k48l96n4
56572A47557R43J981K684L253L643L475K974K926L487M106M777O106P863Q789
56558B04564Q341P444O883O156M704L116K187J626P49j95m09J23N34J64q54j923
56542B43210k534k601k522k653k764k406j763j533j868k212k194k027j866j570
56528B12697j263j392j944k354k364k289k281k131j893j861j831j297n64n41j215
56513A87477j478q67l30o64j339j560j499j620j651j123l19J55K48K43J64LpR8
56495A75931j69q80j295q87j89Pk33l13j15K1l5o6J09M75Q74J068J062J262J871
56476A78498K225J490Jj012j005n62j53L84R49R84N44M36Q38R64O12P27J700K316
$$ plain form
56590 150720 150172 149249 148736 148265 147211 145961 145430 145833 146708 147714 148648 149124 148949 148521 148255 148007 147611 147557
56572 147557 148500 150481 153165 156418 160061 163536 166510 169436 172923 177029 181806 187912 195775 204564
56558 204564 212905 220349 227232 233388 238092 241208 243395 245021 245770 245575 245166 245289 245823 245987 245133 243210
56542 243210 240676 238075 235553 232900 230136 227730 225967 224434 222566 220354 218160 216133 214267 212697
56528 212697 211434 210042 208098 205744 203380 201091 198810 196679 194786 192925 191094 189797 189233 188692 187477
56513 187477 185999 185132 184802 184138 182799 181239 179740 178120 176469 175346 175027 175182 175430 175673 175837 175840 175833 175931
56495 175931 175762 174882 173587 172700 172511 172518 172285 171972 171857 171878 171843 171777 171886 172361 173235 174303 175365 176627 178498
56476 178498 180723 182213 182214 181202 180197 179635 179482 179866 180815 181799 182343 182779 183617 184581 185193 185920 187620 189936
56458A89936J416l81j503j307k92P86J269Q57J59K98J335K002J493N36j1m21j073
56441A95099j353o70L28P69R14J395J884J721J210J144J473J555J232P54J33n56
56425B07032p95l92k8k31n00k87Oo7l9M99Q75N18K13P88J443R15k91n94K13Q91
56405B10169R29J061J587J772J208M90K16K79L69L72J81j92l05J53P31Q58Q20
56388B20698J183J587J173L6p32m95L23R77J055N54K1K84J363K012J213l64j246
56371B29642j037l62M92J665K668K659J762J017R48J141J165J026P37L39K97R79
56355B45138J869K083J608J149R41O59L50N39J294K050K445K654K911L160L135
56340B71985K527J362M43O81J712K132J595J497K669L813L482K387K026K175J672
$$ plain form
56458 189936 191352 190971 189468 188161 187869 188655 189924 190781 190940 191238 192573 194575 196068 196604 196593 196172 195099
56441 195099 193746 193076 193404 194173 195087 196482 198366 200087 201297 202441 203914 205469 206701 207455 207588 207032
56425 207032 206237 205845 205817 205586 205086 204799 204805 204738 204699 205198 206073 206591 206804 207592 209035 209950 209659 209065 209278 210169
56405 210169 211098 212159 213746 215518 216726 217216 217432 217711 218080 218452 218633 218441 218136 218289 219020 219878 220698
56388 220698 221881 223468 224641 224677 223945 223450 223773 224750 225805 226359 226380 226664 228027 230039 231252 230888 229642
56371 229642 228605 228243 228735 230400 233068 235727 237489 238506 239454 240595 241760 242786 243523 243862 244159 245138
56355 245138 247007 249090 250698 251847 252788 253447 253797 254336 255630 257680 260125 262779 265690 268850 271985
56340 271985 274512 275874 276317 276998 278710 280842 282437 283934 286603 290416 293898 296285 298311 300486 302158
56325C02158R12J284K518K739J320k70o93j89M86J000J126P83O19J293K160K007
56309C19253R87M30P42J048R78J167J827K322K459K733L099K975K641L088M133
56294C49882M324L179J943J606J705J735K222L488M641M765M164L675L611L973
56280C94913M819N884O660P232Q213R530J0350J0465J0661J1318J1864J2085J2749
56267E16743J4233J5731J6621J7620J9640K2368K4840K6912K9240L2274L5873
56256G72095L9743M3799M8208N3265N8979O4915P0839P7334Q5086R3721J02104
56245A510088J09632J16413J22294J26670J29222J30016J28800J25003J18381
56236B616519J08929R6448Q0994O3431M4674K4783L864j6739l5520n2549o8624
$$ plain form
56325 302158 303070 304354 306872 309611 310931 310661 309968 309779 310265 311265 312391 313174 313793 315086 317246 319253
56309 319253 320240 320670 321412 322460 323438 324605 326432 328754 331213 333946 337045 340020 342661 345749 349882
56294 349882 354206 357385 359328 360934 362639 364374 366596 370084 374725 379490 383654 387329 390940 394913
56280 394913 399732 405616 412276 419508 427721 437251 447601 458066 468727 480045 491909 503994 516743
56267 516743 530976 546707 563328 580948 600588 622956 647796 674708 703948 736222 772095
56256 772095 811838 855637 903845 957110 1016089 1081004 1151843 1229177 1314263 1407984 1510088
56245 1510088 1619720 1736133 1858427 1985097 2114319 2244335 2373135 2498138 2616519
56236 2616519 2725448 2821896 2902890 2966321 3010995 3035778 3039642 3022903 2987383 2934834 2866210
56225B866210q3049r4042j01269j06204j09851j11841j11977j10931j08980j05580
56215A822486j00682r5138q9449q3460p7496p2369o7941o3129n7753n2888m9043
56204A013138m5370m1232l7123l3602l0534k7827k5697k3857k1603j8950j6622
56193F90721j4759j2955j1458j0880j0778j0014q632p710p398o808n868n383n205
56180E72873m324k974k517k951k741j499o48q06q26j46J85k60k16J015K259K544
56164E58968K638L368M226M654N089N746O008N915O521P998R163R593J0303J1606
56150F51796J2455J2750J4009J6753J9501K1559K4421K9074L4242L8919M4331
56139I19810N1547N9228O5682P1276P6850Q1487Q3809Q4037Q2878P9754P3966
$$ plain form
56225 2866210 2783161 2689119 2587850 2481646 2371795 2259954 2147977 2037046 1928066 1822486
56215 1822486 1721804 1626666 1537217 1453757 1376261 1303892 1235951 1172822 1115069 1062181 1013138
56204 1013138 967768 926536 889413 855811 825277 797450 771753 747896 726293 707343 690721
56193 690721 675962 663007 651549 640669 629891 619877 611245 603535 596137 589329 583461 578078 572873
56180 572873 568549 565575 563058 560107 557366 555867 555219 554413 553587 553441 553626 553366 553150 554165 556424 558968
56164 558968 561606 564974 569200 573854 578943 584689 590697 596612 603133 611131 620294 629887 640190 651796
56150 651796 664251 677001 691010 707763 727264 748823 773244 802318 836560 875479 919810
56139 919810 971357 1030585 1096267 1167543 1244393 1325880 1409689 1493726 1576604 1656358 1730324
56128A730324O6419N8616N1095M4203L8891L5294L1824K7042K1129J4485O637
56117B125959k142r947j5634k0472k5975l1847l7607m4390n3218o2759p0591p5502
56105A675875p7266p5716p1476o6129o0402n3575m5695l8520l3051k8140k2908
56094A102997j8414j5488j3160j0715r181r001q535o648m665l874l262j682m0
56081I98332O77J394K964M362M833N607P407Q550P803O867P667R356J0319J0935
56067A087073J2037J2799J2514J2389J3317J4119J4074J4704J6767J8198J7569
56056A245560J6754J7526J8288J7216J5786J6017J6807J6291J5313J5373J5706
56045A426637J5452J6166J8815K1145K1250K0962K2248K3461K2856K2570K4906
$$ plain form
56128 1730324 1796743 1855359 1906454 1950657 1989548 2024842 2056666 2083708 2104837 2119322 2125959
56117 2125959 2123817 2113870 2098236 2077764 2051789 2019942 1982335 1937945 1884727 1821968 1751377 1675875
56105 1675875 1598609 1522893 1451417 1385288 1324886 1271311 1225616 1187096 1154045 1125905 1102997
56094 1102997 1084583 1069095 1055935 1045220 1036039 1027038 1018503 1011855 1007190 1003316 1000054 998372 998332
56081 998332 999009 1000403 1003367 1007729 1012562 1018169 1025576 1034126 1041929 1048796 1056463 1065819 1076138 1087073
56067 1087073 1099110 1111909 1124423 1136812 1150129 1164248 1178322 1193026 1209793 1227991 1245560
56056 1245560 1262314 1279840 1298128 1315344 1331130 1347147 1363954 1380245 1395558 1410931 1426637
56045 1426637 1442089 1458255 1477070 1498215 1519465 1540427 1562675 1586136 1608992 1631562 1656468
56034A656468K7782K8338K8162L0199L3306L4670L5162L7247L9909M0673M0527
56023B032443M2017M4386M5410M5966M8061N0467N1071N1427N4181N8227O1090
56012B584746O3737O8145P2794P5488P7963Q2612Q7574R0300R2868R8188J04316
56001C498731J08352J12440J19738J27936J33446J38430J46794J56840J65058
55992D707765J73443J85555J99160K10671K22891K40034K59323K76337K94300
55983F769479L18611L46680L73312M01775M38511M81358N24571N71359O29288
55974A0854944O97499P71205Q54674R56472J076419J211585J370545J566702J802715
55965B1162760K077787K404620K801270L272973L823061M476404N270235O227991
$$ plain form
56034 1656468 1684250 1712588 1740750 1770949 1804255 1838925 1874087 1911334 1951243 1991916 2032443
56023 2032443 2074460 2118846 2164256 2210222 2258283 2308750 2359821 2411248 2465429 2523656 2584746
56012 2584746 2648483 2716628 2789422 2864910 2942873 3025485 3113059 3203359 3296227 3394415 3498731
56001 3498731 3607083 3719523 3839261 3967197 4100643 4239073 4385867 4542707 4707765
55992 4707765 4881208 5066763 5265923 5476594 5699485 5939519 6198842 6475179 6769479
55983 6769479 7088090 7434770 7808082 8209857 8648368 9129726 9654297 10225656 10854944
55974 10854944 11552443 12323648 13178322 14134794 15211213 16422798 17793343 19360045 21162760
55965 21162760 23240547 25645167 28446437 31719410 35542471 40018875 45289110 51517101
55957E1517101P365842Q716091J0313816J2165107J4255758J6575934J9091885
55950A40001534K1696380K4215626K6413376K7880509K7931920K5794244K1064928
55943C14998517J4008916N400554l822616j2682479k0125117k5208160k7523441
55936B45046174k7406028k5662897k3106105k0305504j7605569j5192439j3120650
55929A02646982j1362701r882060q653682p635352o766147o000827n320623m711632
55921D2313958m158347l658370l219543k839563k505476k211952j962195j751550
55913B0006962j567207j403992j265219j148200j043270r47105q63631p91746
55905A0976592p24722o61707o07903n63009n20555m78818m41929m10084l78709
$$ plain form
55957 51517101 58882943 67599034 77912850 90077957 104333715 120909649 140001534
55950 140001534 161697914 185913540 212326916 240207425 268139345 293933589 314998517
55943 314998517 329007433 334407987 330585371 317902892 297777775 272569615 245046174
55936 245046174 217640146 191977249 168871144 148565640 130960071 115767632 102646982
55929 102646982 91284281 81402221 72748539 65113187 58347040 52346213 47025590 42313958
55921 42313958 38155611 34497241 31277698 28438135 25932659 23720707 21758512 20006962
55913 20006962 18439755 17035763 15770544 14622344 13579074 12631969 11768338 10976592
55905 10976592 10251870 9590163 8982260 8419251 7898696 7419878 6977949 6567865 6189156
55896F189156l47653l21569l00705k80156k58594k39421k23033k06104j88689
55887C823232j74279j62622j49941j36261j25366j17444j08865r9276r2057q7693
55877B569428q3292p8695p6636p6823p6036p4025p3221p2890o9801o4547o1037
55866A762425n9725n7332n3261n0219m8396m5026m0130l6870l5796l4273l1909
55855A269488l1037l1475l0334k7575k6295k6960k6673k4783k3914k4614k4250
55844I71578k2253k1347k2433k2923k1462j9833j9043j7798j5900j5004j5052
55833G58530j3973j1766j0798j1327j0917r097q335r363r781q500p543q170r016
55820F29944r322j0319j2096j2706j1627j0691j0478r304o825n190n295n308m143
$$ plain form
55896 6189156 5841503 5519934 5219229 4939073 4680479 4441058 4218025 4011921 3823232
55887 3823232 3648953 3486331 3336390 3200129 3074763 2957319 2848454 2749178 2657121 2569428
55877 2569428 2486136 2407441 2330805 2253982 2177946 2103921 2030700 1957810 1888009 1823462 1762425
55866 1762425 1702700 1645368 1592107 1541888 1493492 1448466 1408336 1371466 1335670 1301397 1269488
55855 1269488 1238451 1206976 1176642 1149067 1122772 1095812 1069139 1044356 1020442 995828 971578
55844 971578 949325 927978 905545 882622 861160 841327 822284 804486 788586 773582 758530
55833 758530 744557 732791 721993 710666 699749 690652 682317 672954 663173 654673 647130 638960 629944
55820 629944 620622 610303 598207 585501 573874 563183 552705 543401 536576 531386 526091 520783 516640
55807E16640l068k699j689L12J602J625K133L891N261N291N246N810N747M533
55793E50635L421K718R82j879l681l509l256m258n257n143m932n470n852n708
55779E08811o538r007j1247j1550j0661r966r397q440p310n853l266M9K210K403
55765D20238J750R16r21l869o393p661q565r549r681q797q236q439q164p017o333
55750C29279o556o299n097m484n079n199l880k702k998l622l277k726k898k880
55736B71582j751n91p50j724k358k659k889k567j681j383k090k614k376k633m085
55721B39431n253m815l695l177k739j545l34rJ54J057J961J895J648K468L912
55706B30959M658M457L763K467M99j196j749j642j851k555l606n070o375o268
$$ plain form
55807 516640 513572 510873 509184 509496 511098 512723 514856 518747 524008 529299 534545 540355 546102 550635
55793 550635 554056 556774 557756 555877 552196 548687 545431 541173 535916 530773 525841 520371 514519 508811
55779 508811 502273 493266 482019 470469 459808 449842 440445 432005 424695 418842 415576 415625 417835 420238
55765 420238 421988 422904 421983 418114 411721 404060 395495 385946 376265 367468 359232 350793 342629 335612 329279
55750 329279 322723 316424 311327 306843 301764 296565 292685 289983 286985 283363 280086 277360 274462 271582
55736 271582 269831 269240 268490 266766 264408 261749 258860 256293 254612 253229 251139 248525 246149 243516 239431
55721 239431 234178 229363 225668 222491 219752 218207 217873 217864 218018 219075 221036 222931 224579 227047 230959
55706 230959 235617 240074 243837 246304 246803 245607 243858 242216 240365 237810 234204 229134 222759 216491
55692B16491m662l150k694k296j021K87O35O00R32J067N05K84J347K741L077K620
55676B16763K417K449K184J868J794J343J41r12j121j220j804j944r15J08j70
55661B20981r01m95Q21J693J954K349K755K568K193K362K652K303J795K020K455
55646B47505J932N90n72j484k706l836l958l359l179l691m311m956n944o851o907
55631A98273o248n530m691l367k064j550j516j144n94o28j150j471j568j833j991
55616A62928j685j576k386l319l037j870j367j812j913j062k46l58r86j358j364
55601A38589j236j045q90r22j032j037j104j437j737j635j346j211r66k34O18
55586A23375R41P77N45K01m02p29k25N73O30j15p63p50k50M65J179J437J092Q44
$$ plain form
55692 216491 211829 208679 205985 203689 202668 202955 203590 204190 205122 206189 206694 206978 208325 211066 214143 216763
55676 216763 219180 221629 223813 225681 227475 228818 228959 228047 226926 225706 223902 221958 221043 221151 220981
55661 220981 220080 219585 220406 222099 224053 226402 229157 231725 233918 236280 238932 241235 243030 245050 247505
55646 247505 249437 250027 249455 247971 245265 241429 237471 234112 230933 227242 222931 217975 212031 205180 198273
55631 198273 192025 186495 181804 178437 176373 174823 173307 172163 171569 170941 169791 168320 166752 164919 162928
55616 162928 161243 159667 157281 153962 150925 149055 147688 145876 143963 142901 142655 142297 141311 139953 138589
55601 138589 137353 136308 135418 134496 133464 132427 131323 129886 128149 126514 125168 123957 122991 122757 123375
55586 123375 124316 125093 125638 125839 125437 124708 124483 125056 125686 125571 124808 124058 123808 124273 125452 126889 127981 128825
55568A28825J443K486K929K518J854J267N44l11r24j146j121r46p68r39j385j331
55552A32995l36P99R61J83o50j133j483j696j515j046n83j7Q18J512J505R23L07
55535A31544j42m04j49P87J843K306K147J682R71J65j68J24K79k77r82j157j152
55518A37417j479j627r96k76n73j654k397k533k569k447j701p67n86j077j287
55503A15448j048j081j472j447q79o72j269j840j462k59R66J548J231K64n84o33
55487A06811k6N18O23M34J65k1P4L62L75j0j87L18J136J698J984J974J236j61
55469A17303j173j197j047j496j794j016J22L53j3J85P41N48j77j80M77M37m77
55452A11596q73k36J99l26q24l44M33L84m25j143j264p02M52J607J889J177K89
$$ plain form
55568 128825 130268 132754 135683 138201 140055 141322 141866 141555 140631 139485 138364 137418 136650 135711 134326 132995
55552 132995 132659 133458 134419 134602 133952 132819 131336 129640 128125 127079 126496 126479 127297 128809 130314 131237 131544
55535 131544 131402 130998 130849 131636 133479 135785 137932 139614 140585 140750 140582 140706 140985 140708 139726 138569 137417
55518 137417 135938 134311 133315 133039 132466 130812 128415 125882 123313 120866 119165 118398 117812 116735 115448
55503 115448 114400 113319 111847 110400 109521 108849 107580 105740 104278 104019 104985 106533 107764 108028 107444 106811
55487 106811 106785 107303 107926 108360 108525 108504 108578 108940 109315 109305 109118 109436 110572 112270 114254 116228 117464 117303
55469 117303 116130 114933 113886 112390 110596 109580 109702 110055 110042 110227 110968 111516 111339 111159 111636 112073 111596
55452 111596 110723 110487 110686 110360 109536 109192 109625 110009 109584 108441 107177 106475 106927 108534 110423 111600 111889
55435A11889k02n14q46r03o17m62n99n14J53J009J486J382P03l34j021o36N44
55418A10518J441J485J093P81N50K93R2k8p9J42O13O82j49j254j640j358j181
55401A12001j116n28M17P53L07r9j64n30j334j679j053j89M2l12p29q32l16Q56
55383A05495J915J911J055M38L22r0r49j240m51M86O60M17M25N50M37L24M58M62
55365A12625M0l35j83J83K40Q5J01K84M14M53M01J82p1n3J72J98m2k63m79q59
55345A13093r88k56Q50J016m9j114j186p04m09j92K29M76J77k54l12k09k99k58
55327A09611L73J283J684J266M22k54l71j4K58K1m39o15o29q63r87l84N31O44
55309A11537j02n30p2N15N99N32N41J11q30j320p70P8L66K59J54k13r52j344q43
$$ plain form
55435 111889 111687 111173 110327 109424 108807 108345 107746 107232 107385 108394 109880 111262 111965 111631 110610 109974 110518
55418 110518 111959 113444 114537 115318 115868 116161 116253 116225 116146 116288 116901 117583 117434 116180 114540 113182 112001
55401 112001 110885 110357 110774 111527 111834 111735 111571 111041 109707 108028 106975 106786 106828 106516 105787 104955 104639 105495
55383 105495 107410 109321 110376 110814 111136 111046 110097 108857 108406 108892 109552 109969 110394 110944 111381 111705 112163 112625
55365 112625 112665 112330 112147 112330 112570 112655 112756 113040 113454 113907 114308 114490 114419 114366 114538 114736 114694 114431 113952 113093
55345 113093 112105 111849 112699 113715 113666 112552 111366 110662 110253 110061 110290 110766 110943 110689 110377 110168 109869 109611
55327 109611 109984 111267 112951 114217 114639 114385 114014 114000 114258 114279 113840 113225 112596 111733 110746 110362 110893 111537
55309 111537 111435 110905 110833 111348 111947 112479 113020 113131 112301 110981 110211 110289 110655 110914 111068 110855 109903 108559 107716
55290A07716J2M97O85P85M63l03o79j50N63O69N13O66Q08N28L49P55J049L83p33
55271A14576j237j145j111r77j81P98Q72J12l12P5N12L57q4k82j90MJ52J00j31
55252A11908j97K8Mp16j561j496l77R13J557J381N46n33j122p60N4L34j94q71
55234A08898j037o31Q7Q56J332J179M12m95r39o17K03Q68J026J006J184J195M62
55217A14989n31n92M03J198J059Q16J325J932J545L93l60k92L5J16k6j82j24K49
55199A21953M85j17j328j907j359p57j028j403q08K19M13j14k35J88L20J23M31
55182A15076J251J546J002N19O17O39N8o06p51o05n98n50j54M01P39Q48R13R99
55164A21344J177J533J878J843J390Q17K04o46j602k108j892j333q91n80j80K94
$$ plain form
55290 107716 107728 108225 108910 109695 110158 109855 109176 109026 109589 110258 110771 111437 112245 112773 113122 113877 114926 115309 114576
55271 114576 113339 112194 111083 110106 109925 110723 111595 111707 111395 111470 111982 112339 112255 111973 111783 111787 111939 112039 111908
55252 111908 111711 111739 111743 111027 109466 107970 107593 108506 110063 111444 111990 111457 110335 109575 109629 109963 109769 108898
55234 108898 107861 107230 107317 108173 109505 110684 111096 110601 109662 109045 109248 110116 111142 112148 113332 114527 114989
55217 114989 114458 113866 114269 115467 116526 117342 118667 120599 122144 122537 122177 121885 121920 122036 122010 121828 121704 121953
55199 121953 122438 122321 120993 119086 117727 116970 115942 114539 113731 113950 114363 114249 114014 114202 114522 114645 115076
55182 115076 116327 117873 118875 119394 120011 120650 120708 120102 119351 118746 118148 117598 117444 117845 118584 119432 120345 121344
55164 121344 122521 124054 125932 127775 129165 129982 130186 129540 127938 125830 123938 122605 121714 121134 120954 121248
55148A21248O03N65K87J08K28L16j70j079j442o97M30Q74O37N82R87J193O83k31
55130A25122q99j007n94R2O66P83L58m66j389j851j314k5R17P73L4l57k43m1J65
55111A20724N57Q88P49L57L06O43Q91Q79Q12O94M13K99P48J403J491R83N76N29
55093A33942L93M1N9Q02J722K050J683J044M93R9k38o62j133j350j103o48m60
55076A36734p39j305j742j520l79J062J625R43K4j46J32N5k29j3N88Q09N09K48
55058A36656J64j03m97n40k89l02n90n59q0K48J27r8j64k13k80k37l17q00j226
55039A30900q35J68P89P34O12O26K49m21l83O44J478J137K71N9M81O28J85l37
55021A36985n68o88r72j434j829j787j137k26L71N66P50J020J012O46L80M52N18
$$ plain form
55148 121248 121851 122416 122703 122811 123039 123355 123185 122106 120664 119967 120397 121271 121908 122490 123477 124670 125353 125122
55130 125122 124223 123216 122622 122714 123380 124163 124521 124055 122666 120815 119501 119476 120393 121166 121200 120843 120600 120559 120724
55111 120724 121281 122169 122918 123275 123581 124224 125115 125994 126806 127500 127913 128212 128960 130363 131854 132837 133413 133942
55093 133942 134335 134376 134435 135237 136959 139009 140692 141736 142229 142328 142090 141428 140295 138945 137842 137194 136734
55076 136734 135995 134690 132948 131428 131049 132111 133736 134679 134703 134557 134689 134744 134515 134502 135090 135899 136408 136656
55058 136656 136820 136717 136220 135680 135391 135089 134499 133940 133860 134108 134235 134137 133973 133760 133480 133243 132926 132126 130900
55039 130900 130065 130233 131022 131756 132368 132994 133243 132822 132439 133083 134561 135698 135969 136028 136509 137137 137322 136985
55021 136985 136417 135729 134757 133323 131494 129707 128570 128344 128715 129281 130031 131051 132063 132709 133089 133541 134059
55004A34059L32K15M53Q15R38P98M66l4l61j4Q29J304J075Q83J303J693J144k0
54986A45878o40l97k22q79j848j938p33Q98J712J343N06K5o4k31o23r25q88n75
54968A40399j48J46j1n35o49K26J519K123J844J421J132N00m99r95n31J26J11
54951A46179l37m36p7K28K41J92K87M51N08L42M7k4L64Q79R82O37K20k40j038
54932A49405j871j862p17P98J900K610L215L632L731L627L273K495J753K063L581
54917A77633N063N388M910M600M523M076L191K282J256l77k509m276n054m993
54903A95713m599m179l807l446l067k813k883l122l002k270j300n68j38N8j07
54888A60470n33o07J03J127J594J324R11Q80J179J530J947K744M146N741O569
$$ plain form
55004 134059 134391 134606 135059 135874 136812 137610 138076 138042 137681 137667 138496 139800 140875 141758 143061 144754 145898 145878
54986 145878 145238 144841 144619 143740 141892 139954 139221 140119 141831 143174 143680 143705 143641 143410 142787 141862 140974 140399
54968 140399 140251 140397 140386 139851 139202 139428 140947 143070 144914 146335 147467 147967 147468 146473 145942 146068 146179
54951 146179 145842 145406 145329 145557 145798 145990 146277 146728 147236 147578 147625 147601 147965 148844 149826 150463 150683 150443 149405
54932 149405 147534 145672 144955 145753 147653 150263 153478 157110 160841 164468 167741 170236 171989 174052 177633
54917 177633 182696 188084 192994 197594 202117 206193 209384 211666 212922 212545 210036 205760 200706 195713
54903 195713 191114 186935 183128 179682 176615 173802 170919 167797 164795 162525 161225 160657 160519 160577 160470
54888 160470 159937 159330 159433 160560 162154 163478 164389 165269 166448 167978 169925 172669 176815 182556 189125
54873A89125O033M786M141M504M946M473L092J325n83k484l952m724n103n393
54859B00186n401n006m697m862m980m315l138k421k490k763k790k745k750k432
54845A49396j496l87K6o29j758k259j568l09L80K13N6O38J400J204r7j375j501
54828A41934m90O80J086O41K6j32R2J97J36L77R95J304P31k63p05k99L39M95L2
54809A47176o09q37l96L30O59L87N6K71R34J336Q58m58j803k068q69Q33J580R85
54791A48365l9o20p72p65m49K56Q46Q46N39N05Q33J215J477J533J277R13J014
54774A56974J707K286K133J614J480J827K276K822L762M940N751N839N445N156
54760B04012N540O694P741P282M890J816l52j394k288l726n441o813p431p165
$$ plain form
54873 189125 195158 199944 204085 208589 213535 218008 221100 222425 221842 219358 215406 210682 205579 200186
54859 200186 194785 189779 185082 180220 175240 170925 167787 165366 162876 160113 157323 154578 151828 149396
54845 149396 147900 147513 147539 146910 145152 142893 141325 141016 141396 141609 141665 142303 143703 144907 144810 143435 141934
54828 141934 141444 142124 143210 143851 143877 143745 143837 144034 144170 144547 145542 146846 147577 147314 146609 146310 146649 147144 147176
54809 147176 146567 145730 145334 145664 146323 146710 146766 147037 147971 149307 150165 149707 147904 145836 144967 145800 147380 148365
54791 148365 148326 147706 146934 146169 145720 145976 146822 147668 148207 148712 149545 150760 152237 153770 155047 155960 156974
54774 156974 158681 160967 163100 164714 166194 168021 170297 173119 176881 181821 187572 193411 198856 204012
54760 204012 209552 216246 223987 231269 236159 237975 237623 236229 233941 230215 224774 217961 210530 203365
54746B03365o222n168m476m152l991l908l753l247k435j801j545j216n49J7J38
54731A61057K96J013J936K451K676L025L357L435L686M432M919M322L347L470
54717B03422M737N632N196L972K645J125n85j847k349k695l395m057m195m163
54703B03443m595n388n800n310l967k201o96p4m20j165j666j656j202o09l65p35
54687A67594j303j383q94m25l76o73j223k011k583k260j174l52l81o48l72K35
54671A51771M52J86j23l64p48j092q78j27M24L04q1r0K40L92K29J36K73K96L3
54652A51233m8M84J177J229O45J80J33J1l69l89L52J189J289P70L16J27m2k13
54634A58074l35p04j464j957j449l07M03M35N64J202J721J409M40m23p07n70n15
$$ plain form
54746 203365 197143 191975 187499 183347 179356 175448 171695 168448 166013 164212 162667 161451 160902 160919 161057
54731 161057 161353 162366 164302 166753 169429 172454 175811 179246 182932 187364 192283 196605 199952 203422
54717 203422 208159 213791 218987 222959 225604 226729 226144 224297 221948 219253 215858 211801 207606 203443
54703 203443 198848 193460 187660 182350 178383 176182 175486 175412 174992 173827 172161 170505 169303 168694 168329 167594
54687 167594 166291 164908 164014 163589 163213 162540 161317 159306 156723 154463 153289 152937 152556 151908 151536 151771
54671 151771 152223 152409 152286 151922 151174 150082 149204 149077 149501 149805 149724 149634 149874 150266 150495 150631 150904 151200 151233
54652 151233 151185 151669 152846 154075 154720 154900 155033 155044 154675 154286 154638 155827 157116 157886 158202 158329 158287 158074
54634 158074 157739 157035 155571 153614 152165 151858 152261 152696 153260 154462 156183 157592 158032 157609 156902 156332 155817
54617A55817q56j248r47J50J054Q19j97q86q67o03k65M63J420J807J300M92m6
54600A57407m44q77j016o27j38j17m49n29o8N94Q92N85Rk55o3J26l0k48k28l17
54580A54207r32j568j254O4J396J953J784J181K75o01r62q21o57n81k05M70Q00
54563A54549M67J8O6M79P07M72j10p41j017p58l13j67k41m1N21J038J267J309
54545A57505J195R41Q87J216J335O70m6M62J957K693J836N42Q4J94R0m1L03P06
54527A72529L95m86j129j248j143r38n87k89k32j66J82N31M57Q2j76k82m54p15
54509A66331r53j144j201r72o81q25j289j221l20N15M44p4j03L44N64L89J88j1
54491A59981m20p78o32k26k21n72n58O2P15R14P73N34K32M5L26J036J579J511
$$ plain form
54617 155817 154961 153713 152766 152916 153970 154789 154592 153706 152839 152236 151971 152434 153854 155661 156961 157453 157407
54600 157407 156963 156086 155070 154443 154305 154188 153739 153210 153142 153736 154628 155213 155222 154967 154904 155030 155000 154752 154524 154207
54580 154207 153275 151707 150453 150517 151913 153866 155650 156831 157106 156505 155543 154722 154065 153484 153279 153749 154549
54563 154549 155016 155034 155100 155579 156286 156758 156648 155907 154890 154132 153819 153652 153411 153370 153891 154929 156196 157505
54545 157505 158700 159641 160528 161744 163079 163749 163703 164165 166122 168815 170651 171193 171277 171471 171561 171520 171823 172529
54527 172529 172924 172438 171309 170061 168918 167980 167393 167104 166872 166706 166888 167419 167876 167958 167782 167500 167046 166331
54509 166331 165378 164234 163033 162061 161380 160555 159266 158045 157725 158240 158684 158610 158507 158851 159415 159804 159992 159981
54491 159981 159561 158783 158151 157925 157704 157132 156574 156636 157351 158265 159038 159572 159804 159849 160175 161211 162790 164301
54473A64301J062P80Q39R25O75J18l10k60R6K91J91N6Nj31k84r1M66Q93R17P54
54453A71293L91o40k157k899j932J3J429J758J451Q57Q3m70m20q5PPK23J00r97
54434A68012k230j912Q1J888K031J080L51R3j99n76o68m70k45N7O41J270J422
54417A70626R55K49k05q3O01J357J543J139Q20R85J136P23R2r2k9m17j049q72
54399A77479K25P49l62j883j602O79K752K795J495O64P23O41q8o78l85L98P80
54382A84382M79j37o26p22l57J51L14P9o7J65M50L93Q3k05m47o26m80R8O99Q87
54362A84513P23M60R8l20l57K12Q08O89Km63l71o3K52P48J333J471R51L40K95
54343A91321O75P04j09j409k326k320j586p15j3O03J172J533J646J645J417P26
$$ plain form
54473 164301 165363 166143 166982 167907 168582 168700 168390 168130 168226 168517 168708 168764 168769 168638 168354 168263 168729 169622 170539 171293
54453 171293 171684 171044 168887 165988 164056 164069 165498 167256 168707 169564 169647 169177 168757 168672 168679 168686 168909 169009 168012
54434 168012 165782 163870 163951 165839 167870 168950 169301 169394 169195 168619 167951 167481 167236 167293 167934 169204 170626
54417 170626 171581 171830 171625 171542 172143 173500 175043 176182 177002 177987 179123 179846 179938 179846 179817 179400 178351 177479
54399 177479 177704 178453 178091 176208 174606 175285 178037 180832 182327 182991 183714 184355 184267 183589 183204 183602 184382
54382 184382 184861 184724 184098 183376 183019 183170 183484 183563 183496 183661 184111 184504 184587 184382 183935 183309 182829 182927 183626 184513
54362 184513 185236 185696 185794 185474 185117 185329 186137 186826 186828 186365 185994 185931 186183 186931 188264 189735 190686 191026 191321
54343 191321 191996 192700 192591 191182 188856 186536 184950 184235 184222 184825 185997 187530 189176 190821 192238 192964
54327A92964p3m8J103K421K897K795L101L976M669M787M684M579M117L116K072
54312B37160J539J425J211N82l86j461k430l165l614l723l509l244l371l981m641
54297B08392m888m638l890k553r65kr5n64n84l84o44j067p38K56O93l4j001j061
54279A86233k26O95J259J581J803J833J444M52r47j980j939j074k67K19R71K094
54263A92151K584J645j0r59q73o32q73j199r79k33N91J280J782J826J115rn82
54246A96625k8J028J393P11k13n28k62P6K65K76q4q07j263q62oL21j35o83q28
54227A94996q16r28r26n81j51N6J61L86N92N38K95J05M0O6K40O12J086J448J442
54208A98661Q28k28r29n45N10Q85j00j534k040j405n72k68k34J17P83J161P86
$$ plain form
54327 192964 192891 192843 193946 196367 199264 202059 205160 209136 213805 218592 223276 227855 231972 235088 237160
54312 237160 238699 240124 241335 241917 241531 240070 237640 234475 230861 227138 223629 220385 217014 213033 208392
54297 208392 203504 198866 194976 192423 191458 191456 191361 190797 190213 189829 189185 188118 187380 187636 188329 188295 187294 186233
54279 186233 186007 186702 187961 189542 191345 193178 194622 195074 194127 192147 190208 189134 188867 189086 190057 192151
54263 192151 194735 196380 196370 195411 194538 193906 193033 191834 190855 190622 191213 192493 194275 196101 197216 197207 196625
54246 196625 196597 197625 199018 199729 199516 198988 198726 198802 199067 199343 199259 198452 197189 196327 196321 196642 196507 195824 194996
54227 194996 194180 193252 192326 191745 191594 191650 191811 192197 192789 193327 193622 193727 193767 193833 194073 194685 195771 197219 198661
54208 198661 199489 199261 198332 197787 198297 199182 199082 197548 195508 194103 193531 193263 193029 193146 193929 195090 195876
54191A95876j12q51j069j077j247j314o49P12J832J881J040J41k75k73j05Q2J71
54174A94763Q2n5N7M98R12Q40L13nM54J400J886J406M23l75q81j282j360p93L4
54155A98317K67k72q36q49o28o93r24q14k96J65J34m46j323k081k310j875j016
54138A84520j00O44J103J139P03mn60n97o5P17J347J702J910J990J754J220P82
54121A98205P08P52N26L4n07r87j202o86O38J949K319J854J380J156P25l0n46
54104B06288m83k32k09k94k36n2J71L84L86Mm01k43L39N53J48j97L5M46M71J82
54084B07060l3n8R2M36P14N05J3L6P61J333J169Q79J198J714J544P77K36K38M02
54065B19016N56Q39J085Q92L38o4j09q2j32r6J54N88J219J975K451K342J954J872
$$ plain form
54191 195876 195764 194913 193844 192767 191520 190206 189557 190269 192101 193982 195022 195163 194888 194615 194510 194592 194763
54174 194763 194845 194790 194847 195345 196257 197097 197410 197405 197859 199259 201145 202551 202974 202599 201718 200436 199076 198283 198317
54155 198317 198584 198312 197476 196627 195999 195306 194382 193568 193272 193437 193571 193125 191802 189721 187411 185536 184520
54138 184520 184420 185064 186167 187306 188009 188005 187445 186848 186783 187500 188847 190549 192459 194449 196203 197423 198205
54121 198205 198913 199665 200191 200225 199718 198731 197529 196843 197481 199430 201749 203603 204983 206139 206864 206834 206288
54104 206288 205805 205573 205364 205070 204834 204782 204953 205337 205723 205727 205326 205083 205422 205975 206123 205926 205961 206407 206878 207060
54084 207060 207027 206969 207061 207497 208211 208716 208729 208765 209526 210859 212028 212907 214105 215819 217363 218140 218376 218614 219016
54065 219016 219572 220411 221496 222388 222726 222662 222553 222471 222339 222243 222397 222985 224204 226179 228630 230972 232926 234798
54047B34798K196K602K969L384L636L410K968L044L983N436O920Q154Q846Q753
54033C01099Q092P468P203P134P087P091P026O529N496M275L295K742K668K898
54019C80103K856J956M17q30j228j274j771k848l994m758m998m643l706k517j616
54004C51149j271j269j125n27M82J639K791M083N772P873J0124J2250J4080J5268
53990D21319J5143J3035Q847L235k757q222j2637j5698j7201j7207j6238j4979
53978C56640j3678j2091j0185q533p684p362o749n562m363l777l756l786l489
53965B65625k790j816r18n47p41q98m19M52Q65M61j63k64J92P82J350K009K601
53948B65781K717K344J980J984K203K478L003L866M664M977M973N029N041M630
$$ plain form
54047 234798 236994 239596 242565 245949 249585 252995 255963 259007 262990 268426 275346 283500 292346 301099
54033 301099 309191 316659 323862 330996 338083 345174 352200 358729 364225 368500 371795 374537 377205 380103
54019 380103 382959 384915 385332 384502 383274 382000 380229 377381 373387 368629 363631 358988 355282 352765 351149
54004 351149 349878 348609 347484 346957 347439 349078 351869 355952 361724 369597 379721 391971 406051 421319
53990 421319 436462 449497 458344 461579 458822 450600 437963 422265 405064 387857 371619 356640
53978 356640 342962 330871 320686 312153 304469 297107 290358 284796 280433 276656 272900 269114 265625
53965 265625 262835 261019 260101 259554 258813 257915 257496 257948 258813 259274 259111 258847 259039 259821 261171 263180 265781
53948 265781 268498 270842 272822 274806 277009 279487 282490 286356 291020 295997 300970 305999 311040 315670
53934C15670L946L622L920M371M381L921L444L484M234N369O245O503O358O127
53920C81595N830N572N860O920Q055Q447Q340Q527Q856Q412P225O581P138P827
53906D85185P334N804M263L051J705M7j540k696l407l803m133m710n528o161o387
53891D69024o536o935p461p994q824j0051j1033j1041j0151q980p859o781n840
53878C59538n138m563m131m183m717m936m182k927k184k178k329k322k434k848
53864C10466l342l684l805l674l413l358l535l358k447j406j053j218j074m81
53850B74618r1j52j74Q6J46l33r01q49p1Q62J197O40k66n23K24J225J674J882
53832B79194K757M489O445Q166R649J0871J1926J3482J6135J9359K1978K3616
$$ plain form
53934 315670 319616 323238 327158 331529 335910 339831 343275 346759 350993 356362 362607 369110 375468 381595
53920 381595 387425 392997 398857 405777 413832 422279 430619 439146 448002 456414 463639 470220 477358 485185
53906 485185 492519 498323 502586 505637 507342 507389 505849 503153 499746 495943 491810 487100 481572 475411 469024
53891 469024 462488 455553 448092 440098 431274 421223 410190 399149 388998 380018 372159 365378 359538
53878 359538 354400 349837 345706 341523 336806 331870 327688 324761 322577 320399 318070 315748 313314 310466
53864 310466 307124 303440 299635 295961 292548 289190 285655 282297 279850 278444 277391 276173 275099 274618
53850 274618 274527 274375 274201 274287 274433 274100 273199 272350 272279 273141 274338 274978 274712 274189 274413 275638 277312 279194
53832 279194 281951 286440 292885 301051 310700 321571 333497 346979 363114 382473 404451 428067
53820D28067K4680K4853K2858J8011J1070L258m562j1447j6255j8625j9315j9016
53808D43577j7578j4804j1224p536m007r10J231K441L578N152O571P180P370P882
53794D28923Q561Q599P629N935L989K300J218K99j477m209o465p007o465o393
53780D35437p146p863q128q381q763q776q255p713p462p311p278p719q424q465
53766C23753p376n845m777m199l589k765k006j579j562j936k482k788k620k198
53752B78031j939k031k331k494k201j505r60j027j344j001K53J519J778J048J99
53737B65995j19J19P24J539K243K394J879J071L61j99o62q14l77M63J100J178
53721B76895R87J007J241J239P58J00k50j00M03J020J527J797J896K061K384K651
$$ plain form
53820 428067 452747 477600 500458 518469 529539 532797 528235 516788 500533 481908 462593 443577
53808 443577 425999 411195 399971 392435 388428 387518 388749 391190 394768 399920 406491 413671 421041 428923
53794 428923 437484 446083 453712 459647 463636 465936 467154 467453 465976 461767 455302 448295 441830 435437
53780 435437 428291 420428 412300 403919 395156 386380 378125 370412 362950 355639 348361 340642 332218 323753
53766 323753 316377 310532 305755 301556 297967 295202 293196 291617 290055 288119 285637 282849 280229 278031
53752 278031 276092 274061 271730 269236 267035 265530 264570 263543 262199 261198 261451 262970 264748 265796 265995
53737 265995 265876 265995 266719 268258 270501 272895 274774 275845 276206 276007 275345 274531 274154 274617 275717 276895
53721 276895 277882 278889 280130 281369 282127 282227 281977 281877 282280 283300 284827 286624 288520 290581 292965 295616
53705B95616K662K551K519K426J925J147P92J348K396L032K855K289J925J867
53691C25350J885J919K099K302K078J172o8j024j438j544j637j725j703j600j603
53676C24463j818k085k076j559o47K66P91Q05N11K70L68O85P40K66l20l79M9K70
53658C20600K1j53R6J59o04j650j798q66J55M91L87L33L23K10J76L73N86N68M48
53639C19855M70P26J294K199L038L120K382J580J304J284J135J148J732K498K712
53624C46477K385K163K303K444K414K446K594K590K486K775L528M038L744L126
53610C85513L152L968M680M464L513K726K634K937L038K714K138J497R56Q31J290
53595D26051J837J608M73o84j118j163j478j865j581o74q5l30q39r10o92q11j507
$$ plain form
53705 295616 298278 300829 303348 305774 307699 308846 309638 310986 313382 316414 319269 321558 323483 325350
53691 325350 327235 329154 331253 333555 335633 336805 336737 335713 334275 332731 331094 329369 327666 326066 324463
53676 324463 322645 320560 318484 316925 316278 316544 317335 318140 318651 318921 319289 319974 320714 320980 320660 320281 320330 320600
53658 320600 320621 320468 320564 320723 320119 318469 316671 315805 315960 316451 316838 317171 317494 317704 317880 318253 318839 319407 319855
53639 319855 320325 321051 322345 324544 327582 330702 333084 334664 335968 337252 338387 339535 341267 343765 346477
53624 346477 348862 351025 353328 355772 358186 360632 363226 365816 368302 371077 374605 378643 382387 385513
53610 385513 388665 392633 397313 401777 405290 408016 410650 413587 416625 419339 421477 422974 423930 424761 426051
53595 426051 427888 429496 429969 429285 428167 427004 425526 423661 422080 421406 421321 420991 420152 419242 418550 417739 416232
53578D16232k468l228l376k753j788j322j627j934j341j0J060J251Q07J68m90
53563C99181r86r98n69k51l98o42m03K88R27J249J385J446J396J363J582K013
53547D06583K403K795L523M531N215N265N232N829O973Q022Q761R611J0826J2006
53533D97575J2536J2249J1484J0657R899R020P905O943O774P405P959P783P519
53520F15708Q379J0422J2369J3282J3667J4519J5989J7582J9098K0648K1942K2463
53508H06068K2368K2525K3371K4248K4206K3155K1880K1098K0873K0878K0830
53497A051500K0559J9942J9047J8268J8000J8138J8153J7729J7169J7014J7365
53486A252884J7830J7972J7673J7083J6475J6037J5697J5165J4343J3487J2735
$$ plain form
53578 416232 413764 410536 407160 404407 402619 401297 399670 397736 396395 396385 397445 398696 399503 399671 399181
53563 399181 398195 397197 396628 396377 395979 395337 394934 395222 396149 397398 398783 400229 401625 402988 404570 406583
53547 406583 408986 411781 415304 419835 425050 430315 435547 441376 448349 456371 465132 474743 485569 497575
53533 497575 510111 522360 533844 544501 554400 563420 571325 578268 585042 592447 600406 608189 615708
53520 615708 624087 634509 646878 660160 673827 688346 704335 721917 741015 761663 783605 806068
53508 806068 828436 850961 874332 898580 922786 945941 967821 988919 1009792 1030670 1051500
53497 1051500 1072059 1092001 1111048 1129316 1147316 1165454 1183607 1201336 1218505 1235519 1252884
53486 1252884 1270714 1288686 1306359 1323442 1339917 1355954 1371651 1386816 1401159 1414646 1427381
53475A427381J1707R916P521N191L200J149j300l845n981p689r357j1127j2634
53462A414132j3416j3468j3375j3820j4901j6042j6726j7077j7508j8075j8589
53451A241135j9172k0037k0809k0738j9729j8529j7665j6817j5574j4178j3028
53440A044859j1925j0396q519o874n867n480n461n394m673k928m65J989L889N092
53426I87847N692O004O530P657R315J1123J2748J4051J5094J6158J7545J9136
53414A128900K0478K1447K2561K4358K6763K9312L1716L3833L5492L6709L7860
53403A449429L9268M0880M2598M4545M6593M8111M8776M9281N0528N2296N3547
53392A965852N3850N3797N3893N3946N3621N2918N1658M9327M5961M2707M0755
$$ plain form
53475 1427381 1439088 1449004 1456525 1461716 1464916 1466065 1464765 1460920 1454939 1447250 1437893 1426766 1414132
53462 1414132 1400716 1387248 1373873 1360053 1345152 1329110 1312384 1295307 1277799 1259724 1241135
53451 1241135 1221963 1201926 1181117 1160379 1140650 1122121 1104456 1087639 1072065 1057887 1044859
53440 1044859 1032934 1022538 1014019 1007145 1001278 995798 990337 984943 980270 977342 976877 978866 982755 987847
53426 987847 993539 999543 1006073 1013730 1023045 1034168 1046916 1060967 1076061 1092219 1109764 1128900
53414 1128900 1149378 1170825 1193386 1217744 1244507 1273819 1305535 1339368 1374860 1411569 1449429
53403 1449429 1488697 1529577 1572175 1616720 1663313 1711424 1760200 1809481 1860009 1912305 1965852
53392 1965852 2019702 2073499 2127392 2181338 2234959 2287877 2339535 2388862 2434823 2477530 2518285
53381B518285L9879L8607L5848L1836K7455K3234J9174J5228J1389P380K721k705
53369B768331q381j3722j8711k3777k9160l4639l9758m3964m6712m7900m8214
53358B413393m8534m9027m9159m8690m7971m7268m6386m5243m4113m3088m1908
53347A902006m0794m0635m1704m2888m2917m1835m0435l8833l6607l4093l2276
53336A468989l1312l0212k8238k5836k3878k2593k1619k0569j9254j7741j6388
53325A211349j5516j4937j4224j3413j2944j2851j2526j1483r926q295o732n216
53313A073286l897k916k089r97O69K820M949O488P418Q331R670J1170J2459J3837
53299A141198J5862J8284K0187K1172K1751K2506K3531K4728K5967K6736K6369
$$ plain form
53381 2518285 2558164 2596771 2632619 2664455 2691910 2715144 2734318 2749546 2760935 2768315 2771036 2768331
53369 2768331 2759950 2746228 2727517 2703740 2674580 2639941 2600183 2556219 2509507 2461607 2413393
53358 2413393 2364859 2315832 2266673 2217983 2170012 2122744 2076358 2031115 1987002 1943914 1902006
53347 1902006 1861212 1820577 1778873 1735985 1693068 1651233 1610798 1571965 1535358 1501265 1468989
53336 1468989 1437677 1407465 1379227 1353391 1329513 1306920 1285301 1264732 1245478 1227737 1211349
53325 1211349 1195833 1180896 1166672 1153259 1140315 1127464 1114938 1103455 1093529 1085234 1078502 1073286
53313 1073286 1069389 1066473 1064384 1063387 1064056 1066876 1071825 1078313 1085731 1094062 1103732 1114902 1127361 1141198
53299 1141198 1157060 1175344 1195531 1216703 1238454 1260960 1284491 1309219 1335186 1361922 1388291
53288A388291K4951K3440K2575K2097K1328K0014J8334J6504J4643J2674J0206
53277A595057O989L542P20j417l641o266q690j0551j2435j4836j7182j8680j9493
53264A493117k0292k1123k1619k1995k2897k4375k5743k6469k6599k6389k6079
53253A229537k5922k5925k5684k5008k4496k4823k5666k6068k5781k5412k5271
53242I49481k4922k4130k3404k3169k3017k2301k1016j9575j8081j6314j4313
53231G19239j2524j1333j0775j0605j0553j0525j0613j0907j1287j1584j1853
53220E96680j2216j2503j2408j2072j1976j2155j2018j1207j0162r422q810p860
53208D63871o728o035n937o001n941n901n912n669n093m586m510m766n098n418
$$ plain form
53288 1388291 1413242 1436682 1459257 1481354 1502682 1522696 1541030 1557534 1572177 1584851 1595057
53277 1595057 1602046 1605588 1606308 1604891 1601250 1594984 1586294 1575743 1563308 1548472 1531290 1512610 1493117
53264 1493117 1472825 1451702 1430083 1408088 1385191 1360816 1335073 1308604 1282005 1255616 1229537
53253 1229537 1203615 1177690 1152006 1126998 1102502 1077679 1052013 1025945 1000164 974752 949481
53242 949481 924559 900429 877025 853856 830839 808538 787522 767947 749866 733552 719239
53231 719239 706715 695382 684607 674002 663449 652924 642311 631404 620117 608533 596680
53220 596680 584464 571961 559553 547481 535505 523350 511332 500125 489963 480541 471731 463871
53208 463871 457143 451108 445171 439170 433229 427328 421416 415747 410654 406068 401558 396792 391694 386276
53194C86276n562n169m209l231k746k620k509k542l027l718l951l531k900k445
53180C38116k103j714j336j067r15r51j186j373j244r84r53j040q21l64j91k78
53164C21596M2Q65J311Q01K3j38Q2m8l93k21M21P48N95O70J232J520R21k4l83
53145C29620r3J09k49q25r99o77m29q48j764k276j772o49K00M03K13j28n60q47
53127C18429o92k90j81l89l18K94Q38N86l45j091r39P4J187J466O02p57j635j732
53109C15107j472j218r19n72m32n44n69l78l24o44r30o09K62R82R12Pj138j754
53091C05767j572j116j042j284j280r94r79j312j256l63P10J084Q53P38Q92P53
53075B99599J9q48j148o47K83R36Q63K83j47j37l0j22j38J83M70K42k50l57p0
$$ plain form
53194 386276 380714 375545 371336 368105 365359 362739 360230 357688 354661 350943 346992 343461 340561 338116
53180 338116 336013 334299 332963 331896 330981 330030 328844 327471 326227 325243 324290 323250 322429 322065 321874 321596
53164 321596 321638 322503 323814 324615 324638 324500 324582 324534 324141 323920 324341 325089 325684 326354 327586 329106 330027 330003 329620
53145 329620 329527 329636 329387 328562 327563 326886 326457 325609 323845 321569 319797 319148 319348 319751 319964 319836 319276 318429
53127 318429 317737 317447 317266 316877 316559 316853 317691 318277 317932 316841 315902 315976 317163 318629 319231 318474 316839 315107
53109 315107 313635 312417 311498 310926 310494 309950 309381 309003 308679 308035 307105 306496 306758 307740 308652 308659 307521 305767
53091 305767 304195 303079 302037 300753 299473 298479 297500 296188 294932 294569 295279 296363 297216 297954 298846 299599
53075 299599 299618 298770 297622 296975 297258 298194 299057 299340 299193 299056 299026 298904 298766 298949 299419 299661 299411 299054 298984
53056B98984J7j49J55J296K496K761K207J863K228K693K509J947J913K587L018
53041C26525K261N71r40j595j667j748k057k470k738k569j902j188j028j367j481
53026C06607j036o42j002j880k373k014j138l20J44K38J39J57M73R08J106R19
53010C00286M64q0m71l93K61J041J226N72l92r07p39l11j77m49p88q22n10m3M32
52991B98200Q27J015R28O83M45K48J53M13J121J820J904J434J096J314J790K032
52975C15423J904J524J039O59N29N12L81K77M97Q56Q41N77Q49J851K638K340J329
52958C34026N66L19K16J84M65Q31O37k70j293j864k086k429l095l847m245l956
52942C14159k990j697n17K48M66K15j62l37m32q67j671k308k342j914j396r34
$$ plain form
53056 298984 299001 298852 299007 300303 302799 305560 307767 309630 311858 314551 317060 319007 320920 323507 326525
53041 326525 328786 329357 328417 326822 325155 323407 321350 318880 316142 313573 311671 310483 309455 308088 306607
53026 306607 305571 304929 303927 302047 299674 297660 296522 296202 296346 296584 296723 296880 297353 298261 299367 300286
53010 300286 300750 300670 300199 299806 300067 301108 302334 302906 302514 301607 300868 300557 300380 299931 299143 298321 297811 297768 298200
52991 298200 299027 300042 300970 301653 302098 302346 302499 302912 304033 305853 307757 309191 310287 311601 313391 315423
52975 315423 317327 318851 319890 320549 321078 321590 321971 322248 322745 323601 324442 325019 325868 327719 330357 332697 334026
52958 334026 334592 334911 335127 335311 335776 336607 337244 336974 335681 333817 331731 329302 326207 322360 318115 314159
52942 314159 311169 309472 308955 309203 309669 309884 309722 309385 308953 308086 306415 304107 301765 299851 298455 297521
52926B97521o38o91r44q14o0P02P76L99L64Q49J189Q31K1o10p54n80l63j39J99
52907B97258N15L80l03q93o99oK67q6k62K71J024J383J431J412J130N82L90Q21
52889C04615J063L85n50n79J36L15n58j643k038j778j384j151j093j019o10J32
52873B94243O24L92k10n57o33o72l06Q77K155K340J596J383K206K753J867L34
52857C08392j69P87K163K891K747J982Q71l36j390k143k572k790l004l241l174
52842C01014k532j715j522k128k776k673j857r72n39n77p10n06P1M83K27l87m88
52825B82413K55J207J533J027O0q81j469j617j453j011o7J329K395K269J197L92
52809B87579N37J140J572K036K967L977M153L226J920J128J071J220P96n62k458
$$ plain form
52926 297521 296883 296192 295248 294434 294374 295076 295852 296251 296615 297464 298653 299484 299505 298895 298141 297561 297198 297059 297258
52907 297258 297773 298153 297850 296957 296258 296252 296519 296433 296171 296442 297466 298849 300280 301692 302822 303404 303794 304615
52889 304615 305678 306063 305513 304934 305070 305385 304827 303184 301146 299368 297984 296833 295740 294721 294111 294243
52873 294243 294867 295259 295049 294492 293859 293187 292881 293758 295913 298253 299849 301232 303438 306191 308058 308392
52857 308392 308223 309010 311173 314064 316811 318793 319664 319328 317938 315795 313223 310433 307429 304188 301014
52842 301014 298482 296767 295245 293117 290341 287668 285811 284839 284300 283723 283013 282507 282578 283061 283288 282901 282413
52825 282413 282668 283875 285408 286435 286495 285614 284145 282528 281075 280064 279997 281326 283721 285990 287187 287579
52809 287579 288116 289256 290828 292864 295831 299808 303961 307187 309107 310235 311306 312526 313322 312760 310302
52794C10302m078m902n024m750m191l363k449j693j124n95o3K57J70j36j21M76
52778B78716J156J147M56k8L45J196J751J795J509R14K9p36j012j036j129j016
52762B84057l54L51L28j65j47N20R43P16N31R01J265R26J19m14m38j59K51O41
52744B89872P38M91K86L99N50K99l34r02r83m40N00J329J639J452R99L75k08j38
52726B95924R56K419L153K899K240J455L71p21j111r06j039j700j879j074l57
52711C00630p89j675j469Q2J690K145J427L85j16J99Q28J057Q66Q29J020P41k48
52694C07602r72m34J026K236K663K650K585K494K261J799J155P11R17J529J633
52679C29855P99k78p64o75m35r2L31L39m14j451k111k407k595k414j597o83l83
$$ plain form
52794 310302 306224 301322 296298 291548 287357 283994 281545 279852 278728 278133 278070 278327 278497 278361 278240 278716
52778 278716 279872 281019 281475 281447 281792 282988 284739 286534 288043 288957 288986 288250 287238 286202 285073 284057
52762 284057 283703 284054 284382 284217 284070 284590 285533 286249 286780 287681 288946 289872 289991 289577 289139 288980 289231 289872
52744 289872 290610 291101 291387 291786 292336 292635 292301 291399 290416 289976 290476 291805 293444 294896 295895 296270 296062 295924
52726 295924 296880 299299 302452 305351 307591 309046 309417 308696 307585 306679 305640 303940 302061 300987 300630
52711 300630 299841 298166 296697 296779 298469 300614 302041 302426 302310 302509 303337 304394 305260 306089 307109 307850 307602
52694 307602 306630 306196 307222 309458 312121 314771 317356 319850 322111 323910 325065 325776 326693 328222 329855
52679 329855 330654 330376 329612 328937 328502 328410 328741 329080 328666 327215 325104 322697 320102 317688 316091 315408 315025
52662C15025m58j51M82O07j01j002j330q94M9J022J531J507J404J474J302O29
52646C21096L2%j13j184k726l362k769j979j650j239k25Q84J318J076O64M32N67
52629C10822J249K376L448M023M029L517K574J603J167J258J150K76r98j798j748
52614C32948j267j013j202j464j274m91M80J082J021L77m41q22m30L00N37O5m56
52597C27950m40o4K87O31R99J038O29L20M94O31K45m4O61J975K659K422K137K253
52579C44783K150J374N02K55M92N34M4q28j723k234k090j437p38l88n38j123j721
52562C37314j704r53k26k77r19j433j559j427r76k36J98j04m93j11P04R79Q18
52545C29595J130J763J523L02m58L2P04M03m11p09m99m02m39l58m00p50q49k21
$$ plain form
52662 315025 314567 314416 314898 315505 315404 314402 313072 312178 312227 313249 314780 316287 317691 319165 320467 321096
52646 321096 321128 321128 321015 319831 317105 313743 310974 308995 307345 306106 305881 306765 308083 309159 309823 310255 310822
52629 310822 312071 314447 317895 321918 325947 329464 332038 333641 334808 336066 337216 337492 336494 334696 332948
52614 332948 331681 330668 329466 328002 326728 326237 326717 327799 328820 329197 328756 327934 327504 327804 328341 328406 327950
52597 327950 327510 327446 327733 328364 329363 330401 331030 331350 331844 332475 332720 332676 333337 335312 337971 340393 342530 344783
52579 344783 346933 348307 348809 349064 349556 350090 350134 349306 347583 345349 343259 341822 341084 340696 340158 339035 337314
52562 337314 335610 334657 334431 334154 333235 331802 330243 328816 327840 327604 327802 327698 327205 327094 327798 328777 329595
52545 329595 330725 332488 334011 334313 333855 333887 334591 334994 334583 333874 333375 332973 332534 332176 331776 331026 330177 329956
52527C29956N24N27P0J66J023J859K036J558O65l37q78n71K49J002J706K731L860
52510C46146M358L986L279K736K265J564O44j71n02k88q5p87k621m596n395m754
52494C45779l518k516j833j212o29k50j51k77n00o96q07p98n25J67J075J649J661
52477C36619J566J876K390K405J583L04p15q93j2J583L080L786L705L344L083
52462C63704K979L006L093K945K269J166N9q43j693k578l272l528l459l345l230
52447C57273k914k328j699j262r59o46n32j034k082k918k873k097j220n11O3L05
52431C34566p8q04j126p56j04M95J068J406J027R4l31L95J543K003J722J433J418
52414C43971J331J145J348K172L282M327N333O439P687R155J0843J2306J2836
$$ plain form
52527 329956 330480 331007 331077 331243 332266 334125 336161 337719 338384 338047 337169 336598 336847 337849 339555 342286 346146
52510 346146 350504 354490 357769 360505 362770 364334 364978 364807 364305 364017 363932 363145 360524 355928 350533 345779
52494 345779 342261 339745 337912 336700 336071 335821 335670 335393 334893 334197 333390 332592 332067 332234 333309 334958 336619
52477 336619 338185 340061 342451 344856 346439 346743 346028 345135 345123 346706 349786 353572 357277 360621 363704
52462 363704 366683 369689 372782 375727 377996 379162 379221 378378 376685 374107 370835 367307 363848 360503 357273
52447 357273 354359 352031 350332 349070 348111 347465 346933 345899 343817 340899 338026 335929 334709 334198 334261 334566
52431 334566 334488 333684 332558 331802 331698 332193 333261 334667 335694 335788 335457 335852 337395 339398 341120 342553 343971
52414 343971 345302 346447 347795 349967 353249 357576 362909 369348 377035 386190 397033 409339 422175
52401D22175J2121J0505Q439N968K943m88l784o424q304r687j0661j0789r577
52388D02437p267m831l036j910j259j148j460j556r57m0N72J036J931L102L749
52373C89363L713L853M747N779N947N117M013L215K717K188J363J73j124k033
52359D29031k235j913j496j198r70p86p33p74o68j91O08J417J881J927J859K124
52343D27883K773L283L114K460K216K949M214N141N602O333P808R483J0432J0478
52329E04169J0338J0794J2106J3999J5835J6876J6891J6547J6726J7411J7679
52318F69371J6978J5846J5154J5065J5158J5220J5364J5556J5540J5253J4961
52307H39466J4885J4904J4758J4401J4025J3806J3648J3329J2814J2261J1557
$$ plain form
52401 422175 434296 444801 453240 459208 462151 461663 457879 451455 443151 433464 422803 412014 402437
52388 402437 395170 390339 387303 385393 384134 382986 381526 379970 379013 378973 379545 380581 382512 385614 389363
52373 389363 393076 396929 401676 407455 413402 418519 422532 425747 428464 430652 432015 432188 431064 429031
52359 429031 426796 424883 423387 422189 421219 420433 419700 418926 418258 418067 418675 420092 421973 423900 425759 427883
52343 427883 430656 433939 437053 439513 441729 444678 448892 454033 459635 465968 473776 483259 493691 504169
52329 504169 514507 525301 537407 551406 567241 584117 601008 617555 634281 651692 669371
52318 669371 686349 702195 717349 732414 747572 762792 778156 793712 809252 824505 839466
52307 839466 854351 869255 884013 898414 912439 926245 939893 953222 966036 978297 989854
52296I89854J0162P753M917K699J354M1k054m687o863p865p743p051o322n688
52282I68507m864l660k446j780j553j035J28J461K489L451M798O367P583Q235
52268I87681Q648R271J0367J1885J3311J3961J3707J3197J3048J3196J3279J3309
52256A134860J3476J3659J3575J3183J2527J1479J0057Q666P612O640N440M212
52244A255386L215K154O74q49j751k094k422k702k393j554j019j247j783k044
52230A241571j972j670j006L1J090J790J996J648R00M07Q96K187L293L736M090
52215A258987M892N740O025N991O283O874P183P119P259P877Q512Q737Q794R109
52201A359382R450R177Q219P317P093P251P099O574O231O275O237N835N526N769
$$ plain form
52296 989854 1000016 1007769 1012686 1015385 1016739 1016780 1014726 1010039 1003176 995311 987568 980517 974195 968507
52282 968507 963643 959983 957537 955757 954204 953169 953297 954758 957247 960698 965496 971863 979446 987681
52268 987681 996329 1005600 1015967 1027852 1041163 1055124 1068831 1082028 1095076 1108272 1121551 1134860
52256 1134860 1148336 1161995 1175570 1188753 1201280 1212759 1222816 1231482 1239094 1245734 1251174 1255386
52244 1255386 1258601 1260755 1261429 1260580 1258829 1256735 1254313 1251611 1249218 1247664 1246645 1245398 1243615 1241571
52230 1241571 1239599 1237929 1236923 1236954 1238044 1239834 1241830 1243478 1244378 1244785 1245681 1247868 1251161 1254897 1258987
52215 1258987 1263879 1269619 1275644 1281635 1287918 1294792 1301975 1309094 1316353 1324230 1332742 1341479 1350273 1359382
52201 1359382 1368832 1378009 1386228 1393545 1400638 1407889 1414988 1421562 1427793 1434068 1440305 1446140 1451666 1457435
52187A457435O175N959M936L524K019M41j084k435l862n643p420q583r222r947
52173A432293j0770j0972j0316r498r048q529p280n424l577k036p45L88J555L053
52159A359094M741N855N813M876L577J973M2j647k391k344k329k713l087l093
52145A368367k868k550j892p23N63J260R95m8j388k626l649m464m847m324k679
52130A339127l59J865L577M906O249Q055J0621J3796J6905J9346K1152K2712K4110
52117A492062K5105K5627K5844K5774K5260K4335K3132K1521J9349J7020J5187
52106A740216J3794J2158J0210Q853Q600Q680Q249P794Q294R368R491Q099O369
52093A860175N482N090M015J816r96l795o236q221r961j1826j3568j4067j2509
$$ plain form
52187 1457435 1463610 1469569 1474505 1478029 1480048 1480489 1479405 1476970 1473108 1467465 1460045 1451462 1442240 1432293
52173 1432293 1421523 1410551 1400235 1390737 1381689 1373160 1365880 1360456 1356879 1354843 1354098 1354486 1356041 1359094
52159 1359094 1363835 1369690 1375503 1380379 1383956 1385929 1385971 1384324 1381933 1379589 1377260 1374547 1371460 1368367
52145 1368367 1365499 1362949 1361057 1360334 1360897 1362157 1363152 1363104 1361716 1359090 1355441 1350977 1346130 1341806 1339127
52130 1339127 1338768 1340633 1344210 1349116 1355365 1363420 1374041 1387837 1404742 1424088 1445240 1467952 1492062
52117 1492062 1517167 1542794 1568638 1594412 1619672 1644007 1667139 1688660 1708009 1725029 1740216
52106 1740216 1754010 1766168 1776378 1785231 1793831 1802511 1810760 1818554 1826848 1836216 1845707 1853806 1860175
52093 1860175 1865657 1870747 1874762 1876578 1875582 1871787 1865551 1857330 1847369 1835543 1821975 1807908 1795399
52080A795399r550o566m029j412J344L378M184M414M918N732O604P812R649J1561
$$ plain form
52080 1795399 1785849 1779283 1775254 1773842 1775186 1778564 1782748 1787162 1792080 1797812 1804416 1812228 1821877 1833438
$$ [...]
##END NTUPLES=NMR SPECTRUM
##END=
