##TITLE=AC1564_ROEFFECT0018_8270708_RLHtpewVFm
##JCAMPDX= 6.0         $$ Bruker NMR JCAMP-DX V2.0
##DATA TYPE= NMR SPECTRUM
##DATA CLASS= NTUPLES
##ORIGIN= BRUKER
##OWNER= Administrator
$$ 1.72 TOPSPIN		Version 2.1
$$ 2013-10-12 19:38:51.450 -0700  Administrator@X
$$ Compression mode = diff/dup
##.OBSERVE FREQUENCY= 400.02188249412
##.OBSERVE NUCLEUS= ^1H
##.ACQUISITION MODE= SIMULTANEOUS (DQD)
##.ACQUISITION SCHEME= undefined
##.AVERAGES= 8
##.DIGITISER RES= 22
##SPECTROMETER/DATA SYSTEM= spect
##.PULSE SEQUENCE= zg30
##.SOLVENT NAME= COFFEE_meoh
##.SHIFT REFERENCE= INTERNAL, COFFEE_meoh, 1, 14.98509
##AUDIT TRAIL= $$ (NUMBER, WHEN, WHO, WHERE, PROCESS, VERSION, WHAT)
$$ ##TITLE= Audit trail, TOPSPIN		Version 2.1
$$ ##JCAMPDX= 5.01
$$ ##ORIGIN= Bruker BioSpin GmbH
$$ ##OWNER= Administrator
$$ $$ E:\/data/COFFEE/nmr/AC1564_ROEFFECT0018_8270708_RLHtpewVFm/10/pdata/1/auditp.txt
$$ ##AUDIT TRAIL=  $$ (NUMBER, WHEN, WHO, WHERE, PROCESS, VERSION, WHAT)
(   1,<2013-10-12 19:38:44.918 -0700>,<Administrator>,<X>,<go>,<TOPSPIN 2.1>,
      <created by zg
	started at 2013-10-12 19:37:38.980 -0700,
	POWCHK enabled, PULCHK disabled,
       configuration hash MD5:
       C8 4E 4E 5D D3 5C D8 9E 9F 52 82 E0 59 8A DE 15
       data hash MD5: 64K
       79 31 F6 49 2D B6 D1 7E C1 EF E5 91 30 BD 68 D5>)
(   2,<2013-10-12 19:38:47.809 -0700>,<Administrator>,<X>,<proc1d>,<TOPSPIN 2.1>,
      <Start of raw data processing
       efp LB = 0 FT_mod = 6 PKNL = 1 PHC0 = 0 PHC1 = 0 SI = 32K 
       data hash MD5: 32K
       26 D1 A2 D5 3D 05 D9 50 18 07 2A 6F AD 71 91 76>)
(   3,<2013-10-12 19:38:48.106 -0700>,<Administrator>,<X>,<proc1d>,<TOPSPIN 2.1>,
      <pk PHC0 = 95.15259 PHC1 = 0 
       data hash MD5: 32K
       AD E0 92 AD DA 77 A6 7E BD 41 1E 84 AB F3 96 07>)
(   4,<2013-10-12 19:38:48.215 -0700>,<Administrator>,<X>,<proc1d>,<TOPSPIN 2.1>,
      <abs ABSG = 1 
       data hash MD5: 32K
       46 2C 70 2C 1E 05 0D 04 5B C1 1C 4C A2 27 85 18>)
(   5,<2013-10-12 19:38:48.278 -0700>,<Administrator>,<X>,<proc1d>,<TOPSPIN 2.1>,
      <abs ABSG = 2 
       data hash MD5: 32K
       47 4D 5E 88 FA 54 61 88 20 3C A9 CB BA 0D 98 E5>)
(   6,<2013-10-12 19:38:48.356 -0700>,<Administrator>,<X>,<proc1d>,<TOPSPIN 2.1>,
      <abs ABSG = 3 
       data hash MD5: 32K
       69 6E 49 5E CE 78 DB 54 2F 24 FC 44 4A 4B 40 57>)
(   7,<2013-10-12 19:38:48.403 -0700>,<Administrator>,<X>,<proc1d>,<TOPSPIN 2.1>,
      <abs ABSG = 4 
       data hash MD5: 32K
       7E CF 89 29 65 A4 5A 9B 68 F9 8B 12 04 AD 6E D0>)
(   8,<2013-10-12 19:38:48.465 -0700>,<Administrator>,<X>,<proc1d>,<TOPSPIN 2.1>,
      <abs ABSG = 5 
       data hash MD5: 32K
       C0 72 D6 1B B0 9F AC AD EA E4 EC 0E 7B 2D 37 A9>)
$$ ##END=
$$ 
$$ $$ hash MD5
$$ $$ DB 03 14 3F 7D F0 10 7E 52 CD 9F BF CB 19 DA 59
##$RELAX= 
##$RELAX= 
##$RELAX= 
##$RELAX= 
##$RELAX= 
##$RELAX= 
##$RELAX= 
$$ Bruker specific parameters
$$ --------------------------
##$DU= <E:\>
##$EXPNO= 10
$$ [...]
##$TP= (0..7)
150 150 150 150 150 150 150 150
##$TP07= 0
##$TPNAME0= <>
##$TPNAME1= <>
##$TPNAME2= <>
##$TPNAME3= <>
##$TPNAME4= <>
##$TPNAME5= <>
##$TPNAME6= <>
##$TPNAME7= <>
##$TPOAL= (0..7)
0.5 0.5 0.5 0.5 0.5 0.5 0.5 0.5
##$TPOFFS= (0..7)
0 0 0 0 0 0 0 0
##$TUNHIN= 0
##$TUNHOUT= 0
##$TUNXOUT= 0
##$USERA1= <user>
##$USERA2= <user>
##$USERA3= <user>
##$USERA4= <user>
##$USERA5= <user>
##$V9= 5
##$VALIST= <valist>
##$VCLIST= <CCCCCCCCCCCCCCC>
##$VD= 0
##$VDLIST= <DDDDDDDDDDDDDDD>
##$VPLIST= <PPPPPPPPPPPPPPP>
##$VTLIST= <TTTTTTTTTTTTTTT>
##$WBST= 1024
##$WBSW= 4
##$XGAIN= (0..3)
0 0 0 0
##$XL= 0
##$YL= 0
##$YMAX_a= 596252
##$YMIN_a= -508186
##$ZGOPTNS= <>
##$ZL1= 120
##$ZL2= 120
##$ZL3= 120
##$ZL4= 120
##$ABSF1= 14.98509
##$ABSF2= -5.573092
##$ABSG= 5
##$ABSL= 3
##$ALPHA= 0
##$AQORDER= 0
##$ASSFAC= 0
##$ASSFACI= 0
##$ASSFACX= 0
##$ASSWID= 0
##$AUNMP= <proc_prof1d_extract_pilot.lims>
##$AXLEFT= 0
##$AXNAME= <>
##$AXNUC= <1H>
##$AXRIGHT= 0
##$AXTYPE= 0
##$AXUNIT= <>
##$AZFE= 0.1
##$AZFW= 0.1
##$BCFW= 0
##$BC_mod= 0
##$BYTORDP= 0
##$COROFFS= 0
##$CY= 15
##$DATMOD= 1
##$DC= 0
##$DFILT= <>
##$DTYPP= 0
##$F1P= 0
##$F2P= 0
##$FCOR= 0.5
##$FTSIZE= 32768
##$FT_mod= 6
##$GAMMA= 0
##$GB= 0
##$INTBC= 1
##$INTSCL= 1
##$ISEN= 128
##$LB= 0
##$LEV0= 0
##$LPBIN= 0
##$MAXI= 10000
##$MC2= 0
##$MEAN= 0
##$ME_mod= 0
##$MI= 0
##$NCOEF= 0
##$NC_proc= -8
##$NLEV= 6
##$NOISF1= 0
##$NOISF2= 0
##$NSP= 0
##$NTH_PI= 0
##$NZP= 0
##$OFFSET= 14.98509
##$PC= 1
##$PHC0= 95.15259
##$PHC1= 0
##$PH_mod= 1
##$PKNL= yes
##$PPARMOD= 0
##$PPDIAG= 0
##$PPIPTYP= 0
##$PPMPNUM= 2147483647
##$PPRESOL= 1
##$PSCAL= 4
##$PSIGN= 0
##$PYNMP= <proc.py>
##$REVERSE= no
##$SF= 400.02
##$SI= 32768
##$SIGF1= 0
##$SIGF2= 0
##$SINO= 400
##$SIOLD= 32768
##$SPECTYP= <>
##$SREGLST= <1H.CDCl3>
##$SSB= 0
##$STSI= 32768
##$STSR= 0
##$SW_p= 8223.68421052631
##$SYMM= 0
##$S_DEV= 0
##$TDeff= 65536
##$TDoff= 0
##$TI= <>
##$TILT= no
##$TM1= 0
##$TM2= 0
##$TOPLEV= 0
##$USERP1= <user>
##$USERP2= <user>
##$USERP3= <user>
##$USERP4= <user>
##$USERP5= <user>
##$WDW= 1
##$XDIM= 32768
##$YMAX_p= 454658073
##$YMIN_p= -704769
##$CURPLOT= <Network HP LaserJet P1505>
##$CURPRIN= <$Network HP LaserJet P1505>
##$DFORMAT= <normdp>
##$LAYOUT= <+/1D_H.xwp>
##$LFORMAT= <normlp>
##$PFORMAT= <normpl>
##$SURQMSG= 1
$$ End of Bruker specific parameters
$$ ---------------------------------
##NTUPLES= NMR SPECTRUM
##VAR_NAME=  FREQUENCY,     SPECTRUM/REAL,   SPECTRUM/IMAG
##SYMBOL=    X,             R,               I
##VAR_TYPE=  INDEPENDENT,   DEPENDENT,       DEPENDENT
##VAR_FORM=  AFFN,          ASDF,            ASDF
##VAR_DIM=   32768,         32768,           32768
##UNITS=     HZ,            ARBITRARY UNITS, ARBITRARY UNITS
##FACTOR=    0.250966925370066, 1,           1
##FIRST=     8223.43324360094, 209707,       70129
##LAST=      0,             217669,          -114788
##MIN=       0,             -704769,         0
##MAX=       8223.43324360094, 454658073,    0
$$ Real data points
##PAGE= N=1
##DATA TABLE= (X++(R..R)), XYDATA
$$ [...]
$$ plain form
19560 -62795 -135168 -108616 -94825 -139860 -60041 65891 -94658 206979 50278 -32058 -74880
19549 -74880 -258445 128973 -181910 161450 37283 313612 -180703 -241018 284043 133215
19538 -87383 187732 48189 -24489 267811 -50240 417133 -559310 -157400 -147402 71416 2666
19526 -237249 -20224 -116438 -281447 -67798 -168600 338170 24252 -89804 -52649 -192997 -331562
19515 -331562 -68191 -266674 -15262 -236727 201389 -325542 -186488 -10768 -196289 -51014
19504 -110211 30560 -226763 -22783 -45884 110380 -122510 -26321 -13563 -236274 -193901 -310977
19493 -310977 133039 -96032 -265543 73762 184853 26313 -23932 -101687 -158852 -152485 -55376
19481 175760 -59315 39233 -306844 -389787 300913 166607 206864 -296433 -21578 -55565 -440387
$$ packed form
19560f2795p2373K6552J3791m5035f0041F5891i4658B06979E0278c2058m2822
19549g4880j83565A28973a81910A61450C7283K76329a80703o0315B84043A33215
19538h7383A87732D8189b4489B67811e0240D17133e59310a57400R998G1416B666
19526b37249b0224r6214j65009f7798j00802C38170B4252h9804L7155j40348j38565
19515c31562f8191j98483a5262k21465B01389c25542J39054a0768j85521e1014
19504a10211C0560b26763b2783k3101A10380a22510b6321J2758k22711M2373j17076
19493c10977A33039i6032j69511G3762J11091B6313b3932p7755n7165O367e5376
19481A75760e9315C9233c06844q2943C00913j34306M0257b96433b1578l3987l84822
$$ plain form
19470 -440387 -89379 92846 2020 -72927 -98600 -28919 -142297 -63637 24224 -137268 -150241
19459 -150241 148921 -56172 -220971 -163415 263150 97066 -33142 -106067 69666 19894 10459
19448 10459 -15651 -79561 -174652 -222260 -202750 -224119 -168784 -83506 -305480 204021 -114135
19436 -148830 129229 53365 -702 307202 -358918 -127438 129229 -83495 -109397 -63485 199443
19424 -119180 -68910 -10678 -220568 50057 -88621 -214030 -115283 -122409 -107583 121561 -98475
19412 -40313 -100254 358653 -285783 -132912 76326 -293246 -152692 -448031 243354 -199343
19401 -38618 -67831 41768 111214 -2511 18789 119372 -199260 -236802 311901 -51621 -237029
19390 -237029 103853 -118640 -83705 -59797 -101067 -144808 -148566 82979 -204843 -321008 98703
$$ packed form
19470d40387h9379I2846B020g2927k5673b8919j13378f3637B4224a37268j2973
19459a50241A48921e6172j64799N7556B63150I7066c3142p2925F9666A9894r435
19448A0459a5651o3910r5091m7608J9510k1369N5335h3506k21974B04021a14135
19436a48830A29229E3365g02C07202c58918a27438A29229h3495k5902M5912A99443
19424a19180N0270a0678k09890E0057h8621j25409R8747p126J4826A21561i8475
19412d0313n9941C58653b85783a32912G6326b93246J40554k95339B43354a99343
19401c8618k9213D1768O9446b511A8789J00583a99260l7542C11901e1621j85408
19390b37029A03853a18640L4935K3908m1270m3741l758H2979b04843j16165I8703
$$ plain form
19378 -352337 -6413 -69890 149120 86923 197972 193742 -230776 182164 -38976 -202807 -62088
19366 -310652 48758 -268554 -192906 -2304 -81828 138002 -189571 -55638 212909 -165142 -81202
19354 -106387 -61159 -238676 -218967 -69386 -116433 -159227 -465124 -266485 23046 -119761 -124641
19343 -124641 -18752 58358 149680 -152085 -79149 -41662 -159181 187761 -166351 -105349 -420968
19332 -420968 -242751 -179094 -282830 -310534 -232884 -68754 287 -11096 82162 -542254 -47763
19320 53379 64777 -36902 189434 -184741 80218 -72477 6216 84560 -111289 -170029 -204795
19309 -204795 246287 106496 -79517 -377069 -305836 317030 249045 51157 -76526 30486 -123035
19297 -230549 88808 45266 -128057 -260493 95734 266100 -60447 142562 -86640 -106654 -387052
$$ packed form
19378c52337f413o3477A49120o2197J11049m230b30776A82164c8976j63831f2088
19366c10652D8758b68554P5648b304p9524A38002a89571e5638B12909a65142h1202
19354a06387M5228j77517J9709f9386m7047m2794l05897J98639B3046a19761m880
19343a24641a8752E8358R1322a52085P2936L7487j17519A87761a66351O1002l15619
19332d20968J78217O3657j03736k7704P7650f8754B87a1096H2162e42254d7763
19320E3379J1398c6902A89434a84741H0218g2477F216P8344a11289n8740l4766
19309b04795B46287A06496g9517k97552P1233C17030o7985E1157g6526C0486a23035
19297b30549H8808m3542a28057j32436I5734J70366f0447A42562h6640k0014k80398
$$ plain form
19286 -387052 -303980 -185664 5472 -67352 -130662 119794 -27156 158902 7452 -136763 -260698
19275 -260698 -85399 179841 173367 -163587 -165791 49230 -315050 138647 125490 248827 -67665
19263 -290016 -64616 -55546 176817 -194633 -90287 -180475 215235 -62870 205720 -105982 -230365
19252 -230365 7147 123067 -34068 -103050 -431788 -23315 -63004 103574 41649 -193808 -316446
19241 -316446 60794 -50725 -235739 256167 -180341 -98900 -90807 -94503 22646 -28659 110751
19229 164722 69456 85604 53416 -94037 -182136 -426110 220381 -213546 -111298 -186573 -229394
19218 -229394 -384089 50260 -46286 -349456 -79244 284993 11899 -400316 -45013 -99429 -4773
19206 -80817 166374 -37190 11694 -8441 -104200 29428 -356085 -56769 -89561 -86276 -18083 176895
$$ packed form
19286c87052Q3072J18316E472f7352o3310A19794b7156A58902G452a36763j23935
19275b60698h5399A79841o474a63587k204D9230c15050A38647j3157J23337f7665
19263b90016f4616R070A76817a94633i0287r0188B15235f2870B05720a05982j24383
19252b30365G147J15920c4068o8982l28738b3315l9689A03574D1649a93808j22638
19241c16446F0794e0725j85014B56167a80341Q1441Q093l696B2646b8659A10751
19229A64722F9456J6148l2188i4037q8099k43974B20381b13546J02248p5275m2821
19218b29394j54695E0260d6286l03170g9244B84993A1899d00316d5013n4416d773
19206h0817A66374c7190A1694h441r5759B9428c56085e6769l2792L285a8083A76895
$$ plain form
19193 4026 -198810 -176768 -212593 -236059 -196847 242533 -209277 62863 -52857 -57771 -19190
19181 -207462 -75157 -235761 -80236 -256268 204057 -19722 271052 59 259298 -47673 -116985
19170 -116985 -62354 -56609 350794 -64272 -110079 13283 -409467 -110094 153351 74819 -55296
19158 -118770 53892 -352365 162916 -168060 80702 -259205 -275322 -68850 552 -6456 -274711
19147 -274711 -71601 -94535 21519 -55208 -302081 -261410 102583 -327855 -98279 159562 213933
19136 213933 -330076 72377 -200382 -124258 59299 -286671 -14014 -101972 43564 -1369 -102058
19125 -102058 -156858 -103719 80518 150726 -80958 -195120 49334 -128245 -69094 -252098 -87633
19113 -2437 32427 -129613 127500 132940 -119154 96692 25551 -310268 7138 -86523 72271
$$ packed form
19193D026a98810K2042l5825k3466L9212B42533b09277F2863e2857m914a9190
19181b07462g5157j60604h0236j76032B04057a9722B71052E9K59239d7673o9312
19170a16985N4631N745C50794f4272m5807A3283d09467a10094A53351G4819e5296
19158a18770E3892c52365A62916a68060H0702b59205j6117f8850E52f456k68255
19147b74711g1601k2934B1519e5208k46873M0671A02583c27855i8279A59562N4371
19136B13933c30076G2377b00382P6124E9299b86671a4014q7958D3564a369j00689
19125a02058n4800N3139H0518P0208h0958j14162D9334a28245N9151j83004h7633
19113b437C2427a29613A27500N440a19154I6692B5551c10268G138h6523G2271
$$ plain form
19101 243997 -145307 71418 -165357 -263482 -46609 -94333 -82017 158657 -669 23848 -177430
19089 -337956 -83169 175100 -253785 -122477 119983 -3655 1154 -380739 408997 -5687 199707
19077 82919 106446 29579 -6774 302134 248783 -197388 -134561 -155073 -76886 -115805 64821
19065 101439 -89779 -119866 -199662 68545 -384881 256112 50990 49682 66854 -215700 171981
19053 -75302 -70507 -124179 -89140 205359 -152651 103782 -6426 31574 -141411 260962 226922
19042 226922 -198972 -160231 -223245 -496458 -87060 127240 106120 -188652 -150249 -59902 -188252
19031 -188252 -16648 347230 -91360 143311 -153122 -145283 31790 -271874 376038 86281 -162365
19019 169050 -260738 59455 194187 15480 319419 -232179 -277821 46090 254392 44417
$$ packed form
19101B43997a45307G1418a65357r8125d6609m7724J2316A58657f69B3848a77430
19089c37956h3169A75100b53785a22477A19983c655A154c80739D08997e687A99707
19077H2919K3527B9579f774C02134n3351a97388O2827k0512g6886l8919F4821
19065A01439h9779l0087p9796F8545c84881B56112E0990j308J7172b15700A71981
19053g5302M795n3672L5039B05359a52651A03782f426C1574a41411B60962l4040
19042B26922a98972L8741o3014k73213h7060A27240k1120a88652L8403e9902j28350
19031a88252a6648C47230i1360A43311a53122P839C1790b71874C76038H6281a62365
19019A69050b60738E9455J34732A5480L03939b32179m5642D6090K08302D4417
$$ plain form
19008 -25393 59668 -7082 -178978 -268914 268403 -167862 -148947 92794 -36364 -37621 27934
18996 309607 -3040 226525 18862 59333 -264166 -53520 -15117 -144587 296473 -86866 -80091
18985 -80091 315711 84624 -164031 190131 165324 -311926 -9606 19535 1896 60239 -176635
18973 -130216 99052 -21265 143987 -252351 -197303 -65069 -218541 -24003 -337189 303877
18962 -82185 -74493 -528371 -437321 117260 10517 -176083 126694 -109878 -416621 -130927
18951 -241308 -77294 94902 -330058 -137886 72997 -177933 -293877 -138590 -114931 -213051
18941 -213051 370995 -154465 246826 -136328 -121024 -39778 -239321 -19304 -14995 34297 -355372
18929 -227040 -51323 118803 -246093 -117449 -346757 -91192 -149132 -306474 -78155 -65755
$$ packed form
19008b5393E9668g082j71896q9936B68403a67862J8915I2794c6364j257B7934
18996C09607c040B26525A8862M0471b64166e3520a5117j29470B96473h6866O775
18985h0091C15711H4624a64031A90131k4807c11926i606A9535A896N8343a76635
18973a30216I9052b1265A43987b52351N5048f5069j53472b4003l13186C03877
18962h2185P692m53878R1050A17260A0517a76083A26694a09878l06743a30927
18951b41308g7294I4902c30058a37886G2997a77933j15944a38590K3659r8120
18941b13051C70995a54465B46826a36328J5304c9778j99543a9304M309C4297c55372
18929b27040e1323A18803b46093a17449k29308i1192n7940j57342g8155J2400
$$ plain form
18919 -65755 54020 -124109 -29324 -97032 -7051 225248 -20900 135968 -239511 -118871 10339
18907 -74695 -216895 172063 54219 101683 -112750 49657 55335 50855 185656 -53694 -200218
18896 -200218 385916 84653 -143399 -251524 -62274 -59490 -133460 -373081 -84152 -354423 210307
18884 127100 30231 -63699 41000 -384423 44419 4568 -191200 18225 -3284 4911 69505 54757
18872 54757 -253285 204393 -63826 606 -113617 -156827 81446 -101958 245488 -1420 178321
18860 -283513 -298926 62077 32870 -151601 -152436 108152 -11887 81303 55999 86910 -355227
18848 -135213 -36716 219022 35273 -3328 81922 -213281 -253536 -279515 27426 -120613 -123630
18837 -123630 -234282 -294783 -154807 262687 99348 -251164 21304 435889 -162464 112909
$$ packed form
18919f5755E4020a24109b9324o7708g051B25248b0900A35968b39511a18871A0339
18907g4695j42200A72063E4219M7464a12750D9657N678m480J34801e3694j46524
18896b00218C85916H4653a43399j08125f2274K784p3970k39621h4152k70271B10307
18884A27100C0231f3699D1000c84423D4419D568a91200A8225c284D911O4594j4748
18872E4757b53285B04393f3826F06a13617m3210H1446a01958B45488a420A78321
18860b83513j5413F2077k9207a51601q35A08152a1887H1303k5304L0911c55227
18848a35213c6716B19022C5273c328H1922b13281m0255k5979B7426a20613l017
18837a23630j10652o0501J39976B62687I9348b51164B1304M14585a62464A12909
$$ plain form
18826 217003 -14552 -115477 -67770 -65502 211893 57399 95219 5732 282961 -221429 159747
18814 -312538 44643 106506 26563 -80296 244566 278293 -130793 -330328 39581 91981 -229613
18802 -331304 -16574 15049 273452 -159811 -47361 55347 345954 144381 -271549 -200477
18792 -200477 -288841 -63985 467 -57964 258740 -68278 65059 -146855 -112549 70270 -53699
18780 184355 94605 -219965 82682 -234242 -171573 153635 131429 141207 -153941 -157026 -101705
18769 -101705 119386 9934 -70527 145694 -124540 -301871 43438 99683 -88254 -68614 -103275
18758 -103275 141834 -122911 -204627 213314 -272701 -307684 -12823 16937 -55807 -90445 -10093
18746 -402636 -2214 -9676 -95541 70044 -201565 -92597 -56553 -277322 -318053 -246062 -297549
$$ packed form
18826B17003a4552j00925M7707K268B11893E7399L7820E732K77229b21429A59747
18814c12538D4643O1863B6563h0296B44566L3727a30793j99535C9581N2400b29613
18802c31304a6574A5049K58403a59811d7361E5347K90607A44381b71549P1072
18792b00477q8364f3985D67e7964B58740f8278F5059a46855L4306G0270e3699
18780A84355q9750b19965H2682b34242O2669A53635k2206R778a53941l085N5321
18769a01705A19386I934g0527A45694a24540j77331D3438N6245h8254J9640l4661
18758a03275A41834a22911q1716B13314b72701l4983a2823A6937e5807l4638a0093
18746d02636b214p462q5865G0044b01565i2597L6044k20769m0731P1991n1487
$$ plain form
18735 -297549 101398 164731 -88372 2587 -199404 19840 9481 110146 -201711 96573 97190
18724 97190 138955 -133190 -112792 -216169 -4311 -46148 42997 -143673 -167466 -61381 -116853
18713 -116853 -152233 3597 -154970 -326364 26659 -46313 276517 -349112 70372 -142414 112657
18701 -27159 -92702 -60904 -388563 -160306 -69204 128260 -150776 -220037 133007 -156305
18690 -279502 -152538 119205 -221797 188595 -16430 -165810 -196343 -82775 -165311 58703
18679 -54227 -110143 -149810 -188390 55707 -127524 10249 239342 -5326 7464 272846 266543 85123
18666 10622 193072 -85306 -15590 -231494 -77237 -68525 196617 -29247 195189 124680 -20369
18654 271882 207329 72022 83159 202124 -385718 -88187 -408278 4001 -31559 -58011 -353994
$$ packed form
18735b97549A01398O3333h8372B587a99404A9840I481J00665b01711I6573O17
18724I7190M1765a33190K0398j03377d311m1837D2997a43673k3793f1381n5472
18713a16853l5380C597a54970j71394B6659d6313B76517c49112G0372a42414A12657
18701b7159o5543L1798l27659a60306f9204A28260a50776o9261A33007a56305
18690b79502J26964A19205b21797A88595a6430j49380l0533h2775q2536E8703
18679e4227n5916l9667l8580E5707a27524A0249K29093e326G464K65382o303H5123
18666A0622J82450h5306a5590k15904g7237Q712A96617b9247A95189p0509b0369
18654B71882o4553G2022J1137J18965c85718h8187l20091D001c1559k6452k95983
$$ plain form
18643 -353994 224297 -114673 -84490 -39746 -68391 -269210 -94095 -384928 -10142 84452 -216831
18631 168803 -141123 20923 55987 73416 -134855 -212282 -31542 -8654 -169035 225125 126805
18620 126805 76640 -217621 -54373 3209 236429 218104 41205 -134456 -6716 -86046 -78817
18609 -78817 -244604 -121904 -376166 17538 29935 -374080 -214833 -12780 103890 37719
18598 -134076 195416 205194 -449676 -165355 -132544 88274 31581 91716 7106 -48071 -95794
18587 -95794 -137179 -53100 53699 -325689 58406 145777 -331699 28456 -163295 -221547 64613
18575 -11385 -52899 -193560 54930 165259 34899 -218965 102413 49506 -182318 -3454 204643
18563 -179316 -168374 164091 -489537 28553 -178717 120311 44748 -12615 -132115 -58714
$$ packed form
18643c53994B24297a14673L0183c9746k8645k00819i4095k90833a0142H4452b16831
18631A68803a41123B0923L5064J7429a34855p7427c1542h654j60381B25125r8320
18620A26805n0165b17621e4373C209K33220j8325D1205a34456f716p9330P229
18609g8817j65787a21904k54262A7538J2397c74080J59247a2780A03890C7719
18598a34076A95416R778d49676a65355L2811H8274C1581O0135G106d8071m7723
18587i5794m1385e3100E3699c25689E8406Q7371c31699B8456a63295n8252F4613
18575a1385m1514j40661E4930J10329C4899b18965A02413D9506a82318c454B04643
18563a79316J0942A64091d89537B8553a78717A20311D4748a2615j19500e8714
$$ plain form
18552 790 -104429 -18881 -260320 49167 18608 77429 -41224 25631 201563 -235243 3181
18540 -393632 164253 185933 293310 -459558 23974 -19953 166356 -2680 12994 -207438 8493
18528 76719 -214710 -201445 -30661 -63904 -122459 -279670 -48569 -21221 -468528 -88058 -152391
18517 -152391 -4553 -126986 -157008 245605 -133535 43440 290458 -321429 -72817 285480
18506 -25451 -132967 -99330 -269240 -120341 71586 -190087 -326622 72060 -192059 325351
18495 -275473 -13603 -91370 -44647 -309897 170783 -160426 43351 -193761 -245387 -121415
18484 33137 -158262 -88493 -24897 -219112 5929 290187 204192 -74482 -278217 -328033 59158
18472 -25783 -131830 23372 5596 165786 -203272 -255752 161123 54991 16003 -31772 -40073
$$ packed form
18552G90a04429a8881k41439D9167A8608N8821d1224B5631J75932b35243C181
18540c93632A64253K1680J07377d59558B3974a9953A66356b680A2994b07438H493
18528G6719b14710J3265c0661l3243n8555j57211d8569b1221m47307h8058o4333
18517a52391d553j22433l0022B45605a33535D3440K47018c21429g2817B85480
18506b5451j07516L3637j69910a20341G1586a90087j36535G2060a92059C25351
18495b75473a3603p7767d4647k65250A70783a60426D3351a93761n1626a21415
18484C3137a58262O9769b4897j94215E929K84258q5995g4482k03735m9816E9158
18472b5783j06047B3372E596J60190b03272n2480A61123E4991A6003c1772q301
$$ plain form
18461 -40073 -241299 55928 -182144 -335469 227410 132809 -10361 -69339 -44059 92463 60514
18450 60514 -200994 223239 154052 -186960 198157 19990 -15953 -201039 -93104 176257
18439 -136392 79068 162853 150371 -248679 48722 -56795 -297700 -53310 11242 -234152 171954
18427 249782 101761 -53359 -234 -109162 -103392 135858 77784 101030 -99806 -403526 88307
18415 -77238 149929 -116158 82869 -77245 -156220 -130817 262097 -103858 11429 100123 230205
18404 230205 -122040 -104908 -350812 -22541 113542 -83316 75205 150753 124403 63172 99786
18393 99786 -288703 23754 -185216 -4408 45965 -159658 118629 5879 -19937 -191588 -181922
18382 -181922 -133904 244742 529094 -178996 32258 -107808 -65699 2640 31034 32358 19588
$$ packed form
18461d0073k01226E5928a82144j53325B27410r4601a0361n8978K5280I2463l1949
18450F0514b00994B23239o9187a86960A98157A9990a5953j85086i3104A76257
18439a36392G9068Q3785j2482b48679D8722e6795k40905e3310A1242b34152A71954
18427B49782A01761e3359b34j08928N770A35858n8074K3246i9806l03720H8307
18415g7238A49929a16158H2869g7245p8975K5403B62097a03858A1429Q8694J30082
18404B30205a22040J7132k45904b2541A13542h3316G5205P5548k6350o1231L6614
18393I9786b88703B3754a85216d408D5965a59658A18629E879a9937j71651R666
18382a81922M8018B44742K84352a78996C2258a07808M2109B640K8394J324j2770
$$ plain form
18371 19588 61466 333877 19674 -84381 -18329 -44769 -252159 -229063 143483 78087 124241
18360 124241 17444 39602 13629 38003 211706 174936 -11914 -5806 -289409 -161423 -66472
18348 125865 -125446 192978 -109066 -292639 -97485 159027 44798 -299141 -7122 274156
18337 -85352 -142378 66041 -34713 -180855 97020 -412440 -339400 347279 146829 -133252 168383
18325 -183600 85567 177030 -183320 37831 -87098 -35289 -131476 -284028 28634 -115230 76971
18313 54222 -162036 -108005 -8748 -138526 -94349 339687 -144917 -239619 138887 1923 -210107
18301 194315 6696 -288600 -194934 66628 -129983 -50633 -84373 -174435 -52812 -47781 -80134
18290 -80134 35932 122042 -67534 -25000 -400666 43770 -416415 -34784 -444472 99076 91552
$$ packed form
18371A9588M1878K72411A9674h4381a8329k6440k07390K3096A43483o5396M6154
18360A24241A7444K2158A3629K4374J73703l6770a1914e806k83603J27986f6472
18348A25865a25446A92978a09066j83573i7485A59027D4798b99141g122B74156
18337h5352n7026F6041c4713j46142I7020d12440P3040C47279A46829a33252A68383
18325a83600H5567R1463a83320C7831h7098c5289r6187j52552B8634a15230G6971
18313E4222a62036N4031h748j29778M4177C39687a44917r4702A38887A923b10107
18301A94315F696b88600R3666F6628a29983e0633l3740r0062e2812N031l2353
18290h0134C5932Q6110f7534b5000l75666D3770d16415c4784m09688I9076p524
$$ plain form
18279 91552 95761 302749 -13829 95874 -10951 237368 -186457 38473 -87264 -462882 -254554
18268 -254554 47653 -201890 -82735 -64888 -87407 49773 8558 -62089 -60353 139797 -62262
18256 -156014 -106769 35826 -10775 -329177 -119376 136877 -17974 84090 -380408 11896 -56821
18244 87223 315461 -261558 26088 47923 331063 -202784 35508 -381462 165351 283196
18234 283196 -194285 197535 97327 73477 -34384 -192165 -26880 20019 -86206 -244609 92459
18222 350469 -226957 -14657 -153654 -411962 167729 39757 -109290 -338125 -532989 -104106
18211 45173 -183189 137239 -167908 -152512 -48455 91055 170134 86499 -180755 -274527 -133265
18199 -21271 -133470 -65444 36948 95103 270321 -350109 -121313 -144566 -307313 -33088 97175
$$ packed form
18279I1552M209K06988a3829I5874a0951B37368a86457C8473h7264l75618K08328
18268b54554D7653b01890h2735J7847k2519D9773H558f2089J736A39797f2262
18256a56014M9245C5826a0775l18402a19376A36877a7974H4090c80408A1896e6821
18244H7223K28238b61558B6088K1835K83140b02784C5508c81462A65351J17845
18234B83196a94285A97535I7327k3850c4384j57781b6880B0019h6206j58403I2459
18222C50469b26957a4657j38997k58308A67729C9757a09290k28835j94864a04106
18211D5173a83189A37239a67908J5396d8455I1055P9079q3635a80755r3772a33265
18199b1271j12199f5444C6948N8155J75218c50109a21313k3253j62747c3088I7175
$$ plain form
18187 -143605 -170941 598 -31800 5537 -27623 16037 -80971 -169844 -84924 159679 157763 -202453
18174 -58735 -280755 -131889 -55596 176066 -222885 -458374 6765 330450 361457 52267 -33907
18162 -10291 -113203 -160545 -172089 59800 -177692 -247552 383345 -294227 160133 52194 -66637
18150 -149470 163920 29048 6640 -10187 167535 145606 -140279 -35215 77311 -217499 129029
18138 298784 -124796 8194 -10793 -86808 28052 19023 310180 -18592 -332653 -11304 -188908
18127 -188908 -40959 -211954 -165829 7405 -74562 -73924 24991 -289170 -185350 -388261 109523
18115 388965 -130401 115779 422174 193191 -272098 230759 20667 -307961 70742 22188
18104 241252 139250 -130919 -475720 22223 -149823 258279 245116 -39540 6131 233729
$$ packed form
18187a43605k7336E98c1800E537b7623A6037h0971q8873Q4920A59679j916b02453
18174e8735k22020a31889e5596A76066b22885k35489F765L23685L1007E2267c3907
18162a0291j02912m7342j1544E9800a77692o9860C83345b94227A60133E2194f6637
18150a49470A63920B9048F640a0187A67535k1929a40279c5215G7311b17499A29029
18138B98784a24796H194a0793p6015B8052r029K91157a8592l14061a1304j77604
18127a88908d0959j70995M6125G405g4562O38B4991b89170J03820k02911A09523
18115C88965a30401A15779L06395A93191b72098B30759B0667c07961G0742B2188
18104B41252j02002a30919l44801B2223a49823B58279j3163c9540F131K27598
$$ plain form
18094 233729 33752 99563 103582 146725 114028 126193 59290 16879 -212066 -74962 125092
18082 -218159 136461 -321805 35056 -201306 -209195 134599 -235172 227021 127873 -47869
18071 23706 -59111 -96594 -182470 131982 -182865 -146458 -147115 68300 -62828 132630 -16575
18059 76047 1455 2317 224523 21349 -40707 -62423 -98945 190900 165438 -82863 287335 -59521
18046 -257699 -66091 -91080 -166536 116816 13813 -343128 -106076 -318556 179195 -1122 -256446
18035 -256446 -91647 87401 -190646 -144593 56501 85567 168230 -242987 -30088 -153900 78549
18023 -158815 301052 -129923 120409 -54463 -69911 66218 18846 -228885 -46283 -101784 35318
18011 -193581 -131575 -244986 -269485 -87827 -134947 -66416 3330 188786 -125553 -156538 53285
$$ packed form
18094B33729C3752O5811M019M3143l2697J2165E9290A6879b12066g4962A25092
18082b18159A36461c21805C5056b01306p889A34599b35172B27021r9148d7869
18071B3706e9111l7483q5876A31982a82865L6407o57F8300f2828A32630a6575
18059G6047A455Q62K22206B1349d0707k1716l6522A90900k5462h2863B87335e9521
18046b57699f6091k4989p5456A16816A3813c43128a06076k12480A79195a122k55324
18035b56446i1647H7401a90646M6053E6501K9066Q2663b42987c0088j23812G8549
18023a58815C01052a29923A20409e4463j5448F6218A8846b28885d6283n5501C5318
18011a93581O2006j13411k4499h7827m7120f6416C330J85456a25553l0985E3285
$$ plain form
17999 -140217 76381 37213 -4786 -19066 -105174 -44634 -173502 23212 -35788 85213 -132883
17987 -196148 -41149 -9611 -316871 -395828 -230938 -25734 -133109 -35969 192101 -367709 43963
17975 -225927 128591 -49337 -209934 -43631 184516 -165718 -251033 89685 -266211 -90844
17964 40925 -19389 -270182 171098 -231464 52201 -203048 134493 126919 -25454 -235462 -177584
17953 -177584 -80008 -68031 231137 233460 -62975 286337 145478 146586 -113194 -35411 8024
17941 -256752 -315271 -371224 226503 -59192 203062 -217579 -543586 315228 -35079 -319094
17931 -319094 -121186 -156559 -61203 -88649 -216685 -144962 -66052 132176 -48794 -52482 194035
17919 -179708 325333 -236156 -375921 90641 -201333 -134697 -30460 420268 219294 282320
$$ packed form
17999a40217G6381C7213d786j4280q6108d4634j28868B3212c5788H5213a32883
17987a96148d1149i611l07260p8957J64890b5734j07375c5969A92101c67709D3963
17975b25927A28591d9337j60597d3631A84516a65718q5315H9685b66211i0844
17964D0925a9389k50793A71098b31464E2201b03048A34493p574b5454k10008N7878
17953a77584h0008J1977B31137K323f2975B86337j40859J108a13194c5411H024
17941b56752n8519n5953B26503e9192B03062b17579l26007C15228c5079k84015
17931c19094a21186l5373f1203k7446j28036P1723f6052A32176d8794l688A94035
17919a79708C25333b36156j39765I0641b01333O6636c0460D20268k00974O3026
$$ plain form
17909 282320 -63548 -51155 -160954 -11788 183664 -6262 187730 174035 -64313 210454 -52268
17897 -9109 -28333 -46579 -90717 10728 -524950 151502 -10001 17531 141867 152849 -437470
17885 17047 -41660 215409 165905 56717 82131 57203 268737 -153798 62858 74044 23944
17873 159513 -873 21124 -111160 188196 131120 20388 256023 -118892 -129570 -253890 131615
17861 50019 194265 -170330 2746 -7290 45244 -207638 -200725 -56666 432770 -3411 113751
17849 -57212 56566 -147624 362451 91533 -74554 -87437 362434 -94587 58842 -150095 -47937
17837 -61147 19119 -221775 139977 -40628 -56981 -14045 115432 -111962 -233922 -194557 -74129
17825 276540 -66220 222834 -205710 -58287 -227291 123551 44550 221324 23263 315508
$$ packed form
17909B82320f3548J2393j09799a1788A83664f262A87730j3695f4313B10454e2268
17897i109j9224j8246m4138A0728e24950A51502a0001A7531J24336J0982d37470
17885A7047d1660B15409m9504E6717K5414k4928K11534a53798F2858J1186B3944
17873A59513h73B1124a11160A88196n7076B0388K35635a18892j0678j24320A31615
17861E0019J44246a70330B746g290D5244b07638O913e6666D32770c411A13751
17849e7212E6566a47624C62451I1533g4554j2883C62434i4587E8842a50095d7937
17837f1147A9119b21775A39977d0628j6353a4045A15432a11962j21960L9365g4129
17825B76540f6220B22834b05710e8287j69004A23551D4550J76774B3263K92245
$$ plain form
17815 315508 -86250 -136731 58653 -371236 92206 -243600 -298549 -57289 38184 -55531 46277
17803 19264 -80982 -50585 34426 31309 149074 69455 236158 -28899 203016 -53578 -51412
17792 -51412 -58174 -22292 208546 104254 -74177 -33447 -261231 -58634 278324 -186973 -189514
17781 -189514 -40473 -69309 23847 300097 -190365 -54655 18625 79784 17148 -103592 -74663
17770 -74663 10963 132194 -133391 -185519 -28349 166554 -78423 -312406 46730 43641 211144
17759 211144 123795 116590 108182 -62883 18829 116007 -206471 -30587 75172 25201 -44008 -25754
17747 -25754 267810 -178862 143695 -117270 231497 -180299 51747 -19411 281740 -400335
17736 130552 -64891 150904 286075 -149397 -30124 42139 -203087 -134918 -157967 102268
$$ packed form
17815C15508h6250n0481E8653c71236I2206b43600n4949e7289C8184e5531D6277
17803A9264h0982L0397C4426l117J17765F9455J66703b8899B03016e3578K166
17792e1412o762b2292B08546A04254g4177c3447k27784e8634B78324a86973k541
17781a89514d0473k8836B3847K76250a90365e4655A8625O1159A7148a03592K8929
17770g4663A0963J21231a33391n2128b8349A66554g8423k33983D6730l089J67503
17759B11144q7349p205q408f2883A8829R7178b06471c0587G5172B5201d4008J8254
17747b5754B67810a78862A43695a17270B31497a80299E1747a9411B81740d00335
17736A30552f4891A50904J35171a49397c0124D2139b03087O8169k3049A02268
$$ plain form
17725 -123856 80637 -35199 41338 -41491 -55878 202659 -318648 -173463 -28412 220735 -84576
17713 44968 32250 110891 205699 -297537 -200211 -4424 -53022 235976 -146118 92856 232031
17702 232031 151279 -136875 334504 -105958 -236064 -229186 -277445 -4457 -66369 5672 11216
17691 11216 -208026 -266560 466811 -171427 -129870 65935 280308 75528 -107743 -39291 279877
17679 -273212 274279 -108268 119668 119307 -129519 159517 308539 107932 -60243 -260182
17669 -260182 187766 317149 75080 144030 180228 -250639 69851 219407 39065 218221
17659 218221 30234 106032 -82222 15178 -78772 -30034 8371 29596 398907 175601 -48401
17647 2093 106378 65292 262645 -5444 -15307 -91628 116203 -49769 388767 158432 78737
$$ packed form
17725a23856H0637c5199D1338d1491j4387B02659c18648J45185b8412B20735h4576
17713D4968j2718P8641R4808b97537R7326d424m8598B35976a46118I2856J39175
17702B32031q0752a36875C34504a05958j30106O878m8259d457o1912E672N544
17691A1216b08026n8534D66811a71427M1557F5935K14373G5528a07743c9291B79877
17679b73212B74279a08268A19668l61a29519A59517J49022A07932f0243j99939
17669b60182A87766J29383G5080O8950L6198b50639F9851J49556C9065J79156
17659B18221C0234P5798h2222A5178g8772c0034H371K1225L69311A75601d8401
17647B093J04285m1086J97353e444r863p6321A16203d9769C88767A58432G8737
$$ plain form
17635 45371 -19062 -158123 73000 258158 209177 -131420 155342 -86983 142347 -11899 130379
17623 -158101 75860 83079 158259 300742 -118375 106550 9292 42266 82441 -77286 -193732
17612 -193732 -194071 174946 -53053 -110496 -104052 8128 489533 -305168 197593 -34569 206882
17600 -197323 130770 -192902 -126487 169471 -142698 -320122 -411985 46225 126392 -94865
17589 71626 -347800 149235 -11450 153401 167088 159475 -9621 68330 107068 -81100 -355099
17578 -355099 -52792 158163 62563 -5594 -264637 -305986 51722 -30316 -330593 -73934 32819
17566 106914 135697 193149 293943 81947 -8007 -33753 184920 150155 209381 85989 142915
17555 142915 147578 -26859 -358843 217364 -179997 -141361 -352882 178536 85239 246240
$$ packed form
17635D5371a9062j39061G3000J85158m8981a31420A55342h6983A42347a1899A30379
17623a58101G5860P219P5180J42483a18375A06550I292L2974M0175g7286j16446
17612a93732l39A74946e3053n7443O444H128M81405c05168A97593c4569B06882
17600a97323A30770a92902O6415A69471a42698j77424r1863D6225Q0167i4865
17589G1626c47800A49235a1450A53401J3687p613i621F8330L8738h1100k73999
17578c55099e2792A58163F2563e594k59043m1349E1722c0316l00277g3934C2819
17566A06914K8783N7452J00794H1947h007k5746A84920l4765N9226H5989N6926
17555A42915M663b6859l31984B17364a79997L8636k11521A78536H5239J61001
$$ plain form
17545 246240 129754 49146 22483 -153122 -92055 346860 -119305 4893 133765 52816 230191
17534 230191 62471 -149765 -263879 23601 44360 345083 38721 79615 -116449 -58579 272297
17522 190689 37182 -75411 45934 351496 -118924 158687 272179 34038 -30628 -361110
17512 -361110 160672 -145143 33930 251953 107151 329135 31178 86650 -29267 160349
17501 -235738 159299 160121 98139 168327 190802 268833 130819 164387 164294 254799 58163 286454
17489 286454 -146832 -12525 98309 324815 -55533 -113365 185343 165288 52002 215125 295325
17478 295325 81162 163847 126417 11376 -21953 -197980 178885 93389 322563 216151 -34573
17466 302426 -250592 111716 129231 -1594 230795 -40075 165672 435979 69655 -202378
$$ packed form
17545B46240j16486D9146B2483a53122O1067C46860a19305D893J28872E2816J77375
17534B30191F2471a49765j14114B3601K0759L00723C8721M0894a16449N7870B72297
17522A90689C7182g5411D5934L05562a18924A58687J13492C4038c0628l30482
17512c61110A60672a45143C3930K18023A07151K21984C1178N5472b9267A60349
17501b35738A59299Q22o1982P0188K2475P8031A30819L3568r3R0505E8163K28291
17489B86454a46832a2525I8309K26506e5533n7832A85343k0055E2002J63123Q0200
17478B95325H1162Q2685l7430A1376b1953j76027A78885q5496K29174j06412c4573
17466C02426b50592A11716J7515a594B30795d0075A65672K70307F9655b02378
$$ plain form
17455 377550 90697 87465 377791 378582 28986 299343 263126 231372 205950 438613 387900
17444 387900 97775 197104 48682 216230 270120 460568 29758 107644 113883 32383 231040
17433 231040 155245 201098 179958 99970 51361 8589 81727 241520 142634 138673 176204 351896
17421 351896 161097 -199709 150021 493548 367973 -74486 220895 352363 7064 268480
17411 268480 6787 -84362 146078 325568 143307 22488 285092 322952 202881 -51963 3470
17399 -125 -29517 136757 458401 89856 -16227 298335 259051 104533 116373 3397 45628
17388 45628 280635 -31799 186230 566588 537507 -132344 9537 225967 61377 96386 -31083
17376 106525 168583 -214004 -137305 303488 167310 82413 -39937 28411 106963 237246 63437
$$ packed form
17455C77550I0697l232K90326P91B8986K70357l6217l1754k5422K32663n0713
17444C87900I7775R9329D8682J67548N3890J90448B9758P7886O239C2383J98657
17433B31040p5795M5853k1140p9988m8609H589P3138J59793r8886l961L7531J75692
17421C51896A61097a99709A50021L43527j25575g4486B20895J31468G064K61416
17411B68480F787h4362A46078J79490A43307B2488K62604L7860j20071e1963C470
17399a25k9392A36757L21644H9856a6227B98335l9284A04533J1840C397M2231
17388D5628K35007c1799A86230L80358k9081a32344I537K16430F1377L5009c1083
17376A06525O2058b14004P6699C03488j36178H2413c9937B8411P8552J30283F3437
$$ plain form
17364 -227614 -2745 173094 -314909 90600 339046 438749 205704 -1006 -55131 520216 -34537
17352 53580 205146 241478 281225 182282 -335601 -59397 -164519 -37876 -92576 -49555 24035
17340 132075 -123064 -258422 46310 147121 330826 -125339 233716 -243534 55719 -43927
17329 12761 -242268 -118721 145688 74295 127763 -18375 -84946 134495 -15011 -31494 241030
17317 191369 -145841 110898 113525 207165 -67563 214471 180099 143875 80406 196263 174994
17306 174994 322013 363091 96974 58830 -41734 -136887 -55057 45042 82189 84282 336079
17295 336079 5590 242622 93637 84302 391361 198626 206742 193475 210172 223881 99015
17283 181795 -171555 250144 125103 180895 102500 374294 -46735 -90976 26672 -78245 -151653
$$ packed form
17364b27614b745A73094c14909I0600K48446R9703B05704a006n4125E20216c4537
17352E3580J51566L6332L9747r8943c35601e9397j05122c7876n4700M3021B4035
17340A32075a23064j35358D6310J00811J83705a25339B33716b43534E5719d3927
17329A2761b42268a18721A45688p1393N3468a8375o6571A34495a5011j6483B41030
17317A91369a45841A10898K627R3640f7563B14471l4372l6224o3469J15857k1269
17306A74994J47019M1078I6974l8144d1734r5153e5057D5042L7147K093K51797
17295C36079E590K37032I3637r335L07059j92735Q116j3267J6697J3709I9015
17283A81795a71555B50144j25041N5792p8395K71794d6735m4241B6672g8245p3408
$$ plain form
17272 -151653 184134 110631 267664 402151 149950 422158 -23320 -2630 268416 248161
17262 248161 19296 183366 127258 267018 -11073 -270024 206878 12261 293702 22547
17251 296542 512839 273045 -810 430694 -11667 541032 114323 309075 76975 309775
17241 309775 52050 62996 -237638 45075 -131973 -35885 612912 396685 16770 -156564
17230 238978 155210 141775 -67127 53281 75088 -293747 212279 247934 -20107 33898 101623
17219 101623 203749 284953 418596 17320 162937 232337 5282 294756 2369 223878 67167
17207 91867 342149 305483 297767 150170 442860 149910 235632 406306 231565 295290 283618
17196 283618 104216 242635 194862 419103 274121 2746 185780 200210 228190 89500 208691
$$ packed form
17272a51653A84134p3503J57033J34487A49950K72208b3320b630B68416k0255
17262B48161A9296J64070n6108J39760a1073k58951B06878A2261K81441B2547
17251B96542K16297k39794h10D30694a1667E41032A14323J94752G6975K32800
17241C09775E2050J0946b37638D5075a31973c5885F12912k16227A6770a56564
17230B38978q3768j3435f7127E3281K1807b93747B12279L5655b0107C3898O7725
17219A01623J02126Q1204J33643A7320J45617O9400E282K89474B369K21509F7167
17207I1867K50282l6666p716j47597K92690A49910Q5722J70674j74741O3725j1672
17196B83618A04216J38419m7773K24241j44982B746J83034J4430K7980H9500J19191
$$ plain form
17185 208691 201244 107514 684381 243257 220634 -324567 196884 63279 -20052 362152 338264
17174 338264 559400 319064 152347 379314 335849 408508 109916 445946 315341 57142
17163 245113 -186273 717287 -59442 104249 173251 294097 240952 267638 528820 485541
17153 485541 143741 398809 192272 158757 357177 252637 92189 127838 59677 164405
17143 164405 354726 102582 207866 490808 170231 123470 400912 203079 227124 191805
17133 191805 110373 287535 302182 3622 449905 379052 43246 227601 350957 565695 116977
17121 458384 387700 404684 74862 15613 -18400 2746 399971 307843 345096 315995 302888
17110 302888 507380 66115 127573 204287 348430 315153 162259 330406 276387 376406
$$ packed form
17185B08691p447r3730N76867B43257k2623c24567A96884F3279b0052C62152k3888
17174C38264K21136k40336A52347K26967m3465P2659A09916L36030j30605E7142
17163B45113a86273G17287e9442A04249O9002J20846n3145K6686K61182m3279
17153D85541A43741K55068A92272l3515J98420j04540I2189L5649E9677J04728
17143A64405J90321A02582J05284K82942A70231m6761K77442j97833K4045l5319
17133A91805q1432J77162J4647C622M46283p0853D3246J84355J23356K14738A16977
17121D58384p0684J6984G4862A5613a8400B746L97225r2128L7253k9101j3107
17110C02888K04492F6115O1458P6714J44143l3277j52894J68147n4019J00019
$$ plain form
17100 376406 310722 621479 168952 372004 349354 235821 584900 112715 177093 290256
17090 290256 320552 429130 89250 220733 220747 408033 188576 350054 492645 489075 629140
17079 629140 512887 446359 288986 141736 233835 278220 122218 195676 44309 452336
17069 452336 555159 542503 605319 202873 293411 545058 176146 437585 418543 6831 256417
17058 256417 176635 432094 685467 580527 218124 575688 406455 563742 738614 335961
17047 436138 451686 594088 443431 695475 113032 442730 334122 462656 366082 190061
17037 190061 679735 629527 966848 441003 351612 625459 419725 463852 608029 457941
17027 457941 567195 451872 455832 741016 267504 716966 754790 459696 912995 625445
$$ packed form
17100C76406o5684L10757A68952K03052k2650j13533L49079A12715O4378J13163
17090B90256L0296J08578H9250J31483J4J87286A88576J61478J42591l570J40065
17079F29140j16253o6528j57373A41736R2099M4385A22218P3458D4309M08027
17069D52336J02823j2656O2816B02873R0538K51647A76146K61439j9042F831K49586
17058B56417p9782K55459K53373j04940B18124L57564j69233J57287J74872C35961
17047D36138J5548J42402j50657K52044A13032L29698j08608J28534r6574j76021
17037A90061M89674n0208L37321D41003q9391K73847k05734M4127J44177j50088
17027D57941J09254j15323L960K85184B67504M49462L7824k95094M53299k87550
$$ plain form
17017 625445 435105 444847 888428 387535 622974 487396 483487 995497 177606 399925
17007 399925 346972 515712 514267 603777 768600 377946 483847 749278 595403 478147
16997 478147 539091 460506 498133 610703 671372 588141 229336 560106 321321 1017218
16987 1017218 797024 699072 537759 506455 938263 734263 272468 522217 725198 557103
16977 557103 660272 643134 558838 561196 733414 122854 895745 855133 753983 553153
16967 553153 880035 616775 753475 865218 825284 785636 848310 747941 723100 961742
16957 961742 834677 1049038 805120 711495 1159208 1010930 529449 1045040 930858 896562
16947 896562 742072 980181 751499 913950 1041640 934282 806939 995073 931028 905035
$$ packed form
17017F25445j90340R742M43581C87535K35439j35578l909N12010A77606K22319
17007C99925n2953J68740j445Q9510J64823C77946J05901K65431j53875j17256
16997D78147O0944p8585L7627J12570O0669q3231B29336L30770k38785O95897
16987A017218k20194r7952j61313l1304M31808k04000B72468K49749K02981j68095
16977E57103J03169j7138q4296K358J72218A22854P72891m0612j01150k00830
16967E53153L26882k63260J36700J11743l9934l9648O2674j00369k4841K38642
16957I61742j27065K14361k43918r3625M47713j48278m81481N15591j14182l4296
16947H96562j54490K38109k28682J62451J27690j07358j27343J88134o4045k5993
$$ plain form
16937 905035 1088551 1252866 957867 1043610 1229652 1140447 708559 1052857 754499 1176252
16927 1176252 770303 1319571 1013451 824491 1085184 907749 1067793 1210239 1325614
16918 1325614 1230378 1049650 1095638 970632 1152219 1098325 1269360 1074424 1387912 1516655
16908 1516655 1254978 1315226 1177963 1576719 1189601 1511294 1403340 1216263 1607787 1527429
16898 1527429 992805 1284670 1354527 1566004 1636033 1511654 1372243 1651143 1628819 1543852
16888 1543852 1855341 1867211 1222804 1721938 1616725 1890272 1926912 1874106 1798647 1696157
16878 1696157 1849985 1914985 2024145 2016632 1945533 1853534 1968695 2184291 2054334 2045563 1818848
16867 1818848 2317811 1940902 1989985 2167034 2060284 2051793 2214347 2148483 2399818 2362912
$$ packed form
16937I05035J83516J64315k94999Q5743J86042q9205m31888L44298k98358M21753
16927A176252m05949N49268l06120j88960K60693j77435J60044J42446J15375
16918A325614r5236j80728M5988j25006J81587n3894J71035j94936L13488J28743
16908A516655k61677O0248j37263L98756l87118L21693j07954j87077L91524q0358
16898A527429n34624K91865O9857K11477P0029j24379j39411K78900k2324q4967
16888A543852L11489J1870o44407M99134j05213K73547L6640n2806p5459j02490
16878A696157J53828O5000J09160p513p1099r1999J15161K15596j29957q771k26715
16867A818848M98963l76909M9083J77049j06750q491J62554o5864K51335l6906
$$ plain form
16857 2362912 2836212 2467923 2311165 2633570 2279695 2418095 2654277 2415407 2941760
16848 2941760 2866892 2677455 2727131 3022351 2950992 2847433 3155540 3110616 3243611 3075570
16838 3075570 3121846 3140253 3488065 3518849 3041496 3862811 3521176 3728372 3567258 3655318
16828 3655318 3744044 3754449 3828361 3850640 4475983 4306441 4068926 4316005 4385166 4378629 4562844
16817 4562844 4466010 4880516 4869466 4847381 5077201 5335962 5184540 5312553 5306428 5517605
16807 5517605 5443109 5847183 6030941 5775245 5937268 6404300 6216526 6515036 6793980 6789777
16797 6789777 7112633 7235897 7432265 7312504 7591426 7953765 8001001 8253174 8465823 8801621
16787 8801621 9007525 9053486 9134746 9737204 9927466 10543181 10583023 10827965 11401872 11434547
$$ packed form
16857B362912M73300l68289j56758L22405l53875J38400K36182k38870N26353
16848B941760p4868j89437M9676K95220p1359j03559L08107m4924J32995j68041
16838C075570M6276J8407L47812L0784m77353Q21315l41635K07196j61114Q8060
16828C655318Q8726J0405P3912K2279O25343j69542k37515K47079O9161o537J84215
16817D562844r6834M14506j1050k2085K29820K58761j51422J28013o125K11177
16807E517605p4496M04074J83758k55696J62023M67032j87774K98510K78944m203
16797F789777L22856J23264J96368j19761K78922L62339M7236K52173K12649L35798
16787H801621K05904M5961Q1260O02458J90262O15715L9842K44942N73907L2675
$$ plain form
16777 11434547 12164422 12531342 12921833 13363308 13555498 14260994 14801612 15423778 15968283
16768 15968283 16437382 16782644 17778657 18370277 18912480 19958061 20520812 21542463 22346329
16759 22346329 23651125 24046264 25448835 26659313 27826103 28817726 30419744 31985434
16751 31985434 33129368 34982776 36924244 38854218 40919578 43252800 45508290 48139603
16743 48139603 50976892 53829099 57537688 61144793 64650389 68861518 73763784 78630245
16735 78630245 83749357 89597354 95543104 102342488 109412033 116823800 124799400 133113403
16727 133113403 141843082 150641449 159775584 168738645 176933236 184991736 192001563 197733902
16719 197733902 202268325 204574783 205504391 204304027 201534802 196855304 190652873 183500754
$$ packed form
16777A1434547P29875L66920L90491M41475J92190P05496N40618O22166N44505
16768A5968283M69099L45262R96013N91620N42203J045581N62751J021651Q03866
16759B2346329J304796L95139J402571J210478J166790R91623J602018J565690
16751C1985434J143934J853408J941468J929974K065360K333222K255490K631313
16743D8139603K837289K852207L708589L607105L505596M211129M902266M866461
16735G8630245N119112N847997N945750O799384P069545P411767P975600Q314003
16727A33113403Q729679Q798367R134135Q963061Q194591Q058500P009827N732339
16719A97733902M534423K306458R29608j200364k769225m679498o202431p152119
$$ plain form
16711 183500754 175125822 166148645 157167058 147969363 138646072 130164017 121588696 113583296
16703 113583296 105771099 98571763 91992523 85913752 79986169 74722684 69897547 65456797
16695 65456797 61300038 57595837 53909296 50752480 47459887 44682237 42493835 40271982
16687 40271982 37895990 35949730 33847070 32001562 30607289 29143106 27507956 26271063
16679 26271063 25176830 23913495 22463214 21994599 20888262 20026029 19166997 18356857 17864702
16670 17864702 17137148 16526552 15708639 14983215 14785534 14066554 13668592 12995343 12633491
16661 12633491 12097454 11697269 11389177 11043736 10660836 10347548 10167403 10078861 9252909
16652 9252909 9210987 9411942 8759613 8406491 8320903 8123049 7736200 7385028 7042318 7262005
$$ packed form
16711A83500754q374932q977177q981587r197695r323291q482055q575321q005400
16703A13583296p812197p199336o579240o078771n927583n263485m825137m440750
16695F5456797m156759l704201l686541l156816l292593k777650k188402k221853
16687D0271982k375992j946260k102660j845508j394273j464183j635150j236893
16679B6271063j094233j263335j450281m68615j106337q62233q59032q10140m92155
16670A7864702p27554o10596q17913p25424j97681p18980l97962o73249l61852
16661A2633491n36037m00185l08092l45441l82900l13288j80145q8542q25952
16652I252909m1922K00955o52329l53122q5588j97854l86849l51172l42710K19687
$$ plain form
16642 7262005 7003842 6749969 6796413 6473426 6440720 6049314 5985423 5919690 5493613 5433609
16632 5433609 5510733 5347685 5083089 5227961 4802185 4834508 4491578 4760521 4301728 4281136
16622 4281136 3890872 4118276 4099850 4303742 3686040 3835518 3818395 3552073 3730486 3302737
16612 3302737 3398808 3213741 3368074 2998718 2931752 3044133 2941914 2913780 2926749 2774508
16602 2774508 2881534 2734464 2373371 2822629 2294953 2722273 2669358 2858988 2402255 2481704
16592 2481704 2488319 2330687 2354947 2175896 2318647 2374488 1818779 2154215 1725843 2123687
16582 2123687 1676346 1854645 1736233 2072247 1769093 2132779 2066029 1668182 1745387 1807579
16572 1807579 1750087 1998452 1552540 1504438 1908116 1660867 1463035 1518341 1526168 1507548
$$ packed form
16642G262005k58163k53873M6444l22987l2706l91406o3891o5733m26077o0004
16632E433609P7124j63048k64596J44872m25776L2323l42930K68943m58793k0592
16622D281136l90264K27404j8426K03892o17702J49478j7123k66322J78413m27749
16612C302737R6071j85067J54333l69356o6966J12381j02219k8134J2969j52241
16602B774508J07026j47070l61093M49258n27676M27320n2915J89630m56733P9449
16592B481704O615j57632K4260j79051J42751N5841n55709L35436m28372L97844
16582B123687m47341J78299j18412L36014l03154L63686o6750l97847P7205O2192
16572A807579n7492K48365m45912m8102M03678k47249j97832N5306P827j8620
$$ plain form
16562 1507548 1453293 1626181 1669732 1439869 1244825 1465003 1343289 1203133 1299661 1239290
16552 1239290 1108696 1031208 1219838 1274630 1250337 1330223 901382 1262118 1467080 1375572
16542 1375572 1096208 931277 914147 955831 1004853 1017639 1140585 1027463 1283260 1107300
16532 1107300 1160930 1035383 891586 998294 887671 1040441 905080 1240363 526512 946214
16522 946214 608661 1005606 993283 1173711 1090488 956249 768307 1050544 1079903 559707
16512 559707 463000 874392 716224 849404 806663 730598 821879 1174451 665051 528540
16502 528540 792040 909673 883514 801558 946431 766107 748895 678138 628614 501175
16492 501175 811000 417446 379359 508680 580908 528664 718527 512484 686461 549662
$$ packed form
16562A507548n4255J72888M3551k29863j95044K20178j21714j40156R6528o0371
16552A239290j30594p7488J88630N4792k4293P9886m28841L60736K04962r1508
16542A375572k79364j64931j7130M1684M9022J2786J22946j13122K55797j75960
16532A107300N3630j25547j43797J06708j10623J52770j35361L35283E26512M19702
16522I46214l37553L96945j2323J80428q3223j34239j87942K82237K9359n20196
16512E59707r6707M11392j58168J33180m2741p6065R1281L52572n09400j36511
16502E28540K63500J17633k6159q1956J44873j80324j7212p0757m9524j27439
16492E01175L09825l93554l8087J29321P2228n2244J89863k06043J73977j36799
$$ plain form
16482 549662 404650 585481 439077 430187 472686 695948 193532 449493 406877 311180
16472 311180 396424 440578 308092 458373 435151 336573 165138 521160 126026 573938
16462 573938 720145 267093 502836 570117 273302 598586 241701 558918 330960 494095
16452 494095 406953 590371 705142 167779 250527 278265 336207 501981 -7520 173236 490679
16441 490679 303967 346811 388825 523980 398522 231467 220490 139781 112316 335004
16431 335004 114482 315372 269425 253704 147548 138389 276129 357155 315160 508079 383901
16420 383901 281917 272733 21818 269907 301178 345689 408048 453821 231670 349466 395806
16409 395806 109553 537493 62419 400373 455984 256137 399561 204567 253591 189798
$$ packed form
16482E49662j45012J80831j46404q890M2499K23262A93532K55961m2616r5697
16472C11180Q5244M4154j32486J50281k3222r8578A65138L56022A26026M47912
16462E73938J46207B67093K35743O7281B73302L25284B41701L17217k27958J63135
16452D94095q7142J83418J14771A67779Q2748K7738N7942J65774g520A73236L17443
16441D90679j86712M2844M2014J35155j25458j67055j0977q0709k7465K22688
16431C35004A14482K00890m5947j5721j06156r159J37740Q1026m1995J92919j24178
16420C83901j01984r184B1818K48089L1271M4511O2359M5773k22151J17796M6340
16409C95806A09553M27940F2419L37954N5611j99847J43424j94994M9024o3793
$$ plain form
16399 189798 15998 143313 -44122 428026 254808 11734 237646 -103913 71218 312348
16389 312348 351597 255777 275029 635731 136606 386032 219232 102439 368418 549810
16379 549810 379053 242925 191704 378690 293112 172212 376212 155624 92531 77273
16369 77273 274132 446027 362884 31363 195296 -24670 369347 114789 123349 48719 -123173
16357 112863 162764 135044 237116 156175 295498 194027 130119 249181 -25452 107488
16346 -97845 88027 199259 129630 572191 56548 384619 260792 325469 183840 567984
16336 567984 55795 526268 -180627 -18375 426986 -28900 371728 451490 232884 298571
16326 298571 -94076 264721 357842 30313 71980 240804 -117873 263665 259881 19991 344420
$$ packed form
16399A89798A5998J27315d4122D28026j73218A1734K25912a03913G1218K41130
16389C12348L9249r5820J9252L60702A36606K49426j66800A02439K65979J81392
16379E49810j70757j36128n1221J86986q5578j20900K04000A55624o3093j5258
16369G7273J96859J71895q3143C1363J63933b4670C69347A14789Q560D8719a23173
16357A12863M9901k7720J02072q0941J39323j01471o3908J19062b5452A07488
16346i7845H8027J11232o9629M42561E6548L28071j23827O4677j41629L84144
16336E67984E5795M70473a80627a8375D26986b8900C71728P9762k18606O5687
16326B98571i4076B64721R3121C0313M1667J68824a17873B63665l784A9991L24429
$$ plain form
16315 344420 40983 -76585 224844 61245 392808 555954 164459 139960 421826 167868
16304 358113 290639 67770 312566 231334 153508 146872 234805 6473 104166 -19902 -168075
16293 -168075 220986 162971 105074 151100 292571 44817 -66506 -207322 273367 -26143 91446
16281 -9338 -164873 151876 -126185 220338 266970 -44399 86624 67152 342330 134409 -7853
16269 100454 344529 148754 220915 -407396 -22342 44707 127851 268435 123541 69265
16259 69265 112693 395206 205058 -354533 -79103 157209 171298 -14003 106296 13103 198111
16248 198111 41455 -10506 254081 249877 149508 32554 217808 -282343 32542 182470 -76818
16236 -26822 -75416 221004 67074 181827 -98445 77540 -142852 97469 291663 137116 30522
$$ packed form
16315C44420D0983g6585B24844F1245L31563J63146A64459k4499K81866A67868
16304C58113o7474F7770K44796q1232p7826o636Q7933F473R7693a9902j48173
16293a68075B20986n8015n7897M6026J41471D4817f6506j40816B73367b6143I1446
16281i338j55535A51876a26185B20338M6632d4399H6624j9472K75178A34409g853
16269A00454K44075A48754P2161d07396b2342D4707Q3144J40584A23541n4276
16259F9265M3428K82513j90148c54533g9103A57209J4089a4003A06296A3103J85008
16248A98111D1455a0506B54081m204j00369C2554J85254b82343C2542J49928g6818
16236b6822m8594B21004F7074J14753i8445G7540a42852I7469J94194A37116C0522
$$ plain form
16224 125492 312394 -148951 -235786 49196 -88034 264176 175663 34885 -264669 -23895 36333
16212 261594 164721 213170 -67855 102097 -356963 -106483 131145 -13840 193385 85086
16201 -106944 343296 5119 -79460 -131620 161228 84568 -153724 20393 335520 122585 180504
16190 180504 165316 -46810 128147 42004 106352 56188 -224408 71368 94431 151363 -254269
16178 -57357 51326 31787 104549 -134132 218368 90307 -101076 -92465 -56167 10776 -285363
16166 -40381 -96540 -58916 -27479 414111 -162051 239221 120232 19584 148353 -91338 381981
16154 -55938 -114657 91852 -44499 -158760 -191725 121256 11532 40615 -302400 653091 -17209
16142 60148 55185 174475 366136 8284 -151002 146306 149184 98150 -100392 98384 -166139
$$ packed form
16224A25492J86902a48951q6835D9196h8034B64176q8513C4885b64669b3895C6333
16212B61594r6873M8449f7855A02097c56963a06483A31145a3840A93385H5086
16201a06944C43296E119g9460n2160A61228p6660a53724B0393L15127A22585N7919
16190A80504j5188d6810A28147D2004O4348n0164b24408G1368K3063N6932b54269
16178e7357E1326j9539P2762a34132B18368I0307a01076Q611L6298A0776b85363
16166d0381n6159L7624b7479D14111a62051B39221j18989A9584J28769i1338C81981
16154e5938n8719I1852d4499j14261l2965A21256A1532K9083c02400F53091a7209
16142F0148m963J19290J91661H284a51002A46306K878n1034a00392I8384a66139
$$ plain form
16130 -57407 361357 -89607 134727 160465 109672 -7028 -335669 63283 -8598 -287381 -83006
16118 -190660 302837 143045 -211807 -195128 29266 -20896 -442658 2479 135942 43358 54976
16107 54976 330544 -35847 100208 74285 -55152 267995 193872 309791 539627 170032
16096 -162064 25911 -43211 182100 100437 -213060 -182155 -4437 189213 97518 14364 -131119
16084 234283 -29123 -121576 34107 -339509 -205301 -173917 291427 -320592 -426917 52650
16073 88933 -54571 132616 24540 -69423 77468 -279072 207953 -189722 80121 -117412 -18396
16061 -231105 -235289 -215981 -261021 138346 -267041 108790 -88861 8306 23096 54965 47381
16050 47381 30729 203990 -39860 441365 -194372 -156531 4439 -386619 -222082 -189321 236757
$$ packed form
16130e7407C61357h9607A34727K5738n0793g028l28641F3283h598k78783h3006
16118a90660C02837A43045b11807J6679B9266b0896m21762B479J33463D3358J1618
16107E4976K75568c5847A00208k5923e5152B67995p4123J15919K29836A70032
16096a62064B5911d3211A82100q1663b13060L0905d437A89213r1695A4364a31119
16084B34283b9123r2453C4107c39509J34208L1384B91427c20592j06325E2650
16073H8933e4571A32616B4540f9423G7468b79072B07953a89722H0121a17412a8396
16061b31105m184J9308m5040A38346b67041A08790h8861H306J4790L1869p584
16050D7381j6652J73261c9860D41365a94372L7841D439c86619J64537L2761B36757
$$ plain form
16038 223826 67976 561790 -45603 88894 -20537 -44355 -202929 40226 -251918 -91583 -36245
16026 -85997 236564 -196575 200728 -222942 -119542 46253 -394157 -149119 79805 -483924
16015 344311 259743 34361 16346 -64366 -4312 190888 64367 -184301 -55008 -54755 87291 99361
16003 99361 -11223 -100034 46675 -153112 -21249 -222463 -143277 -9617 -14508 379445 -122655
15991 136969 -338818 -110153 76235 274591 -16234 97324 143316 249478 174235 105807 49310
15979 299431 17415 -105487 421280 -39014 -54799 -152263 -192054 -105554 -249346 -22958 -114429
15968 -114429 40338 -192456 -208667 -18574 112255 -38916 323014 77952 40404 123253 -168232
15956 -9058 -351541 -131494 -3809 -164546 -249846 -110126 108148 -162847 -55408 -245877 -260513
$$ packed form
16038B23826F7976M93814d5603H8894b0537k3818j58574D0226b51918i1583c6245
16026h5997B36564a96575B00728b22942J03400D6253c94157a49119G9805d83924
16015C44311q4568C4361A6346f4366d312A90888F4367a84301e5008K53H7291J2070
16003I9361a1223q8811D6675a53112b1249k01214P9186i617m891C79445a22655
15991A36969c38818a10153G6235J98356a6234I7324M5992J06162p5243o8428D9310
15979B99431A7415a05487D21280c9014j5785r7464l9791Q6500j43792b2958r1471
15968a14429D0338a92456j6211a8574A12255c8916C23014G7952l7548Q2849a68232
15956i058l42483a31494c809j60737q5300a10126A08148a62847e5408j90469j4636
$$ plain form
15945 -260513 -282591 -31426 -11453 -60717 -410491 -112194 -146668 38434 10276 49401 -131432
15933 51444 3781 -346470 223750 -224333 126508 -96380 -10963 32087 150266 -187260 -19575
15921 -6271 371135 -41263 -189803 -31728 -179617 -226687 264312 -6401 -119430 -99772 -120861
15910 -120861 -256532 -65042 137938 -177461 -51300 18912 -120456 -263605 -127141 -398748
15900 -398748 148686 179969 45005 -266318 80582 5216 -283077 -74919 -286300 -145687 232848
15888 125528 255893 -50522 -315760 -157398 104934 251899 -262991 -194661 362289 341653
15878 341653 4452 -148111 283673 124133 -433340 62952 -6789 -6132 76832 17047 -130098
15866 -180350 75171 -262584 -75492 137423 -29800 -226986 63534 -163494 -200959 -51623 264685
$$ packed form
15945b60513k2078c1426a1453m9264l49774a12194l4474C8434A0276L9125a31432
15933E1444C781c46470B23750b24333A26508i6380a0963C2087J18179a87260a9575
15921f271C71135d1263j48540c1728j47889m7070B64312f401j13029J9658k1089
15910a20861j35671f5042A37938a77461e1300A8912a20456j43149a27141k71607
15900c98748A48686L1283D5005b66318H0582E216b83077g4919k11381J40613B32848
15888A25528J30365e0522k65238a57398A04934J46965b62991O8330C62289k0636
15878C41653D452a48111B83673A24133d33340F2952f789O57G6832A7047a30098
15866a80350G5171b62584g5492A37423b9800j97186F3534a63494l7465e1623B64685
$$ plain form
15854 -75356 -294127 -333255 -332278 292902 198963 91131 223426 132465 -155997 -16537 -46611
15843 -46611 -78070 3433 -170130 12074 -202245 64353 -48851 -98511 -150132 59835 5957 -23842
15830 -172565 189745 42758 -68080 -101620 118360 -63094 198170 -55371 -267533 -17022 -34321
15819 -34321 71542 -243043 -308714 -206850 98479 -151797 -157474 -161507 130614 -82097 99216
15807 -159976 -615 -141569 -357555 202879 166959 201754 -286879 -85348 136799 -19055 -193320
15796 -193320 47124 2186 -41653 -11149 105311 -96982 48199 -129641 496159 -185281 -70529
15784 -131882 -54625 -37610 -27992 37363 -102996 45444 -219956 -239718 -253427 -126127 -289959
15773 -289959 910 33060 13792 15497 -322164 -71120 -39333 68448 -224654 -79768 -110633 -282905
$$ packed form
15854g5356k18771l9128R77B92902r3939I1131J32295r0961a55997a6537l0074
15843d6611l1459C433a70130A2074b02245F4353d8851m9660n1621E9835E957b3842
15830a72565A89745D2758f8080l3540A18360f3094A98170e5371k12162a7022j7299
15819c4321G1542b43043o5671J01864I8479a51797n677m033A30614h2097I9216
15807a59976f15j40954k15986B02879l5920L4795b86879h5348A36799a9055j74265
15796a93320D7124B186d1653a1149A05311i6982D8199a29641D96159a85281g0529
15784a31882e4625J7015R618C7363a02996D5444b19956j9762j3709a26127j63832
15773b89959I10L2150A3792J705c22164g1120L1787F8448b24654g9768l0865j72272
$$ plain form
15761 -282905 -120210 153214 39547 143336 105853 -116530 112069 -370651 -354670 940 22928
15750 22928 114104 -105477 84644 127509 -182476 108697 -61498 6317 184801 158703 125432
15739 125432 371582 -21850 -214177 114556 24802 372451 -210499 108215 -121542 -101808
15729 -101808 35076 82693 5472 -55238 -39632 17710 26722 356685 -197417 80972 -384468
15717 -199864 -11696 115094 -287031 -125919 -172776 51682 22905 48883 -89840 -314973 257768
15705 152049 -35058 -182434 -320710 419932 -192910 265418 -117317 -239407 -260577 453573
15694 -91265 -421761 55747 -50810 214556 -311025 -10435 157051 -56940 -175332 -50245 -112719
15683 -112719 -278777 40874 -260673 -370328 201908 -111141 82253 16761 -181831 -66876
$$ packed form
15761b82905a20210A53214C9547J03789l7483a16530A12069c70651J5981I40K1988
15750B2928R1176a05477H4644M2865a82476A08697f1498F317J78484k6098l3271
15739A25432K46150b1850j92327A14556B4802L47649b10499A08215a21542J9734
15729a01808C5076M7617E472e5238J5606A7710R012L29963a97417H0972c84468
15717a99864a1696A15094b87031a25919m6857E1682B2905K5978h9840k25133B57768
15705A52049c5058j47376j38276D19932a92910B65418a17317j22090k1170D53573
15694i1265l30496E5747e0810B14556c11025a0435A57051e6940j18392e0245o2474
15683a12719j66058D0874b60673j09655B01908a11141H2253A6761a81831f6876
$$ plain form
15672 73862 183934 -15654 72084 32245 70743 60107 113575 394897 366839 -171596 -63545
15660 -48609 23797 -220607 -42230 140498 -138097 -16114 -147851 53389 -126472 22519 13668
15649 13668 194743 383484 -95870 131708 -124428 -95173 50148 -256752 -78371 229837
15638 14121 108433 -1806 -286450 -54928 210781 -114378 -425848 -178947 85516 166871 -45434
15626 -220517 -23569 271516 126808 64182 85210 10423 88757 59588 61897 101910 -182819
15614 -69585 -55669 -165043 -304245 252382 -22139 -152025 -241209 -90129 255102 65007 36905
15603 36905 -177911 -420680 66043 2073 -184167 -349214 107425 69749 66824 13009 -197724
15591 -206283 -121672 -109247 56482 -13717 21332 32770 245917 -201238 -69642 -138224 123671
$$ packed form
15672G3862J10072a5654G2084C2245L8498j0636N3468K81322k8058a71596f3545
15660d8609B3797b20607d2230A40498a38097a6114j31737E3389a26472B2519q851
15649A3668J81075J88741i5870A31708a24428K9255E0148b56752g8371B29837
15638A4121R4312a806k84644e4928B10781a14378l11470a78947H5516Q1355d5434
15626b20517b3569B71516A26808o2626K1028A0423P8334k9169K309M0013a82819
15614f9585J3916j09374j39202B52382b2139j29886q9184i0129B55102F5007k8102
15603C6905a77911k42769F6043B073a84167j65047A07425l7676k925A3009a97724
15591b06283Q4611J2425E6482a3717B1332J1438K13147b01238f9642o8582A23671
$$ plain form
15579 145734 -274502 190860 -15615 -26927 -206285 -37501 91694 -42369 24509 -162991 -211958
15568 -211958 -283289 -266199 126601 -124252 134578 -149417 -55509 -45429 149901 156951 -183188
15556 -189226 -313058 -43750 97833 350449 151249 -152887 -224338 -37615 -526738 -266800
15546 -266800 -91721 -77247 8305 -188936 -97390 150513 79825 -26285 89553 -16227 50139
15534 96401 -146367 -70164 82146 122900 55606 -287034 324646 160373 34481 -61519 84191
15522 -50259 -164220 -43998 268702 -79968 96336 83137 -246605 -142484 5193 126901 167500
15511 167500 74358 210671 56453 -220264 13124 -20772 69810 -169439 -276432 -121990
15500 -47683 -107999 67068 246661 4240 363814 -197458 24185 41680 262746 -89594 -169925
$$ packed form
15579A45734b74502A90860a5615j1312j79358c7501I1694d2369B4509a62991m8967
15568b11958p1331J7090A26601a24252A34578a49417e5509J0080A49901P050a83188
15556a89226j23832d3750I7833K52616A51249a52887p1451c7615m89123K59938
15546b66800i1721J4474H305a88936R1546A50513p0688b6285H9553a6227E0139
15534I6401a46367g0164H2146M0754E5606b87034C24646A60373C4481f1519H4191
15522e0259j13961d3998B68702g9968I6336j3199b46605J04121E193J21708M0599
15511A67500G4358J36313E6453b20264A3124b0772F9810a69439j06993a21990
15500d7683o0316F7068J79593D240L59574a97458B4185J7495K21066h9594q0331
$$ plain form
15489 -169925 -77215 -117986 -409205 -92921 -41877 229646 -284858 -60988 -173830 -308114
15479 -308114 -118759 -72161 -17423 -203877 58958 69787 74307 -39146 -115919 -190355 9466
15467 -111194 -106614 -64997 29304 -111298 -206042 101699 -266402 308982 216104 -143967 -578335
15456 -578335 -16669 -54456 156043 -162515 286155 -156976 77548 -114389 50398 113131
15446 113131 -57041 86202 124302 -92952 106929 17701 -89577 70967 75723 190907 -152259
15434 167058 26932 -84954 -53325 6079 315989 143132 -359540 -83767 -206501 -78467 -23068
15422 -119906 -142827 385880 60086 -255629 17482 -189447 -78200 156897 -64084 -130451 50599
15410 321207 -144376 141298 155488 -180212 43179 -439234 33895 183600 -56909 74233
$$ packed form
15489a69925g7215m0771k91219i2921d1877B29646b84858f0988j12842j34284
15479c08114a18759M6598a7423j86454E8958J0829M520c9146p6773p4436I466
15467a11194M580M1617B9304a11298r4744A01699b66402C08982r2878a43967m34368
15456e78335a6669l7787A56043a62515B86155a56976G7548a14389E0398O2733
15446A13131e7041H6202L8100i2952A06929A7701h9577G0967M756J15184a52259
15434A67058B6932h4954L1629F079L09910A43132c59540h3767j22734g8467b3068
15422a19906k2921C85880F0086b55629A7482a89447g8200A56897f4084o6367E0599
15410C21207a44376A41298J4190a80212D3179d39234C3895J49705e6909G4233
$$ plain form
15399 122316 49898 -116943 239527 289582 -68668 -235421 -15345 -29234 1040 -70830 140263
15387 71215 -51925 301672 -27329 215306 19626 -25174 110891 145503 -150297 147158 14511
15375 -180160 19543 27278 -205340 -64811 44421 -225298 92022 143378 -79150 -113981 131287
15363 99718 -209669 -265539 -99118 3333 -74322 55222 -383910 76018 26355 203146 5178
15351 -71314 -101365 -25031 231375 52105 -97385 -231709 -362565 95394 118758 338383 -63296
15339 -85885 65433 -71615 -144015 -102934 -154672 68206 -29950 -126555 -220407 -125395 249037
15327 446305 -54447 221933 -254329 69098 67198 -83332 -23585 -224154 -291049 54779 231534
15316 231534 349501 95308 15101 44220 -246657 101704 138889 414296 -287999 169906
$$ packed form
15399A22316D9898a16943B39527N0055f8668j66753a5345j3889A040g0830A40263
15387G1215e1925C01672b7329B15306A9626b5174A10891L4612a50297A47158A4511
15375a80160A9543P735b05340f4811D4421b25298I2022N1356g9150l4831A31287
15363I9718b09669n5870i9118C333g4322E5222c83910G6018B6355J76791E178
15351g1314l0051b5031B31375E2105i7385j34324j30856I5394K3364K19625f3296
15339h5885F5433g1615p2400M1081n1738F8206b9950r6605r3852R5012B49037
15327D46305e4447B21933b54329F9098j900h3332b3585k00569o6895E4779J76755
15316B31534J17967I5308A5101K9119b46657A01704L7185K75407b87999A69906
$$ plain form
15305 -69151 177223 -147714 -196974 -11790 192583 -86116 299519 -11841 -172225 199907
15294 116608 213816 -113243 58923 83276 824 308302 60314 -6185 118572 -11086 -19361 97873
15281 -163012 -80726 252098 -70801 178518 159024 173123 144639 92387 64287 299204 59080
15269 -149367 -114055 239746 -32738 -3523 -229774 -49253 28753 191335 50669 -153152 236456
15257 161845 129123 -144774 47385 339605 -53436 -5614 347359 107808 278008 208809 1692619
15246 1692619 1289702 1227553 1809315 614366 169797 32025 -147798 -140552 158022 384827
15236 384827 -189985 -157064 122539 -112271 112415 -208773 262043 70345 42205 -129191
15225 54901 -103720 -87839 -21730 27164 -292596 111919 -199372 -114898 -137614 68572 -20528
$$ packed form
15305f9151A77223a47714m9260a1790A92583h6116B99519a1841j60384A99907
15294A16608R7208a13243E8923K4353H24L07478F0314f185A18572a1086q275I7873
15281a63012h0726B52098g0801A78518j9494J4099k8484n2252k8100K34917E9080
15269a49367L5312B39746c2738c523k26251d9253B8753J62582E0669a53152B36456
15257A61845l2722a44774D7385K92220e3436e614C47359A07808J70200o9199J483810
15246A692619m02917o2149N81762F14366A69797C2025a47798P246A58022K26805
15236C84827a89985L2921A22539a12271A12415b08773B62043G0345k8140a29191
15225E4901a03720J5881b1730B7164b92596A11919a99372Q4474k2716F8572b0528
$$ plain form
15213 367633 200326 352540 -85951 -25479 267258 -127061 82598 -153365 292069 88349
15202 -114864 -10905 -170303 -231755 91753 65458 55484 160189 79436 -125883 -56362 5029
15190 -61139 -4310 54593 114323 190599 -156772 86721 405655 73166 33723 382510 -56188
15178 -385 221223 256394 58600 211172 248352 137578 89061 157074 306474 26605 15575
15167 15575 195906 104256 150274 34479 13040 -41725 -219360 225259 231580 59995 -161308
15155 127861 -113455 333855 75493 110690 9431 -431253 -235305 -31556 -331931 316195
15144 150452 -39734 -79083 144588 95988 234902 26368 -172395 303944 -128350 -89239
15134 -89239 231351 226845 11028 133459 49074 175473 254953 -69457 87263 164688 23890
$$ packed form
15213C67633j67307J52214h5951b5479B67258a27061H2598a53365B92069H8349
15202a14864a0905j59398o1452I1753k6295r974J04705G9436a25883e6362E029
15190f1139d310E4593N9730P6276a56772H6721L18934G3166C3723L48787e6188
15178c85B21223L5171E8600J52572L7180j10774m8517O8013J49400B6605j1030
15167A5575J80331r1650M6018C4479A3040d1725j77635B25259O321E9995a61308
15155A27861a13455C33855G5493L5197I431d31253J95948c1556l00375C16195
15144A50452c9734l9349A44588m8600J38914B6368a72395C03944a28350L9111
15134h9239B31351m506A1028J22431D9074J26399P9480f9457H7263P7425B3890
$$ plain form
15122 209632 -141133 220450 -202936 206536 276689 70064 311374 -224358 96437 -179714
15111 -88901 -161623 233864 209346 258801 132703 -259689 -148490 135617 198153 -137965
15100 215332 255684 275042 205949 228835 38602 157497 96895 153819 213035 58778 56586
15089 56586 388854 77866 206207 -36528 57497 42055 -75034 83881 55254 5877 -111402
15077 164655 -97003 71324 145835 49541 -356137 103410 170738 133018 71984 366818 429513
15066 429513 29777 -184552 -148571 192385 93846 202003 229274 347848 175827 -17338
15055 254714 304276 100494 130296 -31935 130396 205913 373298 309638 13428 303320 176837
15044 176837 178447 280361 88839 242192 250767 321415 -16325 259966 554367 -45092 121490
$$ packed form
15122B09632a41133B20450b02936B06536P0153G0064K41310b24358I6437a79714
15111h8901p2722B33864k4518M9455j26098b59689J11199A35617O2536a37965
15100B15332M0352J9358o9093K2886C8602J18895o0602N6924N9216E8778k192
15089E6586L32268G7866J28341c6528E7497j5442g5034H3881k8627E877a11402
15077A64655i7003G1324P4511D9541c56137A03410O7328l7720o1034K94834O2695
15066D29513B9777a84552L5981A92385I3846J08157K7271J18574j72021a7338
15055B54714M9562A00494K9802c1935A30396P5517J67385o3660A3428K89892j26483
15044A76837J610J01914H8839J53353Q575P0648a6325B59966K94401d5092A21490
$$ plain form
15032 242948 75019 -195541 -53549 234287 167696 -46688 80313 235485 406132 105826
15021 86105 89803 217869 318953 222779 -125553 -91740 249877 -61327 85401 -50977 -60743
15010 -60743 357235 -49021 53483 205097 184563 161703 292645 265761 103289 101722 237012
14999 237012 171819 176316 392609 152686 96113 78624 243590 301095 210710 187758 216682
14988 216682 169168 228034 373737 97855 196393 162081 182067 322096 320803 458858 436257
14977 436257 42915 379662 213945 10594 110138 294145 349966 116869 142466 204847 195670
14966 195670 70648 550842 348836 174533 423158 215577 292088 476185 -12221 287428
14955 222602 47096 163415 191446 461633 145715 -10272 13616 47440 241307 264799 362942
$$ packed form
15032B42948G5019a95541e3549B34287o6591d6688H0313J55172J70647A05826
15021H6105L698J28066J01084r6174a25553L3813B49877f1327H5401e0977r766
15010f0743C57235d9021E3483J51614k0534k2860J30942k6884A03289j567J35290
14999B37012o5193M497K16293A52686n6573j7489J64966N7505r0385k2952K8924
14988B16682m7514N8866J45703I7855R8538l4312J9986J40029j293J38055k2601
14977D36257D2915L36747j65717A0594R9544J84007N5821A16869K5597O2381r177
14966A95670G0648M80194k02006j74303K48625k07581P6511J84097a2221B87428
14955B22602D7096J16319K8031K70187A45715a0272A3616L3824J93867K3492R8143
$$ plain form
14944 362942 14030 180957 158440 86896 52188 28472 386177 44879 99024 547467 329290
14933 329290 197650 240201 269733 349065 65547 182472 276614 239257 116639 161933 269394
14922 269394 171938 297117 65084 216915 362893 303467 504632 302595 393164 161668
14911 218470 196380 328276 85680 200912 168237 362610 420456 430882 228432 45879 238100
14900 238100 420005 298942 109351 364801 203263 320158 163679 104090 68355 120635
14890 120635 541945 253634 108226 272260 468035 316839 513186 528627 563834 313736
14880 313736 378482 176665 102513 334122 604788 210599 274761 60851 158267 361159
14870 361159 108549 238824 419592 546103 47224 455147 218339 455738 447586 448244 175684
$$ packed form
14944C62942A4030J66927k2517p1544l4708k3716L57705D4879N4145M48443k18177
14933C29290j31640M2551K9532P9332F5547J16925R4142l7357A16639M5294J07461
14922B69394r7456J25179F5084J51831J45978n9426K01165k02037R0569A61668
14911B18470k2090J31896H5680J15232l2675J94373N7846J0426k02450D5879J92221
14900B38100J81905j21063A09351K55450j61538J16895j56479n9589l5735N2280
14890A20635M21310B53634A08226J64034J95775j51196J96347J5441L5207k50098
14880C13736O4746A76665p4152K31609K70666B10599O4162F0851R7416K02892
14870C61159A08549J30275J80768J26511D7224M07923B18339K37399q152O58A75684
$$ plain form
14858 121217 98316 277852 425881 318687 516555 395144 230226 340247 238923 343457
14848 343457 231001 28782 -157390 245693 -9913 658478 184938 179180 172154 515730 684286
14837 684286 431519 456105 350356 371085 226937 107418 448144 266851 487488 340926
14827 340926 381611 383554 500528 388107 333979 536598 299805 744504 501231 707860
14817 707860 173668 816237 712511 662484 552801 731685 566438 387953 441746 381239
14807 381239 457354 311643 644472 457207 466254 143676 184947 251260 467088 623443
14797 623443 254102 100420 441228 246318 343149 437339 707882 606052 209244 648270
14787 648270 178719 427803 273641 415264 284908 181431 610792 446293 512084 305163
$$ packed form
14858A21217k2901J79536J48029j07194J97868j21411j64918J10021j01324J04534
14848C43457j12456B8782a57390B45693i913F58478A84938n758p026L43576J68556
14837F84286k52767K4586j05749K0729j44148A07418L40726j81293K20637j46562
14827C40926M0685J943J16974j12421n4128K02619k36793M44699k43273K06629
14817G07860A73668O42569j03726n0027j09683J78884j65247j78485N3793o0507
14807C81239P6115j45711L32829j87265R047A43676M1271O6313K15828J56355
14797F23443B54102A00420L40808j94910R6831R4190K70543j01830B09244M39026
14787F48270A78719K49084j54162J41623j30356j03477M29361j64499O5791k06921
$$ plain form
14777 305163 452963 467891 558606 292812 539704 609560 744060 669965 592127 322438
14767 322438 421163 463703 731344 603081 376899 188252 707044 494418 554493 734526
14757 734526 193749 498513 509954 544184 624538 781644 988802 532802 490672 340580
14747 340580 459074 528929 783921 513288 688852 487304 414180 489986 238790 707292
14737 707292 747869 809476 548068 910508 811707 712771 668772 736763 456434 589913 559324
14726 559324 702161 441681 527532 437093 823033 741684 526012 803023 685032 841367
14716 841367 827529 864182 911393 923314 837396 629088 466453 523601 819043 789024 935482
14705 935482 761474 621604 704201 773985 307548 706905 525878 904895 999724 699131
$$ packed form
14777C05163J47800J4928R0715k65794K46892O9856J34500p4095p7838k69689
14767C22438R8725M2540K67641j28263k26182A88252N18792k12626O0075J80033
14757G34526A93749L04764J1441L4230Q0354J57106K07158m56000m2130j50092
14747C40580J18494O9855K54992k70633J75564k01548p3124P5806B38790M68502
14737G07292M0577O1607k61408L62440r8801r8936m3999O7991k80329J33479l0589
14726E59324J42837k60480Q5851r0439L85940q1349k15672K77011j17991J56335
14716H41367j3838L6653M7211J1921q5918k08308j62635N7148K95442l0019J46458
14705I35482j74008j39870Q2597O9784C07548L99357j81027L79017R4829l00593
$$ plain form
14695 699131 663271 880027 872717 688704 766482 748262 535392 1075656 763547 893261
14685 893261 1197496 876817 881108 928102 500764 1122374 1002907 1036336 969466 587787
14675 587787 925826 942116 984471 1045966 945628 987350 1017599 650692 915085 1172030
14665 1172030 594832 1085406 713447 749659 1001201 1059236 1001697 849111 838534 890914
14655 890914 900207 503943 1316785 1224611 969448 1055558 1126687 1213599 647531 1129291 673925
14644 673925 1269042 1122100 1218036 1108033 1119155 1139235 994204 1319864 1352121 1252195
14634 1252195 1253935 1108995 1104534 958127 973473 693521 1137335 1397805 1405130 1099800 1110949
14623 1110949 1034581 1055738 1128739 1247493 1220997 1457431 1490584 1512481 1333429 1318383 1375684
$$ packed form
14695F99131l5860K16756p310j84013P7778j8220k12870N40264l12109J29714
14685H93261L04235l20679M291M6994m27338O21610j19467L3429o6870l81679
14675E87787L38039J6290M2355O1495j00338M1722L0249l66907K64393K56945
14665A172030n77198M90574l71959L6212K51542N8035n7539j52586j0577N2380
14655H90914R293l96264Q12842r2174k55163Q6110P1129Q6912n66068M81760m55366
14644F73925N95117j46942R5936j10003J1122K0080j45031L25660L2257r9926
14634A252195J740j44940m461j46407J5346k79952M43814K60470P325l05330J1149
14623A110949p6368K1157P3001J18754k6496K36434L3153K1897j79052j5046N7301
$$ plain form
14612 1375684 1314313 1112296 1157735 1214746 1142870 1166173 1593405 1341792 1479813 1446780
14602 1446780 1446937 1517272 1322028 1347466 1675273 1375852 1132198 1469859 1368990 1381132
14592 1381132 1462399 1648492 1535216 1535700 1365524 1419722 1591322 1477528 1608627 1752122
14582 1752122 1626128 1789758 1447631 1442911 1865657 1660742 1984947 1770438 1854923 2052445
14572 2052445 2040959 2037668 1978690 1869436 1423282 1580109 2169425 1713076 1852247 2071795
14562 2071795 2191951 2167217 2212780 2533933 2597733 2867901 2830700 3091518 3045342 3123853
14552 3123853 3435713 3941712 4882395 6540132 9621607 17938648 42142499 45904566
14544 45904566 16644275 9057131 3924692 2307473 1979922 1935780 1732384 1787683 1553928
$$ packed form
14612A375684o1371k02017M5439N7011p1876K3303M27232k51613J38021l3033
14602A446780J57P0335j95244K5438L27807k99421k43654L37661j00869J2142
14592A381132Q1267J86093j13276M84j70176N4198J71600j13794J31099J43495
14582A752122j25994J63630l42127m720M22746k04915L24205k14509Q4485J97522
14572B052445j1486l291n8978j09254m46154J56827N89316m56349J39171K19548
14562B071795J20156k4734M5563L21153O3800K70168l7201K60818m6176P8511
14552C123853L11860N05999R40683J657737L081475Q317041K4203851L762067
14544D5904566A6644275p587144C924692j617219l27551m4142k03396N5299k33755
$$ plain form
14535 1553928 1438910 1739533 2086993 1567780 1773465 1890728 1938984 1908900 1980478 2101957
14525 2101957 1931166 2155416 2020338 1708739 2144613 2291169 2301521 2426341 2406736 2517756
14515 2517756 2471740 2346424 2248526 2392727 2673321 2430000 2420336 2487140 2217366 2538176
14505 2538176 2695038 2658527 2564438 2831223 2620264 2737054 2747488 2868145 2909672 2514045
14495 2514045 2913432 2795924 2966138 3090753 2984496 3030485 3061783 3026908 3312236 3068322
14485 3068322 3222967 3130845 3329765 3522664 3334824 3480392 3494717 3691122 3107319 3553844
14475 3553844 3689079 3348574 3555107 3946345 3720718 3784819 3718748 4242964 4032533 3889316
14465 3889316 4075785 3784286 4023104 3947406 4254589 4096110 4344194 4552484 4351952 4225045
$$ packed form
14535A553928j15018L00623L47460n19213K05685J17263M8256l0084P1578J21479
14525B101957j70791K24250j35078l11599M35874J46556J0352J24820j9605J11020
14515B517756m6016j25316r7898J44201K80594k43321r664O6804k69774L20810
14505B538176J56862l6511r4089K66785k10959J16790J0434J20657M1527l95627
14495B514045L99387j17508J70214J24615j06257M5989L1298l4875K85328k43914
14485C068322J54645r2122J98920J92899j87840J45568J4325J96405n83803M46525
14475C553844J35235l40505K06533L91238k25627O4101o6071N24216k10431j43217
14465C889316J86469k91499K38818p5698L07183j58479K48084K08290k00532j26907
$$ plain form
14455 4225045 4675454 4823784 4605007 4542593 4574401 4714403 4411811 4789505 4899735 4942933
14445 4942933 4908932 4978649 4943329 5312360 5412466 5140945 5175273 5534340 5442075 5851454
14435 5851454 5573830 5708365 5597354 5740977 6111168 5949415 6060735 6450527 6369125 6149196
14425 6149196 6383600 6580392 6678867 7021796 7294839 7221748 7318117 7293368 7238851 7407552
14415 7407552 7818747 7595551 7624538 7931289 7988486 8102551 7964080 8247786 8345722 8463196
14405 8463196 8718954 9055509 8977213 9073544 9058976 9539296 9457807 9711626 9797974 9766541
14395 9766541 10031699 10341896 10482550 10492215 10727173 11064125 11331907 11403189 11466604 11945254
14385 11945254 11796762 12340512 12474241 12437570 12707410 13006077 13238973 13805558 13837756 13832584
$$ packed form
14455D225045M50409J48330k18777o2414L1808J40002l02592L77694J10230M3198
14445D942933l4001O9717l5320L69031J00106k71521L4328L59067r2265M09379
14435E851454k77624J34535j11011J43623L70191j61753J11320L89792q1402k19929
14425F149196K34404J96792R8475L42929K73043p3091R6369k4749n4517J68701
14415G407552M11195k23196K8987L06751N7197J14065j38471K83706R7936J17474
14405H463196K55758L36555p8296R6331j4568M80320q1489K53819Q6348l1433
14395I766541K65158L10197J40654R665K34958L36952K67782P1282O3415M78650
14385A1945254j48492N43750J33729l6671K69840K98667K32896N66585L2198n172
$$ plain form
14375 13832584 14127309 14731506 14605390 14775425 15620250 15901927 16432549 16413982 16827704
14366 16827704 16740021 17486223 17778163 18125284 18424406 18686906 19062071 19727087 20680371
14357 20680371 20333871 21310647 21373014 22412648 22323755 23251184 24000567 24105471 24918530
14348 24918530 25684512 26297343 26971260 27501381 28347353 29260776 29888719 30663209 31324573
14339 31324573 32133230 33120293 33969271 35198394 36312507 37186209 38827112 39453838 40760941
14330 40760941 42410922 43762509 44887783 46538633 47645377 49460630 51451248 52923536
14322 52923536 55098911 56812369 59026964 61224210 63588083 65758931 68169496 70980839
14314 70980839 73719438 77033914 79664746 83041897 86750150 90466132 94295746 98375696
$$ packed form
14375A3832584K94725O04197j26116J70035Q44825K81677N30622j8567M13722
14366A6827704q7683P46202K91940L47121K99122K62500L75165O65016R53284
14357B0680371l46500R76776O2367J039634q8893R27429P49383J04904Q13059
14348B4918530P65982O12831O73917N30121Q45972R13423O27943P74490O61364
14339C1324573Q08657R87063Q48978J229123J114113Q73702J640903O26726J307103
14330D0760941J649981J351587J125274J650850J106744J815253J990618J472288
14322E2923536K175375J713458K214595K197246K363873K170848K410565K811343
14314G0980839K738599L314476K630832L377151L708253L715982L829614M079950
$$ plain form
14306 98375696 102741773 107720526 112344941 117578720 123040600 129381868 135137868 142197663
14298 142197663 149497528 156793801 164502917 173229788 182458863 191840034 202354933 213179519
14290 213179519 224515661 236539438 249198516 262428226 276480719 290930001 305941309
14283 305941309 321002326 336771930 352558121 368461848 383620237 397848529 411672753
14276 411672753 424552316 435579038 444896784 450786273 453355975 454658073 453688360 451385080
14268 451385080 448841081 443385506 434706372 424618605 412588340 398065798 382734348
14261 382734348 367391188 351129297 334913508 319020794 303514077 288296938 273238761
14254 273238761 259777820 246791715 233932482 221268528 209917061 199104984 188716702
$$ packed form
14306I8375696M366077M978753M624415N233779N461880O341268N756000P059795
14298A42197663P299865P296273P709116Q726871R229075R381171J0514899J0824586
14290B13179519J1336142J2023777J2659078J3229710J4052493J4449282J5011308
14283C05941309J5061017J5769604J5786191J5903727J5158389J4228292J3824224
14276D11672753J2879563J1026722R317746N889489K569702J302098r69713k303280
14268D51385080k543999n455575q679134j0087767j2030265j4522542j5331450
14261C82734348j5343160j6261891j6215789j5892714j5506717j5217139j5058177
14254B73238761j3460941j2986105j2859233j2663954j1351467j0812077j0388282
$$ plain form
14247 188716702 179036891 170246321 161656092 153726792 146205597 139011878 132549061 126035123
14239 126035123 119944600 115259209 109925784 105164765 100345984 96123681 92057122 88118856
14231 88118856 85492246 81643721 78190206 75335186 72276970 69302477 66691920 64237195
14223 64237195 61809297 59751572 57486566 55902835 54244712 51844048 50604947 48827160
14215 48827160 47396257 46140835 44691777 43105919 41696281 40367861 39243091 38529833
14207 38529833 37928484 36618256 35377453 34286575 33065017 31894796 31683493 31487744
14199 31487744 29980867 29236236 28501844 27518131 26919460 26446414 25765831 24957239 24451399
14190 24451399 24135302 23343365 23048126 22213492 21777523 21553182 20528522 20498631 20070250
$$ packed form
14247A88716702r679811q790570q590229p929300p521195p193719o462817o513938
14239A26035123o090523m685391n333425m761019m818781m222303m066559l938266
14231H8118856k626610l848525l453515k855020l058216k974493k610557k454725
14223F4237195k427898k057725k265006j583731j658123k400664j239101j777787
14215D8827160j430903j255422j449058j585858j409638j328420j124770p13258
14207C8529833o01349j310228j240803j090878j221558j170221k11303j95749
14199C1487744j506877p44631p34392r83713n98671m73046o80583q08592n05840
14190B4451399l16097p91937k95239q34634m35969k24341j024660k9891m28381
$$ plain form
14181 20070250 19062715 19216538 18570774 18112299 17851209 17591166 17037042 16365410 16614432
14172 16614432 16163009 15408845 15469548 14699910 14814470 14576745 14199434 14112927 13553341 13546981
14162 13546981 13116967 13117204 12694576 12596757 12254472 12011689 11974474 11549873 11538848 11611393
14152 11611393 11249955 11123678 10876443 10572037 10450830 10231650 10063995 10018020 10253124
14143 10253124 9632137 9471189 9486593 9216632 9082386 8967175 8767245 8831183 8456860 8327694
14133 8327694 8195487 8041634 8048421 7659792 7563169 7867572 7834157 7427555 7462078 7103017
14123 7103017 7404653 7121209 6982847 6902611 6985266 6654782 6469962 6505900 6559925 6301245
14113 6301245 6296203 6387616 6015975 5978474 6046110 5709931 5815687 5793303 5658585 5855392
$$ packed form
14181B0070250j007535J53823o45764m58475k61090k60043n54124o71632K49022
14172A6614432m51423p54164O0703p69638J14560k37725l77311q6507n59586o360
14162A3546981m30014K37m22628r7819l42285k42783l7215m24601j1025P2545
14152A1611393l61438j26277k47235l04406j21207k19180j67655m5975K35104
14143A0253124o20987j60948J5404k69961j34246j15211j99930O3938l74323j29166
14133H327694j32207j53853O787l88629r6623L04403l3415m06602L4523l59061
14123G103017L01636k83444j38362q0236Q2655l30484j84820L5938N4025k58680
14113F301245n042R1413l71641l7501O7636l36179J05756k2384j34718J96807
$$ plain form
14103 5855392 5393352 5304464 5299187 5459564 5144575 5333683 5341995 5188705 5140003 5204052 5257290
14092 5257290 4683301 4867346 4919056 4906123 4750966 4795218 4494112 4513601 4684373 4602891
14082 4602891 4398185 4300285 4275771 4334525 4166550 4252510 4112308 3960513 4333125 3586001
14072 3586001 3987293 3753442 4014149 4002174 3738995 3720291 3865000 3457037 3609923 3566424
14062 3566424 3683400 3654840 3265556 3688511 3505986 3840089 3295410 3520250 3648677 3486027
14052 3486027 3019060 3208587 3136502 3102357 3106335 3086277 3157236 3108672 2918557 3062775 2939261
14041 2939261 2939342 2799690 2807630 2713225 2919323 2895150 2937668 2574704 2714676 2800198 2709762
14030 2709762 2881227 2941556 2528505 2491904 2757342 2152990 2584424 2225476 2467978 2316819
$$ packed form
14103E855392m62040q8888n277J60377l14989J89108Q312j53290m8702O4049N3238
14092E257290n73989J84045N1710j2933j55157M4252l01106J9489J70772q1482
14082D602891k04706r7900k4514N8754j67975Q5960j40202j51795L72612p47124
14072C586001M01292k33851K60707j1975k63179j8704J44709m07963J52886m3499
14062C566424J16976k8560l89284M22955j82525L34103n44679K24840J28427j62650
14052C486027m66967J89527p2085l4145L978k0058P0959m8564j90115J44218j23514
14041B939261Q1j39652P940r4405K06098k4173M2518l62964J39972Q5522r0436
14030B709762J71465O0329m13051l6601K65438o04352M31434l58948K42502j51159
$$ plain form
14020 2316819 2287011 2144170 2285523 2352765 2343511 2310724 2369976 2339443 2149336 1892453 1984553
14009 1984553 2240821 2400802 2200349 2180844 1973506 1751170 2022870 2269510 1714229 1527962
13999 1527962 2181706 1750908 1668297 1986539 1874032 2076404 2043630 1893500 2020792 2174159
13989 2174159 2982297 5194961 11547126 34498592 49465794 22002976 10245090 6244637
13981 6244637 4817929 3927869 3293219 3204429 3001926 2781872 3013456 2542014 2631453 2645955
13971 2645955 2259755 2283775 2313564 2035879 2198647 1736462 1833773 1910716 1781695 1771021
13961 1771021 2089139 1640413 1853073 2001855 1914360 1569719 1843647 1609872 1668752 1806397
13951 1806397 1620680 1487461 1938141 1558246 1842107 1419856 1722461 1750910 1685540 1473208
$$ packed form
14020B316819k9808j42841J41353O7242r254l2787N9252l0533j90107k56883R2100
14009A984553K56268J59981k00453j9505k07338k22336K71700K46640n55281j86267
13999A527962O53744m30798q2611L18242j12507K02372l2774j50130J27292J53367
13989B174159Q08138K212664O352165K2951466J4967202B2002976A0245090m000453
13981F244637j426708q90060o34650q8790k02503k20054K31584m71442Q9439J4502
13971B645955l86200K4020K9789k77685J62768m62185R7311P6943j29021j0674
13961A771021L18118m48726K12660J48782q7495l44641K73928k33775N8880J37645
13951A806397j85717j33219M50680l79895K83861m22251L02605K8449o5370k12332
$$ plain form
13941 1473208 1620115 1712903 1554918 1635445 1522847 1636238 1521534 1234288 1740979 1680537
13931 1680537 1533119 1623161 1653507 1347275 1783516 1361282 1503769 1424264 1533968 1134791
13921 1134791 1033221 1330422 1345209 1219200 1478632 1125759 1237524 1380540 1249600 1469679
13911 1469679 1048834 1227851 1048326 1454030 747476 1247853 1291312 1167896 1282436 1830058
13901 1830058 1243186 784226 1350770 1217257 1155324 1320971 969030 1370044 1046554 817691
13891 817691 1001025 1031854 1169322 1112801 1454766 1255121 1303544 1022770 1267932 1113980
13881 1113980 1232086 1093376 913994 1155175 1160340 1210007 1083979 586250 908578 849895
13871 849895 1036113 974891 1099059 800550 1078377 1185921 972904 944580 1136856 883173
$$ packed form
13941A473208J46907R2788j57985Q0527j12598J13391j14704k87246N06691o0442
13931A680537j47418R0042L0346l06232M36241m22234J42487p9505J09704l99177
13921A134791j01570K97201J4787j26009K59432l52873J11765J43016j30940K20079
13911A469679m20845J79017j79525M05704p06554N00377M3459j23416J14540N47622
13901A830058n86872m58960N66544j33513o1933J65647l51941M01014l23490k28863
13891H17691J83334L0829J37468n6521L41965j99645M8423k80774K45162j53952
13881A113980J18106j38710j79382K41181N165M9667j26028m97729L22328n8683
13871H49895J86218o1222J24168k98509K77827J07544k13017k8324J92276k53683
$$ plain form
13861 883173 999332 1071955 794940 1123140 340535 1037891 853186 1102982 825268 1095457
13851 1095457 939409 927507 829009 913742 708863 727505 737700 1001065 733360 811054
13841 811054 1358429 1194748 942548 967322 1137237 1049766 903402 783191 586125 938563
13831 938563 743800 716934 686821 864876 793542 829391 776875 657812 553467 890217
13821 890217 769016 601279 1014474 672311 640853 378482 930808 450753 961792 618220
13811 618220 1218347 871564 471203 831320 818000 706885 1042867 946117 429600 320892
13801 320892 757753 841859 824779 621890 678773 1279740 518616 536884 801828 724296
13791 724296 676631 462645 627001 649711 567346 943925 483575 1013788 510551 313281
$$ packed form
13861H83173J16159P2623k77015L28200C40535O97356j84705K49796k77714K70189
13851A095457j56048j1902r8498Q4733k04879J8642J0195K63365k67705P7694
13841H11054N47375j63681k52200K4774J69915q7471j46364j20211j97066L52438
13831I38563j94763k6866l0113J78055p1334L5849n2516j19063j04345L36750
13821H90217j21201j67737M13195l42163l1458k62371N52326D50753N11039l43572
13811F18220O00127l46783m00361L60117j3320j11115L35982r6750D29600j08708
13801C20892M36861Q4106j7080k02889N6883O00967E18616J8268K64944p7532
13791G24296m7665k13986J64356K2710q2365L76579m60350N30213n03237j97270
$$ plain form
13781 313281 561821 644459 570909 771577 698053 421462 710043 825404 800839 378452
13770 778206 910784 481551 1034342 672934 465607 612814 585554 485816 422606 694935
13760 694935 481320 1018300 778709 530454 506773 486727 500389 69278 761326 644082
13750 644082 951177 787222 284543 668888 617133 537651 731648 600510 615019 555958
13740 555958 542579 193213 477376 683407 502697 475328 390077 447382 630220 619395
13730 619395 274642 527019 73250 688739 487295 500029 563564 250602 446011 706255
13720 706255 410752 286887 595394 662661 473278 867950 759590 660755 387532 345240
13710 345240 364990 180923 528890 179387 632376 533785 472363 351960 365346 578041
$$ packed form
13781C13281K48540Q2638p3550K00668p3524k76591K88581J15361k4565C78452
13770G78206J32578m29233N52791l61408k07327J47207k7260r9738o3210K72329
13760F94935k13615N36980k39591k48255k3681k0046J3662F9278O92048j17244
13750F44082L07095j63955B84543L84345n1755p9482J93997j31138J4509n9061
13740E55958j3379A93213K84163K06031j80710k7369q5251N7305J82838j0825
13730F19395B74642K52377G3250O15489k01444J2734O3535B50602J95409K60244
13720G06255k95503j23865L08507O7267j89383L94672j08360r8835k73223m2292
13710C45240J9750A80923L47967A79387M52989r8591o1422j20403J3386K12695
$$ plain form
13700 578041 626323 253376 370119 429574 374884 789935 477733 415973 755362 447026
13690 447026 544209 429764 376041 512547 190735 354807 438692 -84382 404210 397082 454293
13679 454293 182907 540815 369486 380423 538894 713811 401531 428449 357538 342868
13669 342868 547398 343513 521012 647390 584361 645946 540665 425072 384477 377054
13659 377054 711157 338779 236566 554004 282096 410452 172203 554480 120203 337800
13649 337800 558682 282312 542934 573264 572790 425526 172446 368705 566044 235465
13638 -53479 -47553 383969 581206 691314 330330 -2000 364286 413486 237918 226336 424269
13627 424269 102044 219098 314337 443711 307880 482734 463260 677862 354165 644795
$$ packed form
13700E78041M8282B53376J16743N9455n4690M15051l12202o1760L39389l08336
13690D47026R7183j14445n3723J36506A90735J64072Q3885h4382D04210p128N7211
13679D54293A82907L57908j71329J0937J58471J74917l12280K6918p0911j4670
13669C42868K04530k03885J77499J26378o3029O1585j05281j15593m0595p423
13659C77054L34103C38779j02213L17438k71908J28356A72203L82277A20203K17597
13649C37800K20882k76370K60622L0330m74j47264A72446J96259J97339B35465
13638e3479N926C83969J97237J10108C30330b000C64286M9200j75568j1582J97933
13627D24269A02044J17054R5239J29374j35831J74854j9474K14602l23697K90630
$$ plain form
13617 644795 309052 115531 507760 355590 407708 244050 389983 86327 231683 408344
13607 408344 301457 395524 422610 217864 568759 269272 352759 123945 366848 61296
13596 -174949 326462 610440 547098 188583 308688 631630 435884 363426 550030 441117
13586 441117 314597 228928 539482 430015 674728 152681 328743 339194 199956 471015
13576 471015 264463 435176 477733 314212 378620 206010 394831 424072 135660 289509
13566 289509 431128 466642 763996 58807 444799 72924 535580 198470 327020 179354
13556 179354 319156 398452 180726 346679 418027 -147905 166595 79797 66109 395215
13546 395215 223747 580875 363432 28621 312447 349464 45117 204817 159839 86055
$$ packed form
13617F44795C09052A15531L92229j52170N2118j63658J45933H6327J45356J76661
13607D08344j06887R4067K7086k04746L50895B69272Q3487A23945K42903F1296
13596a74949C26462K83978o3342A88583J20105L22942j95746p2458J86604j08913
13586D41117j26520q5669L10554j09467K44713A52681J76062J0451j39238K71059
13576D71015k06552J70713M2557j63521O4408j72610J88821K9241A35660J53849
13566B89509J41619L5514K97354E8807L85992G2924M62656A98470J28550j47666
13556A79354J39802P9296A80726J65953P1348a47905A66595G9797j3688L29106
13546C95215j71468L57128k17443B8621K83826L7017D5117J59700m4978p3784
$$ plain form
13536 86055 261286 471892 -46339 -147846 605634 -18123 122500 331984 124080 138146
13526 138146 431787 266128 330959 114953 63072 205505 356552 153121 342984 -28204
13515 270176 343322 -10547 235333 210825 187402 542403 367802 363258 448619 126729 258584
13504 258584 283809 356 51003 221823 49894 154826 308801 642512 381414 6199 74443
13493 74443 401402 11917 124698 41431 227864 133682 220585 82289 251156 243232 202135
13482 202135 256553 514774 387934 -55269 266708 136646 197343 73801 174910 -38596
13471 164015 173821 196608 16763 51737 384466 119122 305446 364099 405095 127371 -60894
13459 473935 56393 -28057 130463 56548 165234 106167 369073 284957 162539 -151808
$$ packed form
13536H6055J75231K10606d6339j01507F05634a8123A22500K09484A24080J4066
13526A38146K93641j65659O4831A14953n1881J42433J51047A53121J89863b8204
13515B70176P3146a0547B35333k4508k3423L55001j74601m544Q5361A26729J31855
13504B58584K5225C56N0647J70820D9894J04932J53975L33711k61098F199O8244
13493G4443L26959A1917J12781D1431J86433r4182Q6903H2289J68867p924m1097
13482B02135N4418K58221j26840e5269B66708j30062O0697G3801J01109c8596
13471A64015R806K2787A6763L4974L32729A19122J86324N8653M0996A27371f0894
13459D73935E6393b8057A30463E6548J08686n9067K62906q4116j22418a51808
$$ plain form
13448 -23981 124824 247294 12768 125680 93340 276043 248171 244775 441046 3315 454063
13437 454063 50455 333684 -54419 446100 95692 107316 168216 178910 591120 214401 313323
13426 313323 204947 534122 151569 -52927 -195412 418745 -208707 76318 174943 32814
13415 129438 374169 230573 98368 115790 130536 -44751 -78139 70232 155536 374502 148970
13403 9344 170305 291177 272285 22167 92403 85889 364665 144307 85143 334781 281516
13392 281516 401818 221518 394409 287893 340841 138379 57287 143583 194582 365558
13382 365558 -148026 -9327 474955 -154676 417668 251255 77603 138987 350139 217790
13372 217790 124140 128671 9080 102478 202956 229204 300226 129263 298764 265338 331312
$$ packed form
13448b3981A24824J22470A2768J12912l2340J82703k7872l396J96271C315M50748
13437D54063E0455K83229e4419D46100I5692J1624O0900J0694M12210B14401R8922
13426C13323j08376L29175A51569e2927j42485D18745b08707G6318R8625C2814
13415A29438K44731j43596I8368J7422J4746d4751l3388G0232Q5304K18966A48970
13403I344J60961J20872j8892B2167P0236o514K78776A44307n9164K49638n3265
13392B81516J20302j80300J72891j06516N2948A38379E7287Q6296N0999J70976
13382C65558a48026i327D74955a54676D17668j66413G7603O1384K11152j32349
13372B17790r3650M531I080R3398J00478K6248P1022A29263J69501l3426O5974
$$ plain form
13361 331312 123521 332839 131243 389992 400832 229067 180102 249250 338054 41083
13350 86189 279659 -65913 -4601 95575 -247760 347494 35328 138997 506822 118375 278896
13339 278896 574504 425463 338317 201513 83436 590843 404152 345306 285 94613 156358
13328 156358 401543 26736 -67668 252108 133652 167222 128671 252655 25012 104611 400383
13317 400383 240641 -28126 338756 222019 3178 175968 37467 34144 345264 16935 224406
13306 224406 90806 293718 -68846 142831 -24861 -17003 -28852 177451 163232 364859 -18434
13294 102702 198309 158506 680435 -18547 80713 244321 -87225 -158202 -22090 216973 113399
13283 113399 154256 70857 -66101 193161 -56479 361202 260125 -130140 59328 -36619 201460
$$ packed form
13361C31312A23521K09318A31243K58749J0840j71765m8965O9148Q8804D1083
13350H6189J93470f5913d601I5575b47760C47494C5328J03669L67825A18375J60521
13339B78896K95608j49041q7146j36804H3436N07407j86691n8846B85R4328O1745
13328A56358K45185B6736f7668B52108j18456L3570l8551J23984B5012P9599K95772
13317D00383j59742b8126C38756j16737C178J72790C7467l323L11120A6935K07471
13306B24406I0806K02912f8846A42831b4861P858j1849A77451j4219K01627a8434
13294A02702R5607l9803N21929a8547H0713J63608h7225p0977b2090B16973j03574
13283A13399M0857G0857f6101A93161e6479C61202j01077a30140E9328c6619B01460
$$ plain form
13271 27340 267923 55628 -24602 85287 252668 -192637 359075 276525 334137 -299096 -32538
13259 161266 329526 144212 -58669 81966 180499 230427 367496 54850 263603 -190261
13248 351559 264269 324069 66418 -57786 23429 112303 153569 569265 65306 106595 21518
13236 30032 -138549 -335110 53113 95429 363541 229943 32503 344038 275867 187705 -38906
13224 -21579 94217 324616 -77189 55587 5753 -11372 361061 -45570 137558 -50619 241827
13212 324374 78706 529300 120415 157590 -114335 -54516 188240 223907 274166 193281 -105155
13200 -35735 247267 -88218 218563 -116061 -22722 -201527 230614 345012 17348 76680
13190 76680 207373 -95755 -6900 -116053 60156 -129400 182141 244989 48502 160443 61627
$$ packed form
13271B7340K40583E5628b4602H5287J67381a92637C59075q2550N7612b99096c2538
13259A61266J68260A44212e8669H1966R8533M9928J37069E4850K08753a90261
13248C51559q7290N9800F6418e7786B3429Q8874M1266M15696F5306M1289B1518
13236C0032a38549j96561E3113M2316K68112j33598C2503L11535o8171q8162c8906
13224b1579I4217K30399g7189E5587E753a1372C61061d5570A37558e0619B41827
13212C24374G8706M50594A20415L7175a14335e4516A88240L5667N0259q0885a05155
13200c5735B47267h8218B18563a16061b2722j78805B30614J14398A7348N9332
13190G6680J30693i5755f900j09153F0156a29400A82141O2848D8502J11941F1627
$$ plain form
13178 -58745 238012 33224 -240388 19840 146691 31764 511210 21615 189414 68902 -14875
13166 -209804 -278480 78411 -9283 -52791 225703 79288 -63929 32561 121788 84760 328459
13155 328459 -43377 -46596 317101 200300 -312316 239410 157125 187505 -1331 -52991 160563
13143 61205 -22367 15404 47999 260445 64973 76542 -184640 -86117 421558 -113835 -55796
13131 -24452 160181 89594 -21205 33178 37973 -210772 222363 -18466 -52362 40882 438122
13120 438122 181872 -90549 2769 152737 53616 2961 -181024 -52936 112070 167637 -284912
13108 -4791 585505 -83786 274436 231209 -215429 162145 457502 -29382 71691 -22182 -69483
13097 -69483 -318051 -267483 134698 89698 115151 -117662 114336 -165122 189888 111233
$$ packed form
13178e8745B38012C3224b40388A9840J26851C1764M79446B1615J67799F8902a4875
13166b09804o8676G8411i283m3508B25703G9288f3929C2561Q9227l7028K43699
13155C28459d3377l219C17101j16801c12316B39410q2285L0380a331n1660A60563
13143F1205b2367A5404L2595K12446F4973J1569a84640h6117D21558a13835e5796
13131b4452A60181p0587b1205C3178M795b10772B22363a8466l3896D0882L97240
13120D38122A81872i0549B769J49968E3616B961a81024e2936A12070N5567b84912
13108d791E85505h3786B74436m3227b15429A62145K95357b9382G1691b2182m7301
13097f9483k48568N0568A34698m5000K5453a17662A14336a65122A89888p8655
$$ plain form
13087 111233 -235419 16984 235529 341384 43034 -165254 -126591 -12663 -85347 -124410 33749
13075 86311 -72852 -62052 316886 124581 166356 42029 294328 203665 -97063 -78095 453661
13063 66586 144661 212151 367896 157602 56196 172160 -120833 100843 506358 327786
13053 327786 151561 343497 325773 92029 264661 219806 147649 142667 -24081 235669 166209
13042 166209 103224 -141474 279197 -248377 174181 -4146 55146 5507 83800 200663 143534
13031 143534 92731 1195 74730 124266 124673 240896 -27245 317672 60857 63282 -91127 193260
13018 345723 -44407 174958 48267 220037 -74662 257561 340337 410840 164698 317414
13008 317414 119378 150478 143879 -200845 81918 80249 381390 -32018 191228 397920 -100320
$$ packed form
13087A11233b35419A6984K18545J05855D3034a65254L8663a2663p2684l9063C3749
13075H6311g2852J0800C16886A24581M1775D2029K52299r0663i7063J8968D53661
13063F6586P8075O7490J55745A57602E6196J15964a20833A00843M05515j78572
13053C27786A51561J91936j7724I2029J72632m4855p2157m982b4081B35669o9460
13042A66209o2985a41474B79197b48377A74181d146E5146E507P8293J16863n7129
13031A43534n0803A195P3535M9536M07J16223b7245C17672F0857K425i1127A93260
13018C45723d4407A74958D8267J71770g4662B57561Q2776P0503A64698J52716
13008C17414A19378L1100o599b00845H1918j669L01141c2018A91228K06692a00320
$$ plain form
12996 109494 -3537 35014 112606 97243 351942 -26483 -287829 214996 -109103 -115842 175885
12984 -241595 -110455 102876 447637 241209 166081 -9268 98904 22354 7662 157798 118778
12973 118778 89227 281089 -30751 39448 48366 -75743 25134 68775 271978 -117830 159689
12961 18906 -141083 -54799 -16090 118007 -12416 24500 3632 43117 -138651 43350 -15818
12949 259073 169105 228402 -17528 14081 345938 58344 -146305 -116217 62659 219615 117129
12938 117129 -196830 -9786 -202825 -33787 255429 -83816 187951 -8879 -119378 165265 -130736
12926 -6533 -107217 7796 -74118 76105 -87250 18501 324429 -335234 -198572 212019 -25927
12914 -42499 -72469 47151 463104 423910 -57659 126885 -63798 -35914 288056 89449 -95657
$$ packed form
12996A09494c537C5014P7592j5363K54699b6483k61346B14996a09103o739A75885
12984b41595a10455A02876L44761k06428p5128i268I8904B2354G662J50136l9020
12973A18778k9551J91862c0751C9448Q918g5743B5134M3641K03203a17830A59689
12961A8906a41083e4799a6090A18007a2416B4500C632L9485a38651D3350a5818
12949B59073q9968N9297a7528A4081L31857E8344a46305L0088F2659J56956j02486
12938A17129a96830i786j93039c3787B55429h3816A87951h879j10499A65265a30736
12926f533j00684G796g4118G6105h7250A8501L05928c35234J36662B12019b5927
12914d2499k9970D7151M15953l9194e7659A26885f3798K7884B88056H9449i5657
$$ plain form
12902 -239529 58800 -125951 78330 25982 -299870 -27119 234783 303007 66815 198332 -170201
12890 -104790 144869 -122485 205359 164066 127627 -587 18328 -104748 117701 154421 -4900
12878 -22598 -134553 269145 103262 97387 -60712 -153494 41703 61081 37392 7346 -329230
12866 -240091 -77084 -142563 -47283 463875 -445934 106070 -48249 381836 206269 -120964
12855 -62800 107237 237625 -13308 96466 -220094 334732 -265659 36471 211824 -10041
12844 29767 114331 63610 202860 13709 158968 -64974 -106539 -342154 90051 -103114 -49805
12832 14490 -138569 7601 -76839 19236 382397 -95108 -228664 302095 -240964 432679 53289
12820 -115114 -123213 154768 -65744 140264 -278418 66414 280142 -397232 -241813 29414
$$ packed form
12902b39529E8800a25951G8330B5982b99870b7119B34783O8224F6815J31517a70201
12890a04790A44869a22485B05359m1293l6439e87A8328a04748A17701L6720d900
12878b2598j11955B69145A03262n875f0712r2782D1703J9378k3689G346c29230
12866b40091g7084o5479d7283D63875d45934A06070d8249C81836j75567a20964
12855f2800A07237J30388a3308I6466b20094C34732b65659C6471J75353a0041
12844B9767Q4564n0721J39250A3709J45259f4974m1565k35615I0051a03114d9805
12832A4490a38569G601g6839A9236L63161i5108j33556C02095b40964D32679E3289
12820a15114q099A54768f5744A40264b78418F6414K13728c97232J55419B9414
$$ plain form
12809 185933 11444 338301 -53415 328905 -242864 -232965 129725 150691 50251 -184917 -224548
12798 -224548 477114 -96999 -230536 11158 75030 76932 -79847 303802 -81159 -56255 575
12786 -295233 431078 -287472 -28306 73514 -457503 -34194 -153603 120862 151116 -2203 289036
12774 72596 -64962 10692 9667 -117961 148269 -121410 -218344 -74345 83394 -79907 -115728
12763 -115728 -39477 218124 -14003 -178215 -187619 97672 164410 189461 76241 145182 122254
12752 122254 -52412 -56117 -82402 187072 17606 -47017 97878 -5792 -202527 187187 800 -128455
12739 -30732 14863 -220442 47210 104503 106593 93004 87063 40058 238236 76600 -98779 752
12726 -179444 85999 -83284 133746 -222676 14716 -193620 -144276 -96548 61732 -144957 19555
$$ packed form
12809A85933A1444L26857e3415C28905b42864R899A29725K0966E0251a84917l9631
12798b24548D77114i6999j33537A1158O3872J902g9847C03802h1159K4904E75
12786b95233D31078b87472b8306G3514d57503c4194j19409A20862L0254b203B89036
12774G2596f4962A0692j025a17961A48269a21410r6934g4345H3394g9907l5821
12763a15728c9477B18124a4003j64212r404I7672O6738K5051G6241O8941k2928
12752A22254e2412l705k6285A87072A7606d7017I7878e792j96735A87187H00a28455
12739c0732A4863b20442D7210N7293K090j3589n941D0058J98178G6600i8779G52
12726a79444H5999h3284A33746b22676A4716a93620M9344M7728F1732a44957A9555
$$ plain form
12714 142215 -31288 -94999 249312 -273973 294572 93077 89320 123019 175682 325612 264479
12703 264479 71645 -107168 314065 476230 131489 324583 -271921 178574 95849 316510
12693 316510 -140660 -88553 -207443 -41743 16978 264382 -195899 -156082 -223357 -111690
12683 -111690 -67053 -50729 30796 142980 -1975 117381 27469 46003 86057 22811 37532
12672 37532 395665 -144131 244960 -61247 298110 94985 170379 -25263 14489 -114193 303330
12660 -52188 41934 -165348 318035 48194 135125 223727 -4136 97772 46398 -54166 -19752
12648 -183887 2570 337905 -91463 115090 -86578 200564 -35199 -190612 89647 35578 203226
12637 203226 399380 230063 -92190 -121800 280559 276565 22929 96381 -3983 237542 345860
$$ packed form
12714A42215c1288o3711B49312b73973B94572I3077l757L3699N2663J49930o1133
12703B64479G1645a07168C14065J62165A31489J93094b71921A78574q2725K20661
12693C16510a40660N2107j18890d1743A6978K47404a95899L9817o7275J11667
12683a11690M4637J6324C0796J12184a975A17381B7469J8534M0054B2811J4721
12672C7532L58133a44131B44960f1247B98110I4985P5394b5263A4489a14193C03330
12660e2188D1934a65348C18035D8194Q6931Q8602d136I7772D6398e4166a9752
12648a83887B570L35335i1463A15090h6578B00564c5199j55413H9647C5578J67648
12637B03226J96154j69317i2190k9610B80559l994B2929P3452c983B37542J08318
$$ plain form
12626 345860 301120 3219 307968 -30196 51233 -24449 162793 135036 101557 305270 137577
12614 72890 -67244 163787 -141607 69085 45364 -139439 132737 -349428 -181858 -248718
12604 -248718 -80255 43533 155668 28875 266760 53820 70671 188072 116028 -83823 53816
12592 -192153 166917 378929 441636 -89751 52405 -177687 107106 -88600 383074 48937
12581 6316 310940 -78226 -102450 -130410 -101014 122971 7136 214433 -10648 381988 1504
12569 289864 142988 -155320 105698 -176949 -193055 -122517 312616 73702 -35965 -29915 49640
12557 241855 234682 -267783 233308 127138 57859 -57439 -62039 173225 -66551 38341 106729
12546 106729 -33062 2582 -228395 119469 -22416 -145639 84982 -127835 -218402 279003 -136617
$$ packed form
12626C45860m4740C219L04749c0196E1233b4449A62793k7757l3479K03713A37577
12614G2890f7244A63787a41607F9085k3721a39439A32737c49428J67570o6860
12604b48718h0255D3533J12135B8875K37885E3820J6851J17401p2044h3823E3816
12592a92153A66917K12012O2707h9751E2405a77687A07106h8600C83074D8937
12581F316L04624g8226k4224k7960K9396A22971G136K07297a0648C81988A504
12569B89864A42988a55320A05698a76949j6106P0538C12616G3702c5965O050D9640
12557B41855p173b67783B33308j06170E7859e7439m600A73225f6551C8341O8388
12546A06729c3062B582b28395A19469b2416j23223H4982a27835r0567B79003a36617
$$ plain form
12534 75534 -39511 60851 -136944 29657 -132937 117914 238315 -99710 -39214 980 -18070
12522 79414 376513 -2210 -109545 162133 156534 270227 -128171 248399 -45491 72579 -649885
12510 124269 35789 3787 77326 209054 261749 25994 -7492 -14387 142476 -32786 41309 -342447
12497 -144959 133229 -270092 177491 1700 67616 51026 -180944 215001 140554 170487 -197352
12485 144356 13036 -94801 23903 247142 235427 78696 -50492 156090 -195718 -182763 -267167
12474 -267167 309766 -171499 11952 192144 149238 -77118 -188163 -170622 220376 192407
12464 192407 -167576 -62539 16824 203722 -12947 234050 73927 294791 44205 184005
12454 184005 -165785 -17916 -20588 219327 -40513 -257932 -39851 203115 -175128 36768 -46874
$$ packed form
12534G5534c9511F0851a36944B9657a32937A17914J20401i9710c9214I80a8070
12522G9414K97099b210j07335A62133n599J13693a28171B48399d5491G2579f49885
12510A24269C5789C787P3539J31728N2695B5994g492o895A42476c2786D1309c42447
12497a44959A33229b70092A77491A700O5916j6590a80944B15001p4447K9933a97352
12485A44356A3036i4801B3903K23239j1715G8696e0492A56090a95718J2955q4404
12474b67167C09766a71499A1952J80192m2906g7118j11045J7541B20376k7969
12464A92407a67576f2539A6824J86898a2947B34050G3927K20864D4205J39800
12454A84005a65785a7916k672B19327d0513k17419c9851B03115a75128C6768d6874
$$ plain form
12442 -103296 -226003 67569 133546 -80004 -163266 279106 129448 -106944 -68965 -50801 -79079
12431 -79079 -13700 -41679 103520 229701 -239260 80374 -165384 -113377 199046 420178
12421 420178 268245 79035 79311 20316 198368 73205 -40071 55794 117454 89840 43128
12409 -87941 236645 9676 48464 -16590 109389 50071 -166207 -59918 200290 -54388 -45431
12398 -45431 81600 -45116 -203380 -417248 -153804 -4288 -92506 161440 256094 -135977 -162614
12387 -162614 -208924 -40764 -81882 -470751 -11993 108938 134567 -61763 -204589 7696 197967
12376 197967 -208484 -937 -5912 34707 -44652 255835 172851 -161682 20792 20278 -428094 -264442
12364 -264442 19580 129092 269070 -34515 168096 293228 -62182 -100160 -212312 -95938
$$ packed form
12442a03296j22707F7569O5977h0004q3262B79106A29448a06944L7979J8164k8278
12431g9079a3700k7979A03520J26181b39260H0374a65384N2007A99046K21132
12421D20178j51933G9035K76B0316J78052G3205d0071E5794O1660k7614D3128
12409h7941B36645I676L8788a6590A09389E0071a66207e9918B00290e4388Q957
12398d5431H1600d5116j58264k13868a53804d288q8218A61440R4654a35977k6637
12387a62614m6310d0764m1118l88869a1993A08938K5629f1763j42826G696J90271
12376A97967b08484i37m975C4707d4652B55835q2984a61682B0792n14d28094J63652
12364b64442A9580J09512J39978c4515A68096J25132f2182l7978j12152i5938
$$ plain form
12353 -34755 228036 31928 -99650 348854 40689 -333697 -55802 -38954 62188 -114895 -100909
12342 -100909 -211794 193304 -56863 -137339 251584 -61205 -169253 -215351 -132721 56304 164171
12331 164171 -66978 189049 -175039 282884 176553 73072 58286 105981 -84836 51318 64866
12320 64866 -101348 -198760 83106 20213 -29201 91696 123913 10668 316873 -130088 -182762
12309 -182762 -15892 -110586 -243401 -37271 195508 48594 45050 -62706 -49337 -169008 -11165
12297 -360676 204936 -219142 -249413 -95071 45159 73600 171387 155596 112965 292642 226342
12286 226342 95225 380033 367886 57714 -394930 83813 100037 -42890 110219 66225 212602
12275 212602 -71809 -162837 -540 297637 -144652 229705 61841 135819 253875 56081 178285
$$ packed form
12353c4755B28036C1928i9650C48854D0689c33697e5802J6848F2188a14895J3986
12342a00909j10885A93304e6863q0476B51584f1205j08048m6098Q2630E6304J07867
12331A64171f6978A89049a75039B82884j06331G3072j4786M7695h4836E1318J3548
12320F4866a01348r7412H3106B0213b9201I1696L2217A0668L06205a30088n2674
12309a82762a5892r4694j32815c7271A95508D8594l544f2706J3369j19671a1165
12297c60676B04936b19142l0271i5071D5159K8441R7787j5791m2631J79677o6300
12286B26342I5225K84808j2147E7714c94930H3813J6224d2890A10219m3994J46377
12275B12602g1809r1028e40B97637a44652B29705F1841P3978J18056E6081J22204
$$ plain form
12264 178285 483905 -64944 54726 -30457 -32119 405001 -134222 396462 32812 90388 -207771
12252 -6145 98726 111421 253529 61962 46911 214544 86743 -28906 216017 -85947 298857
12240 409739 -94000 306173 12921 320498 50607 -2387 415566 -145042 136398 48798 165791
12229 165791 284493 -93866 324498 249279 221641 220065 100832 237989 2895 248972 189062
12218 189062 89837 361452 223039 94359 19126 -1418 27366 -76237 25170 163726 549245
12207 549245 234733 88697 307558 127488 171816 211603 196081 186458 -38900 350008 278947
12196 278947 -48958 226133 85322 123511 269785 15110 75719 199817 170115 -161792 213586
12184 7565 205721 -87248 147380 38826 73895 120868 218263 -152911 -334769 212226 -281816
$$ packed form
12264A78285L05620f4944E4726c0457j662D05001a34222C96462C2812N7576b07771
12252f145I8726J2695J42108F1962j5051J67633H6743b8906B16017h5947B98857
12240D09739i4000C06173A2921L07577E0607b387D15566a45042A36398D8798J16993
12229A65791J18702i3866C24498p5219k7638j576A00832J37157B895K46077n9910
12218A89062H9837K71615j38413I4359A9126a418B7366g6237B5170J38556L85519
12207E49245B34733H8697K18861A27488M4328L9787j5522r623c8900C50008p1061
12196B78947d8958B26133H5322L8189J46274A5110O0609J24098k9702a61792B13586
12184G565J98156h7248A47380C8826L5069M6973R7395a52911j81858B12226b81816
$$ plain form
12172 7807 -28119 179890 204692 171938 -25931 218808 -43202 133289 -88272 331751 54410
12160 341713 -101354 248392 54680 166302 3234 -10132 185764 119983 175393 124551 -52403
12148 396898 -316405 34424 -105495 39324 51297 164120 -160083 117847 -286358 194003
12137 -8518 162694 83519 19961 180787 -29193 -128972 55879 49094 89148 107928 18750 -226015
12124 130356 88071 324963 90927 -43932 -5794 -20148 85642 104578 6691 320123 -77216
12112 105403 -136588 13761 53869 -90291 -286900 -5348 -309024 -91288 -210694 179859 -76587
12100 157201 172667 -469346 75664 -100612 31924 19258 202220 124233 -18902 -146674 -125605
12089 -125605 317068 89914 -311934 -60581 13174 133991 113963 -211474 -73693 -129756 125648
$$ packed form
12172G807b8119A79890K4802l2754b5931B18808d3202A33289h8272C31751E4410
12160C41713a01354B48392E4680J11622C234a0132A85764o5781N5410n0842e2403
12148C96898c16405C4424a05495C9324J1973J12823a60083A17847b86358A94003
12137h518A62694p9175A9961J60826b9193r9779E5879o785M0054J8780A8750b26015
12124A30356m2285K36892I0927d3932e794j4354H5642J8936F691L13432g7216
12112A05403a36588A3761M0108i0291j96609e348l03676i1288j19406A79859g6587
12100A57201J5466d69346G5664a00612C1924j2666J82962p7987a8902j27772K1069
12089a25605C17068H9914c11934f0581A3174J20817k0028b11474g3693n6063A25648
$$ plain form
12077 22602 -296931 209761 105418 -167410 -345739 115835 -57488 98904 -267864 -27302
12066 119378 -126181 271572 86435 87453 157833 294812 979546 1868882 828348 180611
12055 -30256 -2806 -20980 117429 322238 -31063 -173458 -16511 -297651 37450 -299450 -54572
12043 -36590 -106663 -17468 136685 106577 -26893 86516 -63577 9842 94377 -195015 269192
12031 139656 303700 -50401 -196808 -103462 25584 244266 133177 59115 -360756 54677
12020 -60091 -36468 -134099 -281349 -207169 -133501 -42194 -284295 176885 -5931 -99475 -158591
12009 -158591 16889 -166945 -111580 -60372 -138137 60402 128569 -77620 -141546 54570 -40082
11997 -11170 197556 -450659 122571 -71166 -107091 38825 -391361 -258751 -158926 -163428 17334
$$ packed form
12077B2602b96931B09761j04343a67410j78329A15835e7488I8904b67864b7302
12066A19378a26181B71572H6435J018P0380J36979O84734Q89336H28348A80611
12055c0256b806j8174A17429K04809c1063j42395a6511k81140C7450b99450e4572
12043c6590p0073a7468A36685l0108b6893H6516f3577I842Q4535a95015B69192
12031A39656J64044e0401j46407R3346B5584K18682j11089E9115c60756E4677
12020f0091K3623r7631j47250P4180P3668d2194k42101A76885e931r3544n9116
12009a58591A6889a66945N5365N1208p7765F0402O8167g7620o3926E4570d0082
11997a1170A97556d50659A22571g1166l5925C8825c91361J32610R9825m502A7334
$$ plain form
11985 -191879 43698 143395 21530 -46033 70563 27297 20501 -689342 157320 98507 -84159
11973 -32323 73645 -9832 -54586 -61212 -30780 -19992 294757 -274633 -14889 236377 -192717
11961 -206408 340704 143787 53745 13638 104025 64043 -26122 -402369 -271616 244600
11950 -103599 -37768 268867 94175 -138218 -123235 -59057 -325895 -103981 116443 163791
11940 163791 -139527 314207 -263204 -27442 274559 141119 20376 -131159 -224990 -88562
11929 208648 236873 -24498 67840 -55707 227793 -408888 -44063 73855 -81563 80940 66668
11918 66668 -53355 170052 -98711 -117341 -29315 8687 -1406 188302 95588 -145058 118408
11906 -116227 145093 -1271 -122559 -72962 93829 -208714 182847 13788 519153 -16017 -106184
$$ packed form
11985a91879D3698R9697B1530d6033G0563B7297o796f89342A57320n8813h4159
11973c2323G3645i832m4754o626L0432J0788B94757b74633a4889B36377a92717
11961b06408C40704A43787E3745A3638R0387l9982b6122l76247J30753B44600
11950a03599c7768B68867I4175a38218J4983e9057k66838a03981A16443M7348
11940A63791a39527C14207b63204b7442B74559j33440B0376a31159r3831h8562
11929B08648K8225b4498F7840e5707B27793d08888d4063G3855h1563H0940j4272
11918F6668e3355A70052i8711j8630b9315H687a406A88302r2714a45058A18408
11906a16227A45093a271j21288M9597I3829b08714A82847A3788N05365a6017r0167
$$ plain form
11895 -106184 -338411 362217 -131626 -107026 -7259 49561 94498 -212589 574807 -164630
11884 77487 125871 -100064 -13069 -327261 183888 -122474 -319806 167802 -124852 -199935
11874 -199935 59426 30867 91430 6902 -58842 36867 -159505 -440443 109636 -10133 -25671
11863 -25671 -62640 -306902 -4613 -24026 -202859 42580 -121030 -142739 78071 -59572 189554
11851 142003 139677 -164814 -30360 -80576 46630 -135005 -135271 -175004 240039 -231742 239984
11839 168980 -139502 -65419 -204397 -38357 14623 36304 -156964 -42091 155678 -193632
11828 -317061 -234491 -102131 -11946 -189387 -296371 48404 -173433 -42728 -175585 -166846 -49363
11816 -17783 -132360 37858 -145903 -220715 140667 301396 -205863 -207922 26936 -41315 304268
$$ packed form
11895a06184k32227C62217a31626K4600g259D9561M4937b12589E74807a64630
11884G7487M8384a00064a3069l14192A83888a22474j97332A67802a24852p5083
11874a99935E9426k8559O0563F902e8842C6867a59505k80938A09636a0133j5538
11863b5671l6969k44262d613j9413j78833D2580a21030k1709G8071e9572A89554
11851A42003k326a64814c0360n0216D6630a35005k66l9733B40039b31742B39984
11839A68980a39502f5419j38978c8357A4623K1681a56964d2091A55678a93632
11828c17061Q2570a02131a1946j77441j06984D8404a73433d2728j32857Q739d9363
11816a7783j14577C7858a45903p4812A40667J60729b05863k059B6936d1315C04268
$$ plain form
11804 83650 34021 -255048 -17287 232278 318153 -145195 392525 52910 148145 282057 -108364
11792 212487 43448 248162 -110199 360912 -161580 -253876 39725 157494 -332607 29922
11781 -97941 -336887 -234664 -272470 268734 143963 324417 130709 108819 18920 -195722
11770 91098 -51828 358963 -44787 -161415 -213038 -69696 -150519 -89128 63437 -166772 279599
11758 194290 -151415 4288 159508 70614 -104236 -86401 -371471 -101095 -200500 -4197 351270
11746 -125596 64779 -1869 -53569 -129703 -81707 142556 -330015 165721 20662 4194 -102461
11734 275820 -179638 -272371 -55771 380809 -29806 159361 -81967 144585 -128317 197673
11723 -122557 265761 -128704 480 223315 100963 -243681 -15382 212603 -69016 -132193 -332285
$$ packed form
11804H3650C4021b55048a7287B32278Q5875a45195C92525E2910R5235J33912a08364
11792B12487D3448K04714a10199C60912a61580r2296C9725J17769c32607B9922
11781i7941k38946J02223l7806B68734j24771J80454A30709k1890A8920a95722
11770I1098e1828C58963d4787j16628n1623f9696q0823O1391F3437a66772B79599
11758A94290a51415D288J55220G0614a04236J7835k85070a01095r9405d197C51270
11746a25596F4779a869n1700p6134M7996A42556c30015A65721B0662D194a02461
11734B75820a79638r2733e5771C80809b9806A59361h1967A44585a28317A97673
11723a22557B65761a28704D80K22835A00963b43681a5382B12603f9016o3177k00092
$$ plain form
11712 -332285 268307 78763 160900 230686 -16832 -21390 -71532 -123148 -122147 -133779 4993 -123608
11699 328111 207469 -83571 -313876 -2089 34823 -207148 3511 293245 -36088 -208348 86957
11687 -293655 398819 117135 300063 -92396 -68027 497602 -336387 -162035 -246049 27637
11676 144415 -258253 -107534 71538 42566 -12565 -278265 203029 180412 -173811 255252
11665 566294 10503 229864 233527 -194081 -111632 77200 20442 74152 -197734 255884 129249
11654 129249 122565 81580 177762 45883 143399 64542 -57711 36860 -127232 214334 -150898
11642 41343 9045 161747 -7378 153418 -7137 90340 141110 354460 251290 115949 172925
11631 172925 -84919 53146 -64635 -83860 -129348 108282 188591 -128360 60761 78903 188655
$$ packed form
11712c32285B68307G8763Q2137O9786a6832m558n0142n1616J001j1632D993a23608
11699C28111j20642h3571k30305b089C4823b07148C511K89734c6088j72260H6957
11687b93655C98819A17135J82928i2396K4369D97602c36387a62035q4014B7637
11676A44415b58253a07534G1538k8972a2565k65700B03029k2617a73811B55252
11665E66294A0503K19361L663a94081Q2449G7200B0442N3710a97734B55884j26635
11654A29249o684m0985R6182D5883R7516F4542e7711C6860a27232B14334a50898
11642D1343I045J52702g378A53418g137I0340N0770K13350j03170A15949N6976
11631A72925h4919E3146f4635j9225m5488A08282Q0309a28360F0761J8142J09752
$$ plain form
11620 188655 -46746 80317 -113562 -99001 -291584 207470 168079 -4835 -59763 9652 6577
11609 6577 -9494 -253813 62592 -208345 195426 237675 -68834 242417 -85912 90981 130768
11598 130768 -50510 101191 130985 -12729 -172183 31051 218318 258087 -207916 21591 234403
11587 234403 314370 70350 107329 450509 200480 -59011 -83320 197605 -12881 18581 12496
11576 12496 318586 -91142 -9882 136437 204148 239508 -128955 10694 216829 388798 -123724
11564 15056 -140275 -171766 -144084 -49776 234243 213420 -211583 -108291 218685 -279919
11553 167373 -96863 157133 -32859 72908 26507 179944 -89488 271197 -153789 77260 -65439
11541 -125039 27 310353 15682 -135115 274792 337843 32373 91891 134066 164988 513541
$$ packed form
11620A88655d6746H0317a13562J4561j92583B07470l9391d835n4928I652l075
11609F577i494k44319F2592b08345A95426M2249f8834B42417h5912I0981L9787
11598A30768e0510A01191K9794a2729j59454C1051J87267L9769b07916B1591K12812
11587B34403P9967G0350L6979L43180B00480e9011k4309A97605a2881A8581o085
11576A2496L06090i1142i882A36437O7711L5360a28955A0694K06135J71969a23724
11564A5056a40275l1491K7682d9776B34243k0823b11583J03292B18685b79919
11553A67373i6863A57133c2859G2908B6507J53437h9488B71197a53789G7260f5439
11541a25039B7L10326A5682a35115B74792O3051C2373N9518M2175L0922L48553
$$ plain form
11530 513541 173571 177390 120621 -14522 25947 -217965 258161 -69774 -83277 101462 -101347
11518 191273 197500 -146216 -102623 -357246 18586 50103 58661 16164 296458 334517 305644
11507 305644 244964 289288 38810 284673 -37215 -110585 -81894 283705 -94731 8559 -92605
11495 -12650 138346 -7616 228405 139992 174364 51341 73854 327332 158914 36262 208781
11484 208781 59132 190902 260963 50762 -30887 31081 -247607 -225011 262286 -233604 421464
11472 -76080 49439 41888 20901 231253 -13239 -15416 7608 -66863 -260930 19287 49233 312417
11460 312417 142430 -55447 5173 181575 51633 -141205 112992 29110 42224 461862 273896
11449 273896 255197 311241 72423 313995 244145 232674 328628 127006 71858 21820 -30312
$$ packed form
11530E13541A73571L819n6769a4522B5947b17965B58161f9774j3503A01462a01347
11518A91273O227a46216M3593k54623A8586L1517Q558A6164K80294L8059k8873
11507C05644o0680M4324C8810K45863c7215p3370K8691B83705i4731H559i2605
11495a2650A38346g616B28405q8413L4372E1341K2513K53478A58914C6262J72519
11484B08781E9132J31770P0061E0762c0887C1081b47607K2596B62286b33604D21464
11472g6080D9439p551B0901K10352a3239k177G608f6863j94067A9287K9946K63184
11460C12417A42430e5447E173J76402E1633a41205A12992B9110J3114M19638j87966
11449B73896j8699N6044G2423K41572o9850j1471R5954A27006n5148B1820c0312
$$ plain form
11437 24374 211163 83989 64941 256409 301079 -68621 44807 -206977 -26083 -69924 227224
11425 231717 -159002 85557 201665 561976 -405791 97963 27293 118643 -52368 57608 51584
11414 51584 124436 -339301 125368 253962 3589 -332457 -17035 22435 -133672 -179870 250175
11402 497 381543 116416 -146558 134336 170484 -262055 174240 45103 209182 -139001
11391 179739 212288 -179328 -35365 156127 25202 -49017 -185358 -144539 -19137 41916 -223546
11379 -1976 -213751 185422 54438 -180617 21492 262690 -259814 -126793 -296037 193437
11368 -159322 4917 52636 190405 56702 239986 257909 40350 3320 250486 92045 52769
11357 52769 32308 -68878 -57676 211640 -175931 -199228 215462 -41268 -49679 54753 -154067
$$ packed form
11437B4374J86789H3989j9048J91468M4670f8621D4807b06977b6083m3841B27224
11425B31717a59002H5557J16108L60311d05791I7963B7293R1350e2368E7608o024
11414E1584P2852c39301A25368J28594C589c32457a7035B2435a33672m6198B50175
11402D97L81046A16416a46558A34336L6148b62055A74240D5103J64079a39001
11391A79739L2549a79328c5365A56127B5202d9017j36341M0819a9137D1916b23546
11379a976k11775A85422E4438a80617B1492K41198b59814a26793j69244A93437
11368a59322D917M7719J37769E6702J83284J7923D0350C320K47166I2045l9276
11357E2769k0461f8878J1202B11640a75931k3297B15462d1268q411E4753a54067
$$ plain form
11345 -322106 -98296 -236144 173649 -10198 120058 -457561 32370 50975 358190 77316
11334 -258600 -127995 -148095 -65948 -71322 -60524 74846 283237 -81157 113051 151602 -37291
11322 -166777 127949 9643 35204 132541 175459 -127300 88613 -187696 9050 212228 47749
11310 -246480 4415 58516 -123977 233551 -206878 -11931 -33840 100721 -116646 104284
11299 -89225 80441 -412048 -33350 -538295 239819 122135 -50093 -161044 -61739 45013 -19521
11287 318747 -123988 -35251 123629 223710 -76237 -68344 -20209 -177363 -7065 139781 175589
11276 175589 -333353 148641 181043 -107522 -100412 189989 -173892 69376 17500 92323 147908
11265 147908 -98116 -127857 42389 -28036 130026 -118236 94591 -95553 201173 215293 -168316
$$ packed form
11345c22106i8296j37848A73649a0198A20058d57561C2370J8605L07215G7316
11334b58600a27995k0100f5948n374J0798G4846K08391h1157A13051L8551c7291
11322a66777A27949I643K5561R7337M2918a27300H8613a87696I050K03178D7749
11310b46480D415N4101a23977B33551b06878a1931k1909A00721a16646A04284
11299h9225H0441d12048c3350n04945B39819j17684e0093j10951f1739D5013a9521
11287C18747a23988c5251A23629J00081g6237P893b0209j57154g065A39781L5808
11276A75589c33353A48641L2402a07522P110A89989a73892F9376A7500P4823N5585
11265A47908i8116k9741D2389b8036A30026a18236I4591i5553B01173J4120a68316
$$ plain form
11253 -224549 -114138 145974 -59779 200418 172992 136861 156851 -94230 -188597 -95695 68412
11241 111964 -16096 -226683 32218 -196284 -276111 -254890 -50397 -82106 -22370 158090 -110213
11229 143062 224245 -13736 -50690 -168063 -301237 -46565 -201613 58822 -19648 -128024 184622
11217 -42661 -22622 -65263 165 -22718 -268187 -44167 -57184 19798 94950 14047 -222557 -244691
11205 -244691 -47380 -121244 -8322 -34934 41437 33134 -192726 152100 -166819 -241960 69716
11193 -219695 -73042 -6874 -167560 -174971 -16157 73282 -29827 -323566 27514 10072 -418731
11181 -194475 -240026 -102377 195944 -201760 -121186 -184871 -89815 123623 -158727 -34565
11170 -63853 118108 -52418 -9023 -131499 241674 -507502 -102155 -74063 -73868 -53897 -159001
$$ packed form
11253b24549J10411A45974e9779B00418k7426l6131J9990i4230r4367R2902F8412
11241A11964a6096k10587C2218a96284p9827K1221e0397l1709b2370A58090a10213
11229A43062Q1183a3736l6954j17373j33174d6565j55048E8822a9648j08376A84622
11217d2661K0039m2641A65b2718k45469d4167j3017A9798P5152A4047b22557k2134
11205b44691d7380p3864h322k6612D1437q303a92726A52100a66819p5141F9716
11193b19695g3042f874j60686p411a6157G3282b9827k93739B7514A0072d18731
11181a94475m5551a02377A95944b01760Q0574o3685h9815A23623a58727c4565
11170f3853A18108e2418i023j22476B41674e07502a02155K8092J95J9971j05104
$$ plain form
11159 -159001 197261 459340 216891 -160870 -68058 -82413 -169681 -51031 77003 -35129 142774
11147 80996 -171304 -133514 113122 196495 20284 -14505 159464 324109 94560 -124303 21996
11135 -213695 144010 -76650 127140 -80761 58074 178322 -142701 63198 329257 153800
11124 218278 76738 221816 -29883 91265 1912 96397 -104461 -42111 -119158 -98117 284699
11112 206448 143668 144891 104839 -98923 119471 172548 162538 188960 367542 361123 151051
11100 -23440 345956 170170 306490 141049 -21321 22481 -280320 -111317 123910 172590
11090 172590 50345 283623 66986 51606 418926 -248191 382783 135929 253584 154587
11080 154587 386414 86639 48422 168266 395232 514683 608564 482092 297908 -44499
$$ packed form
11159a59001A97261K62079B16891a60870f8058j4355q7268e1031G7003c5129A42774
11147H0996a71304L7790A13122Q3373B0284a4505A59464J64645I4560a24303B1996
11135b13695A44010g6650A27140h0761E8074J20248a42701F3198K66059A53800
11124B18278G6738J45078b9883I1265A912R4485a04461d2111p7047K1041B84699
11112B06448o2780J223m0052i8923A19471N3077j0010K6422J78582o419A51051
11100b3440C45956A70170J36320A41049b1321B2481b80320a11317A23910M8680
11090A72590E0345K33278F6986j5380L67320b48191C82783A35929J17655r8997
11080A54587K31827H6639l8217J19844K26966J19451R3881j26472j84184d4499
$$ plain form
11069 501138 458688 451075 452716 426113 172015 231607 501523 403725 511090 357491 471828
11058 471828 295066 529011 488612 408215 136061 593135 652418 826500 369631 427207
11048 427207 375584 623652 381986 805296 619730 825575 761447 808878 535315 391573
11038 391573 418437 842906 305662 621592 663904 599478 708190 941071 624071 784470
11028 784470 458008 584355 554224 664335 590070 758084 1019926 529818 527531 404107
11018 404107 312633 658902 498146 427244 717695 456874 600329 708149 680738 645638
11008 645638 683339 507489 783644 743406 812290 713245 821858 612979 784258 736993
10998 736993 470012 601221 835036 253375 501658 853836 561132 484869 553386 1065445
$$ packed form
11069E01138m2450p613J641k6603A72015N9592K69916r7798J07365j53599J14337
11058D71828j76762K33945m0399q0397A36061M57074N9283J74082C69631N7576
11048D27207n1623K48068k41666M23310j85566K05845o4128M7431k73563j43742
11038C91573K6864M24469C05662L15930M2312o4426J08712K32881l17000J60399
11028G84470l26462J26347l0131J10111p4265J68014K61842m90108k287j23424
11018D04107r1474L46269j60756p0902K90451k60821J43455J07820k7411l5100
11008F45638L7701j75850K76155m0238O8884r9045J08613k08879J71279m7265
10998G36993k66981J31209K33815B53375K48283L52178k92704p6263O8517N12059
$$ plain form
10988 1065445 926027 912821 762615 842307 874088 820269 871399 1113845 1445099 1217692
10978 1217692 1417128 1298193 1845111 1876907 2382883 2200499 2449823 2774002 2397916 2717991
10968 2717991 2634238 2566285 2068874 2006929 1594413 1594782 1593669 1920282 1607572 1690581 1915713
10957 1915713 1840839 2132162 1780531 1349633 1102791 1049915 778813 477132 637675 574025
10947 574025 710665 546733 -96424 369163 -118433 -820 102832 392354 157056 -80473
10936 275506 104820 381128 298590 220969 -38349 -306834 -148039 110525 -129881 255440
10925 214602 149097 -88144 -125057 -184972 128817 -34859 -84692 -71471 -196120 -40268 -122901
10914 -122901 -61946 158758 -213739 23362 -66270 197558 95797 -349163 -141864 -251004
$$ packed form
10988A065445j39418j3206j50206P9692L1781n3819N1130K42446L31254k27407
10978A217692J99436j18935N46918L1796N05976j82384K49324L24179l76086L20075
10968B717991q3753o7953m97411o1945m12516L69j113L26613l12710Q3009K25132
10957A915713p4874K91323l51631m30898k46842n2876k71102l01681J60543o3650
10947E74025J36640j63932i6424C69163a18433h20A02832K89522A57056h0473
10936B75506A04820K76308q2538p7621c8349k68485a48039A10525a29881B55440
10925B14602o5505h8144l6913n9915A28817c4859m9833J3221j24649d0268q2633
10914a22901O0955A58758b13739B3362f6270A97558I5797c49163a41864j09140
$$ plain form
10904 -251004 -46049 199484 -303865 111780 380861 202228 17001 -194414 -688172 -267245
10893 181551 106190 77071 71282 120059 -104282 -1083 -8026 65317 177940 -111372 311296
10881 -34250 -7984 -90943 8496 86198 -241574 -39219 -102376 105870 -98878 -120557 35752 41558
10869 41558 -69344 -320397 -253008 -159500 -49152 -208025 -115551 382862 157973 107490 -179925
10857 193351 -35870 34897 259382 227673 -47275 206217 -117079 43254 -180759 -226531 -253819
10846 -253819 30225 229696 187907 -168065 69702 -337426 278656 72018 -313306 390427
10835 -191036 -385283 314793 -24003 -93809 -171594 266040 312019 -115289 -366506 -110283
10824 -60854 -273637 -189343 -170997 -33629 209040 180459 -111900 -28110 156166 -48946 -315065
$$ packed form
10904b51004d6049A99484c03865A11780K69081j78633A7001a94414m93758b67245
10893A81551p5361k9119n789M8777a04282a083o943F5317J12623a11372C11296
10881c4250g984q2959H496P7702b41574c9219o3157A05870i8878k1679C5752N806
10869D1558f9344k51053O7389R3508d9152j58873R2474C82862A57973n0483a79925
10857A93351c5870C4897K24485l1709d7275B06217a17079D3254a80759m5772k7288
10846b53819C0225J99471m1789a68065F9702c37426B78656G2018c13306C90427
10835a91036j94247C14793b4003o9806p7785B66040M5979a15289k51217a10283
10824f0854k12783Q4294J8346c3629B09040k8581a11900b8110A56166d8946k66119
$$ plain form
10813 -315065 -130969 -294801 -238722 39114 71435 -2639 83209 -197625 -99963 172059 157606
10802 157606 -114955 170762 -43124 -114344 73294 -72659 136401 7524 92686 501452 -54374
10790 265079 23986 175790 81098 -219767 -259703 243744 -63143 -243528 -46763 162381
10779 -214059 -160628 -223469 -181564 -72940 -268426 -261254 126814 -5797 -29005 31076 145138
10768 145138 -236512 -148635 -143385 -95702 -139628 43334 -141507 -132343 38563 -225200 39139
10756 64396 -78348 -160113 224455 -11255 176193 99064 -165919 16510 -85423 -202570 150599
10744 87895 -114842 184887 -122178 -68473 344945 13355 114748 165485 -227209 -467912
10734 -467912 -204044 69459 -100245 -39375 -147413 60710 -50335 -29389 -52928 -226443 16069
$$ packed form
10813c15065a30969j63832N6079C9114L2321b639H3209a97625R7662A72059j4453
10802A57606a14955A70762d3124p1220G3294g2659A36401G524Q5162M08766e4374
10790B65079B3986J51804H1098b19767l9936B43744f3143j80385d6763A62381
10779b14059N3431o2841M1905g2940j95486P172A26814e797k3208C1076J14062
10768A45138b36512Q7877N250M7683m3926D3334a41507R164C8563b25200C9139
10756F4396g8348q1765B24455a1255A76193p7129a65919A6510h5423j17147A50599
10744H7895a14842A84887a22178N3705C44945A3355J01393N0737b27209k40703
10734d67912b04044F9459a00245c9375j08038F0710e0335K0946k3539j73515A6069
$$ plain form
10722 46265 -318107 -295841 -259018 -83163 -167732 272166 -160032 -20532 -183239 47790 -77270
10710 211293 -59353 -320150 1053 32750 -88566 75983 -391358 123030 12385 -66431 108760
10698 -111837 -164220 157175 -154438 -23991 -220822 261760 26589 121808 18760 21048 38278
10687 38278 -65738 -118120 -68522 -415351 -54280 -48411 -146376 -2662 164026 -185030 -148594
10676 -148594 -363545 -69855 16893 -60049 90912 60683 -207786 150363 -295688 43283 8849
10664 -97473 151785 -32995 -222815 6455 -46192 50906 -323829 272758 -237302 286222 79700
10652 -307284 -237936 38567 -216675 120158 -174011 -331341 5221 -151338 -173448 266828
10641 -38764 64171 -11934 26137 560 -118263 -31478 -176716 -248631 -67797 -5487 268324 200701
$$ packed form
10722D6265c18107K2266L6823h3163q4569B72166a60032b0532j62707D7790g7270
10710B11293e9353k60797A053L1697h8566G5983c91358A23030A2385f6431A08760
10698a11837n2383A57175a54438b3991j96831B61760B6589R5219A8760K288J7230
10687C8278f5738n2382M9598l46829e4280N869r7965b662A64026a85030L6436
10676a48594k14951f9855A6893f0049I0912l0229b07786A50363b95688D3283H849
10664i7473A51785c2995j89820F455d6192E0906c23829B72758b37302B86222G9700
10652c07284O9348C8567b16675A20158a74011j57330E221a51338k2110B66828
10641c8764F4171a1934B6137E60a18263c1478j45238p1915f7797e487B68324o7623
$$ plain form
10629 200701 132451 -20206 164266 28856 24456 -330473 -141073 -188542 -179848 72940 -84422
10617 72071 -105476 155117 70114 116816 -108932 -2085 -67263 -23757 -259258 234516 -179195
10605 -157765 -420017 -90935 -290722 20787 -92245 115304 287293 -432132 317655 -101991
10594 -94202 -306454 111516 -12177 47690 63245 305932 -535919 -425058 -44589 79366 -280308
10582 -334214 -56656 -221434 -241242 234079 749 -50922 -82044 -247981 -138928 -249611 -92235
10570 -328930 -91194 16102 151367 -182301 -254114 -50247 -100291 75652 264427 -105500 70838
10558 -345387 -11331 -212593 137068 -3601 -128079 -309093 42945 159732 -39753 90248 -136569
10546 91456 -24371 138187 -115611 -3019 65250 24699 -383462 28544 204553 88733 98481
$$ packed form
10629B00701o8250b0206A64266B8856m400c30473a41073m7469Q694G2940h4422
10617G2071a05476A55117G0114M6702a08932b085o5178b3757k35501B34516a79195
10605a57765k62252i0935j99787B0787i2245A15304J71989d32132C17655a01991
10594i4202k12252A11516a2177D7690J5555K42687e35919J10861d4589G9366b80308
10582c34214e6656j64778j9808B34079G49e0922l1122j65937J09053j10683i2235
10570c28930i1194A6102J35265a82301p1813e0247n0044G5652J88775a05500G0838
10558c45387a1331k01262A37068c601j24478j81014D2945J16787c9753I0248a36569
10546I1456b4371A38187a15611c019F5250B4699c83462B8544J76009H8733R748
$$ plain form
10535 98481 26969 -3551 -80834 94828 -135125 -62042 -61175 61215 257276 -116782 -89825 121477
10522 -48621 -139351 -154875 163422 -69906 -101155 -206982 52763 41156 23316 159388 -27549
10510 -259841 -70343 205207 11840 -2617 32709 -19841 -285296 120075 375082 2783 254620
10499 254620 -375276 -172576 -59559 -330295 43395 -319034 90826 42315 244912 7289 -18945
10487 -22013 -109849 -93200 130315 -137214 -39300 -126149 260819 315389 32052 455088 76468
10475 179023 -73206 430779 99704 -322374 417375 57856 233470 40199 -171097 -115427
10465 -115427 55367 149183 -105535 82313 272475 -129163 58896 91230 -98536 -224317 -164967
10454 -164967 66587 23498 -127230 -7654 -5591 -94339 -30457 -23867 -176445 -340093 150213
$$ packed form
10535I8481B6969c551p7283I4828a35125f2042Q67F1215J96061a16782K6957A21477
10522d8621r0730j5524A63422f9906l1249j05827E2763j1607j7840J36072b7549
10510b59841g0343B05207A1840b617C2709a9841k65455A20075K55007B783K51837
10499B54620c75276a72576e9559k70736D3395c19034I0826D2315K02597G289a8945
10487b2013q7836J6649A30315a37214c9300q6849B60819N4570C2052M23036G6468
10475A79023g3206D30779I9704c22374D17375E7856J75614D0199a71097N5670
10465a15427E5367R3816a05535H2313J90162a29163E8896L2334i8536j25781N9350
10454a64967F6587B3498a27230g654K063q8748c0457O590j52578j63648A50213
$$ plain form
10442 47689 202389 13824 -98734 -246204 199246 -32765 5182 -91848 184429 -117085 -143114
10431 -143114 83596 -148771 -239157 -95097 -8029 112444 250525 70349 -59874 95620 -252948
10419 51149 -162021 136595 34963 -15231 151540 44444 -293122 -123418 85922 -77870 -198441
10408 -198441 -177736 144357 55181 -935 -238795 3481 -230546 -99082 -4975 -44293 -134495 98316
10395 421570 137409 153113 -171045 -53802 208988 52291 448629 277608 288081 -147476
10384 86236 -20239 -11887 -19706 204623 -50975 148809 -26475 572558 156510 91914 171540
10373 171540 -20073 36385 186121 364333 508411 351368 309692 518817 506003 391674
10363 391674 352071 67380 385920 50620 -13176 114947 186880 11375 98099 130526 390531
$$ packed form
10442D7689J54700A3824i8734j47470A99246c2765E182i1848A84429a17085k6029
10431a43114H3596a48771r0386i5097h029A12444J38081G0349e9874I5620b52948
10419E1149a62021A36595C4963a5231A51540D4444b93122a23418H5922g7870j20571
10408a98441K0705A44357E5181i35k37860C481b30546i9082d975l9318r0202I8316
10395D21570A37409J5704a71045e3802B08988E2291L96338j71021J0473a47476
10384H6236b0239Q352p819B04623e0975A48809b6475E72558A56510o4596P9626
10373A71540b0073C6385J49736J78212J44078j57043m1676K09125j2814j14329
10363C91674l9603F7380L18540E0620a3176A14947P1933A1375Q6724L2427K60005
$$ plain form
10352 390531 271057 420529 324879 617762 305749 461080 222102 385906 490652 180814
10341 399685 595687 -76240 113122 286935 166540 220716 241627 241369 189933 -57047 169468
10329 15503 34097 48431 345951 237817 394197 216949 161736 72556 289815 -13344 128490
10317 -169246 239925 667104 88880 7484 -46049 219358 103387 -194163 -224162 50364 -252976
10305 -163367 104554 -143594 -182926 83056 -118879 -215245 162760 -13508 18970 5755 26376
10294 26376 -180021 -260499 -287591 11591 -59039 -93174 -22564 -149594 -132703 -185316 139693
10282 365780 233655 11158 -88453 94712 -58980 39736 -267571 113690 93912 150228 15823
10270 -124405 95265 78518 25768 -85562 -218872 104028 361614 257674 239265 -36684 344957
$$ packed form
10352C90531j19474J49472r5650K92883C05749J55331B22102J63804J04746A80814
10341C99685J96002g6240A13122J73813j20395N4176K0911k58n1436e7047A69468
10329A5503J8594J4334K97520j08134J56380j77248n5213G2556K17259a3344A28490
10317a69246B39925M27179H8880G484d6049B19358A03387a94163k9999E0364b52976
10305a63367A04554a43594l9332H3056a18879r6366A62760a3508A8970E755K0621
10294B6376a80021q0478k7092A1591e9039l4135b2564j27030J6891n2613A39693
10282C65780j32125A1158h8453I4712e8980C9736b67571A13690j9778N6316A5823
10270a24405I5265j6747B5768h5562j33310A04028K57586j03940j8409c6684C44957
$$ plain form
10258 433405 408629 562506 463940 110544 336426 170805 162674 -1444 -207660 152232 -269779
10246 -51702 39508 -183190 -139163 253961 376154 270668 -122096 -62427 -463505 115894
10235 19410 -16636 -177237 -235016 -37389 -119756 -199967 151692 -109301 178631 -210356 145439
10223 -135371 -39153 -283718 -222814 -112943 320749 -122178 -103121 45504 54904 -220005 135966
10211 244711 -138519 -345527 11398 69508 -341523 -161123 99204 484374 -140739 38682
10200 24142 -136977 -169335 248880 -150362 36573 -106211 -57859 112716 -230699 -199654
10190 -199654 333576 66621 -144072 -365847 94344 -182268 194189 -40344 -131966 -141062 82872
10178 29306 -118977 -32271 -133166 -465948 -117839 -288550 -234304 -3015 213034 114205 -205294
$$ packed form
10258D33405k4776J53877r8566A10544K25882j65621q131a444k06216A52232b69779
10246e1702C9508a83190M4027B53961J22193j05486a22096N9669m01078A15894
10235A9410a6636j60601n7779c7389q2367q0211A51692a09301A78631b10356A45439
10223a35371c9153k44565O0904J09871C20749a22178J9057D5504R400b20005A35966
10211B44711a38519k07008A1398N8110c41523a61123I9204L85170a40739C8682
10200B4142a36977l2358B48880a50362C6573a06211M8352A12716b30699L1045
10190a99654C33576F6621a44072k21775I4344a82268A94189d0344r1622r096H2872
10178B9306a18977c2271j00895l32782a17839j70711N4246c015B13034r8829b05294
$$ plain form
10166 79305 -51719 -167398 43891 -272511 57378 83595 -260878 16178 -190030 206258 116714
10155 116714 -48198 -9038 186645 -201750 -314017 72238 -276705 27394 -114586 105272
10144 -254627 -104726 29207 109845 82827 77756 -149770 221962 -296418 73625 98288 -57179
10132 81705 151533 169268 -16937 -66790 14146 -227898 -133038 33328 -271706 -190226 112059
10120 160459 -87627 -704769 31923 -379349 -294489 191941 -114116 -192208 88233 -46667 -144300
10109 -144300 92297 -37321 11083 12015 161117 179078 -208317 -87074 -122983 -57837 107155
10097 41216 -104842 276937 218593 142339 29372 28279 151535 -109017 -180611 -363523 183976
10085 -171945 34976 -29907 226992 -69634 -154872 -402238 191239 -151460 -269760 -215888
$$ packed form
10166G9305e1719j15679D3891b72511E7378K6217b60878A6178a90030B06258q9544
10155A16714d8198i038A86645b01750j12267G2238b76705B7394a14586A05272
10144b54627a04726B9207Q0638k7018n071a49770B21962b96418G3625K4663e7179
10132H1705O9828J7735a6937m9853A4146b27898R4860C3328b71706Q1480A12059
10120A60459h7627o17142C1923c79349Q4860A91941a14116p8092H8233d6667r7633
10109a44300I2297c7321A1083R32J49102J7961b08317h7074l5909e7837A07155
10097D1216a04842B76937n8344p6254B9372j093J23256a09017p1594j82912A83976
10085a71945C4976b9907B26992f9634q5238k47366A91239a51460j18300N3872
$$ plain form
10075 -215888 -232800 -155912 -279129 -71149 13964 122934 -50936 115017 9924 35423 -82627
10063 56717 -40111 -6837 -55989 85888 73272 143432 -183386 32894 -200117 -23378 -117594
10052 -117594 41641 26428 -195788 -155588 -78066 -12721 -223782 -70169 162547 -72255 79560
10040 118764 -71142 -178516 183853 -296517 46544 102247 -216819 -263177 -123094 133262
10029 128289 -165243 237096 218898 -320467 108393 -18317 -174725 -32369 -240254 -98994
10018 -160685 -97775 -358686 229024 142430 47232 -223896 66775 -112286 147318 170179
10008 170179 -34861 38362 -129518 -119400 -36067 -6894 10440 47126 -127736 -89519 -311534
9997 -311534 -69357 -66139 -223374 -167451 -60 -71767 -63949 -180773 -168508 -72768 -110662 -147263
$$ packed form
10075b15888j6912P6888j23217g1149A3964J08970e0936A15017I924K5499h2627
10063E6717d0111f837m9152H5888j2616P0160a83386C2894b00117b3378r4216
10052a17594D1641j5213a95788M0200P7522a2721k11061g0169A62547g2255G9560
10040A18764g1142j07374A83853b96517D6544N5703b16819m6358a23094A33262
10029A28289a65243B37096j8198c20467A08393a8317j56408c2369k07885i8994
10018a60685O2910k60911B29024q6594D7232b23896F6775a12286A47318K2861
10008A70179c4861C8362a29518J0118c6067f894A0440L6686a27736L8217k22015
9997c11534f9357L218j57235N5923f0p1707P818j16824J2265g2768l7894l6601
$$ plain form
9985 -147263 -141448 -113386 75390 -147615 -149943 -77322 -355024 10598 10315 -28756 -89810 -265240
9973 -265240 -63548 443269 -89795 -210909 -253250 8776 -232986 -24495 -135367 119006 -230244
9961 130561 -26331 -84894 37825 102033 215904 -434 212891 39242 87098 -3136 -301735 184342
9948 -145861 -224406 -311630 157881 -36488 1176 -198746 36929 -31742 197629 142391 223285
9937 223285 -13617 57974 -209245 113458 369358 -241087 -19412 -255907 114878 -31870
9926 68181 56764 -210851 187623 -83592 2538 -533867 5269 -117051 -58630 139433 -275848
9914 -42014 -176827 79549 -299419 -10028 -436465 41859 -21302 -179492 -259533 15952 73675
9903 73675 -154984 179342 -50596 -559432 11961 21644 -98161 -530269 -312409 112549 -277136
$$ packed form
9985a47263N815K8062G5390a47615k328P2621k77702A0598k83b8756o1054j75430
9973b65240f3548D43269h9795j21114m2341H776b32986b4495j10872A19006b30244
9961A30561b6331n8563C7825O4208J13871d34B12891C9242M7856c136k98599A84342
9948a45861p8545q7224A57881c6488A176a98746C6929c1742A97629n5238Q0894
9937B23285a3617E7974b09245A13458K55900b41087a9412k36495A14878c1870
9926F8181j1417b10851A87623h3592B538e33867E269a17051N8421A39433b75848
9914d2014j34813G9549b99419a0028m26437D1859b1302j58190q0041A5952N7723
9903G3675a54984A79342e0596n08836A1961R683i8161m32108K17860A12549b77136
$$ plain form
9891 97881 -52622 29904 -49088 -167193 13321 7568 -168427 -66068 -81906 -23988 -134338
9880 -134338 -444644 -203113 -130916 275145 -248979 -277727 32397 -65766 -267 -172911 57249
9868 -336366 27482 -252993 -317401 -110464 114915 -164162 -118100 -107875 56030 192531 289141
9857 289141 134714 208716 92766 256191 89439 -577309 -314346 -259365 263608 52903 -242244
9845 -296654 -167939 62446 -65639 57492 -160240 -277693 -35587 18263 -214920 87942 -141419
9833 -87238 -129470 18718 -226525 -314427 -52840 -55308 100790 -3119 -15567 118133 -16252 -26519
9821 -26519 194340 -108004 -41566 98056 -60390 -45148 -69013 45991 -110893 -255386 -67440
9809 59562 -192863 -22474 138810 -49341 -126932 164861 -89864 36409 -108977 51330 -271640
$$ packed form
9891I7881e2622B9904d9088j18105A3321n753a68427f6068j5838b3988j10350
9880a34338l10306b03113P2197B75145b48979k8748C2397f5766b67j72644E7249
9868c36366B7482b52993o4408a10464A14915a64162M6062J0225E6030J36501R6610
9857B89141A34714P4002I2766J63425H9439e77309K62963N4981B63608E2903b42244
9845b96654J28715F2446f5639E7492a60240j17453c5587A8263b14920H7942a41419
9833h7238m2232A8718b26525q7902e2840k468A00790c119j2448A18133a6252j0267
9821b6519A94340a08004d1566I8056f0390J5242k3865D5991a10893j44493f7440
9809E9562a92863b2474A38810d9341p7591A64861h9864C6409a08977E1330b71640
$$ plain form
9797 -324525 41033 48477 -142594 107741 67273 -216387 35185 52547 -7750 -482973 45673
9785 61702 -121174 -43571 179635 126048 -33618 -196985 -175852 -259561 -151377 188609 -191075
9773 97374 -246807 92200 190621 -193228 -187744 -299848 -22515 -72631 -235851 27853 -214035
9761 -250779 165267 -300482 58836 56129 192067 8638 -251282 -348960 -1253 -85408 81396
9749 146316 -400579 -210020 24645 200275 -13101 -291293 -194327 -331057 286769 -78400
9738 9409 -361952 372034 347187 -519788 122465 259369 -14673 70660 -81722 -118311 -61951
9727 -61951 -306907 -326036 232878 28298 62908 -243059 207775 205023 111849 -230873 -368375
9716 -368375 -50783 -178534 -210440 126724 -196552 -96554 -222718 -146161 389605 -184 710
$$ packed form
9797c24525D1033P444a42594A07741m0468b16387C5185J7362g750m75223D5673
9785F1702a21174d3571A79635n3587c3618j63367K1133q3709J08184A88609a91075
9773I7374b46807I2200R8421a93228N484j12104b2515n0116j63220B7853b14035
9761b50779A65267c00482E8836k707J35938H638b51282r7678a253q4155H1396
9749A46316d00579J90559B4645J75630a3101k78192R6966j36730B86769g8400
9738I409c61952C72034k4847e19788A22465J36904a4673G0660h1722l6589N6360
9727f1951k44956j9129B32878B8298L4610b43059B07775k752r3174b30873j37502
9716c68375e0783j27751l1906A26724a96552i6554j26164P6557C89605a84G10
$$ plain form
9704 -207970 57736 84251 -307644 -301586 32923 -121594 -81325 -96682 -20717 -159805 253651
9692 89694 -16689 191143 -158680 -149413 -166764 -102492 -178879 -187710 24960 -182578 -108429 -98282
9680 -98282 19731 -272974 263261 55268 225127 170674 324840 -208491 454425 -163671
9669 217606 -302806 -306142 -94530 -149574 -271019 1907 286137 148364 -50380 154561 -384081
9657 123840 -435049 -78388 -473529 -353158 -192377 297559 -381418 3691 -150717 1528 -60553
9645 -277100 127806 21106 23676 41569 -147648 -129995 -114082 299689 157372 -126694 -316262
9634 -316262 -41021 63327 89322 49380 -246861 35963 -45467 3367 98109 -209316 74004
9622 74145 -334309 -171794 -172968 -263077 -155195 -195760 3286 -52672 -57132 66047 -63001 26508
$$ packed form
9704b07970E7736K6515c07644O058C2923a21594M0269j5357b0717j39088B53651
9692H9694a6689A91143a58680R267j7351O4272p6387q831B4960a82578P4149J0147
9680i8282A9731b72974B63261E5268J69859n4453J54166b08491D54425a63671
9669B17606c02806l336i4530n5044j21445A907K84230j37773e0380A54561c84081
9657A23840d35049g8388l95141J20371J60781B97559c81418C691a50717A528f0553
9645b77100A27806B1106K570J7893a47648J7653J5913B99689j42317a26694j89568
9634c16262d1021F3327K5995l9942b46861C5963d5467C367R4742b09316G4004
9622G4145c34309J62515j174r0109J07882m0565C286e2672m460F6047f3001B6508
$$ plain form
9609 -242357 234613 65307 -3551 -234049 119698 -154280 40608 -185535 -121293 -87062 -391531
9598 -391531 69642 -256211 121395 1139 -184331 22772 295752 -118189 221821 -88201 206803
9586 -207270 34694 -98211 -131289 -123949 -86837 -570887 -72737 -5336 46587 -131860 -116478 -343104
9574 -343104 31597 -82595 32624 -89687 -217115 -197516 -122586 -105536 -168717 -67325 47017
9562 79187 10646 -72439 -160567 -328042 -220250 151583 -136547 -34461 -195316 -340592 37427
9550 -79306 343981 168557 -103712 15737 62840 397498 -266274 228170 -359014 -162973
9539 119220 21840 -289599 -231862 41735 -130497 -241517 -11744 -94296 243104 -311515 136575
9527 -239240 85740 132575 198983 -51589 4451 90328 -130059 -52637 -123815 180443 126569
$$ packed form
9609b42357B34613F5307c551k30498A19698a54280D0608a85535O4242L4231l04469
9598c91531F9642b56211A21395A139a84331B2772K72980a18189B21821h8201B06803
9586b07270C4694i8211l3078P340L7112m84050g2737e336D6587a31860J5382k26626
9574c43104C1597h2595C2624h9687j27428J9599P4930J7050o3181f7325D7017
9562G9187A0646g2439q8128j67475J07792A51583a36547c4461j60855j45276C7427
9550g9306C43981A68557a03712A5737M7103L34658b66274B28170c59014a62973
9539A19220B1840b89599N7737D1735a30497j11020a1744q2552B43104c11515A36575
9527b39240H5740M6835O6408e1589D451Q5877a30059e2637p1178A80443n3874
$$ plain form
9516 126569 -135975 205770 278444 -177351 98819 7019 1006 62510 327192 87802 -37374
9504 -91361 -61053 12135 -182679 -471135 11704 85920 128661 27086 550018 197502 183913
9493 183913 -233858 -27716 -142457 -98607 432287 206614 -152048 -6823 -127293 -45522 269760
9481 -52061 113154 -306295 -210191 -315027 -78902 -557798 51723 53885 -340834 161215 16896
9469 -120935 244758 -44983 -12728 -172009 -40467 -124524 269272 -100742 -78588 -116348 -110246
9458 -110246 159376 234860 -363009 -428073 3179 -49744 219736 -84048 -355355 -68169 -134644
9447 -134644 -279440 112040 46044 7386 -146119 -216191 366028 -374431 -73028 268721 98253
9435 64220 82450 -125458 -216212 219968 226522 -243148 351460 -124194 -148532 -152892 52534
$$ packed form
9516A26569a35975B05770P2674a77351I8819G019A006O1504K64682H7802c7374
9504i1361L0308A2135a82679k88456A1704P4216M2741B7086N22932A97502j3589
9493A83913b33858b7716j14741M3850D32287B06614a52048f823j20470d5522B69760
9481e2061A13154c06295R6104j04836g8902m78896E1723K162c40834A61215A6896
9469a20935B44758d4983a2728j59281d0467q4057B69272a00742K2154l7760O102
9458a10246A59376P5484c63009o5064C179d9744B19736h4048k71307f8169o6475
9447a34644j44796A12040D6044G386a46119p0072C66028c74431g3028B68721I8253
9435F4220J8230a25458r0754B19968O554b43148C51460a24194k4338m360E2534
$$ plain form
9423 -10544 172431 -300386 48453 -66566 132197 -132526 -18638 -185093 186002 -73792 -172689
9412 -172689 -98080 -19605 -301799 350972 -232225 86221 -250176 -106240 -80240 -25398 -144714
9401 -144714 59005 -201459 176550 -85629 -64733 67305 -66509 -163367 -77782 74448 -94743
9389 -99628 -263771 -17027 -91490 -165500 39900 -42824 147579 -39836 -154324 -337448 -105954
9377 -19290 -111052 -192931 90861 -160468 -149413 -19904 -318425 55306 -125040 -118664 105696
9365 -154473 -83692 -367614 -33716 34168 35598 -327254 136414 -263350 97573 87511 65791
9354 65791 -78065 85721 -78048 -220135 -355940 -82806 -119551 -165700 40592 -24235 4918 -38172
9341 -80159 -9439 124802 263651 162117 -125767 51790 -299874 -191809 25198 -283828 -444958
$$ packed form
9423a0544A72431c00386D8453f6566A32197a32526a8638j66455A86002g3792r8897
9412a72689P4609a9605k82194C50972b32225H6221b50176a06240K6000b5398j19316
9401a44714E9005b01459A76550h5629K0896F7305f6509r6858g7782G4448i4743
9389i9628j64143a7027p4463p4010C9900d2824A47579c9836j14488j83124a05954
9377a9290r1762q1879I0861a60468J1055a9904k98521E5306a25040O376A05696
9365a54473P0781k83922c3716C4168J430c27254A36414b63350I7573j0062k1720
9354F5791g8065H5721g8048j42087j35805h2806l6745m6149D0592b4235D918c8172
9341h0159i439A24802J38849j01534a25767E1790b99874J08065B5198b83828j61130
$$ plain form
9330 -444958 -81211 -382432 -134124 114114 -53209 -178332 -222892 -201101 -8343 -327845 74796
9318 -61433 -250278 -81539 49406 101948 -109756 -307675 -22486 -1450 -1803 -45354 -58990 52316
9305 395188 -238424 68545 -99335 147935 143605 8151 -99362 -8043 -72628 119954 26405 -123296
9292 -193226 -207017 334143 -207724 -8318 -84431 -92993 57965 -32555 59800 -47423 -134372 10859
9279 -225323 16030 -89930 -278091 -5944 254829 175910 89815 5980 10337 -188258 -48220 223039
9266 -86815 -160959 99783 -253701 -202020 129424 217087 90332 196281 -76477 -217994 -81898
9254 376422 -154281 119917 -1571 -237756 3123 -135731 5346 -98722 -145553 -180805 27341
9242 42485 30161 -150993 -36732 -53536 -51137 -41555 -391785 -117842 123169 -111733 -358 -357343
$$ packed form
9330d44958h1211l01221a34124A14114e3209j25123m4560K1791h343l19502G4796
9318f1433j88845h1539D9406N2542a09756j97919b2486a450l53m3551j3636E2316
9305C95188b38424F8545i9335A47935m330H151i9362h043o4585A19954B6405a23296
9292a93226j3791C34143b07724h318p6113q562E7965c2555E9800d7423q6949A0859
9279b25323A6030h9930j88161e944B54829p8919q6095E980M357a88258d8220B23039
9266h6815p4144I9783b53701N1681A29424Q7663I0332J05949g6477j41517h1898
9254C76422a54281A19917a571k36185C123a35731E346i8722m6831l5252B7341
9242D2485j2324a50993c6732j6804K399R582l50230a17842A23169a11733c58l56985
$$ plain form
9230 -357343 139922 -5225 -176306 -116999 -78235 -141427 -124325 -168162 -198192 -91810 9941 52065
9218 52065 -260513 -113514 266700 -18166 -241388 -146624 -325125 81510 -86512 61957 -132882
9206 -362915 -28122 -272049 86692 -110979 7517 41055 -76526 360943 -101715 101100 -193471
9194 144808 325172 -157999 -72935 -267801 -203271 -276184 217932 15759 172907 -10603 -15499
9183 -15499 52448 -198157 -62053 -23007 -277897 -443057 -144090 -215274 56056 306165 -82449
9171 126182 -322487 -133963 -20806 -132109 -291610 -90716 155371 -94634 -51339 7837 63839
9160 63839 38686 121369 149853 -152118 167555 223537 -59243 -785 -199029 134532 -66256
9148 -69220 -529 141838 -148262 -198021 179776 -71112 17852 -83514 737 9631 -44848 158760
$$ packed form
9230c57343A39922e225j71081N9307L8764o3192J7102m3837l0030i1810I941M2124
9218E2065b60513a13514B66700a8166k23222R4764j78501H1510h6512F1957a32882
9206c62915b8122k43927H6692a10979G517L3538g6526C60943a01715A01100a93471
9194A44808J80364a57999g2935j94866O4530p2913B17932A5759J57148a0603m896
9183a5499E2448a98157f2053b3007k54890j65160a44090p1184E6056K50109h2449
9171A26182c22487a33963b0806j11303j59501i0716A55371i4634M3295G837N6002
9160F3839k5153Q2683K8484a52118A67555N5982e9243g85j98244A34532f6256
9148f9220e29A41838a48262m9759A79776g1112A7852h3514G37Q894d4848A58760
$$ plain form
9135 -202304 -221973 129425 -157255 -150945 -212490 -483863 -3125 -207696 17924 -122441 86439
9123 -160324 53706 -207396 -19992 294723 -262328 -78547 -136541 -234088 25806 -36751 -140320
9112 -140320 51081 -65098 -242805 -1474 -154292 95784 -129592 184237 -460268 -204280 -534787
9101 -534787 -208476 -17867 -100407 17841 -129049 -113587 93657 -55600 202063 241879 27347
9089 -209949 15286 165272 -14232 -76318 14609 128712 86910 -196645 -178658 158869 540
9077 121310 -226375 -90482 -87557 -111250 179376 48055 -240347 -97199 -136021 277067 28173
9065 -198877 -328633 -150414 -70476 33189 -245392 138365 165389 -73450 -107801 -71040 33583
9053 -121129 38908 -30658 -322985 90672 -33550 -200874 -107508 -34407 -36323 -68469 -81728
$$ packed form
9135b02304j9669A29425a57255O310o1545k71373c125k04571A7924a22441H6439
9123a60324E3706b07396a9992B94723b62328g8547n7994r7547B5806c6751j03569
9112a40320E1081f5098j77707a474j52818I5784a29592A84237d60268b04280l30507
9101e34787b08476a7867q2540A7841a29049J5462I3657e5600B02063L9816B7347
9089b09949A5286J49986a4232o2086A4609J14103m1802a96645J7987A58869E40
9077A21310b26375i0482K925k3693A79376D8055b40347i7199l8822B77067B8173
9065a98877j29756a50414g0476C3189b45392A38365K7024g3450l4351L6761C3583
9053a21129C8908c0658k92327I0672c3550j67324R3366c4407j916l2146j3259
$$ plain form
9042 -81728 -366608 -193920 -42709 132577 -171236 -203837 -32305 -151085 -225160 -23787 69302
9030 -45389 -7426 2754 92718 -206094 10914 -229880 -149642 124552 119749 -256742 155381
9018 -221463 -139116 41932 -100657 103264 -32740 234066 -168239 320421 55143 -28799 165562
9006 203616 -96270 -4000 113638 55594 -70095 288437 110321 -8605 -16287 -176172 97680
8994 25736 -124011 -39599 -89896 -23338 -118707 -68853 -488598 -248834 -53810 -378623 -150061
8982 -62619 92433 224706 -7388 12 7503 -89287 -153280 -264630 -34868 5195 77051 -188128
8969 -225170 -83845 63447 -422285 -174935 82772 -151719 -195681 -163878 281719 -53009 276273
8957 -275268 10305 -269948 31935 -324150 82709 -40129 260797 -33399 -83752 -263002 239480
$$ packed form
9042h1728k84880J72688d2709A32577a71236l2601c2305j18780p4075b3787F9302
9030d5389g426B754Q9964b06094A0914b29880Q0238A24552m803b56742A55381
9018b21463Q2347D1932a00657A03264c2740B34066a68239C20421E5143b8799A65562
9006B03616i6270d000A13638E5594g0095B88437A10321h605p682j59885I7680
8994B5736a24011c9599n0297b3338r5369M9854m19745K39764e3810l24813a50061
8982f2619I2433J32273g388A2P491h9287o3993j11350c4868E195P1856a88128
8969b25170h3845F3447d22285a74935H2772a51719m3962L1803B81719e3009B76273
8957b75268A0305b69948C1935c24150H2709d0129B60797c3399n0353j79250B39480
$$ plain form
8945 -201313 -174544 100316 109864 50723 -112279 -126513 190324 -39923 -47180 242599 633055
8934 633055 160972 249630 128350 -202252 3391 -20143 -204372 -74839 408078 450475 1034437
8923 1034437 3521800 18283551 7683587 1597951 260125 128521 174287 119567 168554
8914 168554 335755 -93008 -134012 -270009 -62178 231622 113132 -312049 -205122 8314 -113096
8902 140646 -14121 -85107 -436153 -200158 84118 -85817 265597 195439 55595 -116635 -280
8890 -22742 169944 -86376 -210192 5775 -291516 28059 44469 -269184 -249053 -284715 66093
8878 -17661 229952 16560 51091 -101023 -143822 310011 -54071 -125454 95992 97557 -287572
8866 -96055 -236181 63801 52110 125738 65946 -28045 -78950 -92719 -288297 115229 170908
$$ packed form
8945b01313K6769A00316R548E0723a12279j4234A90324c9923p257B42599L90456
8934F33055A60972Q8658j21280b02252C391b0143j84229g4839D08078M2397N83962
8923A034437K487363J4761751G683587A597951B60125A28521M5766n4720M8987
8914A68554J67201i3008m1004j35997f2178B31622A13132c12049J06927H314a13096
8902A40646a4121p0986l51046b00158H4118h5817B65597p0158E5595a16635b80
8890b2742A69944h6376j23816E775b91516B8059J6410b69184K0131l5662F6093
8878a7661B29952A6560L4531a01023m2799C10011e4071p1383I5992J565b87572
8866i6055j40126F3801j1691P3628n9792b8045n0905j3769j95578A15229N5679
$$ plain form
8855 170908 108829 -194663 124900 -50558 -288595 -74743 -105489 -30668 80027 -59494 -92152
8844 -92152 136053 -153223 139172 -301677 103550 96476 123468 63074 75938 -220048 -515988
8833 -515988 -80175 21619 -200033 391 55020 164767 -242259 -83801 -162912 195275 -21589
8821 -211869 8321 -10101 20571 -116785 -575419 -181215 -75284 -165389 346469 184055 203323
$$ packed form
8855A70908o2079a94663A24900e0558k38037g4743l0746c0668H0027e9494l2658
8844i2152A36053a53223A39172c01677A03550p074K6992o0394J2864b20048k95940
8833e15988h0175B1619b00033C91N4629J09747b42259h3801p9111A95275b1589
8821b11869H321a0101B0571a16785m58634a81215g5284r0105C46469j62414J9268
$$ [...]
##END NTUPLES=NMR SPECTRUM
##END=
