##TITLE=AC1565_ROEFFECT0018_8270532_XF1lbCM5OA
##JCAMPDX= 6.0         $$ Bruker NMR JCAMP-DX V2.0
##DATA TYPE= NMR SPECTRUM
##DATA CLASS= NTUPLES
##ORIGIN= BRUKER
##OWNER= Administrator
$$ 1.72 TOPSPIN		Version 2.1
$$ 2013-10-12 17:22:09.269 -0700  Administrator@X
$$ Compression mode = diff/dup
##.OBSERVE FREQUENCY= 400.02188249412
##.OBSERVE NUCLEUS= ^1H
##.ACQUISITION MODE= SIMULTANEOUS (DQD)
##.ACQUISITION SCHEME= undefined
##.AVERAGES= 8
##.DIGITISER RES= 22
##SPECTROMETER/DATA SYSTEM= spect
##.PULSE SEQUENCE= zg30
##.SOLVENT NAME= COFFEE_meoh
##.SHIFT REFERENCE= INTERNAL, COFFEE_meoh, 1, 14.98509
##AUDIT TRAIL= $$ (NUMBER, WHEN, WHO, WHERE, PROCESS, VERSION, WHAT)
$$ ##TITLE= Audit trail, TOPSPIN		Version 2.1
$$ ##JCAMPDX= 5.01
$$ ##ORIGIN= Bruker BioSpin GmbH
$$ ##OWNER= Administrator
$$ $$ E:\/data/COFFEE/nmr/AC1565_ROEFFECT0018_8270532_XF1lbCM5OA/10/pdata/1/auditp.txt
$$ ##AUDIT TRAIL=  $$ (NUMBER, WHEN, WHO, WHERE, PROCESS, VERSION, WHAT)
(   1,<2013-10-12 17:22:02.457 -0700>,<Administrator>,<X>,<go>,<TOPSPIN 2.1>,
      <created by zg
	started at 2013-10-12 17:20:56.363 -0700,
	POWCHK enabled, PULCHK disabled,
       configuration hash MD5:
       C8 4E 4E 5D D3 5C D8 9E 9F 52 82 E0 59 8A DE 15
       data hash MD5: 64K
       48 12 6E 00 02 ED E3 3A 68 B9 9E 23 32 CE 4E 27>)
(   2,<2013-10-12 17:22:05.410 -0700>,<Administrator>,<X>,<proc1d>,<TOPSPIN 2.1>,
      <Start of raw data processing
       efp LB = 0 FT_mod = 6 PKNL = 1 PHC0 = 0 PHC1 = 0 SI = 32K 
       data hash MD5: 32K
       51 B1 E7 40 D8 31 EE E2 8E 02 18 FE 6F 3B A1 61>)
(   3,<2013-10-12 17:22:05.754 -0700>,<Administrator>,<X>,<proc1d>,<TOPSPIN 2.1>,
      <pk PHC0 = 98.55835 PHC1 = 0 
       data hash MD5: 32K
       BA CA F6 2B 30 C9 6F 78 47 FF B6 75 0E 9A E0 BB>)
(   4,<2013-10-12 17:22:05.863 -0700>,<Administrator>,<X>,<proc1d>,<TOPSPIN 2.1>,
      <abs ABSG = 1 
       data hash MD5: 32K
       FA AB BF 73 58 81 8B E7 63 D6 D6 9E 16 54 BE AB>)
(   5,<2013-10-12 17:22:05.941 -0700>,<Administrator>,<X>,<proc1d>,<TOPSPIN 2.1>,
      <abs ABSG = 2 
       data hash MD5: 32K
       14 96 48 C0 ED CE 8F EE 53 99 4F 87 D1 10 50 1D>)
(   6,<2013-10-12 17:22:06.004 -0700>,<Administrator>,<X>,<proc1d>,<TOPSPIN 2.1>,
      <abs ABSG = 3 
       data hash MD5: 32K
       92 EA CF 52 CA 6A D0 63 8E 59 9C 67 0B 0A A7 80>)
(   7,<2013-10-12 17:22:06.097 -0700>,<Administrator>,<X>,<proc1d>,<TOPSPIN 2.1>,
      <abs ABSG = 4 
       data hash MD5: 32K
       35 4F B8 67 70 73 E8 16 8D 83 B3 BB C4 9C C8 D4>)
(   8,<2013-10-12 17:22:06.144 -0700>,<Administrator>,<X>,<proc1d>,<TOPSPIN 2.1>,
      <abs ABSG = 5 
       data hash MD5: 32K
       49 5F 34 E7 67 5E 45 D5 51 67 82 67 F1 8F A5 4C>)
$$ ##END=
$$ 
$$ $$ hash MD5
$$ $$ ED 4B 8A 56 C0 CB AE AC 37 1E CC E5 5B 8A C0 90
##$RELAX= 
##$RELAX= 
##$RELAX= 
##$RELAX= 
##$RELAX= 
##$RELAX= 
##$RELAX= 
$$ Bruker specific parameters
$$ --------------------------
##$DU= <E:\>
##$EXPNO= 10
$$ [...]
150 150 150 150 150 150 150 150
##$TP07= 0
##$TPNAME0= <>
##$TPNAME1= <>
##$TPNAME2= <>
##$TPNAME3= <>
##$TPNAME4= <>
##$TPNAME5= <>
##$TPNAME6= <>
##$TPNAME7= <>
##$TPOAL= (0..7)
0.5 0.5 0.5 0.5 0.5 0.5 0.5 0.5
##$TPOFFS= (0..7)
0 0 0 0 0 0 0 0
##$TUNHIN= 0
##$TUNHOUT= 0
##$TUNXOUT= 0
##$USERA1= <user>
##$USERA2= <user>
##$USERA3= <user>
##$USERA4= <user>
##$USERA5= <user>
##$V9= 5
##$VALIST= <valist>
##$VCLIST= <CCCCCCCCCCCCCCC>
##$VD= 0
##$VDLIST= <DDDDDDDDDDDDDDD>
##$VPLIST= <PPPPPPPPPPPPPPP>
##$VTLIST= <TTTTTTTTTTTTTTT>
##$WBST= 1024
##$WBSW= 4
##$XGAIN= (0..3)
0 0 0 0
##$XL= 0
##$YL= 0
##$YMAX_a= 633183
##$YMIN_a= -539197
##$ZGOPTNS= <>
##$ZL1= 120
##$ZL2= 120
##$ZL3= 120
##$ZL4= 120
##$ABSF1= 14.98509
##$ABSF2= -5.573092
##$ABSG= 5
##$ABSL= 3
##$ALPHA= 0
##$AQORDER= 0
##$ASSFAC= 0
##$ASSFACI= 0
##$ASSFACX= 0
##$ASSWID= 0
##$AUNMP= <proc_prof1d_extract_pilot.lims>
##$AXLEFT= 0
##$AXNAME= <>
##$AXNUC= <1H>
##$AXRIGHT= 0
##$AXTYPE= 0
##$AXUNIT= <>
##$AZFE= 0.1
##$AZFW= 0.1
##$BCFW= 0
##$BC_mod= 0
##$BYTORDP= 0
##$COROFFS= 0
##$CY= 15
##$DATMOD= 1
##$DC= 0
##$DFILT= <>
##$DTYPP= 0
##$F1P= 0
##$F2P= 0
##$FCOR= 0.5
##$FTSIZE= 32768
##$FT_mod= 6
##$GAMMA= 0
##$GB= 0
##$INTBC= 1
##$INTSCL= 1
##$ISEN= 128
##$LB= 0
##$LEV0= 0
##$LPBIN= 0
##$MAXI= 10000
##$MC2= 0
##$MEAN= 0
##$ME_mod= 0
##$MI= 0
##$NCOEF= 0
##$NC_proc= -8
##$NLEV= 6
##$NOISF1= 0
##$NOISF2= 0
##$NSP= 0
##$NTH_PI= 0
##$NZP= 0
##$OFFSET= 14.98509
##$PC= 1
##$PHC0= 98.55835
##$PHC1= 0
##$PH_mod= 1
##$PKNL= yes
##$PPARMOD= 0
##$PPDIAG= 0
##$PPIPTYP= 0
##$PPMPNUM= 2147483647
##$PPRESOL= 1
##$PSCAL= 4
##$PSIGN= 0
##$PYNMP= <proc.py>
##$REVERSE= no
##$SF= 400.02
##$SI= 32768
##$SIGF1= 0
##$SIGF2= 0
##$SINO= 400
##$SIOLD= 32768
##$SPECTYP= <>
##$SREGLST= <1H.CDCl3>
##$SSB= 0
##$STSI= 32768
##$STSR= 0
##$SW_p= 8223.68421052631
##$SYMM= 0
##$S_DEV= 0
##$TDeff= 65536
##$TDoff= 0
##$TI= <>
##$TILT= no
##$TM1= 0
##$TM2= 0
##$TOPLEV= 0
##$USERP1= <user>
##$USERP2= <user>
##$USERP3= <user>
##$USERP4= <user>
##$USERP5= <user>
##$WDW= 1
##$XDIM= 32768
##$YMAX_p= 448153141
##$YMIN_p= -744605
##$CURPLOT= <Network HP LaserJet P1505>
##$CURPRIN= <$Network HP LaserJet P1505>
##$DFORMAT= <normdp>
##$LAYOUT= <+/1D_H.xwp>
##$LFORMAT= <normlp>
##$PFORMAT= <normpl>
##$SURQMSG= 1
$$ End of Bruker specific parameters
$$ ---------------------------------
##NTUPLES= NMR SPECTRUM
##VAR_NAME=  FREQUENCY,     SPECTRUM/REAL,   SPECTRUM/IMAG
##SYMBOL=    X,             R,               I
##VAR_TYPE=  INDEPENDENT,   DEPENDENT,       DEPENDENT
##VAR_FORM=  AFFN,          ASDF,            ASDF
##VAR_DIM=   32768,         32768,           32768
##UNITS=     HZ,            ARBITRARY UNITS, ARBITRARY UNITS
##FACTOR=    0.250966925370066, 1,           1
##FIRST=     8223.43324360094, -216542,      -42230
##LAST=      0,             103320,          -321317
##MIN=       0,             -744605,         0
##MAX=       8223.43324360094, 448153141,    0
$$ Real data points
##PAGE= N=1
##DATA TABLE= (X++(R..R)), XYDATA
$$ [...]
$$ plain form
19563 -219031 -49048 140835 -105678 -162087 -207524 -66479 -191891 -332942 -106760 -178245
19553 -178245 -81722 3099 -316609 -138016 -136636 -17765 267 -662 -297302 -281214 -228019 -381909
19541 -381909 -185570 -243830 75803 89785 -4424 -24984 -213328 -203147 -246951 -107904 -29879
19529 -424307 -362298 42820 278490 -57939 93923 298506 101218 -127077 -67941 307212
19518 295545 195827 -41707 -174240 302302 113599 134296 -3076 -65724 158640 -313688 68043
19506 -118720 -36516 113060 -80373 -133995 -197641 313277 24208 510937 -231656 148442
19495 4861 -48649 -102750 -230386 209034 -196955 100717 -207570 -193572 34163 -23101 -402807
19484 -402807 -211645 -86998 -58636 95310 -150418 52745 -124036 -360102 -167888 7055 -16590
$$ packed form
19563b19031d9048A40835a05678n6409m5437f6479j25412j41051a06760p1485
19553a78245h1722C099c16609a38016J380a7765B67f62k96640J6088N3195j53890
19541c81909a85570n8260G5803J3982d424k0560j88344J0181m3804a07904b9879
19529d24307O2009D2820K35670e7939I3923K04583A01218a27077N9136C07212
19518B95545r9718d1707j32533C02302A13599K0697c076o2648A58640c13688F8043
19506a18720c6516A13060h0373n3622o3646C13277B4208M86729b31656A48442
19495D861d8649n4101j27636B09034a96955A00717b07570J3998C4163b3101l79706
19484d02807J91162h6998K8362I5310a50418E2745a24036k36066a67888G055a6590
$$ plain form
19472 4599 145048 -172299 64553 -235247 -64409 -240122 60233 124960 90753 -159094 -215110
19461 -215110 21540 -95262 -4973 90872 -92970 73627 -289767 -30297 114173 204168 -26945
19449 -4605 40692 -53997 -77479 113652 111115 -144311 -298117 -115520 -110435 -131431 -131056 -309534
19437 -309534 -204289 81299 -47681 -11729 -84775 -2155 -70979 -47841 -393741 -88659 -513765
19426 -513765 -18524 27468 132942 -95145 -275099 -2057 -254865 -116242 6384 -33987 57694
19414 110494 58349 143236 -203232 -298318 -328725 -274185 -178346 -189283 -107460 30833 -114584
19402 153844 273409 15012 -198452 180389 66523 -116455 105820 -94349 -199275 -284918
19392 -284918 -163107 -86306 -183481 36526 -80848 -492105 -172805 -282383 -161211 -239454
$$ packed form
19472D599J40449a72299F4553b35247f4409j75713F0233O4727l4207a59094n6016
19461b15110B1540i5262d973I0872i2970G3627b89767c0297A14173Q9995b6945
19449d605D0692e3997k3482A13652k537a44311j53806a15520N085k0996L75j78478
19437c09534J05245H1299d7681a1729p3046b155o8824K3138l45900h8659m25106
19426e13765a8524B7468J05474i5145j79954b057k52808a16242F384c3987E7694
19414A10494n2145Q4887b03232r5086l0407N4540R5839j0937Q1823C0833a14584
19402A53844J19565A5012a98452A80389F6523a16455A05820i4349j04926q5643
19392b84918J21811P6801r7175C6526h0848m11257a72805j09578J21172p8243
$$ plain form
19382 -239454 -206865 -282379 -111445 -234301 -402142 265315 -221571 -12839 59180 -110879
19371 -81375 -156533 4121 -26638 -49435 -297025 -45064 -375499 -93752 -106 -58815 -201650 -154041
19359 -154041 -232861 96389 48579 -21577 121696 -29992 -162904 455568 -34017 171743 21644
19347 231943 -260667 156257 154111 -275482 -145285 -61675 -288942 35683 39085 125846 -341050
19335 -64618 63812 -265008 -178219 64134 -76694 -155322 38695 -128005 -218074 -257701 255389
19323 -186682 -139857 246029 19370 -195728 292895 262469 227332 -8263 -50004 -140088 76240
19311 -64839 48095 273702 -63871 -72612 -416462 -197317 -34127 -230055 -104724 220486 -18346
19299 -57349 -18807 -161238 -36433 28145 -374922 4685 -31063 -249426 264485 18918 -199188
$$ packed form
19382b39454L2589p5514a11445j22856j67841B65315b21571a2839E9180a10879
19371h1375p5158D121b6638k2797k47590d5064l30435i3752a06n8709j42835M7609
19359a54041p8820I6389m7810b1577A21696b9992j32912D55568c4017A71743B1644
19347B31943b60667A56257k146b75482J30197f1675k27267C5683L402Q6761c41050
19335f4618F3812b65008Q6789F4134g6694p8628C8695a28005r0069l9627B55389
19323a86682M6825B46029A9370a95728B92895l0426l5137h263m1741r0084G6240
19311f4839D8095K25607f3871q741l43850a97317c4127j95928a04724B20486a8346
19299e7349a8807j42431c6433B8145c74922D685c1063k18363B64485A8918a99188
$$ plain form
19287 132840 -107106 -61456 -122601 115209 -70664 -44120 89566 -67402 -183532 -97187 -251879
19276 -251879 9909 8510 255695 -120710 -53700 -144404 177219 228311 -91740 -40554 52563
19264 -18630 -132926 -229849 -213734 125950 119702 -117232 -85428 -118202 -23027 -252999 -126192
19252 181722 -160544 -191377 2346 -23076 89630 20286 20703 -22138 48688 300333 -58955 -277160
19240 -277160 -301324 -180984 -122592 113128 63049 -76128 -124490 -10812 35907 -64921 -153521
19229 -153521 -157788 163843 40741 -66351 -23319 -586116 -338783 -37245 334085 7777 -40677
19217 144857 -148285 -43424 6960 152424 -29890 -160568 -78110 -84729 155200 -133216 -15553
19205 -217975 52978 -180734 62998 -103044 -37409 -27037 73545 192760 -47192 32920 -128504
$$ packed form
19287A32840a07106M5650o1145A15209g0664K6544H9566f7402j16130Q6345j54692
19276b51879I909j399K47185a20710e3700r0704A77219N1092i1740d0554E2563
19264a8630j14296r6923J6115A25950o248a17232L1804l2774b3027k29972a26192
19252A81722a60544l0833B346b3076H9630B0286M17b2138D8688K51645e8955k18205
19240b77160k4164J20340N8392A13128n0079g6128m8362a0812C5907f4921q8600
19229a53521m267A63843D0741f6351b3319n62797K47333c7245C34085G777d0677
19217A44857a48285d3424F960J45464b9890j30678g8110o619A55200a33216a5553
19205b17975E2978a80734F2998a03044c7409J0372G3545J19215d7192C2920a28504
$$ plain form
19193 180149 -59507 74658 138777 92333 37716 -175167 -253128 -175604 -164975 -116572 -120717
19182 -120717 -472920 7526 136194 27022 56673 41216 12979 -121263 -222400 -208895 -57856
19170 32313 -366754 -9032 -271354 -176503 -176404 -38343 -99123 7717 -193150 -83257 -404736 -146365
19157 6755 -405816 -25816 191259 -214197 -304709 64062 47078 464996 99052 18008 -68023
19145 218502 -12327 -68986 90655 22138 -153043 32776 -293464 -8975 211767 -80417 245801
19133 -113819 -411881 -135109 -2742 -236113 -234129 241600 127106 -67237 -6778 -350769 -38832
19121 -57640 -127643 -33510 -127398 213342 342702 -178093 -137485 -264213 48361 -166942 -144964
19110 -144964 301637 -58550 -108943 -131808 -193806 107293 -89349 -102765 -6771 6869 -20846
$$ packed form
19193A80149e9507G4658O4119m6444C7716a75167p7961P7524J0629M8403m145
19182a20717l52203G526J28668B7022K9651j5457A2979a21263j01137J3505e7856
19170C2313c66754i032k62322R4851R9c8343o0780G717a93150h3257l21479a46365
19157F755d05816b5816A91259b14197r0512F4062j6984M17918I9052A8008f8023
19145B18502a2327n6659I0655B2138a53043C2776b93464h975B11767h0417B45801
19133a13819k98062a35109b742k33371J984B41600j14494f7237f778l43991c8832
19121e7640p0003c3510r3888B13342J29360a78093M0608j26728D8361a66942K1978
19110a44964C01637e8550n0393k2865o1998A07293h9349j3416f771F869b0846
$$ plain form
19098 -22744 -287065 -3880 -56086 -25203 126989 -3982 -102877 -63806 -95551 -391693 -131642
19086 -359949 -98822 -327877 -125348 144729 -136496 21859 327772 22247 191596 272363
19076 272363 -184899 5907 105599 -79647 -960 -15391 100325 -258541 107360 -32532 -114651
19065 -114651 -171381 -198262 -72087 -240647 -142577 -125790 -83142 386919 -242102 -53478 131748
19053 -81148 76248 -12056 -187389 58106 289676 742 -11245 -104626 -262977 -175836 -190952
19042 -190952 -366544 121135 303577 -212138 -332424 -21250 -57196 -299603 -182308 201936
19031 -148486 -143737 286770 330871 80287 -4045 -163368 81059 219292 86191 133199 -299102
19019 213451 -58988 238911 -270628 -65661 -117243 -118042 -197754 -166487 136800 -10681 -38445
$$ packed form
19098b2744k64321c880n2206b5203A26989c982r8895L9071l1745k96142a31642
19086c59949i8822k29055a25348A44729a36496B1859L05913B2247J69349Q0767
19076B72363a84899E907R9692g9647i60j4431A00325b58541A07360c2532q2119
19065a14651n6730k6881g2087j68560R8070J6787M2648C86919b42102e3478A31748
19053h1148G6248a2056j75333E8106K31570G42a1245r3381j58351Q7141j5116
19042a90952j75592A21135J82442b12138j20286b1250l5946k42407J17295B01936
19031a48486M749B86770M4101H0287d045j59323H1059J38233H6191M7008b99102
19019B13451e8988B38911b70628f5661n1582p99p9712L1267A36800a0681k7764
$$ plain form
19008 -38445 -49161 -235443 -140679 403787 -128255 -56745 125942 -39214 277339 133284
18997 -281281 -107864 -467282 -126579 -166418 126764 69833 -31040 -28364 -222323 -130463 158470
18985 375174 -12158 135508 -240573 147879 70134 -117868 147597 -14528 -141721 -105659
18975 -105659 -249942 -499779 267352 263324 -216138 216564 -251293 54382 -19256 -51289
18965 -51289 -10828 211353 -75799 72981 26206 -50497 63481 272980 24908 134226 85853
18954 85853 -263566 -369815 19508 128235 276292 42459 -90020 -53102 -84925 -37109 406031
18942 97586 25847 -183102 -2102 -426025 -73934 -56142 -112319 169583 33796 -5298 171515
18930 -304861 -68185 -65495 47295 285693 -251415 -393560 251379 191519 283691 -201048 209316
$$ packed form
19008c8445j0716j86282R4764D03787a28255e6745A25942c9214B77339A33284
18997b81281a07864l59418a26579l9839A26764n6931c1040K676j93959R1860A58470
18985C75174a2158A35508b40573A47879G0134a17868A47597a4528j27193L6062
18975a05659j44283k49837B67352m028b16138B16564b51293E4382a9256l2033
18965e1289a0828B11353g5799G2981B6206e0497F3481K09499B4908J09318m8373
18954H5853b63566j06249A9508J08727J48057D2459i0020L6918l1823c7109D06031
18942I7586B5847a83102b102m23923g3934J7792n6177A69583C3796e298A71515
18930c04861f8185K690D7295K38398b51415j42145B51379n9860R2172b01048B09316
$$ plain form
18918 9139 -86670 136915 83854 -323691 -372054 -130786 87682 -51680 -149724 79958 5753
18906 -553963 -151470 -710 105790 44064 34616 45159 99882 30946 408001 59836 23952
18894 -156341 -113347 279156 49334 248082 -159621 514908 -157699 224640 -234577 -146160
18884 -146160 -136127 183165 -227886 -91655 113763 -70493 33396 56092 12032 -57209 39183
18872 -276026 -254049 -63350 -93422 -60013 58012 -116876 96672 -251938 -43091 -110176 63590
18860 64551 345122 -262283 -345814 148282 122719 135367 131140 88430 -302116 253195 97468
18848 73494 71970 107498 42280 -440132 54165 118969 -184721 32065 86747 -165232 176208
18836 -443543 14343 -66514 17995 139972 -177291 -5514 -310726 -255728 -183234 -44403 20185
$$ packed form
18918I139h6670A36915n3061c23691m8363a30786H7682e1680r8044G9958E753
18906e53963a51470g10A05790D4064r448J0543N4723C0946L77055E9836B3952
18894a56341M2994B79156D9334J98748a59621E14908a57699B24640b34577Q8417
18884a46160J0033A83165b27886i1655A13763g0493C3396K2696A2032e7209C9183
18872b76026K1977f3350l0072L3409E8012a16876I6672b51938d3091o7085F3590
18860F4551K80571b62283q3531A48282k5563J2648m227m2710c02116B53195I7468
18848G3494j524L5528D2280d40132E4165O4804a84721C2065N4682a65232A76208
18836d43543A4343f6514A7995J21977a77291e514l05212N4998P2494d4403B0185
$$ plain form
18824 -25870 -265934 -96972 -47796 -273013 159048 303446 -160234 196481 68484 -33498
18813 -130692 17779 -162153 136422 263025 246216 80589 -57552 72038 -82217 252575 -203546
18801 131720 -104845 -236206 30701 -248847 -135227 -146022 91909 87051 9728 170643 116473
18790 116473 68613 51143 -87636 271668 -49174 -413475 72496 -156757 -341208 16080 225587
18779 225587 6451 -19303 -123723 59631 -232269 -32043 -147005 -326366 -482071 -425867 152388
18767 -490351 194649 -198912 -128231 -34102 -111407 317324 -199121 -309158 86405 120062
18757 120062 221065 121511 205369 -41583 -36771 -138410 24687 339319 82751 27983 130080
18746 130080 -264675 -73318 134427 -21371 -94690 -1126 -1457 -244460 -131763 -77458 -123863
$$ packed form
18824b5870k40064i6972d7796k25217A59048J44398a60234A96481F8484c3498
18813a30692A7779a62153A36422J26603j6809H0589e7552G2038h2217B52575b03546
18801A31720a04845j31361C0701b48847J13620j0795I1909m858I728J60915n4170
18790A16473m7860j7470h7636B71668d9174l64301G2496a56757j84451A6080K09507
18779B25587F451a9303j04420E9631b32269c2043j14962j79361j55705N6204A52388
18767d90351A94649a98912P0681c4102p7305C17324a99121j10037H6405L3657
18757A20062J01003r9554Q3858d1583M812j01639B4687L14632H2751B7983J02097
18746A30080b64675g3318A34427b1371p3319a126l31k43003J12697N4305m6405
$$ plain form
18735 -123863 -189224 -334791 -117303 -12196 -154041 -68145 -72030 92883 544201 120743 219437
18724 219437 -45010 -57662 100995 105605 -31357 -143031 -95142 -261188 -245361 -217114 96730
18712 -277012 53797 -62157 -43650 -59442 104136 -179948 -82216 52200 90493 44474 162385
18701 162385 167363 -134367 136467 -268618 -81582 -50894 -334151 -3209 -53754 271627 89101
18689 -256866 45266 -192445 35078 -104078 -137896 -197367 -64707 -148950 -89923 139158 7543
18677 -316577 -167910 214759 106320 42350 310606 434858 287827 13906 -330869 -141962
18666 -244869 39148 -160111 -188268 22874 -109512 -290957 50659 43524 -151530 -22720 -241577
18655 -241577 -194337 -217652 -378137 95689 -180070 300498 -478931 225140 -136785 7659
$$ packed form
18735a23863o5361j45567a17303a2196j41845f8145l885I2883M51318A20743R8694
18724B19437d5010j2652A00995M610c1357j11674M7889j66046J5827K8247I6730
18712b77012E3797f2157J8507j5792A04136a79948h2216E2200L8293D4474J17911
18701A62385M978a34367A36467b68618h1582L0688k83257c209n0545B71627H9101
18689b56866D5266a92445C5078a04078l3818n9471f4707q4243N9027A39158G543
18677c16577J48667B14759A06320D2350K68256J24252j47031A3906c30869a41962
18666b44869C9148a60111k8157B2874a09512j81445E0659p135a51530b2720k18857
18655b41577M7240k3315j60485I5689a80070C00498d78931B25140a36785G659
$$ plain form
18644 90794 -167872 -79665 -161011 210733 69828 -13570 164867 18904 -232692 109956 -327996
18632 -46737 146072 7799 -118737 -328944 -154961 109115 321772 -118017 -253481 -27038
18621 -160429 84305 -13962 -165226 9147 139741 266539 144569 -321801 -211448 -283212
18611 -283212 174592 54808 24276 226442 -56825 -39056 71845 -12256 -43306 -18083 -104804
18600 -104804 39250 217560 7275 -219797 -171735 109534 60705 75072 -213100 55529 -145754
18588 -36764 -23027 -137839 15379 201632 50903 -56587 191287 20554 -229486 -371235 -207742
18577 -207742 -80940 -270365 -420692 -182955 -230349 52794 -120966 -68560 -106132 158695
18566 -125667 -330843 -133928 -118362 -78940 -157237 188157 44544 -286478 -127129 -185184
$$ packed form
18644I0794a67872g9665q1346B10733F9828a3570A64867A8904b32692A09956c27996
18632d6737A46072G799a18737k10207a54961A09115K12657a18017j35464b7038
18621a60429H4305a3962j51264I147J30594J26798j21970c21801J10353p1764
18611b83212A74592E4808B4276K02166e6825J7769G1845a2256l1050a8083q6721
18600a04804C9250J78310G275b19797M8062A09534m8829J4367b13100E5529a45754
18588c6764J3737j14812A5379J86253E0903e6587A91287B0554b29486j41749J63493
18577b07742h0940j89425j50327a82955m7394E2794a20966N2406l7572A58695
18566a25667k05176a33928J5566L9422p8297A88157D4544b86478a27129n8055
$$ plain form
18556 -185184 123079 -173836 -9211 -118780 -290810 -237018 -11590 -231901 -120816 -203911
18546 -203911 -77300 -68124 77255 31616 -120007 188705 152996 -263783 164730 -98036 -201162
18535 -201162 -310905 11655 181545 156082 111189 -132190 114532 7818 -225210 -27099 -44012
18524 -44012 -190604 172642 45473 95911 -73842 -34337 276702 64266 -314189 -109995 -125565
18513 -125565 -106321 -183557 -171233 -350455 68116 -51366 23563 -34814 109922 44856 92585
18502 92585 -48647 -177975 398072 60504 -284991 -137573 153847 -202455 59572 -24708
18491 -23546 -225914 -99119 -191101 -41045 8376 -12619 95595 -251910 -149302 74692 -355819
18479 -14106 -154224 -65124 -271361 -87439 35884 26441 364494 189356 -23330 127132 -184349
$$ packed form
18556a85184A23079a73836i211j09569j72030N3792a1590k20311J11085q3095
18546b03911g7300R176G7255C1616a20007A88705l5709b63783A64730i8036j03126
18535b01162j09743A1655J69890k5463m4893a32190A14532G818b25210b7099j6913
18524d4012j46592A72642D5473N0438g3842c4337B76702F4266c14189a09995j5570
18513a25565J9244p7236J2324j79222F8116e1366B3563c4814A09922D4856M7729
18502I2585d8647j29328C98072F0504b84991a37573A53847b02455E9572b4708
18491b3546k02368i9119r1982d1045H376a2619I5595b51910J02608G4692c55819
18479a4106j40118f5124k06237h7439C5884r443L38053j75138b3330A27132a84349
$$ plain form
18467 297832 -257571 -381283 -117366 343169 115519 99111 -264713 -292126 88948 131419
18457 131419 53927 108054 -198855 122698 63867 -181522 -197785 6656 -203654 -121250 218228
18445 119794 40446 97812 -65579 323236 -43111 -94342 -146578 294221 21452 119130 821
18433 -213010 -151582 37082 -354200 152969 158557 -88561 140621 236707 -293722 4674 -63999
18421 -124372 35950 15584 -154125 81035 45011 -181942 -194157 -186058 79857 -232618 -159293
18410 -159293 -155563 -50588 -248 -25091 -100839 -138126 -269262 156941 -69981 62774 121228 -21024
18397 -79596 4983 28616 -78177 7822 -9941 -192611 -275442 -153618 44090 -215805 115570
18385 -115298 -44577 -662102 -2831 21893 109025 -174438 -275833 -15981 -153052 -26063 123701
$$ packed form
18467B97832b57571j23712a17366C43169A15519j6408b64713k7413H8948M2471
18457A31419E3927N4127a98855A22698n8831a81522j6263F656b03654Q2404B18228
18445A19794D0446N7366f5579C23236d3111n1231n2236B94221B1452R7678H21
18433b13010O1428C7082c54200A52969N588h8561A40621R6086b93722D674f3999
18421a24372C5950A5584a54125H1035l6024a81942j2215Q099G9857b32618P3325
18410a59293L730e0588b48k4843p5748l7287j31136A56941f9981F2774N8454b1024
18397g9596D983K3633g8177G822i941j82670q2831J21824D4090b15805A15570
18385a15298d4577o17525b831B1893Q7132a74438j01395a5981j37071b6063A23701
$$ plain form
18373 -91939 89328 -214401 -9046 -222129 63364 12343 32746 -85545 26839 -237627 -259590
18362 -259590 404613 -83599 -31723 -272028 59451 -87842 41484 55272 -60693 -76858 114980
18350 14248 144073 -159998 7147 99234 -263573 -111979 -162005 -45026 -346274 53200 31185
18339 31185 217646 -84624 104091 -222342 -31502 -24659 -302127 325858 -44034 110012 -63107
18327 -4535 101887 21467 -34125 -165838 -353062 -1074 -245074 -192690 -167102 96186 555050
18316 555050 53657 -1737 155699 -273831 -345631 67571 316844 -70161 63999 -175173 -12284
18304 -52936 -35579 -124060 -48120 55255 -196362 -110219 -3403 73137 -16763 95130 -292275
18292 -176296 -171288 131375 -137752 272541 -21934 -439532 -42583 14975 -141135 -49373 -40640
$$ packed form
18373i1939H9328b14401i046k13083F3364A2343K0403h5545B6839b37627k1963
18362b59590D04613h3599c1723k40305E9451h7842D1484J3788f0693j6165A14980
18350A4248J29825a59998G147R2087b63573a11979n0026d5026l01248E3200k2015
18339C1185J86461h4624A04091b22342c1502O843k77468C25858d4034A10012f3107
18327d535A01887B1467c4125j31713j87224a074k44000N2384K5588I6186M58864
18316E55050E3657a737A55699b73831p1800F7571K49273g0161F3999a75173a2284
18304e2936J7357q8481d8120E5255a96362Q6143c403G3137a6763I5130b92275
18292a76296N008A31375a37752B72541b1934m17598d2583A4975a41135d9373Q733
$$ plain form
18281 -40640 115879 131824 -75064 -173837 -65010 -174448 24009 -242925 -300217 34787 -98839
18269 -224533 -22667 220521 -35527 -15137 -140136 -246344 191064 -58956 94270 -178675
18258 -95359 61008 59114 48439 369713 -49671 15270 -31571 -88134 -357885 -130979 -179273
18247 -179273 52071 -136777 -175784 -266444 -554340 -216886 -215851 -197715 113743 -385396 -119791
18235 125517 -189465 -63890 164942 69990 -170288 -19675 -182037 -38534 -166412 -155448
18225 -155448 214540 226106 356277 -103422 -61372 -341023 -23865 -22428 -20247 128493 -88372
18213 -246297 163598 39763 -70247 -86966 72194 452981 -290435 -19221 -93861 65341 -61477
18201 65478 148030 -227808 -282999 -65328 -176003 -34407 59414 -30136 -238109 -27997 21601
$$ packed form
18281d0640A15879J5945g5064r8773f5010j09438B4009b42925n7292C4787i8839
18269b24533b2667B20521c5527a5137j24999j06208A91064e8956I4270a78675
18258i5359F1008j894j0675L21274d9671A5270c1571n6563k69751a30979m8294
18247a79273E2071a36777l9007r0660k87896b16886J035J8136A13743c85396a19791
18235A25517a89465f3890A64942F9990a70288a9675j62362c8534j27878J0964
18225a55448B14540J1566J30171a03422M2050k79651b3865J437K181A28493h8372
18213b46297A63598C9763g0247j6719G2194L80787b90435a9221p4640F5341f1477
18201F5478Q2552b27808n5191f5328j10675c4407E9414c0136k07973b7997B1601
$$ plain form
18189 90249 -27939 14245 53963 238084 -224501 109390 -149942 193837 -1959 -195806 160747
18177 -10920 227900 211840 -196844 253866 50288 207291 -282758 158452 -102680 76731
18166 73115 -269960 168637 21621 -32400 -142802 -117114 -232214 134202 87228 97577 -77292
18154 31581 5140 -77774 -52107 45920 -251155 99694 -42300 -255513 166341 -143358 -174133
18143 -174133 -53285 -91736 34774 -143449 1752 149282 259327 -4918 251485 199241 -37533
18131 423686 123307 77543 -9565 -219312 243600 -85066 110356 -390832 191986 101297
18121 101297 -60665 128463 -391992 16682 -298598 5377 30309 -398069 193715 177760 12524
18109 -232497 -301248 -147476 19147 415 -465683 -236774 33141 40342 75225 81452 -23881 214935
$$ packed form
18189I0249b7939A4245L9718J84121b24501A09390a49942A93837a959j93847A60747
18177a0920B27900j6060a96844B53866E0288J57003b82758A58452a02680G6731
18166G3115b69960A68637B1621c2400j10402K5688j15100A34202m6974J0349g7292
18154C1581E140g7774K5667D5920b51155I9694d2300k13213A66341a43358l0775
18143a74133e3285l8451C4774a43449A752J47530J10045d918B51485n2244c7533
18131D23686A23307m5764i565k09747B43600h5066A10356c90832A91986r0689
18121A01297f0665A28463c91992A6682b98598E377K4932c98069A93715j5955A2524
18109b32497o8751a47476A9147D15d65683K28909C3141P201L4883O227b3881B14935
$$ plain form
18096 -27152 -117753 -80151 -90273 -115224 146327 -326439 101026 -119172 -133094 -16133 226
18084 -152162 113250 -21447 -79869 209041 165216 167432 60546 -326397 -67801 -227630 -30349
18072 -54775 84976 -98499 157061 -199173 -159412 260484 -46913 -1674 63845 55385 -405151
18060 115989 -115346 222615 89770 129704 19241 57075 -222668 -11511 -5550 -4529 -13427
18049 -13427 302092 -89819 -2524 -122924 50630 357032 -33491 61553 29064 119074 -185759
18037 -1472 -119817 137199 -369026 255404 -38959 167713 26418 -52989 188058 278673 77695
18025 -245558 -180387 -82144 -153160 -50252 175681 146077 165793 86757 -377857 -118811 161579
18013 327003 -34444 -19147 -12782 -117053 -373348 -154648 144799 -12066 -212640 -140364 144249
$$ packed form
18096b7152r0601L7602j0122k4951A46327c26439A01026a19172j3922a6133B26
18084a52162A13250b1447n8422B09041m3825K216F0546c26397f7801j59829c0349
18072e4775H4976i8499A57061a99173L9761B60484d6913a674F3845q460d05151
18060A15989a15346B22615H9770L9934A9241L7834b22668a1511e550J021q898
18049a3427C02092h9819b524j20400E0630L06402c3491F1553B9064R0010a85759
18037a472j18345A37199c69026B55404c8959A67713B6418e2989A88058R0615G7695
18025b45558O5171h2144p1016e0252A75681k9604J9716p9036c77857a18811A61579
18013C27003c4444J5297O365j04271k56295a54648A44799a2066k00574P2276A44249
$$ plain form
18001 42674 134299 7604 -240541 103234 -113981 -159035 278418 -147073 -88776 -128130 314160
17989 130869 251683 -205161 104325 55768 173717 -2907 -420160 -90384 -63623 219513
17978 -136179 -52585 -125685 374203 -93940 -31668 71108 286877 -216432 114981 -82104 -173832
17967 -173832 -185463 38950 -2504 -169845 86015 -91498 -246539 214407 -15382 -67821 -197766
17956 -197766 -13658 -241215 106443 74075 -230331 -82901 -268482 62735 73558 4238 10503
17945 10503 -216212 -268434 346756 49808 -205525 -72239 -122083 44579 -205649 -172892 76809
17933 -21814 -14740 191632 217481 136404 81017 -236492 77443 192019 -185274 -300549 -59038
17921 -175177 -134108 -51765 92369 -134191 118187 -26242 -30621 -46534 -1335 -59198 228013
$$ packed form
18001D2674R1625G604b40541A03234a13981m5054B78418a47073N8297l9354C14160
17989A30869J20814b05161A04325m8557J17949b907m17253i0384K6761B19513
17978a36179e2585p3100C74203i3940c1668G1108K15769b16432A14981h2104r1728
17967a73832j1631C8950b504j67341H6015i1498j55041B14407a5382n2439j29945
17956a97766a3658k27557A06443l2368b30331h2901j85581F2735J0823D238O265
17945A0503b16212n2222C46756D9808b05525g2239m9844D4579b05649L2757G6809
17933b1814P074A91632K5849q1077n5387b36492G7443J14576a85274j15275e9038
17921a75177M1069e1765I2369a34191A18187b6242m379j5913a335n7863B28013
$$ plain form
17909 62249 -110294 -228119 20793 90002 128963 -211833 16268 52671 -62412 -129546 98660
17897 -213474 -79818 126442 -363484 66462 -35971 246269 -79330 -82204 158627 -238808 217368
17885 55613 202829 -119802 -39548 326006 -199869 -140265 66782 39323 14364 -40401 124303
17873 -95546 -116255 -229429 138826 -41510 182681 -108875 132833 419402 344598 -92860
17862 -128699 51590 152730 -30139 -91937 319624 -136805 42773 -102321 70850 146046 -306941
17850 86039 -166887 -284839 -120223 128934 35590 215477 -427021 -54448 216175 -93791
17839 94088 -298594 -128385 -73074 -123351 362003 756 136891 -136556 113313 -264079 123426
17827 -85469 238291 108503 -42530 -9716 -203920 -249055 189208 -289200 -69189 -99779 -224000
$$ packed form
17909F2249a10294j17825B0793O9209L8961b11833A6268L6403f2412o7134I8660
17897b13474g9818A26442c63484F6462c5971B46269g9330k874A58627b38808B17368
17885E5613J47216a19802c9548C26006a99869N9604F6782k7459A4364d0401A24303
17873i5546k0709j13174A38826d1510A82681a08875A32833K86569p4804i2860
17862a28699E1590J01140c0139o1798C19624a36805D2773a02321G0850P5196c06941
17850H6039a66887j17952a20223A28934C5590J79887d27021e4448B16175i3791
17839I4088b98594a28385N5311n0277C62003G56J36135a36556A13313b64079A23426
17827h5469B38291A08503d2530i716j94204m5135A89208b89200f9189l0590j24221
$$ plain form
17816 -224000 268542 67643 58964 133576 -95067 59541 34815 100350 -5100 -165411 -78792
17804 143011 -51602 285488 206796 -341406 -124237 7000 -207362 212128 -126898 108195
17793 -141417 345145 -241388 -233038 114546 -106591 -231120 -13109 186510 -19112 -156434
17783 -156434 309532 -5264 -126102 -77705 -222372 188495 -48711 370934 -108967 -29022
17772 -35979 204761 90526 -21282 -109793 144196 -85499 -243148 289505 -319559 70814 43711
17761 43711 -265947 224628 145806 -195054 -38214 71058 44030 194735 -60102 190251 -201507
17749 -103278 -30975 -66715 185381 103616 -67748 -130813 286373 60281 141863 -343433 240530
17737 47262 -157570 -64886 -48437 16670 165663 236232 -268208 111670 70445 -307768 254756
$$ packed form
17816b24000B68542F7643q679P4612i5067E9541k4726O5535e100j60311g8792
17804A43011e1602B85488p8692c41406a24237G000b07362B12128a26898A08195
17793a41417C45145b41388Q350A14546a06591j24529a3109A86510a9112j37322
17783a56434C09532e264j20838M8397j44667A88495d8711C70934a08967b9022
17772c5979B04761I0526b1282q8511A44196h5499j57649B89505c19559G0814k7103
17761D3711b65947B24628p8822a95054c8214G1058k7028J50705f0102A90251b01507
17749a03278c0975l5740A85381q1765f7748o3065B86373F0281Q1582c43433B40530
17737D7262a57570f4886J6449A6670J48993P0569b68208A11670m1225c07768B54756
$$ plain form
17725 206293 -160848 -232610 75898 -272841 -137537 -92342 -44908 -240886 -98736 -275215
17715 -275215 87324 99209 233723 202514 -121558 -37890 293732 256288 -100007 -177853 5373
17703 110343 -46932 230249 35914 275880 -84605 15374 152722 -129058 -10982 -229515
17693 -229515 102968 287392 67901 -234865 -143729 117913 255526 -115518 23051 -287845
17682 -41158 74586 593425 -159079 149795 66146 -2900 52813 82060 106679 -160268 243083
17670 -24131 171033 -23122 27555 -206226 142770 249189 150788 -247822 -114693 101110
17659 -130465 -23721 150345 -233437 -167621 183779 -181167 -134323 49316 111270 73180 -53707
17647 148155 95365 -134828 -194991 62879 -327082 188852 38089 -32003 166707 164482 135574
$$ packed form
17725B06293a60848p1762G5898b72841J35304M5195d4908j95978i8736j76479
17715b75215H7324J1885J34514l1209a21558c7890B93732l7444a00007p7846E373
17703A10343d6932B30249C5914K39966h4605A5374J37348a29058a0982k18533
17693b29515A02968J84424F7901b34865R1136A17913J37613a15518B3051b87845
17682d1158G4586N18839a59079A49795F6146b900E2813K9247K4619a60268B43083
17670b4131A71033b3122B7555b06226A42770J06419r8401b47822a14693A01110
17659a30465b3721A50345b33437O5816A83779a81167M6844D9316O1954l8090e3707
17647A48155n2790a34828o0163F2879c27082A88852C8089c2003A66707k225k8908
$$ plain form
17636 135574 -11112 107528 -220034 -93221 177531 78024 329213 211783 4070 251909
17626 251909 85338 72219 233041 221514 -39716 -168917 210918 55720 168655 12531 80829
17615 80829 -118687 102416 288669 166500 -225160 -207899 -88090 -21773 47272 -111641
17604 275982 -26075 142511 -31709 254759 -91662 182743 283005 164218 314022 -97691
17593 159246 18946 9237 19961 16606 -147912 -56032 -293049 142255 77701 42975 -89578
17581 217965 -34754 122722 116459 179091 -61718 87210 95761 318826 53039 66231 -124294
17569 -288941 312913 286184 155411 -258115 196885 205750 66352 56734 342657 -56612 -2403
17557 -141099 -103032 -130305 54394 78388 -94535 253885 110306 82486 1211 -19883 12677
$$ packed form
17636A35574a1112A07528b20034i3221A77531G8024K51189j17430D070K47839
17626B51909H5338j3119J60822j1527c9716j29201B10918E5720J12935A2531O8298
17615H0829a18687A02416J86253j22169b25160J7261h8090b1773D7272a11641
17604B75982b6075A42511c1709B54759i1662A82743J00262j18787J49804i7691
17593A59246A8946I237J0724l355a47912e6032k37017A42255o4554l4726h9578
17581B17965c4754A22722o263O2632f1718H7210Q551K23065E3039J3192a24294
17569b88941C12913k6729j30773b58115A96885Q865F6352r618K85923e6612b403
17557a41099L8067k7273E4394K3994i4535B53885A10306k7820A211a9883A2677
$$ plain form
17545 -70424 48800 -7223 142603 319890 138500 -81501 -399801 424123 -26433 -79290 -137700
17534 -137700 -30371 71902 203743 122803 337549 32935 38198 60295 5602 5071 -277342 26682
17521 75208 -177314 65446 -37086 -25628 -137781 103412 99871 305874 -2234 -166686 13268
17509 -281937 272645 -241076 6292 461759 89924 329590 -302615 -274329 131136 146909
17499 146909 -363845 270940 54460 354480 76599 -185571 85017 25084 211116 -116312
17488 358601 49228 -147315 54768 -66107 55704 -144629 73895 258482 63290 351112 318075
17477 318075 105629 179496 -104570 96455 312201 265999 139787 179651 466331 429822
17467 429822 63548 215536 -109545 430207 -159320 84561 89832 -76806 389658 323497 336014
$$ packed form
17545g0424D8800g223A42603J77287A38500h1501l18300D24123b6433n2857n8410
17534a37700c0371G1902J31841q0940K14746C2935N263K2097E602n31b77342B6682
17521G5208a77314F5446c7086J1458j12153A03412l541K06003b234j64452A3268
17509b81937B72645b41076F292M55467H9924K39666c02615K8286A31136J5773
17499A46909c63845B70940E4460L00020G6599a85571H5017B5084J86032a16312
17488C58601D9228a47315E4768f6107E5704a44629G3895J84587F3290K87822l3037
17477C18075A05629P3867a04570I6455K15746m6202j26212L9864K86680l6509
17467D29822F3548J51988a09545D30207a59320H4561N271g6806C89658o6161J2517
$$ plain form
17456 336014 -7020 35570 164066 293654 387683 535601 39927 222338 334246 -159793
17445 361726 445247 2752 309924 234740 15190 120061 329959 508968 268240 458229
17435 458229 207836 284146 581966 206539 317024 367301 39460 441414 481163 205825
17424 32420 128722 536876 235215 357401 276060 533915 97109 234052 512086 366307
17414 366307 354934 206707 241075 189861 285056 569515 140492 -4716 262071 176560 -139559
17402 76755 -376757 210145 -50418 116752 70238 195436 -28360 151797 192617 -88279 254052
17390 -36161 250761 190133 116287 -260871 233379 52321 34389 -71453 154854 -1571 -64141
17379 -64141 346975 130874 21538 23417 -24527 -158581 154924 130212 137104 -81175 379955
$$ packed form
17456C36014g020C5570J28496J29588R4029J47918C9927J82411J11908a59793
17445C61726Q3521B752L07172p5184A5190J04871K09898J79009k40728J89989
17435D58229B07836P6310K97820B06539J10485N0277C9460M01954L9749B05825
17424C2420R6302M08154B35215J22186q1341K57855I7109J36943K78034j45779
17414C66307j1373j48227L4368n1214R5195K84459A40492d716B62071q5511a39559
17402G6755c76757B10145e0418A16752m6514J25198b8360A51797M0820h8279B54052
17390c6161B50761o0628p3846b60871B33379E2321j7932g1453A54854a571o2570
17379f4141C46975A30874B1538J879b4527j34054A54924k4712O892h1175C79955
$$ plain form
17367 87450 -93150 50948 108030 197785 387954 226955 -141677 -157245 104617 147278 184986
17356 184986 212485 172413 98687 -69493 504821 324364 315409 282558 -311292 -595 388413
17344 256563 75783 203813 127540 230631 194029 333054 336812 -170369 -8658 215963 -97887
17332 183951 218190 29427 207983 285360 -103604 206414 38436 61985 76988 201149 185828
17321 185828 51562 -66701 -256511 93632 116690 15373 -122901 39114 365795 111473 58611
17310 58611 128835 166004 106157 61400 -12741 223346 216349 13248 209693 396013 284354
17299 284354 -234029 -43047 172208 36748 246226 173843 -185531 244873 69149 85790
17289 85790 190134 297252 444523 129529 404004 141756 271823 28104 147004 346622
$$ packed form
17367H7450i3150E0948N7082Q9755J90169j60999a41677j5568A04617M2661L7708
17356A84986K7499m0072p3726f9493E04821j80457q955l2851c11292e95C88413
17344B56563G5783J28030p6273J03091l6602J39025L758a70369h658B15963i7887
17332A83951L4239B9427J78556P7377a03604B06414C8436K3549J5003J24161j5321
17321A85828E1562f6701j89810I3632K3058A5373a22901C9114L26681A11473n2862
17310E8611P0224L7169n9847m4757a2741B23346o997A3248J96445J86320j11659
17299B84354b34029d3047A72208C6748K09478p2383a85531B44873F9149J6641
17289H5790J04344J07118J47271A29529K74475A41756J30067B8104J18900J99618
$$ plain form
17279 346622 182828 74081 179231 190400 86336 361774 164840 251279 170275 269155 269736
17268 269736 40614 -32053 68643 276737 -34593 176250 77882 38220 124844 -107701 -230990
17257 -230990 188239 176749 206545 294729 126245 430102 181091 261560 469699 80621
17246 81342 11802 92193 341169 357166 388301 87856 -49558 300082 -318441 265890 356276
17235 356276 430449 100659 213863 344331 284177 248606 35611 559683 195713 123409
17225 123409 189419 536 376293 152712 -154408 293921 246467 288682 264295 17099 -25224
17213 4942 514302 -35239 349956 184369 -38347 206680 236187 109703 332525 217292
17203 217292 37223 172046 596595 197131 316307 323396 160042 187425 219160 405246
$$ packed form
17279C46622j63794G4081J05150J1169H6336K75438A64840Q6439q1004R8880N81
17268B69736D0614c2053F8643K08094c4593A76250G7882C8220Q6624a07701j23289
17257b30990A88239j1490K9796Q8184A26245L03857A81091Q0469K08139H0621
17246H1342A1802Q0391K48976J5997L1135H7856d9558C00082c18441B65890R0386
17235C56276P4173A00659J13204J30468o0154l5571C5611N24072A95713p2304
17225A23409O6010E36L75757A52712a54408B93921m7454M2215k4387A7099b5224
17213D942N09360c5239C49956j65587c8347B06680K9507A09703K22822j15233
17203B17292C7223J34823M24549A97131J19176P089A60042K7383L1735J86086
$$ plain form
17193 405246 77148 164567 418993 -344494 364108 458382 592301 250107 540017 -154564
17182 -19952 294347 453224 61371 335960 386790 165854 40247 474984 334626 123107
17171 451443 316320 261038 323789 263769 276594 580573 531409 321258 421611 421687 421775 78942
17158 375162 140766 467143 222338 255398 262969 65413 -31536 123387 244837 237777 383864
17147 383864 285446 448007 174350 307666 341639 396964 414840 284763 162891 50801
17136 235782 350023 69426 365102 171507 535318 139222 362424 -61593 58098 546441
17126 546441 158996 334263 513752 -294262 27292 265243 292332 159363 604857 140391
17115 421455 360462 288184 255096 462882 211758 234532 -27350 391131 205594 331105
$$ packed form
17193D05246G7148Q7419K54426c44494C64108R4274J33919B50107K89910a54564
17182a9952B94347J58877F1371K74589N0830A65854D0247M34737j40358A23107
17171D51443j35123n5282O2751o0020J2825L03979m9164k10151J00353P6Q8G8942
17158C75162A40766L26377B22338L3060P571F5413c1536A23387J21450p060J46087
17147C83864r8418J62561A74350J33316L3973N5325J7876j30077j21872E0801
17136B35782J14241F9426K95676A71507L63811A39222K23202f1593E8098M88343
17126E46441A58996J75267J79489b94262B7292K37951K7089j32969M45494A40391
17115D21455o0993p2278l3088K07786B11758K2774b7350C91131j85537J25511
$$ plain form
17105 331105 261758 126635 -16898 155403 603788 252036 113325 485544 506553 482347
17095 482347 201806 342754 489192 517010 153095 466197 158566 201585 548015 708331
17085 708331 172051 97473 456059 -67143 597723 562249 363166 492400 237053 298259
17075 298259 423565 542254 371450 81465 558181 460515 199817 696812 707182 -150864
17064 523999 628198 268205 660825 455247 456705 535136 709750 645200 276951 407598
17054 407598 304790 68169 294107 766842 766537 491750 581385 234370 584407 470682
17044 470682 532867 672335 446787 520301 632772 544153 278113 727481 343735 852090
17034 852090 416055 206110 732039 518253 816006 281335 379426 468787 655815 720087
$$ packed form
17105C31105o9347A26635a6898A55403M48385B52036A13325L72219K1009k4206
17095D82347B01806J40948J46438K7818A53095L13102A58566M3019L46430J60316
17085G08331A72051p4578L58586f7143E97723l5474j99083J29234B37053O1206
17075B98259J25306J18689j70804H1465M76716r7666A99817M96995J0370a50864
17064E23999J04199B68205L92620k05578J458P8431J74614o4550B76951J30647
17054D07598j02808F8169K25938M72735l05k74787Q9635B34370L50037j13725
17044D70682O2185J39468k25548P3514J12471q8619k66040M49368C43735N08355
17034H52090D16055B06110N25929k13786K97753B81335R8091Q9361J87028O4272
$$ plain form
17024 720087 336172 495453 586091 483924 527825 646798 530108 289238 574328 765335
17014 765335 599464 649390 582812 640846 676852 473682 439778 328239 696915 838950
17004 838950 594607 402032 619593 778217 381512 630013 550351 666644 673958 684119
16994 684119 616938 645385 540933 622232 572775 497421 505520 662933 1028933 556132 580997
16983 580997 828567 256815 689117 877333 779420 978443 703676 919536 712677 886991
16973 886991 673140 618925 536699 653205 946883 733923 852094 522924 1048366 753117
16963 753117 828784 1021696 1003971 886891 1031761 913593 879898 719332 910142 1077257
16953 1077257 1140526 669901 1132401 1305997 909915 1102752 966097 1150563 1052785 1022027
$$ packed form
17024G20087C36172J59281R0638j02167M3901J18973j16690k40870K85090J91007
17014G65335j65871M9926o6578N8034L6006k03170l3904j11539L68676J42035
17004H38950k44343j92575K17561J58624C81512K48501p9662J16293P314J0161
16994F84119o7181K8447j04452Q1299m9457p5354Q099J57413L66000m72801K4865
16983E80997K47570B56815M32302J88216r7913J99023k74767K15860k06859J74314
16973H86991k13851n4215q2226J16506K93678k12960J18171l29170N25442k95249
16963G53117P5667J92912j7725j17080J44870j18168l3695j60566J90810J67115
16953A077257O3269m70625M62500J73596l96082J92837j36655J84466r7778l0758
$$ plain form
16943 1022027 1158669 1106268 1048030 1338086 942716 788900 962186 1444333 954239 774789
16933 774789 1091293 1184855 1401507 1141934 1285411 1065313 1094625 1145789 1379389 969298
16923 969298 1329176 1218406 1498440 1530019 1572884 1085011 1369969 1589922 1577180 1206608
16913 1206608 1357844 1389704 1537647 1501594 1577176 1451650 1216021 1432142 1497348 1512885
16903 1512885 1768976 1396420 1703690 1364845 1547784 1745147 1474591 1748868 1573169
16894 1573169 1779169 1417458 1711720 1715346 1525109 1792523 2050456 1660581 1814933 1708202
16884 1708202 1599443 2017679 1619486 2047986 2067665 1983724 2123094 2167691 1933913 1865634
16874 1865634 2270724 1906351 1817119 2273568 2251393 2219518 2069917 2012960 2176188 2289604
$$ packed form
16943A022027J36642n2401n8238K90056l95370j53816J73286M82147m90094j79450
16933G74789L16504R3562K16652k59573J43477k20098K9312N1164K33600m10091
16923I69298L59878j10770K80034L1579M2865m87873K84958K19953j2742l70572
16913A206608J51236L1860J47943l6053P5582j25526k35629K16121O5206J5537
16903A512885K56091l72556L07270l38845J82939J97363k70556K74277j75699
16894A573169K06000l61711K94262L626j90237K67414K57933l89875J54352j06731
16884A708202j08759M18236l98193M28500J9679q3941J39370M4597k33778o8279
16874A865634M05090l64373q9232M56449k2175l1875j49601n6957J63228J13416
$$ plain form
16864 2289604 2449984 2382521 2605909 2535469 2429446 2371309 2762133 2672793 2523238 2685518
16854 2685518 2891792 2546179 2669974 2634393 2918485 2702987 3088744 2825572 3082735 3303705
16844 3303705 3115347 3046350 3135365 3407518 3078623 3174543 3423597 3412903 3495452 3504613 3420685
16833 3420685 3749482 3889408 3754298 4277140 3990816 3854581 3858392 4010903 3990638 4263125
16823 4263125 4555361 4742820 4585030 4596520 4646947 5055741 4951178 5312865 4868948 5220163
16813 5220163 5355033 5446574 5399866 5804100 5565430 5678729 5731924 6210420 6200372 6477237
16803 6477237 6569911 6572118 6961091 6880261 7118037 7081012 7458371 7520815 8016052 7852529
16793 7852529 8217859 8199846 8561608 8754013 9305513 9444310 9468468 9650027 10019843 10250782
$$ packed form
16864B289604J60380o7463K23388p0440j06023n8137L90824q9340j49555J62280
16854B685518K06274l45613J23795l5581K84092k15498L85757k63172K57163K20970
16844C303705j88358o8997Q9015K72153l28895R5920K49054j0694Q2549R161q3928
16833C420685L28797J39926j35110N22842k86324j36235L811J52511k0265K72487
16823D263125K92236J87459j57790J1490N0427M08794j04563L61687m43917L51215
16813E220163J34870R1541m6708M04234k38670J13299N3195M78496j0048K76865
16803F477237R2674K207L88973q0830K37776l7025L77359O2444M95237j63523
16793G852529L65330j8013L61762J92405N51500J38797K4158J81559L69816K30939
$$ plain form
16783 10250782 10724295 11005194 11317919 11278503 11792829 12219868 12548257 12919651 13419502
16774 13419502 13726651 14292259 15195398 15247550 15838510 16369325 16858483 17653374 18311008
16765 18311008 18825948 19867184 20338073 20855662 21799201 22570160 23485964 24815424 25820890
16756 25820890 26983603 28065482 29605275 30824555 32182179 33796855 35297800 37118775
16748 37118775 38851692 41152829 42978637 45721982 47869186 50520228 53483892 56582293
16740 56582293 59679943 63640558 67229664 71526784 76165856 80353633 86068690 91676263
16732 91676263 97332263 104019419 110811141 117630052 125653424 133562115 141625531 150225231
16724 150225231 158433215 166781052 174886044 182438935 188983687 194887170 199363354 202528508
$$ packed form
16783A0250782M73513K80899L12725l9416N14326M27039L28389L71394M99851
16774A3419502L07149N65608R03139N2152N90960N30815M89158P94891O57634
16765A8311008N14940J041236M70889N17589R43539P70959R15804J329460J005466
16756B5820890J162713J081879J539793J219280J357624J614676J500945J820975
16748C7118775J732917K301137J825808K743345K147204K651042K963664L098401
16740E6582293L097650L960615L589106M297120M639072M187777N715057N607573
16732I1676263N656000O687156O791722O818911Q023372P908691Q063416Q599700
16724A50225231Q207984Q347837Q104992P552891O544752N903483M476184L165154
$$ plain form
16716 202528508 204103971 203851294 202178372 199039871 194405860 188692347 181554608 174046029
16708 174046029 165951228 157367875 148601208 140302087 131621968 123754007 116088701 108489523
16700 108489523 101614915 94996157 89287744 83258079 77836874 73034912 68919300 64378004
16692 64378004 60401230 57371756 53691131 50907101 47749312 45264105 42823669 40434539
16684 40434539 38564403 36469150 34769981 33080800 31415572 30149834 28524482 27038588
16676 27038588 26102257 24634358 24004576 22757227 21682648 21163284 20397473 19159167 18302303
16667 18302303 17624214 17230744 16486363 15919301 15383580 14877184 14269073 13900201 13127573
16658 13127573 12781138 12590689 11932831 11586957 11207769 10923452 10621740 10282001 10223559
$$ packed form
16716B02528508J575463k52677j672922l138501m634011n713513p137739p508579
16708A74046029q094801q583353q766667q299121q680119p867961p665306p599178
16700A08489523o874608o618758n708413o029665n421205m801962m115612m541296
16692F4378004l976774l029474l680625k784030l157789k485207k440436k389130
16684D0434539j870136k095253j699169j689181j665228j265738j625352j485894
16676B7038588r36331j467899o29782j247349j074579n19364p65811j238306q56864
16667A8302303o78089l93470p44381n67062n35721n06396o08111l68872p72628
16658A3127573l46435j90449o57858l45874l79188k84317l01712l39739n8442
$$ plain form
16649 10223559 9603060 9896436 9302579 8754868 8587753 8590298 8125082 8282959 7765947 7693639
16639 7693639 7371613 7101464 7128524 7101529 6519702 6816357 6134044 5982997 6244868 5824501
16629 5824501 5604032 5595244 5341045 5310966 5493025 5018320 4805303 4989109 4824761 4750741
16619 4750741 4332707 4672629 4258068 4436551 4118400 4171794 4075688 3772209 3951545 3757791
16609 3757791 3971240 3762912 3395638 3675662 3598902 3149386 3127724 3268001 3161162 3006796
16599 3006796 3063053 2818608 2946326 2917521 2841749 2752617 2910352 2679257 3008816 2733568
16589 2733568 2575001 2539612 2540792 2206015 2599816 2336805 2206545 1982842 2238968 2242841
16579 2242841 2454415 2153298 2057540 2404306 2018761 2037900 1944353 2033202 2106548 1983426
$$ packed form
16649A0223559o20499K93376n93857n47711j67115K545m65216J57877n17012p2308
16639G693639l22026k70149K7060k6995n81827K96655o82313j51047K61871m20367
16629E824501k20469q788k54199l0079J82059m74705k13017J83806j64348p4020
16619D750741m18034L39922m14561J78483l18151N3394r6106l03479J79336j93754
16609C757791K13449k08328l67274K80024p6760m49516k1662J40277j06839j54366
16599C006796N6257k44445J27718k8805p5772q9132J57735k31095L29559k75248
16589B733568j58567l5389J180l34777L93801k63011j30260k23703K56126L873
16579B242841K11574l01117r5758L46766l85545J9139r3547Q8849P3346j23122
$$ plain form
16569 1983426 1993103 1764231 1929973 2096118 1735993 1765147 1476024 1444820 1457728 1647222
16559 1647222 1663706 1522216 1606680 1253924 1675092 1522652 1362587 1592262 1466503 1146328
16549 1146328 1140349 1431068 1216361 1414369 1463597 1161960 1255694 1273375 1025577 1453358
16539 1453358 1333180 1020873 1150915 1202393 1386613 888743 926234 1052586 1247627 1090110
16529 1090110 1182317 1399095 893433 1328966 1147199 1040267 1028831 1002195 1113764 878587
16519 878587 758936 903059 872339 1013205 922729 917016 692433 396467 937556 852505
16509 852505 962826 892798 668855 1044994 775327 954272 899810 763032 858735 778672
16499 778672 634561 898959 896199 514482 815560 821026 707807 766582 521092 709828
$$ packed form
16569A983426R677k28872J65742J66145l60125K9154k89123l1204J2908J89494
16559A647222J6484j41490Q4464l52756M21168j52440j60065K29675j25759l20175
16549A146328n979K90719k14707J98008M9228l01637R3734J7681k47798M27781
16539A453358j20178l12307J30042N1478J84220m97870L7491J26352J95041j57517
16529A090110R2207K16778n05662M35533j81767j06932j1436k6636J11569k35177
16519H78587j19651J44123l0720J40866r0476n713k24583k95966N41089q5051
16509H52505J10321p0028k23943L76139k69667J78945n4462j36778R5703q0063
16499G78672j44111K64398k760l81717L01078N466j13219N8775k45490J88736
$$ plain form
16489 709828 496557 634531 657600 327551 701719 445014 507718 501964 749740 646942
16479 646942 557096 726607 220158 502091 588053 568361 671391 445454 647568 454369
16469 454369 374163 431827 797158 390506 458310 164055 852171 803131 143753 472337
16459 472337 714997 658434 584691 383276 550333 805644 602157 543770 338014 582267
16449 582267 81094 428073 280027 312582 216627 373809 710549 706626 812116 312840
16438 550157 383236 149585 9768 404829 406488 485381 454603 309238 501513 460466 658054
16427 658054 -4172 317905 433016 363296 304765 -46719 93405 446377 564632 399689 451971
16416 451971 430748 393449 511792 588095 214869 541237 493642 515413 319233 330458 90830
$$ packed form
16489G09828k13271J37974K3069C27551L74168k56705O2704n754K47776j02798
16479F46942q9846J69511B20158K81933Q5962j9692J03030k25937K02114j93199
16469D54369q0206N7664L65331C90506O7804A64055O88116m9040A43753L28584
16459D72337K42660n6563p3743k01415J67057K55311k03487n8387k05756K44253
16449E82267H1094L46979j48046L2555r5955J57182L36740l923J05490C12840
16438E50157j66921A49585I768L95061J659P8893l0778j45365J92275m1047J97588
16427F58054d172C17905J15111o9720n8531d6719I3405L52972J18255j64943N2282
16416D51971k1223l7299J18343P6303B14869L26368m7595K1771j96180J1225I0830
$$ plain form
16404 223154 291829 701509 307891 357722 270971 75150 361281 399366 422872 333675 491513
16393 491513 180180 371539 527386 350382 99096 360361 107429 304747 84492 490964
16383 490964 279738 466663 -30473 341878 184421 34588 52009 117247 -8138 253609 339934
16372 339934 269949 421671 160837 142588 286706 177361 390264 27864 47245 -124397
16361 221923 359025 528315 233740 22177 81298 -181702 -132811 354116 -6358 346755
16350 471231 124418 -17818 422171 209723 174611 526686 168491 7672 109554 274293
16340 274293 253585 44311 313187 227445 85042 207721 344289 367915 104483 405147
16330 405147 63768 459626 -4122 -125274 249837 165863 347398 -2349 -46299 243241 67627
$$ packed form
16404B23154O8675M09680C07891M9831q6751G5150K86131L8085K3506q9197J57838
16393D91513A80180J91359J55847j77004I9096K61265A07429J97318H4492M06472
16383D90964k11226J86925c0473C41878j57457C4588J7421O5238h138B53609Q6325
16372C39934o9985J51722A60837j8249J44118j09345K12903B7864J9381a24397
16361B21923J37102J69290B33740B2177N9121a81702M8891C54116f358C46755
16350D71231A24418a7818D22171B09723l5112L52075A68491G672J01882J64739
16340B74293k0708D4311K68876q5742H5042J22679J36568K3626A04483L00664
16330D05147F3768L95858d122j21152B49837q3974J81535b349m3950B43241F7627
$$ plain form
16318 38843 82748 247993 129514 235659 106515 127345 -63158 162751 -37138 213552
16307 472850 -33951 278505 -82824 64538 -24842 86444 321728 235552 109554 16451 116306
16296 116306 -5702 264312 39178 12063 90131 168961 51259 29918 -227172 -122803 166855
16284 286409 87298 -193238 -20835 144586 49399 250188 398260 -113593 -105592 187942
16273 -123533 188093 -28823 37099 3803 55845 208823 -48182 -97820 228795 87800 -61159
16261 235276 -8389 253944 -134381 129425 439794 125061 -103723 36082 247803 616377
16251 616377 186630 44504 86951 14369 295423 213657 350857 -141422 -48404 23602 -120444
16239 120219 195774 20104 281718 251354 113650 193207 408900 -90201 62757 163191 -73538
$$ packed form
16318C8843M3905J65245j18479J06145A06515K0830f3158A62751c7138B13552
16307D72850c3951B78505h2824F4538b4842H6444K35284q6176A09554A6451R9855
16296A16306e702B64312C9178A2063P8068P8830E1259k1341b27172J04369A66855
16284B86409H7298a93238b0835A44586D9399K00789J48072a13593Q001A87942
16273a23533A88093b8823C7099C803N2042J52978d8182m9638B28795H7800f1159
16261B35276h389B53944a34381A29425L10369A25061a03723C6082K11721L68574
16251F16377A86630D4504M2447A4369K81054q1766J37200a41422d8404B3602a20444
16239A20219P5555B0104K61614l0364A13650P9557K15693i0201F2757J00434g3538
$$ plain form
16227 91721 199289 423501 16734 47092 236479 -22402 103785 509830 61428 -32215 -122050
16216 -122050 -90264 -2602 249624 212398 71122 369923 36583 172314 231831 131482 113335
16205 113335 23174 51700 -29785 -224728 95296 -22757 48618 223765 -13124 -2999 44663
16193 -182624 -181703 151252 -45560 22787 68020 -214570 110198 7885 -125796 273920 106190
16181 102148 139977 -155038 -153597 -143354 193586 94680 -65418 -135982 37627 -209534 -257502
16170 -257502 -298057 29741 -122119 -40375 170110 -118111 -63538 191345 -86798 255860
16159 143680 128793 121243 297411 -427258 -122686 70269 -113919 -158830 -105487 180303 -191032
16147 -174329 182623 225694 -58090 13876 -182165 -107918 -206900 -198184 22824 -222767 -19401
$$ packed form
16227I1721J07568K24212A6734L0358J89387b2402A03785M06045F1428c2215q9835
16216a22050L1786b602B49624l7226G1122K98801C6583J35731N9517j00349j8147
16205A13335B3174K8526b9785j94943I5296b2757D8618J75147a3124b999D4663
16193a82624R21A51252d5560B2787M5233b14570A10198G885a25796B73920A06190
16181A02148L7829a55038J441J0243A93586I4680f5418p0564C7627b09534m7968
16170b57502m0555B9741a22119d0375A70110a18111N4573A91345h6798B55860
16159A43680j4887p550J76168d27258a22686G0269a13919m4911N3343A80303a91032
16147a74329A82623M3071e8090A3876a82165P4247r8982Q716B2824b22767a9401
$$ plain form
16135 -212137 -111557 -3938 93696 -343223 170970 30830 -105249 106157 -315636 55303
16124 78342 291574 -13155 -120778 -320184 56107 -165233 -123376 49649 128328 -68258 117837
16112 -28646 110989 -180338 470248 90002 153146 253709 -5919 290901 -378232 137532
16101 -104292 107312 -20734 46075 -15146 13671 125286 -164291 125281 242963 -49906
16090 198766 -57177 -1314 143589 244644 -269661 163123 -239082 87062 82204 248221 131210
16079 131210 -54388 274330 -132520 -105997 -63017 -130124 -28749 -246747 295195 -69095 42507
16067 -107116 -93645 -116541 106783 -174332 160422 -89280 52314 112704 -266424 -55405 96482
16055 -158647 -178596 -35064 40644 -95248 22871 206268 -136430 155711 21802 140882 -67978
$$ packed form
16135b12137J00580c938I3696c43223A70970C0830a05249A06157c15636E5303
16124G8342K13232a3155j07623j99406E6107a65233M1857D9649P8679f8258A17837
16112b8646A10989a80338D70248I0002O3144J00563e919B90901c78232A37532
16101a04292A07312b0734D6075a5146A3671J11615a64291A25281J17682d9906
16090A98766e7177a314A43589J01055b69661A63123b39082H7062m858J66017j17011
16079A31210e4388B74330a32520K6523M2980o7107b8749k17998B95195f9095D2507
16067a07116J3471k2896A06783a74332A60422h9280E2314O0390b66424e5405I6482
16055a58647j9949c5064D0644i5248B2871J83397a36430A55711B1802J19080f7978
$$ plain form
16043 -206251 -353507 -10877 56323 61687 -104518 -96941 7553 -152499 -331841 157804 247983
16032 247983 35717 -53796 116536 -98886 -262691 39330 154147 143340 156097 3717 -130692
16020 299549 -24043 -127604 -204053 98082 -300336 -101485 154804 225990 -362901 -78040
16009 -273918 -201170 -372840 -147398 61504 162388 -188469 -98164 -272010 76022 163356
15999 163356 -343711 -267360 22941 -78699 346143 -68377 138311 -219170 -99621 -85710 474704
15987 69092 -57316 -180612 -59287 164142 -60267 525967 316723 316786 184539 18573 239538
15976 239538 -40642 -161852 -181688 38657 151590 149875 -106098 -163669 152080 20828 76554
15965 76554 118856 86084 253691 -299671 130335 64742 114172 111442 -178507 -151521 23587
$$ packed form
16043b06251j47256a0877E6323N364a04518P577G553a52499j79342A57804R0179
16032B47983C5717e3796A16536i8886j63805C9330J14817j0807J2757C717a30692
16020B99549b4043j03561p6449I8082c00336a01485A54804P1186c62901g8040
16009b73918P2748j71670a47398F1504J00884a88469R0305j73846G6022Q7334
15999A63356c43711P6351B2941g8699C46143f8377A38311b19170i9621J3911D74704
15987F9092e7316j23296e9287A64142f0267E25967k09244O3j32247A8573K20965
15976B39538d0642j21210j9836C8657J12933j715a06098n7571A52080B0828N5726
15965G6554M2302l2772J67607b99671A30335F4742M9430k730a78507K6986B3587
$$ plain form
15953 -91298 29105 -433647 -29832 -353786 -281339 -113036 -190054 66519 -111975 -298556 100133
15941 -347033 44376 -61370 -134823 175978 -73518 206219 -318946 -297003 -362837 110639 91331
15930 91331 -106357 226915 -215660 63704 -16585 51333 -5433 152884 -297163 -110799 -16301
15918 -48835 136306 122075 68596 45499 -169842 -253741 -7088 -475693 -370030 -241023 157010
15906 -90665 71823 -221005 319033 -41660 13351 -213850 -290039 140740 -559296 120384
15895 -65149 -95888 -30584 207366 131138 -155409 -107105 -167349 26511 223026 -28804 90647
15883 87762 369661 -351716 -72280 330169 302650 -139188 129184 -233386 -23253 -137286
15873 -137286 1683 -30380 -133409 88517 -473784 -104191 7182 135925 213570 -146696 171337
$$ packed form
15953i1298B9105d33647b9832l23954P2447a13036p7018F6519a11975j86581A00133
15941c47033D4376f1370p3453A75978g3518B06219c18946K1943o5834A10639j9308
15930I1331a06357B26915b15660F3704a6585E1333e433A52884b97163a10799a6301
15918d8835A36306j4231n3479k3097a69842q3899g088m68605J05663J29007A57010
15906i0665G1823b21005C19033d1660A3351b13850p6189A40740e59296A20384
15895f5149l0739c0584B07366p6228a55409M8304o0244B6511J96515b8804I0647
15883H7762K81899c51716g2280C30169k7519a39188A29184b33386b3253j14033
15873a37286A683c0380j03029H8517d73784a04191G182J28743P7645a46696A71337
$$ plain form
15861 190933 -3586 -107873 -97537 190229 -55962 -125290 -104897 220771 -54426 -195988 154541
15849 -10567 -177937 102357 -126434 -266510 -29002 -302777 -234596 -7002 -223218 -188513 -67079
15837 59320 309290 74119 -36103 -154624 -136171 226684 101161 117311 141910 -346347 245585
15825 -23698 -228003 -379719 -237354 -200344 60553 16527 45799 194227 13090 6682 -184149
15813 -199899 154357 -319080 59489 3099 -145313 187567 60532 -128223 -217275 -350189
15803 -350189 -1900 17972 61690 -120932 -132706 104010 9586 -329154 -113816 -230441 -303663
15792 -303663 -336692 -155151 120525 -76585 -170981 -78935 -188246 62967 -112804 96151 -75342
15780 -127595 -7844 -78515 -113839 114224 -75576 -105690 -105760 -148506 162240 -159935 -389193
$$ packed form
15861A90933c586j04287J0336A90229e5962o9328K0393B20771e4426j41562A54541
15849a0567j67370A02357a26434j40076b9002k73775O8181g002k16216L4705f7079
15837E9320K49970G4119c6103j18521J8453B26684A01161J6150K4599c46347B45585
15825b3698k04305j51716J42365L7010F0553A6527K9272J48428A3090o408a84149
15813a99899A54357c19080E9489C099a45313A87567F0532a28223q9052j32914
15803c50189a900A7972M3718a20932j1774A04010I586c29154a13816j16625p3222
15792c03663l3029a55151A20525g6585r4396g8935j09311F2967a12804I6151g5342
15780a27595g844p0671l5324A14224g5576l0114p0m2746A62240a59935k29258
$$ plain form
15769 -389193 -116256 -40125 233357 67724 -10159 -40897 6045 -296394 -363157 -2426 -9724
15758 -9724 377346 210467 128574 67702 -104050 -106440 114653 124481 -88958 89590 -165004
15746 -84965 307760 89751 253055 235762 -356922 52999 172570 -73167 109595 77514 45431
15735 45431 -106821 134973 389658 165847 6842 -146957 -4857 -172995 -349383 46035 -92720
15723 -8980 -98915 25377 -136048 129366 152336 83031 -9608 129325 36221 -227394 -176700
15712 -176700 -2874 -45676 -40168 -150492 -71717 -43703 49372 -65830 426943 -148114 -196358
15701 -196358 54226 215187 31852 -105595 -340174 -27162 36162 -24019 10420 79432 177507
15690 177507 221509 191907 -238650 -209142 232728 179281 53169 -190071 -25308 -164320 -43395
$$ packed form
15769c89193a16256d0125B33357F7724a0159l0738F045b96394o6763b426p298
15758i724C77346j66879q1893o0872a04050k390A14653R828h8958H9590a65004
15746h4965C07760H9751J63304j7293c56922E2999J19571g3167A09595l2081l2083
15735D5431a06821A34973K54685A65847F842a46957d857j68138j76388D6035i2720
15723h980q9935B5377a36048A29366K2970o9305i608A29325C6221b27394N0694
15712a76700b874m2802N508j10324g1717K8014D9372f5830D26943a48114m8244
15701a96358E4226J60961C1852a05595k34579b7162C6162b4019A0420O9012R8075
15690A77507M4002k9602b38650K9508B32728n3447E3169a90071b5308j39012d3395
$$ plain form
15678 -118875 154123 202573 -119899 137242 14986 195819 -37784 423096 197331 -312141
15667 -84462 -13837 -57797 345288 -167131 -304663 -175214 -10400 -186520 -71429 222668
15656 16409 -204212 -388431 -214920 -16566 -28221 -188379 -277375 172683 144593 359501
15646 359501 57747 -176848 139494 -42561 -215350 -172765 175375 107331 -280935 -192478
15636 -192478 -43395 -377876 -51694 -289000 40599 -482626 -338156 237823 -159288 -87554
15626 -87554 -151278 97803 295150 27679 284434 -153668 -86059 -33249 124144 -6591 -72490
15615 -72490 -49560 -454868 236310 -59646 185140 -265822 -146141 -89574 214353 124161
15605 124161 198326 139916 -147536 -360895 -91533 56408 -229895 46088 -45448 -141869 -148893
$$ packed form
15678a18875A54123M8450a19899A37242A4986J80833c7784D23096A97331c12141
15667h4462a3837m3960C45288a67131j37532J29449a0400j76120g1429B22668
15656A6409b04212j84219J73511a6566j1655j60158q8996A72683k8090K14908
15646C59501E7747a76848A39494d2561j72789M2585A75375o8044b80935Q8457
15636a92478d3395l34481e1694k37306D0599d82626J44470B37823a59288P1734
15626h7554o3724I7803J97347B7679K56755a53668O7609c3249A24144f591o5899
15615g2490K2930m05308B36310e9646A85140b65822J19681N6567B14353r0192
15605A24161P4165n8410a47536k13359i1533E6408b29895D6088d5448r6421p024
$$ plain form
15594 -148893 -225136 -140721 -59801 -152250 191270 -80002 221319 227801 -148376 243895 -74757
15582 -303334 211869 91155 -159673 239054 91867 146208 -82033 293084 63926 100217 -327554
15570 -141808 -208156 222906 297951 -47815 50655 -135760 94428 48725 35009 -200667 63150
15558 234935 -104997 78039 -31335 38383 -94570 471579 -244534 202646 190398 -175417
15547 262575 -191593 -266338 -41346 48271 -10512 -120025 110009 -29049 133363 -107799
15536 174739 144180 74122 -89936 -119829 -148475 129062 -234560 14827 -75979 -80931 196314
15524 99164 -231540 192702 258424 113429 -192335 39233 152872 -56425 54103 128094 -191910
15512 401115 -65777 -77889 259836 124106 -230660 330091 -149084 -132959 38949 60221
$$ packed form
15594a48893p6243Q4415e9801r2449A91270h0002B21319O482a48376B43895g4757
15582c03334B11869I1155a59673B39054I1867N4341h2033B93084F3926L6291c27554
15570a41808o6348B22906P5045d7815E0655a35760I4428m5703j3716b00667F3150
15558B34935a04997G8039c1335C8383i4570D71579b44534B02646j2248a75417
15547B62575a91593p4745d1346D8271a0512j09513A10009b9049A33363a07799
15536A74739l0559p0058h9936k9893k8646A29062b34560A4827g5979m952A96314
15524I9164b31540A92702O5722A13429a92335C9233J13639e6425E4103P3991a91910
15512D01115f5777j2112B59836A24106b30660C30091a49084J6125C8949K1272
$$ plain form
15502 60221 -392481 202282 -467634 23545 -68969 -25406 -97768 190137 -131510 -119959 75181
15490 -115972 -114908 86060 -339850 99867 19268 108844 -21623 -36046 -247822 -186408 -171299
15479 -171299 136239 -178378 141139 -225717 -132170 88255 253119 108153 34528 9567
15468 -15045 -115756 -93347 -100660 -123374 99192 -6306 -33820 289328 237854 -147959 173643
15456 -18232 102695 86549 -248574 -72929 251816 -23017 82973 177090 24322 -262555 207720
15444 -176070 -86148 -110199 42710 337381 51069 -45644 111798 205989 217089 -239828 164921
15432 122448 -255269 -28097 -32130 70879 -395381 12406 111820 17282 138216 -117968 -261868
15421 -261868 -209756 -91995 -111129 -62096 -135203 -50470 204408 44356 99345 184631 197436
$$ packed form
15502F0221c92481B02282d67634B3545f8969b5406p2362A90137a31510J1551G5181
15490a15972J064H6060c39850I9867A9268Q9576b1623j4423k11776O1414J5109
15479a71299A36239a78378A41139b25717R3547H8255J64864A08153C4528I567
15468a5045j00711K2409p313k2714I9192f306k7514B89328n1474a47959A73643
15456a8232A02695j6146b48574g2929B51816b3017H2973R4117B4322b62555B07720
15444a76070h6148k4051D2710K94671E1069d5644A11798R4191J1100b39828A64921
15432A22448b55269b8097m033G0879c95381A2406R9414A7282J20934a17968j43900
15421b61868N2112i1995j9134M9033p3107e0470B04408D4356N4989Q5286J2805
$$ plain form
15410 197436 -57780 -190163 234468 -86743 -122751 309575 126856 64474 161412 -60499 233539
15398 -306393 -263530 -106845 -118941 113016 -134360 -183270 -151845 -150285 -6622 -47959 224133
15386 -20097 -37257 21810 -178589 -388845 231069 -88019 35778 71401 -5964 -87338 -179676
15375 -179676 -145700 -18502 -49055 -70531 -206577 262110 146699 190914 -216732 -94955 85617
15363 -193889 131556 50227 300262 215953 -24413 -228298 -46287 -369477 292529 254178
15353 254178 10845 -259209 26278 310470 35060 -64459 -224039 116607 -123666 -41263
15342 252994 -28544 82844 67546 -121615 -302792 148022 -136850 -83997 95409 215460
15332 215460 416010 126524 -192347 95683 -5908 -328793 -157757 87624 76653 -82954 -259128
$$ packed form
15410A97436e7780j32383B34468h6743l6008C09575A26856o2382R6938f0499B33539
15398c06393M2863a06845j2096A13016a34360m8910L1425J560f622m1337B24133
15386b0097j7160B1810a78589k10256B31069h8019C5778L5623e964q1374r2338
15375a79676L3976a8502l0553k1476j36046B62110j15411M4215b16732i4955H5617
15363a93889A31556E0227K50035q4309b4413k03885d6287l23190B92529l8351
15353B54178A0845b59209B6278K84192C5060f4459j59580A16607a23666d1263
15342B52994b8544H2844j5298a21615j81177A48022a36850N2853I5409J20051
15332B15460K00550A26524a92347I5683e908l22885a57757H7624j0971h2954j76174
$$ plain form
15321 -259128 -96387 16791 28504 -77376 -167698 -243739 160805 208930 81686 1591 -301 4503
15308 -3277 288016 -130553 -109662 179817 -476401 -53843 158622 308100 89253 63625 201186
15297 201186 -192847 405044 276918 -4621 358908 109526 48263 269318 -29532 252511
15286 -112554 -27377 224925 63998 -50334 295942 61048 236722 -241519 155476 158050 -95863
15274 54993 -37247 69924 -209411 -140660 -3827 23375 -45598 209854 -163200 219552 256361
15263 256361 -226186 22684 -91684 257179 45551 58983 393712 280941 77666 38353 -167943
15251 -72118 185190 344112 235101 529393 1491849 1596479 1294480 1563184 705425 441199
15241 441199 76256 464340 -185292 122513 181961 -75363 11399 155037 -115855 149588
$$ packed form
15321b59128i6387A6791J1713g7376r0322p6041A60805M8125H1686A591c01D503
15308c277B88016a30553K0891A79817d76401e3843A58622J49478H9253k5628J37561
15297B01186a92847D05044j28126d621C58908A09526D8263K21055b9532B52511
15286a12554b7377B24925F3998e0334B95942F1048J75674b41519A55476K574i5863
15274E4993c7247F9924b09411O8751c827B3375d5598B09854a63200B19552L6809
15263B56361b26186B2684i1684B57179D5551J3432L34729j12771G7666C8353a67943
15251g2118A85190J58922j09011K94292R62456J04630l01999K68704G05425k64226
15241D41199G6256L88084a85292A22513N9448g5363A1399J43638a15855A49588
$$ plain form
15230 46497 397729 -8615 203436 116856 15758 -194369 151438 298667 61898 67005 -188249
15218 20602 -227179 22515 -145972 -88413 30698 105386 -170454 -4357 -70235 131058 -77170
15206 -8939 83710 -205022 -104727 -27706 59973 61441 201468 -102709 282863 24220 -261397
15194 99573 53071 -78965 -42508 274316 440577 -87390 205702 14110 166654 334389 -97112
15182 -69729 71030 -65813 -193810 215943 449281 6644 115523 -110025 4459 -21037 -141915
15171 -141915 418375 -9100 -140887 176758 284856 -8124 167931 -67032 -508 -327043 60337
15159 43614 176650 121494 -96491 158669 76604 126698 47338 64188 61081 165911 82783
15147 234729 385972 -240446 238719 156815 199155 -98566 75153 89480 -262185 122948
$$ packed form
15230D6497L51232h615B03436q6580A5758a94369A51438J47229F1898N107a88249
15218B0602b27179B2515a45972N7559C0698P4688a70454d357o5878A31058g7170
15206h939H3710b05022J00295b7706E9973J468J40027a02709B82863B4220b61397
15194I9573m6502g8965L6457B74316J66261h7390B05702A4110J52544J67735i7112
15182f9729G1030f5813j27997B15943K33338F644J08879a10025D459b1037j20878
15171a41915D18375i100j31787A76758J08098h124A67931f7032e08l26535F0337
15159D3614J33036n5156i6491A58669G6604N0094D7338J6850l107J04830H2783
15147B34729J51243b40446B38719q1904M2340i8566G5153J4327b62185A22948
$$ plain form
15136 -61477 286904 167208 -8542 -10593 12445 181871 348932 -70364 64537 -72962 147480
15124 -21597 1437 178503 65375 332013 -175321 -100522 -9779 224659 413309 401455 282083
15113 282083 64372 147466 261340 103511 344427 319470 103979 74282 -5638 638434 242270
15101 -76637 72602 -32885 -215138 236747 225238 -15084 101509 -5858 322104 274568 185355
15090 185355 474322 16972 -34144 327931 152325 189119 410464 567762 221671 409490
15080 409490 147166 219116 88640 144055 393747 144119 63330 483039 -26716 70462 151682
15069 151682 258766 207987 -105282 250874 511737 244297 -88564 -71462 -114526 -276214
15059 -276214 -30362 151457 193372 320530 224948 443246 -3391 6447 439027 370217 273546
$$ packed form
15136f1477B86904j19696h542k051A2445J69426J67061g0364F4537g2962A47480
15124b1597A437J77066F5375K66638a75321P4799i779B24659J88650j1854j19372
15113B82083F4372Q3094J13874A03511K40916k4957A03979k9697e638F38434B42270
15101g6637G2602c2885j82253B36747j1509a5084A01509e858C22104m7536q9213
15090A85355K88967A6972c4144C27931A52325L6794K21345J57298B21671J87819
15080D09490A47166P1950H8640N5415K49692A44119F3330M19709b6716G0462Q1220
15069A51682J07084n0779a05282B50874K60863B44297h8564J7102m3064j61688
15059b76214c0362A51457M1915J27158r5582K18298c391F447M32580o8810r6671
$$ plain form
15048 273546 119215 243719 65840 62089 -10160 -107202 176818 448394 44628 400190 -13927
15036 398059 113798 -112185 246119 -256197 279313 -74167 -193385 -94659 524499 85754
15025 139149 -73685 486283 173525 172274 75349 101153 459093 -64365 -33001 313559 220780
15014 220780 -136974 200377 50242 146230 288398 471396 397307 -59557 217882 -116049
15003 233999 127534 246944 3392 -18154 -12436 228856 582782 366568 -22139 364890 132108
14991 134904 350859 204751 290947 271379 -29641 263968 133413 414491 606269 93003
14980 176369 275855 401070 -125093 490072 -28038 299401 117306 160791 614583 331508
14970 331508 226824 181742 148985 300369 136997 302053 418229 431644 166945 259836
$$ packed form
15048B73546A19215J24504F5840l751a0160r7042A76818K71576D4628L55562a3927
15036C98059A13798a12185B46119b56197B79313g4167j19218i4659E24499H5754
15025A39149g3685D86283A73525j251G5349K5804L57940f4365L1364C13559r2779
15014B20780a36974B00377E0242R5988J42168J82998p4089e9557B17882a16049
15003B33999j06465J19410C392a8154N718B28856L53926k16214b2139C64890A32108
14991A34904K15955j46108Q6196j9568b9641B63968j30555K81078J91778I3003
14980A76369R9486J25215a25093D90072b8038B99401A17306M3485M53792k83075
14970C31508j04684m5082l2757J51384A36997J65056J16176J3415A66945R2891
$$ plain form
14960 259836 332043 181002 -78849 292160 193268 101153 252842 86792 215315 682409
14950 682409 319895 -29467 282426 204837 133434 412967 273025 284325 91084 204148
14940 204148 391152 -22889 174021 315611 -5346 -59113 251353 391191 -19360 397785
14929 572906 382095 104258 286931 408770 117863 466058 353297 4090 231751 744089
14919 744089 255791 277033 10604 84184 339148 92175 523381 370743 306803 155750
14909 155750 75397 354337 352634 274808 277327 290720 203026 320028 276908 131307 179827
14898 179827 486407 303243 395852 297826 245619 233281 328989 236746 532007 362524 373850
14887 373850 19510 623714 227400 324846 537043 261161 108538 342997 166845 173883
$$ packed form
14960B59836P2207j51041g8849B92160r8892r2115J51689H6792J28523M67094
14950F82409C19895b9467B82426p7589p1403K79533j39942J1300I1084J13064
14940B04148J87004b2889A74021J41590e346n3767B51353J39838a9360C97785
14929E72906j90811A04258J82673J21839A17863L48195j12761D090K27661N12338
14919G44089B55791K1242A0604P3580K54964I2175M31206j52638o3940j51053
14909A55750G5397K78940j703p7826K519J3393q7694J17002m3120A31307M8520
14898A79827L06580j83164R2609r8026n2207j2338R5708r2243K95261j69483J1326
14887C73850A9510O04204B27400R7446K12197B61161A08538K34459A66845P038
$$ plain form
14877 173883 481235 377094 473247 177126 556698 189384 322975 344933 176165 129476
14867 129476 557587 169749 512237 346973 286362 289383 491633 433649 139986 643245
14857 643245 532381 576712 497243 565810 408375 511473 384917 376587 607769 402327
14847 402327 724058 439070 -23788 136423 292066 287445 476973 336423 554868 518513
14837 518513 313323 250634 458275 527042 175683 647311 706324 347183 579767 390542
14827 390542 472888 107199 506480 438711 487522 548458 117697 568746 285803 584120
14817 584120 223179 215490 357645 485182 247602 461464 275163 536474 518760 518366 618097
14806 618097 678515 415720 411156 532997 223936 484424 665654 380163 205181 576297
$$ packed form
14877A73883L07352j04141R6153A77126L79572A89384J33591K1958j68768m6689
14867A29476M28111A69749L42488j65264o0611L021K02250n7984A39986N03259
14857F43245j10864M4331p9469O8567j57435J03098j26556q330K31182k05442
14847D02327L21731k84988b3788A36423J55643m621J89528j40550K18445l6355
14837E18513k05190o2689K07641O8767A75683M71628N9013C47183K32584j89225
14827C90542Q2346A07199L99281o7769M8811O0936A17697M51049k82943K98317
14817E84120B23179p689J42155J27537k37580K13862j86301K61311j7714l94R9731
14806F18097O0418k62795m564J21841B23936K60488J81230k85491j74982L71116
$$ plain form
14796 576297 449379 553010 392835 472598 581978 397957 564388 221464 1004995 436672
14785 105270 470685 339442 700496 535900 383786 674629 686415 420439 716442 221388
14774 822775 673992 778064 357241 769445 546120 772806 624825 547718 719682 814869
14764 814869 537228 644425 716500 589789 477994 633045 358076 523189 547950 631005
14754 631005 299393 668111 406318 696271 753221 1069624 896731 661935 789736 558497
14744 558497 315680 856855 577240 635117 599461 1041263 544123 798345 877099 632182
14734 632182 801189 627717 532214 725014 873113 483440 883842 804400 1001779 488827
14723 990157 725906 639477 1089017 961994 832133 859416 577671 877065 778294 1043607
$$ packed form
14796E76297j26918J03631j60175P9763J09380j84021J66431B21464P83531D36672
14785A05270L65415j31243L61054j64596j52114K90843J1786k65976K96003B21388
14774H22775j48783J04072C57241M12204k23325K26686j47981p7107J71964R5187
14764H14869k77641J07197P2075j26711j11795J55051k74969J65113K4761Q3055
14754F31005B99393L68718k61793K89953N6950L16403j72893k34796J27801k31239
14744E58497k42817N41175k79615N7877l5656M41802m97140K54222P8754k44917
14734F32182J69007j73472r5503J92800J48099l89673M00402p9442J97379D88827
14723I90157k64251q6429M49540j27023j29861K7283k81745K99394r8771K65313
$$ plain form
14713 1043607 578631 905891 817867 765967 1066070 557661 881641 603116 780846 629268
14703 629268 636796 1093623 1160707 798564 832443 1055003 873790 881335 955729 969117 948421
14692 948421 675126 972026 765712 632636 715457 1016823 1018400 761134 936779 1185410
14682 1185410 687983 917888 936286 985891 1106142 992092 999502 1061276 777932 917785
14672 917785 1116097 1079003 1016292 958620 1003811 1204528 1188287 1208434 905096 878258 1120331
14661 1120331 1137914 917994 1169097 922910 1219307 1077966 877600 1332854 1089317 1040512
14651 1040512 1129696 981956 972047 1226875 1159922 1335528 1172171 1117302 1252184 902294
14641 902294 1190711 986861 1151189 1300366 1128830 981043 1317352 1167722 1116557 1057063
$$ packed form
14713A043607m64976L27260q8024n1900L00103n08409L23980k78525J77730j51578
14703F29268P528M56827O7084l62143L3879K22560j81213P545P4394J3388k0696
14692I48421k73295K96900k06314j33076Q2821L01366J577k57266J75645K48631
14682A185410m97427K29905J8398M9605J20251j14050P410O1774k83344J39853
14672I17785J98312l7094o2711n7672M5191K00717j6241K0147l03338k6838K42073
14661A120331J7583k19920K51103k46187K96397j41341k00366M55254k43537m8805
14651A040512Q9184j47740r909K54828o6953J75606j63357n4869J34882l49890
14641I02294K88417k03850J64328J49177j71536j47787L36309j49630n1165n9494
$$ plain form
14631 1057063 1209468 1132744 1391959 1320426 1110301 1553726 1283619 1324163 1212864 1133840
14621 1133840 1515301 1368419 1485071 1676609 1659190 1447116 1489223 1712691 1353213 1570383
14611 1570383 1474276 1303996 1345963 1642207 1366474 1644701 1889523 1607363 1938474 1835224
14601 1835224 1552869 1978928 1541401 1680140 1317016 1618722 1693335 1842147 1538462 1765428
14591 1765428 1777018 1590687 2000492 1948873 1795554 1695433 1727994 2104554 1660332 1964288
14581 1964288 1853062 1975856 1811637 1692671 1776373 1705437 2087321 1901913 1903707 1969556
14571 1969556 2007146 2440761 2145680 2433153 2477785 1964083 2391244 2456975 2449058 2526074
14561 2526074 2305397 2749379 2624199 2963425 2875844 3062754 3350843 3362470 3546744 4318827
$$ packed form
14631A057063J52405p6724K59215p1533k10125M43425k70107M0544j11299p9024
14621A133840L81461j46882J16652J91538j7419k12074M2107K23468l59478K17170
14611A570383r6107j70280M1967K96244k75733K78227K44822k82160L31111j03250
14601A835224k82355M26059m37527J38739l63124L01706P4613J48812l03685K26966
14591A765428J1590j86331M09805n1619j53319j00121L2561L76560m44222L03956
14581A964288j11226J22794j64219j18966Q3702p0936L81884j85408J794O5849
14571A969556L7590M33615k95081K87473M4632n13702M27161O5731p917P7016
14561B526074k20677M43982j25180L39226q7581J86910K88089J1627J84274P72083
$$ plain form
14551 4318827 4726758 5682495 7267885 12241638 24004760 42906521 36925770 17947160
14542 10520098 5794753 3138655 2255757 2432216 2027216 1825713 1879263 1637436 1943174
14533 1943174 1951499 1878765 2130672 1747360 2098190 2166402 2127218 2164046 2302503 2333447 2102395
14522 2102395 2192848 2478839 2520581 2319196 2457364 2408483 2311482 2801057 2588223 2514605
14512 2514605 2511048 2504041 2807896 2722703 2950098 2784943 2862531 2902080 2970769 2983609 3162402
14501 3162402 2892336 3310513 3287276 3497877 3231320 3365295 3141425 3373736 3579445 3322836
14491 3322836 3337927 3487455 3590061 3352573 3748900 3477972 3785913 3564781 3754393 3719771
14481 3719771 3738243 3714610 3776595 3653539 4129470 4149013 4083690 4077416 3947838 4122115 4257137
$$ packed form
14551D318827M07931R55737J585390M973753J1763122J8901761n980751A7947160
14542A0520098m725345k656098q82898J76459m05000k01503N3550k41827L05738
14533A943174Q325p2734K51907l83312L50830O8212l9184L6828J38457L0944k31052
14522B102395R0453K85991M1742k01385J38168m8881r7001M89575k12834p3618
14512B514605l557p007L03855q5193K27395j65155P7588L9549O8689J2840J78793
14501C162402k70066M18177k3237K10601k66557J33975k23870K32311K05709k56609
14491C322836J5091J49528J02606k37488L96327k70928L07941k21132J89612l4622
14481C719771J8472k3633O1985j23056M75931J9543o5323o274j29578J74277J35022
$$ plain form
14470 4257137 3959034 4413269 4067597 4427178 4619284 4250155 4333722 4430612 4662384 4675772
14460 4675772 4849705 4874338 4894999 4467042 4862973 4966092 4999575 4888940 5112425 5347047
14450 5347047 5300514 4974860 5680798 5394612 5443442 5546633 5443879 5477479 5376558 6076214
14440 6076214 5864399 5860721 6060130 6318234 6085236 6372879 6379574 6283242 6352941 6552293
14430 6552293 6518415 6693640 6992609 7068524 7166046 7110142 7345417 7109407 7325923 7674342
14420 7674342 7645972 8090759 8115417 7765804 8135094 8346953 8218260 8545881 8603822 8893890
14410 8893890 8739531 8621032 9210189 9215631 9231832 9479268 9846246 9814098 10034764 10332398
14400 10332398 9851705 10511910 10538266 10338208 10660951 10888431 11010633 11344910 11706276
$$ packed form
14470D257137k98103M54235l45672L59581J92106l69129Q3567R6890K31772J3388
14460D675772J73933K4633K0661m27957L95931J03119L3483j10635K23485K34622
14450E347047m6533l25654P05938k86186M8830J03191j02754L3600j00921O99656
14440F076214k11815l678J99409K58104k32998K87643O695r6332O9699J99352
14430F552293l3878J75225K98969P5915R7522n5904K35275k36010K16516L48419
14420G674342k8370M44787K4658l49613L69290K11859j28693L27621N7941K90068
14410H893890j54359j18499N89157N442J6201K47436L66978l2148K20666K97634
14400A0332398m80693O60205K6356k00058L22743K27480J22202L34277L61366
$$ plain form
14391 11706276 11675282 11934896 12260121 12343333 12691632 12886006 13191944 13198141 13329999 13625175
14381 13625175 13865247 13868190 14314600 14694792 14999674 15170204 15387905 15954230 16030412 16304182
14371 16304182 16664200 17214111 17595866 17754184 18004741 18522382 18889643 19182913 19766581
14362 19766581 20055176 20416364 21064849 21308904 21906116 22174672 23064770 23225462 23527504
14353 23527504 24657212 25519786 25663544 26313839 26741481 27704091 28250172 28965612 29654350
14344 29654350 30554679 31477243 32310308 33090637 33778761 35158284 35682883 37003462 37720106
14335 37720106 39243009 39982152 41342726 42742721 43919097 45187586 46464462 48162673
14327 48162673 49610372 51404376 52807805 54810190 56680165 58352086 60150733 62547645
$$ packed form
14391A1706276l0994K59614L25225Q3212L48299J94374L05938O197J31858K95176
14381A3625175K40072K943M46410L80192L04882J70530K17701N66325P6182K73770
14371A6304182L60018N49911L81755J58318K50557N17641L67261K93270N83668
14362A9766581K88595L61188O48485K44055N97212K68556Q90098J60692L02042
14353B3527504J129708Q62574J43758O50295M27642R62610N46081P15440O88738
14344B9654350R00329R22564Q33065P80329O88124J379523N24599J320579P16644
14335C7720106J522903P39143J360574J399995J176376J268489J276876J698211
14327D8162673J447699J794004J403429K002385J869975J671921J798647K396912
$$ plain form
14319 62547645 64751636 67310901 69787255 72182637 75005603 77963556 80900700 84067317
14311 84067317 87724785 91283928 94821030 99259142 102882717 107438758 112697125 117599888
14303 117599888 123279864 128730754 134484345 141455729 147762375 155233052 162392140 170763411
14295 170763411 178941456 188092334 197548855 207417882 218130104 229415469 241221882
14288 241221882 253526947 266089922 279793563 293330122 307564155 321630699 336193866
14281 336193866 350534061 364882289 378886714 392253233 405169895 417189247 428099108
14274 428099108 437268980 444747395 448153141 447131039 447470750 445251286 443570287 441408780
14266 441408780 436405633 429127997 420229282 409613312 398490033 385362112 370951742
$$ packed form
14319F2547645K203991K559265K476354K395382K822966K957953K937144L166617
14311H4067317L657468L559143L537102M438112L623575M556041N258367M902763
14303A17599888N679976N450890N753591O971384O306646P470677P159088Q371271
14295A70763411Q178045R150878R456521R869027J0712222J1285365J1806413
14288B41221882J2305065J2562975J3703641J3536559J4234033J4066544J4563167
14281C36193866J4340195J4348228J4004425J3366519J2916662J2019352J0909861
14274D28099108R169872P478415L405746j022102L39711k219464j680999k161507
14266D41408780n003147p277636q898715j0615970j1123279j3127921j4410370
$$ plain form
14259 370951742 355753008 340274844 325152487 309980198 295289485 281583136 268277538
14252 268277538 255161333 242708828 230379866 219173091 208205452 197763983 188058525
14245 188058525 179325881 170970901 162609878 155093061 147654804 140944092 134753011 128761612
14237 128761612 123290887 117860734 112348460 107541550 103297132 99357253 95721309 91423147
14229 91423147 88089688 84415650 81246279 78191327 74866192 72393445 69961828 67401396
14221 67401396 65161984 63047402 60945671 58857238 56595505 54814597 53532818 51726311
14213 51726311 50319472 48633193 47059902 45589450 44379663 43033370 42694248 41141628
14205 41141628 39904788 38369388 37178057 36409978 35828245 35064209 34044798 33002801
$$ packed form
14259C70951742j5198734j5478164j5122357j5172289j4690713j3706349j3305598
14252B68277538j3116205j2452505j2328962j1206775j0967639j0441469r705458
14245A88058525q732644q354980q361023p516817p438257o710712o191081n991399
14237A28761612n470725n430153n512274m806910m244418l939879l635944m298162
14229I1423147l333459l674038l169371l054952l325135k472747k431617k560432
14221F7401396k239412k114582k101731k088433k261733j780908j281779j806507
14213E1726311j406839j686279j573291j470452j209787j346293l39122j552620
14205D1141628j236840j535400j191331p68079n81733p64036j019411j041997
$$ plain form
14197 33002801 31879203 31190058 30455764 29924087 28886856 28313938 27669310 26911551 26314384
14188 26314384 25385552 24986740 24395195 23749188 23487066 22682692 22224750 21692511 21345486
14179 21345486 20788868 20474476 20242006 19358229 19235498 18937812 18666146 18310269 18032382
14170 18032382 17292596 17188497 16864016 16757016 16114877 16145502 15559166 15380617 15164516
14161 15164516 14909887 14587179 14398147 13919361 13813787 14068150 13287631 13063444 12901905
14152 12901905 12369142 12469636 11965458 12141009 11932184 11993088 11389242 11473952 11186838 10658374
14142 10658374 10789988 10616279 10174129 10186103 10260235 9935886 9813121 9578831 9499718 9121304
14132 9121304 9115898 9173296 8752580 8682551 8769690 8545722 8513015 8347287 8171500 8424482
$$ packed form
14197C3002801j123598o89145p34294n31677j037231n72918o44628p57759n97167
14188B6314384r28832l98812n91545o46007k62122q04374m57942n32239l47025
14179B1345486n56618l14392k32470q83777j22731k97686k71666l55877k77887
14170A8032382p39786j04099l24481j07000o42139L0625n86336j78549k16101
14161A5164516k54629l22708j89032m78786j05574K54363p80519k24187j61539
14152A2901905n32763J00494n04178J75551k08825O0904o03846Q4710k87114n28464
14142A0658374J31614j73709m42150J1974P4132l24349j22765k34290p9113l78414
14132I121304n406N7398m20716p0029Q7139k23968l2707j65728j75787K52982
$$ plain form
14122 8424482 8162006 7819751 7642081 7599643 7760572 7680277 7151087 7146106 7370473 7161881
14112 7161881 6767484 7027616 6770940 6662601 6997551 6713749 6541671 6401311 6764899
14103 6764899 6219188 6290265 6262249 5778434 5964503 6143551 6102448 5659797 5737355 5828252
14093 5828252 5564124 5657618 5439811 5455838 5513276 5059780 5272144 5435537 5234688 4846113
14083 4846113 5024180 4813248 4747899 4898856 5244979 4616654 4893851 4722953 4763052 4398012
14073 4398012 4442689 4488403 4382635 4157018 4501802 3953128 4064306 4168226 3993534 4348194
14063 4348194 3898689 4033073 4068784 3993653 4028423 4159346 4010312 3932128 4019984 3636565
14053 3636565 3769847 3747483 3907940 3573131 3915627 3568750 3396051 3301346 3439010 3324329
$$ packed form
14122H424482k62476l42255j77670m2438J60929q0295n29190m981K24367k08592
14112G161881l94397K60132k56676j08339L34950k83802j72078j40360L63588
14103F764899n45711P1077k8016m83815J86069J79048m1103m42651P7558R0897
14093E828252k64128R3494k17807J6027N7438m53496K12364J63393k00849l88575
14083D846113J78067k10932o5349J50957L46123o28325K77197j70898M0099l65040
14073D398012M4677M5714j05768k25617L44784n48674J11178J03920j74692L54660
14063D348194m49505J34384L5711p5131L4770J30923j49034p8184Q7856l83419
14053C636565J33282k2364J60457l34809L42496l46877j72699r4705J37664j14681
$$ plain form
14043 3324329 3371509 3108812 3012512 3268400 3474599 3115337 3279079 2954527 2711696 3072806
14033 3072806 3037641 2934609 2850668 3172454 2836018 3171622 2960056 2831779 3005718 2821995
14023 2821995 2774523 2608445 3020242 2475303 2788504 2951068 2632909 2545954 2656551 2715464
14013 2715464 2511112 2243417 2240181 2452226 2183374 2449886 2661125 2087975 2446984 2399658
14003 2399658 2221287 2425486 1825295 2278555 2292340 2109180 2055931 2109134 2157637 2179409
13993 2179409 2066804 1939870 2300887 2698018 3686062 6748105 17223334 37855216 40718900
13984 40718900 23178128 12126139 7627626 6020792 4834879 3937412 3812953 3300847
13976 3300847 3265517 2947386 2781100 2838491 2581560 2227404 2898011 2207171 2429216 2269391
$$ packed form
14043C324329M7180k62697r6300K55888K06199l59262J63742l24552k42831L61110
14033C072806l5165j03032q3941L21786l36436L35604k11566j28277J73939j83723
14023B821995m7472j66078M11797n44939L13201J62564l18159q6955J10597N8913
14013B715464k04352k67695l236K12045k68852K66512K11239n73150L59009m7326
14003B399658j78371K04199o00191M53260J3785j83160n3249N3203M8503K1772
13993B179409j12605j26934L61017L97131R88044L062043J0475229K0631882K863684
13984D0718900j7540772j1051989m498513j606834j185913q97467j24459n12106
13976C300847l5330l18131j66286N7391k56931l54156O70607o90840K22045j59825
$$ plain form
13966 2269391 2214617 2136905 2324364 1924469 2147923 2148500 2056184 2196123 2091908 2218873
13956 2218873 1946230 1819963 1948739 1938984 1899517 2217041 1952670 2001893 1973337 1583034
13946 1583034 1770540 1664121 1701531 1581886 1401927 1885805 1567753 1560999 1902754 1555381
13936 1555381 1814658 1859587 1603066 1601661 1464293 1527806 2043711 1727519 1242548 2018991
13926 2018991 1505893 1736430 1541258 1545867 1574699 1458077 1432132 1244693 1613489 1319739
13916 1319739 1297951 1021722 1403660 1459722 1383310 1553648 1328886 1054855 1330297 1514307
13906 1514307 1422516 1183273 1205027 1626911 1270015 1578103 1566657 1296772 1341214 1396744
13896 1396744 899204 1187701 1248507 1309336 1450975 1099924 1496360 1013886 1132978 732475
$$ packed form
13966B269391n4774p7712J87459l99895K23454N77r2316J39939j04215J26965
13956B218873k72643j26267J28776r755l9467L17524k64371M9223k8556l90303
13946A583034J87506j06419L7410j19645j79959M83878l18052o754L41755l47373
13936A555381K59277M4929k56521j405j37368O3513N15905l16192m84971P76443
13926B018991n13098K30537j95172M609K8832j16622k5945j87439L68796k93750
13916A319739k1788k76229L81938N6062p6412J70338k24762k74031K75442J84010
13906A514307r1791k39243K1754M21884l56896L08088j1446k69885M4442N5530
13896A396744m97540K88497O0806O0829J41639l51051L96436m82474J19092m00503
$$ plain form
13886 732475 1502465 1444219 1275649 1160365 1473130 1166289 1033629 1188246 956437 1161107
13876 1161107 1263817 1115082 1130790 1191485 837340 1276012 1119083 944755 1063100 1377527
13866 1377527 1087063 1499930 846477 1239664 1170304 1145414 1227115 1344784 1282540 1011054
13856 1011054 1350051 1055331 762847 883710 1003498 967759 955440 1079935 1045609 804693
13846 804693 1207410 955291 1018650 1004141 897685 1132699 762267 1083781 1072817 1315458
13836 1315458 849666 998713 1003104 885619 1040266 1317715 837125 988041 607524 903463
13826 903463 1035029 848609 832369 796593 660173 805701 1419967 785969 756185 1236559
13816 1236559 873122 812679 700552 660129 790592 1055420 779896 749241 969038 1183323
$$ packed form
13886G32475P69990n8246j68570j15284L12765l06841j32660J54617k31809K04670
13876A161107J02710j48735J5708O0695l54145M38672j56929j74328J18345L14427
13866A377527k90464M12867o53453L93187o9360k4890Q1701J17669o2244k71486
13856A011054L38997k94720k92484J20863J19788l5739j2319J24495l4326k40916
13846H04693M02717k52119O3359j4509j06456K35014l70432L21514j0964K42641
13836A315458m65792J49047M391j17485J54647K77449m80590J50916l80517K95939
13826I03463J31566j86420j6240l5776j36420J45528O14266o33998k9784M80374
13816A236559l63437o0443j12127m0423J30463K64828k75524l0655K19797K14285
$$ plain form
13806 1183323 923396 716084 930242 867037 781554 1054179 907528 669188 869877 714404
13796 714404 684737 809150 683339 1080951 673395 463895 519772 891304 1013726 528914
13786 528914 675773 533837 661734 676106 1035958 536929 709692 673231 876112 650466
13776 650466 896730 783823 394831 631716 981544 641813 673756 498367 684431 492757
13766 492757 758574 801628 995337 938355 518749 963683 797094 730715 573967 555363
13756 555363 729326 706749 498943 517687 874463 553646 810023 553721 462157 658078
13746 658078 522901 554168 707683 609975 883903 875571 519360 878466 648633 621587
13736 621587 794402 535851 414184 707728 378867 634396 844196 272582 635655 681653
$$ packed form
13806A183323k59927k07312K14158o3205q5483K72625j46651k38340K00689j55473
13796G14404k9667J24413j25811L97612m07556k09500N5877L71532J22422m84812
13786E28914J46859j41936J27897J4372L59852m99029J72763l6461K02881k25646
13776F50466K46264j12907l88992K36885L49828l39731L1943j75389J86064j91674
13766D92757K65817M3054J93709n6982m19606M44934j66589o6379j56748j8604
13756E55363J73963k2577k07806J8744L56776l20817K56377k56302r1564J95921
13746F58078j35177L1267J53515r7708K73928q332l56211L59106k29833k7046
13736F21587J72815k58551j21667K93544l28861K55529K09800B72582L63073M5998
$$ plain form
13726 681653 414654 909326 677747 789637 766729 586697 657779 672721 509673 444000
13716 444000 601807 396812 325729 550167 361073 324032 398909 633383 703440 572910
13706 572910 507272 823045 643684 647301 530302 502064 603261 425686 280020 478096
13696 478096 815066 565778 301804 439528 279725 358168 565238 543940 320536 138776
13685 447734 555723 359446 516346 101247 392307 632499 594379 369391 736869 407258
13675 407258 459677 433337 787084 444827 886467 364686 491306 487434 322396 683135
13665 683135 488701 449146 95264 667960 261285 605465 285352 229888 439003 542284
13655 542284 428702 791392 396281 285768 456266 342001 177398 459856 452576 417205
$$ packed form
13726F81653k66999M94672k31579J11890k2908j80032P1082J4942j63048o5673
13716D44000J57807k04995p1083K24438j89094l7041P4877K34474P0057j30530
13706E72910o5638L15773j79361L617j16999k8238J01197j77575j45666J98076
13696D78096L36970k49288k63974J37724j59803P8443K07070k1298k23404A38776
13685D47734J07989j96277J56900A01247K91060K40192l8120k24988L67478l29611
13675D07258N2419k6340L53747l42257M41640C64686J26620l872j65038L60739
13665F83135j94434l9555I5264N72696B61285L44180B85352n5464K09115J03281
13655E42284j13582L62690l95111j10513J70498j14265j64603K82458p280l5371
$$ plain form
13645 417205 551594 399153 327440 363992 238741 796611 314354 577004 484539 370633
13635 370633 236331 563033 415095 288598 488089 307164 12038 452869 414283 315824
13625 315824 495152 283884 494754 697101 604830 353290 682176 500108 364596 204815
13615 204815 408812 -35760 387678 366743 186186 493801 892978 585314 365250 627413
13605 627413 85784 436627 438291 516945 95056 345416 376350 401506 495798 486030 286385
13594 286385 661420 191874 521881 360651 507967 301962 367513 567490 352102 101811
13583 213478 295408 366101 335702 525449 549092 531518 299210 296429 492309 434588 410063
13572 410063 269423 297291 476446 280937 167765 272052 241497 392474 407849 411716
$$ packed form
13645D17205J34389j52441p1713L6552j25251N57870C14354K62650r2465j13906
13635C70633j34302L26702j47938j26497J99491j80925A2038M40831l8586r8459
13625C15824J79328k11268K10870K02347r2271k51540L28886j82068j35512j59781
13615B04815K03997c5760C87678k0935j80557L07615L99177l07664k20064K62163
13605F27413H5784L50843J664P8654I5056K50360L0934K5156R4292r768j99645
13594B86385L75035A91874L30007j61230J47316k06005O5551J99977k15388A01811
13583B13478Q1930P0693l0399J89747K3643j7574k32308k781J95880n7721k4525
13572D10063j40640K7868J79155j95509j13172J04287l0555J50977J5375L867
$$ plain form
13562 411716 288472 212296 249838 18830 337596 203853 296587 429931 284928 428591
13552 428591 319567 75383 406506 342370 1941 384726 671302 268185 535557 310555
13542 310555 282443 165159 58855 139432 226010 645580 -61984 490581 335611 606102
13532 606102 107038 205287 208708 -104125 334814 84860 669163 263649 270783 294185 393954
13521 393954 343908 275606 401270 412589 265336 472444 548689 366853 120196 104366
13511 104366 231864 657071 419000 124766 -88097 108976 550477 90463 92139 153226
13501 153226 422561 280602 112443 345698 265210 397210 40081 122771 322683 590705
13491 590705 12910 -73696 551485 69854 84834 -169087 179398 315630 -217006 535163
$$ packed form
13562D11716j23244p6176L7542A8830L18766j33743R2734J33344j45003J43663
13552D28591j09024G5383L31123o4136A941L82785K86576B68185K67372k25002
13542C10555k8112j17284E8855Q0577Q6578M19570f1984D90581j54970K70491
13532F06102A07038R8249L421a04125C34814H4860N84303B63649P134K3402R9769
13521C93954n0046o8302J25664J1319j47253K07108P6245j81836A20196j5830
13511A04366J27498M25207k38071A24766h8097A08976M41501I0463J676O1087
13501A53226K69335j41959A12443K33255q0488J32000D0081Q2690J99912K68022
13491E90705A2910g3696E51485F9854J4980a69087A79398J36232b17006E35163
$$ plain form
13480 37104 427383 310119 -25811 448637 30569 189114 131429 307886 132591 216769
13470 216769 346225 273410 75695 529892 613062 190772 -71875 308295 95511 330932
13460 330932 386792 417405 3232 136534 378442 283972 456691 86804 -125867 275545 107280
13448 41689 57927 258197 343090 391876 250937 353077 297246 211861 144613 36092 197928
13437 197928 53727 332486 269408 33185 169726 483386 222417 163653 414258 594372
13427 594372 311215 217876 115794 458342 241151 153111 140166 222350 -44982 273193
13416 706389 217416 299544 170986 455965 507956 -150388 -231242 159332 178200 415958
13406 415958 230086 210813 142189 450384 437033 505926 130048 59642 150495 346034 190023
$$ packed form
13480C7104L90279j17264b5811D48637C0569J58545n7685J76457A32591Q4178
13470B16769J29456p2815G5695M54197Q3170A90772g1875C08295I5511K35421
13460C30932N5860L0613C232J33302K41908r4470J72719H6804a25867B75545A07280
13448D1689J6238K00270Q4893M8786j40939J02140n5831q5385o7248C6092J61836
13437A97928E3727K78759o3078C3185J36541L13660B22417n8764K50605J80114
13427E94372k83157r3339j02082L42548k17191q8040j2945Q2184d4982B73193
13416G06389B17416Q2128j28558K84979N1991a50388q0854A59332J8868K37758
13406D15958j85872j9273o8624L08195j3351O8893A30048E9642R0853J95539j56011
$$ plain form
13395 190023 322993 135924 -66557 312807 154817 94600 133879 -73990 376479 141818
13384 276358 483968 -51986 5703 83784 185438 35447 419293 281101 366951 66508 335872
13373 335872 318905 147488 200146 135721 192694 469370 8891 -43046 239424 116284 422112
13362 422112 102025 485696 172974 -91160 80913 213288 305111 149552 138862 180253
13352 180253 102566 374791 231287 117138 386427 455020 467444 377824 274649 360076
13342 360076 322132 254941 629863 452613 37516 308976 442475 98583 258482 309294
13332 309294 219042 459441 -75977 182291 431943 161068 9318 -67844 102518 52231 492025
13321 492025 485220 295227 138457 96880 414067 209633 207969 431521 -51806 166765 269303
$$ packed form
13395A90023J32970A35924f6557C12807A54817o0217L9279g3990C76479A41818
13384B76358K07610e1986E703P8081J01654C5447L83846j38192Q5850F6508K69364
13373C35872j6967A47488N2658o4425N6973K76676H891d3046B39424A16284L05828
13362D22112A02025L83671A72974i1160H0913J32375R1823A49552j0690M1391
13352A80253p7687K72225j43504j14149K69289O8593J2424q9620j03175Q5427
13342C60076l7944o7191L74922j77250C7516K71460J33499I8583J59899N0812
13332C09294r0252K40399g5977A82291K49652A61068I318f7844A02518n0287M39794
13321D92025o805j89993A38457m1577L17187k04434j664K23552e1806A66765J02538
$$ plain form
13310 269303 -118590 -73325 294674 108108 167525 196156 1189 24550 173871 330320 447021
13299 447021 -33353 338402 2640 2429 163732 -138706 -1263 38899 124362 127138 158096 223587
13287 223587 435259 420334 -37621 24157 81524 69668 32365 134868 -56709 96265 212219
13276 212219 25080 306498 -141813 257637 163103 -12808 158422 -69115 152492 236176
13266 236176 26436 -29663 -208657 -48338 105525 82158 270565 79482 232854 -175544
13255 44228 -135715 97849 109636 236923 188421 -44911 133824 42104 -92741 188277 -9672
13243 -223996 193293 539127 254266 23138 -71795 19659 21769 262877 21276 -52812 184209
13231 -61181 338735 7437 -139483 347620 60201 -113354 388533 100096 43868 163552
$$ packed form
13310B69303a18590M5265B94674A08108N9417K8631A189K3361J49321J56449J16701
13299D47021c3353C38402B640k11J61303a38706a263C8899Q5463K776L0958O5491
13287B23587K11672j4925c7621B4157N7367j1856C2365J02503e6709I6265J15954
13276B12219B5080K81418a41813B57637r4534a2808A58422f9115A52492Q3684
13266B36176B6436b9663j78994d8338A05525k3367J88407G9482J53372a75544
13255D4228a35715I7849J1787J27287m8502d4911A33824D2104i2741A88277i672
13243b23996A93293L45834B54266B3138g1795A9659K110K41108B1276e2812A84209
13231f1181C38735G437a39483C47620F0201a13354C88533A00096D3868J19684
$$ plain form
13221 163552 154506 447426 -40748 -84071 184114 163430 339144 230510 138131 -7081 8958
13209 -71668 205274 -203955 -38133 -52292 228267 244954 154729 82157 238619 -118901 234581
13197 166382 103690 39901 316566 373852 25417 276837 228020 -3605 220282 176061 -179814
13185 539585 86250 5242 311799 198310 302716 50202 240439 140530 -6629 161393 -127470
13173 135287 -130169 -215704 138801 106945 43443 -7519 41335 -213376 69128 -34646 96361
13161 270989 40163 -33903 17933 123572 -64027 20661 224921 120383 196234 13594 -9440
13149 43052 20638 -195334 161881 210663 -219674 -208172 138438 -123737 236391 -17821
13138 94320 94125 156485 188196 408161 220774 -66666 321057 176136 15929 -9173 86958
$$ packed form
13221A63552r046K92920d0748m3323A84114k0684J75714j08634r2379g081H958
13209g1668B05274b03955c8133j4159B28267J6687r0225p2572J56462a18901B34581
13197A66382o2692C9901K76665N7286B5417K51420m8817c605B20282m4221a79814
13185E39585H6250E242L06557j13489J04406E0202J90237r9909f629A61393a27470
13173A35287a30169q5535A38801l1856D3443g519D1335b13376F9128c4646I6361
13161B70989D0163c3903A7933J05639f4027B0661K04260j04538P5851A3594i440
13149D3052B0638a95334A61881M8782b19674J1502A38438a23737B36391a7821
13138I4320j95O2360L1711K19965j87387f6666C21057j44921A5929i173H6958
$$ plain form
13126 542750 183017 -142116 -60039 -96273 49859 162739 198955 49525 172060 -21552 -51768
13115 -51768 301978 206464 -36769 181550 52854 66050 210096 415904 135564 238578
13105 238578 45764 -187815 64818 -107910 -306071 -137882 -102300 53252 32333 -156106
13094 21419 73464 18721 188403 240794 399576 239731 7008 28945 101471 -116148 315890
13082 19765 107385 181236 160411 -29441 79472 -135178 -66029 -110162 -41984 195766 189322
13071 189322 379936 -126536 46085 284168 70028 135386 146544 -219913 111265 -42299
13060 106296 3731 -19885 -19805 59179 307779 -134410 4351 -171089 -105230 3174 107102 2182
13047 128698 219849 128410 341991 164155 192596 147255 -216485 153540 428649 130515
$$ packed form
13126E42750A83017a42116f0039l6234D9859J12880L6216D9525J22535b1552l0216
13115e1768C01978r5514c6769A81550E2854J3196J44046K05808A35564J03014
13105B38578D5764a87815F4818a07910j98161a37882L5582E3252k0919a56106
13094B1419N2045A8721J69682N2391J58782j59845G008K1937P2526a16148C15890
13082A9765Q7620P3851k0825b9441G9472a35178f6029m4133d1984A95766o444
13071A89322J90614a26536D6085K38083G0028O5358J1158b19913A11265d2299
13060A06296C731a9885Q0E9179K48600a34410D351a71089O5859C174J03928B182
13047A28698R1151r1439K13581A64155K8441m5341b16485A53540K75109A30515
$$ plain form
13036 6066 -121454 422160 -186535 119033 415483 47122 21503 51954 207762 -147114
13025 332425 80025 239863 299622 313996 24857 307575 34384 90471 -21347 70382 -15130
13013 323843 318967 199880 491673 70535 306780 463142 2578 346546 346345 17009 95671
13002 95671 -137063 139601 141147 51829 158070 38093 260661 391405 -20694 127453 291255
12991 291255 92779 116440 -56801 364321 96467 -193168 158007 345128 157160 -38701
12980 176155 149938 -99145 -55689 -209811 -275084 148067 -12909 227848 -23848 42419 187446
12969 187446 174399 419782 -23035 -117510 26970 25951 122456 -169671 84599 81380 -131707
12957 290418 105700 201820 113438 2194 11370 -253886 -10401 183646 152387 55222 -153747
$$ packed form
13036F066a21454D22160a86535A19033K96450D7122B1503L0451J55808a47114
13025C32425H0025J59838N9759J4374B4857K82718C4384N6087b1347G0382a5130
13013C23843m876j19087K91793G0535K36245J56362B578L43968k01A7009P8662
13002I5671a37063A39601J546E1829J06241C8093K22568J30744b0694A27453J63802
12991B91255I2779K3661e6801C64321I6467a93168A58007J87121A57160c8701
12980A76155k6217i9145M3456j54122o5273A48067a2909B27848b3848D2419J45027
12969A87446j3047K45383b3035r4475B6970j019R6505a69671H4599l219a31707
12957B90418A05700R6120q8382B194R176b53886a0401A83646l1259E5222a53747
$$ plain form
12945 242763 35396 -125266 56855 -252945 322677 172460 115277 282899 -80751 285510
12934 -58122 41781 129175 -202269 -184396 269978 -205505 88173 139748 -142369 46531 -34379
12922 243058 -138990 20122 140680 72389 14210 14779 25712 -102348 326760 88940 -5487
12910 88281 201064 8076 555843 52065 -233634 -310349 -59697 -56210 198000 -29559 -383140
12899 -383140 274853 -47683 -74726 338240 -255045 44696 120944 -9992 -130822 -205975 223672
12887 -27115 -20807 243698 223825 -63909 255089 41572 178705 94307 161956 14090 -99619
12875 55874 -30747 -90009 121229 -6021 -122561 74408 116956 97309 149123 16127 -133637
12863 65415 -45809 -129041 168554 267860 48155 611250 171529 66292 82511 228172 -102287
$$ packed form
12945B42763C5396a25266E6855b52945C22677j50217n7183J67622h0751B85510
12934e8122D1781Q7394b02269J7873B69978b05505H8173N1575a42369D6531c4379
12922B43058a38990B0122J20558o8291A4210N69J0933a02348C26760H8940e487
12910H8281J12783H076N47767E2065b33634p6715e9697L487A98000b9559l53581
12899c83140B74853d7683k7043C38240b55045D4696P6248i992j20830p5153B23672
12887b7115O308B43698j9873f3909B55089D1572J37133q4398O7649A4090i9619
12875E5874c0747n9262A21229f021j16540G4408M2548j9647N1814A6127a33637
12863F5415d5809q3232A68554R9306D8155N63095A71529F6292J6219J45661a02287
$$ plain form
12851 89854 -267055 -44832 7531 364432 -220242 149866 31755 -102903 -94778 275531 -35570
12839 21160 546178 -115088 -135038 197102 -200197 -29776 -133853 -25080 75365 288731
12829 288731 -216046 -13163 76794 68474 -346730 -119959 -170788 87855 -203371 -109660 -206586
12818 -206586 -44718 356462 -161489 70053 256851 -143784 3274 -29028 306707 36515 281139
12807 281139 -102386 117830 66548 119862 106006 -125534 79311 93170 136891 116078 -248550
12795 23225 -99891 111507 -192748 -34569 -139167 71457 -300217 2261 49864 86598 -120322
12783 -267169 -77971 -149685 -117953 -152280 100514 65696 -180796 44927 -201870 -18504 210144
12771 157282 -249834 44864 -32610 56379 45580 -98618 21342 79713 7138 15099 -57067 90743
$$ packed form
12851H9854b67055d4832G531L56901b20242A49866C1755a02903Q125B75531c5570
12839B1160N25018a15088j9950A97102b00197b9776j04077b5080G5365K13366
12829B88731b16046a3163G6794q320c46730a19959n0829H7855b03371R3711r6926
12818b06586d4718C56462a61489G0053J86798a43784C274b9028C06707C6515K44624
12807B81139a02386A17830n1282N3314j3856a25534G9311J3859M3721k0813b48550
12795B3225i9891A11507a92748c4569j04598G1457c00217B261M7603L6734a20322
12783b67169g7971p1714L1732l4327A00514l4818a80796D4927b01870a8504B10144
12771A57282b49834D4864c2610E6379j0799i8618B1342N8371G138P961e7067I0743
$$ plain form
12758 136688 -51846 333546 300542 55588 -32474 152590 64232 223490 -52979 435866 164245
12746 201275 86762 -164235 55412 -45225 -50621 -135093 -336785 -342990 -26763 109870 -51894
12734 526303 -51461 166897 -65160 -68173 188183 -142984 127254 -95355 71855 -39881 129778
12722 43480 77504 16218 -254087 200869 10217 36257 -195123 49947 -4035 72018 153745
12711 153745 54278 12695 96798 69182 248157 220741 34039 -19759 563958 123548 75781
12700 75781 359971 -29935 274735 129945 337917 18004 -55675 64895 43108 -71343 137989
12688 109133 -1234 -147996 89756 4128 12151 257396 -290230 -190881 144492 577264 106753
12676 179891 91498 292663 147689 530929 49125 445345 -68296 -731 166914 318351 -112653
$$ packed form
12758A36688e1846C33546l3004E5588c2474A52590F4232J59258e2979D35866A64245
12746B01275H6762a64235E5412d5225n396q4472k01692o205b6763A09870e1894
12734E26303e1461A66897f5160l013A88183a42984A27254i5355G1855c9881A29778
12722D3480L4024A6218b54087B00869A0217K6040a95123D9947d035G2018Q1727
12711A53745E4278A2695Q4103k7616J78975k7416C4039a9759E63958A23548m7767
12700G5781K84190b9935B74735A29945K07972A8004e5675F4895k1787g1343A37989
12688A09133a234j46762H9756D128Q023K45245b90230R9349A44492M32772A06753
12676A79891q8393K01165j44974L83240D9125L96220f8296g31A66914J51437a12653
$$ plain form
12664 -48747 -104980 -28769 173652 124750 -12439 113687 422925 348222 358576 -27469 -85444
12653 -85444 -48238 119167 107758 226514 220596 84257 -252324 -43234 -281365 129978 -7583
12641 -116837 301124 138689 105804 435430 -326935 170775 289084 208943 -154005 121028
12630 98358 -232457 257297 -98733 477068 355756 10976 60550 33970 233853 239284 633124
12619 633124 98477 351731 17784 123586 125249 -80779 291513 76977 -185759 -91190 -16588
12607 -74969 -18226 -10168 -29627 165621 123958 146632 -6618 341495 108835 -28926 98605
12595 26943 -122095 -225719 -353160 87013 235121 220232 -385186 -166276 67721 -163585
12584 114626 268978 -202891 81640 202886 66495 256958 152215 -150400 75816 127144
$$ packed form
12664d8747n6233b8769A73652m8902a2439A13687L09238p4703J0354b7469n7975
12653h5444L7206A19167j1409J18756n918H4257b52324d3234k38131A29978g583
12641a16837C01124A38689l2885L29626c26935A70775J18309q0141a54005A21028
12630I8358b32457B57297i8733D77068j21312A0976M9574k6580J99883N431L93840
12619F33124I8477K53254A7784J05802J663h0779B91513G6977a85759i1190a6588
12607g4969a8226Q058j9459A65621m1663K2674f618C41495A08835b8926I8605
12595B6943a22095j03624j27441H7013J48108j4889c85186a66276F7721a63585
12584A14626J54352b02891H1640J21246F6495J90463j04743a50400G5816N1328
$$ plain form
12574 127144 89403 102555 18221 -25361 -102581 -281885 23244 198076 -82390 -115552 -40688
12562 -60697 51382 -113022 59323 116414 -95171 -86876 23499 62810 5471 -101536 194347
12550 -51343 -79393 -90259 210425 136197 72002 -31050 -14899 269434 162516 382678 -355180
12538 29893 87777 194875 301334 155260 126189 -88121 4013 -105412 -57218 92050 48100
12527 48100 -122667 -103407 -84291 -283396 -6867 32034 229429 178813 184944 -23886 65231
12515 -140789 321827 101760 170978 71654 29821 -63417 218265 -91305 -94619 -129802 -112727
12504 -112727 96669 225570 -242031 -323618 10288 5257 214217 208290 -8037 -30458 -11693
12492 -135758 170243 -10585 144759 152730 -6747 -101530 175695 -126595 -223042 256120 346441
$$ packed form
12574A27144l7741J3152A8221b5361p7220j79304B3244J74832h2390l3162d0688
12562f0697E1382a13022E9323N7091i5171Q295B3499L9311E471a01536A94347
12550e1343k8050j0866B10425p4228o4195c1050a4899B69434j06918K20162c55180
12538B9893N7884J07098J06459j46074k9071h8121D013a05412M8194I2050m3950
12527D8100a22667J9260J9116j99105f867C2034J97395n0616O131b3886F5231
12515a40789C21827A01760O9218G1654B9821f3417B18265i1305l314l5183J7075
12504a12727I6669J28901b42031q1587A0288n031K08960n927h037k2421a1693
12492a35758A70243a0585A44759P971f747r4783A75695a26595r6447B56120R0321
$$ plain form
12481 346441 -44792 -99926 12536 25341 -219061 24323 104250 -92327 198881 117294 232408
12470 232408 -130932 -62892 -191025 -37907 171012 4373 -448203 -54311 -39672 83369 197660
12459 197660 48670 138464 81012 -214424 160001 -53225 232782 185178 298553 -148360
12448 2785 203359 -204597 247323 88495 178275 -135277 199590 136744 -192655 -96218 155063
12436 280577 73140 288728 144979 98885 -462299 -35280 -144923 164651 -126635 -83090
12426 -83090 166620 61164 -70109 270855 159055 52221 -93198 75421 355189 -58712 160497
12414 -27311 109272 81493 -153335 -14342 283825 -9914 -80391 27045 206720 -10629 -136703
12403 -136703 187711 -132823 -276808 -138615 104004 248866 -34068 48926 61246 101488
$$ packed form
12481C46441d4792n5134A2536J2805b19061B4323P9927i2327A98881q1587J15114
12470B32408a30932f2892j28133c7907A71012D373d48203e4311J4639H3369J14291
12459A97660D8670Q9794n7452b14424A60001e3225B32782m7604J13375a48360
12448B785K00574b04597B47323H8495Q9780a35277A99590o2846a92655i6218A55063
12436B80577G3140K15588j43749m6094d62299c5280j09643A64651a26635M3545
12426h3090A66620F1164g0109B70855j11800E2221i3198G5421K79768e8712A60497
12414b7311A09272k7779a53335a4342B83825i914p0477B7045J79675a0629j26074
12403a36703A87711a32823j43985J38193A04004J44862c4068D8926J2320M0242
$$ plain form
12393 101488 44812 125813 -324254 267809 129419 82290 7126 -108481 -171403 -82628 161508
12381 64534 110749 -19576 133711 -501499 242416 55825 -35004 19224 -156430 -45298 317783
12369 -28703 96386 -212282 -77777 24493 -346835 154698 179234 -30931 -34167 166600 371936
12358 371936 -114239 -164279 -134091 266029 83085 221349 41605 -199111 85569 157500 59155
12346 -38448 -300330 182814 -64234 -16504 -3954 -228626 409729 35422 -80799 363679 76323
12334 -215215 117110 222252 309893 -44984 43975 -68158 224275 -54527 -71475 -241000 164099
12322 252623 -35958 -339093 322 6977 -314382 -81008 364299 113577 5373 80360 194786
12311 194786 133714 256410 39649 -1996 137738 294635 -26527 80600 2913 121376 -198516
$$ packed form
12393A01488D4812Q1001c24254B67809A29419m7129G126a08481o2922h2628A61508
12381F4534M6215a9576A33711e01499B42416E5825c5004A9224a56430d5298C17783
12369b8703I6386b12282g7777B4493c46835A54698K4536c0931l236A66600K05336
12358C71936a14239n0040L0188B66029H3085J38264D1605a99111H5569P1931E9155
12346c8448k61882A82814f4234a6504c954k24672D09729C5422h0799C63679G6323
12334b15215A17110J05142Q7641d4984D3975f8158B24275e4527j6948j69525A64099
12322B52623c5958l03135C22O655c14382h1008C64299A13577E373P4987J14426
12311A94786o1072J22696C9649a996A37738J56897b6527H0600B913J18463a98516
$$ plain form
12299 164582 -25966 -124550 -186671 -6474 -111099 68252 376147 270373 334046 58139 135373
12288 135373 24348 43382 -99709 213455 68492 -1107 -30576 512920 -88584 148384 109421
12277 109421 123182 -107641 182254 332673 119112 113532 271857 -174370 -321435 323053
12266 -67736 -214901 44968 199564 -162270 -72630 70962 115821 112255 7938 210663 -166600
12254 -49308 -320520 266005 63348 -10627 83783 -205747 201608 354428 96363 106828 151933
12243 151933 292288 103236 -134143 22066 -149770 205490 363553 71262 235652 227568
12233 227568 -39432 42893 12957 -26193 260672 -26766 386270 242352 196800 46474 196753
12222 196753 114071 72509 340729 139325 176721 275267 -60861 282862 108180 268866
$$ packed form
12299A64582b5966r8584o2121f474j04625F8252L07895j05774O3673E8139P7234
12288A35373B4348J9034i9709B13455F8492a107k9469E12920h8584A48384l8963
12277A09421J3761a07641A82254J50419A19112n580J58325a74370j47065C23053
12266f7736j47165D4968J54596a62270g2630G0962M4859l566G938K02725a66600
12254d9308k71212B66005F3348a0627H3783b05747B01608J52820I6363J0465M5105
12243A51933J40355A03236a34143B2066a49770B05490J58063G1262J64390q084
12233B27568c9432D2893A2957b6193B60672b6766C86270j43918m5552D6474J50279
12222A96753q2682m1562K68220A39325L7396R8546f0861B82862A08180J60686
$$ plain form
12212 268866 20769 200768 -42162 287869 148475 62721 139742 -14515 55908 251 223462
12201 223462 373102 339260 236695 261734 -62924 86318 392054 384117 311385 -253569 474257
12189 204398 344510 -31063 -261558 -143817 216761 83659 125377 248671 297242 314502
12179 314502 8718 -86624 223352 -144525 -58143 -14738 237666 -162061 162856 174597 -57200
12167 84825 247426 -49578 216054 360499 -30681 -88178 104524 -12306 83170 164972 224197
12156 224197 192772 159974 -55531 -339054 74101 49910 -221477 393342 265542 27675 169956
12145 169956 -291296 -23207 209906 -75261 29070 -7152 -77344 29966 105835 248245 -174691
12133 15612 20607 215516 63607 64619 119884 230269 -341941 -61407 15510 -236844 -133151
$$ packed form
12212B68866B0769J79999d2162B87869j39394F2721P7021a4515E5908B51K23211
12201B23462J49640l3842j02565K5039f2924H6318L05736p937p2732b53569D74257
12189B04398J40112c1063k30495J17741B16761H3659M1718J23294M8571J7260
12179C14502H718h6624B23352a44525e8143a4738B37666a62061A62856J1741e7200
12167H4825J62601d9578B16054J44445c0681n7497A04524a2306H3170Q1802N9225
12156B24197l1425l2798e5531k83523G4101k4191b21477C93342j27800B7675J42281
12145A69956b91296b3207B09906g5261B9070g152p0192B9966P5869J42410a74691
12133A5612M995J94909F3607J012N5265J10385c41941f1407A5510b36844J03693
$$ plain form
12122 -133151 66548 -98733 188590 175009 3892 179796 186157 158565 201184 192741 387379
12111 387379 69056 -43101 255723 11260 6133 -269288 -129785 -92243 260688 -236393 -56283
12099 -79858 137284 -127863 95256 450030 -52131 -215764 -37149 253963 139862 -62300
12088 238568 -167958 -180814 47863 46576 -216958 220200 -263795 -281782 37268 163811 -45459
12076 221903 -221403 193140 -170784 -20708 -22374 290809 96286 98449 -190324 23917 -17008
12064 19078 143078 3099 519208 1061636 1871321 1165122 395422 387639 25278 -310120 18350
12052 -134776 209982 299609 90663 -266485 -235350 -124708 23803 -261139 -228545 -96745 233539
12040 -420024 86666 84723 113670 34014 -325382 -376592 -218921 88811 83207 64518 -3300 194844
$$ packed form
12122a33151F6548i8733A88590j3581C892J75904O361k7592M2619q443J94638
12111C87379F9056d3101B55723A1260n127b69288a29785L7542B60688b36393e6283
12099g9858A37284a27863I5256L54774e2131j63633c7149B53963j14101f2300
12088B38568a67958j2856D7863j287b16958B20200b63795j7987C7268J26543d5459
12076B21903b21403A93140a70784b0708j666B90809I6286K163a90324B3917a7008
12064A9078J24000C099N16109N42428Q09685p06199C95422p783B5278c10120A8350
12052a34776B09982Q9627I0663b66485L1135J10642B3803b61139L2594i6745B33539
12040d20024H6666j943K8947C4014c25382n1210J57671H8811n604j8689c300A94844
$$ plain form
12027 -108418 242522 -90834 185893 -174503 177644 -71041 -24261 32650 8823 -82389 144306
12015 33307 87535 176234 -62664 85262 -119278 71599 94610 89370 -150817 -54230 8139 -52222
12002 86821 363989 21628 -254460 -174302 59449 83607 -91369 145651 134844 -63232 -97084
11991 -97084 54712 287260 3352 -62623 -85333 -14944 -211006 84713 173514 148355 134053
11980 134053 -36132 259451 -309278 79278 -199552 216557 199400 -140649 85025 47098
11970 47098 149161 -155506 -102278 183430 -115391 -36050 -73519 -86117 -177658 -149574 55658
11958 18131 -243123 86897 262139 -76102 -22242 104452 -2331 17247 -199570 131157 153632
11947 153632 -23222 -29283 -166558 -92924 -273749 56965 84263 139983 49125 90745 121279
$$ packed form
12027a08418B42522i0834A85893a74503A77644g1041b4261C2650H823h2389A44306
12015C3307N4228Q8699f2664H5262a19278G1599K3011n240a50817e4230H139e2222
12002H6821K77168B1628b54460Q0158E9449K4158i1369A45651j0807f3232l3852
11991i7084E4712K32548C352f2623k2710a4944j96062H4713Q8801k5159j4302
11980A34053c6132B59451c09278G9278a99552B16557j7157a40649H5025l7927
11970D7098J02063a55506N3228A83430a15391c6050l7469j2598r1541K8084E5658
11958A8131b43123H6897J75242g6102b2242A04452b331A7247a99570A31157K2475
11947A53632b3222o061j37275P3634j80825E6965K7298N5720D9125M1620L0534
$$ plain form
11936 121279 -171444 -259001 -19825 251781 72305 -59023 -200762 -310944 -276921 214162
11925 -177950 -78254 -309623 44917 -266316 -176012 299768 48524 120178 -246861 92338 92404
11914 92404 472855 -178798 101301 79402 -109778 347433 -46423 26626 50333 -152824
11903 65329 -222529 -33322 -89158 125259 -39251 111011 67460 -25710 154944 105346 36644
11891 5213 -43080 75761 8347 -12378 -326777 -240772 28412 137144 -1725 160998 -128882
11879 135250 47034 211881 218839 23595 119053 1971 136110 -242706 -104907 35724 48223
11868 48223 147002 195879 -118262 209674 -216533 177940 -120956 -291719 23414 -47716
11857 97655 -42209 -62838 -314524 368349 -363462 -9555 199895 -95049 -79132 113737 -164713
$$ packed form
11936A21279a71444q7557a9825B51781G2305e9023j41739j10182L4023B14162
11925a77950g8254k31369D4917b66316R0304B99768D8524P1654b46861I2338O6
11914I2404L80451a78798A01301k1899a09778C47433d6423B6626K3707a52824
11903F5329b22529c3322n5836A25259c9251A11011m3551b5710A54944m9598C6644
11891E213d3080G5761H347a2378l14399Q6005B8412J08732a725A60998a28882
11879A35250D7034J64847O958B3595R5458A971J34139b42706a04907C5724J2499
11868D8223R8779M8877a18262B09674b16533A77940a20956j70763B3414d7716
11857I7655d2209k0629k51686C68349c63462i555A99895i5049J5917A13737a64713
$$ plain form
11845 -281557 -264904 6767 218173 -322229 -170827 -477936 213595 30330 -61154 -83543 -122055
11834 -122055 496297 -83353 85407 -347830 49688 -135785 47263 53611 -191230 26731 -7312
11822 -81694 90641 38772 20356 -179973 86447 1100 -52915 252924 -56221 119020 -42824
11810 -470799 35007 -207698 210847 35552 161183 -140735 -167032 279109 -35034 2757 -134073
11798 -154709 -313975 -199684 -74266 -99375 -14787 -25432 -76054 -126702 130669 71533 -22692
11786 -219994 -72840 -99847 184004 -129158 58379 6357 -37172 -173750 39387 -4463 -218645
11775 -218645 -20087 -202853 -168565 171189 22696 376021 -85077 25806 -357243 121269
11764 135314 178306 -116334 -159346 -146706 -75154 267899 93814 -44901 -5652 -266591 -125437
$$ packed form
11845b81557J6653F767K11406c22229J51402l07109B13595C0330f1154k2389l8512
11834a22055D96297h3353H5407c47830D9688a35785D7263O348a91230B6731g312
11822h1694I0641C8772j8416a79973H6447A100e2915B52924e6221A19020d2824
11810d70799C5007b07698B10847C5552J25631a40735k6297B79109c5034B757a34073
11798a54709j59266J14291g4266k5109a4787j0645n0622n0648A30669n9136b2692
11786b19994g2840k7007A84004a29158E8379F357c7172j36578C9387d463k14182
11775b18645b0087j82766L4288A71189B2696L53325h5077B5806c57243A21269
11764A35314M2992a16334m3012J2640P1552B67899I3814d4901e652k60939a25437
$$ plain form
11752 -20953 -12806 229996 -227560 3879 -31567 47791 -331753 86705 112162 85632 -80104
11740 86635 133860 215271 101601 77147 154871 -121486 399913 -49306 225379 11620 288952
11729 288952 4346 -235916 -117789 -205261 290560 31023 -182489 -79998 181648 22095 239199
11718 239199 60974 -135070 -269520 -149253 -14797 232767 303125 329173 223633 144991
11708 144991 63580 132635 -2670 -112221 -91241 -47645 34913 87378 31942 166662 -70318
11696 8484 36648 232387 -40079 251584 -46231 145413 -1459 175381 158144 230831 -40563
11684 248903 173955 22053 113331 364477 95219 -156831 502006 115364 39694 84466 228213
11673 228213 97485 38322 -94155 117402 111423 95121 -72388 -296411 128038 -29553 -225927
$$ packed form
11752b0953Q147B29996b27560C879c1567D7791c31753H6705K5457k6530h0104
11740H6635M7225Q1411A01601k4454P7724a21486C99913d9306B25379A1620K77332
11729B88952D346b35916a17789q7472B90560C1023a82489g9998A81648B2095K17104
11718B39199F0974a35070j34450J20267a4797B32767P0358K6048j05540p8642
11708A44991F3580O9055b670j09551K0980M3596C4913N2465C1942J34720g0318
11696H484K8164J95739d0079B51584d6231A45413a459A75381j7237P2687d0563
11684B48903p4948B2053R1278K51146I5219a56831E02006A15364C9694M4772J43747
11673B28213I7485C8322i4155A17402n979j6302g2388k24023A28038b9553j96374
$$ plain form
11662 -225927 -208869 -27158 122813 -218356 215777 -71923 20198 -132715 -138467 -55690 -124137
11651 -124137 -6299 -143072 -43764 -170083 -116727 -16784 105439 111594 -16946 66674 -201599
11639 251324 216429 -112826 -140830 41646 48347 46194 22909 108644 265818 279587 63431
11627 68945 38199 125877 310014 -15112 -79555 150680 18691 151694 -169928 -159944 50983
11615 -135853 321925 91098 62900 187691 -135650 187398 196970 -165807 126376 26539
11604 63000 -13238 -134728 386354 12192 217609 75563 -169202 -259350 125015 209141 -179184
11592 -200760 320896 61324 101878 14584 127508 -201026 277393 -20601 1155 -57354 165670
11580 271427 197533 -128695 20147 207413 -278688 175123 29289 253758 547950 84405
$$ packed form
11662b25927J7058b7158A22813b18356B15777g1923B0198a32715n752e5690o8447
11651a24137f299j36773d3764j26319N3356a6784A05439O155a6946F6674b01599
11639B51324l4895a12826k8004D1646O701k153B2909Q5735J57174J3769F3431
11627F8945l0746Q7678J84137a5112o4443A50680A8691J33003a69928R984E0983
11615a35853C21925I1098k8198J24791a35650A87398R572a65807A26376B6539
11604F3000a3238j21490C86354A2192K05417G5563a69202r0148A25015Q4126a79184
11592b00760C20896F1324M0554A4584J12924b01026B77393b0601A155e7354A65670
11580B71427p3894a28695B0147J87266b78688A75123B9289K24469K94192H4405
$$ plain form
11569 215897 -263876 -35471 189817 132953 236596 39978 139485 259907 -24466 124931
11558 161617 874 -111289 -352827 -49987 142766 -14958 240459 -54927 118807 129052 249198
11547 249198 336451 -86902 -97322 53294 338541 -125932 -74809 -88908 319131 184465 222531
11536 222531 117319 103389 132354 16585 167318 -279068 222759 -101254 -12981 93013
11525 130922 178987 86996 -109 62526 103408 118337 62593 205059 -283263 239882 158697
11514 158697 204693 188665 -17428 261919 440309 -140324 131933 -48551 179810 114536
11504 114536 146099 201514 -60640 86775 188082 21525 312885 337507 19527 310104 395815
11493 395815 291980 367676 -102382 357289 -166112 -159106 -27194 93153 -126535 426583
$$ packed form
11569B15897b63876c5471A89817n6864J03643C9978R9507J20422b4466A24931
11558A61617H74a11289k41538d9987A42766a4958B40459e4927A18807J0245J20146
11547B49198Q7253h6902j0420E3294K85247a25932N1123j4099C19131j34666L8066
11536B22531j05212j3930K8965A6585J50733b79068B22759a01254a2981I3013
11525A30922M8065H6996a09F2526M0882J4929n5744J42466b83263B39882q1185
11514A58697M5996j6028a7428B61919J78390a40324A31933d8551A79810o5274
11504A14536L1563N5415f0640H6775J01307B1525K91360K4622A9527K90577Q5711
11493C95815j03835P5696a02382C57289a66112P006b7194I3153a26535D26583
$$ plain form
11482 139478 72442 152014 84262 -75361 144644 293016 -80013 220523 76904 9290 -102058
11470 140079 361676 -295568 304268 158741 151639 79549 59549 120185 316303 101342
11459 -84475 67907 260643 -45894 106290 130189 238231 220744 -83569 -123586 -358941 90122
11447 94512 -28672 182424 -108262 -393047 251680 64223 284842 4023 99429 335451 137191
11435 -185008 171844 -349259 113228 -25580 127956 -18948 -118332 -53275 54325 118308 80179
11424 80179 134434 -137829 129950 37713 343312 -26925 -92656 34856 -18108 -106628 -194811
11413 -194811 128457 -25663 56921 74310 -105570 144949 -204199 -84875 -47338 -44836 92870
11401 67463 262020 -78906 -3506 -113154 134525 -209969 -377795 -224534 -314358 -63321 43105
$$ packed form
11482A39478o7036P9572o7752g5361A44644J48372h0013B20523G6904I290a02058
11470A40079K21597b95568C04268j45527p102p2090k0000O0636J96118A01342
11459h4475F7907J92736d5894A06290K3899J08042j7487h3569m0017k35355I0122
11447I4512b8672A82424a08262k84785B51680F4223K20619D023R5406K36022A37191
11435a85008A71844c49259A13228b5580A27956a8948r9384e3275E4325O3983l8129
11424H0179N4255a37829A29950C7713L05599b6925o5731C4856a8108q8520q8183
11413a94811A28457b5663E6921J7389a05570A44949b04199h4875L7537K502I2870
11401F7463J94557g8906c506j09648A34525b09969j67826J53261q9824f3321D3105
$$ plain form
11389 -97694 -98084 -203597 -332187 -98754 -102000 -166469 -456593 120984 118668 -296003 300380
11377 29825 2887 227316 -95383 -68941 -29308 -10584 -16106 -67950 78444 91218 201834 -126997
11364 53487 -99877 42408 173641 -6845 217756 33165 320427 333299 2103 105669 -316798
11352 -147136 44878 -35617 -214354 323841 385405 -87354 312425 183366 -42124 -119046 147714
11340 -70979 -92575 54802 -67736 -98073 173366 -373564 291823 -106692 135219 -106343
11329 -267171 220429 271867 420500 -46173 105721 -11417 29996 189226 23288 69761 -183199
11317 62343 160631 71583 43675 388073 -66123 48893 191601 171585 -12577 -80880 -226793
11306 -226793 -88452 -86647 164101 -96952 65730 75004 119861 30951 266640 217332 -121019
$$ packed form
11389i7694l90j05513j28590i8754l246o4469k90124A20984k316b96003C00380
11377B9825B887K24429i5383K6442b9308a0584n522n1844G8444J2774J10616a26997
11364E3487i9877D2408J31233f845B17756C3165K87262J2872B103J03566c16798
11352a47136D4878c5617j78737C23841O1564h7354C12425j29059d2124p6922A47714
11340g0979k1596E4802f7736l0337A73366c73564B91823a06692A35219a06343
11329b67171B20429N1438J48633d6173A05721a1417B9996J59230B3288M6473a83199
11317F2343R8288G1583k7908L44398f6123D8893J42708k0016a2577o8303j45913
11306b26793h8452J805A64101i6952F5730R274M4857C0951K35689m9308a21019
$$ plain form
11294 -212075 210043 -197736 107888 6651 53993 -85207 -211540 -238457 169397 48200 143697
11283 143697 9837 -258009 -75026 -68122 -235194 66430 206154 42016 -4620 -289412 60987
11271 55063 -346167 27494 -265701 64723 -185370 -247743 -207612 62795 -107216 -179678 -63644
11259 12584 -177599 165550 -314467 41303 24174 -45170 -242553 -205175 -38690 128579 -106315
11247 -270735 -24930 -39155 -128740 182054 -410635 -318416 -152972 236601 -161754 -118467
11237 -118467 65883 -59791 -271192 -181228 179019 -305495 -16047 99717 153669 56954 -168268
11225 -105048 94336 115112 101885 -130799 17805 -139822 67984 139025 -58608 -499545 310460
11213 -266132 -116830 253228 227258 -172403 -199666 -218356 167743 -337345 -12303 161645
$$ packed form
11294b12075B10043a97736A07888F651M7342h5207j26333k6917A69397D8200R5497
11283A43697I837b58009g5026O904j67072F6430J39724D2016d620k84792F0987
11271E5063c46167B7494b65701F4723a85370o2373M0131F2795a07216p2462f3644
11259A2584a77599A65550c14467D1303j7129d5170j97383L7378c8690A28579a06315
11247b70735b4930j4225q9585A82054d10635R2219a52972B36601a61754M3287
11237a18467F5883e9791k11401Q9964A79019c05495a6047I9717N3952E6954a68268
11225a05048I4336K0776j3227a30799A7805a39822F7984P1041e8608m40937C10460
11213b66132a16830B53228k5970a72403k7263j8690A67743c37345a2303A61645
$$ plain form
11202 51196 159543 41133 -3489 90440 48180 6666 3897 150862 201834 -465242 -57665 -330065
11190 -330065 -365270 -35819 -70859 -54183 17808 260166 -59682 -38722 7602 69025 -148951
11178 -188936 223251 -240168 207869 564482 -142852 -190194 40555 -25239 -170564 -49344
11167 -215461 239538 -63337 -142667 337834 -22363 -199636 -76193 37995 -46656 19258 22929
11156 22929 -129649 -5222 -39798 -2940 78374 -118925 -8260 -69160 -168317 -116808 106475 55520
11144 55520 -177258 34134 -353913 73774 140599 -1228 -31732 -137923 1045 26292 87266
11133 87266 138450 1607 38668 120303 -274846 12729 228041 61552 305758 101514 -210352
11121 80275 -51566 343183 -192774 139294 97529 279875 -96659 82388 -164556 -66379 103211
$$ packed form
11202E1196J08347D1133c489I0440m2260F666k769J46965N0972d65242e7665k72400
11190c30065l5205c5819l5040J6676A7808K42358e9682K0960G602O1423a48951
11178a88936B23251b40168B07869L56613a42852m7342D0555b5239j45325d9344
11167b15461B39538f3337p9330C37834b2363j77273g6193C7995d6656A9258L671
11156B2929a29649e222l4576b940G8374a18925h260o0900r9157N1509A06475n0955
11144E5520a77258C4134c53913G3774O6825a228l0504j06191A045K5247O0974
11133H7266N1184A607L7061Q1635b74846A2729K15312F1552K44206A01514b10352
11121H0275e1566C43183a92774A39294m1765J82346i6659H2388a64556f6379A03211
$$ plain form
11109 72798 124700 178640 -43067 -200279 151514 78973 318681 168891 -247336 213240
11098 294365 156965 168429 71761 151538 -37784 169337 -63946 48294 31190 126873 137289
11087 137289 -122136 65784 340085 -97615 214511 275807 208690 345084 492940 279529
11077 279529 143419 162860 137776 403877 335939 358206 346188 470189 196011 517532
11067 517532 323953 319795 223263 325762 588774 378033 355874 466056 508578 912289
11057 912289 524434 563127 491602 838768 696266 621382 416082 763812 635061 736680
11047 736680 758927 336635 458880 920934 692134 837642 618250 628151 459189 936169
11037 936169 896818 453354 883576 398200 606538 657647 776942 586962 750674 567196
$$ packed form
11109G2798N1902N3940d3067j57212A51514p2541K39708j49790b47336B13240
11098B94365j37400J1464G1761P9777c7784A69337f3946D8294j7104R5683J0416
11087A37289a22136F5784K74301i7615B14511O1296o7117J36394J47856k13411
11077B79529j36110J9441k5084K66101o7938K2267j2018J24001A96011L21521
11067E17532j93579m158r6532J02499K63012k10741k2159J10182M2522M03711
11057I12289l87855L8693p1525L47166j42502p4884k05300L47730j28751J01619
11047G36680K2247C36635J22245M62054k28800J45508k19392R901j68962M76980
11037I36169l9351m43464M30222C98200K08338N1109J19295j89980J63712j83478
$$ plain form
11027 567196 699286 597644 567527 669402 664220 770118 431812 870621 595998 829502
11017 829502 388732 533389 579372 704294 527287 513855 406714 581398 275034 977743
11007 977743 708365 811548 406120 430999 297441 425170 580401 555580 537651 529313
10997 529313 653286 794794 570392 508611 878929 882016 890509 464847 700447 863904
10987 863904 763327 886096 1083654 833777 782810 1379386 1322451 1075551 1373882 1337709
10977 1337709 1617447 1848368 2559648 2762740 2650396 2699002 2744452 3122529 3217675 3095588
10967 3095588 2573287 2494215 2355556 2061917 2216418 1950397 2160133 1941545 1913719 1884913
10957 1884913 1885877 1955373 1907453 1656851 1244208 1228869 1021843 630697 763997 370351
$$ packed form
11027E67196J32090j01642l0117J01875n182J05898l38306M38809k74623K33504
11017H29502C88732J44657M5983J24922j77007j3432j07141J74684B75034P02709
11007I77743k69378J03183m05428K4879j33558J27729J55231k4821j7929q338
10997E29313J23973J41508k24402o1781L70318L087Q493m25662K35600J63457
10987H63904j00577J22769J97558k49877n0967N96576n6935k46900K98331l6173
10977A337709K79738K30921P11280K03092j12344M8606M5450L78077R5146j22087
10967C095588n22301p9072j38659k93639J54501k66021K09736k18588k7826k8806
10957A884913R64O9496m7920k50602m12643j5339k07026l91146J33300C70351
$$ plain form
10946 456152 326224 581197 591053 464668 203290 25357 172654 279132 79896 68730
10936 68730 -27081 -160835 178113 399241 168436 -186483 625 29340 406849 158504 -223081
10924 109537 349159 -60016 130614 304527 126246 -117691 85737 214583 -129071 84232
10913 114612 66104 10926 -12247 -231078 94965 -108957 118457 -220078 91769 77776 125017
10902 125017 105651 -195642 -110009 -240693 95500 177973 -176977 198929 114736 222784
10892 222784 37627 86658 -16859 296029 438413 -212062 -45749 -204268 16668 -9571 -230532
10881 -230532 70802 56294 -246419 -236430 225340 -17606 -118673 116222 -101547 -77468 96631
10869 109229 14501 -95809 17956 170316 -212931 209860 160902 271813 -250447 41488
$$ packed form
10946D56152j29928K54973R856j26385B03290B5357J47297J06478G9896j1166
10936F8730b7081j33754A78113K21128A68436a86483F25K8715L77509A58504b23081
10924A09537K39622f0016A30614J73913A26246a17691H5737J28846a29071H4232
10913A14612m8508A0926a2247k18831I4965a08957A18457b20078I1769j3993M7241
10902A25017j9366a95642Q5633j30684I5500Q2473a76977A98929q4193J08048
10892B22784C7627M9031a6859B96029J42384b12062d5749j58519A6668i571k20961
10881b30532G0802j4508b46419R989B25340a7606j01067A16222a01547K4079I6631
10869A09229A4501i5809A7956J52360b12931B09860m8958J10911b50447D1488
$$ plain form
10858 -202108 -49720 69095 -173352 52577 -17772 -145745 234080 95914 245241 -69277 270141
10846 184488 61307 -330556 31442 21853 -62406 55996 -5944 -75789 -175505 -56625 -68115 189904
10833 -134182 99395 25894 99456 136102 -109529 378087 141890 -89509 22285 -74887 -80814
10822 -80814 165770 -99375 -90646 -28598 292987 -218221 -83879 -39620 -188060 -212184 -23320
10810 32585 89256 -78590 20035 -41851 -55448 143308 -58174 34661 -24134 153727 196437
10799 196437 -11432 -84134 -223957 -184244 83474 98959 117564 1328 -41450 71030 115582
10788 115582 -128986 173313 84630 7823 -378679 470046 168522 173252 -350647 -139554
10777 -262786 173382 -79952 180197 84364 -106370 -253077 335011 193076 -181601 166427
$$ packed form
10858b02108d9720F9095a73352E2577a7772j27973B34080I5914J49327f9277B70141
10846A84488F1307c30556C1442r589f2406E5996e944o9845r9716e6625j1490A89904
10833a34182I9395B5894P3562L6646a09529C78087A41890h9509B2285g4887n927
10822h0814A65770i9375Q729b8598B92987b18221h3879c9620j48440k4124b3320
10810C2585N6671g8590B0035d1851j3597A43308e8174C4661b4134A53727M2710
10799A96437a1432p2702j39823L9713H3474J5485J8605A328d1450G1030M4552
10788A15582a28986A73313H4630G823c78679D70046A68522M730c50647a39554
10777b62786A73382g9952A80197H4364a06370j46707C35011j41935a81601A66427
$$ plain form
10766 90671 -118288 -196468 -328848 -221602 152150 -145957 284658 -127097 -137950 -201532
10756 -201532 107200 96324 -42251 -135997 171441 -296464 -89209 -108165 71743 -120975 372092
10744 -24965 -417957 -87533 -63906 -176857 60768 251511 97860 211246 -29735 -150281 57095
10732 -193747 -3222 2618 120025 -176975 -43162 -5025 206295 -210836 -57031 -218920 -480123
10721 -480123 -541159 -149181 -95606 69366 9708 -195244 -105812 -284982 -241333 -124776 -335850
10710 -335850 -131058 -108044 -142415 -122810 -107896 17130 -26259 -78301 31546 63895 -296368
10698 -61414 -597573 -111463 -109008 168051 -49195 -6631 163007 -151942 313170 189541 -12526
10686 -154696 50133 -229123 58034 -175388 290999 -38140 93653 43305 194463 -176055
$$ packed form
10766I0671a18288p8180j32380J07246A52150a45957B84658a27097j0853o3582
10756b01532A07200j0876d2251r3746A71441b96464h9209j8956G1743a20975C72092
10744b4965l92992h7533K3627j12951F0768J90743I7860J13386b9735j20546E7095
10732a93747c222B618J17407a76975d3162e025B06295b10836e7031j61889k61203
10721d80123o1036a49181N3575F9366I708a95244Q9432j79170M3649J16557k11074
10710c35850a31058K3014l4371J9605J4914A7130b6259n2042C1546L2349b96368
10698f1414n36159a11463K455A68051d9195f631A63007a51942C13170j23629a2526
10686a54696E0133b29123E8034a75388B90999c8140I3653D3305J51158a76055
$$ plain form
10675 109122 -149049 -28027 -144946 -116519 136924 -253970 -211132 169327 -52062 -168709
10665 -168709 -323629 -140718 -333221 237579 -15865 57748 23294 -226050 -173664 -55002
10654 -159136 -196660 292132 -50749 -215348 -267321 43343 -36835 -173262 -66897 189227 -233432
10642 -166840 -69344 -77400 -95332 -83944 51190 -136322 -189755 -146466 115202 -45435 -242863
10631 -242863 -174740 7705 113871 2852 -312871 -591309 357098 -69343 206038 95281 87708
10620 87708 -254082 206848 -39214 -187930 298941 -104660 13109 -69232 78122 -80303 -300086
10609 -300086 -411347 179135 -125355 11855 -296322 -17930 -254881 -98286 -24919 -270936
10599 -270936 29658 334686 -115799 52154 119389 149715 404 -125913 -7956 103116 74483
$$ packed form
10675A09122a49049b8027j16919K8427A36924b53970M2838A69327e2062j16647
10665a68709j54920a40718j92503B37579a5865E7748B3294b26050N2386e5002
10654a59136l7524B92132e0749j64599n1973D3343c6835j36427f6897A89227b33432
10642a66840f9344q056j7932J1388E1190a36322n3433M3289A15202d5435j97428
10631b42863O8123G705J06166B852c12871k78438C57098f9343B06038I5281p573
10620H7708b54082B06848c9214j48716B98941a04660A3109f9232G8122h0303k19783
10609c00086j11261A79135a25355A1855b96322a7930k36951i8286b4919k46017
10599b70936B9658L05028a15799E2154O7235L0326D04a25913g956A03116k8633
$$ plain form
10588 74483 -27622 -23334 179870 205900 54664 -316270 204804 -123093 46575 -183760 -187663
10577 -187663 -118014 -57736 -31411 -109274 -436043 77622 -227785 -117484 -120635 -4082 -34950
10566 -34950 290590 117105 -117570 -10787 212557 167455 -3310 55204 144734 157982 -8964
10554 -293424 217551 155364 128866 -306547 -9796 -38041 -2527 21608 -209934 -77234 46220
10542 -43711 -67058 -8033 180031 -40643 316034 268548 -53349 -226874 131244 176831 -281098
10530 -161962 44794 -41651 -63448 -68771 -191809 -130725 -39475 -40770 115188 -298392 -257865
10519 -257865 -119832 331208 246272 -254493 79660 -132448 165453 -35405 71159 204683
10509 204683 -283414 202088 55116 -353796 -122627 12854 110984 -226032 -175418 18736
$$ packed form
10588G4483b7622M288A79870K6030E4664c16270B04804a23093D6575a83760l903
10577a87663O9649e7736K6325p7863l26769G7622b27785J10301l151d082l0868
10566c4950B90590A17105a17570a0787B12557m5102c310E5204Q9530J3248h964
10554b93424B17551o2187k6498c06547i796k8245b527B1608b09934g7234D6220
10542d3711k3347h033A80031d0643C16034m7486e3349j73525A31244M5587b81098
10530a61962D4794d1651k1797n323j23038O1084c9475j295A15188b98392M0527
10519b57865a19832C31208q4936b54493G9660a32448A65453c5405G1159J33524
10509B04683b83414B02088E5116c53796a22627A2854R8130b26032N0614A8736
$$ plain form
10498 -58517 -155253 -39359 776 -162626 -305610 -149374 -71382 -11091 63846 342992 -145595
10486 300934 13324 -251143 -6035 -306262 524904 392592 248363 641069 -105025 174074
10475 85733 189907 93577 107090 -195358 -197007 -77067 -349399 -100417 306613 -34906 177310
10463 -46784 -64578 -170601 125826 -3779 42046 -4474 -28499 185636 79594 -244861 -61088
10451 -186909 -60115 -221786 -293098 77857 43157 -39991 -301512 248560 79659 -42948 -294403
10440 -294403 182161 -82748 -56027 -356416 -187892 289596 -31439 -53662 -14002 104756
10429 87277 -109143 -244596 -78102 -25024 11311 -372694 193640 -38524 -238734 203346
10418 -94229 -415812 214952 -376136 167107 193468 -325630 -25816 -306271 -242742 -148894
$$ packed form
10498e8517r6736c9359G76a62626j42984a49374g1382a1091F3846K79146a45595
10486C00934A3324b51143f035l00227E24904j32312j44229L92706a05025A74074
10475H5733J04174I3577J3513a95358j649g7067k72332a00417C06613c4906A77310
10463d6784j7794j06023A25826c779D2046d474k4025A85636G9594b44861f1088
10451a86909f0115j61671p1312G7857l4700c9991k61521B48560G9659d2948k51455
10440b94403A82161h2748K6721l00389J68524B89596c1439k2223a4002A04756
10429H7277a09143j35453g8102b5024A1311c72694A93640c8524k00210B03346
10418i4229l21583B14952c76136A67107K6361c25630b5816k80455O3529R3848
$$ plain form
10408 -148894 -171391 213878 -141921 -25281 176630 156053 -282529 -223508 -88932 39331 99478
10397 99478 -135332 -121241 -239262 294880 41256 30268 175751 -232258 304495 157511
10387 157511 233869 8484 420372 -53519 351128 190587 -162268 143770 -130264 147900
10376 174232 100286 447964 72237 340543 212172 63822 105650 339560 346489 453965 518907
10365 518907 317816 166813 -108202 -57420 335690 389184 406432 9680 140292 342841
10355 342841 149626 24248 27772 549351 407244 350735 147716 617566 550653 346582
10345 346582 121057 595427 165934 257662 -148536 32058 229141 314809 449253 131078
10334 -9312 325344 88687 190879 113387 118455 -184302 24091 -234737 101877 216284 425996
$$ packed form
10408a48894k2497B13878a41921b5281A76630k0577b82529N9021h8932C9331O0147
10397I9478a35332J4091j18021B94880D1256j0988J45483b32258C04495j46984
10387A57511P6358H484M11888e3519C51128j60541a62268A43770a30264A47900
10376A74232p3946L47678G2237K68306j28371F3822M1828K33910O929J07476O4942
10365E18907k01091j51003a08202N0782C35690N3494J7248I680J30612K02549
10355C42841A49626B4248L524N21579j42107n6509A47716M69850o6913k04071
10345C46582A21057M74370A65934R1728a48536C2058J97083Q5668J34444A31078
10334i312C25344H8687J02192p7492N068a84302B4091b34737A01877J14407K09712
$$ plain form
10323 425996 2584 220964 199343 -67616 684416 5462 168428 381936 256329 -134737 358278
10311 -109237 127461 18132 -118809 42639 338412 53375 -311610 -197342 -40867 49196
10300 -291190 109952 -327806 155597 78661 57452 -357141 160392 165787 -132553 284449
10289 -101996 116258 -81727 -144700 64784 1030 -135584 -105466 -76948 170206 -116034 31268
10277 -116759 -104932 -65397 -77598 -41618 -197324 64299 101919 -136648 -90032 -12401 97162
10265 -165263 -254732 -19582 72142 -79019 217254 396704 532602 413480 438051 131567
10254 537214 -119335 335828 -126875 -47065 -2364 -59208 -125162 13308 -119159 13334 -53992
10242 40337 85603 103146 75980 -216922 -277475 -184043 172799 18415 264944 81686 -63718
$$ packed form
10323D25996B584K18380k1621f7616F84416E462J62966K13508j25607a34737C58278
10311a09237A27461A8132a18809D2639K95773E3375c11610J14268d0867D9196
10300b91190A09952c27806A55597p6936k1209c57141A60392N395a32553B84449
10289a01996A16258h1727o2973F4784A030a35584L0118K8518A70206a16034C1268
10277a16759J1827L9535j2201L5980j55706F4299L7620a36648M6616a2401I7162
10265a65263q9469a9582G2142g9019B17254J79450J35898j19122K4571A31567
10254E37214a19335C35828a26875d7065b364n6844o5954A3308a19159A3334e3992
10242D0337M5266J7543k7166b16922o0553R3432A72799A8415K46529H1686f3718
$$ plain form
10230 219188 22794 134601 -48254 193693 -26771 -128330 137489 -97122 -55577 -98335 22148
10218 -200379 31583 -461966 -174409 64740 -37526 -97197 26373 155548 10924 170793 -86093
10206 85479 127082 -20143 18202 34113 -73852 -133361 142829 -118772 267947 20929 -7783
10194 -183635 -112990 30345 -209047 -158410 -34187 -263164 -142541 -246551 220692 -2692 -167667
10183 -167667 -29314 -165569 -14436 -174492 -258545 -154689 -135251 -313064 -98780 -454292
10173 -454292 -248080 -341193 -303973 -28202 -175822 -150968 40078 -30246 -110248 -147776 -25164
10161 26751 -113927 -180786 -43152 298025 347116 -91826 172797 18953 -226580 -10860 -296592
10150 -296592 262793 8595 98238 -76142 -99891 -51101 -242599 -47558 -238112 -78687 18390
$$ packed form
10230B19188B2794J11807d8254A93693b6771j01559A37489i7122M1545m2758B2148
10218b00379C1583d61966a74409F4740c7526n9671B6373J29175A0924J59869h6093
10206H5479M1603b0143A8202J5911g3852n9509A42829a18772B67947B0929g783
10194a83635P0645C0345b09047N0637c4187k28977J20623j04010B20692b692j64975
10183a67667b9314j36255a4436j60056q4053J03856J9438j77813i8780l55512
10173d54292K06212r3113L7220b8202j47620K4854D0078c0246q0002l7528b5164
10161B6751a13927o6859d3152B98025M9091i1826A72797A8953b26580a0860k85732
10150b96592B62793H595Q9643g6142k3749M8790j91498d7558j90554g8687A8390
$$ plain form
10138 41125 -32190 55377 -158537 -182129 -159982 -36513 -64667 -79756 -75256 62724 -54891 325419
10125 20147 90897 237554 -330078 38380 -184063 -274169 -73609 -90376 -242337 248182 -106088
10113 -40377 -354858 123753 185455 138303 -284247 -36673 -353172 147990 -89446 -186443 273830
10101 190079 223711 163762 -33184 -103809 -168324 -167872 64557 152477 145830 -104504 125147 -58005
10088 -232293 -99348 -132176 -17230 -283794 65815 -97518 -348847 15548 -98814 86814 14920
10076 -227171 39162 95740 -176951 33739 76863 -252998 -100705 -32182 -36934 460111 -157112
10064 -383931 51577 28491 -100398 12463 171671 119018 -202252 226963 134312 -139587
10053 -214020 213229 -128624 -305477 155854 -11206 -91475 -5744 -63872 34756 -204294 -93103
$$ packed form
10138D1125c2190E5377a58537k3592K2147c6513k8154j5089M500F2724e4891C25419
10125B0147P0750J46657c30078C8380a84063r0106g3609j6767j51961B48182a06088
10113d0377l14481A23753O1702m7152b84247c6673l16499A47990h9446r6997B73830
10101A90079L3632n9949c3184p0625o4515M52F4557Q7920o647a04504A25147e8005
10088b32293i9348l2828a7230k66564F5815i7518k51329A5548i8814H6814A4920
10076b27171C9162N6578a76951C3739M3124b52998a00705c2182m752D60111a57112
10064c83931E1577k3086a00398A2463J59208n2653b02252B26963r2651a39587
10053b14020B13229a28624j76853A55854a1206q0269e744n8128C4756b04294i3103
$$ plain form
10041 -183646 154139 70456 23653 -52662 -23295 -121026 -368222 111485 -58454 -61319 -212803
10030 -212803 111195 8175 452002 -82134 -63414 -139634 -158349 -79470 -101262 15064 -173462
10018 -199036 -265789 60571 -179052 -99678 -169080 -196692 48404 6113 -72115 -112555 -22470
10006 -287931 -11917 54679 -299475 -99321 -344539 -924 178378 -40587 -24881 -186719 -150547
9995 -150547 -101646 153704 257821 -158029 46051 -180408 -258053 -122749 -382928 -355038
9985 -355038 -91660 -153285 -44727 9505 62566 -7171 92122 -340160 250769 26948 -142698
9973 -142507 271986 -2532 148658 141500 -229866 -244920 -46929 -93244 155577 -68463 -178354
9962 -178354 104571 96271 -349604 -225021 147782 77574 229770 -158543 -153635 -265316 167360
$$ packed form
10041a83646A54139G0456B3653e2662b3295r7731k47196A11485e8454k865j51484
10030b12803A11195H175M43827h2134J8720p6220j8715P8879k1792A5064a73462
10018a99036o6753F0571a79052P9374o9402k7612D8404F113g2115m0440b2470
10006b87931a1917E4679b99475i9321k45218i24A78378d0587J5706j61838L6172
9995a50547M8901A53704J04117a58029D6051a80408p7645a22749k60179K7890
9985c55038i1660o1625d4727I505N3061g171I2122c40160B50769B6948a42698
9973a42507B71986b532A48658p158b29866j5054d6929m6315A55577f8463j09891
9962a78354A04571q300c49604J24583A47782p0208J52196a58543M908j11681A67360
$$ plain form
9950 55711 -96129 22482 130305 -75265 77888 -258362 101118 100224 -152753 59634 -56818
9938 -94250 -251201 -145851 61005 -135172 -16641 -179485 -84801 -53955 -124808 58305 -134203
9926 -216489 -341809 128455 -223730 -56721 -382173 -46488 -49192 -193894 -210631 -235712 -166253
9915 -166253 -203871 -167921 -70374 -162837 10456 -109153 -89390 82158 -130176 -126523 -255085
9904 -255085 -112822 84709 -276269 -73079 -133911 -3965 149240 -416345 8222 -211327 -55610
9892 -235290 -72982 -327737 33688 151975 87432 138741 -43073 34929 73787 -31768 -150710
9881 -150710 47516 153002 -73930 124672 -158241 -116130 156255 12554 -131159 -126141 -85599
9870 -85599 -494112 -36409 219751 -86581 -111442 157209 -200702 -155677 42889 -208800 111754
$$ packed form
9950E5711i6129B2482J07823g5265G7888b58362A01118q94a52753E9634e6818
9938i4250j56951J05350F1005a35172a6641j62844h4801L0846p0853E8305a34203
9926b16489j25320A28455b23730e6721l25452d6488k704j44702j6737k5081O9459
9915a66253l7618L5950g0374r2463A0456a09153J9763H2158a30176L653j28562
9904b55085a12822H4709b76269g3079o0832c965A49240d16345H222b11327e5610
9892b35290g2982k54755C3688J18287o4543N1309d3073C4929L8858c1768j18942
9881a50710D7516J05486g3930A24672a58241M2111A56255A2554a31159N018M0542
9870h5599m08513c6409B19751h6581k4861A57209b00702M5025D2889b08800A11754
$$ plain form
9858 -251685 30272 -98390 -247521 -111061 196199 -214397 -246277 -58685 212303 194256 -76209
9846 -209077 582 182665 4679 93234 -133602 -214864 -300140 -99589 250310 29457 -363950
9834 -251750 180821 -226013 -173500 4737 293685 -57526 292984 242052 -128862 141037 -171299
9822 -82923 -127271 -32189 240573 -218631 -218409 -193943 212905 -177802 -217367 -34355 269373
9810 -221175 -17283 327272 -309550 81632 237858 -89254 -119806 280838 -134276 -32783 45299
9798 -382134 3591 -98223 -89744 -262509 -316808 23017 417587 71600 51905 143152 110890 -20619
9785 15256 -385265 21382 -218098 -135315 -363352 -297146 -439421 174488 -192029 -76582 -292950
9774 -292950 -303854 -111595 106515 -417657 -41704 172607 283954 -211038 -183017 178992
$$ packed form
9858b51685C0272i8390j49131a11061A96199b14397l1880e8685B12303j8047g6209
9846b09077E82J82083D679Q8555a33602q1262q5276i9589B50310B9457c63950
9834b51750A80821b26013N2513D737K88948e7526B92984n0932a28862A41037a71299
9822h2923m4348c2189B40573b18631K22K4466B12905a77802l9565c4355B69373
9810b21175a7283C27272c09550H1632J56226h9254l0552B80838a34276c2783D5299
9798c82134C591i8223Q479j72765n4299B3017L94570G1600j9695R1247l2262b0619
9785A5256c85265B1382b18098Q2783k28037O6206j42275A74488a92029g6582k16368
9774b92950j0904a11595A06515d17657d1704A72607J11347b11038K8021A78992
$$ plain form
9763 -28630 -281257 -233481 15190 -261687 -274106 -77411 184973 219779 -27972 17815 -281303
9751 -249824 -118359 -73500 -101176 -142870 -40626 326045 -6292 -28801 74441 118609 -75416
9739 -125027 -297179 -251917 91312 -84677 -124337 54207 -106774 -9046 -16122 104239 -245667
9727 -133692 -72256 -53409 173580 -165366 -182290 273565 -16781 -163490 -251618 -286190 -44026
9715 225025 -153576 -51426 83082 40713 -26841 301876 -126853 -411811 165733 -165506
9704 102248 254260 16444 -304434 -139569 -341539 -98380 -248499 -87057 -121084 93012 -150517
9692 -122490 -94594 63775 53096 241709 -432103 -179463 -98057 23473 -21653 -306358 170158
9680 -590631 -176744 49322 -84 -188700 -345579 -229343 -66180 -50121 -117245 75987 34291
$$ packed form
9763b8630k52627M7776A5190b61687j2419g7411A84973L4806b7972A7815b81303
9751b49824a18359M4859k7676m1694d0626C26045f292k2509G4441M4168g5416
9739a25027j72152M5262I1312h4677l9660E4207a06774i046p076A04239b45667
9727a33692O1436J8847A73580a65366j6924B73565a6781j46709q8128l4572d4026
9715B25025a53576e1426H3082D0713b6841C01876a26853k84958A65733a65506
9704A02248J52012A6444c04434a39569k01970i8380j50119h7057l4027I3012a50517
9692a22490K7896F3775j0679J88613d32103a79463Q1406B3473b1653k84705A70158
9680e90631a76744D9322h4j88616j56879J16236f6180J6059o7124G5987C4291
$$ plain form
9668 -359235 6936 -400477 -142385 -118973 -20451 -88434 -269086 -208611 -161856 -169743 -426772
9657 -426772 -299256 -68638 -3370 -29083 -182927 -183324 -70317 -173766 -268626 -205955 -117167 -75702
9645 -75702 -449723 113426 -187454 -76036 -194174 90524 298402 -57460 63700 157385 145122
9634 145122 -171248 13102 -119756 100913 -65165 -124988 22637 192927 17537 205110 11934
9622 17105 127145 33418 -211097 -141029 81568 -432209 225176 -312408 -1593 -182425 16290
9610 -198206 -270839 -228837 141971 -132554 56845 -95418 -8693 -250777 -35592 4170 58362
9599 58362 184632 -160909 -26403 13557 -192920 9372 -316858 71910 -11541 -13034 34177
9587 18219 -160075 242337 -190505 -189851 -66808 256360 -175772 -69629 -64364 -56072 -283096
$$ packed form
9668c59235F936d00477a42385K3412b0451o7983j80652O0475M6755p887k57029
9657d26772J27516f8638c370k5713j53844l97g0317j03449r4860O2671Q8788M1465
9645g5702l74021A13426a87454g6036j18138I0524K07878e7460F3700R3685j2263
9634A45122a71248A3102a19756A00913f5165n9823B2637J70290A7537J87573A1934
9622A7105J10040C3418b11097P0068H1568d32209B25176c12408a593j80832A6290
9610a98206p2633M2002A41971a32554E6845i5418h693k42084c5592D170N4192
9599E8362J26270a60909b6403A3557a92920I372c16858G1910a1541j493C4177
9587A8219a60075B42337a90505O54f6808B56360a75772f9629N265Q292k27024
$$ plain form
9576 -283096 -90291 -145873 -48438 21305 -71648 -258476 -187638 -99151 -383396 60844 -35965
9564 -278280 229504 8192 5278 -40679 -87629 -359843 84620 -180106 -26531 -109319 -89234
9553 -89234 -48132 23123 -155190 -179257 -206409 -166232 24290 -24492 -214285 -249297 -58628
9541 198932 123960 42578 102477 182146 -33043 51291 -261189 72676 -4799 -305053 44016
9529 -114028 85188 -75297 -232648 -34285 4117 30658 55799 20325 -118521 -322592 -112895
9517 -151533 67366 56756 -121076 -131819 -54380 -1657 138506 165123 208147 284534 -176670
9505 -118402 -222529 -184012 77310 -64224 -77018 -130992 123098 2026 -11725 -160374 -25009
9493 -138601 76530 -284519 -100616 27738 -113376 -88388 -435640 -160543 -164874 53802 -246978
$$ packed form
9576b83096i0291n5582d8438B1305g1648j86828P0838Q8487k84245F0844c5965
9564b78280B29504H192k914d0679m6950k72214H4620a80106b6531q2788K0085
9553h9234M1102B3123a55190k4067k7152M0177B4290b4492j89793l5012e8628
9541A98932p4972D2578N9899P9669c3043E1291b61189G2676d799l00254D4016
9529a14028H5188g5297j57351c4285D117K6541K5141B0325a18521k04071a12895
9517a51533F7366j0610a21076j0743e4380a657A38506K6617M3024P6387a76670
9505a18402j04127L8517G7310f4224j2794n3974A23098B026a1725j48649b5009
9493a38601G6530b84519a00616B7738a13376K4988l47252a60543m331E3802b46978
$$ plain form
9481 -4609 -158127 267730 101929 -111427 -317109 62149 4367 -178228 106517 35753 -274816
9469 -144254 -30344 153773 139610 -90846 142899 -378191 -97044 208748 -342564 -137480
9458 66023 427283 -90845 107097 -485396 43972 92013 -156069 182764 109684 -92721 78324
9446 -291052 -26164 -174717 -25200 -39609 -151665 -91293 -234349 145434 -107146 108102
9435 139443 -16752 -172951 -488913 -546442 128707 77268 -114934 13473 -129051 205758
9424 -13714 -396459 -38942 -173803 -154187 70086 188725 -239557 -248932 -118664 -164867 44230
9412 -120037 163692 255181 -35997 194671 -209381 -176966 -203608 -226492 -32513 -110118 12905
9400 53299 -6575 269384 8379 -92590 -255414 -96775 -388856 60872 70133 41513 -484982 -468726
$$ packed form
9481d609j53518B67730A01929a11427k05682F2149D367a78228A06517C5753b74816
9469a44254c0344A53773j4163i0846A42899c78191i7044B08748c42564a37480
9458F6023L61260i0845A07097d85396D3972M8041a56069A82764p3080i2721G8324
9446b91052b6164j48553b5200j4409j12056O0372j43056A45434a07146A08102
9435A39443a6752j56199l15962n7529A28707n1439a14934A3473a29051B05758
9424a3714l82745c8942j34861J9616G0086J18639b39557r375a18664m6203D4230
9412a20037A63692R1489c5997A94671b09381L2415k6642k2884c2513p7605A2905
9400E3299f575B69384H379i2590j62824i6775k92081F0872R261k8620d84982J6256
$$ plain form
9388 -468726 72696 -42589 33504 -437902 188577 100828 -90021 -175337 41519 -169858 254629
9376 -268220 34115 -206130 132341 -84119 -56041 18448 28469 -213801 -74935 -197471 -51714
9364 79433 231592 -159264 -104790 -30442 -56213 29132 29633 -256097 22631 168729 130598
9353 130598 173686 -145489 -303343 85186 -9264 127090 -82685 197603 -183610 -149882 51107
9341 -55186 -31237 -204375 269730 -145616 -136458 -291552 -126816 290561 -257175 216043
9330 -50555 -183298 295029 111028 -1720 -262529 163456 372783 -63772 -204693 -74325 -234599
9319 -234599 160653 -120566 -208296 205162 -191719 324046 185566 -168317 49120 -238667
9308 -508377 28424 18011 23418 172229 186315 -92449 31484 -257051 -6567 15978 -227364
$$ packed form
9388d68726G2696d2589C3504d37902A88577q7749i0021q5316D1519a69858B54629
9376b68220C4115b06130A32341h4119K8078A8448J0021b13801g4935j22536e1714
9364G9433J52159a59264N4474c0442k5771B9132N01b56097B2631J46098l8131
9353A30598M3088a45489j57854H5186i264A27090h2685A97603a83610L3728E1107
9341e5186K3949j73138B69730a45616R158j55094a26816B90561b57175B16043
9330e0555j32743B95029A11028a720k60809A63456K09327f3772j40921g4325j60274
9319b34599A60653a20566q7730B05162a91719C24046j38480a68317D9120b38667
9308e08377B8424j0413N407J48811J4086i2449C1484b57051f567A5978b27364
$$ plain form
9296 -109128 -285259 67251 -191156 52847 -394860 136399 -192647 -98484 -68813 105564
9285 -190628 68499 -59995 296894 -274571 -36792 -105014 58710 -81013 117670 -173349 -197457
9274 -197457 -341561 10513 13609 -84363 -278943 -278091 129378 -32383 -345732 -126916 -235392
9263 -235392 38118 -52101 -304158 255560 -232632 -303625 386256 69846 -340950 -39445 165247
9251 117395 72140 -336374 269713 34300 -32820 182269 6939 -150470 -58810 -409462 99975
9239 -238687 -121915 -127088 -167667 162261 -193708 4094 -95459 -288358 -332709 -503005 48193
9227 -33388 -53455 302153 74263 -374467 -738 41615 -84180 60267 159879 76649 82800 94947
9215 94947 136601 207812 28793 -213652 -176779 61096 167520 17143 129463 -118400 55793
$$ packed form
9296a09128j76131F7251a91156E2847c94860A36399a92647R4163K9671A05564
9285a90628F8499e9995B96894b74571c6792o8222E8710h1013A17670a73349k4108
9274a97457j44104A0513L096h4363j94580Q52A29378c2383l13349a26916j08476
9263b35392C8118e2101k52057B55560b32632p0993C86256F9846c40950c9445A65247
9251A17395m5255c36374B69713C4300c2820A82269F939a50470e8810l50652I9975
9239b38687J16772n173m0579A62261a93708D094i5459j92899m4351j70296D8193
9227c3388k0067C02153G4263c74467g38D1615h4180F0267R9612G6649O151J2147
9215I4947M1654P1211B8793b13652L6873F1096J06424A7143J12320a18400E5793
$$ plain form
9203 -229239 -75241 246700 71954 -83673 -69371 206198 -464455 275791 -389069 -84760 -321475
9192 -321475 92721 55333 -138258 -125183 -191884 9946 141269 -255776 31283 -192445 57263
9180 -332004 -365439 48853 -147645 -144941 61252 -209416 -156427 -249029 -2043 -209282 -108890
9169 -108890 -57026 -304987 -121108 -314983 -3189 -68547 134116 -175 -1347 -109279 -567452
9158 -567452 -240263 118437 168629 -90813 -297162 6069 147000 -130872 -190356 151032 -500391
9146 134387 92062 -78162 -112545 -85653 164791 -23897 120316 68321 35213 -65448 -207049
9135 -207049 -51299 214711 40754 -42698 143335 -373249 -123059 137583 -270427 197214
9124 -165833 106169 -72786 -66269 116600 -258429 152093 371323 -90268 -323046 234288
$$ packed form
9203b29239g5241B46700G1954h3673J4302B06198d64455B75791c89069h4760k36715
9192c21475I2721l7388a38258J3075o6701I946J31323b55776C1283a92445E7263
9180c32004l3435D8853a47645K704F1252b09416N2989r2602b043k07239J00392
9169a08890N1864k47961a21108j93875c189o5358A34116a75j172j07932m58173
9158e67452b40263A18437N0192i0813k06349F069J40931a30872n9484A51032e00391
9146A34387m2325g8162l4383K6892A64791b3897A20316n1995l3108f5448j41601
9135b07049e1299B14711D0754d2698A43335c73249a23059A37583b70427A97214
9124a65833A06169g2786O517A16600b58429A52093K19230i0268k32778B34288
$$ plain form
9113 -223030 97618 -188924 -272067 -76510 300337 -172346 -172018 -42151 -245400 -92002 -262814
9102 -262814 113307 -143508 -48380 -241005 64079 -358866 -366870 8014 -20696 -18076 59312
9090 56953 -123318 -79972 66057 -35880 89955 61969 12749 251258 -18628 182311 -288808
9078 16602 259692 -153053 -229940 -85752 288029 282339 121346 -186757 229969 155501 -38943
9066 -56228 -297099 -221441 184544 -26545 23468 -62877 -116649 -181559 -112007 212231 -180050
9054 -409983 -3452 113987 -174009 280598 -87653 -180606 -215484 28922 -258027 -368121 -79970
9042 -307591 22022 82866 404648 122597 -293012 -337380 -96378 -64909 -215569 -22839 -94286
9031 -94286 14737 -35013 -36356 -375063 -356380 -16599 28612 -206577 143534 -93369 -88846 86436
$$ packed form
9113b23030I7618a88924q3143g6510C00337a72346L28d2151k03249i2002j70812
9102b62814A13307a43508d8380j92625F4079c58866q004H014b0696K620E9312
9090E6953a23318M3346F6057c5880H9955k7986A2749K38509a8628A82311b88808
9078A6602K43090a53053p6887h5752B88029n690A21346a86757B29969p4468c8943
9066e6228k40871P5658A84544b6545B3468f2877n3772o4910O9552B12231a80050
9054d09983c452A13987a74009B80598h7653r2953l4878B8922b58027j10094g9970
9042c07591B2022O0844L21782A22597b93012m4368i6378L1469j50660b2839p1447
9031i4286A4737c5013j343l38707J8683a6599B8612b06577A43534i3369M523H6436
$$ plain form
9018 2484 133039 -179582 -29852 -357074 -345496 -130173 192899 68931 -220561 -61778 -94797
9007 -94797 -178134 -168338 225057 -34773 -96887 -146495 -89704 -299414 275282 -146319 15422
8995 -406072 -193332 -18637 -113218 -206298 234714 120410 -109004 58571 -147562 -181030 2752
8983 -194600 -19451 -93584 6543 -159669 -30255 212015 -310158 121323 -78430 132266 26167
8971 75280 142824 -92011 26928 -115026 21396 -464841 -111965 19109 92278 -152037 -9829
8959 -37893 133841 255399 -162084 -383780 -138929 -79674 105606 56177 -134183 -111794
8949 -111794 -99421 -271058 -155827 -83066 -183728 -83084 -154456 -71466 373516 -129384 -148299
8938 -148299 -93302 95483 119762 387807 -132466 -153960 -1448 -306166 -79127 14842 -32026
$$ packed form
9018B484J30555a79582b9852l27222J1578a30173A92899F8931b20561f1778l3019
9007i4797q3337R796B25057c4773o2114m9608N6791k09710B75282a46319A5422
8995d06072a93332a8637r4581r3080B34714j14304a09004E8571a47562l3468B752
8983a94600a9451p4133F543a59669c0255B12015c10158A21323g8430A32266B6167
8971G5280O7544i2011B6928a15026B1396d64841a11965A9109P3169a52037i829
8959c7893A33841J21558a62084k21696a38929N9255A05606m9429a34183K2389
8949a11794J2373j71637J15231P2761j00662h3084p1372g1466C73516a29384j8915
8938a48299N4997I5483K4279K68045a32466k1494a448l04718g9127A4842c2026
$$ plain form
8926 185478 256729 112089 2063894 7210259 16780354 7308586 2495399 1030232 499450
8916 379146 180762 160654 264267 405113 -57179 73438 58116 375687 109545 296904
8906 296904 -3163 2793 19574 -159603 -112830 -133551 -40137 25558 -389124 87577 74041 -108208
8893 -105764 -164585 96207 -57396 220978 -40039 20321 -110781 -113356 -265369 -118931 -37030
8881 -58326 10158 -49039 -60828 -176154 191258 -28673 -173471 143945 16559 8177 55565
8870 55565 -191237 52725 -18260 344791 -247246 -353868 116510 -104813 102473 130109
8860 130109 -133173 -26310 99413 52077 -94627 -314590 97858 -288310 -188690 87313 178589
$$ packed form
8926A85478P1251A12089J951805N146365R570095G308586B495399A030232D99450
8916C79146A80762k0108J03613J40846e7179G3438j5322L17571A09545J87359
8906B96904c163B793J6781a59603M6773k0721d0137B5558c89124H7577j3536a08208
8893a05764n8821I6207e7396B20978d0039B0321a10781k575j52013a18931c7030
8881e8326A0158d9039j1789j15326A91258b8673j44798A43945A6559H177M7388
8870E5565a91237E2725a8260C44791b47246j06622A16510a04813A02473K7636
8860A30109a33173b6310I9413m7336i4627k19963I7858b88310R9620H7313R1276
$$ [...]
##END NTUPLES=NMR SPECTRUM
##END=
