##TITLE=AC1565_ROEFFECT0018_8270532_XF1lbCM5OA
##JCAMPDX= 6.0         $$ Bruker NMR JCAMP-DX V2.0
##DATA TYPE= NMR SPECTRUM
##DATA CLASS= NTUPLES
##ORIGIN= BRUKER
##OWNER= Administrator
$$ 1.72 TOPSPIN		Version 2.1
$$ 2013-10-12 17:35:08.402 -0700  Administrator@X
$$ Compression mode = diff/dup
##.OBSERVE FREQUENCY= 400.02188249412
##.OBSERVE NUCLEUS= ^1H
##.ACQUISITION MODE= SIMULTANEOUS (DQD)
##.ACQUISITION SCHEME= undefined
##.AVERAGES= 64
##.DIGITISER RES= 22
##SPECTROMETER/DATA SYSTEM= spect
##.PULSE SEQUENCE= noesygpps1d.comp
##.SOLVENT NAME= COFFEE_meoh
##.SHIFT REFERENCE= INTERNAL, COFFEE_meoh, 1, 14.96053
##AUDIT TRAIL= $$ (NUMBER, WHEN, WHO, WHERE, PROCESS, VERSION, WHAT)
$$ ##TITLE= Audit trail, TOPSPIN		Version 2.1
$$ ##JCAMPDX= 5.01
$$ ##ORIGIN= Bruker BioSpin GmbH
$$ ##OWNER= Administrator
$$ $$ E:\/data/COFFEE/nmr/AC1565_ROEFFECT0018_8270532_XF1lbCM5OA/12/pdata/1/auditp.txt
$$ ##AUDIT TRAIL=  $$ (NUMBER, WHEN, WHO, WHERE, PROCESS, VERSION, WHAT)
(   1,<2013-10-12 17:35:03.390 -0700>,<Administrator>,<X>,<go>,<TOPSPIN 2.1>,
      <created by zg
	started at 2013-10-12 17:23:33.379 -0700,
	POWCHK enabled, PULCHK disabled,
       configuration hash MD5:
       C8 4E 4E 5D D3 5C D8 9E 9F 52 82 E0 59 8A DE 15
       data hash MD5: 64K
       CC 5E A1 89 EA C2 94 7B 36 7C C0 17 13 69 41 AA>)
(   2,<2013-10-12 17:35:06.381 -0700>,<Administrator>,<X>,<proc1d>,<TOPSPIN 2.1>,
      <Start of raw data processing
       efp LB = 0.3 FT_mod = 6 PKNL = 1 PHC0 = 0 PHC1 = 0 SI = 128K 
       data hash MD5: 128K
       BD 13 56 91 1D FD F6 5A C4 E6 DE A5 B9 AB 91 36>)
(   3,<2013-10-12 17:35:07.392 -0700>,<Administrator>,<X>,<proc1d>,<TOPSPIN 2.1>,
      <pk PHC0 = -79.43115 PHC1 = 0 
       data hash MD5: 128K
       77 3F B2 EB 76 D3 46 07 1A A5 82 75 A7 AB 2D 52>)
(   4,<2013-10-12 17:35:07.813 -0700>,<Administrator>,<X>,<proc1d>,<TOPSPIN 2.1>,
      <abs ABSG = 1 
       data hash MD5: 128K
       37 40 BE 4E A0 0D 27 E9 A6 ED 12 53 06 FD 8A B3>)
(   5,<2013-10-12 17:35:07.914 -0700>,<Administrator>,<X>,<proc1d>,<TOPSPIN 2.1>,
      <abs ABSG = 2 
       data hash MD5: 128K
       30 21 B8 15 80 EB B6 22 9C F0 69 E7 C1 10 F1 F0>)
(   6,<2013-10-12 17:35:07.998 -0700>,<Administrator>,<X>,<proc1d>,<TOPSPIN 2.1>,
      <abs ABSG = 3 
       data hash MD5: 128K
       D7 E4 FF 66 A5 DC B6 BF E3 F3 9D DB 9B F7 24 0F>)
(   7,<2013-10-12 17:35:08.116 -0700>,<Administrator>,<X>,<proc1d>,<TOPSPIN 2.1>,
      <abs ABSG = 4 
       data hash MD5: 128K
       14 2D 83 27 79 7F 5B 47 70 B1 AE D9 FA BA 9A A9>)
(   8,<2013-10-12 17:35:08.200 -0700>,<Administrator>,<X>,<proc1d>,<TOPSPIN 2.1>,
      <abs ABSG = 5 
       data hash MD5: 128K
       BA F7 E8 28 76 2C 21 FD A5 2B 84 F2 0B 72 A8 BA>)
$$ ##END=
$$ 
$$ $$ hash MD5
$$ $$ CE 46 D7 24 02 3B B8 88 53 BE 27 79 2D C4 EB 2C
##$RELAX= 
##$RELAX= 
##$RELAX= 
##$RELAX= 
##$RELAX= 
##$RELAX= 
##$RELAX= 
##$RELAX= 
$$ Bruker specific parameters
$$ --------------------------
##$DU= <E:\>
##$EXPNO= 12
$$ [...]
##$TP07= 0
##$TPNAME0= <>
##$TPNAME1= <>
##$TPNAME2= <>
##$TPNAME3= <>
##$TPNAME4= <>
##$TPNAME5= <>
##$TPNAME6= <>
##$TPNAME7= <>
##$TPOAL= (0..7)
0.5 0.5 0.5 0.5 0.5 0.5 0.5 0.5
##$TPOFFS= (0..7)
0 0 0 0 0 0 0 0
##$TUNHIN= 0
##$TUNHOUT= 0
##$TUNXOUT= 0
##$USERA1= <user>
##$USERA2= <user>
##$USERA3= <user>
##$USERA4= <user>
##$USERA5= <user>
##$V9= 5
##$VALIST= <valist>
##$VCLIST= <CCCCCCCCCCCCCCC>
##$VD= 0
##$VDLIST= <DDDDDDDDDDDDDDD>
##$VPLIST= <PPPPPPPPPPPPPPP>
##$VTLIST= <TTTTTTTTTTTTTTT>
##$WBST= 1024
##$WBSW= 4
##$XGAIN= (0..3)
0 0 0 0
##$XL= 0
##$YL= 0
##$YMAX_a= 6317016
##$YMIN_a= -13662919
##$ZGOPTNS= <>
##$ZL1= 120
##$ZL2= 120
##$ZL3= 120
##$ZL4= 120
##$ABSF1= 14.96053
##$ABSF2= -5.597651
##$ABSG= 5
##$ABSL= 3
##$ALPHA= 0
##$AQORDER= 0
##$ASSFAC= 0
##$ASSFACI= 0
##$ASSFACX= 0
##$ASSWID= 0
##$AUNMP= <proc_prof1d_extract.lims>
##$AXLEFT= 0
##$AXNAME= <>
##$AXNUC= <1H>
##$AXRIGHT= 0
##$AXTYPE= 0
##$AXUNIT= <>
##$AZFE= 0.1
##$AZFW= 0.1
##$BCFW= 0
##$BC_mod= 0
##$BYTORDP= 0
##$COROFFS= 0
##$CY= 15
##$DATMOD= 1
##$DC= 0
##$DFILT= <>
##$DTYPP= 0
##$F1P= 0
##$F2P= 0
##$FCOR= 0.5
##$FTSIZE= 131072
##$FT_mod= 6
##$GAMMA= 0
##$GB= 0
##$INTBC= 1
##$INTSCL= 1
##$ISEN= 128
##$LB= 0.3
##$LEV0= 0
##$LPBIN= 0
##$MAXI= 10000
##$MC2= 0
##$MEAN= 0
##$ME_mod= 0
##$MI= 0
##$NCOEF= 0
##$NC_proc= -2
##$NLEV= 6
##$NOISF1= 0
##$NOISF2= 0
##$NSP= 0
##$NTH_PI= 0
##$NZP= 0
##$OFFSET= 14.96053
##$PC= 1
##$PHC0= -79.43115
##$PHC1= 0
##$PH_mod= 1
##$PKNL= yes
##$PPARMOD= 0
##$PPDIAG= 0
##$PPIPTYP= 0
##$PPMPNUM= 2147483647
##$PPRESOL= 1
##$PSCAL= 4
##$PSIGN= 0
##$PYNMP= <proc.py>
##$REVERSE= no
##$SF= 400.020009824959
##$SI= 131072
##$SIGF1= 0
##$SIGF2= 0
##$SINO= 400
##$SIOLD= 131072
##$SPECTYP= <>
##$SREGLST= <1H.CDCl3>
##$SSB= 0
##$STSI= 131072
##$STSR= 0
##$SW_p= 8223.68421052631
##$SYMM= 0
##$S_DEV= 0
##$TDeff= 65536
##$TDoff= 0
##$TI= <>
##$TILT= no
##$TM1= 0
##$TM2= 0
##$TOPLEV= 0
##$USERP1= <user>
##$USERP2= <user>
##$USERP3= <user>
##$USERP4= <user>
##$USERP5= <user>
##$WDW= 1
##$XDIM= 131072
##$YMAX_p= 378506493
##$YMIN_p= -16061
##$CURPLOT= <Network HP LaserJet P1505>
##$CURPRIN= <$Network HP LaserJet P1505>
##$DFORMAT= <normdp>
##$LAYOUT= <+/1D_H.xwp>
##$LFORMAT= <normlp>
##$PFORMAT= <normpl>
##$SURQMSG= 1
$$ End of Bruker specific parameters
$$ ---------------------------------
##NTUPLES= NMR SPECTRUM
##VAR_NAME=  FREQUENCY,     SPECTRUM/REAL,   SPECTRUM/IMAG
##SYMBOL=    X,             R,               I
##VAR_TYPE=  INDEPENDENT,   DEPENDENT,       DEPENDENT
##VAR_FORM=  AFFN,          ASDF,            ASDF
##VAR_DIM=   131072,        131072,          131072
##UNITS=     HZ,            ARBITRARY UNITS, ARBITRARY UNITS
##FACTOR=    0.0627417313425164, 1,          1
##FIRST=     8223.62146879497, 2828,         -64674
##LAST=      0,             3602,            -64382
##MIN=       0,             -16061,          0
##MAX=       8223.62146879497, 378506493,    0
$$ Real data points
##PAGE= N=1
##DATA TABLE= (X++(R..R)), XYDATA
$$ [...]
67688 76609 78235 79385 80064 80533 80965 81250 81212 80937 80731 80759 80891 80948 80973 81095 81292 81454 81634 82000 82537 83039
67668 83039 83496 84235 85421 86613 87153 86941 86504 86275 86170 86074 86374 87602 89668 91786 93149 93471 92922
67651 92922 91862 90675 89619 88672 87686 86748 86245 86476 87309 88299 89019 89246 88975 88353 87546 86644 85797 85394
67633 85394 85799 86874 87997 88773 89496 90693 92382 94056 95255 95852 95889 95499 95087 95190 95914 96681 96822
67616 96822 96335 95861 95919 96421 97057 97834 98910 99983 100314 99571 98342 97487 97215 97159 97143 97270 97255 96376 94480
67597 94480 92509 91503 91354 91013 89778 87921 86165 85018 84611 84726 84887 84747 84423 84177 83853 83064 81966
67580 81966 81267 81268 81321 80606 79172 77820 77114 76834 76427 75750 75270 75542 76514 77459 77714 77376 77063 77144 77583 78387
67560 78387 79592 80709 80836 79757 78440 77987 78448 79101 79556 79932 80142 79779 78823 77939 77830 78618 79948
67543 79948 81403 82669 83539 83889 83505 82076 79613 76876 74962 74426 75026 76234 77526 78194 77572 75819
67527 75819 74050 73308 73661 74531 75492 76294 76508 75818 74608 73750 73678 74061 74362 74320 73817 72807 71632 71047
67509 71047 71475 72392 72797 72291 71450 71108 71483 72120 72495 72499 72331 72124 71833 71459 71197 71221 71451 71701 72008 72570
67489 72570 73274 73574 73059 72012 71154 70851 70828 70717 70570 70673 71000 71177 70992 70718 70765 71141 71395 71164 70664
67470 70664 70533 71166 72289 73300 73960 74514 75067 75119 74087 72257 70818 70728 71709 72654 72968 73175 74094 75654
67452 75654 76871 76994 76401 76131 76663 77434 77657 77278 76894 76894 77068 77098 77062 77243 77624 77854 77686 77260 76934 76966
67432 76966 77387 78053 78712 79047 78848 78280 77932 78332 79283 79845 79226 77583 75766 74407 73507 72772 71901 70554
67414 70554 68581 66468 65121 64912 65290 65602 65927 66698 67812 68627 68715 68246 67711 67588 68135 69131 69950 70209
67396 70209 70201 70287 70178 69362 68096 67272 67256 67495 67428 67150 66943 66734 66386 66047 65854 65628 65237 64903 64796 64607
67376 64607 63945 62948 62137 61823 62005 62621 63556 64479 65048 65281 65529 66146 67252 68638 69701 69754 68700 67273
67358 67273 66378 66363 67070 68287 69754 71045 71879 72454 73051 73467 73292 72669 72265 72412 72720 72684 72344 72196 72681
67339 72681 73854 75336 76471 76796 76454 76028 75961 76244 76662 77079 77479 77948 78721 80091 82165 84697 87077
67322 87077 88548 88718 88063 87649 88058 88798 89021 88529 87614 86270 84269 81905 79947 78745 78041 77769 78235
67305 78235 79160 79372 78138 76345 75629 76565 78382 80262 82165 84246 86154 87390 88053 88752 89769 90613
67289 90613 90618 89889 89371 89854 91032 91762 91191 89413 87130 85077 83835 83754 84656 85738 86051 85103 83081 80730
67271 80730 79047 78702 79500 80593 81380 81957 82593 83187 83597 84119 85152 86548 87756 88529 89100 89679 90164
67254 90164 90348 90083 89224 87805 86281 85242 84760 84325 83526 82550 81860 81598 81496 81228 80773 80545 81165 82888
67236 82888 85172 87006 87721 87376 86424 85306 84416 84024 83951 83600 82676 81706 81505 82146 82849 82940 82631 82635 83250
67217 83250 84034 84336 83863 82719 81206 79827 79297 80140 82123 84328 85964 86992 87803 88490 88736 88338 87564
67200 87564 86898 86619 86749 87255 88172 89511 91036 92197 92458 91833 91006 90707 91066 91718 92374 92952 93232 92891
67182 92891 92015 91205 90940 91039 91013 90694 90306 90133 90352 91013 91906 92550 92648 92449 92396 92520 92526 92437 92749 93866 95635
67161 95635 97537 99061 99821 99630 98768 97957 97753 97937 97748 96780 95591 95315 96609 98917 100872 101523 101144
67144 101144 100732 100854 101311 101862 102680 103828 104747 104875 104618 105040 106502 108133 108914 108829 108583 108500 108260 107644
67126 107644 106993 106771 107047 107679 108719 110246 111948 113303 114224 115113 116094 116575 116010 114877 114326 114833 115746
67109 115746 116384 117004 118211 119816 120963 121329 121572 122441 123892 125263 125932 125581 124216 122279 120538 119563
67093 119563 119348 119537 119803 119927 119845 119852 120492 121938 123729 125356 126824 128302 129539 130175 130370 130596 130885 130942
67075 130942 130985 131785 133622 135779 137419 138562 139787 141338 142974 144555 146281 148282 150270 151744 152496
67060 152496 152868 153481 154628 155997 157097 157877 158707 159792 160924 161898 162849 164035 165512 167196 169038 171020
67044 171020 173134 175421 177818 179949 181351 182041 182568 183422 184717 186509 188962 191920 194703 196661 197727
67029 197727 198212 198394 198617 199395 201016 203258 205786 208578 211631 214577 217075 219278 221467 223481 225059
67014 225059 226568 228799 232126 236273 240750 245015 248412 250680 252511 254979 258366 262125 265926 270023
67000 270023 274462 278686 282193 284968 287077 288534 289940 292462 296602 301451 305773 309409 313028 316856
66986 316856 320430 323514 326642 330570 335527 341072 346463 351196 355375 359504 363816 367976 371651 375165
66972 375165 379350 384874 391827 399726 407691 414944 421423 427740 434305 440881 447262 453903 461356 469418
66958 469418 477515 485605 494023 502598 510844 519079 528409 539190 550282 560340 569341 578293 587914
66945 587914 598273 609414 621570 634689 648344 662277 676641 691561 706807 722104 737435
66934 737435 752810 767992 782837 797788 813699 831017 849381 868120 887010 906384 926616
66923 926616 947665 969116 990574 1012061 1034136 1057518 1082469 1108621 1135556 1163365 1192319
66912 1192319 1222164 1252311 1282825 1314639 1348425 1383695 1419490 1455644 1492781 1531255 1570786
66901 1570786 1611171 1652669 1695426 1739012 1782964 1827435 1872949 1919726 1967627 2016641 2066983
66890 2066983 2118645 2171122 2223743 2276122 2328174 2379843 2431043 2481899 2532842 2584207 2635680
66879 2635680 2686345 2735434 2782891 2829024 2873772 2916612 2957120 2995180 3030538 3062537 3090573
66868 3090573 3114578 3134815 3151416 3164398 3173915 3180043 3182390 3180364 3173920 3163671 3150098 3132990
66856 3132990 3111891 3086813 3058169 3026226 2991077 2953133 2913209 2871865 2828949 2783994 2736878
66845 2736878 2687877 2637240 2585087 2531723 2477713 2423574 2369591 2316000 2263079 2210887 2159147
66834 2159147 2107600 2056358 2005676 1955595 1906143 1857833 1811525 1767582 1725310 1683422 1640988
66823 1640988 1597972 1555151 1513677 1474470 1437622 1402291 1367363 1332373 1297772 1264338 1232498
66812 1232498 1202170 1172996 1144475 1116092 1087720 1059966 1033790 1009523 986393 963274 939823
66801 939823 916657 894512 873531 853444 834079 815489 797748 780829 764628 748870 733092
66790 733092 716947 700643 684976 670795 658322 646941 635654 623862 611709 599685 588001
66779 588001 576500 565067 553862 543087 532728 522572 512333 501815 491195 481079 471922 463434
66767 463434 455041 446903 439752 433484 426809 418924 410838 404124 398816 393596 387855 382329 377579 372949
66753 372949 367570 361558 355614 350074 344958 340425 336535 332895 329086 325147 321236 317175 312857 308690
66739 308690 305016 301390 297167 292594 288520 285096 281546 277372 273040 269205 265880 262731 259661 256692
66725 256692 253683 250585 247675 245141 242698 240056 237536 235693 234364 232590 229716 226261 223477 222121
66711 222121 221752 221150 219364 216378 212896 209614 206822 204603 203006 201762 200090 197249 193398 189619 186958
66696 186958 185592 184987 184578 184095 183401 182390 181043 179439 177678 175924 174435 173323 172280 170811 168836
66681 168836 166820 165224 164064 163162 162477 161875 160860 159041 156798 155010 154007 153169 151718 149564 147225
66666 147225 145207 143743 142871 142455 142201 141899 141592 141403 141312 141140 140571 139179 136820 134185 132494 132232 132524
66649 132524 132245 131470 131188 131777 132466 132359 131323 129713 127903 126386 125675 125611 125261 124034 122550 121796 121702
66632 121702 121236 119848 118116 116826 116010 115178 114100 112931 111806 110671 109498 108434 107705 107503 107901 108803
66616 108803 109949 110990 111554 111317 110201 108567 107035 105975 105290 104750 104422 104585 105341 106446 107483 108072
66600 108072 108004 107348 106442 105567 104683 103612 102461 101595 101155 100864 100450 99998 99633 99116 98147 97020 96491 96816
66582 96816 97202 96547 94607 92271 90707 90424 91085 91970 92545 92726 92805 93096 93582 93870 93510 92452 91196 90437
66564 90437 90489 91036 91549 91876 92280 92878 93297 93061 92152 90945 89673 88279 86851 85853 85664 86029 86244 85886
66546 85886 85158 84475 83944 83462 83175 83496 84538 85748 86357 86103 85387 84794 84683 85123 85869 86384 86280 85877
66528 85877 85952 86705 87344 87036 85950 84911 84317 83999 83992 84699 86062 87187 87163 85993 84454 83332 82939 83072
66510 83072 83190 82906 82481 82516 83040 83392 83278 83335 84116 85034 85117 84495 84203 84525 84475 83206 81210 79674 79180
66491 79180 79415 79711 79486 78571 77574 77548 78781 80197 80469 79543 78497 78057 77919 77536 76949 76511 76245 75822
66473 75822 75008 74001 73459 74155 76208 78566 79703 79113 77814 77115 77260 77587 77658 77634 77734 77942 78301 78936
66455 78936 79607 79714 79054 78219 77911 78167 78612 79174 80052 81117 81913 82321 82687 83110 83078 82207 80949 80117 79918
66436 79918 79993 80315 81381 83301 85227 86090 85650 84458 83044 81625 80508 80190 80796 81749 82277 82144 81668
66419 81668 81163 80607 79807 78720 77544 76616 76253 76609 77549 78665 79470 79716 79606 79665 80285 81361 82442 83207
66401 83207 83636 83771 83498 82717 81606 80545 79837 79592 79769 80209 80721 81290 82181 83619 85360 86730 87166
66384 87166 86656 85683 84851 84504 84555 84606 84402 84225 84659 85894 87378 88309 88415 88163 88188 88664 89209 89345 88994
66365 88994 88563 88569 89182 90116 90881 91063 90462 89153 87511 86022 84883 83830 82547 81262 80709 81311 82570
66348 82570 83509 83703 83571 83588 83661 83582 83754 84772 86288 86977 85985 83991 82411 81914 82131 82501 82733 82569 81817
66329 81817 80801 80312 80843 82145 83603 84699 85055 84526 83430 82337 81438 80512 79650 79457 80207 81322 82151
66312 82151 82858 83997 85513 86723 87114 86642 85469 83982 82946 82979 83823 84629 84942 84933 84735 84212 83474 82973
66294 82973 82869 82864 82927 83599 85229 87300 88897 89531 89260 88399 87436 86924 87023 87382 87690 88044 88514 88784 88675
66275 88675 88621 89114 89940 90509 90759 91096 91539 91587 90992 90085 89212 88336 87404 86660 86273 85973 85383 84529 83797 83522
66255 83522 83770 84377 85013 85365 85411 85434 85646 85901 85982 86027 86435 87301 88139 88329 87858 87430 87758 88858 90173 91324
66235 91324 92393 93407 93941 93569 92494 91391 90721 90520 90767 91583 92980 94690 96259 97191 97138 96254 95275
66218 95275 94843 94775 94411 93666 93217 93519 94114 94205 93532 92389 91125 89962 89083 88532 88202 88111 88497 89377 90269
66199 90269 90693 90824 91367 92900 95464 98497 100916 101618 100367 98115 96105 94827 94093 93761 93821 93995 93956
66182 93956 93963 94600 95788 96663 96660 96203 96028 96326 96866 97532 98290 98923 99229 99325 99429 99501 99408 99290 99454 99984 100721
66161 100721 101479 102033 102077 101578 101084 101253 102056 102774 102868 102551 102368 102483 102580 102376 102079 102257 103228 104573 105422
66142 105422 105324 104687 104205 104055 103950 103792 103849 104307 105055 106009 107246 108669 109898 110672 111085 111221 110912 110089
66124 110089 109086 108236 107463 106660 106225 106681 107796 108628 108600 108107 107882 108173 108773 109561 110629 111983 113414
66107 113414 114626 115370 115571 115476 115498 115670 115469 114531 113438 113367 114853 117249 119486 121021 121888 122257 122354 122541
66089 122541 123017 123453 123319 122569 121730 121275 121228 121383 121591 121723 121705 121803 122491 123753 124778 124744 123837 123098 123255
66070 123255 124010 124538 124371 123680 122871 122124 121315 120302 119249 118526 118215 117900 117178 116277 115854 116195 116957 117736
66052 117736 118504 119337 120060 120476 120690 120918 121119 121139 121081 121249 121795 122696 123956 125466 126753 127291 127175 127096 127465
66033 127465 127920 127930 127587 127459 127818 128427 129063 129918 131319 133262 135349 137130 138475 139632 140889 142092
66017 142092 142618 142060 140948 140505 141529 143686 145996 147782 148936 149583 149950 150533 151840 153722 155283 155819
66001 155819 155685 156019 157697 160769 164752 169131 173505 177579 181187 184299 186987 189465 192058 194904 197699
65986 197699 199940 201476 202661 203905 205194 206057 205871 204276 201495 198258 195173 192219 189059 185732 182630
65971 182630 179878 177196 174512 172153 170256 168514 166784 165427 164597 163773 162593 161711 161993 163063 163520
65956 163520 162660 161238 160350 160242 160548 161150 162336 164368 167192 170483 173834 177079 180483 184368 188583
65941 188583 192682 196612 200759 205206 209461 213109 216289 219211 221614 223113 223813 224258 224960 226218 228094
65926 228094 230244 232012 233043 233748 234934 237077 240067 243457 246836 250173 253912 258455 263533 268525
65912 268525 273409 278762 284606 289986 294154 297482 300585 303210 304833 305774 306789 307837 308327 308396 308864
65897 308864 309876 310554 310180 308829 306671 303627 300077 296947 294489 291648 287250 281314 274755 268355 262549
65882 262549 257648 253580 249711 245531 241259 237365 233805 230240 226728 223670 221278 219547 218513 218074
65868 218074 217833 217595 217797 218863 220342 221307 221459 221194 220616 219231 216741 213591 210492 207816 205640 203945
65852 203945 202564 201251 200016 199163 198833 198765 198648 198422 198110 197620 196907 196187 195765 195719 195865 196039 196370 197241
65834 197241 198880 200924 202618 203612 204395 205721 207834 210571 213988 218347 223602 229462 236001 243643 252282
65819 252282 260935 268603 275149 280999 286266 290527 293339 294660 294780 294003 292385 289823 286484 283047 280215
65804 280215 277942 275575 272858 270425 269092 268996 269696 270760 271871 272652 272807 272424 271835 271319 271086 271363 272224
65787 272224 273556 275522 278788 283873 290393 297454 304826 313249 323525 335761 349738 365554 383442
65774 383442 403049 423311 443144 462043 479855 496077 509590 519157 524010 523890 518743 508801 494955
65761 494955 478624 461033 442869 424795 407947 393559 382270 374093 368864 366438 366669 369671 376065
65748 376065 386532 401116 419246 440397 464361 490897 519508 549581 580339 610560 638745
65737 638745 663727 684881 701692 713466 719606 719833 713976 701924 684008 661172 634619 605494
65725 605494 574930 543984 513250 482871 453132 424766 398473 374559 353250 334847 319113
65714 319113 304995 291577 279092 268363 259467 251649 244467 238260 233313 229217 225309 221287 217177
65701 217177 213189 209909 208119 207921 208354 208301 207639 207131 207383 208308 209481 210562 211348 211842 212460 213874 216426
65684 216426 219795 223358 226837 230492 234758 239809 245452 251435 257811 265061 273887 284933 298600 314938
65670 314938 333652 354408 377333 403126 432417 464994 499871 536086 573147 610502 646870
65659 646870 680562 710479 736463 758593 776553 790063 799600 806115 810068 811329 810264 808356 807251
65646 807251 807466 808550 810245 812839 816224 819216 820119 817709 811487 801307 787031 768414 745169 717301
65632 717301 685464 650782 614227 576526 538733 502376 468523 437044 407289 379379 354263
65621 354263 332577 313970 297650 283138 270267 258813 248455 238964 230306 222667 216405 211741
65609 211741 208355 205495 202604 199708 197097 194852 192926 191523 191121 191910 193302 194188 193904 192988 192692 193569
65593 193569 194846 195516 195719 196386 197639 198383 197939 197380 198620 202484 208217 214713 221550 228825 236657 245194
65577 245194 254872 266387 280493 297803 318535 342346 368589 396794 426823 458583 491808 526056
65565 526056 560558 593905 624141 649495 669048 682662 690391 692076 687406 676257 659025 636700
65553 636700 610539 581583 550497 517854 484460 451356 419607 390100 363390 339656 318845
65542 318845 300882 285608 272563 261110 251002 242605 236408 232383 229995 228679 228037 227683 227263 226745
65528 226745 226420 226439 226421 225715 223946 221197 217700 213559 208870 203994 199439 195419 191688 188041 184854 182817
65512 182817 182037 181684 180745 178983 176948 175239 174061 173412 173285 173588 174105 174659 175098 175156 174643 173887 173595 174100
65494 174100 175072 176207 177803 180225 183182 186167 189486 194108 200340 207320 214125 220827 227980 235438
65480 235438 242276 247711 251617 254172 255525 255854 255358 253992 251446 247488 242184 235795 228744 221702 215340
65465 215340 209828 204807 199931 195246 190937 187036 183604 180890 179018 177698 176594 175846 175883 176713 177694
65450 177694 178083 177650 176785 176180 176361 177289 178364 179050 179556 180708 183042 186177 189164 191337 192801 194209
65434 194209 196222 199090 202651 206636 210868 215084 218768 221451 223141 224150 224434 223455 220906 217336 213770
65419 213770 210873 208699 207065 205850 204929 204122 203331 202605 202105 202070 202695 203784 204664 204771 204329 204040 204068 203796
65401 203796 202822 201795 201814 203281 205791 208979 212871 217367 221957 226234 230301 234311 237866 240189 240797
65386 240797 239778 237602 234923 232338 229952 227255 223833 220195 217418 215815 214361 211811 208200 204920
65372 204920 203374 203768 205211 206789 208388 210496 213305 216278 218764 220857 223269 226410 230069 234178
65358 234178 239367 246317 254859 264203 273942 284331 295581 307337 318964 330009 340257 349604 358002
65345 358002 365268 370862 374175 375187 374560 372903 370142 365830 359841 352523 344330 335583 326507 317235
65331 317235 307741 297952 287940 277966 268395 259646 252109 246016 241423 238323 236534 235425 234097 232163
65317 232163 230098 228466 227010 224989 222303 219698 217732 216033 213842 210895 207388 203471 199217 195029
65303 195029 191570 189209 187787 187024 186940 187780 189664 192388 195510 198652 201794 205249 209217 213413 217278
65288 217278 220443 222773 224021 223861 222401 220392 218649 217370 216180 214692 212850 210870 209120 208067
65274 208067 208067 209090 210701 212303 213453 214104 214665 215682 217311 219237 221205 223380 225902 228428 230618
65259 230618 232955 236414 241234 246587 251649 256397 261011 265058 267824 269089 268927 266995 262714 256184
65245 256184 248385 240352 232533 224954 217583 210398 203566 197700 193557 191277 190209 189689 189683 190419 191707
65230 191707 192945 193685 193926 193938 194037 194535 195667 197416 199366 200765 200936 199831 198080 196297 194489 192465
65214 192465 190619 189761 190122 191125 192353 194145 196786 199614 201517 202190 202409 203126 204595 206253 207129 206547
65198 206547 204773 202862 201547 200474 198795 196314 193548 190965 188780 187374 187179 187978 188956 189729 190792
65183 190792 192644 194984 197173 199135 201299 203817 206266 208094 209058 209275 209050 208648 208103 207274 206142 204847
65167 204847 203393 201619 199634 197967 196993 196490 196167 196395 197870 200558 203481 205721 207225 208454 209632
65152 209632 210710 211756 212943 214210 215395 216824 219405 223826 229803 236409 243137 250344 258554 267659
65138 267659 277108 286717 296855 307738 318896 329631 339800 349873 360275 370976 381748 392510
65126 392510 403247 413736 423634 432896 441925 451126 460292 468578 475146 479666 482000 481606 477732 470358
65112 470358 460525 449361 436970 422721 406530 389387 372476 356219 340429 325118 310776 297993
65100 297993 287082 277994 270278 263152 255934 248594 241753 236054 231583 227925 224602 221455 218736 216904
65086 216904 216145 216065 216013 215829 216037 217060 218445 219176 218753 217657 216687 216068 215389 214229 212600 210795 209058
65069 209058 207527 206420 206004 206257 206723 206952 207097 207750 209082 210491 211399 212138 213603 216071 218793 220800
65053 220800 221751 221912 221698 221382 220955 220063 218361 216139 214261 213222 212523 211291 209288 207023 205080 203757
65037 203757 203209 203448 204135 204678 204677 204113 203147 201918 200562 199148 197609 195896 194176 192659 191258 189633
65021 189633 187633 185529 183829 182952 183008 183727 184682 185663 186697 187673 188307 188814 190208 193372 198016 203122
65005 203122 208296 214049 220671 227552 233920 239731 245480 251419 257260 262380 266111 268153 268893 269111 269256
64990 269256 269349 269650 270844 273258 276327 279307 282320 286335 292182 299712 307703 314450 318801 320812 321201
64975 321201 320176 317312 312618 306939 300881 294088 286256 278184 270951 264474 257889 251166 245353 241126
64961 241126 238025 235300 232746 230457 228495 227120 226733 227167 227576 227413 227046 226964 226791 225652 223266 220186
64945 220186 217092 214307 211997 210407 209679 209578 209555 209159 208488 208147 208656 209903 211361 212767 214293 216068
64929 216068 217908 219605 221110 222257 222652 222155 221237 220549 220205 219680 218325 215897 212759 209748 207678 206785
64913 206785 206689 206929 207376 208130 209315 211155 213989 217946 222692 227626 232261 236479 240765 246240 253969
64898 253969 263882 274720 285361 295911 307101 318944 330604 341462 351780 362169 372881 383808
64886 383808 394881 406313 418507 431654 445155 457514 467144 473383 476527 476916 474360 468602 459967
64873 459967 449299 437413 424875 412223 400156 389458 380708 374036 369064 365083 361329 357186 352399
64860 352399 347244 342315 337787 332920 326582 318306 308632 298434 288254 278400 269218 260956 253583 247034
64846 247034 241460 236938 233119 229549 226251 223580 221533 219726 218157 217432 217857 218696 218900 218325 217666 217255
64830 217255 216664 215642 214754 214594 214887 215018 215185 216285 218687 221771 224840 227880 231162 234614 238011 241478
64814 241478 245372 249870 254973 260741 267236 274366 282129 290889 301075 312587 324649 336150 346077
64801 346077 353909 359838 364352 367283 367563 364322 358033 350087 341473 332438 323325 314926 307831 301999
64787 301999 297258 293726 291496 290387 290304 291388 293423 295524 296914 297748 298742 300205 301923 303831 306253
64772 306253 309438 313298 317740 323012 329590 337863 347930 359542 372204 385413 398738 411577 423119
64759 423119 432908 441435 449841 458928 468521 477813 486173 493712 501263 509802 519689 530442 541277 551720
64745 551720 561498 569947 575873 578018 575569 568365 556958 542462 526012 508298 489836 471529 454513
64732 454513 439364 425890 413871 403614 395512 389363 384479 380282 376525 373127 370179 368015 366985
64719 366985 367105 368198 370397 374300 380521 389156 399681 411294 423353 435564 447704 459211 469168
64706 469168 476767 481606 483396 481634 475874 466286 453690 439024 422943 405941 388618 371699 355878
64693 355878 341666 329301 318770 309949 302696 296795 291848 287379 283086 279040 275745 273956 274157 276060
64679 276060 278825 281931 285652 290491 296415 303015 310198 318291 327505 337704 348665 360141 371559
64666 371559 382082 391053 398114 402908 405110 404852 402588 398421 392090 383874 374929 366316 358196 350429
64652 350429 343440 337797 333362 329683 327036 326181 327100 328806 330637 332987 336495 341170 346740 353315 361226
64637 361226 370633 381748 395048 410754 428389 447364 467727 489657 512330 533956 553005 568843
64625 568843 580967 588235 589406 584318 574091 560163 543354 523967 502597 480514 459078 438895
64613 438895 419856 402042 386227 373204 362833 354195 346588 339998 334556 329971 325741 321631 317705
64600 317705 314021 310528 307209 304155 301557 299703 298866 299065 299980 301238 302822 305133 308685 313692 319818
64585 319818 326367 332934 340015 348820 360338 374663 391315 409966 430571 452918 476364 500111
64573 500111 523472 545772 566158 583734 597914 608547 615615 618753 617163 610225 598322 582852
64561 582852 565202 545808 524446 501331 477573 454617 433582 415144 399539 386367 374723
64550 374723 363962 354187 345821 339007 333791 330570 329738 330904 333091 335826 339469 344171 349100 353173
64536 353173 356120 358183 359020 357690 353892 348548 342842 337115 331052 324602 318107 311706 305230 298854
64522 298854 293357 289342 286479 283932 281490 279845 279644 280616 281903 283059 284337 286067 288133 290194 292096
64507 292096 293816 295225 296286 297474 299696 303653 309437 316817 325706 336170 348066 360902 374130
64494 374130 387457 400747 413582 425037 434041 439971 442891 443268 441737 439214 436897 435680 435556 435886
64480 435886 436343 437269 438970 440956 442154 441736 439462 435340 429312 421465 412439 403476 395948 390681 387621
64465 387621 386198 386060 387317 390003 393536 397050 400195 403259 406387 408984 410117 409355 406950 403309 398597
64450 398597 392999 387158 382101 378631 376799 376011 375671 375740 376711 379105 383054 388408 395060 403022 412185
64435 412185 422315 433479 446336 461710 479888 500627 523971 550845 582667 620609 665477
64424 665477 718181 780015 852545 937448 1036353 1150311 1279152 1421446 1575022 1737151
64414 1737151 1904139 2071280 2233806 2388035 2531475 2661991 2777100 2873986 2949933 3002701
64404 3002701 3030743 3033286 3010408 2963092 2893096 2802421 2692681 2565169 2421696 2265325 2100354
64393 2100354 1931813 1764982 1604702 1454456 1316023 1190205 1077655 978701 892696 818227
64383 818227 754060 699464 653669 615473 583587 556969 534749 516250 501282 489948 481868 475851
64371 475851 470545 465171 459483 453342 446553 438846 429807 419187 407518 396042 385663 376247 367272
64358 367272 358834 351500 345484 340545 336574 333724 332000 331231 331517 333200 336396 340937 346746 353710 361094
64343 361094 367667 372598 375769 377090 376181 373063 368509 363118 356553 348333 339073 330223 322728 316603
64329 316603 311745 308398 306672 306195 306548 307531 308826 309894 310647 311842 314346 318152 322482 326743 331075
64314 331075 336005 341885 348569 355335 361072 364815 366223 365540 363096 358975 353129 345699 337186 328272
64300 328272 319323 310119 300348 290442 281542 274368 268502 263173 258429 254904 252587 250593 248319 246232
64286 246232 245258 245875 248064 251585 255806 259677 262495 264631 267164 270928 276198 283037 291439 301164 311819
64271 311819 323043 334265 344412 352414 358090 362190 365472 368050 369660 370143 369569 368267 366911 366155
64257 366155 365994 365764 365000 363961 362994 361672 358974 354238 347638 339781 331166 322070 312716 303418 294584
64242 294584 286584 279565 273474 268302 264166 261070 258709 256673 254838 253445 252848 253194 254237 255403 256153
64227 256153 256464 256862 257858 259366 260776 261585 261899 262313 263340 264930 266581 267935 269085 270136 270688 270145
64211 270145 268496 266304 263818 260692 256833 253068 250405 248987 248253 247905 248070 248608 248956 248892 248974 249902 251712
64194 251712 253889 256137 258838 262877 269136 278024 289326 302452 316810 331945 347478 363159 378892
64181 378892 394403 408877 421169 430425 436259 438289 435971 429224 419025 407013 394475 381872
64169 381872 369279 356954 345277 334239 323325 312126 301034 291063 282920 276465 271163 266741
64157 266741 263099 259904 256827 254178 252744 252860 253989 255455 257245 259900 263895 269345 276043 283507
64143 283507 291124 298411 304990 310355 314088 316495 318517 320596 322018 321849 320150 317632 314449 310205
64129 310205 305149 300444 296871 294030 291347 289298 288914 290299 292363 294128 295829 298604 303392 310219
64115 310219 318295 326676 334958 343421 352445 361988 371839 382154 393160 404235 413826 420706 425086
64102 425086 428185 430958 433636 436324 439493 443735 449388 456516 464892 473783 482043 488752 493696 497027
64088 497027 498627 498112 495337 490587 484225 476441 467401 457369 446526 434892 422648 410395 398818
64075 398818 388144 378188 368933 360724 353756 347674 342080 337304 334268 333417 334142 335458 336938 338679
64061 338679 340573 342212 343526 345003 347023 349333 351489 353554 356017 359186 363005 367425 372595 378635
64047 378635 385399 392577 399962 407630 415915 425060 434774 444301 453055 460975 468006 473548 476886 478084
64033 478084 477942 477002 475046 471713 467182 461962 456389 450704 445425 441276 438701 437634 437704 438564 440031
64018 440031 441965 443957 445196 444851 442672 439017 434245 428333 421220 413266 405167 397569 390886 385250
64004 385250 380341 375479 370217 364860 360125 356310 352994 349579 346015 342945 341129 340684 340846 340732 340333
63989 340333 340540 342071 344675 347638 350777 354500 359097 364333 369671 374556 378560 381725 384785 388619
63975 388619 393366 398389 403188 407943 412988 418195 423203 428039 433148 438932 445529 452947 461111 469825
63961 469825 478998 488970 500339 513335 527574 542648 558792 576780 597251 620493 646994 677849
63949 677849 714293 757022 806345 862958 928095 1002794 1087482 1182571 1289070 1407984 1539162
63938 1539162 1681178 1832365 1991508 2157329 2327643 2499302 2668823 2832881 2988357
63929 2988357 3132194 3261334 3372816 3463995 3532774 3577641 3597497 3591574 3559641 3502386 3421630
63918 3421630 3320100 3200811 3066527 2919856 2763819 2602024 2438062 2274847 2114746
63909 2114746 1960111 1813293 1676151 1549878 1435262 1332762 1242232 1162931 1093963 1034452
63899 1034452 983356 939559 902408 871703 846797 826058 807690 790975 776254 763770 752949
63888 752949 742851 732931 723240 714193 706283 699792 694588 690393 687333 686017 686945 690132 695551 703648
63874 703648 714899 728993 745107 763246 784752 811018 842032 876808 914976 957149 1003634
63863 1003634 1053652 1106241 1161180 1218336 1276659 1334835 1392762 1451350 1510535 1568280 1621977
63852 1621977 1670292 1713188 1750636 1782013 1806613 1824136 1834525 1837689 1833555 1822227 1803919 1778753
63840 1778753 1746707 1707915 1663109 1613587 1560520 1504388 1445417 1384428 1322717 1261031 1199261
63829 1199261 1137397 1076264 1016921 959883 905455 854350 807284 764172 724426 687944 655090
63818 655090 625647 598525 572763 548412 526184 506588 489566 474597 460900 447874 435593
63807 435593 424661 415411 407404 399836 392235 384709 377722 371676 366433 361199 355228 348674 342386 336790
63793 336790 331476 326118 321161 317136 313725 310177 306440 303226 301016 299606 298671 298158 297897 297333 296066
63778 296066 294350 292702 291137 289174 286573 283750 281390 279796 278722 277706 276455 275007 273638 272631
63764 272631 272013 271475 270658 269582 268712 268491 268862 269369 269616 269429 268641 267080 264908 262676 260823 259341 258209
63747 258209 257920 259054 261308 263419 264388 264572 265262 267269 270184 273075 275617 278283 281502 284971 287995
63732 287995 290393 292744 295676 299169 302754 306271 310132 314801 320239 325951 331445 336563 341502 346625
63718 346625 352137 357815 363066 367400 370802 373460 375151 375180 373156 369665 365906 362670 359896 357251 354739
63703 354739 352522 350437 348138 345695 343721 342752 342686 342898 342805 342311 341911 342400 344319 347533 351412 355346
63687 355346 358879 361469 362655 362691 362649 363489 365176 367008 368611 370257 372255 374473 376513 378125 379352
63672 379352 380456 381809 383705 386253 389392 392898 396257 398778 400151 400820 401509 402380 402898 402420 400636
63657 400636 397525 393277 388231 382559 376036 368560 360910 354406 349683 346277 343571 341525 340182 339110
63643 339110 338013 337476 338375 340726 343720 346823 350248 354356 359143 364405 369938 375509 381039 386794 392931
63628 392931 398873 403745 407540 411257 415704 420778 426151 431960 438314 444762 451016 457850 466501 477295
63614 477295 489509 502541 516634 532433 550459 571042 594206 619405 645828 673077 701135
63603 701135 729606 757573 784307 809411 831913 849944 862059 868658 871494 872017 870746 867981 864288
63590 864288 860044 855025 848715 840745 830903 819000 804872 788360 769297 747774 724477 700481
63578 700481 676672 653638 632000 612340 594705 578692 564343 552494 543895 538340 535068 533700
63566 533700 534222 536212 538788 541443 544477 548407 553273 558660 564108 569359 574533 580317 587740 597430
63552 597430 609228 622762 638330 656907 679402 706317 738184 775765 819277 867477 917918
63541 917918 968108 1016026 1059434 1095342 1120886 1134830 1138024 1132595 1121100 1106215 1090394 1075304
63529 1075304 1061706 1049848 1039458 1029229 1017056 1001415 982222 959937 934354 904984 872291
63518 872291 837769 802849 768456 735482 704689 675919 648301 621674 597109 575514 556438
63507 556438 538873 522686 508453 496231 485309 475051 465276 455910 446910 438600 431398 425084 418926
63494 418926 412714 407081 402503 398538 394510 390623 387835 386752 387051 388015 389219 390606 392206 394106 396579
63479 396579 399979 404349 409295 414421 419788 425710 432055 438078 443118 447151 450399 452587 453017 451394
63465 451394 448220 444332 440333 436603 433553 431579 430751 430642 430542 430013 429304 429087 429584 430140 429901 428807
63449 428807 427569 426793 426522 426645 427342 428994 431960 436545 442904 450924 460566 472451 487712 507142
63435 507142 530847 558930 592045 630837 674964 722833 771884 818855 860249 893307 916740
63424 916740 930472 935061 931835 923275 912491 902064 893710 888960 889595 897002 911306 931265 954780
63411 954780 979560 1003768 1026462 1047282 1065535 1079776 1088631 1092049 1091492 1088758 1084683 1079013 1071349
63398 1071349 1061929 1051319 1039483 1025458 1008085 986901 962198 934448 903982 871292 837381
63387 837381 803597 771032 740062 710462 682033 655140 630570 608877 589977 573419 558801
63376 558801 545929 534870 526095 520270 517545 517174 518222 520551 524689 530760 538096 546182 555611 567690
63362 567690 583150 601599 622252 644887 669939 697841 728603 761972 797567 834617 871902
63351 871902 908454 944141 978966 1011802 1040525 1063640 1081105 1093238 1099707 1100442 1096948 1091565
63339 1091565 1085548 1078788 1071302 1063751 1056061 1046480 1032753 1013853 990237 962954 933031 901331
63327 901331 868539 835386 803098 773252 746960 724636 706777 694381 688049 687114 690072 695321
63315 695321 700861 703814 701260 691706 675336 653168 626665 597938 569291 542205 517172 494588
63303 494588 475115 459006 445640 434069 423718 414382 405993 398622 392378 387054 382174 377544 373450
63290 373450 370109 367266 364532 361843 359318 356911 354493 352091 349833 347751 345807 344021 342457 341199
63276 341199 340357 339894 339490 338921 338662 339595 341844 344272 345626 345952 346478 348162 350787 353439 355474 356885
63260 356885 358091 359623 361942 365278 369531 374357 379447 384774 390440 396199 401373 405581 409457 414223
63246 414223 420405 427333 434088 440560 447264 454449 461796 468948 476049 483844 493361 505235 518965 533030
63232 533030 546129 558311 570660 584058 598593 614049 630375 647515 665218 683213 701419
63221 701419 719858 738536 757477 776676 795993 815300 834687 854256 873582 891634 907315
63210 907315 919919 929107 934687 936560 934646 928828 919224 906502 891584 874905 856384 836354 816144
63197 816144 797342 780665 765943 753094 742724 735666 732221 732067 734846 740736 750311 763805 780657
63184 780657 800024 821697 846185 873807 904055 936007 969010 1002688 1036534 1069908 1102363
63173 1102363 1133755 1164135 1193692 1222552 1250369 1276255 1299291 1318876 1334341 1344673 1349080
63162 1349080 1347527 1340185 1326560 1305812 1277824 1243349 1203242 1158348 1110245 1061149 1012658 965118
63150 965118 918585 873768 831580 792318 755931 722683 692964 666663 643315 622734 604984
63139 604984 589852 576745 565019 554086 543509 533523 525199 519502 516209 514246 512923 512241 512078
63126 512078 511865 511268 510613 510402 510851 512093 514274 517166 520121 522754 525371 528496 532299 536608 541032
63111 541032 544849 547315 548469 549247 550422 551835 553120 554697 557302 560772 564036 566330 567862 569218
63097 569218 570677 572296 574180 576386 578858 581684 585151 589369 593979 598413 602276 605332 607317 608020
63083 608020 607514 606124 604146 601698 598868 595935 593364 591571 590748 590997 592474 595227 598954 603222 608044
63068 608044 613981 621486 630351 639923 649663 659389 669341 680333 693489 709345 727327 746491 766675
63055 766675 788460 812219 837887 865732 896619 931056 968356 1007143 1046513 1086429 1127214
63044 1127214 1169060 1211977 1255881 1300578 1345711 1390878 1435897 1481049 1526881 1573573 1620569
63033 1620569 1667050 1712614 1757054 1799451 1837975 1870811 1896952 1915905 1926989 1929318 1922321 1906009
63021 1906009 1880897 1847981 1808730 1764849 1717963 1669535 1620927 1573429 1528355 1487198 1451488
63010 1451488 1422314 1400132 1385159 1377738 1378197 1386537 1402467 1425580 1455270 1490688 1531033 1575800
62998 1575800 1624521 1676370 1730253 1785256 1840926 1897262 1954515 2012741 2071326 2129155 2185374
62987 2185374 2239755 2292053 2341388 2386521 2426363 2459666 2484488 2498649 2500766 2490411 2467314
62976 2467314 2431047 2381642 2320138 2248379 2168618 2083290 1994644 1904342 1813672 1724163 1637587
62965 1637587 1555307 1478088 1406543 1341136 1281529 1226676 1176040 1130149 1089331 1052456 1017703
62954 1017703 984367 953094 924384 897736 872418 848356 825779 804524 784206 764802 746608
62943 746608 729694 713793 698710 684472 671080 658359 646190 634717 624230 614946 606963 600242
62931 600242 594527 589383 584522 580078 576343 573299 570615 568216 566535 565884 565738 565001 563069 560321 557538
62916 557538 555144 553147 551494 550186 549137 548270 547677 547494 547628 547802 547773 547333 546221 544332 542061 540123
62900 540123 538950 538454 538428 538892 539898 541251 542722 544316 546031 547382 547597 546416 544446 542527 540910
62885 540910 539288 537555 536208 535865 536584 537858 539236 540664 542154 543360 543746 543155 541957 540550 538897
62870 538897 536707 533951 530955 528006 525103 522165 519239 516311 513100 509372 505467 502202 500138 499093
62856 499093 498539 498260 498394 498914 499418 499519 499305 499251 499726 500616 501425 501686 501315 500516 499487 498348 497410 497159
62838 497159 497633 498040 497461 496001 494742 494353 494231 493395 491862 490567 490108 490222 490632 491772 494222 497696
62822 497696 501071 503460 505034 506755 509403 512912 516548 519653 522151 524345 526411 528343 530338 532886
62808 532886 536328 540497 544961 549394 553584 557344 560746 564354 568887 574632 581410 589014 597369 606271
62794 606271 615426 624876 635062 646205 657956 670022 683006 698228 716726 738692 763863 792155
62782 792155 823845 859469 899737 945302 996278 1052041 1111702 1174776 1241143 1310323 1380999
62771 1380999 1451388 1519887 1585142 1645650 1699735 1746065 1783959 1812869 1831739 1839233 1834730 1818866
62759 1818866 1792964 1758079 1714753 1663569 1605762 1543278 1478296 1412530 1346804 1281334 1216561
62748 1216561 1153700 1094355 1039629 989698 944128 902396 864152 829313 798061 770551 746484
62737 746484 725116 705791 688380 673061 659827 648423 638731 630957 625277 621385 618527 616030 613745
62724 613745 611992 611149 611462 613166 616529 621594 628027 635405 643614 652784 663020 674480 687688 703336
62710 703336 721651 742271 764946 790178 818992 852200 890039 932362 979097 1030702 1088303
62699 1088303 1153101 1225414 1304469 1389335 1479793 1576015 1677535 1782876 1890048 1997086
62689 1997086 2102140 2203324 2298407 2384460 2458045 2516169 2557037 2579676 2583195 2567072 2532111
62678 2532111 2480383 2413971 2334374 2243360 2143801 2039128 1932301 1825650 1721256 1620752
62668 1620752 1524893 1433864 1348031 1268008 1194055 1125913 1063329 1006366 955068 909110 867944
62657 867944 831074 798087 768630 742455 719314 698729 679988 662458 645780 629811 614616
62646 614616 600524 587851 576372 565393 554597 544705 536935 531807 528666 526350 524167 522236 521075
62633 521075 520961 521513 521834 521141 519391 517259 515454 514051 512520 510346 507506 504312 500882 496975 492485
62618 492485 488007 484624 482949 482490 482211 481673 481423 482243 484280 487100 490337 494019 498272 503023 508124
62603 508124 513584 519624 526609 535023 545387 558021 572885 589660 608036 628019 650059 674808
62591 674808 702528 732729 764570 797550 831447 865493 898001 927202 952235 973066 989632
62580 989632 1001424 1007784 1008234 1002543 990869 973946 952888 928733 902294 874319 845451 816111
62568 816111 786776 758286 731494 706559 683046 660753 640000 621042 603770 588200 574647
62557 574647 563082 552888 543703 535977 530074 525283 520529 515829 512143 509733 507505 504315 500389 497061
62543 497061 495410 495471 496547 498006 499843 502529 506304 510736 515187 519522 523920 528148 531638 534446 537538
62528 537538 541841 547424 553940 561451 570414 581111 593564 607887 624332 643052 664186 688181
62516 688181 715847 748071 785567 828680 877183 930299 987132 1047025 1109366 1173171 1236995
62505 1236995 1299130 1357752 1411183 1458297 1498521 1531148 1554802 1568000 1570189 1562006 1544681 1519650
62493 1519650 1488740 1454174 1418080 1382149 1347853 1316711 1290165 1269267 1254530 1245906 1242995 1245573
62481 1245573 1253992 1268764 1289603 1315058 1343091 1371727 1399162 1423726 1444100 1459352 1468536 1470448
62469 1470448 1464027 1448845 1425045 1393096 1353820 1308412 1258063 1203737 1146529 1088001 1029740
62458 1029740 972760 917781 865910 818369 775465 736407 700491 668135 640434 617905 599964
62447 599964 585443 573392 563457 555749 550363 547034 545291 544943 546107 548709 552193 555953 559810 563807
62433 563807 567705 570943 573030 573726 572943 570739 567358 562978 557397 550296 541928 533310 525496 518748 512475
62418 512475 505939 498925 491843 485319 479711 474970 470882 467346 464306 461525 458650 455559 452488 449662
62404 449662 446913 443805 440203 436564 433607 431735 430871 430840 431668 433373 435607 437854 440051 442719 446298
62389 446298 450555 454830 458703 462180 465430 468694 472366 476727 481526 486114 490188 494201 498941 504864
62375 504864 511878 519616 527789 536397 545605 555282 564734 573260 581022 589084 598465 609502 622264 637193
62361 637193 654936 675846 700075 728013 760143 796473 836467 879649 925944 975248 1026852
62350 1026852 1079431 1131432 1181362 1227835 1269542 1305316 1334294 1356072 1370625 1377975 1378060 1371062
62338 1371062 1357748 1339203 1316113 1288529 1256533 1221036 1183756 1146363 1109778 1074338 1040454
62327 1040454 1008750 979483 952163 926091 901128 877583 855391 833866 812334 790568 768434
62316 768434 745691 722571 700139 679516 660884 643704 627681 612940 599387 586557 574262
62305 574262 562859 552755 544043 536732 530838 526072 521943 518452 516293 515967 516942 517993 518255 517765 517262
62290 517262 517622 519193 521391 523192 524252 525260 526964 529261 531670 534309 537741 541987 546305 549983
62276 549983 552839 554916 556226 557044 557991 559546 561695 564230 567129 570473 574360 579246 586149 596116 609502
62261 609502 626001 645355 667816 693925 724119 758671 797836 841789 890350 942809 998056
62250 998056 1054869 1112012 1168059 1221320 1270096 1312992 1348890 1376766 1395885 1406204 1408275 1402536
62238 1402536 1388902 1367244 1338072 1302397 1261032 1214520 1163882 1111042 1058165 1006673 957210
62227 957210 910406 867194 828182 793054 760959 731465 704875 681637 661725 644628 629682
62216 629682 616266 603898 592406 581904 572385 563410 554469 545640 537580 530751 524873 519340 514000
62203 514000 509331 505900 503874 503028 503030 503624 504707 506355 508738 511951 515972 520868 526944 534521 543519
62188 543519 553395 563589 573949 584564 595275 605665 615682 625957 637126 648764 659385 667673
62176 667673 673517 677672 680690 682603 683611 684622 686938 691705 699835 712108 728963 750251 775559
62163 775559 804817 838279 875850 916607 959010 1001383 1042170 1080140 1114633 1145432 1172184
62152 1172184 1194069 1210311 1220891 1226412 1227279 1223351 1214569 1201678 1186040 1168785 1150246 1130226
62140 1130226 1108664 1086090 1063628 1042650 1024286 1008956 996236 985273 975476 966815 959335 952513
62128 952513 945352 937271 928667 920461 913288 907361 902893 900239 899576 900716 903348 907255 912269 918252
62114 918252 925189 932978 940910 947569 951583 952473 950649 946772 941344 934873 928015 921377 915279 909914
62100 909914 905656 903001 902088 902401 903089 903687 904559 906594 910455 916062 922798 930225 938587 948569 960462
62085 960462 973716 987496 1001652 1016921 1034160 1053723 1075709 1100337 1127654 1157088 1187784
62074 1187784 1219285 1251385 1283386 1314105 1342785 1369399 1393764 1414895 1431823 1444855 1455492
62063 1455492 1465178 1474521 1483730 1493342 1504264 1517199 1532105 1548159 1564301 1579927 1595054 1609778
62051 1609778 1623731 1636135 1646084 1652524 1654171 1649904 1639227 1622072 1598248 1567434 1529758 1485984
62039 1485984 1437076 1383908 1327556 1269464 1211030 1153210 1096770 1042654 991780 944549 900890
62028 900890 860763 824368 791850 763059 737617 714986 694442 675305 657398 641070 626502
62017 626502 613181 600333 587765 575930 565180 555428 546677 539408 533954 529759 525823 521904 518834
62004 518834 517467 517757 519128 521410 524919 529711 535201 540664 545779 550480 554484 557322 558896 559696 560226
61989 560226 560299 559115 556045 551150 544945 537969 530739 523733 517062 510289 502929 495099 487413 480387 474309
61974 474309 469570 466642 465605 466073 467578 469727 471989 473880 475403 476815 477907 478172 477937 478531 480806
61959 480806 484032 486902 489147 491455 494153 496795 499026 501089 503345 505853 508539 511424 514617 518440
61945 518440 523545 530572 539670 550638 563381 577847 593702 610548 628370 647254 666738 685984
61933 685984 704554 722440 739440 755211 769977 784358 798230 810455 820079 827135 831919 834166
61921 834166 833454 829923 824002 815917 806131 795890 786668 779147 773294 769283 767759 769211 773648 780937
61907 780937 791006 803564 817909 833195 848709 863839 877957 890372 900324 907075 910201 909791
61895 909791 906231 899808 890620 878784 864653 848912 832498 816270 800611 785477 770936 757488
61883 757488 745784 736113 728173 721128 713926 705965 697597 689674 682502 675573 668471 661565 655520 650583
61869 650583 646698 643897 642107 640938 640176 640220 641517 643840 646661 650005 654373 660068 667273 676655 689099
61854 689099 704782 723145 743848 767099 792973 821095 851210 883380 917278 951875 986144
61843 986144 1019523 1051278 1080007 1104400 1124167 1139617 1150571 1156248 1156245 1151237 1142717 1132364 1121616
61830 1121616 1111544 1103006 1096872 1093888 1094240 1097660 1104168 1114249 1127800 1143189 1158038 1170869 1181427
61817 1181427 1189340 1193158 1191062 1182150 1166707 1145489 1119210 1088661 1055000 1019763 984507 950233
61805 950233 917046 884532 852672 822342 794765 770558 749407 730531 713278 697417 683184
61794 683184 671052 661145 652748 644649 636208 627895 620655 614923 610477 607000 604322 602130 599946 597571
61780 597571 595255 593195 591168 588928 586741 585076 583835 582297 579973 577230 574857 573167 571760 570151
61766 570151 568414 567070 566444 566306 566219 566058 566010 566166 566430 566855 567732 569159 570788 572261 573662 575279 577115
61749 577115 579019 581153 583860 587047 590095 592578 594751 597134 599814 602410 604630 606680 609097 612251
61735 612251 616002 619828 623271 626137 628248 629358 629686 630278 632233 635399 638296 639645 639667 639625 640419 642017
61719 642017 644001 646055 647837 648876 648940 648336 647538 646578 645001 642448 639036 635076 630639 625701 620613
61704 620613 615901 611455 606304 599727 592356 585704 580565 576313 571849 566833 561829 557643 554774 553186
61690 553186 552288 551308 549881 548079 545807 542597 538363 533968 530505 528201 526494 524989 523690 522369 520393
61675 520393 517475 514037 510592 507241 504053 501392 499279 496846 493142 488463 484225 481470 479952 478812
61661 478812 477544 476080 474483 473040 472294 472415 472766 472596 472037 471848 472272 472778 473047 473562 474895 476909 479086
61644 479086 481241 483486 485792 488024 490228 492486 494652 496586 498375 499903 500424 499166 496297 492775
61630 492775 489336 486129 483260 480957 479033 476833 474001 470872 467921 465315 463183 461725 460741 459627
61616 459627 458229 457181 456917 456879 456234 454896 453151 450665 446758 441520 435846 430291 424592 418507 412520
61601 412520 407396 403396 400199 397342 394582 392024 389925 388204 386273 383681 380779 378254 376093 373548
61587 373548 370210 366502 362917 359407 355841 352569 350057 348327 347162 346475 345973 344806 342244 338694 335484
61572 335484 333563 332833 332770 333120 333703 333974 333305 331709 329945 328862 328729 329225 329881 330411 330718 330774 330612 330413
61554 330413 330490 331133 332397 333978 335281 335810 335638 335405 335660 336287 336789 337084 337656 338847 340357 341682 342835
61537 342835 344347 346631 349575 352690 355503 357832 359857 361804 363457 364158 363527 362060 360636 359533 358297
61522 358297 356620 354847 353368 351904 349853 347253 344968 343847 343914 344480 344826 344684 344216 343715 343302 342817
61506 342817 341978 340597 338611 335988 332864 329862 327947 327667 328523 329388 329579 329262 328816 328152 326990 325516
61490 325516 324326 323668 323122 322233 321222 320758 321125 321831 322160 321965 321780 322222 323493 325470 328057 331142 334239
61473 334239 336563 337742 338336 339325 341053 342866 343830 343649 342780 341844 341117 340581 340297 340562 341650 343436 345455
61456 345455 347386 349340 351431 353264 354174 354087 353825 354360 355896 357818 359308 359814 359172 357666 356035 355135
61440 355135 355387 356617 358419 360509 362698 364723 366325 367547 368884 371025 374275 378125 381427 383208
61426 383208 383458 383085 383103 383894 385265 387030 389351 392471 396275 400268 404065 407770 411696 415705 419099
61411 419099 421361 422836 424302 425846 426562 425595 423160 420208 417295 414268 410986 407775 404907 402077 398878
61396 398878 395536 392683 390503 388555 386536 384701 383356 382332 381276 380177 379245 378457 377628 376880 376646
61381 376646 377175 378367 380143 382600 385591 388444 390429 391463 392093 392828 393729 394681 395822 397409 399327
61366 399327 400973 401870 402239 402765 403801 405093 406370 407881 410095 413082 416579 420584 425500 431591 438552
61351 438552 445734 452659 459320 466238 474251 483911 494946 506452 517681 528414 538593 547983 556433
61338 556433 564124 571290 577846 583606 588643 593150 597070 600112 602034 602643 601654 598897 594678 589716 584713
61323 584713 580131 576238 573116 570631 568612 567027 565820 564781 563911 563820 565329 568603 572969 577688 582618
61308 582618 588120 594607 602314 611264 621296 632248 644107 656794 669808 682346 693835 704022
61296 704022 712555 718815 722352 723171 721469 717405 711307 703786 695358 686218 676603 667083 658152 649765
61282 649765 641626 633737 626342 619507 613232 607866 603958 601613 600392 599985 600597 602517 605577 609285 613308
61267 613308 617587 622075 626661 631338 636333 641896 648023 654487 661211 668519 676924 686709 697888 710483
61253 710483 724484 739352 753905 767026 778330 787833 795142 799453 800486 799028 796327 793017 788777
61240 788777 782956 775493 767254 759479 752802 746970 741574 736819 733231 730790 728852 726996 725490 724795
61226 724795 725051 726343 729064 733584 739680 746676 754078 761775 769663 777384 784544 791026 797059 803051
61212 803051 809311 815765 821957 827406 831924 835533 838268 840313 842259 844861 848420 852578 856871 861331
61198 861331 866462 872782 880656 890519 902974 918419 936633 956925 978685 1001643 1025522 1049696
61186 1049696 1073399 1096156 1117690 1137423 1154440 1168210 1179192 1188533 1197160 1205171 1211978 1216952
61174 1216952 1220015 1221668 1222390 1222033 1219960 1215684 1208977 1199388 1186244 1169512 1150223 1129549 1107713
61161 1107713 1084327 1059522 1034036 1008275 982103 955793 930466 907153 885924 866380 848586
61150 848586 832953 819533 808054 798531 791241 786069 782426 779907 778537 778187 778077 777155 774727 770627
61136 770627 765136 758971 753075 748063 744014 741009 739644 740702 744452 750629 758918 769134 781010 794353
61122 794353 809572 827649 849325 874480 902487 932983 966108 1002065 1040635 1081034 1122246
61111 1122246 1163623 1205185 1247134 1289083 1330059 1369362 1406961 1442828 1476300 1506535 1533257
61100 1533257 1556471 1575624 1589684 1598046 1600788 1597902 1588917 1573580 1552508 1526795 1497163 1463763
61088 1463763 1426616 1386083 1343139 1299280 1255873 1213378 1171494 1130147 1089976 1051618 1015058
61077 1015058 980134 947340 917523 890931 867112 845650 826489 809589 794815 782226 771962
61066 771962 763677 756608 750377 745299 741653 739121 737313 736461 737088 739194 742293 746162 751077 757244 764486
61051 764486 772692 782167 793255 805858 819687 834829 851748 870754 891789 914721 939507 966065
61039 966065 994341 1024604 1057210 1091840 1127407 1163087 1199120 1236137 1274060 1312269 1350635
61028 1350635 1389630 1429393 1469424 1509378 1549560 1590399 1631981 1674257 1717165 1760351 1803488
61017 1803488 1847225 1893221 1942935 1997061 2056528 2123155 2198668 2283822 2379369 2487344 2610857
61006 2610857 2753696 2921466 3122756 3368383 3670705 4045710 4515705 5108709 5855994
60997 5855994 6791461 7949319 9352223 10992701 12823611 14766732 16727976 18603220
60989 18603220 20279457 21652102 22662442 23327540 23731397 23980500 24158880 24309774 24436837
60980 24436837 24503437 24429194 24104386 23430794 22366147 20940731 19240294 17376080 15461518
60971 15461518 13597294 11859747 10294459 8919360 7734100 6727870 5883158 5178554
60963 5178554 4592184 4104058 3696596 3354712 3065955 2820047 2608345 2424101 2262777
60954 2262777 2121167 1996283 1885502 1787168 1700114 1622934 1554492 1494547 1442616 1396492 1353150
60943 1353150 1311073 1270555 1231745 1193749 1155862 1118422 1082011 1046802 1013102 981490 951914
60932 951914 923568 896195 870613 847358 825696 804736 784829 766959 751273 737077 724009
60921 724009 712377 702390 693671 685547 677533 669588 662138 655657 650096 645006 640376 636881 634997 634360
60907 634360 634345 634856 636014 637458 638552 639140 639660 640603 642125 643975 645454 645702 644425 642136 639382 636001
60891 636001 631565 626296 621003 616223 611893 607769 603702 599477 594848 589872 584914 580249 575853 571602
60877 571602 567493 563606 560025 556830 554073 551818 550234 549469 549346 549429 549595 550298 552007 554540 557328 560251
60861 560251 563850 568688 574762 581615 588804 596124 603452 610539 617067 622991 628723 634768 641189 647571
60847 647571 653544 659105 664444 669676 674812 679633 683538 685822 686328 685619 684370 682847 680994 678710 675857
60832 675857 672437 668945 666153 664256 662597 660588 658520 657095 656526 656529 656897 657521 658073 658259 658337 658901 660157
60815 660157 661828 663749 666112 669073 672490 676178 680118 684272 688419 692297 695923 699756 704519 710685
60801 710685 718033 725945 734189 743143 753085 763636 774141 784274 793937 803002 811599 820342 829717
60788 829717 839432 848890 858205 868148 879083 890473 901476 911670 921074 929834 937976 945307 951604
60775 951604 957036 962116 966982 971062 973842 975617 976898 977444 976681 974885 973029 971370 969068 965521 961262
60760 961262 957093 952930 947982 941674 933961 925079 915466 905617 895697 885478 874949 864683 855208
60747 855208 846244 836939 826806 816118 805490 795272 785326 775174 764368 752829 740829 728726
60735 728726 716822 705441 694799 684751 674938 665289 656135 647705 639800 632105 624605 617568 611305
60722 611305 606059 601852 598355 595090 591868 588769 585655 582125 578072 573917 570012 566214 562336 558668
60708 558668 555631 553144 550799 548505 546534 544946 543387 541482 539089 536073 532212 527550 522690 518403
60694 518403 514871 511443 507308 502474 497943 494755 492943 491597 489955 488131 486716 485997 485790 485825 485971
60679 485971 486154 486317 486496 486784 487182 487583 487936 488329 488805 489189 489205 488873 488665 489026 489737 490049 489608 488942 488735
60660 488735 488883 488752 488213 487836 487985 488340 488600 489238 491125 494580 499087 503795 508060 511636 514639 517379
60644 517379 520081 522686 524896 526352 526855 526590 526097 525826 525668 525106 523747 521558 518700 515541 512786 511102
60628 511102 510470 510290 510224 510523 511340 512180 512406 511950 511144 510075 508478 506179 503370 500488 497909 495592 493001
60611 493001 489673 486011 483127 481643 480995 480186 478870 477334 475710 473790 471480 469071 466997 465560 464779
60596 464779 464333 463777 463065 462640 462816 463290 463519 463366 463076 462919 463188 464210 465895 467500 468332 468464 468302 467788
60578 467788 466729 465690 465614 466478 467265 467617 468703 471853 476840 482270 487387 492867 499885 508959 519775
60563 519775 531658 543894 555831 566931 576781 584958 590920 594129 594419 592249 588477 583789 578389
60550 578389 572339 566060 560282 555491 551653 548572 546377 545495 546256 548642 552480 557706 564321 572075 580345
60535 580345 588499 596315 603851 610952 617108 621898 625314 627456 628147 627104 624476 621022 617745 615356
60521 615356 613856 612524 610579 608019 605644 604046 602865 601377 599554 598117 597676 598302 599851 602143 604737
60506 604737 607098 609266 611981 615874 620879 626786 634108 643992 657414 674773 696202 721852 751735
60493 751735 785517 822582 862105 902857 942943 979914 1011289 1035103 1050085 1055521 1051116 1037060
60481 1037060 1014172 983873 947969 908357 866886 825393 785679 749155 716326 686772 659888
60470 659888 635636 614369 596040 579958 565404 552091 539862 528355 517320 507067 498184 490917
60458 490917 485083 480427 476725 473582 470518 467377 464438 462084 460454 459340 458233 456564 454196 451696
60444 451696 449866 448923 448312 447341 445828 444072 442403 440925 439602 438417 437380 436450 435548 434695 433996 433335
60428 433335 432272 430560 428690 427531 427401 427868 428477 429203 430025 430723 431437 432850 435265 437975 440139 441935
60412 441935 444114 446704 448910 450232 450934 451398 451741 452164 453012 454218 455209 455605 455661 455850 456360 457068 457670
60395 457670 457845 457657 457762 458762 460410 462007 463493 465419 467800 469874 471237 472470 474189 476129 477678
60380 477678 478765 479748 480864 482257 484129 486353 488350 489783 491020 492467 493943 495216 496677 498762
60366 498762 501091 502954 504420 506134 508059 509269 509202 508468 508123 508578 509420 510025 510195 510402 511457 513722
60350 513722 516738 519880 523225 527415 532833 539390 547020 555721 564998 573885 581803 588907 595287 600286
60336 600286 603032 603352 601747 598682 594317 588781 582279 574910 566806 558543 551142 545370 541148 537761
60322 537761 534612 531681 529278 527542 526281 525229 524271 523374 522477 521616 521098 521364 522693 525190 529074 534807
60306 534807 542813 553205 565899 580879 598139 617305 637452 657342 675789 691760 704391 713132
60294 713132 717911 719000 716765 711722 704798 697147 689534 682100 674843 668026 661868 656147 650521 644986
60280 644986 639527 633449 625721 616147 605737 595724 586587 578185 570336 562942 555884 549182 543115 537901
60266 537901 533399 529332 525601 522214 519119 516318 513994 512331 511330 510900 510918 511149 511370 511620 512031 512376
60250 512376 512317 512216 513071 515279 518005 520244 521934 523511 524878 525575 525613 525407 525123 524768 524643 524892 524825 523653
60232 523653 521837 520808 521237 522448 523731 525342 527893 531546 536196 541681 547350 552165 555769 558901
60218 558901 562208 565331 567834 570437 574432 580165 586934 594211 602150 610890 620098 629400 638692 647861
60204 647861 656669 665078 673340 681582 689577 697084 704116 710702 716582 721341 724814 727255 729087 730447
60190 730447 731026 730487 729038 727287 725484 723287 720410 717072 713400 708931 703271 696977 691041 685620 679997
60175 679997 673776 667419 661469 655972 650982 646927 644063 642004 640253 638853 638132 638141 638749 639997 641965
60160 641965 644481 647274 650152 652752 654518 655321 655776 656454 657149 657488 657902 659203 661355 663550 665492 667772
60144 667772 670759 674023 677297 681254 686693 693465 700852 708622 717032 725985 734835 743032 750472 757213
60130 757213 763225 768415 772538 775134 775911 775226 773899 772599 771677 771409 771900 772756 773372 773695 774372 776091
60114 776091 779103 783340 788380 793154 796342 797542 797676 797789 797810 796898 794725 791757 788372 784288 779041
60099 779041 772628 765528 758347 751545 745309 739591 734448 730318 727708 726556 726192 726086 726443 727944 731083
60084 731083 735888 742011 748844 755672 761932 767339 771638 774486 775828 776219 776271 775667 773178 767939 760490
60069 760490 752207 743836 735009 725135 714293 703013 691613 680170 669027 658863 650120 642571 635614
60056 635614 628915 622683 617382 613260 610122 607554 605392 603900 603465 604149 605709 607957 610954 614810 619506
60041 619506 624987 631337 638755 647323 656746 666253 674896 682151 688216 693505 697909 700865 702111 701970
60027 701970 700661 697750 692654 685462 676775 666886 655621 643064 629929 617006 604604 592828 582048
60014 582048 572632 564344 556521 548892 541856 535849 530841 526724 523793 522457 522653 523949 526061 528861
60000 528861 531915 534622 536942 539499 542681 546064 549087 551957 555429 559866 564927 570102 575152 580131
59986 580131 585276 590829 596622 601838 605565 607567 608322 608342 607711 606200 603512 599469 594254 588395 582214
59971 582214 575497 568118 560806 554701 550212 546898 544474 543178 542960 543003 542543 541740 541391 542041 543594 545434
59955 545434 546801 547473 548242 550220 553441 556671 558871 560270 561638 563263 565165 567633 570681 573369 574563
59940 574563 574192 573055 571524 569227 565965 562209 558525 555092 551832 548538 544829 540546 536264 532871
59926 532871 530496 528376 525983 523778 522544 522340 522504 522481 522380 522725 523858 525619 527639 529890 532674 535968
59910 535968 539134 541701 544156 547416 551628 556045 560083 563953 568099 572594 577289 582142 587096 591960
59896 591960 596692 601542 606652 611739 616419 620659 624741 628944 633452 638386 643598 648558 652721 656189
59882 656189 659888 664894 671470 678815 685825 692022 697538 702394 706241 708894 710514 710923 709263 704910
59868 704910 698389 690712 682067 671923 660371 648581 637753 628250 620019 613221 608017 604085 600784
59855 600784 597734 595120 593592 593848 596025 599446 603364 608000 614465 623498 634597 646493 658090 668822
59841 668822 678487 686990 694028 698973 701434 702058 702345 703453 705523 708287 711813 716188 720847 724666 726679
59826 726679 726414 723650 718210 710080 699697 688039 676243 664866 653594 641978 630378 619705
59814 619705 610212 601063 591379 581358 572118 564694 559394 555872 553567 552218 551985 552949 554607 556213
59800 556213 557471 558367 558434 556959 554130 551207 549154 547695 546126 544401 542817 541172 538966 536220 533487
59785 533487 531181 529298 527658 526017 524171 522301 520973 520394 519960 518962 517469 516051 514938 513999 513330
59770 513330 513182 513355 513291 512908 512854 513797 515775 518365 521213 524271 527627 531185 534599 537644 540662 544232
59754 544232 548285 552053 555200 558533 563022 568449 573663 577994 581861 586090 591165 597015 602982 608008
59740 608008 611430 613673 615720 617885 619620 620551 621121 621962 623082 623980 624274 624074 623930 624530 626204 628582
59724 628582 630925 632841 634580 636624 639155 641890 644251 645763 646517 647131 648114 649416 650836 652512 654580
59709 654580 656634 658153 659338 660851 662639 663718 663300 661639 659493 657298 655217 653531 652491 651935 651430
59694 651430 650719 649835 648868 647734 646196 644131 641884 640239 639728 640051 640537 641082 642132 643735 645228 646090
59678 646090 646512 646726 646314 644711 641997 638607 634498 629296 623215 617161 611769 606792 601675 596357 591268
59663 591268 586806 583093 580029 577354 574764 572270 570400 569831 570773 572857 575569 578605 581842 585264 589095
59648 589095 593690 598966 604046 607807 609801 610400 610059 608822 606696 604107 601649 599533 597585 595707 594059
59633 594059 592792 591888 591289 591014 591007 591011 590760 590324 590137 590546 591283 591589 590995 589811 588611 587471 586138 584830
59615 584830 584219 584446 584744 584437 583902 584024 585051 586533 588253 590673 594384 599462 605384 611261 616184 619612
59599 619612 621560 622278 621850 620239 617587 614273 610759 607550 605053 603217 601435 599110 596166 592886 589528
59584 589528 586362 583763 581869 580344 578883 577666 576863 575959 574233 571799 569563 568084 567021 565774 564206
59569 564206 562678 561728 561778 562769 564088 565223 566419 568316 571043 574173 577375 580468 582934 584217 584650
59554 584650 585311 586659 587987 588551 588581 588757 589270 589950 590856 592119 593507 594736 596142 598681 603399 611103
59538 611103 622205 636378 652467 669124 685486 701023 714972 726302 734240 738653 740131 740005
59526 740005 740062 741746 745439 750654 756872 763976 771892 780067 787434 792876 795777 796192 794508 790924 785249
59511 785249 777176 766640 753973 739871 725184 710539 696140 681994 668281 655343 643461 632894
59499 632894 624031 617100 611759 607329 603406 599978 596991 594299 592038 590530 589714 589189 588953 589544 591184
59484 591184 593362 595605 598224 601855 606655 612406 618992 626254 633626 640539 647095 653906 661296 669033
59470 669033 676708 683910 690111 694874 698332 701131 703770 706200 708130 709567 711020 713349 717391 723499
59456 723499 731400 740692 751512 764528 780190 798091 817136 836260 854906 872849 889631 904206
59444 904206 915162 921319 922143 917688 908323 894618 877447 858081 837975 818332 799807 782703
59432 782703 767338 754010 742687 733067 725109 719133 715313 713539 714076 717758 724940 734730 746000
59419 746000 758945 774772 794028 816173 840849 868402 898623 929683 958992 984674 1005684
59408 1005684 1020933 1028984 1028626 1019644 1003334 982478 960421 939713 921569 906467 894648 885860
59396 885860 879081 872831 865423 854925 839728 819679 796311 771633 747108 723896 703128 685217
59384 685217 669475 655206 642818 633213 626407 621512 617817 615163 613431 612403 612145 612885 614453 616320
59370 616320 618212 620287 622716 625476 628559 631999 635731 639670 643867 648408 653377 659154 666420 675507
59356 675507 686033 697591 710420 724932 740974 758234 777128 798528 822668 848938 876729
59345 876729 905803 935802 965943 995306 1022981 1047954 1069396 1087131 1101405 1112096 1118455 1119533
59333 1119533 1114522 1102929 1085124 1062724 1037804 1011550 984024 955213 925761 896688 868967
59322 868967 843450 820613 800193 781598 764785 750233 737941 727096 717004 707793 699907 693383
59310 693383 688012 683815 680903 679081 677932 677191 676930 677567 679757 683904 689652 696234 703571 712648 724518
59295 724518 739139 755356 771677 786732 799249 808122 812624 812452 807712 799047 787706 775265 763112
59282 763112 752153 742865 735582 730800 729085 730606 734913 741482 750446 762438 777632 795237 814108
59269 814108 833621 853755 874422 894853 913583 929037 940204 946847 949169 947474 942170 933688
59257 933688 922091 907082 888837 868657 848323 828849 810310 792694 776326 761350 747511
59246 747511 734799 723927 715834 710937 709028 709631 712240 716494 722354 730011 739447 750204 761595
59233 761595 772965 783711 793313 801466 808007 812690 815181 815204 812463 806559 797444 785960 773491 760887
59219 760887 748067 734783 721386 708611 696863 685957 675404 664925 654848 646027 639060 633574
59207 633574 628619 623771 619434 615985 613174 610663 608699 607886 608476 610192 612510 614872 616941 618952 621650
59192 621650 625545 630346 635375 640347 645421 650631 655666 660293 664671 668989 672916 675644 676672 676489
59178 676489 676315 677112 679049 681983 686046 691441 697991 705461 714227 725007 737884 752130 767127 782915
59164 782915 799551 816433 832672 847804 861700 873979 883859 890549 893533 892608 887883 879780 868897
59151 868897 855888 841457 826286 810892 795647 780938 767098 754180 741991 730415 719511
59140 719511 709273 699527 690071 680718 671306 662042 653805 647593 643546 640883 638904 637596 637051 636783
59126 636783 636093 634880 633842 634009 636227 640750 646956 653697 660249 666924 674607 683879 694672 706471
59112 706471 718584 730384 741571 752115 761871 770531 778097 785062 791825 798189 803801 808859 813927
59099 813927 819070 823568 826611 828042 828328 827994 827250 826089 824670 823474 823024 823437 824320 825082 825189 824152
59083 824152 821439 816585 809414 800198 789660 778656 767694 756710 745402 733661 721610 709479
59071 709479 697741 687188 678434 671333 665188 659527 654382 649901 646099 642983 640495 638305 636026 633715
59057 633715 631790 630431 629427 628613 627983 627317 626169 624428 622489 620709 619103 617728 616885 616619 616385 615556
59041 615556 614108 612584 611567 611245 611272 611005 610185 609430 609677 611063 612810 614339 616039 618713 622736 628046
59025 628046 634597 642444 651597 662119 674210 687988 703144 718804 733647 746376 756481 764428
59013 764428 770770 775232 777205 776956 775672 774286 772980 771862 771323 771576 772563 774642 778669 785117 793746
58998 793746 804320 816860 830894 845332 859567 873963 888799 903484 917288 929976 941098
58987 941098 949499 954386 956200 955596 952268 945744 936829 927161 917598 908035 898647 890351 884049 880133
58973 880133 878742 879851 883207 888737 896965 908482 923133 940154 958866 978721 998984 1019056
58961 1019056 1038961 1058894 1078416 1096483 1111923 1123365 1129272 1128911 1123047 1112879 1098549 1079552
58949 1079552 1056355 1030623 1003836 976606 949344 922681 897100 873002 851267 832868 817675
58938 817675 804449 792380 781874 773530 767069 761806 757580 754549 752392 750297 747732 744925 742554
58925 742554 741097 740345 739514 737963 735760 733454 731462 729922 728986 728855 729546 730937 732966 735481 738073
58910 738073 740506 743248 747173 752724 759758 768124 778007 789636 803051 818156 834802 852794 872012
58897 872012 892330 913293 934239 955184 977266 1001860 1029535 1060309 1094535 1132801 1175077
58886 1175077 1220630 1268582 1317880 1366776 1413062 1454953 1491268 1520863 1542552 1555680 1560206
58875 1560206 1556184 1543611 1522800 1494425 1459315 1418720 1374629 1329159 1283660 1238980 1196418
58864 1196418 1157533 1122902 1091867 1063657 1038088 1015013 993833 973865 954699 935994 917485
58853 917485 899378 882273 866470 851766 838016 825418 814124 804037 795056 787028 779488 771967
58841 771967 764590 757792 751497 745215 738917 733023 727486 721733 715665 709871 704562 699154 693317 687637
58827 687637 682785 678751 675422 673284 672918 674280 676975 680818 685628 690947 696496 702565 709448 716749
58813 716749 723770 730263 736395 742207 747571 752471 756811 760033 761375 760615 758391 755776 753567 751821
58799 751821 749922 747175 743413 738986 734261 729330 724038 718114 711413 704394 698150 693509 690208 687440
58785 687440 685106 683976 684721 687303 691289 696142 701241 706209 711195 716266 720636 723241 723959 723435 721786
58770 721786 718611 714368 710489 707642 704934 701452 697573 694042 690698 687136 683973 682347 682425 683307 684310
58755 684310 685655 687996 691830 697265 703827 710555 716731 722459 728255 734260 740275 746389 753162 761114
58741 761114 770186 779630 788393 795872 802394 808710 815019 820870 826054 831091 836608 842716 849294 856389
58727 856389 864001 871810 879472 886912 894045 900545 906167 911099 915793 920654 926031 932259 939560 948037
58713 948037 957649 967915 977848 986669 994429 1001348 1006703 1009182 1008261 1004367 997646 987555 973874 957188
58699 957188 938017 916358 892495 867420 842026 816683 791995 769095 748644 730349 713985
58688 713985 700076 688940 679875 671856 664295 656613 648112 639097 631181 625429 620839 615683 609699 604000
58674 604000 599435 596134 594277 594159 595696 598767 603801 611166 620372 630810 642931 657589 674367
58661 674367 691537 707605 721957 734064 743175 749030 752044 752556 750616 746703 741880 736872 731468
58648 731468 725158 718004 710646 703692 697290 691191 685232 679829 675806 673621 673036 673752 675922 679701 684692
58633 684692 690329 696472 703121 709782 715662 720328 723764 725985 727038 727184 726699 725751 724857 725127 727562
58618 727562 732347 739272 748566 760766 775921 793359 812150 831397 850195 867579 882454 893599
58606 893599 900190 902479 901449 897608 890748 881152 870226 859341 848669 837709 826358 814850 803329
58593 803329 792255 782695 775391 769936 765645 762901 762871 766137 772243 780339 789778 800433 812889 827811
58579 827811 844572 861077 875541 887840 898593 907801 915362 922181 929550 937847 946835 956881 968865
58566 968865 983273 1000340 1020682 1044708 1071721 1100615 1131127 1163264 1195759 1226257 1252922
58555 1252922 1274836 1291083 1300793 1304256 1302927 1298179 1290851 1281949 1272670 1263543 1254352 1244996 1235572
58542 1235572 1225598 1214052 1200391 1184811 1167420 1147824 1125640 1100959 1074519 1048034 1023947
58531 1023947 1003850 987234 972621 959725 949557 942587 937979 934844 933286 933892 936833 941615 947215
58518 947215 952533 957196 961695 966196 969740 971388 971625 971564 971225 969887 967778 965934 964399 962037 958369
58503 958369 954263 950398 946180 940740 934051 926662 919038 911564 904515 897678 890547 883024 875470 868151
58489 868151 861297 855576 851700 849599 848729 849132 851479 856217 863430 873272 885651 899751 914815 931093
58475 931093 948959 967339 984197 998305 1009344 1016515 1018621 1015684 1009139 1000241 989482 977608
58463 977608 965855 954859 944593 935600 929073 925439 924095 924886 928584 935569 945129 956413 968886
58450 968886 981512 992681 1001411 1007552 1010500 1008952 1002542 992689 981226 969092 956815 945326 935572
58437 935572 927894 922169 918062 915070 912963 912255 913559 916711 921378 928112 937603 949117 961124 973419
58423 973419 987147 1002613 1018522 1033531 1047045 1058189 1065589 1068782 1068669 1066160 1061481 1054998 1047402
58410 1047402 1038745 1028526 1016957 1004843 992100 977848 962235 946730 932317 918805 906129
58399 906129 894775 884688 875481 867945 863610 862365 862269 862136 862434 863182 863016 861221 858818 856778 854893
58384 854893 853225 852821 854057 855979 858299 862296 868760 876776 885548 895697 907623 920268 932672
58371 932672 945142 957812 969747 980658 991757 1003714 1015529 1026815 1039354 1054774 1072232
58360 1072232 1090012 1107951 1126546 1145009 1161898 1176661 1189106 1198480 1204461 1207979 1209729 1209037
58348 1209037 1205463 1200348 1195523 1191677 1189088 1188514 1190072 1192631 1195673 1200376 1207612 1216428 1225928 1237029
58334 1237029 1250728 1266092 1281694 1297700 1314907 1332975 1351166 1369392 1386914 1401465 1411511
58323 1411511 1418209 1423455 1427332 1429134 1429424 1429202 1428344 1426810 1426130 1427666 1430484 1432949 1435478 1439906 1447007
58308 1447007 1456353 1467646 1480470 1493605 1506226 1519022 1532910 1547672 1562984 1579344 1596660
58297 1596660 1613467 1628985 1644372 1660580 1676759 1692309 1708512 1726384 1744863 1763092 1782503
58286 1782503 1804587 1828462 1852761 1877996 1904904 1932439 1959660 1987649 2017323 2047446 2077215
58275 2077215 2108572 2143264 2179727 2215727 2252065 2290768 2331576 2373270 2416656 2463266 2512845
58264 2512845 2564923 2620862 2681371 2744040 2806409 2869434 2934864 3001489 3067291 3132900 3199360
58253 3199360 3264793 3327217 3388558 3452103 3518116 3585782 3657193 3735295 3819988 3910337 4008387
58242 4008387 4116674 4234230 4359143 4492498 4635570 4786117 4942207 5106695 5282955
58233 5282955 5469356 5663487 5868599 6089838 6327197 6578446 6846042 7134555 7444346
58224 7444346 7774737 8130606 8518695 8940334 9395087 9888365 10427665 11014720 11649818
58215 11649818 12340582 13097973 13927647 14835018 15835199 16948131 18188500 19571902 21126971
58206 21126971 22890392 24896204 27184945 29820015 32883299 36464957 40679885 45695376
58198 45695376 51734745 59075679 68082123 79240729 93142997 110424719 131692176
58191 131692176 157363279 187355605 220784295 255963884 290731774 322754029 349599057
58184 349599057 368836903 378506493 377785519 367304789 348845773 324735542 297364872
58177 297364872 268904157 241074082 214967474 191053974 169378140 149796140 132124994
58170 132124994 116206210 101926200 89206134 77973791 68144572 59618209 52276497
58163 52276497 45983044 40597223 35992048 32055469 28682114 25776625 23263892 21086279
58155 21086279 19192047 17534437 16078505 14798016 13665703 12654368 11745630 10928646
58147 10928646 10190888 9518073 8902155 8341178 7831106 7364770 6938369 6551745 6201833
58138 6201833 5882056 5588287 5319561 5072908 4843130 4627739 4426879 4238581 4059228
58129 4059228 3888430 3728354 3578456 3435793 3300105 3173467 3055066 2941371 2831531
58120 2831531 2727761 2630252 2536434 2445692 2360252 2280841 2205649 2134099 2067698 2006590 1948886
58109 1948886 1893820 1842109 1793063 1744843 1697688 1653391 1611523 1569742 1527885 1488132 1450974
58098 1450974 1414657 1378959 1345861 1315920 1287350 1259318 1232962 1208583 1184989 1162246 1142028
58087 1142028 1124513 1107686 1090329 1073077 1056061 1038264 1019689 1001590 984086 966024 947471
58076 947471 929799 913105 896138 878953 862943 848036 832683 816844 802164 788885 775603
58065 775603 762518 751844 744190 737469 730315 723702 718145 712089 704423 696131 688098 679522 669804 659961
58051 659961 650865 641937 632747 624133 616681 609785 603092 597141 591732 585478 577975 570713 564862 559689
58037 559689 554047 547885 541506 534832 528101 521774 515166 506835 496972 487619 479739 471921 462819 453135
58023 453135 444186 436204 429112 423339 418649 413612 407485 401380 396438 392070 387133 381793 377061 373333
58009 373333 370377 367979 365751 363017 359564 355889 352372 348983 346067 344351 343838 343831 344370 346465 350659
57994 350659 356613 364481 375197 388818 403934 419246 434356 448501 460113 468527 474775 479686
57982 479686 482466 482215 479735 476727 473969 471267 468479 465712 463009 460515 458466 456664 454626 452555
57968 452555 451350 451371 452038 452869 453990 455373 456672 458081 460272 463188 465989 468427 470983 473366 474320
57953 474320 473496 472149 471253 470125 467695 464041 459940 455855 451982 448476 445159 441943 439787 440063 442645
57938 442645 445926 449122 453128 458615 464839 471126 478038 486111 494685 502838 510299 516615 520757 522515
57924 522515 523066 523187 522072 518885 514253 509146 503460 496845 489871 483193 476540 469647 463214 457837 452953
57909 452953 447971 443453 440013 437050 433871 431067 429319 427676 424619 420254 415924 412088 408032 403503
57895 403503 399221 395739 392829 389996 386817 382984 378712 374874 372053 369811 367502 365266 363530 362090
57881 362090 360522 358987 357840 356863 355621 354130 352504 350488 348003 345544 343382 341033 338236 335620
57867 335620 333604 331422 328252 324568 321332 318572 315892 313690 312577 312143 311653 311630 313483 317719 323659
57852 323659 330714 338783 347443 355847 363499 370377 376363 381348 385754 390145 394428 398120 401178 403856
57838 403856 406007 407309 408021 408734 409514 409918 409648 408668 406985 404956 403414 402835 402723 402361 401697 400892 399696
57821 399696 398062 396730 396230 395873 394756 393222 392254 391879 391376 390717 390524 390723 390404 388971 386415 382526
57805 382526 376868 369576 361320 352563 343674 335528 328949 323627 318590 313732 309865 307275 305265 303344
57791 303344 301903 301387 301589 302087 302800 303806 305067 306507 308104 309872 311979 314658 317756 320747 323506
57776 323506 326556 330179 333961 337749 342214 347604 352756 356377 358665 360505 361682 361194 358904 355499
57762 355499 351147 345565 339233 333102 327194 320819 314117 307964 302359 296389 290045 284608 280918 278525
57748 278525 276949 276465 277115 278131 278926 279701 280471 280491 279264 277335 275489 273842 272165 270433 268627 266600
57732 266600 264502 262827 261859 261634 262435 264506 267237 269626 271650 274122 276962 278857 279138 278788 278866 278933
57716 278933 277917 275735 273139 270498 267605 264328 260763 256932 252862 248747 244714 240708 236795 233215
57702 233215 229992 226986 224423 222725 221666 220459 218969 218094 218469 219497 220167 220230 220020 219697 219276 219011
57686 219011 219183 219790 220869 222814 226032 230628 236736 244812 255268 268167 283619 302238 325087
57673 325087 353572 389485 434456 488748 550654 617093 684316 747904 802748 843758 866872
57662 866872 869820 852703 818144 770442 714268 654114 594361 538689 489081 445934 409233 378898
57650 378898 354080 333277 315663 301547 291085 283307 276901 271291 266430 262215 258687 256193 254754
57637 254754 253706 252457 251171 250287 249807 249514 249441 249683 250074 250412 250640 250540 249685 247933 245543 242691 239471
57620 239471 236418 234207 232569 230409 227377 224485 222639 221472 220203 218815 217630 216502 215266 214312
57606 214312 213895 213437 212346 211023 210201 209737 208939 207726 206620 205819 205004 203848 202081 199440 196142 192988
57590 192988 190309 187246 182889 177757 173251 169933 167249 164786 162817 161549 160614 159494 157938 155944
57576 155944 153777 151840 150118 147979 145067 142088 140041 138909 137784 136100 134018 131737 129299 127104
57562 127104 125846 125677 125913 125759 125011 124094 123795 124861 127402 130704 133944 136916 139736 142170 143836 144829
57546 144829 145558 146106 146315 146287 146141 145490 143943 142131 141440 142507 144533 146238 147025 147113 147007 147028 147080 146793
57528 146793 146049 145215 144591 143929 142975 142167 142145 142744 143185 143257 143611 144829 146807 149155 151626 153984 155981
57511 155981 157651 159263 160863 162199 163097 163563 163554 163092 162509 162099 161605 160523 158870 157069 155240 153252
57495 153252 151415 150258 149464 147861 144870 141310 138338 136169 134282 132405 130770 129674 129273 129607 130428
57480 130428 131145 131300 130989 130599 130184 129379 127853 125733 123560 121825 120458 118878 116714 114401 112710 111729
57464 111729 110735 109214 107586 106660 106651 107081 107452 107663 107780 107699 107241 106468 105793 105668 106198 107117 108106 109026 109843
57445 109843 110487 110858 110855 110399 109652 109163 109481 110474 111378 111691 111651 111620 111413 110663 109543 108645 108288 108385 108852 109726
57425 109726 110891 112033 112898 113398 113529 113373 113063 112615 111978 111349 111029 110809 109992 108337 106494 105070 103810
57408 103810 102240 100634 99617 99178 98849 98578 98577 98495 97680 96293 95357 95533 96495 97645 98846 100247 101894
57391 101894 103663 105215 106049 106066 106067 107183 109786 113361 117312 121302 124843 127252 128213 127974 126970 125641
57375 125641 124447 123514 122387 120723 119059 118200 117936 117226 115657 113938 112893 112687 113117 113836 114172 113591
57359 113591 112567 112188 112677 113115 112925 112720 113270 114462 115858 117532 119690 121990 123861 125129 125877 126081
57343 126081 125841 125585 125599 125662 125408 124738 123689 122421 121540 121832 123314 125027 126148 126793 127438 128148 128814 129554
57325 129554 130372 130944 131224 131766 132940 134290 135242 135996 137119 138675 140424 142512 145225 148188 150499 151676
57309 151676 152006 151997 151906 151815 151801 151952 152377 153172 154309 155695 157352 159301 161251 162833 164201 165965 168383
57292 168383 171046 173540 175891 178145 180105 181756 183372 184874 185636 185363 184645 184251 184311 184588 184925 185046
57276 185046 184465 183134 181619 180157 178176 175399 172727 171243 170836 170717 170837 171727 173202 174285 174547 174674
57260 174674 175542 177384 179986 183111 186508 189973 193563 197467 201570 205405 208600 211133 213223 215221
57246 215221 217576 220664 224668 229628 235409 241603 247853 254323 261424 268934 276047 282492 288922 295767
57232 295767 302403 308065 312986 318069 323918 330739 338540 346741 354253 360809 367644 376004 385474 394756
57218 394756 403613 412942 423205 433965 444769 455372 465145 473453 480794 488637 497908 508421 519795
57205 519795 532016 545026 558688 573383 589742 607548 625720 643645 661757 680512 699624
57194 699624 718736 738243 758946 781259 804955 829270 853146 875871 897610 918895 939656
57183 939656 959351 977925 995733 1012451 1027068 1039470 1051203 1064177 1079105 1095671 1113630
57172 1113630 1133101 1154113 1176457 1199960 1224620 1250544 1277946 1307168 1338587 1372392 1408272
57161 1408272 1445388 1483071 1521697 1562241 1604673 1647639 1690488 1734776 1782629 1834122 1887539
57150 1887539 1941779 1997016 2053158 2109498 2166455 2226313 2291515 2363055 2440761 2523873 2610742
57139 2610742 2699158 2787883 2877238 2967636 3058288 3147899 3235752 3321484 3404530 3484492 3561588
57128 3561588 3636118 3708003 3777245 3844387 3910155 3975145 4040125 4106186 4174447 4246085 4322437
57117 4322437 4404331 4491484 4583521 4681322 4786305 4898847 5019080 5148984 5291777 5449284
57107 5449284 5622238 5813662 6029750 6276977 6561091 6890228 7276676 7734531 8278595
57098 8278595 8927947 9708838 10652624 11793174 13167638 14815711 16773204 19065153 21703496
57089 21703496 24685065 27987245 31569245 35383412 39385871 43538147 47808810 52178253
57081 52178253 56621553 61052022 65266762 68964929 71845384 73702086 74441089 74036830
57073 74036830 72502286 69903375 66379908 62134335 57396365 52391826 47324616 42364898
57065 42364898 37642371 33247737 29238290 25641536 22458505 19671053 17250436 15162030
57057 15162030 13367375 11827530 10506725 9372889 8396376 7550654 6814366 6171363 5608635
57048 5608635 5114981 4681071 4299269 3962897 3666013 3403494 3170643 2962863 2776260
57039 2776260 2608299 2457370 2321999 2200744 2092264 1994976 1907224 1828281 1758657 1698946
57029 1698946 1649004 1608763 1579067 1560989 1555090 1562004 1582624 1616090 1657726 1699975 1735168 1756698
57017 1756698 1758612 1736387 1689130 1620349 1536263 1443766 1349378 1258270 1173242 1095096 1024372
57006 1024372 962154 908956 863729 824581 790122 759747 733118 709854 689444 671066 653729
56995 653729 636912 620923 606544 594469 585073 578289 573618 570634 569590 571093 575088 580573 586360
56982 586360 591550 595075 595444 591461 582907 570299 554462 536635 518457 501205 485185 470231 456553
56969 456553 444751 435237 428068 423183 420473 419792 421256 425462 433149 444708 459967 478004 496796
56956 496796 513448 525410 531540 531934 527038 517340 503640 487075 468839 450117 432126 415788
56944 415788 401398 388936 378702 371401 367710 367928 371964 379449 390044 403882 421446 442670 466314
56931 466314 490420 513041 532140 545315 550509 547103 535851 517895 494453 467398 439235 412009
56919 412009 386624 363441 342987 325640 311043 298471 287726 279206 273010 268320 263944 259347
56907 259347 254876 250973 247523 244298 241821 241161 242623 245179 247548 249566 252087 255872 261121 267932
56893 267932 276635 287614 301153 317454 336474 357748 380579 404223 427431 448019 463516 472449
56881 472449 474766 471215 462815 450886 436977 422515 408758 396935 387904 381706 378056 377381 380861
56868 380861 389372 403020 421895 446662 478049 516144 560313 609119 659887 708778 751763 785472
56856 785472 807251 815298 809381 791134 763223 728479 690004 651381 615901 585588 561382 544094
56844 544094 534763 534232 542838 560609 587659 624693 673260 734873 808983 891703 976796 1057805
56832 1057805 1129009 1184957 1220486 1232124 1219516 1185323 1133917 1070234 999374 926483 856234
56821 856234 792066 735831 688325 650141 621978 604331 597287 600857 615298 640951 677746 724747
56809 724747 779776 839194 898135 951118 992705 1018258 1024991 1012728 983489 940305 886643 826645
56797 826645 764847 705001 649378 599355 556103 520257 491495 469215 453563 445352 445153 452926
56785 452926 468249 490237 517138 546474 575692 602439 624344 639007 644420 639336 623424 597614
56773 597614 564331 526954 488604 451284 416024 383507 354352 328872 306764 287262 269763
56762 269763 254249 240984 229870 220406 212275 205610 200549 196798 193769 190867 187545 183456 178844
56749 178844 174526 171255 169282 168560 168896 169661 169794 168595 166329 163814 161676 160244 159684 159804 160006 159913
56733 159913 159830 160176 160767 161132 161322 161840 162850 163972 164856 165572 166443 167762 169537 171265 172124 171766 170748
56716 170748 169891 169429 169185 169236 169869 170979 172133 173221 174538 176185 177835 179146 180103 180908 181807 182924
56700 182924 183990 184380 183721 182304 180625 178776 176730 174876 173707 173157 172853 172838 173367 174068 174099 173225 172099
56683 172099 171295 170605 169534 167971 166210 164735 164097 164511 165419 165869 165481 164662 163833 163025 162352 162249 162857
56666 162857 163637 164008 164073 164358 165101 166094 167036 167789 168449 169324 170708 172561 174624 176865 179498 182448 185193
56649 185193 187326 188967 190359 191373 191776 191838 192296 193608 195377 196653 196882 196559 196799 198180 200226 202139
56633 202139 203750 205345 206858 207796 207994 207913 208070 208585 209337 210123 210502 209927 208342 206402 204913 204185 204013
56616 204013 203960 203535 202457 200999 199922 199830 200659 201828 202775 203310 203590 203861 204141 204197 203857 203168 202073 200221
56598 200221 197465 194358 191730 189903 188699 188029 187964 188247 188372 188179 187920 187740 187681 188175 189792 192216 194151
56581 194151 194663 194185 193804 194009 194505 194888 195003 194871 194668 194645 194829 195082 195639 197252 200388 204596 209185 214313
56563 214313 220849 229170 238708 248813 259477 270763 281884 291448 298624 303584 306691 307817 306881
56550 306881 304671 302452 300753 299096 296983 294593 292333 290198 287882 285126 281733 277717 273664 270398
56536 270398 267960 265489 262472 259449 256966 254608 251831 249148 247463 246631 245633 243898 241538 238590 235154
56521 235154 232104 230488 230083 229603 228472 227401 226987 226770 226074 224952 223826 222861 222066 221450 220829 219997 219186
56504 219186 218728 218245 217063 215504 214835 215563 216688 217034 216533 215809 215281 215161 215584 216158 216036 214939 213597
56487 213597 212796 212598 212857 213759 215275 216693 217315 217225 216928 216662 216472 216477 216584 216341 215489 214381 213691 214072 216059
56468 216059 219541 223221 225458 226015 226156 226784 227400 227345 227018 227119 227526 227738 227791 227993 228318 228696 229291 229916
56450 229916 229884 229105 228616 229198 230182 230495 230283 230476 231206 231740 231799 231999 232970 234664 236464 237535 237339 236236
56432 236236 235259 234934 234812 234531 234590 235436 236467 236792 236449 236002 235497 234730 234175 234598 235958 237485 238671 239390
56414 239390 239342 238283 236733 235716 235747 236596 237843 239096 239927 240211 240348 240693 241069 241342 241993 243435 245167
56397 245167 246359 246970 247585 248498 249683 251308 253434 255446 256584 256937 257271 258064 259289 260805 262289 263125
56381 263125 263070 262778 262992 263591 264064 264454 264989 265290 264951 264567 265164 266790 268645 270407 272384 274468 275974
56364 275974 276604 276738 276710 276612 276810 277824 279563 281313 282547 283188 283191 282502 281401 280360 279626 279399 280034 281509
56346 281509 283143 284542 286368 289300 292657 295135 296603 298103 300210 302487 304597 306924 309927 313650
56332 313650 317981 322682 327189 331034 334412 337703 340644 342714 344089 345423 346883 348139 349064 349583 349152
56317 349152 347357 344868 342882 341787 341173 340839 340802 340654 340071 339738 340597 342334 343782 344760 346264 348833
56301 348833 351911 354963 358124 361609 365433 369796 374776 379672 383686 387234 391459 396443 401064 404632
56287 404632 407544 410272 412984 416342 421382 428202 435801 443481 451377 459443 467115 474372 482086 490894
56273 490894 500596 510972 522277 534628 547751 561646 576742 593235 611026 630346 651541 674310
56261 674310 698119 723470 751713 783615 819077 858294 902063 950945 1005278 1066123 1135016
56250 1135016 1212695 1299239 1395419 1502538 1620659 1748237 1883676 2025952 2173499 2323861
56240 2323861 2474796 2624400 2769718 2906433 3030375 3138379 3227613 3295502 3340573 3362169
56230 3362169 3359224 3330867 3278530 3205860 3116159 3011394 2894076 2768156 2637162 2502990
56220 2502990 2367466 2233583 2104105 1980067 1861652 1749537 1644530 1546861 1456584 1373837
56210 1373837 1298107 1228240 1163718 1104947 1051810 1003096 957852 916151 878092 843320 812009
56199 812009 784936 761922 741429 722303 704684 688712 673849 660103 648406 638889 630187 621324
56187 621324 612946 605850 599618 593612 588032 583104 578511 574459 571978 571179 570494 568590 565929 563609 561932
56172 561932 560992 561322 562911 564679 565889 567055 568805 571024 573725 577353 581597 585429 589004 593832 600253
56157 600253 606569 611716 616987 623883 632019 640468 649488 659527 670199 681754 695999 714176 735409
56144 735409 758806 785660 818079 856950 902885 957624 1022544 1097024 1180037 1272037 1373128
56133 1373128 1480302 1588438 1693407 1792678 1883992 1965538 2037138 2099778 2154294 2201439 2242306
56122 2242306 2277311 2305435 2325513 2337486 2341645 2337820 2326310 2308257 2284012 2252364 2212339 2164214
56110 2164214 2107763 2041396 1964687 1880292 1791966 1702229 1613307 1528479 1450535 1380170 1317436
56099 1317436 1263219 1217754 1179308 1146090 1118068 1095454 1077114 1061995 1050293 1041619 1034061 1026807
56087 1026807 1021548 1019358 1018410 1016945 1016146 1017581 1020068 1021864 1023959 1028241 1034175 1040172 1046584 1054353
56073 1054353 1062334 1069036 1075618 1084217 1094559 1105090 1116084 1128737 1142502 1156196 1170477 1186433
56061 1186433 1203100 1219145 1235495 1253507 1272132 1289762 1307104 1325144 1342182 1356283 1368913
56050 1368913 1382569 1396545 1408802 1420366 1433875 1449199 1464555 1480728 1499959 1521649 1543202
56039 1543202 1564398 1587058 1611254 1635676 1660930 1688690 1718460 1748835 1780880 1816489 1854483
56028 1854483 1892193 1929804 1969335 2010668 2052563 2096103 2142929 2191513 2239478 2288099 2340108
56017 2340108 2394788 2449878 2506523 2567257 2630877 2694665 2760021 2830328 2904831 2980505 3058593
56006 3058593 3143183 3234521 3329885 3430018 3538427 3655192 3777604 3906012 4042860 4187178
55996 4187178 4336415 4492497 4659559 4837128 5022360 5217289 5426622 5650219 5885554
55987 5885554 6135748 6406927 6699551 7011103 7345490 7710498 8107837 8535507 8998081
55978 8998081 9504211 10056019 10652271 11300296 12013027 12796303 13652076 14592561 15637948
55969 15637948 16802566 18098600 19552184 21200677 23077271 25217188 27678907 30543045
55961 30543045 33897057 37848180 42555953 48237715 55159095 63662871 74216407 87402588
55953 87402588 103856919 124202991 148924441 178063147 210869595 245743299 280557009
55946 280557009 313012644 340714241 361172177 372172763 372469313 362245815 342989953
55939 342989953 316984918 286812093 254975105 223573675 194078803 167328950 143695777
55932 143695777 123242148 105806511 91081008 78708249 68340684 59648631 52329547
55925 52329547 46134422 40871275 36379557 32518009 29176520 26276464 23750825 21536323
55917 21536323 19585143 17866747 16352623 15010995 13817828 12759231 11819605 10978694
55909 10978694 10222289 9544359 8936125 8383492 7877276 7415795 6995205 6606859 6246162
55900 6246162 5914513 5610204 5326155 5058817 4810859 4582826 4370060 4170030 3985004
55891 3985004 3815231 3656670 3507640 3370770 3246315 3130177 3020548 2920076 2829434 2744930
55881 2744930 2664430 2589742 2521170 2455411 2390658 2328265 2267603 2204870 2138867 2072702 2007973
55870 2007973 1942485 1875539 1810275 1748732 1689395 1631617 1577777 1528970 1483018 1438704 1397856
55859 1397856 1361404 1327511 1295370 1266770 1242074 1218528 1194368 1170978 1149336 1127969 1105986
55848 1105986 1084568 1063909 1042180 1018896 995915 973830 950946 927067 904614 884625 865202
55837 865202 845434 827282 812085 798554 785734 774571 765104 755466 745168 736045 728530 720384
55825 720384 710619 701176 693024 684108 673075 661742 651772 642053 631421 621061 612003 603037 593305
55812 593305 584432 577930 572756 567477 562660 559329 557170 555910 556392 558774 561839 565394 570967 578757
55798 578757 586451 592588 598459 605009 610491 613077 613321 612055 608328 601555 593472 585762 577751 568525
55784 568525 559270 551326 543737 534897 525010 514833 503651 490636 476848 463872 451697 439737
55772 439737 428741 419932 413357 408514 405354 403342 400939 397415 393802 390758 387133 381977 376218 370837
55758 370837 365188 358975 354188 352970 354812 357729 361121 365628 371228 377195 383068 388205 391304 391736
55744 391736 390340 387716 383045 375905 367879 360827 354830 349337 344982 342454 340714 338153 334781 331707
55730 331707 329292 327210 325405 323607 320810 316555 311774 307138 301780 295107 288618 284141 281299 278502
55716 278502 275648 274004 274001 274859 276069 277755 279802 281876 284069 286571 289116 291443 293669 295507 296038
55701 296038 295022 293334 291275 287778 282379 276606 272042 268239 263984 259483 255719 252710 250060 248335
55687 248335 248225 249065 249810 250804 253089 256580 260385 264298 268468 272212 274641 276008 277064 277703 277578 277412
55671 277412 278179 279462 280028 279638 278965 278157 276866 275289 273899 272494 270734 269213 268859 269719 271388 274050
55655 274050 277907 282221 286149 289963 294188 298163 300783 302097 302846 302970 301938 299963 297513 294186 289557
55640 289557 284511 280156 275878 270139 262906 255620 249000 242515 235963 229987 224909 220453 216717 214121
55626 214121 212355 210624 208948 208025 207842 207638 207181 206835 206347 204871 202367 199831 197934 196414 194875 193233
55610 193233 191337 189128 187157 186000 185210 183863 182091 180959 180772 180537 179269 176907 173877 170690 168135
55595 168135 166942 166928 167073 166579 165386 163832 162373 161498 161272 161159 160844 160813 161414 161833 160971 159016 157253
55578 157253 156573 156993 158320 160303 162334 163932 165432 167457 169952 172433 174742 176773 177991 178166 178082
55563 178082 178502 178929 178532 177701 177355 177184 176081 174121 172591 172024 171606 170660 169431 168193 166735 165059
55547 165059 163676 162928 162776 163222 164221 165288 166020 166834 168328 170179 171605 172618 173782 175078 176160 177396
55531 177396 179361 181472 182480 182278 181912 181845 181548 180827 180172 179607 178480 176609 174427 171862 168300 163892
55515 163892 159734 156498 153982 152088 151024 150377 149335 148086 147727 148457 149177 149202 149030 148969 148435 147258 146384
55498 146384 146457 146825 146767 146665 147053 147426 147006 146029 145364 145290 145414 145446 145427 145495 145838 146587 147449 147820 147506 146971 146714
55477 146714 146847 147361 148195 148924 148931 148113 146903 145600 144233 143086 142599 142664 142669 142356 142018 141824 141643 141531 141673
55458 141673 141866 141821 141851 142426 143135 143071 142207 141392 140935 140301 139310 138525 138222 138047 137945 138350 139168 139620 139419 139098
55438 139098 138922 138552 138106 138377 139561 140832 141656 142418 143270 143539 142935 142292 142328 142614 142469 142004 141541 140870
55420 140870 139834 138964 138821 139355 140420 142108 144028 145128 144989 144513 144624 145058 145169 145149 145556 146262 146759
55403 146759 147013 147237 147248 146790 146093 145466 144735 143702 142729 142268 142164 141954 141483 140812 139947 139084 138662 138731 138820
55384 138820 138764 139013 139712 140210 140034 139641 139514 139236 138248 136973 136372 136746 137672 138721 139536 139613 138792 137785
55366 137785 137563 138337 139600 140915 142205 143477 144732 145981 147041 147524 147227 146251 144698 142754 141170
55351 141170 140896 141954 143301 144128 144619 145080 145199 144696 143962 143370 142611 141341 139915 138857 138153 137690 137784
55334 137784 138588 139494 139819 139674 139558 139553 139526 139579 139649 139170 137849 136395 135753 135967 136419 136840 137462 138406 139515
55315 139515 140526 141058 140829 140243 140222 140983 141610 141339 140613 140247 140282 140431 140987 142301 143753 144246 143534 142360
55297 142360 141490 141227 141566 142143 142270 141634 140756 140297 140280 140465 140972 141934 143019 143950 145043 146530 147788 147964
55279 147964 147037 145649 144335 143541 143748 144808 145627 145384 144614 144291 144372 144173 143706 143589 143972 144542 145342 146526
55261 146526 147562 147710 147224 147083 147616 148306 148846 149447 150089 150382 150201 149706 148773 147247 145688 144997 145261 145793
55243 145793 146248 146824 147337 147101 146004 144896 144588 145010 145557 145751 145434 144806 144371 144472 144895 145272 145606 145989
55225 145989 146179 146130 146561 148098 150084 151194 151134 150855 151110 151713 152268 152731 153018 152847 152151 151072 149541 147540
55207 147540 145728 144993 145377 146168 147079 148465 150255 151579 151718 150763 149184 147474 146291 146178 146895 147709
55191 147709 148441 149466 150608 151001 150289 149112 148067 147070 146139 145864 146493 147224 147130 146317 145631 145568 145921 146146
55173 146146 145725 144537 143163 142490 142741 143295 143625 143939 144612 145543 146416 147143 147713 148013 148105 148276 148507 148283
55155 148283 147295 145968 145002 144667 144814 145241 145741 146117 146361 146589 146687 146391 145850 145662 146110 146751 146984 146655 145915
55136 145915 144930 143940 143199 142605 141770 140722 140070 140198 140724 141106 141354 141770 142384 143112 144140 145600 147043
55119 147043 147763 147623 147131 146689 146166 145338 144464 144078 144348 144864 145247 145704 146689 148035 148957 149100 149084 149588 150359
55100 150359 150747 150863 151406 152442 153210 153271 153111 153403 154271 155527 157032 158479 159347 159452 159197 159017 158966 159027
55082 159027 159324 159714 159673 159043 158510 158830 159833 160707 161132 161569 162362 163026 162731 161368 159766 158768 158291 157648
55064 157648 156719 156271 156932 158325 159625 160541 161159 161178 160092 158097 156066 154594 153592 152879 152539 152619 152988
55047 152988 153598 154350 154702 154066 152731 151786 151926 152855 153963 154910 155367 154890 153496 151859 150603 149771 149204
55030 149204 148883 148689 148372 148065 148297 149154 150001 150430 150882 151812 152751 152808 151825 150452 149282 148418 147754 147249
55012 147249 146914 146797 146927 147194 147412 147581 147907 148498 149315 150325 151301 151573 150696 149487 149605 151679 154465
54995 154465 156304 156891 157103 157639 158525 159547 160486 161036 161040 160745 160426 159993 159391 159114 159807 161444 163395 165208
54977 165208 166870 168330 169295 169631 169599 169519 169432 169243 169096 169410 170459 171941 173124 173581 173646 173924 174457 174749
54959 174749 174541 174124 173869 173923 174432 175537 176961 178040 178414 178253 177700 176696 175619 175379 176271 177292 177278
54942 177278 176419 175913 176342 177126 177611 177959 178605 179316 179293 178244 177057 177100 178807 181184 182996 184277 186185
54925 186185 189406 193303 196943 200428 204691 210220 216578 223115 229696 236478 243190 249004 253237 256011
54911 256011 257853 258668 257619 254333 249734 245108 240686 235820 230274 224460 218589 212512 206516 201298
54897 201298 196926 192769 188752 185775 184407 184037 183873 183968 184575 185276 185592 185882 186788 188216 189656 191141
54881 191141 193124 195660 198457 201570 205361 209979 215451 222050 229862 238077 245289 250572 253840 255340
54867 255340 255297 253984 251634 248226 243622 237882 231293 224346 217828 212465 208164 204002 199394 194782 190810
54852 190810 187356 183960 180694 177872 175344 172831 170609 169085 167979 166736 165480 164712 164272 163588 162867
54837 162867 163026 164246 165527 165981 165797 165592 165472 165198 164740 164211 163574 162836 162360 162677 164008 166038 168116
54820 168116 169707 170810 171827 172897 173587 173503 172964 172630 172670 172720 172607 172667 173351 174837 176852 178581 179000 177804
54802 177804 175886 174422 173607 172779 171647 170748 170667 171402 172565 173748 174588 174886 174819 174781 175006 175542 176393 177349
54784 177349 177905 177890 177978 178999 180795 182366 183142 183537 184219 185408 186981 188757 190558 192413 194765 198068
54768 198068 202236 206953 212362 218798 225839 232483 238417 244324 250606 256503 260940 263675 265014 264879
54754 264879 262837 258892 253678 247841 241618 235039 228302 221861 216204 211550 207739 204505 201840 199928
54740 199928 198730 197831 196778 195461 194161 193275 192957 192935 192794 192509 192483 192955 193769 194985 197320 201420 206920
54723 206920 212804 218562 224475 230841 237509 244167 250508 256010 260065 262451 263368 262970 261293 258543 254940
54708 254940 250308 244399 237705 231333 225912 221108 216408 211848 207749 204235 201283 198858 196739 194574
54694 194574 192329 190357 188888 187794 186989 186622 186664 186724 186476 185917 185021 183605 181796 180235 179447 179333 179545
54677 179545 180060 180985 182037 182631 182472 181824 181163 180604 179708 177992 175781 174274 174329 175338 175906 175642 175598 176677
54659 176677 178332 179341 179391 179217 179402 179715 179729 179539 179579 179956 180309 180366 180353 180622 181018 181013 180549 180266 180614 181219
54639 181219 181572 181914 182732 183665 183788 183001 182323 182574 183440 184143 184400 184281 183627 182188 180170 178232 176952
54622 176952 176447 176430 176627 177174 178461 180348 181833 182050 181472 181485 182671 184141 184745 184348 183642 183158 182856 182424
54604 182424 181715 181001 180732 180853 180584 179395 177986 177588 178388 179444 180166 180848 181540 181495 180409 179361 179665
54587 179665 181244 182806 183272 182515 181093 179851 179447 179766 180022 179787 179543 179839 180390 180535 180213 179885 179805 179888
54569 179888 180046 180196 180204 180294 181149 183047 185159 186270 186036 185074 184052 183245 182780 182689 182764 182785 182832 183019 183103 182817
54549 182817 182423 182430 182840 183106 182785 181907 180837 180124 180300 181397 182754 183720 184384 185228 186286 187203 187962 188920
54531 188920 190083 190953 191333 191763 192871 194539 196002 196646 196523 196095 195642 195038 194124 193104 192343 191875 191492
54514 191492 191266 191446 191722 191205 189584 187835 187299 188256 189831 191062 191636 191755 191665 191292 190198 188134 185699
54497 185699 184013 183474 183382 183113 183035 183673 184597 184971 184869 185129 186025 186882 187003 186350 185324 184471 184357 185103 186042
54478 186042 186390 186238 186304 186784 187153 187117 187058 187384 188070 189023 190282 191673 192762 193436 194047 194758 195219 195099 194548
54459 194548 193846 193048 192283 192076 192963 194853 196918 198040 197464 195357 192817 191080 190604 191029 191848 192678 193075
54442 193075 192778 192259 192379 193225 193731 192873 190871 188887 187772 187430 187208 186618 185729 185049 184993 185499 186302 187387
54424 187387 188825 190287 191269 191873 192821 194488 196428 198130 199646 201052 201792 201222 199606 197970 196960
54409 196960 196347 195697 195076 194880 195230 195871 196581 197448 198599 199748 200308 200065 199547 199397 199553 199499 199293 199746
54391 199746 201336 203435 205034 205881 206449 207033 207448 207597 207741 208104 208615 209178 209797 210194 209766 208369 206938
54374 206938 206756 208017 209548 210134 209768 209338 209417 209854 210348 210855 211301 211429 211269 211359 212145 213348 214330 214874
54356 214874 215200 215282 214700 213388 212090 211729 212377 213163 213234 212621 212005 211753 211493 210767 209816 209325 209493 209805 209817
54337 209817 209724 209911 210353 210823 211319 211927 212526 213122 214174 216079 218456 220545 222298 224503 227707 231586
54321 231586 235617 239846 244685 250246 256259 262381 268217 273141 276456 277875 277708 276531 274670 272006
54307 272006 268333 263856 259192 254746 250311 245535 240643 236312 232786 229554 226092 222635 219920 218289
54293 218289 217361 216549 215653 214796 213942 212749 211046 209283 208248 208283 208975 209669 210019 209987 209665 209346 209521 210418
54275 210418 211646 212602 213112 213396 213529 213296 212626 211857 211492 211810 212695 213769 214738 215703 216884 218013 218392
54258 218392 217842 217226 217555 218870 220451 221785 222718 222919 222082 220699 219849 219964 220436 220665 220857 221410 222113
54241 222113 222398 222049 221264 220405 220038 220814 222710 224597 225146 224163 222645 221558 221024 220728 220591 220732 221027
54224 221027 221123 220888 220561 220399 220410 220572 221086 222111 223325 224080 224106 223780 223562 223437 223051 222195 220954 219587
54206 219587 218456 217828 217615 217508 217496 217865 218489 218666 218052 217341 217450 218427 219719 221127 222754 224225 224805
54189 224805 224284 223104 221690 220320 219527 219753 220568 221059 221138 221595 222641 223308 222769 221491 220533 220287 220417
54172 220417 220535 220402 219897 219279 219155 219750 220563 221147 221837 223257 225378 227517 229029 229679 229589 229141 228687 228079
54154 228079 226802 224748 222456 220346 218259 216184 214812 214737 215494 216101 216284 216519 217052 217540 217679 217590 217503
54137 217503 217467 217409 217205 216797 216482 216907 218396 220429 222183 223418 224418 225239 225559 225269 224683 224063 223363 222579
54119 222579 222036 222131 222926 224082 225151 225998 226987 228590 230699 232608 233817 234501 234963 235130 234964 234922 235325
54102 235325 235635 235104 234002 233385 233648 234070 233987 233682 233756 234236 234733 235039 235132 234872 234157 233155 232110 231060
54084 231060 230064 229515 229884 231174 232888 234477 235651 236335 236615 236790 237304 238485 240354 242645 244919 246718
54068 246718 247767 248167 248366 248836 249715 250711 251376 251458 251045 250467 250098 250178 250665 251262 251664 251784 251735 251682 251862 252645
54048 252645 254350 256998 260383 264299 268495 272579 276400 280524 285805 292286 298980 305025 310705 317002
54034 317002 324457 332806 341487 350026 358102 365630 372802 379794 386533 392932 399152 405280 410984 415812
54020 415812 419676 422611 424282 424271 422850 420905 418936 416581 413383 409671 406336 403861 401811 399339 396150
54005 396150 392986 391178 391778 395220 401731 411549 424420 439269 454912 470847 486701 500946 510957
53992 510957 514693 511922 503600 490659 473902 454627 434540 414937 396350 379089 363707 350735
53980 350735 340169 331466 323977 317226 310843 304572 298529 293334 289623 287316 285589 283783 282161 281414
53966 281414 281501 281384 280121 277889 275688 274241 273550 273403 273813 274790 276012 277114 278136 279370 280771 281881
53950 281881 282482 283127 284802 288068 292561 297201 300960 303713 306468 310505 316119 322395 328308 333684 338790
53935 338790 343503 347475 350897 354418 358303 362241 366100 370241 374948 380036 385299 390888 397009 403626
53921 403626 410731 418480 426755 434982 442761 450372 458375 467026 476416 486757 497967 509199 519378
53908 519378 528213 536201 543539 549443 552846 553645 552993 552217 551510 549935 546814 542727 538714 534840 530214
53893 530214 524284 517326 509573 500828 491307 481936 473147 464125 454039 443434 433470 424231 414826 405016
53879 405016 395731 387868 381389 375814 370890 366468 362281 358169 354233 350583 347188 344077 341372 339023
53865 339023 336742 334256 331417 328138 324505 320909 317769 315135 312765 310488 308235 305905 303589 301813
53851 301813 301119 301369 301825 301912 301635 301338 301371 301944 303020 304389 305981 307913 310050 311959 313735 316522 321543
53834 321543 328872 337748 347898 359914 374547 392488 414703 441929 473344 506373 538104 566406
53822 566406 589502 605297 611840 608376 595707 575833 551486 525633 500831 478822 460573 446464
53810 446464 436468 430428 428187 429288 432684 437134 441866 446643 451299 455566 459167 461702 462650 462003 460682
53795 460682 459702 458995 457704 455521 453015 450656 448370 446204 444604 443676 442867 441690 440191 438359 435748
53780 435748 432073 427641 422745 417166 410694 403702 396736 389918 383119 376379 369747 363035 356209 349718
53766 349718 344051 339131 334469 329758 325048 320530 316408 312861 309917 307389 304982 302396 299451 296342
53752 296342 293597 291493 289746 288170 287239 287311 287662 287244 286271 285954 286647 287474 288095 289503 292394 295834 298402
53735 298402 299796 300519 300773 300619 300513 300701 300605 299737 298781 298804 299793 300907 301809 302765 303716 304296 304675 305424 306533
53716 306533 307467 308238 309579 311873 314586 316944 318658 319907 321085 322584 324380 325953 327079 328467 330965
53701 330965 334287 337269 339285 340675 341815 342660 343403 344774 347296 350747 354555 358252 361366 363416 364331
53686 364331 364500 364264 363698 362950 362320 361907 361572 361254 360894 360160 358871 357630 357285 357630 357479 356301 354948
53669 354948 354325 354119 353447 352112 350490 348669 346566 344630 343607 343603 344025 344468 345082 345986 346827 347163 346958
53652 346958 346470 345957 345662 345851 346642 347815 348924 349557 349541 349091 348774 349131 350157 351301 352101 352706 353563 354737
53634 354737 355855 356697 357502 358523 359681 360937 362644 365097 367941 370584 373112 376185 379973 383798 387055
53619 387055 389900 392738 395581 398353 401356 404859 408546 411924 415093 418625 422858 427708 432942 438225
53605 438225 443093 447354 451321 455220 458621 461043 462807 464612 466453 467686 468028 467697 466642 464632 462288
53590 462288 461025 461402 462262 462141 460949 459653 458672 457359 454991 451699 448337 445705 443935 442487 440782
53575 440782 438838 437130 435815 434459 432703 430818 429325 428323 427540 426842 426390 426338 426644 427142 427590 427731
53559 427731 427442 426855 426296 426153 426736 427992 429325 430012 430003 430175 431593 434602 438713 443232 447921 453167 459591
53542 459591 467420 476248 485524 495167 505507 516746 528785 541391 554097 566003 576289 585001
53530 585001 592803 599796 605318 609196 612487 616381 620964 625803 631320 638613 648045 658885 670542 683348
53516 683348 697787 713574 730049 747150 765508 785682 807664 831070 855503 880643 906179
53505 906179 931739 956913 981445 1005543 1029871 1054969 1080563 1105575 1128962 1150547 1170950
53494 1170950 1190842 1210422 1229598 1248354 1266778 1284913 1302873 1321024 1339757 1359093 1378724
53483 1378724 1398496 1418536 1438721 1458352 1476638 1493368 1508743 1522588 1534162 1542936 1549305 1554214
53471 1554214 1558155 1560766 1561359 1559459 1554755 1546969 1536222 1523385 1509591 1495345 1480480 1464951 1449122
53458 1449122 1433112 1416433 1398775 1380638 1362556 1343996 1323843 1301985 1279646 1257942 1236724
53447 1236724 1215225 1193320 1171717 1151209 1132223 1114934 1099397 1085608 1073675 1063836 1056039 1049639
53435 1049639 1043884 1038703 1034660 1032086 1030600 1029679 1029467 1030623 1033435 1037464 1042283 1048262 1056273 1066653
53421 1066653 1078883 1092351 1106991 1122890 1139742 1157200 1175611 1195802 1218151 1242390 1268442
53410 1268442 1296850 1328038 1361518 1396260 1431762 1468460 1507149 1548242 1591599 1636841 1683755
53399 1683755 1732393 1782789 1834625 1887342 1940586 1994469 2049343 2105430 2162626 2220481 2278342
53388 2278342 2335641 2392127 2447693 2502005 2554422 2604322 2651419 2695781 2737619 2776904 2813080
53377 2813080 2845301 2873182 2897101 2917444 2933747 2945006 2950705 2950966 2945769 2934614 2917113 2893351
53365 2893351 2863451 2827363 2785434 2738716 2688353 2635074 2579639 2523332 2467457 2412575 2358690
53354 2358690 2305988 2254845 2205249 2156744 2109034 2062274 2016702 1972185 1928160 1883835 1838573
53343 1838573 1792391 1746132 1701011 1657966 1617427 1579459 1543904 1510489 1479035 1449513 1421844
53332 1421844 1395884 1371743 1349773 1329954 1311512 1293505 1275636 1258213 1241514 1225552 1210230
53321 1210230 1195343 1180573 1166005 1152495 1141026 1131661 1123643 1116627 1111247 1108274 1107655 1108708 1110910
53308 1110910 1114163 1118511 1123947 1130407 1137737 1145755 1154647 1165225 1178552 1195186 1214835 1236695 1260056
53295 1260056 1284668 1310673 1338244 1367223 1397070 1427116 1456796 1485674 1513420 1539903 1565202
53284 1565202 1589344 1612007 1632669 1651048 1667254 1681368 1693046 1701745 1707266 1709790 1709391 1705897
53272 1705897 1699397 1690514 1679785 1667004 1651643 1633850 1614487 1594120 1572512 1549299 1524721 1499348
53260 1499348 1473486 1447282 1421110 1395315 1369606 1343160 1315368 1286348 1256805 1227701 1199870
53249 1199870 1173495 1147846 1121869 1095152 1068121 1041291 1014684 988100 961582 935325 909373
53238 909373 883769 858919 835445 813630 793239 773975 755926 739414 724611 711463 699889
53227 699889 689690 680293 670910 661070 650756 639891 628061 615081 601591 588561 576276 564247
53215 564247 552132 540299 529287 519136 509496 500155 491240 483075 475979 470022 464865 460037 455420
53202 455420 451137 446939 442169 436597 430908 426026 422181 418902 415596 411792 407142 401661 395909 390621
53188 390621 386231 382865 380464 378592 376471 373702 370746 368264 366178 363903 361340 359037 357439 356517
53174 356517 356151 356247 356366 355857 354624 353313 352458 351831 350934 349830 349206 349744 351611 354302 356844 358359 358732
53157 358732 358595 358604 358831 358946 358708 358139 357434 356892 356754 356930 357046 356852 356461 356072 355710 355356 355069 354774 354118
53138 354118 352861 351221 349589 347978 346116 344054 342317 341303 340818 340406 339962 339755 339909 340189 340387 340715
53122 340715 341588 343097 344862 346369 347315 347711 347895 348450 349781 351628 353180 353797 353497 352743 352051 351883 352437
53105 352437 353181 352961 351079 348089 345127 342633 340291 338126 336910 337184 338289 338783 337693 335208 332320
53090 332320 329941 328262 326859 325390 324027 323037 322164 320887 319208 317698 316669 315832 314986 314547 314987 316082
53074 316082 317109 317610 317614 317312 316895 316670 316894 317425 317792 317763 317645 317969 318949 320352 321836 323355 325155 327381
53056 327381 329704 331471 332239 332201 332094 332798 334847 338098 341770 344982 347357 349084 350503 351783 352954
53041 352954 353906 354312 353818 352398 350340 347835 344898 341810 339231 337547 336307 334680 332358 329836 327888
53026 327888 327018 327242 328042 328608 328431 327779 327378 327623 328269 328856 329219 329496 329869 330389 331014 331723 332602 333700
53008 333700 334696 334924 334050 332639 331698 331582 331706 331479 331119 331167 331524 331488 330704 329573 328565 327624 326548 325633
52990 325633 325459 326134 327152 328056 328907 330002 331384 332786 333921 334720 335423 336484 338235 340535 342846 344728
52974 344728 346156 347357 348515 349684 350726 351296 351151 350607 350430 351060 352237 353601 355315 357757 360835
52959 360835 363942 366487 368106 368604 368100 367098 366001 364724 363183 361887 361398 361303 360460 358382 355686 353002
52943 353002 350185 347025 344027 341848 340380 339044 337746 336905 336619 336372 335608 334207 332358 330330 328453
52928 328453 327020 326057 325357 324745 324185 323616 322931 322165 321592 321581 322353 323749 325122 325641 324951 323501 322078
52911 322078 321092 320531 320472 321234 322901 324951 326601 327437 327643 327714 328053 328801 329848 330931 331779 332319 332798 333580
52893 333580 334739 335943 336829 337368 337624 337323 336054 333961 331899 330704 330505 330784 330776 329725 327238 323850
52877 323850 320916 319495 319404 319714 319903 320043 320052 319477 318244 317081 316900 318034 320287 323378 326986 330569 333491
52860 333491 335453 336755 338202 340634 344204 347957 350388 350739 349580 347979 346350 344381 341807 338794
52846 338794 335666 332667 330002 327659 325151 321886 317985 314350 311705 309940 308669 307983 308119 308632 308578
52831 308578 307596 306309 305514 305387 305659 306164 306919 307907 309034 310184 311134 311602 311523 311074 310297 308979 307112
52814 307112 305217 303897 303296 303318 304155 306153 309218 312828 316652 320809 325350 329757 333156 334976 335374
52799 335374 335035 334521 333707 332029 329342 326308 323738 321859 320453 319391 318537 317487 315954 314253 312758
52784 312758 311051 308459 305423 303437 303310 304288 305285 306147 307133 307914 308033 308004 308959 311186 313742 315589 316548
52767 316548 317033 317398 317816 318466 319435 320515 321274 321369 320834 320047 319317 318488 317162 315338 313573 312363 311713
52750 311713 311507 311871 312824 313921 314804 315853 317699 320177 322346 323574 324085 324344 324480 324530 324785 325482 326474
52733 326474 327492 328579 330024 331987 334370 336952 339462 341691 343695 345815 348355 351272 354247 356885
52719 356885 358751 359442 358932 357803 356800 356032 354842 352636 349722 347052 345151 343570 341506 338736 335710
52704 335710 332960 330761 329253 328443 327999 327412 326551 325733 325153 324603 324018 323817 324317 325176 325942 326885 328621
52687 328621 330985 333039 334309 335381 336936 338714 339963 340612 341400 342867 344624 345786 345894 345273 344619
52672 344619 344373 344471 344528 344201 343455 342553 341841 341471 341361 341371 341460 341502 341176 340356 339589 339706 340783 341924 342432 342821
52652 342821 344129 346501 349064 351203 353285 355855 358613 360566 361000 359986 358089 355886 353744 351871
52638 351871 350476 349816 350065 351133 352688 354276 355440 355980 356323 357395 359722 362699 365189 366822 368241
52623 368241 370008 371735 372572 372126 370603 368423 366065 364033 362512 361149 359522 357765 356351 355381 354476
52608 354476 353453 352702 352661 353151 353425 352840 351355 349497 347973 347309 347660 348788 350120 351001 351126 350828 350777
52591 350777 351283 352050 352752 353635 355244 357627 360103 361908 362836 363235 363641 364481 365848 367331 368318 368696 369078
52574 369078 370032 371246 371855 371529 370821 370375 370284 370426 370940 371846 372487 371971 370190 367917 365780 363605 360984
52557 360984 358143 355864 354667 354325 354148 353593 352758 352376 353190 355110 357165 358480 359135 359777 360588 361137 361314
52540 361314 361824 363313 365240 366139 365161 363065 361433 361063 361406 361536 361295 361262 361859 362854 363734 364232 364433 364588
52522 364588 364927 365475 365965 366108 365994 366101 366872 368488 371019 374476 378569 382709 386483 389970 393506 397308
52506 397308 401311 405044 407530 407785 405715 402206 398096 393491 388409 383544 379735 376952 374532 372250
52492 372250 370467 369229 368011 366567 365404 365062 365325 365496 365192 364620 364270 364540 365484 366778 368031 369196
52476 369196 370469 371871 373246 374700 376587 378903 381087 382711 384126 386160 389343 393558 398184 402414
52462 402414 405704 408183 410435 412685 414401 414864 413886 411741 408699 405034 401232 397712 394368 390819 387153
52447 387153 384044 381947 380528 379123 377549 376138 374998 373584 371249 368122 365156 363188 362146 361342
52433 361342 360415 359610 359172 358908 358656 358815 359922 361735 363250 363803 363814 364116 364804 365173 364734 363836 363153 362998
52415 362998 363498 365074 368133 372329 376696 380703 384808 389812 396082 403663 412739 423565 436122 450088
52401 450088 464834 479114 491099 499330 503576 504398 502067 496440 487784 477068 465339 453350 441905
52388 441905 431953 424000 417775 412765 408815 406008 404271 403425 403422 404332 406209 409084 412891 417299 421861
52373 421861 426487 431571 437482 444042 450595 456393 460908 464019 466051 467401 468050 467659 466174 464059 461778
52358 461778 459350 456602 453671 451082 449459 449201 450173 451658 452820 453355 453565 453945 454967 457064 460266
52343 460266 463844 466952 469720 473057 477211 481346 484978 489036 494707 501829 509350 517041 525754 536026
52329 536026 547358 559154 571621 585354 600460 616471 632829 649195 665505 681954 698744
52318 698744 715620 731869 747009 761405 776011 791438 807399 823133 838380 853800 870294
52307 870294 887919 905680 922546 938513 954498 971305 988911 1006652 1023834 1040022 1054897
52296 1054897 1067956 1078464 1085779 1089792 1090997 1090123 1087738 1084147 1079478 1073820 1067403 1060657 1053930 1047198
52282 1047198 1040373 1033916 1028774 1025475 1023568 1022167 1020854 1019889 1019816 1021184 1024425 1029660 1036602 1044791 1053859
52267 1053859 1063552 1073826 1085032 1097659 1111609 1126042 1140204 1154148 1168311 1182688 1196885
52256 1196885 1210797 1224760 1239114 1253916 1268971 1283797 1297725 1310422 1322116 1332889 1341963
52245 1341963 1348340 1352041 1354036 1354851 1353997 1351130 1347154 1343615 1341255 1339685 1338301 1337014 1335985 1335121 1334182
52230 1334182 1333244 1332723 1332834 1333232 1333380 1333203 1333128 1333476 1334111 1334745 1335365 1336179 1337380 1339182 1341910 1345739 1350421
52213 1350421 1355434 1360433 1365493 1371000 1377342 1384484 1391876 1399056 1406408 1414814 1424391 1434073 1442873 1451067
52199 1451067 1459581 1468580 1477391 1485652 1493814 1502429 1511571 1521109 1531019 1541169 1551111 1560285 1568287 1574940
52185 1574940 1580305 1584541 1587455 1588317 1586492 1582163 1576019 1568298 1558686 1547174 1534475 1521402 1508312
52172 1508312 1495338 1482767 1470944 1460145 1450714 1443060 1437352 1433527 1431632 1431853 1434058 1437709 1442365
52159 1442365 1447874 1453875 1459475 1463736 1466285 1467310 1467256 1466667 1465955 1465021 1463396 1461004 1458524 1456767 1455929
52144 1455929 1455715 1455856 1456147 1456207 1455569 1453973 1451289 1447366 1442257 1436480 1430719 1425343 1420462 1416367 1413542
52129 1413542 1412284 1412669 1414962 1419734 1427421 1437987 1451194 1467007 1485497 1506449 1529314 1553596
52117 1553596 1579121 1605826 1633420 1661346 1688954 1715518 1740235 1762526 1782354 1800030 1815722
52106 1815722 1829505 1841993 1854382 1867454 1880853 1893813 1906395 1919534 1933924 1949325 1964926
52095 1964926 1979897 1993496 2005086 2014277 2020811 2024203 2023745 2019007 2010157 1997831 1982939 1966612 1949976
52082 1949976 1933836 1918761 1905406 1894447 1886194 1880596 1877568 1876938 1878086 1880172 1882863 1886493 1891485
52069 1891485 1898084 1906676 1917677 1930730 1944495 1957742 1970377 1983092 1996280 2009648 2022607 2034690
52057 2034690 2045708 2055751 2064961 2073207 2080199 2085920 2090496 2093505 2093938 2091199 2085705 2078147 2068603 2056866
52043 2056866 2043191 2028116 2011809 1994237 1975889 1957759 1940583 1924514 1909491 1895525 1882675
52032 1882675 1871127 1861135 1852488 1844215 1835400 1826286 1817979 1811032 1804836 1798459 1791456 1783635 1774666 1764412
52018 1764412 1753317 1742077 1731114 1720654 1711031 1702474 1694737 1687296 1679853 1672316 1664340 1655293 1644764
52005 1644764 1632803 1619447 1604208 1586244 1564952 1540343 1512912 1483405 1452658 1421539 1390891
51994 1390891 1361571 1334391 1309782 1287439 1266475 1246166 1226457 1207681 1189877 1172609 1155406
51983 1155406 1138200 1121345 1105252 1089908 1074554 1058026 1039744 1020340 1000987 982080 962942
51972 962942 942960 922665 903454 886587 872740 862290 855499 852322 852354 855256 861117 870144 881855
51959 881855 894739 906964 917469 926180 933050 937230 937510 933426 925645 915447 904123 892690 881615
51946 881615 870851 860574 851864 846133 843851 844384 847117 852028 859000 867293 876186 885449 894722 902991
51932 902991 909372 913949 917103 918308 916361 910648 901467 889226 874139 856834 838565 820426 802713
51919 802713 785174 767607 750193 733668 719203 707571 698214 689540 680472 671460 663778 658229 654899
51906 654899 653882 655714 660938 669487 680669 693727 708373 724718 742664 761380 779446 795346
51894 795346 807667 814991 816146 810896 800222 785598 768062 748336 727753 708527 692582 680326
51882 680326 671047 664442 661160 661713 665603 672195 681974 696116 714935 737565 763077 790919 819934
51869 819934 847895 872729 893643 910470 922496 928790 929404 925367 917464 905697 890064 871401
51857 871401 851295 831526 813581 798267 785580 775106 766571 759843 754579 750196 746117 741802 736723
51844 736723 730662 723962 717069 709869 701829 692796 683298 674020 665286 657110 649609 643332 639233 638071
51830 638071 639600 642570 645844 649308 653398 657962 662007 664386 664430 662139 658180 653490 648489 642982 637234
51815 637234 632596 630389 630547 632164 635032 639592 645607 652041 658188 663683 667293 667198 663161 657235 651429
51800 651429 645604 638537 630214 621946 614772 608930 604574 601877 600352 598962 597099 594920 592759 590782
51786 590782 589174 588037 587076 585938 584928 584789 585664 586670 586638 584957 581714 577577 573664 571078 570269 571049
51770 571049 573241 577036 582676 590239 599854 611740 625748 641105 656787 671954 685850 697529
51758 697529 705967 710391 710454 706263 698367 687587 674683 660272 645161 630538 617548 606603 597253
51745 597253 588817 581097 574559 569874 567343 566782 567926 570851 575901 583258 592764 604154 617227 631575
51731 631575 646134 659311 669825 677459 682887 686688 688704 688550 686601 684082 682030 680428 678508 675655
51717 675655 671728 666739 660747 654150 647688 641959 637146 633303 630595 628989 627968 627033 626483 627341 630355
51702 630355 635308 641512 648732 657304 667286 677724 686920 693502 697304 699350 701012 703110 705747 708787
51688 708787 712204 715796 718764 719869 718076 712933 704548 693570 681214 668925 657747 648178 640625
51675 640625 635666 633576 633857 635565 638050 641163 644825 648638 651983 654427 656097 657659 659794 662614
51661 662614 665692 668544 670681 671203 668967 663614 656134 648090 640633 634579 630892 630329 632780 637556 644119
51646 644119 651849 659317 664651 666753 665551 661029 652857 641213 627214 612221 597258 583312 571365
51633 571365 561586 553093 545119 537957 532303 528210 525276 523384 522485 522005 521284 520482 520291 520762 521114 520816
51617 520816 520254 520125 520660 521629 522649 523235 522947 521878 520750 520223 520176 519905 519024 517943 517462 518001 519362
51600 519362 521230 523748 527488 532972 540457 550181 562417 577048 593263 609933 626165 641303 654561
51587 654561 664957 671680 674407 673365 669282 663236 656456 650243 645979 644860 647461 653813 664048 678656
51573 678656 697913 721443 748771 780014 815511 854905 897161 941511 987963 1036830 1088193
51562 1088193 1141938 1197950 1256103 1316336 1378803 1443557 1509816 1575643 1638427 1695404 1743659
51551 1743659 1780072 1801711 1806439 1793223 1762199 1714727 1653277 1580990 1501190 1417152 1331992
51540 1331992 1248429 1168596 1094110 1026196 965629 912594 866785 827665 794634 766976 743836
51529 743836 724336 707713 693342 680648 669093 658288 648093 638589 629948 622359 615944 610629
51517 610629 606097 602000 598207 594794 591783 589032 586344 583557 580533 577222 573704 570005 565918 561289
51503 561289 556463 552118 548562 545567 542929 540785 539160 537776 536714 536817 538772 542043 545404 548460
51489 548460 551987 556624 561874 566600 570013 571819 571893 570320 567620 564441 561027 557232 553029 548699 544445
51474 544445 540158 535783 531725 528560 526348 524489 522411 520191 518275 516859 515893 515584 516338 518057 519953
51459 519953 521362 522418 523605 525026 526503 528100 529964 531744 532754 532808 532506 532658 533804 536322 540589
51444 540589 546884 555536 567244 582738 601774 622707 643362 662197 678514 691908 701952 708375
51432 708375 711282 711226 709189 706315 703245 699657 694627 687503 678315 667453 655278 642271 629288 617350
51418 617350 607100 598551 591399 585420 580540 576761 574282 573580 575073 578469 582626 586295 589059 591548
51404 591548 594689 598788 603246 607190 610358 613291 616593 620234 623771 627132 630842 635533 641621 649485
51390 649485 659478 671626 685766 702305 722530 747928 779551 818286 865282 921545 987320 1062248
51378 1062248 1145800 1237087 1334408 1435500 1538004 1639142 1734997 1820731 1891663 1944028 1975155
51367 1975155 1983790 1970405 1936713 1884786 1817035 1736825 1648263 1554996 1459605 1364294 1271604
51356 1271604 1184093 1103549 1030695 965454 907473 856733 813584 777834 747972 721906 698428
51345 698428 677372 658415 640690 623812 608372 594897 583057 572450 563423 556410 550933 546027
51333 546027 541317 537080 533549 530748 528695 527165 525522 523446 521572 520773 520999 521491 521891 522380 522846 522780
51317 522780 522088 521278 520670 520099 519604 519807 521260 523884 527305 531314 535723 540159 544296 548026 551197 553459
51301 553459 554584 554649 553750 551843 548982 545352 540864 535134 528185 520850 514120 508352 503436 499531 497122
51286 497122 496390 496881 497896 499068 500577 502995 506859 512219 518568 525313 532206 539190 545942 551873 556592
51271 556592 560214 563231 566227 569714 573929 578645 583306 587500 591320 595128 598918 601954 603122 601703
51257 601703 597812 592145 585454 578348 571369 564908 558970 553263 547599 542031 536561 531023 525517 520700
51243 520700 517252 515103 513477 511741 509919 508319 506952 505511 503790 501980 500634 500352 501266 502710 503670
51228 503670 503844 504079 505408 507747 509962 511252 511975 512862 513897 514474 514391 514056 513679 512939 511755 510892 511285
51211 511285 512967 515174 517443 520084 523467 527311 530997 534358 537805 541766 546263 550987 555511 559392
51197 559392 562301 564204 565291 565661 565211 563954 562318 560911 559996 559388 558880 558647 559095 560382 562175 563866
51181 563866 564992 565514 565707 565784 565645 565063 564120 563248 562733 562333 561605 560522 559539 559007 558755 558312 557406 556185
51163 556185 555081 554559 554814 555627 556571 557366 557881 557803 556654 554342 551432 548563 545772 542710 539395 536280
51147 536280 533571 530941 528049 524964 521894 518904 516185 514215 513149 512408 511487 511056 512473 515953 519896
51132 519896 522492 523570 524329 525606 527108 528263 529004 529482 529622 529467 529611 530795 533175 536339 539889 543612
51116 543612 547195 550331 553313 557058 562110 567789 572734 576285 579037 581876 584813 587068 588121 588248
51102 588248 587923 587136 585680 583846 582332 581457 580828 579912 578488 576457 573635 570116 566552 563637 561478
51087 561478 559810 558635 558178 558289 558433 558394 558621 559694 561736 564511 567757 571223 574571 577534 580067 582257
51071 582257 584228 586219 588575 591478 594822 598502 602676 607589 613280 619726 627258 636503 647762 660455
51057 660455 673337 685312 696019 705586 713932 720674 725921 730928 737550 746949 759009 772883 787689
51044 787689 802695 817335 831422 845068 858119 869870 879592 887083 892404 895262 895142 891979 886234
51031 886234 878103 866997 852099 833381 811888 789069 766014 743389 721947 702738 686560 673318
51019 673318 662267 653000 645980 641945 641035 642746 646492 651888 658521 665925 673894 682585 692102 702134
51005 702134 712195 722099 731978 741873 751526 760632 769145 777238 785142 793152 801634 810769 820398 830461
50991 830461 841598 854849 870480 887486 904562 921336 938252 955616 973337 991479 1010320
50980 1010320 1029701 1048895 1067364 1085133 1102177 1117938 1131759 1143335 1152385 1158518 1162048 1164640
50968 1164640 1168443 1174748 1184022 1196988 1214802 1238046 1266261 1298761 1335391 1376240 1421109 1469582
50956 1469582 1521219 1575236 1630257 1684842 1738181 1789989 1839849 1887074 1931202 1972369 2011112
50945 2011112 2048130 2084346 2120944 2159005 2198931 2240248 2281845 2322382 2360553 2395195 2425337
50934 2425337 2450190 2469142 2481866 2488437 2489223 2484481 2474017 2457273 2433703 2403010 2365121 2320146
50922 2320146 2268343 2210007 2145385 2074980 2000017 1922529 1844795 1768678 1695346 1625360 1558923
50911 1558923 1496196 1437512 1383277 1333753 1289001 1248898 1212917 1180072 1149581 1121617 1096933
50900 1096933 1075623 1056799 1039738 1024715 1012181 1001600 991815 982345 973638 966141 959793 954464
50888 954464 950258 947145 944787 942946 941736 941281 941494 942337 943964 946419 949478 952956 956906 961351 966188
50873 966188 971535 977909 985740 994931 1005109 1016101 1027891 1040363 1053441 1067376 1082566 1099187
50861 1099187 1117347 1137534 1160539 1186832 1216341 1249025 1285339 1325819 1370394 1418615 1470786
50850 1470786 1528501 1593699 1667256 1748784 1837731 1934116 2038005 2148759 2265313 2386951
50840 2386951 2513201 2642940 2774081 2904189 3030995 3152240 3265640 3369460 3462882 3545556
50830 3545556 3617167 3677808 3728551 3771206 3807681 3840065 3871211 3904552 3942958 3987909 4039749
50819 4039749 4098254 4162581 4230854 4300088 4366446 4425486 4472501 4503170 4514130 4502966 4467852
50808 4467852 4407620 4322233 4213062 4082650 3934403 3772409 3601017 3424177 3245275 3067748
50798 3067748 2895552 2732478 2580954 2441826 2315340 2201989 2102201 2015567 1940832 1876722
50788 1876722 1822615 1778356 1743521 1716922 1696802 1681433 1669445 1659669 1651023 1642840 1635105 1627894
50776 1627894 1620515 1611634 1600395 1587059 1572374 1556665 1539817 1521791 1502724 1482671 1461632 1439719
50764 1439719 1416979 1393164 1368093 1342206 1316413 1291349 1267121 1243824 1221958 1202214 1185066
50753 1185066 1170686 1159015 1149853 1143075 1138891 1137729 1139781 1144827 1152582 1162985 1176081 1191852 1210394
50740 1210394 1232080 1257290 1286038 1318076 1353397 1392470 1435874 1483789 1535825 1591225 1649180
50729 1649180 1709091 1770784 1834489 1900400 1968157 2036922 2106063 2175408 2244488 2311795 2375363
50718 2375363 2434013 2487348 2534327 2572596 2599962 2616302 2623586 2624265 2620137 2612647 2603542 2594974 2589268
50705 2589268 2588668 2594943 2608914 2630395 2658569 2692231 2729591 2768015 2804157 2834489 2855913 2866028
50693 2866028 2862856 2844464 2809332 2757326 2690160 2610710 2522047 2427160 2329037 2230496 2134074
50682 2134074 2042325 1957838 1882446 1816669 1760414 1713949 1677664 1651283 1634193 1626417 1628345 1639328
50670 1639328 1657399 1680623 1707992 1738635 1770971 1803287 1834639 1864491 1891856 1915501 1934995
50659 1934995 1950993 1964444 1975917 1985764 1994520 2002810 2010869 2018372 2024885 2030482 2035774 2041322 2047296
50646 2047296 2053952 2062204 2073348 2088271 2107315 2130737 2158863 2191757 2229208 2271117 2317435 2367607
50634 2367607 2420579 2475602 2532768 2592524 2654778 2718406 2781295 2840830 2894635 2940790 2977053
50623 2977053 3000204 3007009 2996172 2969050 2928639 2878564 2823001 2766437 2712697 2664342 2623026
50612 2623026 2589686 2564077 2544931 2531155 2522345 2517650 2514800 2511013 2504431 2493993 2478304 2455524
50600 2455524 2424342 2384501 2336434 2280953 2219225 2152643 2082622 2010697 1938527 1867480 1798422
50589 1798422 1732185 1669878 1612255 1559170 1510215 1465677 1426337 1392473 1363585 1338985 1318234
50578 1318234 1301181 1288117 1279715 1276283 1277109 1280970 1287217 1295891 1306883 1319468 1332655 1345521 1357249
50565 1357249 1367384 1376148 1384232 1392258 1400716 1410333 1422081 1436746 1454731 1476099 1500569 1527628
50553 1527628 1557003 1588906 1623438 1659899 1696965 1733299 1767671 1798969 1826799 1851954 1875674
50542 1875674 1898539 1920588 1942363 1965131 1990103 2018084 2049877 2086294 2127577 2173396 2223679
50531 2223679 2279083 2340519 2408625 2483741 2565964 2655116 2751019 2853773 2963226 3078130 3196296
50520 3196296 3315632 3434449 3550648 3661214 3762922 3853340 3931026 3994984 4043988 4076263
50510 4076263 4090035 4084699 4061264 4021254 3965662 3895643 3813843 3724004 3629376 3532613 3437217
50499 3437217 3347759 3268164 3200647 3146669 3107814 3085095 3078220 3086135 3107328 3138894 3176164 3214220
50487 3214220 3249068 3276572 3291362 3288395 3265417 3222759 3161115 3081071 2984899 2877269 2763310
50476 2763310 2646590 2529308 2413573 2301698 2195589 2096371 2004438 1919595 1841352 1769340
50466 1769340 1703304 1642810 1587363 1536977 1492170 1453080 1418886 1388491 1361586 1338738 1320521
50455 1320521 1306811 1296892 1290031 1285862 1284280 1285042 1287613 1291486 1296603 1303264 1311612 1321372 1332107 1343489
50441 1343489 1355277 1367198 1379005 1390504 1401377 1411085 1419155 1425595 1430942 1435837 1440609 1445268 1449830
50428 1449830 1454536 1459765 1465819 1472886 1481115 1490610 1501395 1513570 1527587 1544229 1564152 1587512
50416 1587512 1614169 1644280 1678583 1717951 1762608 1811853 1864597 1920155 1978391 2039254 2102437
50405 2102437 2167479 2233720 2299921 2364292 2425311 2482247 2534460 2580472 2618290 2646422 2663890
50394 2663890 2669437 2661788 2640962 2608446 2565588 2512635 2450027 2379972 2305824 2230278 2155011 2081884
50382 2081884 2013456 1952200 1899850 1857629 1826302 1805700 1794737 1792227 1797287 1808626 1823949 1840425
50370 1840425 1855475 1866808 1872207 1869909 1859154 1839988 1812665 1777614 1735893 1689136 1638926 1586551
50358 1586551 1533407 1481110 1430845 1382864 1337031 1293709 1253751 1217651 1185133 1155673 1129159
50347 1129159 1105894 1086128 1069680 1055725 1042953 1030377 1018295 1008146 1001005 996428 993143 990598
50335 990598 989226 989360 990601 992469 995040 998549 1002710 1006834 1010481 1013811 1017468 1022203 1028359 1035560
50321 1035560 1043181 1051165 1059994 1069716 1079499 1088452 1096468 1103890 1110807 1117195 1123409 1129935 1136770 1143602
50307 1143602 1150503 1157886 1165838 1174075 1182680 1192355 1203863 1217572 1233663 1252260 1273125 1295579
50295 1295579 1318976 1343006 1367379 1391465 1414433 1435414 1453368 1467200 1476438 1481718 1484258 1484892
50283 1484892 1483624 1479800 1472389 1460350 1443418 1422740 1400431 1378252 1356841 1336318 1317306 1301027
50271 1301027 1288454 1279674 1274097 1271032 1269885 1270026 1270788 1271611 1272083 1271831 1270609 1268524 1265956 1263139 1259981
50256 1259981 1256491 1253260 1251199 1250712 1251330 1252220 1252929 1253429 1253676 1253508 1253094 1253084 1253967 1255464 1257013 1258785 1261662
50239 1261662 1265955 1270711 1274725 1277863 1280790 1283701 1286095 1287752 1289080 1290193 1290396 1289092 1286702 1284084
50225 1284084 1281352 1277843 1273092 1267311 1260915 1254119 1247046 1239896 1232860 1226171 1220350 1216187 1214338 1214987
50211 1214987 1217925 1222801 1229365 1237675 1248144 1261247 1277072 1295157 1314782 1335413 1356957 1379642
50199 1379642 1403599 1428584 1454223 1480479 1507577 1535217 1562057 1586125 1605693 1619656 1627252
50188 1627252 1627675 1620065 1603981 1580091 1550355 1517214 1482464 1447169 1412604 1380616 1352625 1328714
50176 1328714 1308164 1290616 1276248 1265132 1256885 1250685 1245015 1237582 1226298 1210583 1191393 1170060
50164 1170060 1147602 1125021 1103481 1083831 1066315 1050945 1037791 1026850 1018084 1011728 1008155 1007288
50152 1007288 1008560 1011554 1016112 1021604 1026698 1030319 1032423 1033360 1032853 1030104 1024640 1016593 1006365 994603
50138 994603 982368 970778 960417 951460 944348 939839 938279 939214 941894 945750 950278 954876 959192 963413
50124 963413 967811 972142 975943 979423 983570 989086 995506 1001778 1007576 1013558 1020325 1027671 1035180 1043118
50110 1043118 1052140 1062304 1072955 1083633 1094566 1106072 1118047 1130435 1143817 1158946 1175765
50099 1175765 1193394 1211133 1229184 1248342 1269417 1293179 1320555 1352431 1389136 1430322 1475395
50088 1475395 1523973 1575798 1630424 1687278 1746174 1807512 1871707 1938443 2006796 2076041 2145893
50077 2145893 2215615 2283168 2345659 2400540 2445953 2480065 2500872 2507197 2499523 2479300 2447655 2405307
50065 2405307 2353575 2294653 2230631 2162940 2093118 2023449 1956103 1891995 1831222 1774361 1722459
50054 1722459 1675787 1633569 1595207 1560910 1530620 1503167 1477298 1453118 1431747 1413739 1398512
50043 1398512 1385259 1373899 1365169 1360187 1359685 1363117 1368669 1374818 1381800 1390904 1402382 1414869 1426989
50030 1426989 1438647 1450314 1461766 1472260 1481471 1489554 1496366 1501234 1503531 1503142 1500343 1495469 1488747
50017 1488747 1480269 1470143 1458618 1445815 1431220 1413841 1393249 1370321 1346610 1323110 1299969
50006 1299969 1277249 1255447 1235177 1216775 1200507 1186930 1176779 1170572 1168563 1171004 1178219 1190229
49994 1190229 1206355 1225230 1245187 1264732 1282907 1299503 1314902 1329453 1342814 1354040 1362439
49983 1362439 1368158 1371749 1373393 1372914 1370472 1366878 1363155 1360166 1358780 1359938 1364176 1371241 1380581 1392234
49969 1392234 1406949 1425290 1446755 1470015 1494069 1519047 1545740 1574447 1604537 1635263 1666639
49958 1666639 1699239 1733240 1767989 1802366 1835100 1864666 1889338 1907693 1919036 1923291 1920627 1911190
49946 1911190 1895034 1872280 1843518 1810025 1773352 1734692 1694832 1654616 1614944 1576210 1538089
49935 1538089 1500009 1461502 1422019 1380949 1338181 1294366 1250302 1206370 1162966 1121225 1082790
49924 1082790 1048753 1019091 993153 970475 951057 935045 922273 912258 904610 899284 896177 894607
49912 894607 893611 892789 892518 893297 895367 899084 905067 913607 924321 936838 951451 968634 988211 1009593
49898 1009593 1032573 1057281 1083291 1109233 1133409 1154537 1171922 1185172 1193818 1197117 1194531 1186602
49886 1186602 1174980 1161014 1144551 1124651 1101341 1075999 1050058 1024032 997968 972178 947118
49875 947118 922970 899771 877780 857530 839657 824720 812860 803521 795827 789369 784349 780941
49863 780941 778993 778521 780002 783837 789919 798048 808430 821372 836754 854174 873388 894192 916083
49850 916083 938449 960926 983153 1004311 1023301 1039387 1052311 1061937 1068178 1071170 1070971 1067117 1059007
49837 1059007 1046905 1032083 1015729 998155 979343 959857 940771 922975 906954 893115 881917
49826 881917 873656 868354 865847 865806 867838 871827 878170 887449 899964 915745 934745 956577 980207
49813 980207 1004459 1028979 1054226 1080310 1106149 1129991 1150492 1167127 1179970 1189410 1195823 1199208
49801 1199208 1199314 1196257 1190624 1182678 1171964 1158254 1142480 1125980 1108980 1090656 1070720 1050141
49789 1050141 1030131 1011205 993542 977445 962894 949364 936816 926295 918655 913012 907412 900965
49777 900965 894410 888552 883203 878124 874188 872761 874319 878303 884230 892272 902669 915012 928340
49764 928340 941743 954699 966968 978313 988374 996857 1003793 1009427 1013695 1015947 1015358 1011498 1004236
49751 1004236 993223 977943 958562 936464 913656 891679 871262 852839 836943 823883 813304
49740 813304 804351 796355 789279 783508 779272 776286 773927 771786 770022 769067 769011 769504 770329 771802 774337
49725 774337 777857 782018 787041 793888 803426 815649 829893 845589 862518 880474 898930 917053
49713 917053 933886 948514 960232 968589 973286 974202 971681 966631 959952 951812 941784 929836 916869
49700 916869 904045 891772 879715 867676 856041 845286 835464 826434 818280 811157 804991 799760 795933
49687 795933 794134 794304 795713 797961 801568 807369 815652 826180 838717 853158 869348 887175 906660
49674 906660 927698 949820 972418 994894 1016245 1034846 1049295 1059440 1066206 1070536 1073025 1074426
49662 1074426 1075748 1077594 1079809 1081918 1083437 1083615 1081258 1075105 1064206 1048069 1026929 1001993 974951
49649 974951 947099 919258 892470 868088 846944 828966 813852 801566 791971 784574 778990 775127
49637 775127 772575 770448 768331 766766 766234 766121 765359 763639 761272 758212 754034 748706 742653 736093 728994
49622 728994 721644 714677 708454 702854 697649 692733 688109 684102 681391 680306 680193 680013 679415 678749 678290
49607 678290 678161 678854 680917 683974 686787 688501 689249 689460 689321 689075 689078 689142 688537 687067 685618 685110 685387 685637
49589 685637 685486 685143 684779 684411 684321 685053 686833 689279 691712 693691 695326 697217 699960 703636 707922 712752
49573 712752 718586 725943 734951 745531 757665 771268 786098 802150 819817 839110 858741 876464
49561 876464 890528 900609 907200 910348 909330 903673 894242 883029 871815 861255 851332 842280 834666
49548 834666 828783 824431 821368 819567 819007 819474 820566 821651 821970 821275 820365 820479 822029 824341 826708 829235
49532 829235 832572 837348 844048 852836 863155 874089 885536 898558 914170 932200 951798 972506
49520 972506 994137 1015950 1036789 1055976 1073370 1088640 1101258 1111489 1120768 1130674 1141812 1153881
49508 1153881 1166446 1179251 1191855 1203288 1212112 1216767 1215952 1208883 1195442 1176281 1152819 1126896
49496 1126896 1100171 1073806 1048741 1025972 1006228 989470 975043 962419 951483 942085 933679 925700
49484 925700 918171 911635 906518 902787 900202 898607 897802 897361 896919 896623 897053 898604 901148 904350 908054
49469 908054 912246 916953 922436 929182 937342 946348 955516 964865 974852 985338 995335 1003878 1010618 1015408
49455 1015408 1017797 1017314 1013928 1007929 999583 989272 977810 966196 955013 944157 933184 921914
49443 921914 910788 900673 892243 885538 880196 875934 872651 870334 869308 870365 874040 879760 886309 893206
49429 893206 901119 910869 922774 937137 954538 975225 998833 1025166 1054540 1086713 1120007 1152144
49417 1152144 1181473 1206606 1225386 1235335 1235428 1227024 1213196 1197572 1183386 1172740 1166550 1165412 1170147
49404 1170147 1181012 1196781 1215548 1236332 1259217 1284085 1310161 1336748 1363437 1389435 1413670
49393 1413670 1435830 1456366 1474996 1490081 1500123 1505117 1505669 1501456 1491580 1476182 1456800 1435134
49381 1435134 1412223 1388923 1366429 1345930 1328066 1313021 1300917 1291894 1285994 1283165 1283254 1285804 1289859
49368 1289859 1294156 1297552 1299314 1299004 1296246 1290763 1282641 1272437 1260841 1248230 1234592 1219887 1204404
49355 1204404 1188753 1173442 1158400 1143002 1126818 1110422 1095201 1082182 1071244 1061663 1053092 1045659
49343 1045659 1039293 1033495 1027879 1022588 1018076 1014579 1011770 1008721 1004432 998741 992673 987463 983307 979445
49329 979445 975452 971842 969248 967531 966132 964958 964496 965220 967162 970037 973547 977527 981836 986147 989981
49314 989981 993212 996368 1000058 1004122 1007830 1011026 1014506 1018951 1023949 1028500 1032185 1035343 1038341 1041237
49300 1041237 1044174 1047587 1051798 1056658 1061833 1067401 1073996 1082253 1091992 1102057 1111190 1119137 1126652 1134391
49286 1134391 1142137 1149320 1155908 1162387 1169011 1175567 1181906 1188379 1195653 1204270 1214487 1226396 1240089
49273 1240089 1255636 1272772 1290633 1308141 1324892 1341458 1358490 1375642 1391702 1405720 1417683
49262 1417683 1428132 1437523 1446031 1453722 1460846 1468250 1477421 1489734 1505610 1524824 1547634 1574828
49250 1574828 1606147 1639222 1670787 1698579 1721311 1737139 1743496 1738943 1724353 1701629 1671912 1635916
49238 1635916 1595595 1554353 1515408 1480548 1450493 1425691 1406413 1392728 1384815 1382799 1385790 1391564
49226 1391564 1397866 1403924 1410176 1416690 1422510 1426605 1428940 1430427 1432156 1434794 1438351 1442292 1446089 1449885
49212 1449885 1454576 1461208 1470348 1481953 1495576 1510665 1526868 1544127 1562355 1581057 1599454 1616931
49200 1616931 1633211 1648165 1661732 1673984 1684989 1694573 1702371 1708106 1711617 1712883 1712420 1711424 1710911
49187 1710911 1710673 1709704 1707778 1706006 1705628 1707012 1710263 1716131 1725600 1739050 1756636 1779306 1808695 1846075
49173 1846075 1892123 1947636 2013467 2089070 2171403 2255610 2336574 2409606 2470186 2514045 2538180
49162 2538180 2542099 2528231 2501187 2466371 2428706 2391984 2358724 2330296 2307203 2289441 2276657
49151 2276657 2267949 2261813 2256727 2251971 2247698 2244227 2241538 2239638 2239118 2240908 2245451 2252324 2260702 2270010
49137 2270010 2280088 2290995 2302860 2315838 2329933 2344826 2360032 2375337 2390995 2407441 2424866
49126 2424866 2443070 2461604 2480062 2498347 2516805 2535992 2556197 2577213 2598652 2620468 2643185
49115 2643185 2667732 2695121 2726079 2760999 2800500 2846200 2900665 2966239 3043916 3133343 3233584
49104 3233584 3343469 3461442 3585391 3712421 3838451 3958404 4067570 4162664 4240751 4297176
49094 4297176 4325845 4322639 4288419 4228339 4148548 4053900 3948090 3834710 3717618 3600597 3486978
49083 3486978 3379602 3281088 3194003 3120313 3060321 3012360 2973914 2942958 2918106 2897907 2880738
49072 2880738 2865369 2851044 2836872 2821709 2805069 2787864 2771690 2757342 2744223 2731315 2718449
49061 2718449 2706373 2695710 2686257 2677591 2669965 2664025 2659640 2655677 2651236 2646589 2642483 2638926 2635283
49048 2635283 2631353 2627606 2624313 2621071 2617496 2614032 2611838 2612051 2615368 2622101 2632476 2646906 2666090
49035 2666090 2690660 2720538 2754602 2790958 2827560 2862651 2894697 2921988 2942476 2954440 2957519
49024 2957519 2952902 2942299 2927009 2908170 2887422 2866554 2846515 2827389 2809414 2793401 2779888
49013 2779888 2768444 2758223 2748879 2740504 2732985 2725961 2719417 2713896 2709987 2707764 2706741 2706181 2705530 2704764
48999 2704764 2704377 2704800 2705711 2706060 2704939 2702327 2698851 2694895 2690244 2684679 2678563 2672463 2666376 2659818 2652697
48984 2652697 2645602 2638984 2632588 2626143 2620227 2615823 2613084 2611190 2609411 2607792 2606598 2605659 2604609 2603524
48970 2603524 2602916 2603151 2603987 2604701 2604701 2604189 2604138 2605406 2607938 2611203 2615268 2620887 2628449 2637452 2647333 2658301
48954 2658301 2670894 2685126 2700645 2717530 2736376 2757618 2781119 2806357 2832684 2859415 2886059
48943 2886059 2912510 2938907 2965430 2992431 3020577 3050446 3082074 3115257 3150248 3187810 3228564
48932 3228564 3272632 3319882 3370117 3422921 3477708 3534131 3592293 3652493 3715064 3780495 3849266
48921 3849266 3921293 3995738 4071527 4147812 4223784 4298356 4370364 4439029 4503957 4564898 4621806
48910 4621806 4674980 4724761 4771023 4813261 4851304 4885756 4917608 4947531 4975670 5001988 5026566
48899 5026566 5049470 5070372 5088479 5103028 5113928 5121913 5127991 5132747 5136110 5137706 5137342 5135167 5131475
48886 5131475 5126434 5120070 5112426 5103544 5093172 5080666 5065490 5047779 5028133 5006743 4982986 4955958
48874 4955958 4925139 4890288 4850959 4806475 4756394 4700792 4640226 4575617 4508141 4438931 4368904
48863 4368904 4299070 4230827 4165556 4103836 4045396 3989883 3937345 3887873 3841292 3797537 3756972
48852 3756972 3719814 3685425 3652727 3621394 3592233 3566222 3543545 3523810 3506964 3493533 3483870
48841 3483870 3477472 3473350 3471036 3470985 3473838 3479473 3487077 3496084 3506676 3519219 3533595 3549405 3566552
48828 3566552 3585153 3604963 3625384 3646149 3667540 3689690 3712035 3733837 3755117 3776705 3799353
48817 3799353 3823037 3847123 3871015 3894515 3917706 3940656 3963281 3985469 4007278 4029013 4051118
48806 4051118 4074016 4097989 4123103 4149295 4176659 4205633 4236761 4270163 4305340 4341521 4378034
48795 4378034 4414225 4449243 4482184 4512532 4540274 4565504 4587986 4607127 4622358 4633545 4641054
$$ [...]
##END NTUPLES=NMR SPECTRUM
##END=
