##TITLE=AC1566_ROEFFECT0020_8270576_CZUkxUbiX8
##JCAMPDX= 6.0         $$ Bruker NMR JCAMP-DX V2.0
##DATA TYPE= NMR SPECTRUM
##DATA CLASS= NTUPLES
##ORIGIN= BRUKER
##OWNER= Administrator
$$ 1.72 TOPSPIN		Version 2.1
$$ 2013-10-18 17:03:29.147 -0700  Administrator@X
$$ Compression mode = diff/dup
##.OBSERVE FREQUENCY= 400.02188249412
##.OBSERVE NUCLEUS= ^1H
##.ACQUISITION MODE= SIMULTANEOUS (DQD)
##.ACQUISITION SCHEME= undefined
##.AVERAGES= 8
##.DIGITISER RES= 22
##SPECTROMETER/DATA SYSTEM= spect
##.PULSE SEQUENCE= zg30
##.SOLVENT NAME= COFFEE_meoh
##.SHIFT REFERENCE= INTERNAL, COFFEE_meoh, 1, 14.98509
##AUDIT TRAIL= $$ (NUMBER, WHEN, WHO, WHERE, PROCESS, VERSION, WHAT)
$$ ##TITLE= Audit trail, TOPSPIN		Version 2.1
$$ ##JCAMPDX= 5.01
$$ ##ORIGIN= Bruker BioSpin GmbH
$$ ##OWNER= Administrator
$$ $$ E:\/data/COFFEE/nmr/AC1566_ROEFFECT0020_8270576_CZUkxUbiX8/10/pdata/1/auditp.txt
$$ ##AUDIT TRAIL=  $$ (NUMBER, WHEN, WHO, WHERE, PROCESS, VERSION, WHAT)
(   1,<2013-10-18 17:03:22.272 -0700>,<Administrator>,<X>,<go>,<TOPSPIN 2.1>,
      <created by zg
	started at 2013-10-18 17:02:16.209 -0700,
	POWCHK enabled, PULCHK disabled,
       configuration hash MD5:
       C8 4E 4E 5D D3 5C D8 9E 9F 52 82 E0 59 8A DE 15
       data hash MD5: 64K
       30 AF 52 A5 91 A5 2B 4A 81 94 28 87 05 1C 68 87>)
(   2,<2013-10-18 17:03:25.256 -0700>,<Administrator>,<X>,<proc1d>,<TOPSPIN 2.1>,
      <Start of raw data processing
       efp LB = 0 FT_mod = 6 PKNL = 1 PHC0 = 0 PHC1 = 0 SI = 32K 
       data hash MD5: 32K
       69 82 9C 3E 54 EF 27 06 26 E0 8F 15 EC F3 B0 EE>)
(   3,<2013-10-18 17:03:25.584 -0700>,<Administrator>,<X>,<proc1d>,<TOPSPIN 2.1>,
      <pk PHC0 = 95.46021 PHC1 = 0 
       data hash MD5: 32K
       9A 48 74 AB D5 3E C5 64 86 8C B0 2A B6 F2 43 13>)
(   4,<2013-10-18 17:03:25.709 -0700>,<Administrator>,<X>,<proc1d>,<TOPSPIN 2.1>,
      <abs ABSG = 1 
       data hash MD5: 32K
       97 47 C0 AE 05 AC 34 BD C2 D3 41 E9 87 15 28 B3>)
(   5,<2013-10-18 17:03:25.819 -0700>,<Administrator>,<X>,<proc1d>,<TOPSPIN 2.1>,
      <abs ABSG = 2 
       data hash MD5: 32K
       1C A8 9A 2C 0E 2F 90 0F AF 11 B2 38 6F B2 D1 6B>)
(   6,<2013-10-18 17:03:25.897 -0700>,<Administrator>,<X>,<proc1d>,<TOPSPIN 2.1>,
      <abs ABSG = 3 
       data hash MD5: 32K
       39 75 A9 08 16 50 0B 5C C6 A4 9F 28 96 AB 0D 23>)
(   7,<2013-10-18 17:03:25.944 -0700>,<Administrator>,<X>,<proc1d>,<TOPSPIN 2.1>,
      <abs ABSG = 4 
       data hash MD5: 32K
       2D CB A1 E8 31 FA AF AF 2A 71 FA BD BB E4 CF 12>)
(   8,<2013-10-18 17:03:26.022 -0700>,<Administrator>,<X>,<proc1d>,<TOPSPIN 2.1>,
      <abs ABSG = 5 
       data hash MD5: 32K
       03 6E 9E 3A A5 E1 4B CD AE AC 20 22 D6 F6 21 94>)
$$ ##END=
$$ 
$$ $$ hash MD5
$$ $$ 3B 25 E5 74 BA B9 1D C3 67 A5 17 CB AD 74 07 AA
##$RELAX= 
##$RELAX= 
##$RELAX= 
##$RELAX= 
##$RELAX= 
##$RELAX= 
##$RELAX= 
$$ Bruker specific parameters
$$ --------------------------
##$DU= <E:\>
##$EXPNO= 10
$$ [...]
150 150 150 150 150 150 150 150
##$TP07= 0
##$TPNAME0= <>
##$TPNAME1= <>
##$TPNAME2= <>
##$TPNAME3= <>
##$TPNAME4= <>
##$TPNAME5= <>
##$TPNAME6= <>
##$TPNAME7= <>
##$TPOAL= (0..7)
0.5 0.5 0.5 0.5 0.5 0.5 0.5 0.5
##$TPOFFS= (0..7)
0 0 0 0 0 0 0 0
##$TUNHIN= 0
##$TUNHOUT= 0
##$TUNXOUT= 0
##$USERA1= <user>
##$USERA2= <user>
##$USERA3= <user>
##$USERA4= <user>
##$USERA5= <user>
##$V9= 5
##$VALIST= <valist>
##$VCLIST= <CCCCCCCCCCCCCCC>
##$VD= 0
##$VDLIST= <DDDDDDDDDDDDDDD>
##$VPLIST= <PPPPPPPPPPPPPPP>
##$VTLIST= <TTTTTTTTTTTTTTT>
##$WBST= 1024
##$WBSW= 4
##$XGAIN= (0..3)
0 0 0 0
##$XL= 0
##$YL= 0
##$YMAX_a= 640684
##$YMIN_a= -545212
##$ZGOPTNS= <>
##$ZL1= 120
##$ZL2= 120
##$ZL3= 120
##$ZL4= 120
##$ABSF1= 14.98509
##$ABSF2= -5.573092
##$ABSG= 5
##$ABSL= 3
##$ALPHA= 0
##$AQORDER= 0
##$ASSFAC= 0
##$ASSFACI= 0
##$ASSFACX= 0
##$ASSWID= 0
##$AUNMP= <proc_prof1d_extract_pilot.lims>
##$AXLEFT= 0
##$AXNAME= <>
##$AXNUC= <1H>
##$AXRIGHT= 0
##$AXTYPE= 0
##$AXUNIT= <>
##$AZFE= 0.1
##$AZFW= 0.1
##$BCFW= 0
##$BC_mod= 0
##$BYTORDP= 0
##$COROFFS= 0
##$CY= 15
##$DATMOD= 1
##$DC= 0
##$DFILT= <>
##$DTYPP= 0
##$F1P= 0
##$F2P= 0
##$FCOR= 0.5
##$FTSIZE= 32768
##$FT_mod= 6
##$GAMMA= 0
##$GB= 0
##$INTBC= 1
##$INTSCL= 1
##$ISEN= 128
##$LB= 0
##$LEV0= 0
##$LPBIN= 0
##$MAXI= 10000
##$MC2= 0
##$MEAN= 0
##$ME_mod= 0
##$MI= 0
##$NCOEF= 0
##$NC_proc= -8
##$NLEV= 6
##$NOISF1= 0
##$NOISF2= 0
##$NSP= 0
##$NTH_PI= 0
##$NZP= 0
##$OFFSET= 14.98509
##$PC= 1
##$PHC0= 95.46021
##$PHC1= 0
##$PH_mod= 1
##$PKNL= yes
##$PPARMOD= 0
##$PPDIAG= 0
##$PPIPTYP= 0
##$PPMPNUM= 2147483647
##$PPRESOL= 1
##$PSCAL= 4
##$PSIGN= 0
##$PYNMP= <proc.py>
##$REVERSE= no
##$SF= 400.02
##$SI= 32768
##$SIGF1= 0
##$SIGF2= 0
##$SINO= 400
##$SIOLD= 32768
##$SPECTYP= <>
##$SREGLST= <1H.CDCl3>
##$SSB= 0
##$STSI= 32768
##$STSR= 0
##$SW_p= 8223.68421052631
##$SYMM= 0
##$S_DEV= 0
##$TDeff= 65536
##$TDoff= 0
##$TI= <>
##$TILT= no
##$TM1= 0
##$TM2= 0
##$TOPLEV= 0
##$USERP1= <user>
##$USERP2= <user>
##$USERP3= <user>
##$USERP4= <user>
##$USERP5= <user>
##$WDW= 1
##$XDIM= 32768
##$YMAX_p= 465570678
##$YMIN_p= -754778
##$CURPLOT= <Network HP LaserJet P1505>
##$CURPRIN= <$Network HP LaserJet P1505>
##$DFORMAT= <normdp>
##$LAYOUT= <+/1D_H.xwp>
##$LFORMAT= <normlp>
##$PFORMAT= <normpl>
##$SURQMSG= 1
$$ End of Bruker specific parameters
$$ ---------------------------------
##NTUPLES= NMR SPECTRUM
##VAR_NAME=  FREQUENCY,     SPECTRUM/REAL,   SPECTRUM/IMAG
##SYMBOL=    X,             R,               I
##VAR_TYPE=  INDEPENDENT,   DEPENDENT,       DEPENDENT
##VAR_FORM=  AFFN,          ASDF,            ASDF
##VAR_DIM=   32768,         32768,           32768
##UNITS=     HZ,            ARBITRARY UNITS, ARBITRARY UNITS
##FACTOR=    0.250966925370066, 1,           1
##FIRST=     8223.43324360094, -93766,       -156881
##LAST=      0,             1376,            -105240
##MIN=       0,             -754778,         0
##MAX=       8223.43324360094, 465570678,    0
$$ Real data points
##PAGE= N=1
##DATA TABLE= (X++(R..R)), XYDATA
$$ [...]
$$ plain form
19532 -45395 40203 -254803 -131497 82168 -264225 -17052 -161765 -208332 -169736 -168283 -232685
19521 -232685 -134766 -167680 -74834 -4997 -379153 -181125 -220562 238596 128139 315227 308988
19510 308988 -267423 -218534 48354 -407218 -235539 -182584 -278595 -309871 -22934 67846 -231873
19498 -263682 -210260 -257585 -171502 349352 120646 -189863 222350 85607 -176181 172912
19487 -77041 -510875 -200008 113685 -139374 98854 -92091 -148852 -392644 -160288 -227423
19477 -227423 -28865 37042 78888 -282692 -99262 106120 -178784 -4628 105976 70863 -220729
19465 -191051 331155 135138 -13009 -65392 -53836 -142561 143867 -114265 -145124 -32925 -1352
19453 71701 -297873 -358357 -26909 -37495 156982 -81172 79942 -67984 -118601 173976 -241118
$$ packed form
19532d5395D0203b54803J23306H2168b64225a7052j44713m6567L8596J453o4402
19521b32685R7919l2914g4834d997l74156a81125l9437B38596j10457J87088o239
19510C08988b67423M8889D8354d07218J71679N2955r6011l1276b2934F7846b31873
19498b63682N3422m7325Q6083C49352A20646a89863B22350H5607a76181A72912
19487g7041m33834b00008A13685a39374I8854i2091n6761k43792a60288o7135
19477b27423b8865C7042M1846b82692i9262A06120a78784d628A05976l5113b20729
19465a91051C31155A35138a3009n2383J1556q8725A43867a14265l0859c2925a352
19453G1701b97873o0484b6909j0586A56982h1172G9942f7984n0617A73976b41118
$$ plain form
19441 -236248 280274 41769 -10332 -334911 -214185 50295 -215773 168449 -22654 167276
19430 -132270 82072 72995 -25519 -140984 -176392 223836 132708 -454550 -144132 -188831 -274862
19419 -274862 236441 -11499 -147499 3625 355571 352945 -117588 -64719 -332 41548 11405
19407 -180981 161063 148414 -141627 -121053 18856 -155878 126078 102464 -128403 167772
19396 302177 -89739 142206 146630 52424 14473 -217220 -324321 -148963 -9665 34249 100978
19385 100978 -464348 -268785 102235 -227656 -95841 -26949 -344335 -440682 -190338 67917
19374 -178588 -103926 27497 194420 -277210 375689 -113433 113498 40858 -326453 -335691
19364 -335691 -173699 -55404 -97407 118477 -304475 184315 17555 -49022 -79665 72559 -57974
$$ packed form
19441b36248B80274D1769a0332l24579J20726E0295b15773A68449b2654A67276
19430a32270H2072r077b5519j15465l5408B23836r1128d54550a44132m4699q6031
19419b74862B36441a1499j36000C625L51946k626a17588N2869c32D1548A1405
19407a80981A61063j2649a41627K0574A8856a55878A26078k3614a28403A67772
19396C02177h9739A42206M424E2424A4473b17220j07101a48963i665C4249O6729
19385A00978d64348J95563A02235b27656i5841b6949l17386r6347a90338F7917
19374a78588P4662B7497J66923b77210C75689a13433A13498D0858c26453r238
19364c35691J61992e5404m2003A18477c04475A84315A7555d9022l0643G2559e7974
$$ plain form
19352 -277928 40940 -62943 -228166 127973 -250478 89949 -6659 211707 56138 -311306 -65012
19340 -95831 2941 -51205 -183528 -79844 -314114 158050 60922 170045 -260814 212698 -215460
19328 -115816 -19640 198812 -29706 -354540 -230407 -67025 -370546 -84042 33729 227048
19318 227048 -250089 161067 -167254 88731 -341364 -188293 137006 -90036 34255 285830
19308 285830 5707 120184 -92235 -273950 -102667 -363799 -84020 -49539 17666 260379 -7614
19296 -183167 28969 -292275 -372099 -232806 65650 87230 -391860 20491 240426 171478 -216900
19284 -35660 11133 -222089 66401 122436 -151873 -137570 -102463 -139111 147798 -296657 3743
19272 227491 -163306 -125814 -236068 -264531 -230855 151215 20810 -201588 -128107 -240651
$$ packed form
19352b77928D0940f2943j65223A27973b50478H9949f659B11707E6138c11306f5012
19340i5831B941e1205j32323g9844k34270A58050F0922J09123b60814B12698b15460
19328a15816a9640A98812b9706l24834J24133f7025l03521h4042C3729J93319
19318B27048b50089A61067a67254H8731c41364J53071A37006i0036C4255K51575
19308B85830E707J14477i2235j81715a02667k61132h4020L4481A7666K42713g614
19296a83167B8969b92275p9824J39293F5650K1580c91860B0491K19935o8948b16900
19284c5660A1133b22089F6401N6035a51873J4303L5107l6648A47798b96657C743
19272B27491a63306L7492j10254k8463L3676A51215B0810b01588P3481j12544
$$ plain form
19262 -240651 99728 -195839 -98714 -184237 -402009 -246141 -101761 -313869 -116133 40367
19251 81367 72971 -320683 -81790 24274 9943 -186077 -437321 -179440 -189432 -388257 29665
19239 -249612 -24716 -60297 -309535 140010 -349201 175025 -110259 -318534 -46802 -349237
19229 -349237 29086 291650 -52909 -136238 7527 161135 270142 -309193 -65478 24854 270697
19218 270697 -60110 141725 -16528 2091 103269 80477 -39088 -413070 -202035 -260989 109597
19206 38485 -44601 -56404 434490 60791 -356053 10806 -115416 46727 -134158 28914 86728
19195 86728 -136089 -13513 -141330 73319 268421 -17079 93544 -118174 -64342 -107538 26000
19183 -234463 -64734 116728 -110276 40965 -521360 -198394 -41108 7852 -374889 1106 139436
$$ packed form
19262b40651I9728a95839R7125q5523k17772J55868a01761k12108a16133D0367
19251H1367q396c20683h1790B4274I943a86077k51244a79440r992j98825B9665
19239b49612b4716l5581k49238A40010c49201A75025a10259k08275d6802l02435
19229c49237B9086K62564e2909q3329G527J53608J09007c09193f5478B4854K45843
19218B70697f0110A41725a6528B091J01178k2792c9088l73982b02035n8954A09597
19206C8485d4601j1803D34490F0791c56053A0806a15416D6727a34158B8914N7814
19195H6728a36089a3513j27817G3319J95102a7079I3544a18174N3832m3196B6000
19183b34463f4734A16728a10276D0965e21360a98394d1108G852c74889A106J38330
$$ plain form
19172 139436 -275117 76941 -120363 99780 70440 -102616 1979 -190909 337460 -57658 328607
19160 -467373 377597 -201898 -198996 96642 -235750 -119635 -125271 -252271 -323337 106390 -296391
19148 79757 15001 -177907 -26476 20555 77257 -88941 -286042 -2269 -275090 124459 64204
19137 64204 56429 179906 27725 25312 -477342 17265 -198695 -71968 -243500 -66582 -160051
19126 -160051 -292453 158307 -53956 -206385 -38832 -63974 -70115 -247587 -161904 128739 20756
19114 -279145 -33072 -267509 -255524 -331916 62535 -168450 -77025 -248483 -339293 -37463 -30862
19103 -30862 -37268 -101211 -259391 -26463 983 461633 -104486 -283449 -73684 -135042 -314970
19092 -314970 -149786 112804 -142531 -127038 27619 163651 -259623 29042 -137749 -243069
$$ packed form
19172A39436b75117G6941a20363I9780k9340a02616A979a90909C37460e7658C28607
19160d67373C77597b01898K902I6642b35750J16115n636j27000p1066A06390b96391
19148G9757A5001a77907b6476B0555N6702h8941j97101b269k72821A24459o0255
19137F4204p775J23477B7725k413d77342A7265a98695g1968j71532f6582r3469
19126a60051j32402A58307e3956j52429c8832k5142o141j77472Q5683A28739B0756
19114b79145c3072k34437J1985p6392F2535a68450g7025j71458r0810c7463O601
19103c0862o406o3943j58180b6463I83M60650a04486j78963g3684o1358j79928
19092c14970a49786A12804a42531J5493B7619J36032b59623B9042a37749j05320
$$ plain form
19082 -243069 39818 252168 -87802 41037 56269 236840 -82702 -134889 -124465 -43237 224999
19070 -83326 177580 115099 207037 55299 -13522 -39771 -47015 -163544 -74011 -84257 151562
19058 -87085 -157941 96336 25761 16968 -270559 75377 130463 77161 -319676 -41930 -144041
19047 -144041 -116959 -29637 118418 -71660 -202465 116654 -14053 -65058 36427 -209368 50508
19035 107684 45185 31136 92330 -32947 -42755 -80885 116024 264473 20003 145856 -5948
19023 -150931 -130673 97431 278412 -46004 35630 192439 -152080 112465 -36619 255477
19012 112992 116191 -100946 -69693 -170957 -84186 -83869 -47279 -33126 -102595 -470269 -559850
19001 -559850 -358049 27043 -10810 -265900 525458 -115071 -284909 22096 -63444 18184
$$ packed form
19082b43069C9818K12350h7802D1037J5232J80571h2702n2187J0424d3237B24999
19070h3326A77580o2481R1938E5299a3522k6249p244j16529g4011j0246A51562
19058h7085p0856I6336B5761q793b70559G5377N5086n3302c19676d1930j02111
19047a44041K7082b9637A18418g1660j30805A16654a4053n1005C6427b09368E0508
19035A07684D5185j4049O1194c2947r808l8130A16024J48449B0003J25853e948
19023a50931K0258I7431J80981d6004C5630J56809a52080A12465c6619B55477
19012A12992L199a00946L1253j01264h4186L17L6590J4153o9469l67674q9581
19001e59850K01801B7043a0810k55090E25458a15071j69838B2096f3444A8184
$$ plain form
18990 11788 115342 -58423 22528 -291866 -127356 247098 -163637 -328673 8268 -179553
18979 -423191 205583 -299987 -211633 102729 -206830 43330 87003 112002 52606 164491
18969 164491 35748 -75749 -92466 -86332 -74087 5148 7043 180836 -483662 -90191 -261858
18958 -261858 100351 -110434 178252 -102783 4170 -58512 28009 234915 -183629 273691
18947 206730 201645 -76316 -57802 130889 -283367 -101730 -16084 -131707 -53070 -97113 87056
18935 -117515 163586 -31771 -44670 -375004 -53645 -82764 -126664 -27817 48654 -129102 -63287
18923 -175936 -179656 -129943 -30472 51987 -6304 -392356 -139413 -281246 -77325 -153402 155427
18911 -252854 -159241 -31148 -167596 136705 -50392 58123 355157 -9843 52158 -396421 -146242
$$ packed form
18990A1788J03554e8423B2528b91866a27356B47098a63637j65036H268a79553
18979d23191B05583b99987Q8354A02729b06830D3330M3673K4999E2606J11885
18969A64491C5748g5749j6717O134J2245E148J895J73793d83662i0191j71667
18958b61858A00351a10434A78252a02783D170e8512B8009K06906a83629B73691
18947B06730n085g6316J8514A30889b83367a01730a6084j15623e3070m4043H7056
18935a17515A63586c1771j2899l30334e3645k9119m3900b7817D8654a29102f3287
18923a75936l720M9713c0472E1987f304l86052a39413j41833g7325p6077A55427
18911b52854R3613c1148j36448A36705e0392E8123K97034i843E2158c96421a46242
$$ plain form
18899 -35841 -223693 -103191 -74397 -155655 -88593 -362694 -140314 -102469 19593 -260524 103144
18887 -146088 -140237 115932 290214 110300 368449 129927 -635 -183752 29752 85840 118559
18876 118559 21687 -371052 8640 -86172 -126317 104770 -132661 -177140 -60392 -95285 -118178
18865 -118178 -137716 -81951 -30434 -125048 -108464 -64319 -172449 -197359 -162334 -194103 58225
18853 -333013 -111106 67180 -114764 145659 -406040 181802 -260225 -87500 -41072 142871
18842 -334995 -284591 149945 282340 120891 -105349 -190311 -109995 53123 -113213 -15993
18831 -211323 -147754 -47510 -299101 119705 148028 -367697 234932 45628 -132493 -174972
18821 -174972 61149 -409684 377048 -30333 -227641 -88370 387289 129588 109692 235999
$$ packed form
18899c5841j87852a03191K8794q1258O7062k74101a40314L7845A9593b60524A03144
18887a46088N851A15932J74282A10300K58149A29927f35j83117B9752N6088L2719
18876A18559B1687c71052H640h6172m0145A04770a32661m4479f0392l4893k2893
18865a18178j9538N5765c0434r4614J6584M4145j08130k4910L5025l1769E8225
18853c33013a11106F7180a14764A45659d06040A81802b60225h7500d1072A42871
18842c34995N0404A49945J32395A20891a05349q4962Q0316E3123a13213a5993
18831b11323O3569d7510k51591A19705K8323c67697B34932D5628a32493m2479
18821a74972F1149d09684C77048c0333j97308h8370C87289A29588j9896J26307
$$ plain form
18811 235999 18903 -33054 115483 86525 -65345 -159591 -91934 -354904 7936 -40748 169717
18799 -98893 -34172 144080 -29890 15016 13018 -264821 -84171 42614 -129122 -6884 14714
18787 185017 -200540 145618 96037 -88018 -306853 117418 13986 125949 201882 407375
18777 407375 219131 97680 -104497 -159591 -113185 -73991 -242736 121269 9757 -258996 -35221
18765 340917 -56123 139120 -218621 19844 -108175 -106307 -238299 -289445 -15617 -57701 -83301
18754 -83301 -272386 125779 577486 -406306 53223 -95197 -32996 -24538 -282585 63533 -53391
18742 -10066 -314520 -338098 312661 -173138 -31370 -249198 -20094 -149940 -140472 113400 242774
18731 242774 -102916 56838 -19448 -26647 63544 -413227 -251979 -127554 387126 -473100
$$ packed form
18811B35999A8903c3054A15483k8958f5345r4246O7657k62970G936d0748A69717
18799i8893c4172A44080b9890A5016j998b64821h4171D2614a29122f884A4714
18787A85017b00540A45618m9581h8018k18835A17418A3986J11963P5933K05493
18777D07375j88244I7680a04497n5094M6406L9194j68745A21269I757b58996c5221
18765C40917e6123A39120b18621A9844a08175J868j31992n1146a5617m2084k5600
18754h3301j89085A25779M51707d06306E3223i5197c2996Q458k58047F3533e3391
18742a0066l04454k3578C12661a73138c1370k17828b0094j29846R468A13400J29374
18731B42774a02916E6838a9448p199F3544d13227J61248J24425C87126d73100
$$ plain form
18720 -181775 18576 -67595 96464 -96215 228684 -183625 -353624 -22504 97783 -23933 -79275
18709 -79275 -166565 38050 -241327 -280343 25833 4328 -192553 111712 -116415 -67329 -415226
18698 -415226 -630503 -54443 86943 -167738 -91711 65273 77792 107267 36590 -133464 4905
18686 -19858 105970 98225 -12095 -236602 -124540 19647 -334097 33591 189141 -142360 157264
18674 -297376 -107490 -280453 158827 -149451 54193 -81947 131251 200156 -13927 31837
18663 -99374 288268 -139532 251802 -400763 140298 -147143 -126796 36253 -109647 -135363
18653 -135363 -146633 -16833 -129324 26257 -161601 83649 -76235 185881 128248 -198257 -108816
18642 -108816 -238894 237497 -21563 -152126 -127968 1547 -133837 -317111 -317021 59094 74762
$$ packed form
18720a81775A8576f7595I6464i6215B28684a83625j69999b2504I7783b3933n5342
18709g9275q7290C8050b41327l9016B5833D328a92553A11712a16415M9086l47897
18698d15226k15277e4443H6943a67738P6027F5273J2519K9475C6590a33464D905
18686a9858A05970p745a2095k24507J12062A9647c34097C3591J55550a42360A57264
18674b97376a07490j72963A58827a49451E4193h1947A31251O8905a3927C1837
18663i9374B88268a39532B51802d00763A40298a47143K0347C6253a09647k5716
18653a35363j1270a6833j12491B6257a61601H3649g6235A85881n7633a98257Q9441
18642a08816j30078B37497b1563j30563K4158A547a33837j83274R0E9094J5668
$$ plain form
18631 74762 -77803 75055 -117830 6650 199981 106982 -109483 -272321 -131773 -328443 47477
18619 -217021 -81303 43742 -4424 -153700 -227002 -228546 -22027 7584 -29710 -5225 173869 49590
18606 2516 -157394 -270739 -346904 -48516 227035 7657 112179 324914 -42689 -235445 -45139
18594 31646 369457 282930 -467746 110990 -241001 -197241 92457 -216135 79370 27955 -16124
18582 -170411 -111409 51326 -61721 -240880 -228147 123025 -128779 150249 -116254 -291203
18572 -291203 46758 -66623 100275 239192 -327132 179031 175552 -265479 -39435 28293 25876
18561 25876 20751 205121 91748 -153445 -424820 52754 -84335 -268959 129574 0 -352725
18549 181918 90038 -82951 21663 25642 -23614 -254980 -10889 254878 -227080 -312390 -233732
$$ packed form
18631G4762g7803G5055a17830F650J93331r2999a09483j62838a31773j96670D7477
18619b17021h1303D3742d424j49276p3302j544b2027G584b9710e225A73869D9590
18606B516a57394j13345p6165d8516B27035G657J04522K12735d2689j92756d5139
18594C1646L37811q6527d67746A10990b41001M3760I2457b16135G9370B7955a6124
18582a70411N9002E1326f1721j79159J2733A23025a28779A50249a16254j74949
18572b91203D6758f6623A00275J38917c27132A79031l479b65479c9435B8293k417
18561B5876n125J84370I1748a53445k71375E2754h4335j84624A29574@c52725
18549A81918I0038h2951B1663L979b3614k31366a0889B54878b27080q5310P8658
$$ plain form
18538 -233732 31481 -166920 -315971 -122148 127423 149221 -239021 168308 -52020 -26466
18528 -26466 -21150 -68933 -41888 -152737 -171574 -89489 -63527 -51043 -247582 40112 -240692
18516 2300 -184024 185148 -22918 -95683 -95734 -89383 -464796 -469 2016 -374735 -196593 -242203
18504 -242203 -101701 -163561 -52005 -432433 70666 -342654 -154427 -226755 -10829 -62046 -48381
18493 -48381 -140927 48572 -27564 471609 -45580 -568567 199912 -16115 -3263 68403 208584
18482 208584 -328116 -167506 85164 -59255 -113611 -33158 -94216 185554 38270 -198798 54748
18470 296117 122828 -92612 -125116 55842 31158 -134761 8505 -135348 159866 -59750 -272631
18459 -272631 -79951 72327 309786 -44324 96764 -166194 -88866 -39845 -264651 120569 108902
$$ packed form
18538b33732C1481a66920j49051a22148A27423K1798b39021A68308e2020K5554
18528b6466N316m7783K7045j10849j8837Q2085K5962J2484j96539D0112b40692
18516B300a84024A85148b2918p2765n1O351l75413d69B016c74735J78142m5610
18504b42203a01701o1860e2005l80428G0666c42654a54427p2328a0829n1217J3665
18493d8381r2546D8572b7564D71609d5580n22987A99912a6115c263F8403J40181
18482B08584c28116J60610H5164e9255n4356c3158o1058A85554C8270a98798E4748
18470B96117A22828i2612l2504E5842k4684a34761H505a35348A59866e9750k12881
18459b72631g9951G2327K37459d4324I6764a66194P7328c9845k24806A20569j1667
$$ plain form
18448 108902 -213305 -362198 93456 -140115 -266601 -23624 -15200 72820 151718 -423921 86100
18436 -21114 -43991 -28091 -243020 257109 121868 -69537 180202 -203442 -425400 111171
18425 -219064 16880 -74661 -131079 -20139 -39462 13577 -26 -9457 -152529 251154 -55310 -87735
18413 -87735 319865 -146140 75701 -191741 20431 182417 -138117 8668 424743 -137613
18402 381008 -210815 -115288 -69927 109000 -74053 -301139 22154 -1140 -106241 -260307 -54142
18390 -18983 -2750 69243 45277 -287592 180721 53525 -35148 19915 175305 -185200 -225219
18379 -225219 -314071 -62134 -109226 131927 -77494 -476441 -48054 -270019 114656 -238337
18368 276586 214101 9830 -103587 -90040 -238477 -55550 205081 52967 -18806 188280 -141853
$$ packed form
18448A08902b13305j48893I3456a40115j26486b3624Q424G2820P8898d23921H6100
18436b1114k2877J5900k14929B57109A21868f9537A80202b03442k21958A11171
18425b19064A6880g4661n6418b0139j9323A3577b6r431j43072B51154e5310l2425
18413h7735C19865a46140G5701a91741B0431J61986a38117H668M16075a37613
18402C81008b10815R5527M5361A09000g4053k27086B2154a140j05101j54066e4142
18390a8983b750F9243k3966b87592A80721E3525c5148A9915J55390a85200m0019
18379b25219q8852f2134m7092A31927g7494l98947d8054k21965A14656b38337
18368B76586o2485I830a03587J3547j48437e5550B05081E2967a8806A88280a41853
$$ plain form
18356 64142 65850 20902 231219 -403769 -306282 -52003 -62520 -64259 236436 -29717 225239
18344 -23118 51514 151814 -11989 170504 310218 391828 48489 -121591 65541 55196 -234330
18332 -4416 -90964 85359 99847 -141583 254046 -36702 -128434 55955 127126 20717 -412986
18320 1409 -202045 -16158 -119489 87865 34779 -63182 -40917 -75895 -83642 -106563 178660
18308 216678 -331584 44618 -241892 249182 8790 -89293 -121862 86851 -108434 13265 26972
18297 26972 -177405 54830 35701 -565 18129 41938 78871 -110448 -18729 -421566 -50005
18285 -27442 160402 -195319 -117957 211945 88858 -115616 -146433 7649 -102395 29777 -196480
18273 130712 -88464 35919 13131 -118427 -70324 175774 -245793 -123919 79334 80282 301868
$$ packed form
18356F4142J708B0902K10317d03769R7487e2003j0517j739B36436b9717B25239
18344b3118E1514J00300a1989A70504J39714Q1610D8489a21591F5541j0345b34330
18332d416q6548H5359J4488a41583B54046c6702r1732E5955P1171B0717d12986
18320A409b02045a6158j03331H7865C4779f3182K2265l4978p747k2921A78660
18308B16678c31584D4618b41892B49182H790h9293l2569H6851a08434A3265J3707
18297B6972a77405E4830j9129e65A8129K3809L6933a10448a8729m02837e0005
18285b7442A60402a95319P7362B11945H8858a15616l0817G649a02395B9777a96480
18273A30712h8464C5919A3131a18427M8103A75774b45793J21874G9334R48K21586
$$ plain form
18262 301868 -127164 -115694 -45525 -110217 -67561 28992 -72700 75856 9860 42690 27697
18251 27697 206451 252012 -188026 -89230 -180503 106527 -141897 -141365 -99027 307769 5459
18239 90070 -292402 63010 104966 -9158 -297323 -243241 -94277 342534 -295840 178379 170581
18228 170581 -31619 -35353 176132 123941 -154670 -88033 173977 -47115 -170527 189001 -269696
18216 -47838 -335536 -15304 -112980 -124413 -135835 -230107 3875 -214995 176061 -506418 -23050
18204 -195815 339855 19618 375535 -303582 -30762 150699 308377 -336921 -236178 100750
18193 -275785 98452 -123266 -223776 -97654 -43367 -402303 -124678 -1878 -254627 14710 -169473
18181 -94262 239280 167570 -288964 -10197 -232829 -181839 104960 -74492 -192377 -54264 27705
$$ packed form
18262C01868a27164J1470d5525o4692M2656B8992g2700G5856I860L2830j4993
18251B7697J78754M5561a88026h9230r1273A06527a41897N32M2338C07769E459
18239I0070b92402F3010M1956i158k88165N4082i4277C42534b95840A78379p798
18228A70581c1619l734A76132n2191a54670O6637A73977d7115j23412A89001b69696
18216d7838k87698a5304r7676j1433j1422r4272C875b14995A76061e06418b3050
18204a95815C39855A9618L55917c03582c0762A50699J57678c36921J00743A00750
18193b75785I8452a23266j00510i7654d3367l58936a24678a878k52749A4710a69473
18181i4262B39280p1710b88964a0197k22632N0990A04960g4492j17885e4264B7705
$$ plain form
18169 -124517 158744 -63853 -379633 317528 -140036 -19437 -55752 269733 131733 10843
18158 61105 142021 132303 -60270 140096 -81587 150683 70216 48733 -97661 -168588 -146991
18147 -146991 -142867 311664 9090 -68198 110313 191872 305025 -497331 18507 81673 -190996
18135 241817 -182430 -106350 -74184 -47113 84852 89958 -325464 -124135 77035 -281866 55503
18123 80410 -242392 -3835 3589 96558 179336 -426816 -227835 73301 98285 -144708 -45723
18111 -108999 -139658 36818 -213587 277459 -246429 100497 123406 -269793 -37616 -48378
18101 -48378 -18493 274684 145542 -312778 85543 -136308 73298 151041 -265257 50038 -17421
18089 -246039 -452316 -356739 -259781 -49313 197287 327514 51723 -66405 -121110 -334699 -279360
$$ packed form
18169a24517A58744f3853l15780C17528a40036a9437l6315B69733A31733A0843
18158F1105Q0916r718f0270A40096h1587A50683G0216k1483i7661p0927K1597
18147a46991M124C11664I090f8198A10313Q1559J13153d97331A8507O3166a90996
18135B41817a82430P6080L2166K7071H4852N106c25464a24135G7035b81866E5503
18123H0410b42392c835C589R2969Q2778d26816J98981G3301K4984a44708d5723
18111a08999l0659C6818b13587B77459b46429A00497K2909b69793c7616j0762
18101d8378a8493B74684j29142c12778H5543a36308G3298P7743b65257E0038a7421
18089b46039k06277R5577R6958d9313A97287J30227E1723f6405n4705k13589N5339
$$ plain form
18078 -279360 1780 140496 15720 168788 193905 -116178 -45836 114609 -92352 -9741 -87274
18067 -87274 4248 9364 71070 22538 97461 81306 62238 -328690 -204964 319842 38732
18055 -225433 17870 -59777 -31503 -107449 -153452 -13496 -68785 1178 -282254 -74075 -114578
18044 -114578 16352 -21113 -22627 -21819 129995 -251381 -137493 -170603 162132 -136864 -24782
18032 -238994 282051 229761 184002 88170 -227745 -449057 -164826 112221 -507083 117861
18021 134436 418126 221145 -275640 349136 118690 -218483 -172868 34566 -119063 188252
18010 -58500 43700 -72516 -113222 -135552 44014 -388431 -8023 -106347 158018 -109738 -205394
17999 -205394 -180701 -13884 -274746 40513 -272219 131090 -167197 64857 325220 173149
$$ packed form
18078b79360A780J38716A5720J53068K5117a16178d5836A14609i2352i741p7533
18067h7274D248N116O1706B2538P4923j6155j9068c28690J23726C19842C8732
18055b25433A7870e9777K8274p5946m6003a3496n5289A178b82254g4075m0503
18044a14578A6352b1113j514Q08A29995b51381J13888l3110A62132a36864b4782
18032b38994B82051n2290m5759H8170b27745k21312a64826A12221e07083A17861
18021A34436K83690j96981b75640C49136A18690b18483M5615C4566a19063A88252
18010e8500D3700g2516m0706k2330D4014c88431h023r8324A58018a09738r5656
17999b05394K4693a3884k60862D0513b72219A31090a67197F4857K60363j52071
$$ plain form
17989 173149 6765 -51920 -304685 127984 -61190 -84693 56109 -174016 -155204 -301175 -81901
17977 138838 114154 217579 72288 17595 -63092 -7487 -158072 46945 -68508 -500147 163871
17965 -2898 -21847 120545 -228631 -281686 -207853 228711 -219425 -202284 -470206 -276905 31623
17953 -151556 41551 -219034 -44603 241325 90671 -126121 7929 56444 -156386 -97845 -24136
17941 -97499 -31048 -148859 -276088 -273024 213096 -6811 -262228 -378874 51064 -29639 -54037
17930 -54037 -121511 316510 192640 -212160 4596 -450970 -211169 -247650 -247799 -149291 -27549
17918 -134243 67033 -4467 -46363 -15926 25320 -73827 -168078 -78424 55932 231516 185205
17907 185205 109185 -91564 -275611 -225592 444454 -94533 143848 -17614 -63059 16030 230978
$$ packed form
17989A73149F765e1920k52765A27984f1190k3503E6109a74016J8812j45971h1901
17977A38838k4684J03425G2288A7595f3092g487j50585D6945f8508m31639A63871
17965b898j8949A20545b28631n3055P3833B28711b19425J7141k67922J93301C1623
17953a51556D1551b19034d4603B41325I0671a26121G929M8515a56386N8541b4136
17941i7499c1048j17811j27229L064B13096f811k55417j16646E1064b9639k4398
17930e4037o7474C16510j23870b12160D596d50970b11169l6481j49R8508b7549
17918a34243F7033d467m1896a5926B5320g3827r4251g8424E5932J75584m6311
17907A85205p6020i1564j84047N0019D44454i4533A43848a7614m5445A6030K14948
$$ plain form
17896 230978 86434 118863 189289 320071 -96131 -53930 -501696 163784 -190749 -459825
17886 -459825 165978 -67249 245438 247117 192157 178231 257549 587109 181906 109916 -499691
17874 87909 118387 106370 -31953 138434 -130398 -51748 59903 37209 -51952 -33064 -140744
17863 -140744 -145442 73751 166758 60269 66677 -98517 130332 -358382 85696 -399401 -53731
17851 309439 -45085 59237 124911 -9715 -357601 -340753 10180 311474 108818 -84913 11577
17839 394689 123876 -67598 -145352 39005 -271675 104343 -7983 11728 -435453 -284852 212700
17827 -62325 69037 -57541 -210503 70277 -158634 73904 175591 313540 67459 -354687 -89839
17815 167814 -110292 67419 -300176 -224251 -104507 -131894 -250228 33198 150361 -1506 -81386
$$ packed form
17896B30978H6434L2429P0426J30782i6131M2201m47766A63784a90749k69076
17886d59825A65978f7249B45438J679n4960j3926P9318L29560A81906p1990d99691
17874H7909L0478j2017c1953A38434a30398e1748E9903k2694e1952J8888j07680
17863a40744m698G3751R3007F0269O408i8517A30332c58382H5696c99401e3731
17851C09439d5085E9237O5674i715l47886J6848A0180L01294A08818h4913A1577
17839C94689A23876f7598p7754C9005b71675A04343g983A1728d35453J50601B12700
17827f2325F9037e7541j52962G0277a58634G3904J01687J37949F7459c54687h9839
17815A67814a10292F7419c00176P5925a04507k7387j18334C3198J17163a506p9880
$$ plain form
17804 -81386 249669 -186698 -32952 -38292 19703 -257232 192991 132066 124024 -106643 -237302
17793 -237302 -302210 184855 200547 -354789 249733 175485 86463 -222732 155724 254312
17783 254312 -57678 -149436 -19479 -77954 -38877 -183136 73124 218731 191663 71424 -254289
17771 -69396 6992 -350101 -66625 215306 189926 -140975 82086 -133211 270099 237794 273075
17760 273075 -14005 -20838 -54788 145228 312838 276385 -12295 184684 204160 -15849 6476
17748 -162092 -44621 -212113 -9824 -375879 179203 -268326 -196739 -353812 178282 139638
17738 139638 -169723 -41604 -77373 294312 98336 103222 -49519 -126624 -120581 -103436 -260044
17727 -260044 -222945 22810 89499 -63942 209291 -174014 199094 -10734 -308639 133017
$$ packed form
17804h1386B49669a86698c2952n340A9703b57232A92991o0925q042a06643j30659
17793b37302o4908A84855J5692c54789B49733p4248H6463b22732A55724R8588
17783B54312e7678r1758a9479n8475c8877j44259G3124J45607k7068G1424b54289
17771f9396F992c50101f6625B15306k5380a40975H2086a33211B70099l2305L5281
17760B73075a4005o833l3950A45228J67610l6453a2295A84684J9476a5849F476
17748a62092d4621j67492i824l66055A79203b68326P1587j57073A78282l8644
17738A39638a69723d1604l5769B94312I8336M886d9519p7105O043J7145j56608
17727b60044L7099B2810O6689f3942B09291a74014A99094a0734k97905A33017
$$ plain form
17716 111711 57514 53757 16573 -32497 -8088 -370326 152764 -157616 -139573 78094 -123573
17704 -153921 140284 70552 86460 -156104 -109445 55767 316305 255360 169484 -357529 -96489
17692 121332 416569 -248480 218693 -315651 -84672 118603 -25196 -193443 75424 -118230
17681 262332 53813 145167 251061 -18594 80666 240557 1053 34686 -26462 86243 8772
17669 -114140 252431 -350760 -219422 -3023 68697 -115294 479970 35339 -97851 3143 6024
17658 6024 -157080 155242 -183317 12393 -73108 316794 70007 180274 -121083 116625
17647 405374 -195929 284524 -111362 201097 26334 -249001 -137401 33720 -430976 325238
17636 83238 -82188 213455 77093 -128827 210782 163499 15181 153771 106210 231689 273787
$$ packed form
17716A11711n4197l757A6573c2497h088l62238A52764a57616J8043G8094a23573
17704a53921A40284o9732J5908a56104M6659E5767K60538o0945q5876c57529i6489
17692A21332K95237b48480B18693c15651h4672A18603b5196j68247G5424a18230
17681B62332E3813R1354J05894a8594H0666J59891A053L3633b6462H6243H772
17669a14140B52431c50760J31338c023F8697a15294D79970C5339i7851C143K881
17658F024a57080A55242a83317A2393g3108C16794G0007J10267a21083A16625
17647D05374a95929B84524a11362B01097B6334b49001J11600C3720d30976C25238
17636H3238h2188B13455G7093a28827B10782m7283A5181J38590m7561J25479M2098
$$ plain form
17625 273787 -96931 52581 -250577 -84161 27652 -272602 153697 -34289 66766 118803 68918
17614 68918 -94205 -104667 138016 -30651 149571 7679 22840 40547 -103556 -228860 -99312
17602 -47474 -28797 -17400 49379 41055 -75343 48815 -172069 104802 168613 241398 51925
17590 396987 105277 24669 97559 -2741 -105894 84649 16157 -110408 -290399 372972 -69615
17578 -32767 252790 -78823 180664 111023 174458 -67070 136528 -146467 -100634 157149 67427
17566 28155 -70553 3883 128218 -88141 148876 6644 21839 188269 66111 135852 -42897
17554 -92610 -198373 -29549 246855 143495 -210041 47941 -75070 -116988 128865 -203607
17543 137879 -160857 63096 164983 226666 67187 183816 -170696 -337584 4463 -117946
$$ packed form
17625B73787i6931E2581b50577h4161B7652b72602A53697c4289F6766N2037m9885
17614F8918i4205j0462A38016c0651A49571G679J5161J7707a03556j25304i9312
17602d7474J8677J1397D9379q324g5343D8815a72069A04802O3811P2785E1925
17590C96987A05277B4669P2890b741j03153H4649A6157a10408j79991C72972f9615
17578c2767B52790g8823A80664o9641O3435f7070A36528a46467M5833A57149F7427
17566B8155g0553C883J24335h8141A48876F644J5195J66430F6111O9741d2897
17554i2610j05763b9549B46855j03360b10041D7941g5070m1918A28865b03607
17543A37879a60857F3096J01887O1683F7187J16629a70696j66888D463a17946
$$ plain form
17532 353369 82418 354192 367557 88532 127582 27404 93853 -29432 26344 -139259 -680
17520 124863 -147751 -69505 -36673 200764 80580 20393 260548 -216056 213423 123280
17510 123280 137352 -116865 445962 124993 -11002 -74355 -31906 -107830 -46837 199820 40281
17498 57160 15170 -6727 215771 106173 69395 128805 102611 327647 230575 168898 36658
17486 23555 -165541 197002 -99629 -61496 49638 67269 50056 224297 -37717 -134828 144339
17474 41171 346747 214491 121754 103022 244162 38322 13000 23936 -176875 90937 257735
17463 257735 211259 118060 141573 52571 348830 -318922 184721 352846 286692 239153 -6761
17451 213194 153258 -149725 273906 -107113 181667 303993 108760 -17086 164414 92511
$$ packed form
17532C53369H2418K71774J3365H8532L9050B7404O6449b9432B6344a39259f80
17520A24863a47751f9505L2832B00764H0580B0393K40155b16056B13423r0143
17510A23280J4072a16865D45962A24993a1002o3353c1906p5924d6837A99820D0281
17498E7160A5170f727B15771A06173l6778N9410k6194K25036r7072o1677C6658
17486B3555a65541A97002i9629L8133D9638J7631j7213J74241c7717r7111A44339
17474D1171L05576j32256r2737j8732J41140C8322A3000J0936a76875I0937J66798
17463B57735m6476r3199K3513E2571K96259c18922A84721J68125o6154m7539f761
17451B13194n9936a49725B73906a07113A81667J22326A08760a7086A64414p1903
$$ plain form
17441 92511 93464 143067 37690 55516 -48561 230565 78095 -2074 121819 65164 379933 59571
17428 276838 -72190 170468 -88391 368136 303317 271902 421646 283109 243489 529771
17418 529771 40574 134297 213507 57870 571016 205057 263090 31776 -20378 311247 89693
17406 122373 375086 313832 196223 481760 -97718 130060 135743 293513 -237488 129654
17395 252080 114592 26365 197981 100861 153572 273519 232535 208308 256016 -148256 272475
17383 -9598 -69501 -119379 56333 124116 208009 75321 97010 370257 120093 280156 380927
17372 380927 198665 210124 498183 403163 172725 -104188 -27295 117160 -179944 50493
17361 90639 336207 -81893 82656 -30250 140802 338549 36137 236854 33949 280917 121345
$$ packed form
17441I2511R53M9603C7690J7826d8561B30565G8095b074A21819n6655L14769E9571
17428B76838g2190A70468h8391C68136o4819l1415J49744j38537l9620K86282
17418E29771D0574R3723P9210E7870N13146B05057N8033C1776b0378C11247H9693
17406A22373K52713o1254j17609K85537i7718A30060N683J57770b37488A29654
17395B52080A14592B6365J71616r7120N2711J19947m0984k4227M7708a48256B72475
17383i598n9903m9878E6333O7783Q3893G5321K1689K73247A20093J60063J00771
17372C80927j82262J1459K88059r5020A72725a04188b7295A17160a79944E0493
17361I0639K45568h1893H2656c0250A40802J97747C6137K00717C3949K46968A21345
$$ plain form
17349 -55167 186740 16347 469917 284870 245530 -119724 -87939 261107 414114 278440
17339 278440 164950 86047 55272 162565 320073 -25216 42725 -198162 166202 219534
17329 219534 350268 124681 68959 196958 151067 67818 197222 -20714 198737 193108 523507
17318 523507 29553 140695 153219 289696 16419 -86574 -44970 18347 181306 84001 -122100
17306 -108178 260142 140294 -46803 171952 -37370 420235 318317 124317 95969 146550
17296 146550 258710 2628 22901 -137995 49218 130071 -43332 -148366 45863 274400 260790
17285 260790 166028 -102594 278234 -26003 136526 -182758 93908 233214 260662 494741
17275 494741 -177288 -27955 169054 -94872 399883 76125 -27638 -44484 235302 290705 183871
$$ packed form
17349e5167A86740A6347M53570j85047l9340a19724L1785B61107J53007j35674
17339B78440j13490p8903l0775J07293J57508b5216D2725a98162A66202N3332
17329B19534J30734A24681n5722J27999m5891F7818J29404b0714A98737n629L30399
17318E23507B9553J11142J2524J36477A6419h6574M1604A8347J62959H4001a22100
17306a08178B60142j19848d6803A71952c7370D20235j01918A24317k8348N0581
17296A46550J12160B628K0273a37995D9218Q0853d3332j05034D5863K28537j3610
17285B60790r4762a02594B78234b6003A36526a82758I3908J39306K7448K34079
17275D94741a77288b7955A69054i4872C99883G6125b7638j6846B35302N5403j06834
$$ plain form
17264 183871 108919 174026 464000 421601 211637 322727 209346 135740 134204 48401 392994
17253 392994 106099 23809 163019 277546 154469 96954 143723 202927 -27053 192728
17242 -226969 450244 306077 -10587 53035 76345 250823 203455 238721 183691 44597 -117345
17230 157810 94035 -106516 145313 156866 178671 152878 37781 303994 149360 -23053 365434
17218 21631 159743 234414 592508 36396 114061 204541 149759 -5731 49167 291780 95157
17206 99061 432698 -170605 161867 -179445 262109 145884 47074 229711 13192 15721
17196 15721 78087 387006 186660 424811 187811 329949 383838 57147 286398 229245
17186 229245 443984 222827 246244 364619 845379 155565 329399 139814 218447 258100
$$ packed form
17264A83871p4952O5107K89974m2399k09964J11090j13381p3606j536D8401L44593
17253C92994A06099B3809J39210J14527j23077n7515M6769N9204b7053A92728
17242b26969D50244j44167a0587E3035K3310J74478m7368L5266n5030D4597a17345
17230A57810o3775a06516A45313J1553K1805k5793C7781K66213A49360b3053C65434
17218B1631J38112P4671L58094C6396P7665R0480n4782e731D9167K42613I5157
17206I9061L33637a70605A61867a79445B62109j16225D7074J82637A3192K529
17196A5721O2366L08919A86660K38151A87811J42138N3889E7147K29251n7153
17186B29245K14739k21157K3417J18375M80760A55565J73834A39814P8633L9653
$$ plain form
17176 258100 237612 83150 350027 317545 332824 441495 131084 221975 184009 234681 318203
17165 318203 29539 283551 83283 229861 432527 125285 778854 439316 259303 103036
17154 170250 254535 159375 113255 279145 419919 292996 122034 149556 367734 228883
17144 228883 197938 -38049 386210 274974 154228 265054 573522 167152 580915 83074
17133 334450 333027 403091 364911 329224 588015 290592 525934 136399 324198 376891 289394
17122 289394 430144 292991 567945 506608 -16324 446935 394251 495064 285046 108099
17111 212766 684845 385842 228931 532814 186257 347768 134220 228672 255472 304090
17101 304090 474960 738855 451577 559827 342740 201337 886016 103565 488552 417450
$$ packed form
17176B58100k0488H3150K66877l2482J5279J08671A31084R0891l7966N0672Q3522
17165C18203B9539K54012H3283J46578K02666A25285O53569l39538j80013A03036
17154A70250Q4285r5160m6120J65890J40774j26923A22034K7522K18178j38851
17144B28883l0945c8049C86210j11236j20746J10826L08468A67152M13763H3074
17133C34450j423P0064l8180l5687K58791B90592K35342A36399J87799N2693q7497
17122B89394J40750j37153K74954o1337a6324D46935n2684J00813k10018A08099
17111B12766M72079k99003j56911L03883A86257J61511A34220R4452K6800M8618
17101C04090J70870K63895k87278J08250k17087j41403O84679A03565L84987p1102
$$ plain form
17091 417450 400937 374410 592517 130743 395820 415539 577409 345230 99388 849449
17081 849449 537337 359942 436109 354566 472034 255356 493550 234514 593123 619646
17071 619646 382133 567605 724604 625581 256189 580738 385430 486585 592415 691563
17061 691563 346196 226960 240603 517380 355057 274086 401504 582162 680060 494903
17051 494903 765443 698949 140934 599497 619554 236910 547657 293888 616038 325187
17041 325187 480312 709028 575835 571987 686416 961358 451900 611143 516587 426778
17031 426778 104386 782350 352800 749499 654010 350876 286995 641072 481426 567945
17021 567945 467274 627848 331097 955660 572635 806370 709263 708028 275413 623334
$$ packed form
17091D17450j6513k6527K18107A30743K65077J9719J61870k32179I9388P50061
17081H49449l12112j77395P6167q1543J17468k16678K38194B34514L58609K6523
17071F19646k37513J85472J56999r9023B56189L24549j95308J01155J05830R9148
17061F91563l45367j19236J3643K76777j62323q0971J27418J80658R7898j85157
17051D94903K70540o6494A40934M58563K0057B36910L10747k53769L22150k90851
17041C25187J55125K28716j33193l848J14429K74942D51900J59243r4556q9809
17031D26778A04386O77964C52800L96699r5489l03134o3881L54077j59646Q6519
17021E67945j00671J60574k96751O24563l83025K33735r7107j235B75413L47921
$$ plain form
17011 623334 637804 757706 763377 615715 767630 1012095 560442 500808 597460 557580 481080
17000 481080 634300 475687 566137 657895 985027 778343 533111 715531 846001 529435
16990 529435 491750 743924 793165 921336 884114 505058 833790 779303 613836 538475
16980 538475 943346 683192 919677 755775 676388 776340 851737 845430 914133 733835 902446
16969 902446 972399 1086149 1119937 935858 874728 773298 976735 893545 825387 903475 1293997
16958 1293997 818515 1107919 1106651 1060187 1139715 927552 1310364 1184791 1120684 1071603
16948 1071603 1057843 1125614 977330 829707 978821 1184103 1371063 1053290 902623 1093185
16938 1093185 1224452 744128 1300639 1393712 1036365 1032497 1113416 1037771 1077693 1376738
$$ packed form
17011F23334J4470J19902N671j47662J51915K44465m51653n9634R6652l9880p6500
17000D81080J53220j58613R0450R1758L27132k06684k45232J82420J30470l16566
16990E29435l7685K52174M9241J28171l7222l79056L28732n4487j65467p5361
16980E38475M04871k60154K36485j63902p9387R9952P5397o307O8703j80298J68611
16969I02446O9953J13750L3788j84079o1130j01430K03437q3190o8158P8088L90522
16958A293997m75482K89404j268m6464P9528k12163L82812j25573o4107m9081
16948A071603j3760O7771j48284j47623J49114K05282J86960l17773j50667J90562
16938A093185J31267m80324N56511R3073l57347l868Q0919p5645L9922K99045
$$ plain form
16928 1376738 1204566 1068130 1433408 1236548 1368011 1427543 1335490 1375681 1372327 1233315
16918 1233315 1146953 1302704 1288815 1593847 1663268 1381812 1500043 1437734 1197315 1241049
16908 1241049 1475652 1517376 1362046 1499008 1348256 1472790 1470310 1472434 1680824 1672718 1565708
16897 1565708 1862456 1736963 1621249 1920370 1768903 2121084 1845847 1779183 1626630 2015835
16887 2015835 1857530 1668260 2008398 2177111 1885159 2073607 1808559 2344342 2204975
16878 2204975 2170479 2048494 1819732 1982609 2252734 2231659 2272534 2036713 2140911 2432607
16868 2432607 2416634 2150764 2714104 2346471 2751428 2538721 2548182 2976946 2523448 2866689
16858 2866689 2708708 2616933 2666218 3003038 2608217 3002077 2736663 2971139 2799726 2934394
$$ packed form
16928A376738j72172j36436L65278j96860J31463N9532r2053M0191l354j39012
16918A233315q6362J55751j3889L05032O9421k81456J18231o2309k40419M3734
16908A241049K34603M1724j55330J36962j50752J24534k480K124K08390q106j07010
16897A565708K96748j25493j15714K99121j51467L52181k75237o6664j52553L89205
16887B015835j58305j89270L40138J68713k91952J88448k65048N35783j39367
16878B204975l4496j21985k28762J62877K70125k1075M0875k35821J04198K91696
16868B432607j5973k65870N63340l67633M04957k12707R461M28764m53498L43241
16858B866689j57981r1775M9285L36820l94821L93860k65414K34476j71413J34668
$$ plain form
16848 2934394 3146200 3272803 3003841 3356740 3275367 3398602 3162160 3341605 3853475 3798321
16838 3798321 3671763 3565746 3725998 3594658 3940113 3852702 3886049 4074816 4125013 4191927
16828 4191927 4354686 4195013 4500600 4702954 5139632 4504671 4775708 4909354 5054305
16819 5054305 4984269 5058427 5401421 5238158 5490372 5611511 5797889 5721844 5844695 6085015
16809 6085015 5981041 6282617 6523494 6610983 6517149 6623072 6652459 7218499 7436360 7662080
16799 7662080 7136120 7855914 7793144 8325662 8369233 8151812 8459319 9113468 9188111 9305661
16789 9305661 9299695 9727389 10054513 10479355 10588668 11179833 11108907 11422197 11783963 12369084
16779 12369084 12483301 12815291 13328811 13675524 14119869 14616986 15224459 15348737 16041506
$$ packed form
16848B934394K11806J26603k68962L52899q1373J23235k36442J79445N11870n5154
16838C798321j26558j06017J60252j31340L45455q7411L3347J88767N0197O6914
16828D191927J62759j59673L05587K02354M36678o34961K71037J33646J44951
16819E054305p0036P4158L42994j63263K52214J21139J86378p6045J22851K40320
16809F085015j03974L01576K40877Q7489r3834J05923K9387N66040K17861K25720
16799G662080n25960P19794o2770N32518M3571k17421L07507O54149P4643J17550
16789I305661n966M27694L27124M24842J09313N91165p0926L13290L61766N85121
16779A2369084J14217L31990N13520L46713M44345M97117O07473J24278O92769
$$ plain form
16770 16041506 16708235 17184126 17731090 18401838 19159132 19802017 20476428 21338354 21862052
16761 21862052 22791858 24034279 25136922 26035766 26756074 27617386 29173497 30696518 31972547
16752 31972547 33479047 34457037 36458938 38129928 39869773 42209440 44229101 46552480
16744 46552480 48676824 51347148 54299469 56994549 60543421 64191088 67662127 71959508
16736 71959508 76234450 80978177 85908631 91160682 97038068 103284436 109599573 116517054
16728 116517054 123573707 131111279 139019304 146494846 154753620 162480305 169942767 176604301
16720 176604301 183654575 189121594 193402019 196876492 199261300 199558965 198652185 196375014
16712 196375014 192979035 188941857 182675757 176184016 169087215 161714476 153751512 145451467
$$ packed form
16770A6041506O66729M75891N46964O70748P57294O42885O74411Q61926N23698
16761B1862052R29806J242421J102643Q98844P20308Q61312J556111J523021J276029
16752C1972547J506500R77990K001901J670990J739845K339667K019661K323379
16744D6552480K124344K670324K952321K695080L548872L647667L471039M297381
16736G1959508M274942M743727M930454N252051N877386O246368O315137O917481
16728A16517054P056653P537572P908025P475542Q258774P726685P462462O661534
16720A76604301P050274N467019M280425L474473K384808K97665r06780k277171
16712A96375014l395979m037178o266100o491741p096801p372739p962964q300045
$$ plain form
16704 145451467 137575600 129562152 122113823 114608640 107905994 101349633 95285091 89689159
16696 89689159 84281296 79078010 74908164 69869907 66084391 62445071 58598796 55711337
16688 55711337 52344373 49497142 47077719 44642094 42507269 40117368 38211384 36365740
16680 36365740 34386998 32780928 31239340 29808413 28720900 26893241 26204335 25242436
16672 25242436 24013524 22949830 21947531 21260991 20362865 19679007 19136352 18325050 17733326
16663 17733326 16959039 16522602 15903685 15212828 14749028 13988599 13578053 13356881 12949971
16654 12949971 12542489 11985950 11607225 11218238 10552171 10703129 10169642 10121758 9756484
16645 9756484 9583845 9080715 9573684 8748278 8362925 8391529 7854579 7780205 7647948 7681710
$$ packed form
16704A45451467p875867q013448p448329p505183o702646o556361o064542n595932
16696H9689159n407863n203286m169846n038257l785516l639320l846275k887459
16688E5711337l366964k847231k419423k435625k134825k389901j905984j845644
16680C6365740j978742j606070j541588j430927j087513j827659o88906r61899
16672B5242436j228912j063694j002299o86540q98126o83858n42655q11302n91724
16663A7733326p74287m36437o18917o90857m63800p60429m10546k21172m06910
16654A2949971m07482n56539l78725l88987o66067J50958n33487m7884l65274
16645I756484j72639n03130M92969q25406l85353K8604n36950p4374j32257L3762
$$ plain form
16635 7681710 7670435 7098903 6799711 6898735 6634250 6600870 6379727 6001195 6229190 5895540
16625 5895540 5840378 5558744 5423708 5412949 5395959 4981269 4723930 5069307 4639607 4564115
16615 4564115 4757167 4595746 4288863 4292035 3974707 4021917 3964838 4324989 4133076 3794575
16605 3794575 3673123 3621219 3571903 3498353 3370923 3329927 3332477 3130935 3284256 3036201
16595 3036201 3021364 3265042 2675043 3317693 2762673 2954092 3014921 2840555 2546725 2781508
16585 2781508 2774116 2637968 2744718 2416931 2555900 2799477 2766760 2132960 2298538 2209465
16575 2209465 2316118 2147454 2414362 2200212 2154103 2061094 2141329 2005154 1701644 1999612
16565 1999612 2022499 1788476 1937392 1645057 1346449 1527217 1482025 1709416 1518695 1787581
$$ packed form
16635G681710j1275n71532k99192R9024k64485l3380k21143l78532K27995l33650
16625E895540n5162k81634j35036j0759j6990m14690k57339L45377m29700p5492
16615D564115J93052j61421l06883L172l17328M7210n7079L60151j91913l38501
16605C794575j21452n1904m9316p3550j27430m0996K550k01542J53321k48055
16595C036201j4837K43678n89999O42650n55020J91419O0829j74366k93830K34783
16585B781508p392j36148J06750l27787J38969K43577l2717o33800J65578q9073
16575B209465J06653j68664K66908k14150m6109r3009Q0235j36175l03510K97968
16565A999612K2887k34023J48916k92335k98608J80768m5192K27391j90721K68886
$$ plain form
16555 1787581 1513202 1705470 1605855 1457535 1781197 1392047 1618443 1584467 1411848 1653559
16545 1653559 1502516 1302592 1550091 1377589 1254465 1358715 1669339 1208476 1428344
16536 1428344 1018757 1363179 1713179 1308182 1229218 1162332 1143134 1208795 1073613 1442279
16526 1442279 1083522 944771 1189971 1150229 1138329 1028493 1081117 1024878 1245628 768082
16516 768082 1170543 861543 1114355 902472 737499 1121949 1103730 1073931 992145 743436
16506 743436 984833 1163855 884051 864425 1075905 997919 739763 899641 597342 788581
16496 788581 1027251 737268 605862 518266 404162 821079 903916 849413 875636 426736
16485 504895 784185 663795 395421 780077 581162 798461 859604 721522 744146 1063146
$$ packed form
16555A787581k74379J92268r9615j48320L23662l89150K26396l3976j72619K41711
16545A653559j51043j99924K47499j72502j23124J04250L10624m60863K19868
16536A428344m09587L44422L50000m04997p8964o6886j9198O5661j35182L68666
16526A442279l58757j38751K45200l9742j1900j09836N2624n6239K20750m77546
16516G68082M02461l09000K52812k11883j64973L84450j8219k9799q1786k48709
16506G43436K41397J79022k79804j9626K11480p7986k58156J59878l02299J91239
16496G88581K38670k89983j31406q7596j14104M16917Q2837n4503K6223D26736
16485E04895K79290j20390k68374L84656j98915K17299O1143j38082K2624L19000
$$ plain form
16475 1063146 448413 448698 854205 655513 752690 518582 740745 667432 519585 744767
16465 744767 456970 706291 492572 481140 412515 500609 673294 565378 765949 481453
16455 481453 803369 518182 326794 388788 451315 230315 407355 486298 329948 523620
16445 523620 439490 132845 384379 509465 574734 436170 613562 543559 326818 550882
16435 550882 -31596 281933 600937 204269 633738 251677 399179 363122 796676 448641
16425 448641 438918 169528 495433 699301 164486 533291 434242 696902 567685 419203
16415 419203 37901 65971 311231 478877 386994 610311 179280 354156 360595 364898 394369
16404 394369 296262 140080 981172 317007 337283 -26420 743846 483274 469368 157649
$$ packed form
16475A063146D48413K85M05507j98692R7177k34108K22163p3313j47847K25182
16465G44767k87797K49321k13719j1432o8625Q8094J72685j07916K00571k84496
16455D81453L21916k85187j91388O1994O2527k21000J77040P8943j56350J93672
16445E23620q4130A32845K51534J25086O5269j38564J77392p0003k16741K24064
16435E50882c1596B81933L19004B04269M29469B51677J47502l6057M33554l48035
16425D48641r723A69528L25905K03868A64486L68805r9049K62660j29217j48482
16415D19203C7901K8070K45260J67646r1883K23317A79280J74876O439M303K9471
16404C94369r8107A40080Q41092C17007K0276b6420G43846k60572j3906A57649
$$ plain form
16393 420268 382879 205065 477387 55875 261226 156091 285013 248966 445247 444058
16383 444058 615652 397926 407759 370346 355868 187201 725549 245318 -89523 385216
16372 -18083 416597 342216 132667 426926 277749 176050 187410 228371 386102 231312
16362 231312 -76094 135496 430305 251906 328011 155675 151548 593624 315162 39579
16351 534237 303670 176955 171979 582576 197024 73056 363682 46956 -94016 632729
16340 43374 284322 87328 382374 253928 145906 161026 -126099 415521 178749 339286
16330 339286 306870 52123 192600 -34472 25020 -117060 173770 68414 8428 186689 3116
16318 183713 446448 92692 525447 61375 130755 104259 293357 -51327 328254 123894
$$ packed form
16393D20268l7389j77814K72322E5875K05351j05135J28922l6047J96281j189
16383D44058J71594k17726R833l7413j4478j68667N38348B45318h9523C85216
16372a8083D16597p4381A32667K94259j49177j01699J1360M0961J57731j54790
16362B31312g6094A35496K94809j78399P6105A55675m127M42076k78462C9579
16351E34237k30567j26715m976M10597A97024G3056K90626D6956i4016F32729
16340D3374K40948H7328K95046j28446j08022J5120a26099D15521A78749J60537
16330C39286l2416E2123J40477c4472B5020a17060A73770F8414H428J78261C116
16318A83713K62735I2692M32755F1375O9380k6496J89098e1327C28254A23894
$$ plain form
16307 168651 75217 97661 162689 212937 163866 217792 304847 282747 -3178 379382 301556
16296 301556 95959 222672 329407 312231 184420 -266294 36770 -46171 132663 172336
16286 172336 427395 271984 -11179 142099 149941 192705 -269497 60479 -250354 233366
16275 -44139 -205286 352388 60243 -69649 -70186 -171816 -48827 -26092 -62206 71589 304604
16264 304604 134531 132316 223461 102801 -87827 140463 -37585 -24422 241584 -309697 65374
16252 201495 31905 247865 30155 -60358 -56739 -55757 -341152 182643 -2858 227005 244610
16241 244610 59089 -266057 65045 -32473 -76157 8033 49679 213240 80672 88957 251409
16230 251409 42814 113335 -279538 -91240 46602 120451 -247884 -100873 117311 160981 -8296
$$ packed form
16307A68651G5217K2444O5028N0248m9071N3926Q7055k2100c178C79382p7826
16296C01556I5959J26713J06735j7176j27811b66294C6770d6171A32663L9673
16286A72336K55059j55411a1179A42099P842M2764b69497F0479b50354B33366
16275d4139j61147C52388F0243f9649n37j01630d8827K2735l6114G1589K33015
16264C04604A34531k215R1145A02801h7827A40463c7585J3163B41584c09697F5374
16252B01495C1905K15960C0155f0358L619R82k85395A82643b858B27005J7605
16241B44610E9089b66057F5045c2473m3684H033M1646J63561H0672Q285J62452
16230B51409D2814P0521b79538i1240D6602P3849b47884a00873A17311M3670h296
$$ plain form
16218 112908 75151 30766 83348 273982 -100240 425918 104111 112844 17457 122422 -19636
16206 -48558 -324081 -286622 6919 78642 99937 125649 -40450 284269 134894 48440 145709
16195 145709 162629 -169315 72282 46330 154528 9084 161972 102558 160088 288588 -71971
16183 212219 -134925 51968 109695 -41176 202979 212939 -293111 -231246 11338 276236 -37577
16171 -3000 -38109 157247 -16786 -39990 -226386 271237 26758 191923 -228707 67250 -172928
16159 -162362 289398 -172065 -19824 -86592 71526 159022 -44138 156274 -105347 47589 -67633
16147 -146201 -106256 136995 94070 -269281 -105330 -236255 156401 -248753 -97265 -44892
16136 -27855 165507 -75126 130473 -275552 -418432 -33419 -130255 -64210 210375 -77150 -149088
$$ packed form
16218A12908l7757C0766N2582J90634a00240D25918A04111Q733A7457J04965a9636
16206d8558k75523L7459F919P1723K1295K5712d0450B84269A34894D8440R7269
16195A45709J6920a69315G2282k5952J08198I084J52888n9414N7530J28500g1971
16183B12219a34925E1968N7727d1176B02979R960b93111O1865A1338K64898c7577
16171c000l5109A57247a6786k3204j86396B71237B6758J65165b28707F7250a72928
16159a62362B89398a72065a9824o6768G1526Q7496d4138A56274a05347D7589f7633
16147a46201L9945A36995m2925b69281a05330j30925A56401b48753i7265d4892
16136b7855A65507g5126A30473b75552j42880c3419r6836f4210B10375g7150p1938
$$ plain form
16125 -149088 36257 -103875 176961 86757 177922 328445 29542 172464 30325 -78622 -40618
16114 -40618 -146737 49853 63991 109517 -23784 77488 -43970 87389 -60342 33960 -112074
16102 -65542 -210326 239502 223158 191530 7197 154983 186462 -23425 -208154 -169797 -46635
16090 -114753 7840 -310442 197691 -102221 -149744 2899 -194320 196297 -128811 139516
16079 46556 318791 42345 -150614 275280 34514 -26852 -186128 -188274 270757 85232 -251192
16067 -99831 372129 -267094 50598 57264 -142544 40735 -29707 -130958 -24427 -225150 41427
16055 276559 61072 40303 51752 267441 114126 -96582 218529 -167701 -131443 69019 -32603
16043 -150923 -114804 -126681 -353414 -146250 -15451 -17378 32130 119720 -155233 -49357 -121695
$$ packed form
16125a49088C6257a03875A76961H6757R1165J50523B9542J42922C0325g8622L8004
16114d0618j06119D9853J4138M5526b3784G7488d3970H7389f0342C3960a12074
16102f5542j44784B39502j6344l1628G197J47786L1479b3425j84729L8357d6635
16090a14753G840c10442A97691a02221m7523B899a94320A96297a28811A39516
16079D6556K72235D2345a50614B75280C4514b6852j59276k146B70757H5232b51192
16067i9831C72129b67094E0598O666a42544D0735b9707j01251b4427k00723D1427
16055B76559F1072k0769J1449K15689A14126i6582B18529a67701L6258F9019c2603
16043a50923L6119j1877k26733a46250a5451j927C2130Q7590a55233d9357p2338
$$ plain form
16032 -121695 -115567 -156961 183640 162456 11402 170237 206999 -104069 157768 117320 -351500
16020 -26840 -226994 10931 284179 -220590 205634 231491 -311215 -595 -207092 96442 127976
16009 127976 -50817 -185185 -183556 147929 -160840 -64555 105807 -203032 -89092 173929
15998 88264 -203347 -78341 44393 -100933 101476 88181 -333781 -27338 -66106 -103373 5603
15986 205 62894 148725 -22117 268543 226271 87419 277078 318254 491326 -170170 -280162
15975 -280162 -100005 -96281 92281 877 102077 -83828 1027 -2547 31337 132960 -92550 -139632
15963 -139632 -315071 30261 -132932 -222526 93890 119508 106032 -206080 -261751 -159986 208983
15951 10500 -11149 183451 -93580 58390 -25181 104492 65763 53355 -179672 -357237 276573
$$ packed form
16032a21695O128m1394A83640k1184A1402J58835L6762a04069A57768m0448c51500
16020b6840k00154A0931K73248b20590B05634K5857c11215e95k06497I6442L1534
16009A27976e0817j34368J629A47929a60840f4555A05807b03032h9092A73929
15998H8264b03347g8341D4393a00933A01476j3295c33781b7338l8768l7267E603
15986B05O2689Q5831b2117B68543m2272H7419J89659M1176J73072a70170j09992
15975b80162a00005L724I2281H77J01200h3828A027b547C1337J01623i2550m7082
15963a39632j75439C0261a32932q9594I3890K5618j3476b06080n5671J01765B08983
15951A0500a1149A83451i3580E8390b5181A04492l8729j2408a79672j77565B76573
$$ plain form
15939 -56135 -29516 -32500 -275566 125405 -245047 -108020 43680 -281663 82614 -105384 -203812
15928 -203812 -209069 124164 331409 58645 -259315 23278 -252564 -2799 -25048 213477 -161208
15916 -28401 -242369 -429677 13526 -177936 -71664 115961 -56555 -104503 -44348 93520 -432604
15904 25065 114583 126220 -406208 -164031 -31814 -421471 -105702 85441 -63763 -129726 -192847
15893 -192847 -231740 -114024 -22564 -59544 59343 67828 -340580 468762 -55980 45899 -81332
15881 -163910 -219219 28341 -122215 -421914 -332573 96288 84363 -124529 159524 6202 -140120
15869 7641 -39217 271013 176775 -22219 97680 -49890 -3446 66638 46435 79837 -182541 -141076
15857 -141076 -230840 128595 121835 77347 -301161 -93694 -294111 105084 323408 -323877
$$ packed form
15939e6135K6619k984k43066A25405b45047a08020D3680b81663H2614a05384r8428
15928b03812n257A24164K07245E8645b59315B3278b52564b799k2249B13477a61208
15916b8401k13968j87308A3526a77936g1664A15961e6555m7948d4348I3520d32604
15904B5065Q9518J1637d06208a64031c1814l89657a05702H5441f3763o5963o3121
15893a92847l8893a14024b2564l6980E9343Q485c40580D68762e5980D5899h1332
15881a63910n5309B8341a22215k99699Q9341I6288j1925a24529A59524F202a40120
15869G641c9217B71013r4238b2219I7680d9890c446F6638k0203L3402a82541M1465
15857a41076q9764A28595o760m4488c01161i3694k00417A05084K18324c23877
$$ plain form
15846 -145908 -24232 205479 -158627 -122235 -247035 -77096 97879 4655 127984 -4180 53984
15834 125421 -240675 318412 -158868 17304 -71794 19614 -64169 15844 75649 79931 11431
15822 -38775 -12779 209380 81587 107737 -129931 6308 -406369 -257115 84856 -267081 -249609
15811 -249609 -366705 -95955 17134 -117006 4159 -143384 -26160 99822 -269600 164421 51635
15799 -202202 194159 67190 -165712 -129915 -96786 -242990 35956 112000 392112 121973
15788 147863 -28054 45826 17983 -211786 101870 151527 -15387 -181049 -72786 -55277 270812
15776 -46641 -270634 150068 36321 -63889 -38175 -253469 -357127 -230773 -278664 203139
15765 -91374 161823 89600 -228292 -187108 -71932 434202 35091 -136453 -65134 -36937 -62288
$$ packed form
15846a45908b4232B05479a58627L6392j24800g7096I7879D655J23329d180E3984
15834A25421b40675C18412a58868A7304g1794A9614f4169A5844N9805M282A1431
15822c8775a2779B09380H1587K6150a29931F308d06369J49254H4856b67081J7472
15811b49609j17096i5955A7134a17006D159a43384b6160I9822b69600A64421E1635
15799b02202A94159F7190a65712L5797L3129j46204C5956P6044K80112A21973
15788A47863b8054D5826A7983b11786A01870M9657a5387j65662g2786J7509B70812
15776d6641k23993A50068C6321f3889K5714k15294j03658J26354m7891B03139
15765i1374A61823p2223b28292M1184g1932D34202C5091a36453f5134K8197k5351
$$ plain form
15754 -62288 91346 -5605 51439 -6951 97667 53605 -122338 -261256 55842 141095 -89212 530802
15741 103127 64013 -222730 169670 46482 -310127 -291483 156909 -290597 -212768 -114306
15731 -114306 182295 47063 -61086 34106 -435981 69234 -144114 -617663 27970 -118933
15720 -21472 252978 132361 -77033 -44877 -52370 -248695 24461 -93390 -32018 -103607 16472
15708 -215782 -91918 90052 222245 -14091 -504277 127647 -243950 75607 -27956 -193592
15698 -193592 29600 -99418 200559 25365 254291 -10787 -134087 446789 209333 59729
15687 -144637 93674 -60299 -257448 -13122 -212102 -15602 -266181 -131918 146610 249669
15677 249669 164863 146328 -112475 -8741 205975 227046 60753 -104122 174539 93269 -6787
$$ packed form
15754f2288I1346e605E1439f951I7667m4062a22338j38918E5842Q5253h9212E30802
15741A03127l9114b22730A69670D6482c10127J8644A56909b90597P7829R8462
15731a14306A82295D7063f1086C4106d35981F9234a44114m73549B7970a18933
15720b1472B52978j20617g7033L2156p493j96325B4461i3390c2018p1589A6472
15708b15782i1918I0052J32193a4091m90186A27647b43950G5607b7956j65636
15698a93592B9600i9418B00559B5365K28926a0787j23300D46789B09333E9729
15687a44637I3674f0299j97149a3122j98980a5602k50579a31918A46610J03059
15677B49669q4806j8535a12475h741B05975K1071F0753a04122A74539q1270f787
$$ plain form
15665 -229600 -121740 127860 -234755 -99471 -83651 -210399 -177276 -136149 -376273 -344176
15655 -344176 -7340 -352642 -353350 -33706 40153 -156304 293680 -47147 -82183 180418 96657
15644 96657 -63732 -114942 -341068 9614 -201666 155665 -58240 -169875 -130628 -114052 93536
15632 177523 -45487 -147087 23192 -122455 98046 -222157 -23296 80866 343872 -138174
15621 173971 13798 -64760 -69492 -93426 -175400 -107853 -245106 127069 128406 -31613 -345471
15610 -345471 -575682 -227128 -179989 -108434 215646 -109543 -69019 -105925 -316072 74647
15599 243865 25010 -111113 -127514 -42685 -299564 -31503 5751 -242870 102883 42005 -186042
15587 141398 -90912 35467 -40290 -94279 -52627 118372 -284981 198296 102781 -47645 -235289
$$ packed form
15665b29600J07860A27860b34755i9471J5820j26748L3123M1127k40124L2097
15655c44176g340l45302p08c3706D0153a56304B93680d7147l5036A80418q3761
15644I6657f3732n1210k26126I614b01666A55665e8240j11635L9247J6576I3536
15632A77523d5487j01600B3192a22455I8046b22157b3296H0866K63006a38174
15621A73971A3798f4760m732k3934q1974O7547j37253A27069J337c1613l13858
15610c45471k30211b27128M7139P1555B15646a09543M0524l6906k10147G4647
15599B43865B5010a11113j6401d2685k56879c1503E751b42870A02883D2005a86042
15587A41398i0912C5467d0290n3989M1652A18372b84981A98296r5515d7645j87644
$$ plain form
15576 -235289 -45087 452783 -47901 211255 1596 294821 83270 -11781 -138225 -348905 -78638
15564 229543 379111 -239768 301473 -66702 -17348 -123327 -55399 -123977 -166534 -179697 -139840
15553 -139840 -132744 -242516 -142005 -5777 87223 -184714 105511 183092 -340623 31643 106869
15542 106869 -83793 -66543 270958 -35420 -76763 47482 -22729 559400 -176601 71203 -95873
15530 -290429 -121927 -136935 -253531 -168836 23302 -67759 -89594 130008 -48909 -90992 258465
15518 438807 -162675 -7971 -243586 -86944 -284280 -124620 215876 -229050 113866 -29968
15507 218039 134780 35337 -115960 -103446 -84492 25721 -84316 235003 -5978 48829 41372
15496 41372 265141 83040 -1870 42356 -226078 159460 -35493 134014 -214309 200298 140844
$$ packed form
15576b35289d5087D52783d7901B11255A596K93225H3270a1781j26444k10680g8638
15564B29543J49568b39768C01473f6702a7348j05979e5399o8578m2557j3163L9857
15553a39840P096j09772J00511e777H7223a84714A05511P7581c40623C1643P5226
15542A06869h3793J7250B70958c5420m1343D7482b2729E59400a76601G1203i5873
15530b90429a21927j5008j16596Q4695B3302f7759k1835A30008d8909m2083B58465
15518D38807a62675g971k35615h6944j97336a24620B15876b29050A13866b9968
15507B18039q3259C5337a15960J2514J8954B5721h4316B35003e978D8829p457
15496D1372K23769H3040a870D2356b26078A59460c5493A34014b14309B00298n9454
$$ plain form
15485 140844 119983 -111377 6167 -141060 -234494 75307 120612 247082 -221100 -67457 -200415
15474 -200415 -103041 -213721 -414371 76471 -252317 -48406 -50557 -18360 -54756 -219243 -163906
15463 -163906 -166178 -88719 9314 -60074 -84076 -172398 219301 141577 -150282 16393 -262913
15451 253237 -170855 23495 -184842 -73141 169783 -218117 330849 -1420 -50504 153032
15440 -28849 -83175 -56150 -85071 -148914 -161027 -135943 195295 -34494 16667 -133737 28252
15428 -97876 -35422 -227255 -255514 -147053 133802 -112694 -11416 114661 -411237 183335
15417 64820 -52971 -229488 22623 -279702 24517 -28391 -318955 -45435 309071 -15467 -230649
15406 -230649 -329488 41282 -130068 -132901 -265995 -122426 219714 282154 24124 315850 -113570
$$ packed form
15485A40844k0861a11377F167a41060r3434G5307M5305J26470b21100f7457j32958
15474b00415R7374j10680k00650G6471b52317d8406k151a8360l6396j64487N5337
15463a63906k272P7459I314f0074k4002q8322B19301p7724a50282A6393b62913
15451B53237a70855B3495a84842g3141A69783b18117C30849a420m9084A53032
15440b8849n4326K7025k8921o3843j2113K5084A95295c4494A6667a33737B8252
15428i7876c5422j91833k8259J08461A33802a12694a1416A14661d11237A83335
15417F4820e2971j76517B2623b79702B4517b8391k90564d5435C09071a5467k15182
15406b30649r8839D1282a30068k833j33094a22426B19714O2440B4124K91726a13570
$$ plain form
15394 319698 183368 -178526 -67584 -163157 -194428 -1669 20020 242052 -130147 24971 -23718
15382 -49225 66882 -115535 -44812 -8794 -134010 329029 -54724 -129881 223355 -46427 -245447
15371 -245447 -401166 -115138 -78616 -8438 -109086 2414 -32629 184548 -242614 439223 326308
15360 326308 -37048 -127879 -100882 46510 154732 282052 -248931 105434 -72352 154742
15349 -110380 109077 144055 257601 152859 -54712 7232 -378588 -76452 -57305 58162 133707
15338 133707 -33459 -31181 -90173 -381614 303986 278600 169380 22746 19451 149734 -57478
15326 266701 -7453 -274299 274439 79897 -118766 -80454 91731 -207697 246494 160591 -5237
15314 327358 -192191 13068 -17485 -39099 502648 50540 77605 372592 -160075 14880 169291
$$ packed form
15394C19698j36330a78526f7584r5573l1271a669B0020K22032a30147B4971b3718
15382d9225F6882a15535d4812h794j25216C29029e4724p5157B23355d6427j99020
15371b45447j55719a15138L6522h438j00648B414c2629A84548b42614D39223j12915
15360C26308c7048r0831K6997D6510J08222J27320b48931A05434g2352A54742
15349a10380A09077L4978J13546j04742e4712G232c78588g6452J9147E8162P5545
15338A33707c3459K278n8992k91441C03986k5386j09220B2746l295J30283e7478
15326B66701g453k66846B74439G9897a18766L8312I1731b07697B46494q5903e237
15314C27358a92191A3068a7485k1614E02648E0540K7065K94987a60075A4880J54411
$$ plain form
15303 169291 30487 143560 83490 251478 240085 -1357 11718 -202361 6979 304569 -277850
15291 -159745 -236145 -28727 17167 208052 -107238 -5106 21376 -52765 201216 -72489 -9337
15279 -129426 173933 137851 -265546 81805 12167 -154695 90656 -82299 207092 71031 360463
15268 360463 247285 -71533 -236244 70197 36393 244330 318889 22194 -27893 -122348 52460
15256 309413 -94656 226369 157194 93516 126434 68543 219704 516999 1479889 1348247
15246 1348247 750888 1674379 491710 501599 -223985 36655 170327 264348 -115025 -222891
15236 -222891 439176 171061 -2057 413038 160312 481115 266736 -160649 -46945 -123812
15226 -123812 18377 -237057 270223 -119420 -196361 149447 -38618 -12601 -137649 78621
$$ packed form
15303A69291C0487J13073o0070J67988j1393a357A1718b02361F979K97590b77850
15291a59745p6400b8727A7167J90885a07238e106B1376e2765B01216g2489i337
15279a29426A73933l6082b65546H1805A2167a54695I0656h2299B07092G1031K89432
15268C60463j13178g1533j64711G0197l3804K07937P4559B2194b7893r4455E2460
15256C09413i4656B26369o9175o3678L2918n7891J51161K97295R62890j31642
15246A348247n97359R23491D91710R889b23985C6655J33672R4021a15025j07866
15236b22891D39176A71061b057D13038A60312L20803k14379a60649d6945p6867
15226a23812A8377b37057B70223a19420p6941A49447c8618a2601j25048G8621
$$ plain form
15215 85554 265253 -38947 -189028 265326 219472 46747 81764 157904 -42707 -81270 266334
15203 -29788 211585 127824 17315 147894 -137483 217079 -428069 -56028 36466 220257
15193 220257 -190920 358234 -23602 59891 221119 175431 -113360 156204 229624 22941
15182 -34300 -176122 -136526 -121637 -234786 75856 329144 172487 24736 -23755 -22877 197149
15170 80531 197129 122684 56064 251297 51828 97935 -37784 -195355 -65204 -67745 78467
15158 -38372 71067 49427 76136 53912 70530 207153 170750 311458 -13435 176524 54596
15146 198906 254497 117483 -49408 -31560 386140 413889 290181 -189874 419175 -41844
15135 217944 178094 418491 304678 82967 207752 132792 32763 423600 13270 181805
$$ packed form
15215H5554J79699c8947j50081B65326m5854D6747L5017P6140d2707l8563B66334
15203b9788B11585q3761A7315J30579a37483B17079d28069e6028C6466J83791
15193B20257a90920C58234b3602E9891J61228m5688a13360A56204P3420B2941
15182c4300j41822L9596J4889j13149G5856K53288j56657B4736b3755Q78A97149
15170H0531J16598p4445E6064J95233E1828M6107c7784j57571f5204k541G8467
15158c8372G1067k1640K6709k2224J6618J36623l6403J40708a3435A76524E4596
15146A98906N5591A17483d9408J7848C86140K7749j23708a89874D19175d1844
15135B17944l9850K40397j13813H2967J24785p4960C2763L90837A3270J68535
$$ plain form
15125 181805 101205 336802 71580 96478 53295 -25967 462266 100776 117849 -58495 293767
15113 193165 158970 302535 150830 49229 165095 122279 -247265 172956 -199243 212790
15102 231700 180242 339126 -138536 9737 -254459 -151572 82988 198202 115520 140895 218007
15091 218007 241264 43336 214250 160736 394554 -84449 181545 217276 34222 105524 164757
15080 164757 106532 121837 -90367 294340 116628 399275 328357 21270 120873 262662 49559
15068 162702 131373 -20479 67502 -102665 -194960 151039 44982 -12589 236264 233212 -57258
15056 308874 -81976 -45091 -234740 -82367 -62371 125486 107392 134211 45709 158665 -58969
15044 180542 247084 -142703 213451 33805 37586 307286 249791 377443 310997 133806 349637
$$ packed form
15125A81805q0600K35597G1580K4898m3183b5967D62266A00776J7073e8495B93767
15113A93165l4195J43565A50830D9229J15866m2816b47265A72956a99243B12790
15102B31700n1458J58884a38536I737b54459J02887H2988J15214q2682K5375P7112
15091B18007K3257D3336J70914n3514K33818h4449A81545L5731C4222P1302N9233
15080A64757n8225J5305i0367B94340A16628K82647p0918B1270R9603J41789D9559
15068A62702l1329b0479F7502a02665r2295A51039D4982a2589B36264l052e7258
15056C08874h1976L6885j89649h2367J9996A25486j8094K6819D5709J12956e8969
15044A80542O6542a42703B13451C3805L781K69700n7495J27652o6446A33806K15831
$$ plain form
15033 349637 87991 -28806 273571 136824 27367 25527 108687 -103774 229610 149876 183257
15022 183257 168636 142679 474246 68233 213818 368127 298253 194864 231103 167206 -35077
15010 -222668 432383 573592 311752 407505 233319 88161 113568 -10297 195013 344558
15000 344558 386442 79766 255832 222623 101111 412190 288675 308427 -8235 382564 388555
14989 388555 -162862 305058 342879 319372 185834 -64135 46847 32910 103001 282275 267778
14978 267778 68872 -57821 222832 193132 265941 516232 285974 139291 254476 244579 359620
14967 359620 202525 -2301 304497 176968 320680 228825 369314 192962 228863 -26475
14956 304648 665740 57190 280708 118449 274327 489574 698739 141074 105285 223108
$$ packed form
15033C49637H7991b8806B73571j36747B7367j840Q3160a03774B29610p9734L3381
15022A83257j4621k5957L31567F8233J45585J54309o9874j03389L6239o3897c5077
15010b22668D32383J41209k61840R5753j74186H8161K5407a0297A95013J49545
15000C44558M1884G9766J76066l3209A01111L11079j23515J9752h235C82564N991
14989C88555a62862C05058L7821k3507j33538f4135D6847j3937P0091J79274j4497
14978B67778F8872e7821B22832k9700P2809K50291k30258A39291J15185r897J15041
14967C59620j57095b301C04497j27529J43712r1855J40489j76352L5901b6475
14956C04648L61092E7190K23518A18449J55878K15247K09165A41074l5789J17823
$$ plain form
14946 223108 374482 309195 399393 190239 93008 437269 42380 315379 121368 249069
14936 249069 -68776 34008 319416 232335 224395 432877 53737 206796 172529 259549 121074
14924 458530 91738 331450 400810 239400 263576 538823 174771 212661 154964 -29997 341872
14912 135192 459353 229549 154300 310858 398458 517570 450885 201617 93137 271051
14902 271051 159314 84286 125712 139427 373613 433242 152009 368249 464366 298729
14892 298729 -56753 95502 383421 395062 277174 392558 247418 474142 454916 359650
14882 359650 9397 199770 373852 234832 400001 42045 477532 485968 375689 544770
14872 544770 619919 252375 634 104958 173626 610313 136526 177401 479760 119192 -42352
$$ packed form
14946B23108J51374o5287R0198A90239I3008L44261D2380K72999A21368J27701
14936B49069f8776C4008K85408q7081p940K08482E3737J53059l4267Q7020A21074
14924D58530I1738K39712O9360j61410K4176K75247A74771L7890n7697b9997C41872
14912A35192L24161B29549p5249J56558Q7600J19112o6685B01617I3137J77914
14902B71051j11737p5028M1426J3715K34186N9629A52009K16240R6117j65637
14892B98729e6753I5502K87919J1641j17888J15384j45140K26724j9226r5266
14882C59650I397J90373J74082j39020J65169D2045M35487Q436j10279J69081
14872E44770P5149B52375F34J04324O8668M36687A36526M0875L02359A19192d2352
$$ plain form
14860 255009 101559 283068 516027 637683 243083 748571 53295 150140 170593 411494
14850 411494 650651 117015 256515 123416 276589 618114 349084 -104931 366952 454361
14840 454361 212487 497701 282232 567074 659174 412290 438962 320467 419201 397592
14830 397592 398577 536182 575890 556231 433000 600430 448671 432344 569545 25495 482567
14819 482567 477740 266106 344119 281394 577422 342453 423820 618781 442434 488721 479308
14808 479308 825705 396528 441198 376315 309727 561837 699493 515114 574948 434961
14798 434961 410038 702882 517402 911476 652986 327153 911353 321482 273407 905807
14788 905807 699119 411040 416436 792269 159694 481946 478248 745710 398985 832465
$$ packed form
14860B55009A01559J81509K32959J21656B43083N05488E3295R6845K0453K40901
14850D11494K39157A17015J39500A23416J53173L41525k69030a04931C66952Q7409
14840D54361B12487K85214k15469K84842R2100k46884K6672j18495R8734k1609
14830C97592R85J37605L9708j9659j23231J67430j51759j6327J37201B5495M57072
14819D82567m827k11634P8013o2725K96028k34969Q1367J94961j76347M6287r413
14808D79308L46397C96528M4670o4883o6588K52110J37656j84379N9834j39987
14798D34961k4923K92844j85480L94074k58490l25833N84200C21482m8075O32400
14788I05807k06688k88079N396L75833A59694L22252l698K67462l46725M33480
$$ plain form
14778 832465 398832 454431 463055 545825 774244 546556 539598 686533 687915 484351 530239
14767 530239 573114 478469 736494 598278 613606 493987 834190 419167 438801 812908
14757 812908 526268 549281 601604 514237 762447 898340 727375 551965 747777 753104
14747 753104 132429 638957 896660 512057 581021 895762 810842 535579 648605 765578
14737 765578 381623 710895 811895 1040187 788160 941673 542895 602215 726130 466747
14727 466747 982228 731619 611483 964662 815704 777399 658298 521391 925293 620254
14717 620254 714949 882428 874064 818811 768071 637242 815681 1134602 655626 955720
14707 955720 896286 385943 1057127 875186 845547 460542 1138843 858347 524951 769877
$$ packed form
14778H32465C98832N5599Q624Q2770K28419k27688o958J46935J382k03564M5888
14767E30239M2875r4645K58025j38216J5328j19619L40203m15023J9634L74107
14757H12908k86640K3013N2323q7367K48210J35893j70965j75410J95812N327
14747G53104A32429N06528K57703l84603O8964L14741q4920k75263J13026J16973
14737G65578C81623L29272J01000K28292k52027J53513l98778N9320J23915k59383
14727D66747N15481k50609j20136L53179j48958l8305j19101j36907M03902l05039
14717F20254R4695J67479q364n5253n0740j30829J78439L18921m78976L00094
14707I55720n9434C85943O71184j81941k9639l85005O78301k80496l33396K44926
$$ plain form
14697 769877 762007 1010926 724939 825795 807169 984975 736776 1014558 778950 1103721
14687 1103721 860594 721241 1026226 886582 998741 683913 1042265 1089655 963024 806478
14677 806478 1003621 1024634 1124651 917564 653999 716628 1095012 581217 898646 1037722
14667 1037722 1093809 1054224 1084834 1138789 1163118 994997 1030652 1190275 1192759 997155 929099
14656 929099 1191662 750169 1169614 976751 804719 1096549 771980 1121230 1035319 1486565
14646 1486565 1365505 1463297 1074339 854086 933552 1202702 1086516 1148101 1280984 1158545
14636 1158545 1389968 1262196 1157775 1105140 1566804 996312 1076640 1418218 1507140 1097186
14626 1097186 1224111 1458243 1829463 1119600 1308610 1444261 1268377 1273527 1412621 1518039
$$ packed form
14697G69877p870K48919k85987J00856j8626J77806k48199K77782k35608L24771
14687A103721k43127j39353L04985j39644J12159l14828L58352M7390j26631j56546
14677H06478J97143K1013J00017k07087k63565O2629L78384n13795L17429J39076
14667A037722N6087l9585L0610N3955K4329j68121L5655J59623K484j95604o8056
14656I29099K62563m41493M19445j92863j72032K91830l24569L49250q5911M51246
14646A486565j21060R7792l88958k20253P9466K69150j16186O1585J32883j22439
14636A158545K31423j27772j04421n2635M61664n70492Q0328L41578Q8922m09954
14626A097186J26925K34132L71220p09863J89010J35651j75884N150J39094J05418
$$ plain form
14616 1518039 1284255 1409181 1510146 1411412 1614843 1421690 1310966 1364027 1562319 1480020
14606 1480020 1660610 1432418 1525815 1307396 1435211 1334634 1536600 1638577 1757586 1765120
14596 1765120 1634245 1619768 1553792 1731501 1733268 1624600 1719482 1526269 1946315 1793235
14586 1793235 1634710 1809250 1886951 2048757 2053925 1718833 1860807 2100664 2513304 1928228
14576 1928228 2039688 2158081 1866552 1877322 2186346 2171907 2070962 2208821 2252166 1668074
14566 1668074 2406670 2237692 2284703 2621784 2399114 2646424 2451540 2670981 2695432 2701003
14556 2701003 3070618 3047846 3465601 3503827 3871102 4476351 5522439 7382698 12138274
14547 12138274 22539661 41629728 45291850 20717612 8046415 4032340 2943437 2332973
$$ packed form
14616A518039k33784J24926J00965r8734K03431j93153j10724N3061J98292q2299
14606A480020J80590k28192R3397k18419J27815j00577K01966J01977J19009P534
14596A765120j30875j4477o5976J77709J767j08668R4882j93213M20046j53080
14586A793235j58525J74540P7701J61806N168l35092J41974K39857M12640n85076
14576A928228J11460J18393k91529J0770L09024j4439j00945J37859M3345n84092
14566A668074P38596j68978M7011L37081k22670K47310j94884K19441K4451N571
14556B701003L69615k2772M17755L8226L67275O05249J046088J860259M755576
14547A2138274J0401387J9090067L662122B0717612H046415m014075j088903o10464
$$ plain form
14539 2332973 2163067 1951587 2066872 1746451 2174304 1885201 1973372 1975259 1905118 2132181
14529 2132181 1891682 2170757 2498645 2217429 2384846 2154186 2193945 1982635 2655886 2564767
14519 2564767 2729062 2261115 2517018 2701543 2616869 2514443 2884274 2399614 2237284 2545082
14509 2545082 3084086 2730677 2873571 2482559 2613175 2512977 3012754 2790590 3254777
14500 3254777 3140533 3439080 3313167 3311654 2911189 3075506 3250460 3148819 3202864 3110713
14490 3110713 3425895 3514881 3519670 3542688 3424236 3750069 3150015 3834568 3718606 3481086
14480 3481086 3549215 3730994 3812313 3966446 3796789 3994228 3873639 3615650 4130478 4180069
14470 4180069 4123809 4205540 4237797 4348455 4203712 4351038 4238858 4794613 4459831 4423654
$$ packed form
14539B332973j69906k11480J15285l20421M27853k89103Q8171J887p0141K27063
14529B132181k40499K79075L27888k81216J67417k30660L9759k11310O73251r1119
14519B564767J64295m67947K55903J84525q4674j02426L69831m84660j62330L07798
14509B545082N39004l53409J42894l91012J30616j00198M99777k22164M64187
14500C254777j14244K98547j25913j513m00465J64317J74954j01641N4045r2151
14490C110713L15182Q8986M789K3018j18452L25833o00054O84553j15962k37520
14480C481086O8129J81779Q1319J54133j69657J97439j20589k57989N14828M9591
14470D180069n6260Q1731L2257J10658j44743J47326j12180N55755l34782l6177
$$ plain form
14460 4423654 4343648 4927101 5066864 4830862 5043358 5246584 5108714 5099866 5089687 5170508
14450 5170508 5293576 5321898 5246426 5227961 5304304 5865126 5619454 5725265 5999673 5588530
14440 5588530 5963741 6019283 5971442 6040179 6275549 6525442 6187009 6598338 6558330 6807328
14430 6807328 6476761 6696744 6926432 6990561 7118622 7010643 7172979 7614930 7264397 7400159
14420 7400159 7720051 8082906 7962687 8076686 8035292 8130861 8391238 8663755 8833246 8778461
14410 8778461 8654293 8967053 9121138 9180740 9205434 9385500 9735495 9793742 10040756 10306303
14400 10306303 10542031 10641015 10644701 10779448 10833764 11081996 11473320 11679396 11673442 12205083
14390 12205083 11993496 12310202 12826322 12460218 12842210 13147423 13254522 13600152 13988431
$$ packed form
14460D423654q0006N83453J39763k36002K12496K03226j37870q848j0179Q0821
14450E170508J23068K8322p5472j8465P6343N60822k45672J05811K74408m11143
14440E588530L75211N5542m7841O8737K35370K49893l38433M11329m0008K48998
14430F807328l30567K19983K29688O4129J28061j07979J62336M41951l50533J35762
14420G400159L19892L62855j20219J13999m1394R5569K60377K72517J69491n4785
14410H778461j24168L12760J54085N9602K4694J80066L49995N8247K47014K65547
14400A0306303K35728R8984L686J34747N4316K48232L91324K06076n954N31641
14390A2205083k11587L16706N16120l66104L81992L05213J07099L45630L88279
$$ plain form
14381 13988431 14202116 14520020 14459679 14911478 15426988 15854873 15989309 15977535 16323785 16849215
14371 16849215 17148939 17372170 17408823 18174513 18258390 18675693 19317432 19056916 20063508
14362 20063508 20560854 21065992 21557519 21954738 22277409 22837891 23323844 24101455 24516216
14353 24516216 25283670 25807295 26243168 27027040 27377060 28146143 28762963 29260120 30326414
14344 30326414 31274014 31787632 33070586 34076461 34710382 35625876 36244426 37879842 38569394
14335 38569394 39836901 41020102 42267627 43352541 45062649 46231520 47825417 49216197
14327 49216197 51090205 52318712 54268618 56345184 58099098 60306192 62400058 64563389
14319 64563389 66620859 69330616 71856233 74709798 77542331 80600198 83724565 87261196
$$ packed form
14381A3988431K13685L17904o0341M51799N15510M27885J34436j1774L46250N25430
14371A6849215K99724K23231L6653P65690Q3877M17303O41739k60516J006592
14362B0063508M97346N05138M91527L97219L22671N60482M85953P77611M14761
14353B4516216P67454N23625M35873P83872L50020P69083O16820M97157J066294
14344C0326414R47600N13618J282954J005875O33921R15494O18550J635416O89552
14335C8569394J267507J183201J247525J084914J710108J168871J593897J390780
14327D9216197J874008J228507J949906K076566J753914K207094K093866K163331
14319F4563389K057470K709757K525617K853565K832533L057867L124367L536631
$$ plain form
14311 87261196 90401035 93993105 98700439 102796762 107052170 111698028 116716181 122140288
14303 122140288 127753708 133636947 139940578 146754719 153931642 161448846 169545830 178103405
14295 178103405 187326238 196888826 206950920 218025543 229385740 241410869 253853189
14288 253853189 267364575 281196817 295360695 310388682 325650393 341106779 357089106
14281 357089106 372585756 387841626 402630590 416418179 429349908 440835386 450972127
14274 450972127 459306919 464721143 465570678 463800933 462695756 462846501 457546898 453155786
14266 453155786 446127226 436448291 425649220 413299889 400078471 385353723 369784789
14259 369784789 353898785 338093387 321972039 306864881 291961149 278240871 264540817
$$ packed form
14311H7261196L139839L592070M707334M096323M255408M645858N018153N424107
14303A22140288N613420N883239O303631O814141P176923P517204Q096984Q557575
14295A78103405R222833R562588J0062094J1074623J1360197J2025129J2442320
14288B53853189J3511386J3832242J4163878J5027987J5261711J5456386J5982327
14281C57089106J5496650J5255870J4788964J3787589J2931729J1485478J0136741
14274D50972127Q334792N414224Q49535j769745j105177J50745n299603m391112
14266D53155786p028560r678935j0799071j2349331j3221418j4724748j5568934
14259C69784789j5886004j5805398j6121348j5107158j4903732j3720278j3700054
$$ plain form
14252 264540817 251253697 238332328 226411647 215424104 204655630 194543314 184963848
14245 184963848 175863464 167695881 159798871 151959097 145314568 138234498 132202952 126609003
14237 126609003 121101701 115777503 110715373 105998677 101311710 97304618 94405340 90055615
14229 90055615 86521084 83240153 80107906 76760809 74197472 71438964 69055468 66089898
14221 66089898 64123872 62136172 59568490 57902438 56281026 53872298 52404184 50766520
14213 50766520 49690790 48595731 46715980 45049172 43427740 42641714 41927779 40595176
14205 40595176 39519349 38411285 37093309 36073225 35358321 35170013 33489026 32533971
14197 32533971 31993382 30882646 30465463 29693759 29237428 27934047 27312817 26552584 26046057
$$ packed form
14252B64540817j3287120j2921369j1920681j0987543j0768474j0112316r579466
14245A84963848r100384q167583p897010p839774o644529p080070o031546n593949
14237A26609003n507302n324198n062130m716696m686967m007092k899278m349725
14229I0055615l534531l280931l132247l347097k563337k758508k383496k965570
14221F6089898j966026j987700k567682j666052j621412k408728j468114j637664
14213E0766520j075730j095059j879751j666808j621432p86026p13935j332603
14205D0595176j075827j108064j317976j020084p14904j88308j680987r55055
14197C2533971n40589j110736m17183p71704m56331j303381o21230p60233n06527
$$ plain form
14188 26046057 25826084 24750984 24300150 23678417 23031087 22947741 22283304 21909990 21148717
14179 21148717 20763110 20176240 20048333 19415866 19236752 18917518 18489778 18035831 17618113
14170 17618113 17043191 16674424 16727126 16544552 16211298 15515062 14928986 15213346 15009538
14161 15009538 14667945 14506209 14140488 13900771 13237652 13574820 12871540 13124765 12600108
14152 12600108 12689050 12502097 12149375 11804377 11839397 11529920 11422799 11114939 11118482 11185505
14142 11185505 10716966 10664022 10126476 10168107 10283415 9655456 9686935 9644868 9819896 9309351
14132 9309351 9134369 9269480 9351129 9037739 8626835 8696962 8361037 8051963 8574981 8396358
14122 8396358 7884514 7690139 7865573 7886097 7766485 7839499 7593198 7318934 7228399 7085912
$$ packed form
14188B6046057k19973j075100m50834o21733o47330q3346o64437l73314p61273
14179B1148717l85607n86870j27907o32467j79114l19234m27740m53947m17718
14170A7618113n74922l68767N2702j82574l33254o96236n86076K84360k03808
14161A5009538l41593j61736l65721k39717o63119L37168p03280K53225n24657
14152A2600108Q8942j86953l52722l44998L5020l09477j07121l07860L543O7023
14142A1185505m68539n2944n37546M1631J15308o27959L1479m2067J75028n10545
14132I309351j74982J35111Q1649l13390m10904P0127l35925l09074N23018j78623
14122H396358n11844j94375J75434K0524j19612P3014k46301k74264r0535j42487
$$ plain form
14112 7085912 7188383 6769750 7226881 6731657 6593698 6452075 6522304 6498307 6265974 6226109
14102 6226109 6163031 6297494 6004772 5985277 5908066 5682491 5709371 5885643 5471564 5603389
14092 5603389 5429887 5191937 5717838 5228085 5486426 4948952 5288068 5191640 5139434 5135057
14082 5135057 5116831 4606227 4986173 5069462 4871237 4901966 5266596 4889184 4818926 4469525
14072 4469525 4242694 4285363 4714272 4339232 4205143 3964898 4191609 4306401 4281654 4297158
14062 4297158 4024221 4225209 4122774 3761510 4125195 3987466 4052902 3681035 3797847 4096059
14052 4096059 3540127 3591314 3724542 3462407 3514609 3418945 3504300 3250672 3245112 3140767
14042 3140767 3202228 3315837 3451955 3037473 3238709 3110057 3237722 2911194 3157530 3226468
$$ packed form
14112G085912J02471m18633M57131m95224j37959j41623P0229k3997k32333l9865
14102F226109o3078J34463k92722j9495p7211k25575K6880J76272m14079J31825
14092E603389j73502k37950N25901m89753K58341n37474L39116r6428n2206m377
14082E135057j8226n10604L79946Q3289j98225L0729L64630l77412p0258l49401
14072D469525k26831M2669M28909l75040j34089k40245K26711J14792k4747J5504
14062D297158k72937K00988j02435l61264L63685j37729O5436l71867J16812K98212
14052D096059n55932N1187J33228k62135N2202r5664Q5355k53628n560j04345
14042C140767O1461J13609J36118m14482K01236j28652J27665l26528K46336O8938
$$ plain form
14032 3226468 3076060 2898234 3006686 3104074 2804712 2937070 2745891 2717874 2424585 2941012
14022 2941012 2396482 2677761 2790097 2692792 2584737 2459263 2652910 2693404 2685943 2358487
14012 2358487 2586975 2457378 2460643 2620567 2457903 2579702 2209246 2134980 2285598 2333295
14002 2333295 2046984 2026230 2583692 1950585 2121389 2307306 2160343 1806009 2384303 1822831
13992 1822831 2107538 2268103 2546160 3541614 6543692 15196563 34044654 47781530
13984 47781530 24689048 12645148 7999387 6298107 4598786 4264648 3644269 3473192
13976 3473192 3174817 2620944 2906539 2884210 2807227 2957434 2742064 2557538 2642749 2332127
13966 2332127 2220233 2351150 2463199 2221251 2203028 2362169 2444530 2072721 2256430 2056295
$$ packed form
14032C226468j50408j77826J08452R7388k99362J32358j91179k8017k93289N16427
14022B941012n44530K81279J12336r7305j08055j25474J93647M0494p461l27456
14012B358487K28488j29597L265J59924j62664J21799l70456p4266J50618M7697
14002B333295k86311k0754N57462o33107J70804J85917j46963l54334N78294n61472
13992A822831K84707J60565K78057R95454L002078Q652871J8848091J3736876
13984D7781530k3092482j2043900m645761j701280j699321l34138o20379j71077
13976C473192k98375n53873K85595k2329p6983J50207k15370j84526Q5211l10622
13966B332127j11894J30917J12049k41948j8223J59141Q2361l71809J83709k00135
$$ plain form
13956 2056295 1975264 1685372 1943042 2243549 2021415 1892371 2065696 2341260 1691800 1857084
13946 1857084 1734347 1834486 1852401 1802792 2123555 1747084 1810825 1863999 1787797 1965458
13936 1965458 1738050 2071902 1444900 1585415 1385661 1399294 1735652 1560866 1741127 1591617
13926 1591617 1438613 1688615 1640171 1491777 1562493 1595903 1485472 1791831 1752292 1645007
13916 1645007 1549493 1233770 1599961 1352368 1330119 1780057 1249916 1368636 1449855 1337324
13906 1337324 1146362 1190260 1376861 1413912 1190599 1320036 1490004 1164423 1482345 1288937
13896 1288937 1503279 1121889 1179246 1393326 1155302 1083451 1613911 1071859 1361788 864567
13886 864567 1241368 990829 1033271 1405522 1191802 1133737 1084591 1222881 963973 1143999
$$ packed form
13956B056295q1031k89892K57670L00507k22134j29044J73325K75564o49460J65284
13946A857084j22737J00139J7915m9609L20763l76471O3741N3174p6202J77661
13936A965458k27408L33852o27002J40515j99754J3633L36358j74786J80261j49510
13926A591617j53004K50002m8444j48394P0716L3410j10431L06359l9539j07285
13916A645007r5514l15723L66191k47593k2249M49938n30141J18720Q1219j12531
13906A337324j90962M3898J86601L7051k23313J29437J69968l25581L17922j93408
13896A288937K14342l81390N7357K14080k38024p1851N30460n42052K89929m97221
13886H64567L76801k50539M2442L72251k13720n8065m9146J38290k58908J80026
$$ plain form
13876 1143999 1013451 969717 1032429 1051019 1402056 1300678 1386524 1098649 896393 1116567
13866 1116567 1157028 1021197 1110661 1145124 931023 1283374 1107119 990571 1087974 1192511
13856 1192511 1309728 1213720 811375 996436 978086 1024957 1131426 809776 992276 1011751
13846 1011751 798842 1259235 1159073 1200516 868884 889259 1088016 930959 842063 1162286
13836 1162286 870881 1209877 1172870 1184606 955049 948021 1086049 926098 564255 822686
13826 822686 1022271 1152444 977909 1081151 676770 839586 1059390 649369 849810 681621
13816 681621 999331 875488 690356 821510 1010076 960174 912329 942585 926067 1049172
13806 1049172 803078 905055 991438 579915 907838 130475 924666 679551 561970 876810
$$ packed form
13876A143999j30548m3734O2712J8590L51037j01378Q5846k87875k02256K20174
13866A116567M0461j35831Q9464L4463k14101L52351j76255j16548R7403J04537
13856A192511J17217r6008m02345J85061j8350M6871J06469l21650J82500J9475
13846A011751k12909M60393j00162M1443l31632K0375J98757j57057q8896L20223
13836A162286k91405L38996l7007J1736k29557p028J38028j59951l61843K58431
13826H22686J99585J30173j74535J03242m04381J62816K19804m10021K00441j68189
13816F81621L17710j23843j85132J31154J88566m9902m7845L0256j6518J23105
13806A049172k46094J01977Q6383m11523L27923A30475P94191k45115j17581L14840
$$ plain form
13796 876810 860447 599232 891917 1005360 559148 715204 903645 822118 669579 971291
13786 971291 809139 601149 976114 708442 984257 935039 1030262 725870 430496 546118
13776 546118 977388 500561 995512 1214664 662627 944627 699601 971927 645456 745013
13766 745013 648957 577627 926065 770564 795307 672207 142380 835737 864398 758036
13756 758036 766942 640815 801908 837963 712168 450999 494881 610730 767207 777130 750346
13745 750346 716197 501986 867074 491388 624993 479494 940030 594162 521812 709291
13735 709291 313134 753760 641509 737234 610566 729231 219952 693206 586605 423694
13725 423694 583479 571071 887760 346878 429451 692455 476561 705066 368568 760148
$$ packed form
13796H76810j6363k61215K92685J13443m46212J56056J88441q1527j52539L01712
13786I71291j62152k07990L74965k67672K75815m9218R5223l04392k95374J15622
13776E46118M31270m76827M94951K19152n52037K82000k45026K72326l26471R9557
13766G45013r6056p1330L48438j55501K4743j23100A42380O93357K8661j06362
13756G58036Q906j26127J61093L6055j25795k61169M3882J15849J56477R923k6784
13745G50346l4149k14211L65088l75686J33605j45499M60536l45868p2350J87479
13735G09291C13134M40626j12251R5725j26668J18665B19952M73254j06601j62911
13725D23694J59785j2408L16689C46878Q2573K63004k15894K28505l36498L91580
$$ plain form
13715 760148 397416 448055 664136 461899 611765 850331 287754 466033 742382 590614
13705 590614 277569 767056 677130 598350 678219 926385 667526 237716 388607 763375
13695 763375 770328 578650 621177 776734 406158 490221 826727 807791 350790 440695 376537
13684 376537 419103 360241 643363 315028 557740 489335 504172 498589 370809 373581 505524
13673 505524 517557 367257 73677 395894 447941 346045 180230 372672 374041 433053 342299
13662 342299 368238 488332 458879 516328 549369 655958 613787 317241 247565 488528 284293
13651 284293 590997 538365 515990 557057 536354 476208 73966 342782 404171 175943 495103
13640 495103 510213 282589 237328 751344 409739 163425 432131 444788 427917 285125
$$ packed form
13715G60148l62732N0639K16081k02237J49866K38566B87754J78279K76349j51768
13705E90614B77569M89487q9926p8780P9869K48166k58859B37716J50891L74768
13695G63375O953j91678M2527J55557l70576Q4063L36506j8936C50790Q9905o4158
13684C76537M2566n8862K83122C15028K42712o8405J4837n583j27780K772J31943
13673E05524J2033j50300G3677L22217N2047j01896j65815J92442J369N9012r0754
13662C42299K5939J20094k9453N7449L3041J06589m2171k96546o9676K40963k04235
13651B84293L06704n2632k2375M1067k0703o0146G3966K68816O1389A75943L19160
13640D95103J5110k27624m5261N14016l41605A63425K68706J2657j6871j42792
$$ plain form
13630 285125 313796 647454 400791 302625 382514 361819 586807 411353 417242 470366 500220
13619 500220 243689 1042230 458778 365823 378114 267848 389225 598295 307641 451879
13609 451879 376664 300646 451804 185759 522240 634756 129762 98507 195094 543778
13599 543778 -33723 276671 539572 450920 163596 50789 630266 471292 481597 458102
13589 458102 388834 512547 289594 -182901 782195 343093 453301 232439 473657 264097
13579 264097 140119 53821 491445 296588 451961 306724 190553 294561 381135 -152367
13568 370573 391851 365394 337494 371797 -15661 110848 693331 179233 243978 361881 441875
13557 441875 212994 329169 241289 383258 51854 455578 30583 608335 195145 364920
$$ packed form
13630B85125K8671L33658k46663r8166P9889k0695K24988j75454N889N3124K9854
13619E00220B43689P98541D58778r2955J2291j10266J21377K09070k90654J44238
13609D51879p5215p6018J51158A85759L36481J12516A29762l1255R6587L48684
13599E43778c3723B76671K62901q8652A63596E0789N79477j58974J0305k3495
13589D58102o9268J23713k22953a82901G82195C43093J10208k20862K41218k09560
13579B64097j23978E3821M37624j94857J55373j45237j16171J04008Q6574a52367
13568C70573K1278k6457k7900L4303a5661A10848N82483A79233O4745J17903P9994
13557D41875B12994J16175q7880J41969E1854M03724C0583N77752A95145J69775
$$ plain form
13547 364920 367579 393506 379937 503372 243007 269695 304303 91919 260288 355968 352823
13536 352823 -63841 404251 179306 384052 170669 470671 2386 216010 17195 315047
13526 315047 233247 287363 294786 -70466 496334 245893 490575 501946 247331 292863 602271
13515 602271 103697 242732 214709 319815 323693 482736 -174465 460883 525187 595085
13505 595085 495869 341993 -136194 252550 369673 186671 229740 283625 433624 85907
13494 187718 232516 273977 557043 318159 584072 341894 630827 376454 341481 -85270
13483 215765 257994 55932 313496 156207 143294 148614 363661 134321 271604 276876 147254
13472 147254 379549 168953 427273 393235 123349 368317 -170828 276961 -101255 416053
$$ packed form
13547C64920K659K5927j3569J23435B43007K6688L4608I1919J68369R5680l145
13536C52823f3841D04251A79306K04746A70669L00002B386K13624A7195K97852
13526C15047q1800N4116P423g0466D96334B45893K44682J1371B47331M5532L09408
13515F02271A03697J39035k8023J05106L878J59043a74465D60883O4304O9898
13505E95085r9216j53876a36194B52550J17123j83002M3069N3885J49999H5907
13494A87718M4798M1461K83066k38884K65913k42178K88933k54373l4973h5270
13483B15765M2229E5932K57564A56207j2913N320K15047A34321J37283N272j29622
13472A47254K32295A68953K58320l4038A23349K44968a70828B76961a01255D16053
$$ plain form
13461 -59043 -5967 41754 5886 -58529 131568 294808 384254 166526 209418 336049 342373
13450 342373 183439 300810 165673 332284 269953 105355 566005 106586 155024 185297
13440 185297 359749 353872 293567 348813 -143183 323652 145160 425574 100644 468015
13430 468015 -68705 36611 187525 213926 -21053 311420 94408 270927 270160 182719 152890
13419 152890 210748 437057 425213 93822 574337 389996 308328 -14564 403382 79882 -119685
13407 187238 168001 481205 89704 465247 65093 433684 -57822 374103 45192 164434
13397 164434 18348 124858 227507 321902 157548 183867 380022 201139 182565 383723
13387 383723 125419 -24444 43963 112393 170616 237658 -180135 -26276 334105 253943 288006
$$ packed form
13461e9043e967D1754E886e8529A31568J63240Q9446A66526M2892J26631O324
13450C42373j58934J17371j35137J66611o2331A05355M60650A06586M8438L0273
13440A85297J74452n877o0305N5246a43183C23652A45160K80414A00644L67371
13430D68015f8705C6611J50914K6401b1053C11420I4408J76519p67q7441k9829
13419A52890N7858K26309j1844I3822M80515j84341q1668a4564D03382G9882a19685
13407A87238j9237L13204H9704L75543F5093L68591e7822C74103D5192J19242
13397A64434A8348J06510J02649R4395A57548K6319J96155j78883j8574K01158
13387C83723A25419b4444D3963O8430N8223O7042a80135b6276C34105q0162L4063
$$ plain form
13376 288006 217533 33652 513906 -219895 350501 126534 124359 240151 64276 146874 32894
13364 -59750 456305 760229 238402 274700 -71463 245607 203123 130218 231848 47360 473299
13353 473299 240094 229728 62079 92580 -7448 324945 63703 -108189 159995 196657 -33169
13341 571444 181484 -168869 254870 -84352 109439 200661 16333 411266 51531 258384
13331 258384 372837 248171 77224 65156 -94567 218381 113384 320910 201306 291329
13321 291329 599859 100907 301268 59006 -24836 205827 303396 141294 140480 93228 359104
13310 359104 208719 239465 58407 251200 391317 262080 295295 209415 153668 413542
13300 413542 348396 139238 470480 218012 -74321 199837 235478 172196 157529 -6432 51083
$$ packed form
13376B88006p0473C3652M80254b19895C50501A26534k175J15792F4276Q2598C2894
13364e9750D56305L03924B38402L6298g1463B45607m2484p2905J01630D7360M25939
13353D73299k33205j0366F2079L0501g448C24945F3703a08189A59995L6662c3169
13341E71444A81484a68869B54870h4352A09439R1222A6333L94933E1531K06853
13331B58384J14453j24666G7224j2068i4567B18381j04997K07526j19604R0023
13321B91329L08530A00907K00361E9006b4836B05827R7569A41294q14m7252K65876
13310C59104j50385L0746E8407J92793J40117j29237L3215q5880n5747K59874
13300D13542o5146A39238L31242B18012g4321A99837L5641o3282j4667f432E1083
$$ plain form
13288 128241 106361 249362 19742 254317 247707 481916 488176 85262 -141651 522598 41713
13276 -260862 460637 296237 36961 23640 90318 195326 330494 42832 154712 166208
13266 166208 -198426 242074 153732 168860 72295 209667 165483 -68197 257292 165350 30751
13254 -186737 96730 -146812 -46239 -49096 177629 449326 37 -46757 -89544 30903 242482
13243 242482 94283 80676 183996 -43896 -230784 174127 356555 176144 408463 105959
13232 -159912 265821 64739 367177 79268 309419 -176772 126079 -23008 -33199 264698
13221 207510 205314 76014 183362 111529 186224 102669 263602 218146 6447 197204 66617
13209 -198665 -62650 10471 21915 180086 -51379 266880 214412 -39802 -47695 -38836 395442
$$ packed form
13288A28241k1880J43001A9742K34575o610K34209O260H5262a41651E22598D1713
13276b60862D60637j64400C6961j3321O6678J05008J35168D2832J11880J1496
13266A66208a98426B42074q8342J5128G2295J37372m4184f8197B57292r1942C0751
13254a86737I6730a46812d6239k857A77629K71697C7d6757m2787C0903K11579
13243B42482I4283j3607J03320d3896j86888A74127J82428A76144K32319A05959
13232a59912B65821F4739L02438G9268K30151a76772A26079b3008j0191B64698
13221B07510k196G6014J07348p1833P4695q3555J60933m5456F447J90757F6617
13209a98665f2650A0471J1444J58171e1379B66880n2468c9802p893Q859C95442
$$ plain form
13197 209998 25737 -60897 16449 205516 29034 378790 -30192 454897 179124 413283
13187 413283 175193 124235 -43413 104658 276147 35054 57913 60383 113923 189887 -160916
13175 193883 149649 217209 -111846 63006 387091 2746 185108 126419 98443 90785 29578
13163 -79423 87830 198555 103279 452438 156775 173054 -107718 -54354 136993 382384
13153 382384 239411 150476 561625 -204902 309846 150110 184883 153272 -219863 -50704
13142 196171 146115 -157044 129991 -81915 -85368 -83887 -4554 55442 103373 82801 164483 125097
13130 125097 24843 48466 152263 -17011 183999 -106546 294835 245200 -130508 -141873
13120 -141873 -137054 72790 45389 12662 -11164 299154 244905 162089 182261 -7377 192439
$$ packed form
13197B09998B5737f0897A6449J89067B9034L49756c0192D54897A79124K34159
13187D13283A75193n0958d3413A04658J71489C5054K2859K470N3540P5964a60916
13175A93883m4234O7560a11846F3006L24085B746J82362n8689k7976p658B9578
13163g9423H7830J10725r5276L49159A56775J6279a07718N3364A36993K45391
13153C82384j42973q8935M11149b04902C09846A50110L4773l1611b19863e0704
13142A96171n0056a57044A29991h1915l453J481d554E5442M7931k0572Q1682l9386
13130A25097B4843K3623J03797a7011A83999a06546B94835m9635a30508j1365
13120a41873M819G2790k7401A2662a1164B99154n4249q2816K0172g377A92439
$$ plain form
13108 -192058 238514 25137 -101841 -51753 178339 56555 -22850 -98137 318792 -4755 -112737
13097 -112737 154480 75423 -78280 359688 197688 95695 -51114 239479 -40843 146496
13086 -8960 10288 73942 79072 -48575 268553 29803 53341 458089 -33130 69347 -95782 40482
13073 197503 224914 414133 29543 -39112 5295 35752 14244 142866 333243 -133352 204959
13061 17876 198205 121254 152725 137524 -9570 -206004 88748 74656 -66693 -99417 282693
13049 239413 320435 268167 406757 -12006 319156 -7943 130106 194926 -86706 173853 385972
13038 385972 -150294 257485 57734 227864 166896 -147099 271907 -1754 179456 -133964
13027 155240 264624 163038 -34338 -73214 -62004 165378 261680 255618 -212059 -172640 273799
$$ packed form
13108a92058B38514B5137a01841N0088A78339E6555b2850p5287C18792d755j07982
13097a12737A54480G5423g8280C59688j62000I5695e1114B39479d0843A46496
13086h960A0288O3654N130d8575B68553B9803K3538M04748c3130F9347i5782D0482
13073A97503K7411J89219B9543c9112E295L0457A4244J28622J90377a33352B04959
13061A7876J80329p6951L1471j5201i570j96434H8748j4092f6693l2724B82693
13049B39413Q1022n2268J38590a2006C19156g943A30106O4820h6706A73853K12119
13038C85972a50294B57485E7734J70130o0968a47099B71907a754A79456a33964
13027A55240J09384j01586c4338l8876J1210A65378R6302o062b12059L9419B73799
$$ plain form
13015 -2625 -62871 -237673 242919 339225 116422 286063 -77270 68413 464833 260069 237149
13004 237149 251518 47005 -107072 217341 129899 100067 7386 68929 9830 117167 323203
12993 323203 -165369 -77435 -130861 51952 27381 193042 47788 -19814 -224183 -22557 149371
12981 35423 147670 1519 -27192 -191110 24177 14782 152143 136779 102690 167348 176994 -34706
12968 237968 -67186 213578 6833 -108413 33706 -143353 137761 320526 -17402 -106635 75708
12956 232015 51800 -134069 -348839 -58005 -11651 308055 -192408 -27916 -45448 -32031 -75977
12945 -75977 92988 135738 -291138 -119990 42331 41960 -50907 119673 -105950 -145448 123666
12933 241227 60804 131462 -17328 336845 -12433 -46871 20770 137943 22698 -359506 229173
$$ packed form
13015b625o0246j74802B42919R6306A16422J69641g7270F8413L96420k04764k2920
13004B37149J4369D7005a07072B17341q7442k9832G386O1543I830J07337K06036
12993C23203a65369g7435n3426E1952k4571J65661D7788a9814k04369b2557A49371
12981C5423J12247A519b7192j63918B4177r395J37361j5364l4089O4658R646c4706
12968B37968f7186B13578F833a08413C3706a43353A37761J82765a7402q9233G5708
12956B32015E1800a34069k14770e8005a1651C08055a92408b7916j7532J3417m3946
12945g5977I2988M2750b91138a19990D2331l71e0907A19673a05950l9498A23666
12933B41227F0804P0658a7328C36845a2433l4438B0770J17173B2698c59506B29173
$$ plain form
12921 104966 -10182 194713 77452 122916 164965 52814 40336 10437 -50858 66643 -93711
12909 -302751 -215570 317828 81883 126698 363541 -82951 133442 357576 89385 -63396 388994
12897 109647 199328 -2104 235596 43910 -128678 170619 147632 110377 124067 -222895 -79859
12885 -154362 117081 301715 43976 -83496 196864 -50412 -9494 58997 -26595 -12036 186926
12873 149255 -93729 -209114 19538 271884 289890 -183365 -104850 -153498 68178 132823 305342
12862 305342 -127619 34048 396664 -24471 117971 97382 -255317 78819 184346 527471
12852 527471 -95254 -139992 181662 -244454 -205205 113366 -2515 66848 198673 338453 426491
12841 426491 318612 93821 -81469 31634 250274 -4496 41162 480317 -208043 -113870 -4283
$$ packed form
12921A04966a0182A94713G7452M5464M2049E2814j2478A0437e0858F6643i3711
12909c02751Q7181C17828H1883M4815K36843h2951A33442K24134H9385f3396C88994
12897A09647Q9681b104B35596D3910a28678A70619k2987l7255J3690b22895g9859
12885a54362A17081J84634D3976h3496A96864e0412i494E8997b6595a2036A86926
12873A49255i3729j15385A9538K52346J8006a83365P8515m8648F8178O4645J72519
12862C05342a27619C4048L62616b4471A17971k0589b55317G8819J05527L43125
12852E27471i5254m4738A81662b44454L9249A13366b515F6848J31825J39780Q8038
12841D26491j07879I3821h1469C1634K18640d496D1162M39155b08043R4173d283
$$ plain form
12829 -81644 64262 -136809 217576 32208 -58625 -12775 77985 -104282 -138736 1807 156850
12818 156850 283332 -114994 -208304 49925 -260235 64790 -147633 290648 98907 150916
12808 150916 -193502 -138873 244012 -104542 101072 360278 46989 256720 -143015 -106867
12798 -106867 401754 236514 255825 19881 -18936 240138 -91275 -96141 -238937 417489 150611
12786 329804 65901 13759 -135497 34994 68904 -123298 604 -21102 78964 -25096 -120520
12775 -120520 86291 244234 -340577 24718 19313 73294 -27383 -91935 7366 119869 144571
12764 144571 309667 -179039 142280 207490 -21515 -97877 -24173 -75671 -176124 -189944 15058
12752 -61763 -149408 73134 -82892 125261 94180 -91541 54650 11115 57184 -136025 107670
$$ packed form
12829h1644F4262a36809B17576C2208e8625a2775G7985a04282l4454A807J55043
12818A56850J26482a14994r3310D9925b60235F4790a47633B90648I8907N2009
12808A50916a93502N4629B44012a04542A01072K59206D6989K09731a43015L6148
12798a06867D01754j65240J9311A9881a8936B40138i1275m866j42796D17489A50611
12786C29804F5901A3759a35497C4994L3910a23298F04b1102G8964b5096r5424
12775a20520H6291J57943c40577B4718n405N3981b7383o4552G366J12503K4702
12764A44571J65096a79039A42280O5210b1515p6362b4173n1498j00453j3820A5058
12752f1763q7645G3134h2892A25261l1081i1541E4650A1115M6069a36025A07670
$$ plain form
12740 -12110 -289725 -382334 10604 177580 2115 277812 145279 88763 98575 -167650 250011
12728 -208379 -224058 132024 -180893 -8076 -1224 184046 233776 -49337 -14969 110464 70797
12717 70797 142912 -38719 42988 -163397 292770 -68172 -70205 187875 -120112 111357 203423
12706 203423 -71188 333928 394187 286301 160947 505363 58713 295882 -76699 15349
12695 256760 457086 -27516 159196 -281455 123828 133832 280644 -13777 -375520 89284
12684 22458 53370 -99663 -222521 277841 186960 115112 163246 223444 125112 4803 27651
12673 27651 111185 157156 -63331 271515 278338 64024 11769 182872 -42456 310861 -2767
12661 276043 121633 324380 -59606 105030 150286 5892 199419 128043 76095 141134 417840
$$ packed form
12740a2110k77615r2609A0604J66976B115K75697j32533n6516R812a67650B50011
12728b08379j5679A32024a80893h076a224A84046M9730d9337a4969A10464l9667
12717G0797P2115c8719D2988a63397B92770f8172k033A87875a20112A11357R2066
12706B03423g1188C33928O0259j07886j25354L44416E8713K37169g6699A5349
12695B56760K00326b7516A59196b81455A23828J0004J46812a3777l61743H9284
12684B2458L0912i9663j22858B77841r0881p1848M8134O0198r8332D803K2848
12673B7651Q3534M5971f3331B71515O823F4024A1769J71103d2456C10861b767
12661B76043A21633K02747e9606A05030M5256E892J93527p1376n1948O5039K76706
$$ plain form
12650 417840 133276 72459 57057 114910 60178 -75985 -23651 -65474 32368 -54197 -82086
12639 -82086 -310288 188922 -134690 144075 -63371 169559 -4646 35154 351078 203644
12629 203644 80550 366475 156654 116491 -13271 138082 23112 199419 230488 165003 173384
12618 173384 190597 -33262 119908 -60050 -53670 105597 510626 202284 37624 -44725 183765
12606 143856 19583 -104359 26245 380553 164542 41435 -177654 -189215 210865 397286
12596 397286 -32818 121901 -138134 126825 326263 173281 108901 5359 -61732 93367 190435
12585 190435 244994 152149 7904 -127645 40138 -229875 189401 185439 254712 -72087 263627
12573 43207 167877 -333635 -35628 150506 -179918 24871 -221179 -37544 -44942 -38640 8267
$$ packed form
12650D17840A33276o0817j5402N7853n4732g5985b3651m1823C2368e4197k7889
12639h2086k28202A88922a34690A44075f3371A69559d646C5154L15924j47434
12629B03644H0550K85925A56654m0163a3271A38082B3112J76307L1069o5485Q381
12618A73384J7213c3262A19908f0050O380A05597M05029B02284C7624d4725A83765
12606A43856A9583a04359B6245L54308A64542D1435a77654j1561B10865J86421
12596C97286c2818A21901a38134A26825J99438j52982o4380E359f1732I3367R7068
12585A90435N4559r2845G904a27645D0138b29875A89401l962O9273g2087B63627
12573D3207J24670c33635c5628A50506a79918B4871b21179c7544p398O302H267
$$ plain form
12561 152396 126895 5107 -51529 -71166 23205 -208503 -132789 382113 -82227 -56245 81984
12549 70214 -351610 -11482 196067 56486 16213 -29198 -145420 -27227 -90758 52312 225634
12538 225634 126215 204951 78384 149428 326725 -33749 330908 131282 206920 1397 78412
12527 78412 -110864 21572 324962 -49019 332895 -344303 -179868 254088 69074 -119583
12516 -9037 -37548 11702 142701 54233 -81103 -180317 -8411 -302040 250949 125889 -234770
12504 140353 74931 -204856 -14247 155480 -54841 -67269 -89291 204645 -75060 -110149 226096
12492 -724199 -12554 -220061 -90324 139826 -184939 -104627 126317 158269 218098 98930 -55879
12480 244638 21105 191514 -189268 157332 171889 21054 -110 84539 150726 -162063 19997
$$ packed form
12561A52396k5501E107e1529j9637B3205b08503P5714C82113h2227K5982H1984
12549G0214c51610a1482A96067E6486A6213b9198j16222b7227o3531E2312J73322
12538B25634r9419P8736G8384P1044J77297c3749C30908A31282P5638A397P7015
12527G8412a10864B1572L03390d9019C32895c44303J64435B54088F9074a19583
12516i037k8511A1702J30999E4233h1103r9214h411k93629B50949j25060b34770
12504A40353o5422b04856a4247A55480e4841j2428k2022B04645g5060l5089B26096
12492g24199a2554k07507i0324A39826a84939Q0312A26317L1952N9829I8930e5879
12480B44638B1105J70409a89268A57332J4557B1054a10H4539O6187a62063A9997
$$ plain form
12468 -13101 281782 39655 194408 -123951 -81337 146580 -117487 81486 20538 62440 73005
12457 73005 -194298 133754 213264 -12622 -24061 43452 115369 -76411 146902 -31558 -402098
12446 -402098 -24444 182146 -47660 44280 20050 300355 134430 -227071 347646 142669
12435 -28258 208215 -63589 25329 21329 -55771 22756 -2778 -137805 -64392 -37700 292526
12423 -100093 89040 138701 121247 -160201 -30522 126571 -113756 395416 90677 -211726
12412 24225 -188001 62125 205336 229171 285252 -300705 63422 21130 -156977 -244868 306878
12400 17076 120917 -8229 35886 24738 -182876 -149180 55224 -189417 261167 3543 162028
12389 162028 132075 32813 94160 -12796 -365217 43788 56051 -102066 10943 -67878 -38587
$$ packed form
12468a3101B81782C9655J54753a23951M2614A46580a17487H1486B0538M1902J0565
12457G3005a94298A33754P9510a2622j1439D3452P1917g6411A46902c1558l70540
12446d02098b4444A82146d7660D4280B0050K80305A34430b27071C47646A42669
12435b8258B08215f3589B5329m000e5771B2756b778j35027f4392K6692B92526
12423a00093H9040M9661j7454a60201c0522A26571a13756C95416I0677b11726
12412B4225a88001F2125J43211K3835N6081c00705F3422B1130a56977q7891C06878
12400A7076J03841h229C5886j1148a82876L3696E5224a89417B61167C543J58485
12389A62028k9953C2813O1347a2796l52421D3788J2263a02066A0943f7878K9291
$$ plain form
12378 -38587 124833 458855 9808 149394 125087 24838 -255997 52048 89965 -80686 387844
12366 341998 -238906 159706 -104881 52841 148071 -116547 73106 -114230 49232 44341 10248
12354 -148763 92437 -210538 24817 107270 -45038 215056 -16552 114808 39815 -101068 86223
12342 -169706 -60131 -163593 151667 4075 -52357 -102807 213882 188976 370834 8949 139895
12331 139895 255164 -155421 183254 -350964 321196 -473643 -171881 -121748 137206 -102388
12320 -87994 10312 -215744 -194480 97223 9348 257497 -675 54639 111864 110742 221356 -37527
12307 44904 301717 76213 -331495 -33227 -160519 -111721 81767 -62087 -82187 -118551 -119874
12296 -119874 -78136 88516 77316 113805 108869 484105 -4635 -254142 -111610 197695 156473
$$ packed form
12378c8587A24833L34022I808J39586k4307B4838b55997E2048L7917h0686C87844
12366C41998b38906A59706a04881E2841R5230a16547G3106a14230D9232m891A0248
12354a48763I2437b10538B4817Q2453d5038B15056a6552A14808C9815a01068H6223
12342a69706f0131j03462A51667D075e2357n0450B13882k4906J81858H949J30946
12331A39895J15269a55421A83254c50964C21196d73643a71881N0133A37206a02388
12320h7994A0312b15744K1264I7223I348K48149f75E4639N7225j122J10614c7527
12307D4904K56813G6213c31495c3227j27292M8798H1767f2087k0100l6364j323
12296a19874M1738H8516j1200L6489m936L75236d635k49507a11610A97695m1222
$$ plain form
12285 156473 51024 159110 -215315 110658 138621 22683 -103003 -37103 85376 286028
12275 286028 182886 -674 55009 207881 49228 144811 350352 -141726 -7380 67750 173889
12264 173889 -102086 143015 -94837 -56219 48733 358254 207549 21268 5277 70646 495578
12253 495578 -18465 238379 -230555 -362899 697477 -110650 -53430 189462 25791 76493
12243 76493 285555 131377 -270402 178730 130334 162636 -54026 -387999 104361 -45471
12232 144869 96046 -164455 24099 235263 422790 214293 136281 39752 513658 -84659
12221 27024 134551 204011 8535 141544 390471 -98571 112381 467373 26279 -15839 -152853
12210 -152853 259266 54695 -188532 93618 337429 113605 454328 109681 189810 322702
$$ packed form
12285A56473E1024J08086b15315A10658K7963B2683a03003c7103H5376K00652
12275B86028j03142f74E5009J52872D9228R5583K05541a41726g380F7750J06139
12264A73889a02086A43015i4837L8618D8733L09521j50705B1268E277O5369M24932
12253D95578a8465B38379b30555j32344F97477a10650e3430A89462B5791N0702
12243G6493K09062A31377b70402A78730m8396L2302e4026l33973A04361d5471
12232A44869m8823a64455B4099K11164J87527k08497p8012C9752M73906h4659
12221B7024J07527O9460H535J33009K48927i8571A12381L54992B6279a5839j37014
12210a52853B59266E4695a88532I3618K43811A13605L40723A09681Q0129J32892
$$ plain form
12200 322702 -19036 -77266 59448 205539 -17003 266467 176103 91668 -54644 258238 -102754
12188 -127802 261741 213775 300491 114331 316127 308539 -122147 198759 197643 -149560 108509
12176 311527 -60375 -108375 179995 158956 192951 138543 -22358 271356 305999 113289 27221
12164 49288 124534 175702 -12284 198441 87831 -49720 142363 380116 -45692 134548 189205
12153 189205 188863 381404 160003 117898 285907 110510 -192383 80840 251270 26824 -8002
12141 -436625 246798 146069 186005 198688 61269 -4407 127573 -148188 32687 171377 259704
12130 259704 -108469 -46795 5471 28354 -426594 93144 -272571 281923 40930 -25261 -80423
12119 -80423 -46527 273512 68896 -50310 139282 -79805 -147488 -82950 126731 178528 -164070
$$ packed form
12200C22702a9036n8230E9448J46091a7003B66467r0364q4435e4644B58238a02754
12188a27802B61741m7966Q6716A14331K01796p588a22147A98759j116a49560A08509
12176C11527f0375m8000A79995k1039L3995n4408b2358B71356L4643A13289B7221
12164D9288P5246N1168a2284A98441H7831d9720A42363K37753d5692A34548N4657
12153A89205l42J92541A60003m2105J68009A10510a92383H0840J70430B6824h002
12141d36625B46798j00729L9936J2683F1269d407A27573a48188C2687J38690Q8327
12130B59704a08469d6795E471K2883d26594I3144b72571B81923D0930b5261n5162
12119h0423L3896B73512F8896e0310A39282g9805o7683O4538A26731N1797a64070
$$ plain form
12107 25658 -126057 399468 -68914 -56740 -206041 15947 -57277 -114231 282133 17774 -53273
12095 -26739 223931 161341 134129 214783 107838 -37359 -284299 396289 248136 -21369 -72963
12084 -72963 -23909 -353376 114164 199692 -42126 798801 1910140 993776 480489 24739
12073 -201050 130184 -44005 101570 85965 119984 -39684 358043 251223 -380384 516331
12062 -92723 2269 267345 118515 86589 -413390 -149104 30205 43650 8389 60035 42889
12051 42889 -75638 331419 -101882 -27891 -18232 -164695 -106199 -109711 -94310 -13972 -9553 127654
12038 201420 -71496 122590 184458 102118 -308391 40748 -138972 240848 -1566 -19825 -44970
12027 -44970 -236259 -198444 -282353 29691 503 72653 -131721 -2360 -291517 -326298 14822 138610
$$ packed form
12107B5658a26057C99468f8914J2174j49301A5947e7277n6954B82133A7774e3273
12095b6739B23931o2590k7212Q0654j06945c7359k46940C96289j48153b1369n1594
12084g2963b3909l29467A14164Q5528d2126G98801J111339r16364D80489B4739
12073b01050A30184d4005A01570j5605L4019c9684C58043j06820c80384E16331
12062i2723B269K65076A18515l1926d13390a49104C0205J3445H389N1646j7146
12051D2889g5638C31419a01882b7891R659j46463N8496l512J5401a3972M419A27654
12038B01420g1496A22590O1868q2340c08391D0748a38972B40848a566j8259k5145
12027d4970j91289L7815q3909B9691E03P2150a31721b360k89157l4781A4822J23788
$$ plain form
12015 138610 -87589 246700 -8685 -1716 -528 -279224 -31017 214751 -29455 -3137 246438 -127026
12002 128723 54324 -175179 196606 -7281 -130323 97970 -50052 424355 -37755 55466 -31769
11990 -133336 79244 -28894 -196118 24244 -99657 -33120 -238680 141530 -63631 -308084 -93253
11978 95507 -81252 -57410 -39472 206890 -315557 -199561 -203437 -133275 120092 -1275 -193761
11967 -193761 115313 -181062 264122 -274617 200147 93022 71325 -128164 -39730 -174378
11957 -174378 -145800 162109 -273217 -138451 209814 50517 58707 21590 138488 33655 -195619
11945 124608 -322347 45787 29151 -111317 -33826 -100129 -54974 277848 -235638 -36304 5188
11933 334267 -110277 30392 -106549 -152598 -33651 -27063 161230 98471 -288330 -248181 212169
$$ packed form
12015A38610h7589B46700h685a716e28k78696c1017B14751b9455c137B46438a27026
12002A28723E4324a75179A96606g281j23042I7970e0052D24355c7755E5466c1769
11990a33336G9244b8894j67224B4244i9657c3120k05560A41530f3631k44453i3253
11978I5507h1252K3842J7938B06890c15557J15996l876P0162A20092a275j92486
11967a93761A15313a81062B64122b74617B00147I3022k1697a28164c9730j34648
11957a74378K8578A62109b73217J34766B09814E0517Q190B1590J16898C3655a95619
11945A24608c22347D5787j6636a11317c3826o6303M5155B77848b35638c6304E188
11933C34267a10277C0392a06549m6049c3651O588A61230o2759b88330M0149B12169
$$ plain form
11921 27572 -178502 -101692 101801 -107896 205714 -256107 -51916 -9976 -81652 -240810 127220
11909 -129309 -109092 -141596 3621 -2845 246960 137331 186344 449210 86140 299082 53700
11897 -202327 -118989 -17537 -7914 -263856 -98020 -30152 -139365 -166982 40498 256524 60318
11885 -148671 39171 257911 -69341 -171791 165176 58407 -255065 -61197 165086 -188372
11874 -140404 -217462 41841 -458424 -21954 -90889 -103975 -269794 -302659 218440 189606 -45674
11862 21696 213003 -99988 22536 -101571 -126742 164204 -85528 137520 153662 98006 -49990
11850 -154302 -134461 11493 -187102 124334 235478 166789 180655 160336 119960 30989 25247
11839 25247 -3781 -36162 -145449 -90660 63137 -173275 72867 -269446 -97387 3017 -130085
$$ packed form
11921B7572a78502P6810A01801a07896B05714b56107e1916i976p1676j59158A27220
11909a29309K0217l2504C621b845B46960j09629M9013K62866H6140K12942E3700
11897b02327Q3338a7537g914k55942i8020c0152j09213k7617D0498K16026F0318
11885a48671C9171K18740f9341j02450A65176E8407b55065f1197A65086a88372
11874a40404p7058D1841d58424b1954o8935j3086j65819l2865B18440k8834d5674
11862B1696J91307i9988B2536a01571k5171A64204h5528A37520J6142n5656d9990
11850a54302J9841A1493a87102A24334J11144o8689J3866k0319m0376C0989n742
11839B5247c781l2381j09287N4789F3137a73275G2867b69446i7387C017a30085
$$ plain form
11827 211452 247027 17807 132683 -75170 -123529 -123541 -385113 -67460 -72932 194115 67840 -115206
11814 -24563 -248573 -318340 61872 -97749 32856 -237331 -53652 -386168 -149347 -35438 -113516
11803 -113516 -169208 -26530 -19908 -805 278275 49193 -392652 99437 -114060 94538 122559
11792 122559 -224306 -129430 -98146 87182 96747 416282 23748 190514 61409 -188042 468384
11780 -175424 79317 -445635 -54426 -287394 -202720 -95756 95043 359285 -5149 -245554 94888
11768 -30679 18211 -233024 60200 -130431 189583 48390 -221148 -180904 123671 -14151 98567
11756 183606 -100030 -85672 -96987 96953 -155492 -55454 -191478 -122412 -241430 81133 351723
11745 351723 -45628 -56140 -95756 -24494 -189548 240823 247452 5526 -191789 5002 -107223
$$ packed form
11827B11452L5575A7807J14876g5170m8359j2k61572f7460n472A94115F7840a15206
11814b4563k24010o9767F1872i7749C2856b37331e3652l32516a49347c5438p8078
11803a13516n5692b6530O622h05B78275D9193c92652I9437a14060I4538K8021
11792A22559b24306R4876L1284H7182R565L19535B3748J66766F1409a88042D68384
11780a75424G9317d45635e4426k32968Q4674i5756I5043K64242e149k40405I4888
11768c0679A8211b33024F0200a30431A89583D8390b21148M0244A23671a4151I8567
11756A83606a00030J4358j1315I6953a55492e5454j36024O9066j19018H1133K70590
11745C51723d5628j0512l9616b4494j65054B40823O629E526a91789E002a07223
$$ plain form
11733 -183206 -50052 74386 136761 119819 -129689 -59079 -181672 154216 -127003 -105453 26616
11721 10968 58025 236950 75933 -114424 60490 -191584 117027 27940 -177837 10846 -6142
11709 195621 115455 127732 170213 137344 129327 -179402 -92064 229130 226255 75369 247588
11698 247588 170857 206583 -174621 -63007 382390 33182 -88076 123660 -129346 11178 182822
11687 182822 252899 126756 208078 84265 68531 -121242 63239 -258520 245867 -297372
11676 220613 130008 -407176 56442 -129015 184038 146289 92373 118312 78983 -175297 75441
11664 -22383 62896 148973 77925 104230 14890 54135 17726 -89226 104983 61081 -182103
11652 145324 -115633 -271634 -1140 277656 -22148 227956 233483 -282708 135610 100580 -249222
$$ packed form
11733a83206e0052G4386O2375j6942a29689e9079j22593A54216a27003K1550B6616
11721A0968M7057J78925G5933a14424F0490a91584A17027B7940a77837A0846f142
11709A95621q0166J2277M2481l2869q017a79402Q7338B29130k875G5369J72219
11698B47588p6731L5726a74621f3007C82390C3182h8076A23660a29346A1178J71644
11687A82822P0077j26143Q1322H4265j5734a21242F3239b58520B45867b97372
11676B20613r0605d07176E6442a29015A84038l7749n3916K5939l9329a75297G5441
11664b2383F2896Q6077p1048K6305A4890L9245A7726h9226A04983m3902a82103
11652A45324a15633j56001a140B77656b2148B27956N527b82708A35610l5030b49222
$$ plain form
11640 100653 236152 -38853 -370875 224829 -21334 102064 59235 39627 203277 -17022
11629 85932 89998 -139706 -28780 16846 -90363 174954 136284 214882 200187 -20825 160237
11617 -96585 29681 80728 130324 47556 -85238 -45750 279842 123531 -9720 -102663 621099
11605 69276 445498 -16791 116079 -159791 89767 -52620 116732 -82146 -29272 113334 -48106
11593 -316217 313169 138004 -60029 -110533 147461 109557 25147 -81072 -81640 13157 85438
11582 85438 44015 207024 -35245 148800 123063 -99066 -74416 -31980 -100717 102267 64218
11571 64218 -6778 169240 136513 62784 251016 -38422 47325 -87609 351190 215195 48388
11559 112813 312430 -105967 -49954 300953 181224 4519 -131185 -271193 -78082 103373
$$ packed form
11640A00653J35499c8853l32022B24829b1334A02064m2829j9608J63650a7022
11629H5932M066a39706b8780A6846i0363A74954l8670P8598j4695b0825A60237
11617i6585B9681N1047M9596D7556h5238L9488B79842A23531i720r2943F21099
11605F9276L76222a6791A16079a59791H9767e2620A16732h2146b9272A13334d8106
11593c16217C13169A38004f0029n0504A47461l7904B5147h1072n68A3157P2281
11582H5438m1423J63009c5245A48800k5737i9066K4650c1980o8737A02267l8049
11571F4218f778A69240l2727F2784J88232c8422D7325h7609C51190j35995D8388
11559A12813J99617a05967d9954C00953j19729D519a31185j40008g8082A03373
$$ plain form
11548 -13955 -22838 -7630 401759 -22148 12015 -204169 -25872 112343 -296715 6241 126924
11537 126924 -54327 74875 22655 46704 272262 152176 56622 -66544 -155977 -228173 200681
11525 313829 96328 -17142 86590 -250411 40299 126906 6960 338978 184474 25405 177553
11514 177553 -171030 136014 150723 28833 235991 256682 -126320 86040 -90668 -38026 11471
11502 161233 -46354 267210 -168606 -251328 60829 160530 196198 183979 -16066 138480 -27827
11490 23370 -27339 247685 306859 324771 318851 48548 -53981 52560 -61262 243408 -108199
11478 347650 -98809 99504 10729 213799 215420 252195 -72102 70825 47656 254582 -82152
11466 213759 249809 147691 120881 216962 350111 175840 168368 16400 59068 181283 142786
$$ packed form
11548a3955q883g630D01759b2148A2015b04169b5872A12343b96715F241J20683
11537A26924e4327G4875B2655K4049K25558j20086E6622f6544q9433p2196B00681
11525C13829I6328a7142H6590b50411D0299Q6607F960L32018j54504B5405J52148
11514A77553a71030A36014J4709B8833K07158K0691a26320H6040i0668c8026A1471
11502A61233d6354B67210a68606q2722F0829R9701L5668j2219a6066A38480b7827
11490B3370b7339B47685N9174J7912n920D8548e3981E2560f1262B43408a08199
11478C47650i8809I9504A0729K03070J621L6775g2102G0825k3169K06926h2152
11466B13759L6050j02118k6810R6081J33149j74271p472A6400M2668J22215l8497
$$ plain form
11455 142786 -187601 -65060 192289 -22705 -82146 336230 99366 -64926 -18160 596403 -98194
11443 194747 -304290 119015 278032 52457 169105 -2298 87705 -137573 888 -248003 392663
11431 -18328 220102 106477 -244828 -79787 288278 19997 138486 15233 -16742 259787
11420 -350811 74574 52048 59326 -118743 -278 -159396 31691 90154 -135874 -195796 9580 -83702
11407 164793 -112356 -85901 59326 28645 -79487 73393 300296 52203 79048 161673 241043
11396 241043 322040 -317809 156812 214848 -274225 -181297 -64282 -79151 -27096 86057 -33313
11384 -109810 -132150 -22341 160152 180531 -116148 210142 74595 191655 -244396 129292
11373 255143 100113 118436 -68306 58462 -137566 60129 -346034 -177603 -229385 51236 -182127
$$ packed form
11455A42786a87601f5060A92289b2705n9441C36230I9366f4926a8160E96403i8194
11443A94747c04290A19015J59017E2457J16648b298H7705a37573H88b48003C92663
11431a8328B20102A06477b44828g9787B88278A9997J18489A5233a6742B59787
11420c50811G4574k2526P278a18743b78j59118C1691N8463a35874n9922I580h3702
11407A64793a12356K6455E9326B8645g9487G3393K26903E2203K6845Q2625P9370
11396B41043Q0997c17809A56812N8036b74225R2928f4282j4869b7096H6057c3313
11384a09810k2340b2341A60152K0379a16148B10142G4595J17060b44396A29292
11373B55143A00113J8323f8306E8462a37566F0129c46034J68431n1782E1236a82127
$$ plain form
11361 9047 83842 -136823 181280 -174600 -393892 -157083 -87357 37145 221721 23721 -39541
11349 -229730 1484 353347 144820 330237 146059 236440 -242758 93194 -196081 27140
11338 434760 38543 123003 314385 -3306 226804 -220883 -206851 59264 -27432 49331 257565
11327 257565 -115818 -81816 -148786 69090 -338824 -97766 -176461 -5448 -207761 -52142 -296342
11316 -296342 -13205 8533 320987 30939 -81472 -1416 -90371 -79275 -178337 -231976 73076 48407
11304 48407 -95652 -157888 -35132 -117584 178423 -50816 -162123 -150147 -55387 20644 -108199
11292 82563 -269172 306597 11267 -188976 -124431 -2609 93618 -27963 -182240 -57045 -8617
11280 -167004 200335 66754 -283597 -171149 89824 -284403 -295071 178184 125402 -269767
$$ packed form
11361I047P4795a36823A81280a74600k19292a57083O9726C7145J84576B3721c9541
11349b29730A484L51863A44820J85417A46059R0381b42758I3194a96081B7140
11338D34760C8543Q4460J91382c306B26804b20883J4032E9264b7432D9331K08234
11327B57565a15818L4002o6970F9090c38824i7766p8695e448k02313e2142k44200
11316b96342a3205H533L12454C0939h1472a416q8955J1096r9062n3639G3076k4669
11304D8407i5652o2236c5132q2452A78423e0816j11307J1976e5387B0644a08199
11292H2563b69172C06597A1267a88976O4545b609I3618b7963j54277e7045h617
11280a67004B00335F6754b83597J12448H9824b84403j0668A78184n2782b69767
$$ plain form
11269 92180 71821 166938 78411 -185706 90561 26693 -241630 -5267 400801 -204085 -328784
11258 -328784 9736 -221324 55647 47616 -9092 -35668 -62337 67711 -37915 49515 252592 67314
11245 -169623 15033 -66079 204154 -166554 -327658 37837 131690 27176 -88409 -238078 -89836
11233 -46895 191264 -170718 251617 -83150 46743 34395 164390 -20585 88500 -82907 86639
11221 -23040 -122009 147899 -64371 59592 36795 70893 -129651 -82421 61093 45201 185129
11210 185129 -179151 -57072 -87860 230145 -226914 -121753 -258930 7473 -129715 -6577 -11265
11199 -11265 127792 59063 -44518 -74025 86021 138529 -41000 141838 29630 219325 -123
11187 -161481 282425 -242986 -192534 -161126 73701 91170 -137977 45626 88386 -31656 3908
$$ packed form
11269I2180k0359R5117G8411a85706I0561B6693b41630e267D00801b04085j24699
11258c28784I736b21324E5647q031i092k6576k6669F7711c7915D9515K03077F7314
11245a69623A5033f6079B04154a66554j61104C7837R3853B7176h8409j49669h9836
11233d6895A91264a70718B51617h3150D6743j2348J29995b0585H8500h2907H6639
11221b3040r8969A47899f4371E9592k2797L4098a29651M7230F1093j5892J39928
11210A85129a79151e7072l0788B30145b26914J05161j37177G473a29715f577m688
11199a1265A27792E9063d4518k9507H6021N2508d1000A41838B9630J89695a23
11187a61481B82425b42986N0452L1408G3701J7469a37977D5626M2760c1656C908
$$ plain form
11175 223804 -222784 45515 -289860 663 -132407 287401 22564 -181254 278817 288194 337046
11164 337046 -2512 -349316 294701 -47733 -234371 163190 57569 133263 -168565 -315534
11154 -315534 116514 -182248 -67348 271902 -23434 -259292 19597 -98522 89012 -34673 -46721
11143 -46721 328268 133838 -25884 102827 -50682 -89688 61848 110251 -103080 -132449 479466
11131 248215 295852 -52545 -157601 47440 -182278 240766 22331 -153799 -268698 168030
11120 2494 55010 211670 -135182 -196724 -109187 -105487 -418513 -183990 -55777 180065 308143
11109 308143 203566 66021 412296 159185 25759 17846 -93379 101374 -4693 -182277 77238
11097 329737 -63948 -118334 267739 354688 53813 28917 -38131 74349 34095 -16059 182058
$$ packed form
11175B23804b22784D5515b89860F63a32407B87401B2564a81254B78817R377M8852
11164C37046b512l46804B94701d7733j86638A63190E7569P5694a68565j46969
11154c15534A16514a82248f7348B71902b3434k35858A9597i8522H9012c4673j2048
11143d6721C28268A33838b5884A02827e0682l9006F1848M8403a03080k9369D79466
11131B48215M7637e2545j05056D7440a82278B40766B2331a53799j14899A68030
11120B494N2516J56660a35182o1542Q7537L700l13026a83990e5777A80065J28078
11109C08143j04577F6021L46275A59185B5759p913i3379A01374d693j77584G7238
11097C29737f3948n4386B67739Q6949E3813k4896c8131G4349C4095a6059A82058
$$ plain form
11085 90947 259600 203506 321033 139598 64765 423963 -15500 276709 155448 163781 -25196
11073 302419 118670 261340 194913 70271 352666 -56976 80911 632148 306582 271553
11063 271553 418463 686959 321283 459733 89913 588313 652017 696440 298954 582297
11053 582297 415834 546382 696112 322214 711032 876741 745528 573339 461392 419628
11043 419628 512232 563083 751755 684629 788044 297366 978695 489354 638557 657993
11033 657993 869371 574167 628141 686754 641139 678474 711953 681970 851650 706481 782675
11022 782675 617058 603376 601634 621890 410025 523586 791404 381988 625913 691298
11012 691298 579869 410272 606521 495799 363226 340933 688372 368262 291618 843481
$$ packed form
11085I0947J68653n6094J17527A39598F4765L59198a5500B76709j21261Q333b5196
11073C02419A18670J42670o6427G0271K82395e6976H0911N51237C06582l5029
11063B71553J46910K68496C21283J38450H9913M98400O3704M4423B98954K83343
11053E82297j66463J30548J49730C22214L88818J65709j31213j72189j11947m1764
11043D19628R2604N0851J88672o7126J03415B97366O81329m89341J49203J9436
11033F57993K11378k95204N3974N8613m5615L7335L3479k9983J69680j45169P6194
11022G82675j65617j3682j742K0256k11865J13561K67818C81988K43925O5385
11012F91298j11429j69597J96249j10722j32573k2293L47439l20110p6644N51863
$$ plain form
11002 843481 622743 392516 473005 751614 485872 692943 904885 655724 818025 552686
10992 552686 826763 379637 576544 790298 620855 874202 610575 1017854 853702 1218560
10982 1218560 1127943 1078653 1187893 913828 1243916 1545525 1588719 2158000 2363787 2346193
10972 2346193 2553584 2467322 2410573 2146642 2132604 2151036 1655541 1638514 1639752 1349298 1635842
10961 1635842 1507469 1742248 1795900 1820274 1531729 1784304 1783293 1587603 1064059 1028898
10951 1028898 962573 977213 526862 371256 320860 442912 174273 141428 271656 80375
10940 273932 127997 239245 181118 243135 360157 -79699 -53666 65155 214342 -280245
10929 -16 281393 188706 -63606 200390 -243325 82306 133702 -167322 117323 160369 164525
$$ packed form
11002H43481k20738k30227Q0489K78609k65742K07071K11942k49161J62301k65339
10992E52686K74077C79637J96907K13754j69443K53347k63627M07279j64152L64858
10982A218560r0617m9290J09240k74065L30088L01609M3194N69281K05787j7594
10972B346193K07391q6262n6749k63931j4038J8432m95495j7027J238k90454K86544
10961A635842j28373K34779N3652K4374k88545K52575j011j95690n23544l5161
10951A028898o6325J4640m50351j55606n0396J22052A74273l2845J30228H0375
10940B73932A27997J11248n8127O2017J17022g9699K6033F5155J49187b80245
10929a6B81393r2687f3606B00390b43325H2306N1396a67322A17323M3046M156
$$ plain form
10918 164525 128292 25516 145567 281203 -94802 63211 177195 212174 -65494 262201 124105
10906 195031 44459 -33230 31823 64257 -118278 72812 14234 104688 60705 221955 281512
10895 281512 142241 48690 -106372 -10794 -41059 145105 -134707 83957 -331028 66327
10884 72870 -240512 152460 -87223 79894 205289 57627 -90680 -467466 -219847 -200127 129421
10872 -116599 229395 6483 147309 143505 -241507 81538 153232 169848 15777 216274 -188527
10860 -92095 -209003 -22217 -42151 9447 -152999 -99774 -403113 -240972 -231859 38892 -105923
10848 192763 130334 -167742 176606 -77525 -77815 -53322 113122 -43492 -99685 -10465 228782
10836 -127971 82348 -60020 -146984 -56001 158482 -298241 58276 136312 256956 155628 -102457
$$ packed form
10918A64525l6233B5516J20051J35636i4802F3211J13984L4979f5494B62201A24105
10906A95031D4459c3230C1823L2434a18278G2812A4234R0454m3983J61250N9557
10895B81512j39271D8690a06372a0794l0265A45105a34707H3957c31028F6327
10884G2870b40512A52460h7223G9894J25395E7627i0680l76786b19847J9720A29421
10872a16599B29395F483J40826l804b41507H1538P1694J6616A5777K00497a88527
10860i2095j16908b2217j9934I447a52999N3225l03339J62141R113C8892a05923
10848A92763o2429a67742A76606g7525k90K4493A13122d3492n6193a0465B28782
10836a27971H2348f0020q6964e6001A58482b98241E8276P8036J20644j01328a02457
$$ plain form
10824 122022 -80500 -115625 -72278 175021 112075 264695 -265563 196095 -94255 -39139 -91649
10813 -91649 156444 -336564 105001 32252 -272592 190320 -195175 -13304 -238260 165526
10802 -73000 126231 -225888 235719 405 -152928 101125 -305657 315606 51498 -19826 -186075
10791 -186075 26236 316991 -204947 -452732 -140847 -160404 -237846 -191016 167374 266813
10781 266813 98490 -93517 -210412 181763 62792 23175 117143 99040 239011 -180544 -423771
10770 -423771 180309 -65136 123329 147137 -212711 -205163 -24116 -146224 -67228 -193702 -237647
10759 -237647 159761 48157 145396 -206238 -52048 153468 240872 -120592 -102208 -114972 277692
10747 -169986 330687 75477 -182958 -137733 -170694 347673 59232 109502 70530 172635 -220490
$$ packed form
10824A22022h0500l5125M3347A75021o2946J52620b65563A96095i4255c9139n2510
10813i1649A56444c36564A05001C2252b72592A90320a95175a3304k24956A65526
10802g3000A26231b25888B35719D05a52928A01125c05657C15606E1498a9826j66249
10791a86075B6236K90755b04947k47785a40847j9557p7442M6830A67374R9439
10781B66813I8490i3517j16895A81763F2792B3175R3968j8103J39971a80544k43227
10770d23771A80309f5136A23329K3808b12711P548b4116j22108f7228j26474m3945
10759b37647A59761D8157R7239b06238e2048A53468Q7404a20592J8384j2764B77692
10747a69986C30687G5477a82958M5225l2961C47673E9232N0270l8972J02105b20490
$$ plain form
10735 -80981 -223432 33260 -11898 150137 27382 37430 52544 -245945 -119592 -58193 22636
10723 -322799 102223 -152169 105828 -44447 29564 -67546 -116609 -272723 -46155 -146814
10713 -146814 273443 -44815 53700 160043 137350 -264390 113338 209758 -103683 218503
10702 134811 -37260 50521 -189903 -74385 76223 -257490 41932 15851 -332446 342271 46437
10690 -130566 -327097 -161705 -255958 -263297 253460 -225469 -134396 -47821 -11885 -309333 63347
10678 -57538 -25525 -136241 -238950 -301613 156679 -338215 -356437 -114634 -125046 -11908 -63572
10667 -63572 222296 90106 -252553 -29735 -98536 -53894 175164 6690 -108830 -152154 -75647
10655 -57989 90659 -461192 10550 -114721 271643 63489 138105 -51003 -9560 -3503 33156
$$ packed form
10735h0981j42451C3260a1898A50137B7382J0048J5114b45945a19592e8193B2636
10723c22799A02223a52169A05828d4447B9564f7546m9063j56114d6155j00659
10713a46814B73443d4815E3700J06343k2693b64390A13338R6420a03683B18503
10702A34811c7260E0521a89903g4385G6223b57490D1932A5851c32446C42271D6437
10690a30566j96531a61705r4253p339B53460b25469R1073d7821a1885k97448F3347
10678e7538b5525j10716j02709o2663A56679c38215j8222a14634j0412a1908n1664
10667f3572B22296I0106b52553b9735o8801M4642A75164F690a08830m3324g5647
10655e7989I0659d61192A0550a14721B71643F3489P4616e1003i560c503C3156
$$ plain form
10643 158495 -175554 -344475 -118441 -204183 145029 -243062 -216507 -41654 -155872 -331204
10633 -331204 23181 -144462 74823 -203857 -75994 -59684 127963 -177044 -99182 -225724
10623 -225724 -113048 14755 60595 -53883 -261730 2244 228232 78402 -126290 -186642 70107
10611 -24830 56253 -135574 -178125 -27819 -18382 -322024 -129348 12425 -65133 129249 -466
10599 -179190 -57403 185121 -190654 -270486 -116220 -290605 -106707 -46469 -183086 67032
10588 -20149 -16659 -130794 -132243 -75406 202281 -3126 -62289 -236003 -335351 -79907 -44052 -286102
10576 -286102 30172 41098 40912 51932 23320 45503 5116 268695 150213 -81408 -144617 230267
10563 -75718 190382 -214507 66981 12026 -10589 -33269 209229 -306466 -259977 368625 -63238
$$ packed form
10643A58495a75554j68921a18441q5742A45029b43062K6555d1654j14218j75332
10633c31204B3181a44462G4823b03857g5994J6310A27963a77044P7862j26542
10623b25724J12676A4755M5840e3883k07847B244K25988G8402a26290o0352G0107
10611b4830E6253a35574m2551b7819R437l03642a29348A2425f5133A29249d66
10599a79190e7403A85121a90654p9832a16220j74385a06707d6469j36617F7032
10588b0149L490j14135j449N6837B02281c126n9163j73714r9348g9907L5855k42050
10576b86102C0172J0926j86J1020B3320K2183E116K63579j18482h1408o3209B30267
10563g5718A90382b14507F6981A2026a0589k2680B09229c06466M6489C68625f3238
$$ plain form
10551 -88509 185612 477124 -35838 -116096 -128099 43866 202512 180977 92246 -120525 -166781
10540 -166781 204372 -123165 -250436 -143694 470661 -128120 -132694 131994 -31830 -180737
10530 -180737 -27613 -74414 -280179 -216828 -122317 90699 -72836 -240519 -16448 -113287 -215748
10519 -215748 -266991 -12734 224544 -23799 -150986 110812 82146 -929 -143425 75187 -190151
10507 -5032 6178 -36046 169426 -237869 230811 -30025 13502 46367 -5084 10135 18509 11032
10495 11032 -224548 148659 -115008 -212488 -409939 188373 -233405 46417 -70993 -18852
10484 -209972 -236042 36977 663574 391787 611192 458344 391577 473607 -33542 80780 -263765
10472 -290845 150312 -116865 62054 -188526 28078 -46432 269906 -40917 -67958 38879 -56462
$$ packed form
10551h8509A85612K91512c5838q0258j2003D3866J58646k1535q8731a20525m6256
10540a66781B04372a23165j27271J06742D70661a28120m574A31994c1830j48907
10530a80737b7613m6801k05765O3351R4511I0699g2836j67683a6448r6839j02461
10519b15748n1243a2734B24544b3799j27187A10812k8666i29j42496G5187a90151
10507e032F178c6046A69426b37869B30811c0025A3502L2865e084A0135Q374p477
10495A1032b24548A48659a15008r7480j97451A88373b33405D6417g0993a8852
10484b09972k6070C6977O26597k71787K19405j52848o6767Q2030c3542H0780b63765
10472b90845A50312a16865F2054a88526B8078d6432B69906d0917k7041C8879e6462
$$ plain form
10460 136173 135354 339782 -78447 -118398 -72343 99714 265780 141178 -181629 -190932 223478
10448 151744 -254299 -352560 -144831 -10332 -226489 -111209 -30598 -1981 4936 -7261 17937
10436 -130680 -49074 -29232 181998 -53926 -6789 33027 -402396 407635 -57286 -27760 -44053
10425 -44053 55767 60840 -45628 -119853 -143424 -203893 51677 -61400 11682 324042 -178995
10413 -141985 146216 2905 94884 227703 120442 -216147 -159531 -198609 203537 116426 -353005
10401 -21105 199425 -85213 135712 143499 159817 326480 107472 -13260 247264 77329 -144141
10389 -3512 24927 -130870 56984 100127 -205369 249287 -6339 137003 -151071 163243 226454
10378 226454 485750 -97895 297789 381888 321530 64501 361508 217905 303629 152371
$$ packed form
10460A36173q19K04428g8447l9951M6055I9714J66066j24602a81629r303B23478
10448A51744b54299r8261a44831a0332k16157a11209c0598a981D936g261A7937
10436a30680d9074J9842A81998e3926f789C3027d02396D07635e7286b7760j6293
10425d4053E5767N073d5628p4225k3571o0469E1677f1400A1682L12360a78995
10413a41985A46216B905R1979J32819j07261b16147N6616l9078B03537q7111c53005
10401b1105A99425h5213A35712P787J6318J66663A07472a3260B47264G7329a44141
10389c512B4927a30870E6984M3143b05369B49287f339A37003a51071A63243O3211
10378B26454K59296i7895B97789Q4099o0358F4501K97007j43603Q5724j51258
$$ plain form
10368 152371 350128 365973 528748 328088 290246 173777 87700 471899 285665 292251
10358 292251 245573 185394 32432 242525 172867 335424 270621 686870 384173 547070
10348 547070 261638 228298 -20152 -249340 481337 727835 322245 308304 -75727 114836
10337 90602 34673 7038 -198253 261600 534921 -69973 49308 159192 174883 61763 266867
10326 266867 304696 264487 147311 202254 160300 -7821 -47752 115134 138279 -153999 26651
10314 85162 -101377 -183813 -27429 -153359 -146220 87699 -406458 145512 60615 -117279 -105070
10303 -105070 -9494 -33686 204534 -347042 -3992 -490747 182970 151814 333274 -299574 62023
10291 -42887 -67294 55054 -40691 -74149 -99310 -121658 -134480 14679 24256 -51937 151908 -14760
$$ packed form
10368A52371J97757J5845J62775k00660l7842j16469q6077L84199j86234O586
10358B92251m6678o0179C2432K10093o9658J62557o4803M16249l02697J62897
10348E47070B61638l3340b0152k29188D81337K46498C22245j3941g5727A14836
10337I0602C4673G038a98253B61600K73321f9973D9308J09884J5691F1763K05104
10326B66867L7829m0209j17176N4943m1954g821l9931A15134K3145a53999B6651
10314H5162a01377q2436b7429j25930P139H7699d06458A45512F0615a17279J2209
10303a05070i494k4192B04534c47042c992m86755A82970l1156J81460b99574F2023
10291d2887k4407E5054d0691l3458k5161k2348j2822A4679R577e1937A51908a4760
$$ plain form
10278 -204161 -58779 212012 -154272 111683 19413 -25930 210660 65326 -55832 -96503 51323
10266 -100601 -39857 -194126 -35069 146649 48088 287919 -23083 312540 -3025 315185 471147
10255 471147 183355 -89001 -124515 -240051 270758 -239314 -135591 -98491 12304 -7955 -409458
10244 -409458 -483469 -217833 104172 135444 81033 -15835 -207254 -23339 -82883 117529 -94119
10232 -155250 401412 -266135 -103913 210459 -134546 76173 184462 43357 313487 -252272
10221 169553 27914 107230 -10537 -27304 67919 -443769 -116008 10500 55531 264166 350935
10210 350935 12360 -281080 33964 -63988 33868 145410 -50810 -298351 44869 111152 182693
10199 182693 -141494 -143144 -70071 10544 -101057 22834 -243326 -443231 185003 -372451
$$ packed form
10278b04161e8779B12012a54272A11683A9413b5930B10660F5326e5832m0671E1323
10266a00601c9857j54269c5069A46649D8088K39831b3083C12540c025C15185J55962
10255D71147A83355h9001l5514j15536B70758b39314J03723L7100A2304g955m01503
10244d09458p4011b17833A04172L1272n4411a5835j91419b3339n9544A17529i4119
10232a55250D01412b66135a03913B10459a34546G6173J08289D3357K70130b52272
10221A69553B7914P9316a0537j6767F7919d43769a16008A0500M5031K08635Q6769
10210C50935A2360b81080C3964f3988C3868J11542e0810k47541D4869O6283P1541
10199A82693a41494j650g0071A0544a01057B2834b43326j99905A85003c72451
$$ plain form
10188 -215525 58588 155388 -93406 -332910 267312 251092 -347003 -545111 -309940 -225939
10178 -225939 179466 81130 -172343 27841 152451 -326146 -104948 210192 -288110 519959
10167 -114010 -167881 24616 -435167 -30612 -70354 50763 -32063 -87438 -11459 -41422 -22233
10156 -22233 -42754 32097 -414166 -100742 -225726 -209686 35328 1033 185344 15450 168611
10145 168611 -350001 -270972 -425555 -154755 4340 -227531 -66137 218902 -215282 -1697 -326319
10134 -326319 -450652 -103423 -214744 100954 365559 -45670 -214924 70903 166551 -372924
10123 255110 -361370 227116 147522 -202173 -181604 2482 -149942 -74035 -151299 12030 17870
10112 17870 57517 54969 -190140 3397 -16355 219538 -223458 -23197 -68731 43794 78374
$$ packed form
10188b15525E8588R6800i3406k39504B67312j6220c47003j98108K35171Q4001
10178b25939A79466H1130a72343B7841J24610c26146a04948B10192b88110E19959
10167a14010n3871B4616d35167c0612l9742E0763c2063n5375a1459k9963J9189
10156b2233k0521C2097d14166a00742j24984J6040C5328A033J84311A5450J53161
10145A68611c50001P9029j54583a54755D340b27531f6137B18902b15282a697l24622
10134c26319j24333a03423j11321A00954K64605d5670j69254G0903R5648c72924
10123B55110c61370B27116p9594b02173K0569B482a49942g4035p7264A2030N840
10112A7870L9647k548a90140C397a6355B19538b23458b3197m5534D3794L4580
$$ plain form
10101 78374 49505 -351448 -440340 181236 169472 81336 -101428 85517 -38001 96419 86514
10090 86514 -15757 -231039 -41132 205040 -27202 241686 -313777 -19727 -190022 -99333 -289004
10079 -289004 190935 -42719 -67011 107482 161381 -41143 -156489 36428 -73964 -33524 234230
10067 -75146 -2516 28345 50069 127831 -158064 -196024 -11318 -36082 -352235 219403 198751
10056 198751 -263469 -362781 124265 299501 -32741 -211547 -85872 43670 141798 -123742
10045 -30781 -104852 249898 -356847 68673 -108112 -187232 -19342 -137346 -277932 -380212
10035 -380212 -202217 -60083 -194180 -94653 -59633 -910 47212 -264140 -114160 -53855 -160313
10024 -160313 -303436 -306535 -244665 -12991 -178706 -302546 19325 -73597 -132895 77053 141052
$$ packed form
10101G8374k8869c51448q8892A81236j1764H1336a01428H5517c8001I6419r905
10090H6514a5757k15282d1132B05040b7202B41686c13777a9727j70295R0689j89671
10079b89004A90935d2719k4292A07482N3899d1143j15346C6428g3964c3524B34230
10067g5146b516B8345K1724P7762a58064l7960a1318k4764l16153B19403k0652
10056A98751b63469r9312A24265J75236c2741j78806h5872D3670R8128a23742
10045c0781p4071B49898c56847F8673a08112p9120a9342j18004j40586j02280
10035c80212J77995f0083j34097i4653L5020i10D7212b64140a14160e3855j06458
10024a60313j43123l099O1870a2991j65715j23840A9325g3597n9298G7053O3999
$$ plain form
10013 141052 43943 427290 -144385 -215605 30729 -68576 -287467 138424 272408 -56256
10002 -98368 -131194 239563 -293340 45471 -228019 -432112 136692 -166803 -34053 -168867
9992 -168867 17880 289738 99319 -5216 -318250 108328 -116909 -123768 -99896 -187246 -292944
9981 -292944 -417415 141945 5029 11703 -148988 444898 -44616 -152809 77907 -84381 -6517
9969 63805 164374 -306382 -200033 -221276 59772 107511 -230116 -185931 -278260 111466 -98228
9957 -167830 108288 70254 -205808 -76318 18562 -55126 -223401 -218125 4312 -147561 -28517
9945 -217790 -92327 -366340 105234 -289256 -92193 -148630 -347031 -68375 -133903 33967 343616
9934 343616 46012 46593 -92484 89033 -9004 126581 -179985 36937 29398 96440 -132284 -411340
$$ packed form
10013A41052D3943L83347a44385p1220C0729f8576k18891A38424J33984e6256
10002i8368l2826B39563b93340D5471b28019k04093A36692a66803c4053j34814
9992a68867A7880K71858I9319e216l13034A08328a16909o859K3872q7350j05698
9981b92944j24471A41945E029O674a48988D44898d4616j08193G7907h4381f517
9969F3805J00569c06382J06349k1243E9772M7739b30116M4185r2329A11466i8228
9957a67830A08288l8034b05808g6318A8562e5126j68275N276D312a47561b8517
9945b17790i2327k74013A05234b89256i2193n6437j98401f8375o5528C3967L09649
9934C43616D6012N81i2484H9033i004A26581a79985C6937p539O7042a32284k79056
$$ plain form
9922 -411340 -54051 129515 -289751 -192188 28357 -79629 -343739 -93093 -242327 52021 125986
9911 125986 -178100 -96468 -284923 226082 32366 25698 -4200 -393396 -139127 53146 -159711
9899 42473 967 -6416 -66330 -42819 -368491 43242 -123582 2045 -161932 -370201 -274053 2928
9886 -158459 -83385 -311318 -274210 39516 -380400 -299083 154858 -75582 -117461 -69849 -72879
9875 -72879 232088 -40302 -326315 81837 -271786 -43705 -263528 -102280 -145067 79244 -231020
9863 -237129 100641 -246100 262564 -318497 -254036 -439337 -123160 59587 218846 -319131
9852 -58962 11399 -123107 -172585 165807 -44784 48377 -241745 147 119129 -352732 -75415
9840 106403 57229 -130559 -371539 6487 -90913 259749 99173 4998 -34121 -331990 28377
$$ packed form
9922d11340e4051A29515b89751R7563B8357g9629k64110i3093j49234E2021P3965
9911A25986a78100Q1632j88455B26082C2366o668d200l89196a39127E3146a59711
9899D2473I67f416n9914K3511l25672D3242a23582B045a61932k08269R6148B928
9886a58459P5074k27933L7108C9516c80400Q1317A54858g5582m1879M7612l030
9875g2879B32088d0302k86013H1837b71786d3705k19823a02280m2787G9244b31020
9863b37129A00641b46100B62564c18497O4461j85301a23160E9587J59259c19131
9852e8962A1399a23107m9478A65807d4784D8377b41745A47J18982c52732g5415
9840A06403m9174a30559k40980F487i0913B59749I9173D998c4121k97869B8377
$$ plain form
9828 61615 103897 81840 -13093 -181147 -100526 -37210 -227819 -237954 17136 -7049 -38715 20021
9815 146560 59740 -47593 -228360 -260670 -72591 166238 -176326 166074 1808 -30333 -261567
9804 -261567 176303 158841 170525 -147827 -35609 -26527 -94657 59645 45702 -176917 167827
9792 -32447 -163422 -11100 -288002 -298587 37697 60702 -9227 -72755 32717 -128798 187561
9780 -235174 -180633 195197 -260231 -42091 -119012 359102 -26737 -142356 732 9583 -228595
9768 186317 169799 -213053 -10844 25046 198677 -19451 182957 -130466 195700 -160787
9757 -135354 14069 191233 -380681 -479441 -101634 -157889 -245437 -164523 -39401 -90504 -218070
9746 -218070 -142158 -9712 -283443 -166666 -213183 -174585 -246159 -148005 132233 163099 -95961
$$ packed form
9828F1615M2282k2057a3093j68054Q0621c7210j90609j0135A7136g049l1666B0021
9815A46560E9740d7593j80767l2310g2591A66238a76326A66074A808c0333k31234
9804b61567A76303j7462J1684a47827c5609R082o8130E9645j3943a76917A67827
9792c2447j30975a1100k76902j0585C7697K3005i227o3528C2717a28798A87561
9780b35174N4541A95197b60231d2091p6921C59102b6737j15619G32Q851b28595
9768A86317j6518b13053a0844B5046J73631a9451A82957a30466A95700a60787
9757a35354A4069J77164c80681r8760a01634n6255q7548Q0914c9401n1103j27566
9746b18070P5912i712k73731J16777m6517L8598p1574R8154A32233L0866i5961
$$ plain form
9734 -319387 326990 28409 -283470 256395 23277 189385 -89721 -225147 -184231 -80430 -148314
9723 -148314 189472 -172278 -36377 -176035 23598 -156418 111434 -23292 -286783 -99975
9712 15334 -133454 -353417 -10712 111686 -56436 -296281 67191 -125921 -317943 -111297
9701 -299194 88816 -40435 58219 48454 -91379 232654 -251017 -115110 -103094 -66477 -175223
9690 -175223 86265 -544335 -412207 -422576 -134359 -245532 19577 82418 97327 49176 16120
9678 40460 56532 52333 259155 -30290 96582 -101418 -167571 225446 183942 -179708 140267
9666 181010 90451 -275117 -183187 -301157 -103794 -142024 -42486 -274262 248413 46374 -107939
9654 -92935 -206791 -2884 -125093 -293290 -56005 -271349 -10592 204953 -110079 -715318 -570020
$$ packed form
9734c19387C26990B8409b83470B56395B3277J66108h9721j35426M0916h0430o7884
9723a48314A89472a72278c6377j39658B3598a56418A11434b3292k63491i9975
9712A5334a33454k19963a0712A11686e6436k39845F7191a25921j92022a11297
9701b99194H8816d0435E8219r765i1379B32654b51017a15110J2016L6617j08746
9690a75223H6265e44335J32128j0369a34359j11173A9577O2841J4909m8151A6120
9678D0460J6072m199K06822c0290I6582a01418o6153B25446m1504a79708A40267
9666A81010I0451b75117R1930j17970a03794l8230d2486k31776B48413D6374a07939
9654i2935j13856b884j22209j68197e6005k15344a0592B04953a10079o05239J45298
$$ plain form
9643 -570020 172754 -55483 -65753 11846 -241288 2726 67580 42106 167072 -138545 56558
9631 110070 35999 -153372 -133535 29052 -53446 90346 -193169 -194022 -71058 130563 27087
9619 -133064 -275757 -187144 136296 -138164 234481 -120621 -73720 -267386 89182 -127933
9608 16517 142768 -65174 -58454 34723 -127848 -25958 -79640 136656 -15453 -64962 -364541
9597 -364541 -191285 -39747 85215 63431 -144885 -76559 -323076 -83603 -281605 233461 31209
9585 6317 -40199 15137 213769 -133799 -50805 -377886 7423 283198 257369 -327732 24011
9573 -39972 -267202 -210453 -95999 -180627 8850 -261048 43618 -77332 -43812 192989 -91210
9561 231074 -237353 -348190 166320 -119557 -112008 149311 -142811 -165963 -123686 27292 -272655
$$ packed form
9643e70020A72754e5483j0270A1846b41288B726O4854k5474J24966a38545E6558
9631A10070C5999a53372J9837B9052e3446I0346a93169q53g1058A30563B7087
9619a33064j42693Q8613A36296a38164B34481a20621M6901j93666H9182a27933
9608A6517J26251f5174O720C4723a27848b5958n3682A36656a5453m9509k99579
9597c64541J73256c9747H5215k1784a44885O8326k46517h3603j98002B33461C1209
9585F317d0199A5137J98632a33799e0805l27081G423K75775k5829c27732B4011
9573c9972k27230N6749i5999q4628H850b61048D3618g7332L3520A92989i1210
9561B31074b37353j10837A66320a19557P549A49311a42811k3152M2277B7292b72655
$$ plain form
9549 163742 202219 -6101 -86229 -65193 -35448 -164414 -162284 -177225 -276566 48966 -42338 -277788
9537 -277788 101797 120309 198819 116268 149318 -507933 -154797 -45214 -178120 -158562 9665
9525 -12212 185929 48 -138755 -230255 -254221 -38845 44297 -137142 -58697 136524 -89454 -3554
9512 -273621 137158 -418818 335309 -126659 -12148 -5090 -48204 1111 10180 -31791 214543
9500 -213897 -17097 187871 204003 117157 133300 -162678 30110 -53319 -39969 -4088 216879
9488 246443 -63808 -114349 169136 -107602 -308719 -44662 56986 -100109 -86511 -111306 -261157
9477 -261157 -56880 -170717 236254 142280 -66094 -143417 73652 -15007 9952 -130742 187872
9465 -257265 -8928 -315804 44196 -386315 -117464 -204939 -228768 -272265 -31988 72942 154690
$$ packed form
9549A63742L8477f101q0128K1036K9745j28966K130j4941r9341D8966d2338k35450
9537b77788A01797J8512P8510q2551L3050e07933a54797d5214j32906J9558I665
9525a2212A85929D8a38755r1500k3966c8845D4297a37142e8697A36524h9454c554
9512b73621A37158d18818C35309a26659a2148e090m3114A111R069c1791B14543
9500b13897a7097A87871J6132q6846J6143a62678C0110e3319J3350d088B16879
9488B46443f3808n0541A69136a07602k01117d4662E6986a00109J3598k4795j49851
9477b61157e6880j13837B36254r3974f6094p7323G3652a5007I952a30742A87872
9465b57265h928l06876D4196c86315a17464q7475k3829m3497c1988G2942Q1748
$$ plain form
9454 154690 -68112 91171 -166705 164309 355062 -160182 -6010 -25390 91083 71219 -82047
9442 -82982 166235 -65960 -326148 -118236 294803 -80661 -273776 -157050 -40223 -157400
9432 -157400 -89594 -86428 93180 -452922 -36105 242002 -58036 -30649 12501 -256921 -321081
9421 -321081 21633 -153395 -181260 36716 35710 -273487 63450 30964 -326318 -108346 -368256
9410 -368256 -114223 -38627 -92383 -90604 -180360 -213463 -255408 75379 -5206 5591 -24592 -466980
9398 -466980 -1000 32479 -111988 17038 -87477 -160810 49902 -285765 -6331 -249669 -16046
9386 88888 -345952 7767 -249824 209837 -186624 -261325 -90498 -835 144962 52946 116826
9375 116826 -219742 -166420 -151041 -35575 25403 -46863 145717 -216499 -470162 317668 -127862
$$ packed form
9454A54690f8112I1171a66705A64309J90753a60182f010j9380I1083j9864h2047
9442h2982A66235f5960k60188a18236B94803h0661j93115J16726d0223j17177
9432a57400O7806L166I3180d52922c6105B42002e8036K7387A2501b56921o4160
9421c21081B1633a53395k7865C6716j006b73487F3450C0964c26318a08346k59910
9410c68256a14223c8627n3756J779q9756l3103m1945G5379e206E591b4592m42388
9398d66980a000C2479a11988A7038h7477p3333D9902b85765f331k43338a6046
9386H8888c45952G767b49824B09837a86624p4701i0498h35A44962E2946O3880
9375A16826b19742N3322J5379c5575B5403d6863A45717b16499k53663C17668a27862
$$ plain form
9363 -179473 -401698 -39824 -262428 228971 76023 -281957 -162699 -133748 188245 -233984
9352 23079 -84690 -361307 258970 -133657 -176625 -333179 -325335 -162410 174104 277566 -231520
9340 261646 -85394 68862 -100821 -133951 -372744 -467637 189275 -217818 173966 -86460 -317391
9329 -317391 -29664 -302710 179212 -456766 -116287 -217716 5979 -371050 -82115 5761 274209
9318 274209 232753 -197167 -21853 126073 -18650 226663 171958 -305362 -107220 193632
9307 132986 -197679 311431 172873 144490 5447 -24701 -33530 81645 -195981 176462 -171627
9295 -282895 -99270 -82738 -11172 -116138 -183109 427468 -309057 -138205 -20441 -277525 -33576
9283 -98236 -176698 39359 143948 -111402 83575 -18319 -391449 273438 -258176 -210672 2839
$$ packed form
9363a79473k22225c9824k22604B28971G6023b81957J19258K8951A88245b33984
9352B3079h4690k76617B58970a33657m2968j56554P844a62410A74104J03462b31520
9340B61646h5394F8862a00821l3130k38793r4893A89275b17818A73966h6460k30931
9329c17391b9664k73046A79212d56766a16287j01429E979c71050h2115E761K68448
9318B74209m1456a97167b1853A26073a8650B26663n4705c05362a07220A93632
9307A32986a97679C11431j38558k8383E447b4701q829H1645a95981A76462a71627
9295b82895i9270J6532a1172j04966o6971D27468c09057a38205b0441k57084c3576
9283i8236p8462C9359J04589a11402H3575a8319l73130B73438b58176M7504B839
$$ plain form
9271 -239958 -188600 -122688 -144080 186535 -204684 -42639 -294831 95970 -279948 -292283 -114345
9259 -218873 -22244 410585 -215535 -116289 -57085 -156602 394560 -290471 -49527 384456 102953
9247 -225074 -20199 -33547 117946 171337 -274717 -228980 -14332 -25926 72598 -351692 -129172
9235 67450 -11594 -96515 -371434 6191 227236 192458 36813 102805 5364 -31879 -81379 -57230
9223 -57230 249939 -97878 -27722 -188217 -176516 71745 -120128 72982 227837 142635 -141753
9211 -274003 -27890 -274142 90204 -81579 63952 -161871 300517 -149931 77784 -97604 149826
9199 1525 48056 -123041 72714 -197232 48912 171790 -351716 -40379 282671 -59331 -221866
9188 -221866 -194756 -83419 133139 -6742 181706 -218371 124277 3675 80388 42794 107653
$$ packed form
9271b39958N1358O5912k1392A86535b04684d2639k52192I5970b79948j2335a14345
9259b18873b2244D10585b15535R9246e7085r9517C94560b90471d9527C84456A02953
9247b25074b0199j3348A17946N3391b74717M5737a4332j1594G2598c51692a29172
9235F7450a1594q4921k74919F191K21045l4778C6813O5992E364c1879m9500K4149
9223e7230B49939i7878b7722j60495J1701G1745a20128G2982J54855q5202a41753
9211b74003b7890k46252I0204h1579F3952a61871C00517a49931G7784i7604A49826
9199A525M6531a23041G2714a97232D8912J22878c51716d0379B82671e9331j62535
9188b21866K7110h3419A33139f742A81706b18371A24277C675P6713l7594O4859
$$ plain form
9177 107653 -269365 -153546 -147215 13758 1225 -210775 116355 15063 -183191 128657 -148997
9165 67820 174047 -113490 10495 -64875 -372672 -98083 -250142 97853 -137167 -74462 -196447
9154 -196447 202412 -197468 318568 168102 -260767 91235 -41196 -278618 6671 -540760
9143 -93015 49898 -36561 51587 73363 234787 214780 237333 -144898 424352 -316201 60617
9131 82868 -224354 58487 -66824 -60185 -149065 -36323 -111639 -252352 -41172 220745 151303
9120 151303 -176038 -322538 13440 -207281 105399 -320546 -104360 -50497 -253697 19530
9109 4134 -1740 -228968 105371 -129117 -6535 205557 -205549 -136441 -227218 339888 -191410
9097 -277298 -175101 -359286 -18722 -306126 83872 -241590 -103057 -260655 -20209 -282445
$$ packed form
9177A07653b69365J15819O331A3758A225b10775A16355A5063a83191A28657a48997
9165F7820J06227a13490A0495f4875l07797i8083j52059I7853a37167O2705j21985
9154a96447B02412a97468C18568j50466b60767I1235d1196k37422F671e40760
9143i3015D9898c6561E1587K1776J61424k0007K2553a44898D24352c16201F0617
9131H2868b24354E8487f6824O639q8880c6323p5316j40713d1172B20745o9442
9120A51303a76038j46500A3440b07281A05399c20546a04360e0497k03200A9530
9109D134a740k27228A05371a29117f535B05557b05549O9108r0777C39888a91410
9097b77298J02197j84185a8722k87404H3872b41590a03057j57598b0209k62236
$$ plain form
9087 -282445 -169062 74904 -20188 4935 31793 48788 -24757 437033 11251 -306271 -215355
9076 -215355 -359360 -90586 86451 134035 -275345 29967 -92392 -149274 131264 -17895 -189913
9065 -189913 -245241 -168489 78702 -78125 -86240 1838 -150661 257185 101590 -156793 -117442
9054 -117442 -161871 99315 119365 -355882 24361 -31805 -223495 41419 175269 -15436 -478245
9043 -478245 -384273 -127555 -4211 48733 -2089 354157 -87189 84848 86631 26355 53141 116645
9031 116645 -167238 -433590 132426 -116180 344641 -285996 130752 -115611 -159395 159611
9020 -45809 -69207 -268613 -24326 -142304 57094 -106554 -191115 -177792 120942 -122600 -238534
9009 -238534 -97486 -89886 -192299 -34178 6187 -93309 123352 169011 -190856 211555 -174187
$$ packed form
9087b82445J13383G4904b0188D935K6858J6995b4757D37033A1251c06271R0916
9076b15355j44005i0586H6451M7584b75345B9967i2392n6882A31264a7895j72018
9065a89913n5328P6752G8702g8125q115A838a50661B57185A01590a56793L9351
9054a17442m4429I9315K0050c55882B4361c1805j91690D1419J33850a5436m62809
9043d78245R3972a27555d211D8733b089C54157h7189H4848J783B6355K6786O3504
9031A16645a67238k66352A32426a16180C44641b85996A30752a15611m3784A59611
9020d5809k3398j99406b4326j17978E7094a06554q4561J3323A20942a22600j15934
9009b38534i7486P600j02413c4178F187i3309A23352M5659a90856B11555a74187
$$ plain form
8997 -155074 -334021 91700 167420 -12855 -370562 37715 167592 -160578 26611 -155732 134964
8985 -255855 57082 203946 208358 -113087 -2069 194176 -115371 5687 -23351 -36232 -79408
8974 -79408 21721 197852 76297 -187745 -17634 -85535 15039 -220450 16662 -30821 -181218
8963 -181218 92670 244508 133069 122543 -257068 -138454 -100682 110222 195670 -142122
8952 -65282 -452739 -323686 88035 60808 -1094 -158253 -194312 -54042 -213484 -52959 -93102
8941 -93102 -489294 -70334 -90862 36323 131782 31338 505104 394511 -136209 -38907 41427
8929 -236565 -3639 252433 350695 290120 593890 2082547 4973852 15180774 9034372 2379391
8918 500339 479216 260561 264650 -221875 -65564 27154 -195677 118458 -80674 247029 170941
$$ packed form
8997a55074j78947I1700P5720a2855l57707C7715J29877a60578B6611a55732A34964
8985b55855E7082J46864M412a13087b069A94176a15371E687b3351j2881m3176
8974g9408B1721J76131G6297a87745a7634o7901A5039b20450A6662c0821j50397
8963a81218I2670J51838j11439j0526b57068J18614L7772A10222Q5448a42122
8952f5282l87457J29053H8035k7227a094j57159l6059e4042j59442e2959m0143
8941i3102l96192g0334k0528C6323R5459C1338M73766j10593a36209c8907D1427
8929b36565c639B52433R8262o0575L03770J488657K891305J0206922o146402B379391
8918E00339k1123k18655M089b21875f5564B7154a95677A18458h0674B47029p6088
$$ plain form
8907 170941 175614 -474633 57573 198793 140161 -168390 -224087 -96659 111831 23443 12254
8896 12254 135554 188751 -194666 -68574 -301006 -71774 -56053 123039 102416 104913 202923
8885 202923 -336766 -198913 105936 41842 181406 -260768 -116594 147771 -180151 32918
8874 -146767 -9154 126038 134279 -136622 78067 -206974 -113967 193511 39788 -166012 57187
8862 -189649 -239334 12290 168307 -188718 -329238 -124815 -223171 138089 -157233 -316562
$$ packed form
8907A70941M673d74633E7573J41220n8632a68390n5697i6659A11831B3443j1189
8896A2254J23300N3197a94666f8574k32432g1774J5721A23039k0623K497R8010
8885B02923c36766J37853A05936D1842J39564b60768a16594A47771a80151C2918
8874a46767i154A26038Q241a36622G8067b06974R3007A93511C9788a66012E7187
8862a89649m9685A2290J56017a88718j40520a24815r8356A38089a57233j59329
$$ [...]
##END NTUPLES=NMR SPECTRUM
##END=
