##TITLE=AC1566_ROEFFECT0020_8270576_CZUkxUbiX8
##JCAMPDX= 6.0         $$ Bruker NMR JCAMP-DX V2.0
##DATA TYPE= NMR SPECTRUM
##DATA CLASS= NTUPLES
##ORIGIN= BRUKER
##OWNER= Administrator
$$ 1.72 TOPSPIN		Version 2.1
$$ 2013-10-18 17:16:28.834 -0700  Administrator@X
$$ Compression mode = diff/dup
##.OBSERVE FREQUENCY= 400.02188249412
##.OBSERVE NUCLEUS= ^1H
##.ACQUISITION MODE= SIMULTANEOUS (DQD)
##.ACQUISITION SCHEME= undefined
##.AVERAGES= 64
##.DIGITISER RES= 22
##SPECTROMETER/DATA SYSTEM= spect
##.PULSE SEQUENCE= noesygpps1d.comp
##.SOLVENT NAME= COFFEE_meoh
##.SHIFT REFERENCE= INTERNAL, COFFEE_meoh, 1, 14.96075
##AUDIT TRAIL= $$ (NUMBER, WHEN, WHO, WHERE, PROCESS, VERSION, WHAT)
$$ ##TITLE= Audit trail, TOPSPIN		Version 2.1
$$ ##JCAMPDX= 5.01
$$ ##ORIGIN= Bruker BioSpin GmbH
$$ ##OWNER= Administrator
$$ $$ E:\/data/COFFEE/nmr/AC1566_ROEFFECT0020_8270576_CZUkxUbiX8/12/pdata/1/auditp.txt
$$ ##AUDIT TRAIL=  $$ (NUMBER, WHEN, WHO, WHERE, PROCESS, VERSION, WHAT)
(   1,<2013-10-18 17:16:23.709 -0700>,<Administrator>,<X>,<go>,<TOPSPIN 2.1>,
      <created by zg
	started at 2013-10-18 17:04:53.865 -0700,
	POWCHK enabled, PULCHK disabled,
       configuration hash MD5:
       C8 4E 4E 5D D3 5C D8 9E 9F 52 82 E0 59 8A DE 15
       data hash MD5: 64K
       AB EF 9E 2A 9B 00 12 84 50 B9 88 F6 08 19 8F 38>)
(   2,<2013-10-18 17:16:26.740 -0700>,<Administrator>,<X>,<proc1d>,<TOPSPIN 2.1>,
      <Start of raw data processing
       efp LB = 0.3 FT_mod = 6 PKNL = 1 PHC0 = 0 PHC1 = 0 SI = 128K 
       data hash MD5: 128K
       74 0A 2A 30 9E 74 8C 96 50 73 65 01 96 F2 D8 C0>)
(   3,<2013-10-18 17:16:27.725 -0700>,<Administrator>,<X>,<proc1d>,<TOPSPIN 2.1>,
      <pk PHC0 = -82.2052 PHC1 = 0 
       data hash MD5: 128K
       AB 34 91 D5 BD 94 1F 6F 1B F6 BB 06 33 FF DD 18>)
(   4,<2013-10-18 17:16:28.194 -0700>,<Administrator>,<X>,<proc1d>,<TOPSPIN 2.1>,
      <abs ABSG = 1 
       data hash MD5: 128K
       A5 70 E0 8F 02 36 E5 D3 A1 BF 67 5C FF 00 F5 0A>)
(   5,<2013-10-18 17:16:28.334 -0700>,<Administrator>,<X>,<proc1d>,<TOPSPIN 2.1>,
      <abs ABSG = 2 
       data hash MD5: 128K
       EA B3 6A 25 08 95 6F 89 02 A1 2A C3 E6 07 28 19>)
(   6,<2013-10-18 17:16:28.428 -0700>,<Administrator>,<X>,<proc1d>,<TOPSPIN 2.1>,
      <abs ABSG = 3 
       data hash MD5: 128K
       A3 F4 74 08 86 9C C8 9A 59 BD CC C7 6A 83 07 6B>)
(   7,<2013-10-18 17:16:28.537 -0700>,<Administrator>,<X>,<proc1d>,<TOPSPIN 2.1>,
      <abs ABSG = 4 
       data hash MD5: 128K
       25 0F 14 11 2A 5E DE BC 5B C9 08 5F 69 3F 2D 78>)
(   8,<2013-10-18 17:16:28.631 -0700>,<Administrator>,<X>,<proc1d>,<TOPSPIN 2.1>,
      <abs ABSG = 5 
       data hash MD5: 128K
       E3 C5 F7 2E E4 AF 07 D0 A6 4D 14 72 DB 59 A8 4E>)
$$ ##END=
$$ 
$$ $$ hash MD5
$$ $$ 0C 10 85 71 38 C5 DE 21 54 49 BB 28 C3 1D 15 28
##$RELAX= 
##$RELAX= 
##$RELAX= 
##$RELAX= 
##$RELAX= 
##$RELAX= 
##$RELAX= 
##$RELAX= 
$$ Bruker specific parameters
$$ --------------------------
##$DU= <E:\>
##$EXPNO= 12
$$ [...]
150 150 150 150 150 150 150 150
##$TP07= 0
##$TPNAME0= <>
##$TPNAME1= <>
##$TPNAME2= <>
##$TPNAME3= <>
##$TPNAME4= <>
##$TPNAME5= <>
##$TPNAME6= <>
##$TPNAME7= <>
##$TPOAL= (0..7)
0.5 0.5 0.5 0.5 0.5 0.5 0.5 0.5
##$TPOFFS= (0..7)
0 0 0 0 0 0 0 0
##$TUNHIN= 0
##$TUNHOUT= 0
##$TUNXOUT= 0
##$USERA1= <user>
##$USERA2= <user>
##$USERA3= <user>
##$USERA4= <user>
##$USERA5= <user>
##$V9= 5
##$VALIST= <valist>
##$VCLIST= <CCCCCCCCCCCCCCC>
##$VD= 0
##$VDLIST= <DDDDDDDDDDDDDDD>
##$VPLIST= <PPPPPPPPPPPPPPP>
##$VTLIST= <TTTTTTTTTTTTTTT>
##$WBST= 1024
##$WBSW= 4
##$XGAIN= (0..3)
0 0 0 0
##$XL= 0
##$YL= 0
##$YMAX_a= 5921337
##$YMIN_a= -12581023
##$ZGOPTNS= <>
##$ZL1= 120
##$ZL2= 120
##$ZL3= 120
##$ZL4= 120
##$ABSF1= 14.96075
##$ABSF2= -5.597432
##$ABSG= 5
##$ABSL= 3
##$ALPHA= 0
##$AQORDER= 0
##$ASSFAC= 0
##$ASSFACI= 0
##$ASSFACX= 0
##$ASSWID= 0
##$AUNMP= <proc_prof1d_extract.lims>
##$AXLEFT= 0
##$AXNAME= <>
##$AXNUC= <1H>
##$AXRIGHT= 0
##$AXTYPE= 0
##$AXUNIT= <>
##$AZFE= 0.1
##$AZFW= 0.1
##$BCFW= 0
##$BC_mod= 0
##$BYTORDP= 0
##$COROFFS= 0
##$CY= 15
##$DATMOD= 1
##$DC= 0
##$DFILT= <>
##$DTYPP= 0
##$F1P= 0
##$F2P= 0
##$FCOR= 0.5
##$FTSIZE= 131072
##$FT_mod= 6
##$GAMMA= 0
##$GB= 0
##$INTBC= 1
##$INTSCL= 1
##$ISEN= 128
##$LB= 0.3
##$LEV0= 0
##$LPBIN= 0
##$MAXI= 10000
##$MC2= 0
##$MEAN= 0
##$ME_mod= 0
##$MI= 0
##$NCOEF= 0
##$NC_proc= -2
##$NLEV= 6
##$NOISF1= 0
##$NOISF2= 0
##$NSP= 0
##$NTH_PI= 0
##$NZP= 0
##$OFFSET= 14.96075
##$PC= 1
##$PHC0= -82.2052
##$PHC1= 0
##$PH_mod= 1
##$PKNL= yes
##$PPARMOD= 0
##$PPDIAG= 0
##$PPIPTYP= 0
##$PPMPNUM= 2147483647
##$PPRESOL= 1
##$PSCAL= 4
##$PSIGN= 0
##$PYNMP= <proc.py>
##$REVERSE= no
##$SF= 400.020009738199
##$SI= 131072
##$SIGF1= 0
##$SIGF2= 0
##$SINO= 400
##$SIOLD= 131072
##$SPECTYP= <>
##$SREGLST= <1H.CDCl3>
##$SSB= 0
##$STSI= 131072
##$STSR= 0
##$SW_p= 8223.68421052631
##$SYMM= 0
##$S_DEV= 0
##$TDeff= 65536
##$TDoff= 0
##$TI= <>
##$TILT= no
##$TM1= 0
##$TM2= 0
##$TOPLEV= 0
##$USERP1= <user>
##$USERP2= <user>
##$USERP3= <user>
##$USERP4= <user>
##$USERP5= <user>
##$WDW= 1
##$XDIM= 131072
##$YMAX_p= 435204341
##$YMIN_p= -11845
##$CURPLOT= <Network HP LaserJet P1505>
##$CURPRIN= <$Network HP LaserJet P1505>
##$DFORMAT= <normdp>
##$LAYOUT= <+/1D_H.xwp>
##$LFORMAT= <normlp>
##$PFORMAT= <normpl>
##$SURQMSG= 1
$$ End of Bruker specific parameters
$$ ---------------------------------
##NTUPLES= NMR SPECTRUM
##VAR_NAME=  FREQUENCY,     SPECTRUM/REAL,   SPECTRUM/IMAG
##SYMBOL=    X,             R,               I
##VAR_TYPE=  INDEPENDENT,   DEPENDENT,       DEPENDENT
##VAR_FORM=  AFFN,          ASDF,            ASDF
##VAR_DIM=   131072,        131072,          131072
##UNITS=     HZ,            ARBITRARY UNITS, ARBITRARY UNITS
##FACTOR=    0.0627417313425164, 1,          1
##FIRST=     8223.62146879497, -2036,        -61323
##LAST=      0,             -1102,           -61984
##MIN=       0,             -11845,          0
##MAX=       8223.62146879497, 435204341,    0
$$ Real data points
##PAGE= N=1
##DATA TABLE= (X++(R..R)), XYDATA
$$ [...]
61701D55246l282l366l321k741j939j356j228j699k619l361l366k805k311k187
61687D19665k288k518k840l002k759k384k372k682k804k565k308k192j963j573
61673C85415j404j557j493p87J07L40k66j025j202p59k27j1N5M88J426K391K872
61656C84363K966L152L559L871L870L641L210K427J375N19K02K71M23O54J076
61641D15579J498J508J014M98N32J106J590J505J184J320J932K266J881J208O86
61626D35307p4j565l236l980l687l462m127n199n673n219m274l350k627k047j510
61611C85277j126j207j873k718l192l250l238l203k874k301j977k125k404k512
61597C51277k627k962l288l189k605j845j301j232j626k136k353k225k017j878
$$ y = [455246, 451964, 448598, 445277, 442536, 440597, 439241, 438013, 436314, 433695, 430334, 426968, 424163, 421852, 419665, 417377, 414859, 412019, 409017, 406258, 403874, 401502, 398820, 396016, 393451, 391143, 388951, 386988, 385415, 384011, 382454, 380961, 380174, 380281, 380621, 380355, 379330, 378128, 377369, 377142, 377131, 377186, 377674, 379100, 381491, 384363, 387329, 390481, 394040, 397911, 401781, 405422, 408632, 411059, 412434, 412953, 413155, 413426, 413849, 414503, 415579, 417077, 418585, 419599, 420097, 420629, 421735, 423325, 424830, 426014, 427334, 429266, 431532, 433413, 434621, 435307, 435233, 433668, 430432, 426452, 422765, 419303, 415176, 409977, 404304, 399085, 394811, 391461, 388834, 386787, 385277, 384151, 382944, 381071, 378353, 375161, 371911, 368673, 365470, 362596, 360295, 358318, 356193, 353789, 351277, 348650, 345688, 342400, 339211, 336606, 334761, 333460, 332228, 330602, 328466, 326113, 323888, 321871, 319993]
61583C19993j732j541j361j143q15n07l78k98l6K62L23K79M88Q50Q82M35j60o71
61565C14870j057j099n52L19J028J634K475L175K867J591N36N76J360K137K595
61550C32455K549J779O84K95R69J760J645O94m32j333j677j061K44J168J165Q95
61534C41799R34P65m3o97l75K31j0p23o62J48M65r4o74r17j502k560l019k154
61516C30912p00K67O32Q16R04Q58R44J242J320R13M79M84P11P60P73J010J165
61499C43490Q59N15Q98J893K437J896Q62L93Q71J829K577K694K173J434J071J289
61483C67181J602J342M76k65k26N32J477K254K783K976K740K206J613R28n8j312
61467C86249k452l082l010k293j457j390k396l464l265j927r16r23q96K41J770
$$ y = [319993, 318261, 316720, 315359, 314216, 313401, 312894, 312516, 312218, 312182, 312444, 312767, 313046, 313534, 314384, 315266, 315701, 315541, 314870, 313813, 312714, 312162, 312481, 313509, 315143, 317618, 320793, 323660, 325251, 325787, 326363, 327723, 329860, 332455, 335004, 336783, 337467, 337762, 338731, 340491, 342136, 342830, 342398, 341065, 339388, 338327, 338571, 339739, 340904, 341799, 342733, 343498, 343455, 342758, 342383, 342614, 342604, 341881, 341219, 341367, 341832, 341738, 341064, 340147, 338645, 336085, 333066, 330912, 330212, 330479, 331111, 331927, 332831, 333689, 334633, 335875, 337195, 338108, 338587, 339071, 339782, 340542, 341315, 342325, 343490, 344349, 344864, 345762, 347655, 350092, 351988, 352850, 353243, 354114, 355943, 358520, 361214, 363387, 364821, 365892, 367181, 368783, 370125, 370601, 370336, 370110, 370642, 372119, 374373, 377156, 380132, 382872, 385078, 386691, 387619, 387561, 386249, 383797, 380715, 377705, 375412, 373955, 372565, 370169, 366705, 363440, 361513, 360597, 359674, 358778, 359019, 360789]
61452C60789K080Q60n18p27K04J263J557J049M39M24Q91J228J340J753K449K527
61436C77608J633Q89J432K634K884J827P20O08J179J492J049K1q97q31M55K101
61420C94804L042L168L001K588J674O65L42O02N88J87K00Q34J175O06k26m72j96
61403D12582K17Q28J654K061J531N54Mpmk07l45k20Q0L74L98j69j195j874j494
61384D14768l11P34J010O04n3n84p72o40m69m61m77k77J02L79L80K17J34K72N12
61365D15068N46K52q9j65j16l08p03q85o82k93K38J136K320L246L610L804M301
61348D31280N000N450N459N174M771M299L678K736J553P40R76K141L351L950L977
61333D84535L586K696J530P83P61Q71N03m7j26K61O18Q31J148J458J380J027J040
$$ y = [360789, 362869, 363729, 363211, 362484, 362688, 363951, 365508, 366557, 366996, 367420, 368311, 369539, 370879, 372632, 375081, 377608, 379241, 380130, 381562, 384196, 387080, 388907, 389627, 390235, 391414, 392906, 393955, 393976, 393079, 392248, 392703, 394804, 397846, 401014, 404015, 406603, 408277, 408942, 409284, 409886, 410474, 410661, 410861, 411695, 412870, 413476, 413250, 412778, 412582, 412799, 413627, 415281, 417342, 418873, 419427, 419431, 419424, 419420, 419213, 418868, 418648, 418728, 419102, 419500, 419331, 418136, 416262, 414768, 414457, 415191, 416201, 416805, 416752, 416168, 415396, 414756, 414287, 413826, 413349, 413072, 413174, 413553, 413933, 414150, 414284, 414556, 415068, 415614, 415866, 415777, 415612, 415496, 415188, 414485, 413600, 412918, 412625, 412863, 413999, 416319, 419565, 423175, 426979, 431280, 436280, 441730, 447189, 452363, 457134, 461433, 465111, 467847, 469400, 470140, 471116, 473257, 476608, 480558, 484535, 488121, 490817, 492347, 493130, 493891, 494762, 495265, 495218, 495092, 495353, 495971, 496802, 497950, 499408, 500788, 501815, 502855]
61316E02855J728K733L692M728O052P444Q505R235J0081J1351J2820J4035J4925
61303F10184J5843J6844J7216J6104J3531J0370P301M323J333j318l229m515n632
61290F98355o923q546j0531j2503j3716j3742j2977j2124j1422j0700r866q923
61278E66382p750o388n347n073n124m501k907j171j82J30L40N03J78n44p70O3
61262E27839J276J786J656K049L558N301O087N783N002M053K996K236K048J807
61248E73477P54n49o92N40J707J666Q64K03k69p79q57P3J599K637K585J622L59
61231E84940l16M27K440M498N683O413P508Q883J0001J0939J1964J2533J1892
61218F77805J0503R730J0002J0340R826Q733P850P476P376P160O497N355M190
$$ y = [502855, 504583, 507316, 511008, 515736, 521788, 529232, 537737, 546972, 557053, 568404, 581224, 595259, 610184, 626027, 642871, 660087, 676191, 689722, 700092, 707393, 711716, 713049, 711731, 708502, 703987, 698355, 691432, 682886, 672355, 659852, 646136, 632394, 619417, 607293, 595871, 585171, 575305, 566382, 558632, 552244, 546897, 541824, 536700, 532199, 529292, 528121, 527939, 528069, 528409, 528912, 529090, 528546, 527776, 527839, 529115, 530901, 532557, 534606, 538164, 543465, 549552, 555335, 560337, 564390, 567386, 569622, 571670, 573477, 574231, 573682, 572990, 573530, 575237, 576903, 577767, 577970, 577701, 576922, 576065, 576138, 577737, 580374, 582959, 584581, 584940, 584624, 585051, 587491, 591989, 597672, 604085, 611593, 620476, 630477, 641416, 653380, 665913, 677805, 688308, 698038, 708040, 718380, 728206, 736939, 744789, 752265, 759641, 766801, 773298, 778653, 782843]
61205G82843L560L468L490L411L317L174K921K960L880N637P532R047J0243J1259
61191H56742J1964J2149J1606R971O986L080o62l231m271m220m184n274p405r083
61177H74168r069q008p509p921q126p570p219q033r524j0478j0444r851r207q801
61163G52408q794r122r430r466r288q988q561q118p719o945n259k974j188l48
61149F56208L75J827L540M329L736K336Q65l61j284j847j897j205K77K057L382
61134F72338M063M667N728P144Q564R888J1095J2063J2948J4335J6563J9248K1808
61121H20452K4145K6444K8662L0698L2689L4739L6617L8142L9493M0761M1572
61110A194414M1694M1633M1970M2326M1776M0215L8593L7631L6848L5107L1798
$$ y = [782843, 786403, 789871, 793361, 796772, 800089, 803263, 806184, 809144, 813024, 818661, 826193, 835240, 845483, 856742, 868706, 880855, 892461, 902432, 909418, 912498, 911836, 908605, 904334, 900114, 895930, 890656, 883251, 874168, 865099, 857091, 849582, 841661, 833535, 825965, 818746, 810713, 801189, 790711, 780267, 770416, 761209, 752408, 743614, 734492, 725062, 715596, 706308, 697320, 688759, 680641, 672922, 665977, 660718, 657744, 656556, 656208, 656583, 658410, 661950, 666279, 670015, 672351, 673216, 672855, 671571, 669724, 667827, 666622, 666899, 668956, 672338, 676401, 681068, 686796, 693940, 702504, 712392, 723487, 735550, 748498, 762833, 779396, 798644, 820452, 844597, 871041, 899703, 930401, 963090, 997829, 1034446, 1072588, 1112081, 1152842, 1194414, 1236108, 1277741, 1319711, 1362037, 1403813, 1444028, 1482621, 1520252, 1557100, 1592207, 1624005]
61099A624005K7222K2086J6896J1756O533J126m439j0020j5315j9906k3586k6619
61087A609739k9438l2117l4468l6499l8292l9420l9169l7550l5517l3911l2731
61076A220627l1676l0751k9883k8590k6624k4496k2812k1436j9820j7847j5854
61065I50838j4135j2867j2160j1705j0838r357p895p022o453n670m774m062l303
61052H40597k110o30Q17K337M016N451O411P491R250J1300J3112J5020J7322J9095
61038I49479J9358J8877J9320K0854K2264K3222K4661K6797K8621K9889L1846
61027A215188L5255L9037M1676M2776M2704M1929M1504M2996M7111N3231O0725
61016A704132O9602P9562Q9786J00187J11555J24320J39139J59158J89274K32155
$$ y = [1624005, 1651227, 1673313, 1690209, 1701965, 1708498, 1709624, 1705185, 1695165, 1679850, 1659944, 1636358, 1609739, 1580301, 1548184, 1513716, 1477217, 1438925, 1399505, 1360336, 1322786, 1287269, 1253358, 1220627, 1188951, 1158200, 1128317, 1099727, 1073103, 1048607, 1025795, 1004359, 984539, 966692, 950838, 936703, 923836, 911676, 899971, 889133, 879776, 871881, 864859, 858406, 852736, 847962, 843900, 840597, 838487, 837857, 838674, 841011, 845027, 850478, 856889, 864380, 873630, 884930, 898042, 913062, 930384, 949479, 968837, 987714, 1007034, 1027888, 1050152, 1073374, 1098035, 1124832, 1153453, 1183342, 1215188, 1250443, 1289480, 1331156, 1373932, 1416636, 1458565, 1500069, 1543065, 1590176, 1643407, 1704132, 1773734, 1853296, 1943082, 2043269, 2154824, 2279144, 2418283, 2577441, 2766715, 2998870]
61006B998870K87354L55211M38288N37481O51151P81467R37036J124484J342084
60997I453426J586711J854181K108082K244845K123927J676471R97641L12674
60989B2357958j67753l64516l19432j10654J82863M43999N06420K40898l31215
60980B2438568j027620j622362j979784k092830k028144j859694j642970j416595
60972H768569j203924j013385q45567p01222n81204m82806m01240l33895k80235
60963B925091k38495k05488j79090j58419j41854j27117j13322j01054r0335q0157
60953A489760p0023o0566n2324m5166l9133l4803l2495l1772l1818l1740l0719
60942A029201k8567k6051k4036k2561k1296k0440k0239k0092j9193j7884j7245
$$ y = [2998870, 3286224, 3641435, 4079723, 4617204, 5268355, 6049822, 6986858, 8111342, 9453426, 11040137, 12894318, 15002400, 17247245, 19371172, 21047643, 22045284, 22357958, 22190205, 21825689, 21506257, 21395603, 21578466, 22022465, 22528885, 22769783, 22438568, 21410948, 19788586, 17808802, 15715972, 13687828, 11828134, 10185164, 8768569, 7564645, 6551260, 5705693, 5004471, 4423267, 3940461, 3539221, 3205326, 2925091, 2686596, 2481108, 2302018, 2143599, 2001745, 1874628, 1761306, 1660252, 1569917, 1489760, 1419737, 1359171, 1306847, 1261681, 1222548, 1187745, 1155250, 1123478, 1091660, 1059920, 1029201, 1000634, 974583, 950547, 927986, 906690, 886250, 866011, 845919, 826726, 808842, 791597]
60931G91597j7436j7450j6617j5359j4273j3340j2278j0972r457q012p259p507
60919F41637q040p887p160o800p034p066o451n731n404n176m687m218m121m193
60905E57669m034l551k818j904j140j012j459j860j921k074k682l447l997m491
60891E21279n162n778n998n892n635n063m019k900k395k752l563m159m059l305
60877D60599k475k125k137j892j124k07M69R28J251J300J086R76J296K031K976
60862D62952L848M217L919L598M107N179N481M370K774J832J432Q42J28mN27R67
60846E06169P06j56j148j878k237k514l176m234n106n483n816o573p406p755p781
60831D45612p902p767o674m943l893m223n172n558n023l934k660j475p78r04j711
$$ y = [791597, 774161, 756711, 740094, 724735, 710462, 697122, 684844, 673872, 664415, 656403, 649144, 641637, 633597, 625710, 618550, 611750, 604716, 597650, 591199, 585468, 580064, 574888, 570201, 565983, 561862, 557669, 553635, 550084, 547266, 545362, 544222, 543210, 541751, 539891, 537970, 535896, 533214, 529767, 525770, 521279, 516117, 510339, 504341, 498449, 492814, 487751, 483732, 480832, 478437, 475685, 472122, 467963, 463904, 460599, 458124, 455999, 453862, 451970, 450846, 450639, 451108, 452036, 453287, 454587, 455673, 456649, 457945, 459976, 462952, 466800, 471017, 474936, 478534, 482641, 487820, 493301, 497671, 500445, 502277, 503709, 504551, 504679, 504675, 505202, 506169, 506875, 506719, 505571, 503693, 501456, 498942, 495766, 491532, 486426, 480943, 475127, 468554, 461148, 453393, 445612, 437710, 429943, 423269, 418326, 414433, 410210, 405038, 399480, 394457, 390523, 387863, 386388, 385610, 384706, 382995]
60816C82995k675l328l487l153k394j416o33n04j108j898k130j592p30k8M26O70
60800C59015O46M87O28J245J893K117K090K230K484K506K306K144J957J467Q25
60785C84040M71M04J36n07j067j090p11m38p09j660l006m027m082l284k368j783
60769C60319j250l70O44J104O48k95q64o36j14j69q78j311o59O50J438J118J34
60752C59509p81j264j269q92l57K19J022K184L312L796L584L099K463J391m1j223
60736C74752j872k421l151l504k855j628r58j285j809j512l01J034J766J827J551
60721C59634J190Q83Q99J418K090K222J648J041R86J149Q43J10l50k50j0n2l85
60704C73066r94j909k768k925k357j889k157k810l082k738k076j407r70j045j585
$$ y = [382995, 380320, 376992, 373505, 370352, 367958, 366542, 365909, 365405, 364297, 362399, 360269, 358677, 357947, 357919, 358345, 359015, 359661, 360148, 360776, 362021, 363914, 366031, 368121, 370351, 372835, 375341, 377647, 379791, 381748, 383215, 384040, 384511, 384915, 385051, 384544, 383477, 382387, 381676, 381238, 380529, 378869, 375863, 371836, 367754, 364470, 362102, 360319, 359069, 358699, 359343, 360447, 361095, 360800, 359936, 359300, 359186, 359017, 358139, 356828, 356169, 356819, 358257, 359375, 359509, 358728, 357464, 356195, 355303, 354946, 355165, 356187, 358371, 361683, 365479, 369063, 372162, 374625, 376016, 375975, 374752, 372880, 370459, 367308, 363804, 360949, 359321, 358363, 357078, 355269, 353757, 353456, 354490, 356256, 358083, 359634, 360824, 361707, 362606, 364024, 366114, 368336, 369984, 371025, 372011, 373160, 374003, 374113, 373763, 373513, 373503, 373451, 373066, 372072, 370163, 367395, 364470, 362113, 360224, 358067, 355257, 352175, 349437, 347361, 345954, 344984, 343939, 342354]
60689C42354j969j660q88l07o8J77N20O41N43P94J713K720K959K401J930K358
60673C54218L594M781N060M126K406P61j23l09n09j273k343l025l021k655k282
60658C59406j900j387q09k54L38R30J274J274J261J599K200K772L271L703L703
60643C77381K873J481K93m39j203k314l279l486l143k963l091k927k083j044n46
60628C55510n67l97L29J087J211Q35O88R95J127M92o20j323j138m37Lk46q21r40
60610C55788k45P49J310J416J538J678J307M06j96M7O68R90J054J107Q30j9p04
60593C67724k21J264K570L030L012K913K564J821J005M24J7k98m08k86l4N03J574
60576C87174K816L318K754K053K462M171O199P539Q134Q737R928J1430J2450J2540
$$ y = [342354, 340385, 338725, 337837, 337530, 337462, 337639, 338159, 338800, 339343, 340137, 341850, 344570, 347529, 349930, 351860, 354218, 357812, 362593, 367653, 371779, 374185, 374946, 374823, 374514, 374005, 372732, 370389, 367364, 364343, 361688, 359406, 357506, 356119, 355310, 355056, 355394, 356324, 357598, 358872, 360133, 361732, 363932, 366704, 369975, 373678, 377381, 380254, 381735, 382028, 381589, 380386, 378072, 374793, 371307, 368164, 365201, 362110, 359183, 357100, 356056, 355510, 354943, 354546, 354875, 355962, 357173, 358008, 358696, 359691, 360818, 361310, 360690, 359367, 358229, 357792, 357795, 357549, 356728, 355788, 355543, 356292, 357602, 359018, 360556, 362234, 363541, 363947, 363751, 363798, 364466, 365456, 366510, 367617, 368447, 368428, 367724, 367503, 368767, 371337, 374367, 377379, 380292, 382856, 384677, 385682, 386106, 386123, 385825, 385417, 385131, 385097, 385600, 387174, 389990, 393308, 396062, 398115, 400577, 404748, 410947, 418486, 426620, 435357, 445285, 456715, 469165, 481705]
60562D81705J1819J0367Q021N006K125j74k383m914p068p811p189o094m850l082
60548D75478q76J013K223L130L985M527M736N213O471Q440J0834J3371J5593J7149
60534E71287J8335J9725K1175K1872K1370J9801J7097J2983P871K817j633n711
60522G26989r355j1927j3233j3811j3908j3209j1867j0680r736q149n718l662
60510F01734k865k499j348M42K035L455N385P996J1032J4546J8570K2559K6059
60497G07101K9508L3446L7359M0248M1872M2549M2139M0300L7427L4298L0985
60486A117232K7012K2479J8030J3729Q807K570m974j3390k2092l0458l8148m5085
60474A055712n0762n4019n4116n1696m8095m4111l9987l5980l2094k7854k3262
$$ y = [481705, 493524, 503891, 511912, 516918, 519043, 518869, 516486, 511572, 504504, 496693, 489504, 483410, 478560, 475478, 474602, 475615, 477838, 480968, 484953, 489480, 494216, 499429, 505900, 514340, 525174, 538545, 554138, 571287, 589622, 609347, 630522, 652394, 673764, 693565, 710662, 723645, 731516, 734333, 732700, 726989, 717634, 705707, 692474, 678663, 664755, 651546, 639679, 628999, 619263, 611114, 605396, 601734, 598869, 596370, 595022, 595464, 597499, 600954, 606339, 614335, 625367, 639913, 658483, 681042, 707101, 736609, 770055, 807414, 847662, 889534, 932083, 974222, 1014522, 1051949, 1086247, 1117232, 1144244, 1166723, 1184753, 1198482, 1207289, 1209859, 1204885, 1191495, 1169403, 1138945, 1100797, 1055712, 1004950, 950931, 896815, 845119, 797024, 752913, 712926, 676946, 644852, 616998, 593736]
60463E93736j9485j7483j6393j4517j1696r411q573q446q027p264o584o133n924
60450D53800n962n896n179l868k697k163k083k144k205j976j153l8N51K82l17
60435D18952o11n16l16l29q91k058l258l722l370k791k301j603m90P28J639K180
60419D01243K429K359J874R13l75j339j092L83J789J919J161Q45J321J747J663
60404D16840J624K083K666K972L165L350L167K516J993K079K412K372J931J461
60390D50631J178J159J599K524L462L793L323K360J416R00R20J253J624J988K402
60375D80532K725K736K422J923J349R24R78J416J570J006J47l96n83m70L74K031
60359D98684L489L831L830M959P113Q711R057R050R385R485Q762P527O093M201
$$ y = [593736, 574251, 556768, 540375, 525858, 514162, 504751, 496178, 487732, 479705, 472441, 465857, 459724, 453800, 447838, 441942, 436763, 432895, 430198, 428035, 425952, 423808, 421603, 419627, 418474, 418436, 418987, 419269, 418952, 418341, 417825, 417509, 417180, 416289, 414231, 410973, 407251, 403881, 401090, 398789, 397186, 396696, 397424, 399063, 401243, 403672, 406031, 407905, 408818, 408443, 407104, 406012, 406395, 408184, 410103, 411264, 412109, 413430, 415177, 416840, 418464, 420547, 423213, 426185, 429350, 432700, 435867, 438383, 440376, 442455, 444867, 447239, 449170, 450631, 451809, 452968, 454567, 457091, 460553, 464346, 467669, 470029, 471445, 472345, 473265, 474518, 476142, 478130, 480532, 483257, 485993, 488415, 490338, 491687, 492611, 493589, 495005, 496575, 497581, 497728, 497332, 496749, 496279, 496653, 498684, 502173, 506004, 509834, 514793, 521906, 530617, 539674, 548724, 558109, 567594, 576356, 583883, 589976, 594177]
60345E94177J919j5j375k850m661n934o165o112o400o415n614m820m958n435n146
60330E30196m345m108m427m353l714l289l288l005k148j363j089q47n2J218K601
60315D97987L997N401O670P824R180J0838J2295J2875J2428J1467J0635J0195
60303F11792J0056J0179J0590J0847R837O747K219k143n520q514j1797j4899j6797
60290F12597j7157j6379j4885j2942j0822q623o221l858k313k011k335k369k032
60277E10650j819j847j842j891k410l363m164m432m346m235m224m313m426m338
60263D63000l888l248k720k312j771j040m03j56k23j45N05J546K100J543M33J5
60247D53236O79J596K033K246K675K998K682J918J294R18N55K80K96L53K4n63
$$ y = [594177, 596096, 596081, 594706, 591856, 587195, 581261, 575096, 568984, 562584, 556169, 550555, 545735, 540777, 535342, 530196, 525851, 521743, 517316, 512963, 509249, 505960, 502672, 499667, 497519, 496156, 495067, 494220, 494168, 495386, 497987, 501984, 507385, 514055, 521879, 531059, 541897, 554192, 567067, 579495, 590962, 601597, 611792, 621848, 632027, 642617, 653464, 663301, 670048, 672267, 670124, 664604, 656090, 644293, 629394, 612597, 595440, 579061, 564176, 551234, 540412, 531789, 525568, 521710, 519397, 517386, 515051, 512682, 510650, 508831, 506984, 505142, 503251, 500841, 497478, 493314, 488882, 484536, 480301, 476077, 471764, 467338, 463000, 459112, 455864, 453144, 450832, 449061, 448021, 447618, 447462, 447239, 447094, 447599, 449145, 451245, 452788, 453221, 453236, 453915, 455511, 457544, 459790, 462465, 465463, 468145, 470063, 471357, 472275, 472830, 473110, 473406, 473759, 473783, 473220]
60231D73220q03l02Q83K398L595L825L230K837L280L886L670K812K322K595L257
60216E10705M095N197O233O621O534O832P800Q787R230R317R374R302Q958Q485
60202F17470P973P264O393N819N864O234O312N750M689L608K904K431J612K58
60188F84581j063j933k857m475o249p016o722o601p370q221q063o963n775n002
60174F06271m572m279l911l270k530k254k645l148l167k842k668k711k712k676
60160E62886k750k717k159j117j19M85P85Q91P32M08K99N86R36R68P76P27Q90
60143E62507J045J166J508K093K585K869L409M603O075P069P395P460P474P280
60129F24538O930O720O478N563L954K604K142J953J279N58P65J721K327K276K453
$$ y = [473220, 472417, 472115, 472998, 475396, 478991, 482816, 486046, 488883, 492163, 496049, 499719, 502531, 504853, 507448, 510705, 514800, 519997, 526230, 532851, 539385, 546217, 554017, 562804, 572034, 581351, 590725, 600027, 608985, 617470, 625443, 632707, 639100, 644919, 650783, 657017, 663329, 669079, 673768, 677376, 680280, 682711, 684323, 684581, 683518, 681585, 678728, 674253, 668004, 660988, 654266, 647665, 640295, 632074, 624011, 617048, 611273, 606271, 601699, 597420, 593509, 590239, 587709, 585455, 582810, 579662, 576495, 573653, 570985, 568274, 565562, 562886, 560136, 557419, 555260, 554143, 554024, 554509, 555294, 556185, 556917, 557325, 557624, 558210, 559146, 560114, 560890, 561617, 562507, 563552, 564718, 566226, 568319, 570904, 573773, 577182, 581785, 587860, 594929, 602324, 609784, 617258, 624538, 631468, 638188, 644666, 650229, 654183, 656787, 658929, 660882, 662161, 662719, 663484, 665205, 667532, 669808, 672261]
60114F72261L345M213M301L931L729L509K746J718J168J073N85o57j919k433k418
60099F95152k641l326m020m362m477m554m556m436m259l844k743r78N30P44l41
60084F51889j816k957l666l925l560k683j840j349j056r04j247k197l264m068
60070F17357m926o152p230p396o843o574p047p589p330o263n219m962n430n806
60056E28590n373m317l455l099k610j351L18J448J670J525J763K724M233N737
60042E27803O612O714O603O946P725Q213P732O315M683L648L347L120K378J413
60028F03252Q55M67o86k769m824o246p609r423j1028j1598j1425j1200j0669r151
60014E07946o996n364m762m727m779m719m170k883j435p36q92j292j618j824j455
$$ y = [672261, 675606, 679819, 684120, 688051, 691780, 695289, 698035, 699753, 700921, 701994, 702579, 701922, 700003, 697570, 695152, 692511, 689185, 685165, 680803, 676326, 671772, 667216, 662780, 658521, 654677, 651934, 650956, 651486, 652230, 651889, 650073, 647116, 643450, 639525, 635965, 633282, 631442, 630093, 629037, 628133, 626886, 624689, 621425, 617357, 612431, 606279, 599049, 591653, 584810, 578236, 571189, 563600, 556270, 550007, 544788, 539826, 534396, 528590, 523217, 518900, 515445, 512346, 509736, 508385, 508703, 510151, 511821, 513346, 515109, 517833, 522066, 527803, 534415, 541129, 547732, 554678, 562403, 570616, 578348, 584663, 589346, 592994, 596341, 599461, 601839, 603252, 604107, 604574, 603888, 601119, 596295, 590049, 582440, 573017, 561989, 550391, 538966, 527766, 517097, 507946, 500950, 495586, 490824, 486097, 481318, 476599, 472429, 469546, 468111, 467375, 466483, 465191, 463573, 461749, 460294]
59999D60294j50J289J564P24J57N79J248J420J376J507J621J693K326L678M795
59984D84121M779L947L162K666K199J726J315P02l19j443k274k900l524l930l856
59969D86371l581l553l616l145j892l22Q96J496J727K020K532L052L434L912M602
59954D93933M925M112K286M43p31j448k081k409j952o70Q67J824J640N69m38q09
59938E00061j081j875k572j985k24J273J773K058K885L860M484N207O376P044
59924E27284N952L251L34j751k976l697m153m404m234l244j503J97J217J859K800
59909E16932L985M727M658M052L379K907K661K388J731O90l59j224k084k828k838
59894E38777j827m05O84J445K232K992L557M205N184N979N843M930M153M046M410
$$ y = [460294, 460144, 461433, 462997, 463721, 463878, 464457, 465705, 467125, 468501, 470008, 471629, 473322, 475648, 479326, 484121, 488900, 492847, 496009, 498675, 500874, 502600, 503915, 504617, 504298, 502855, 500581, 497681, 494157, 490227, 486371, 482790, 479237, 475621, 472476, 470584, 470262, 471158, 472654, 474381, 476401, 478933, 481985, 485419, 489331, 493933, 498858, 502970, 505256, 505699, 504968, 503520, 501439, 499030, 497078, 496408, 497275, 499099, 500739, 501308, 500870, 500061, 498980, 497105, 494533, 492548, 492324, 493597, 495370, 497428, 500313, 504173, 508657, 513864, 520240, 527284, 533236, 536487, 536821, 535070, 532094, 528397, 524244, 519840, 515606, 512362, 510859, 511056, 512273, 514132, 516932, 520917, 525644, 530302, 534354, 537733, 540640, 543301, 545689, 547420, 548110, 547751, 546527, 544443, 541615, 538777, 536950, 536545, 537229, 538674, 540906, 543898, 547455, 551660, 556844, 562823, 568666, 573596, 577749, 581795, 586205]
59879E86205N030N974P089P734P355N979M137K494J445Q62K52n64j213j429j612
59864F29738k215k921k993k384j803j688j713j416p96m4Q80K079L376M394M917
59849F27411N076N266N953P375R264J0751J0728Q600M935J241j194k217k451k186
59835F88552j185M67J865J935L90k091m374n522n355m582m144m380n060o002p119
59820F43395p959p948p258o682o462n921m548k720j064J77P46K73q96j541r71
59805E90621J7L59K10M11R69J147P10J45k42n57p31n06j9K74K86K79J57n08j665
59786E91357k640l064l375m138n132n535m936l946l630m233m761m118k537j260
59772E38052q65p01j79K92K36J11N66J352J851K212L023M149M854M969N035N392
$$ y = [586205, 591235, 597209, 604298, 612032, 619387, 625366, 629503, 631997, 633442, 634304, 634556, 633992, 632779, 631350, 629738, 627523, 624602, 621609, 619225, 617422, 615734, 614021, 612605, 611809, 611765, 612645, 614724, 618100, 622494, 627411, 632487, 637753, 643706, 651081, 660345, 671096, 681824, 690424, 695359, 696600, 695406, 693189, 690738, 688552, 687367, 687834, 689699, 691634, 692024, 689933, 685559, 680037, 674682, 670100, 665956, 661576, 656516, 650514, 643395, 635436, 627488, 620230, 613548, 607086, 601165, 596617, 593897, 592833, 593010, 593756, 594029, 593133, 591592, 590621, 590638, 590997, 591207, 591618, 592587, 593734, 594444, 594589, 594347, 593790, 593059, 592553, 592534, 592808, 593094, 593373, 593530, 593022, 591357, 588717, 585653, 582278, 578140, 573008, 567473, 562537, 558591, 554961, 550728, 545967, 541849, 539312, 538052, 537187, 536486, 536307, 536599, 536835, 536946, 537512, 538864, 540715, 542927, 545950, 550099, 554953, 559922, 564957, 570349]
59756E70349N808O107O431O887P474Q296R349J0207J0575J0866J1557J2143J1568
59743F87617R756P830O714O237N777N088M166K955J599N92K42K44j0p74j728k320
59727G33985k362k310k807l807m488m257l473k845k566k443k482k693k729k394
59713F92329k218k731l416l189j906n86l2lJ54O98J500K371L130L760M556N728
59697G00145O915P478P241O530N657M844M398M342M033K861J289M33N45P02J12
59682G57525r54j803k191k275k251k373k971m182n803p426q493q502p590o778
59668F93933o922p546p390o072m446l302k536j807j158o45M3J059J986K362K343
59653F59902K515L301M631N926O386N705M470L431K430P07j745l912n127n921
$$ y = [570349, 576157, 582264, 588695, 595582, 603056, 611352, 620701, 630908, 641483, 652349, 663906, 676049, 687617, 697373, 705203, 711917, 718154, 723931, 729019, 733185, 736140, 737739, 738331, 738573, 738817, 738807, 738033, 736305, 733985, 731623, 729313, 726506, 722699, 718211, 713954, 710481, 707636, 705070, 702627, 700145, 697452, 694723, 692329, 690111, 687380, 683964, 680775, 678869, 678283, 678251, 678248, 678402, 679100, 680600, 682971, 686101, 689861, 694417, 700145, 707060, 714538, 721779, 728309, 733966, 738810, 743208, 747550, 751583, 754444, 755733, 756166, 756711, 757413, 757525, 756571, 754768, 752577, 750302, 748051, 745678, 742707, 738525, 732722, 725296, 716803, 708301, 700711, 693933, 687011, 679465, 672075, 666003, 661557, 658255, 655719, 653912, 652754, 652109, 652152, 653211, 655197, 657559, 659902, 662417, 665718, 670349, 676275, 682661, 688366, 692836, 696267, 698697, 699404, 697659, 693747, 688620, 682699]
59639F82699p066q438r344r528r279q846q265p623o987o121m728k989j670j501
59625E90314k431l638m350m644n226o352p335p402o637n707m957m303l732l358
59611E20242k998k331j410n81M3N93J054J320J543J887K123J984J729J783K013
59596E28994K000J865K013K253J957J099L68J93L85O92R49P98O0o57o72m70j161
59579E40666k635l492l079k402k510l051l151k752k322j937j417q25k95J90L80
59564E11368k21j407k084j573n31J0j11m54q40j192j096l53M48O70N41O86J056
59547E04917J205J292J961L245M437N216O227Q152J0635J2618J3720J4917J7256
59534F05798J9812J9575J4290N308l215q167r714r694q980p295m763k339p24L13
$$ y = [682699, 675633, 667195, 657851, 648323, 639044, 630198, 621933, 614310, 607323, 601202, 596474, 593485, 591815, 590314, 587883, 584245, 579895, 575251, 570025, 563673, 556338, 548936, 542299, 536592, 531635, 527332, 523600, 520242, 517244, 514913, 513503, 512922, 512965, 513558, 514612, 515932, 517475, 519362, 521485, 523469, 525198, 526981, 528994, 530994, 532859, 534872, 537125, 539082, 540181, 540549, 540742, 541127, 541819, 542768, 543566, 543626, 542969, 542297, 541827, 540666, 538031, 534539, 531460, 529058, 526548, 523497, 520346, 517594, 515272, 513335, 511918, 511093, 510798, 510988, 511368, 511147, 509740, 507656, 506083, 505552, 505562, 505451, 504997, 504157, 502965, 501869, 501516, 501964, 502634, 503175, 503861, 504917, 506122, 507414, 509375, 512620, 517057, 522273, 528500, 536652, 547287, 559905, 573625, 588542, 605798, 625610, 645185, 659475, 664783, 661568, 653401, 643687, 633993, 625013, 617718, 612955, 610616, 609892, 610205]
59520F10205J414K803M000M117K593o1k533l917m424m743n175n748o573p547q030
59505E76381p486o254n222m821m818m855m751m367l667k892k281j664o44P44J922
59490E25325K357K070J497R87O01L45M71J269K554L645M082M087M030L823L306
59475E60449K848K877L103K960K597K527K439J526J4q10m48J16J06J32Q77J717
59459E83030J743J383J778K994M096M752N550O665P271O739N597M802M534M228
59445F45162L586K930K526J981O70j371l426m969o039o600o197m737l041j896
59431F18579j042Q9J150J371R94J021J735K684L988O240R058J1199J2431J3805
59417F83302J5779J7582J8944K0735K3181K5273K6784K8866L1022K9493K1109
$$ y = [610205, 611619, 614422, 618422, 622539, 625132, 625071, 622538, 618621, 614197, 609454, 604279, 598531, 591958, 584411, 576381, 568895, 562641, 557419, 552598, 547780, 542925, 538174, 533807, 530140, 527248, 524967, 523303, 522659, 523403, 525325, 527682, 529752, 531249, 532236, 532837, 533182, 533653, 534922, 537476, 541121, 545203, 549290, 553320, 557143, 560449, 563297, 566174, 569277, 572237, 574834, 577361, 579800, 581326, 581340, 580530, 580082, 580198, 580304, 580436, 581313, 583030, 584773, 586156, 587934, 590928, 595024, 599776, 605326, 611991, 619262, 626001, 631598, 636400, 640934, 645162, 648748, 651678, 654204, 656185, 656855, 655484, 652058, 647089, 641050, 634450, 628253, 623516, 620475, 618579, 617537, 617626, 618776, 620147, 621141, 622162, 623897, 626581, 630569, 636809, 645867, 657066, 669497, 683302, 699081, 716663, 735607, 756342, 779523, 804796, 831580, 860446, 891468, 920961, 942070]
59406I42070P907m268j1335j3384j2306r487n856j955K642Q275J2925J2679N592
59393I33499n773j6487k3287k6023k6116k4750k2415j9350j5976j2920j0598q906
59381G20898p520o347n487m866m247l479k471j149K97J338J617J388J205J351
59367F92528J781K306K619K504K306K713L841M955N383N248N021N001N485O715
59353G48406Q263R209R372R584J0309J0928J1071J1470J2642J3693J3573J2645
59341H81165J1821J0961R465P705O372M911K164j642n074p513r576j1585j3059
59328H86115j3912j4753j5705j6093j5631j4894j4323j3664j2654j1483j0358
59317G32645r339q657q482q364p728o815o331o247n858m986m061l098j651J61
$$ y = [942070, 949977, 945709, 934374, 920990, 908684, 899197, 893341, 891386, 894028, 902303, 915228, 927907, 933499, 927726, 911239, 887952, 861929, 835813, 811063, 788648, 769298, 753322, 740402, 729804, 720898, 713378, 707031, 701544, 696678, 692431, 688952, 686481, 685332, 685629, 686967, 688584, 689972, 691177, 692528, 694309, 696615, 699234, 701738, 704044, 706757, 710598, 715553, 720936, 726184, 731205, 736206, 741691, 748406, 756669, 765878, 775250, 784834, 795143, 806071, 817142, 828612, 841254, 854947, 868520, 881165, 892986, 903947, 913412, 921117, 927489, 932400, 934564, 932922, 927848, 920335, 910759, 899174, 886115, 872203, 857450, 841745, 825652, 810021, 795127, 780804, 767140, 754486, 743003, 732645, 723306, 714649, 706167, 697803, 690075, 683260, 676929, 670682, 664824, 659838, 655777, 652679, 651028, 651189]
59303F51189J635K678M039O171Q797J1613J4321J5731J4106Q868J365o372j2742
59290G21399j6570j7251j5490j2993j0850q846o580m357k594j182R5J189K267
59277F28237L826N909P826R071R929J0878J1926J2896J3780J4546J5059J5412
59265G59295J5737J5629J4375J1976R280O978N035L193J332o91k818m370m641
59252H30310m050l739m020m143l757l473l638l751l594l788m579n061m494l512
59238G74711l258l895m758n337n374m626l375k714l422m861n667n348m548m068
59224G13460m201m909n966o927p383p328p021o564n903n101m420m063l912l564
59210F36198k686j485n85k53j4O59J554K103K213K205K177K080K111K301K041
$$ y = [651189, 652824, 655502, 659541, 665712, 674509, 686122, 700443, 716174, 730280, 739148, 740513, 734141, 721399, 704829, 687578, 672088, 659095, 648245, 639399, 632819, 628462, 625868, 624686, 624781, 625970, 628237, 632063, 637972, 645798, 654869, 664798, 675676, 687602, 700498, 714278, 728824, 743883, 759295, 775032, 790661, 805036, 817012, 826292, 833270, 838305, 841498, 842830, 842139, 839321, 834951, 830310, 826260, 822521, 818501, 814358, 810601, 807128, 803490, 799739, 796145, 792357, 787778, 782717, 778223, 774711, 771453, 767558, 762800, 757463, 752089, 747463, 744088, 741374, 737952, 733091, 727424, 722076, 717528, 713460, 709259, 704350, 698384, 691457, 684074, 676746, 669725, 663161, 657258, 652157, 647737, 643674, 639762, 636198, 633512, 632027, 631442, 631189, 631175, 631834, 633388, 635491, 637704, 639909, 642086, 644166, 646277, 648578, 650619]
59195F50619Q69m99r16m19p6l44o97q41j083j368j232q43q80j126o04N53Q47k77
59177F41683j354j073k08j93r18j305j216j352j709j574q46k25j4L19J225K414
59161F33654L231L241K455J299L11l84j145k263l595m893o021o722o694o180n893
59146F00401o021n932n208m320l836l600l275l077l337l781l953m011m387m900
59132E40763m840l874k487j439j092j131q81K0J246K395L664N408P203Q192Q472
59117E61619R123J0570J1800J1741J0633R468Q725Q295Q117Q136P996P333O198
59104F79754M838L365J936Q65K84j4k26l67n92j214k188l067l555l690l469k833
59088F69827k019j345p06K5L27m19j809k885l609m695o088o878o895o872o865
$$ y = [650619, 651488, 650989, 650073, 649654, 649578, 649234, 648537, 647696, 646613, 645245, 644013, 643170, 642290, 641164, 640560, 641113, 641960, 641683, 640329, 639256, 639048, 638855, 637937, 636632, 635416, 634064, 632355, 630781, 629935, 629710, 629696, 630015, 631240, 633654, 636885, 640126, 642581, 643880, 644191, 643807, 642662, 640399, 636804, 631911, 625890, 619168, 612474, 606294, 600401, 594380, 588448, 583240, 578920, 575084, 571484, 568209, 565132, 561795, 558014, 554061, 550050, 545663, 540763, 535923, 532049, 529562, 528123, 527031, 525900, 525019, 525039, 526285, 528680, 532344, 537752, 544955, 553147, 561619, 570742, 581312, 593112, 604853, 615486, 624954, 633679, 641974, 650091, 658227, 666223, 673556, 679754, 684592, 687957, 689893, 690758, 691042, 691028, 690802, 690435, 689843, 688629, 686441, 683374, 679819, 676129, 672660, 669827, 667808, 666463, 665757, 665782, 666109, 665690, 663881, 660996, 657387, 652692, 646604, 639726, 632831, 625959, 619094]
59073F19094o044m448l403l496l726l367l073l277l155k322j982k945l929l442
59059E70485k215j988k788l230k929k814l267l557l115k128r53J32O91N75L25
59044E43224L96M06l6l63O3P20O58O1r9L94R10J156J391J662J790J980K600L472
59026E60385M207M967O224P983R868J1582J2780J3077J2772J2737J2968J2151
59014F81701R564O306L598J003k216n110o224n958n796n779m776k975j892j753
59000F59693j016J034L098L928L974M093M040L245K116J532J657K014K280K455
58986F94143K594K697K609K000Q43j57j72P72K058L497N356P466R200J0354J1295
58971G54555J2161J2774J3326J4342J5734J6638J6377J5131J3529J2155J1317
$$ y = [619094, 613050, 608602, 605199, 601703, 597977, 594610, 591537, 588260, 585105, 582783, 580801, 577856, 573927, 570485, 568270, 566282, 563494, 560264, 557335, 554521, 551254, 547697, 544582, 542454, 541501, 541633, 542324, 542899, 543224, 543620, 544026, 543990, 543627, 543690, 544410, 545068, 545129, 545030, 545424, 546334, 547490, 548881, 550543, 552333, 554313, 556913, 560385, 564592, 569559, 575783, 583766, 593634, 605216, 617996, 631073, 643845, 656582, 669550, 681701, 691265, 697571, 701169, 702172, 699956, 694846, 688622, 682664, 676868, 671089, 666313, 663338, 661446, 659693, 658677, 659711, 662809, 666737, 670711, 674804, 678844, 682089, 684205, 685737, 687394, 689408, 691688, 694143, 696737, 699434, 702043, 704043, 704886, 704729, 704557, 705329, 707387, 710884, 716240, 723706, 732906, 743260, 754555, 766716, 779490, 792816, 807158, 822892, 839530, 855907, 871038, 884567, 896722, 908039]
58960I08039J0703R395O851L792J316o72l282o859j0354j2719j4051j5056j5990
58947H61113j6638j6871j6827j6674j6345j5565j4157j2343j0508q633o422m036
58935G06094k100q19J88R54J014N95Q37K062L012K688J905J763J709O14j056j852
58919G17608j661j688k350k879k972l245l746l512k036q7J333K016K316K697L619
58904G05413N191O960Q537J0203J2136J3595J3818J3322J3205J3467J3250J2418
58892H41515J1747J1611J1728J2120J3197J4856J6547J8063J9306J9534J8026
58881A008250J5329J2705J0419P766M584J552r20k987m614n711o791q368r852
58868A021362j0215r485q462p326n906m904n237o381o995p052p643q790r316r046
$$ y = [908039, 918742, 928137, 934988, 938780, 940096, 939424, 936142, 929283, 918929, 906210, 892159, 877103, 861113, 844475, 827604, 810777, 794103, 777758, 762193, 748036, 735693, 725185, 716552, 710130, 706094, 703994, 703175, 703363, 704317, 705331, 705926, 706763, 708825, 711837, 714525, 716430, 718193, 719902, 720516, 719460, 717608, 715947, 714259, 711909, 709030, 706058, 702813, 699067, 695555, 693519, 693432, 694765, 696781, 699097, 701794, 705413, 710604, 717564, 726101, 736304, 748440, 762035, 775853, 789175, 802380, 815847, 829097, 841515, 853262, 864873, 876601, 888721, 901918, 916774, 933321, 951384, 970690, 990224, 1008250, 1023579, 1036284, 1046703, 1054469, 1059053, 1060605, 1059685, 1056698, 1052084, 1046373, 1039582, 1031214, 1021362, 1011147, 1001662, 993200, 985874, 979968, 975064, 969827, 963446, 956451, 949399, 941756, 932966, 923650, 914604]
58854I14604r249j0466j1593j1641j0936j0034q902p706p136p360p745p985q488
58841G95363r393j0251j0872j1411j1684j1420j1029j0868j0103p867n190l945
58829F81330m079l803k580j689j599j140K41J510K096K815L948M439L959L852
58815F89300M857N728N336M435M088L882L056K072J623J271L04r66j899k618l485
58800G16984m368n231o445p839q509q268q105q539q836q537q279q232p223m686
58786F13887k104j167j457j289k5J655L091M170M934N507N973N974N036L478K114
58771F49777R01r13l121m496m781n152o259p320p734p967q153p515n967m678m127
58756E72495l290j668k81L04J093K579L399K559J309J227J908K123J861J660J305
$$ y = [914604, 905355, 894889, 883296, 871655, 860719, 850685, 841783, 834077, 826941, 819581, 811836, 803851, 795363, 785970, 775719, 764847, 753436, 741752, 730332, 719303, 708435, 698332, 690465, 685275, 681330, 677251, 673448, 670868, 669179, 667580, 666440, 666681, 668191, 670287, 673102, 677050, 681489, 685448, 689300, 694157, 699885, 705221, 709656, 713744, 717626, 720682, 722754, 724377, 725648, 725952, 724986, 723087, 720469, 716984, 712616, 707385, 700940, 693101, 684592, 676324, 668219, 659680, 650844, 642307, 634028, 625796, 618573, 613887, 611783, 610616, 609159, 607870, 607845, 609500, 612591, 616761, 621695, 627202, 633175, 639149, 644185, 647663, 649777, 650678, 649765, 646644, 642148, 637367, 632215, 625956, 618636, 610902, 602935, 594782, 587267, 581300, 576622, 572495, 569205, 567537, 567256, 567560, 568653, 571232, 574631, 577190, 578499, 579726, 581634, 583757, 585618, 587278, 588583]
58741E88583Q41J465L652N641N681M649M598N609O079N420M621M530N077N932
58727F52378O640O517N448M271L581K942K123J953K933M150M746N270O371P378
58713G16701P554P546Q118Q517P658N878M050K014n70k896m201n389p787j1023
58699G36170j3744j5593j6987j7745j7536j6939j6567j5925j4495j3045j2332
58688E65262j1551r688p462o219n727m900l844l387l289k745k126k416l342l695
58674D94871l074j934m99R98J728J450J482L000N200O656P494Q583R530R413Q534
58659E53432P588N886K483j659m583n847o295o132n235m596n297o494o527n497
58645E11227m777m520l842k902k549k345j193L92R17N49Q34J886K241J553J162
$$ y = [588583, 589424, 590889, 594541, 600182, 605863, 610512, 615110, 620719, 626798, 632218, 636839, 641369, 646446, 652378, 659018, 665535, 670983, 675254, 678835, 681777, 683900, 685853, 688786, 692936, 697682, 702952, 709323, 716701, 724255, 731801, 739919, 748436, 756094, 761972, 766022, 768036, 767466, 764570, 760369, 754980, 747193, 736170, 722426, 706833, 689846, 672101, 654565, 637626, 621059, 605134, 590639, 577594, 565262, 553711, 544023, 536561, 530342, 524615, 519715, 515871, 512484, 509195, 506450, 504324, 501908, 498566, 494871, 491797, 489863, 489364, 490362, 492090, 493540, 495022, 498022, 503222, 509878, 517372, 525955, 535485, 544898, 553432, 561020, 566906, 569389, 567730, 563147, 557300, 551005, 544873, 539638, 535042, 529745, 523251, 516724, 511227, 506450, 501930, 498088, 495186, 492637, 490292, 489099, 489491, 490408, 490957, 491791, 493677, 495918, 497471, 498633]
58630D98633J729K292K062J355M94n91j560j910j949k162j979p67O07J006J189
58615D98449K608M603N145M096L281L498L785L707L941M427M208L343K897K862
58601E50850K248J366J594K666K595Q02r73j490j546j916j973j194k15N44J608
58586E54966L138M459N464O938Q889J0235J0644J1040J1758J1831J0690R102P798
58573F66952O701N980O315P586Q742R487J0678J2677J4737J6523J8733K1710K4723
58560H31544K7111K8949L0190L0320K9116K6686K2738J7034J0489M523n29n037
58548A053134q430r613q866p666o735n871n523o576q702j0738j2727j5756j9782
58535I26149k3445k5918k7169k6696k4125k0827j8673j7239j4588j0761p965p132
$$ y = [498633, 500362, 502654, 504716, 506071, 506565, 505974, 504414, 502504, 500555, 498393, 496414, 495647, 496254, 497260, 498449, 501057, 505660, 510805, 514901, 518182, 521680, 525465, 529172, 533113, 537540, 541748, 545091, 547988, 550850, 553098, 554464, 556058, 558724, 561319, 562121, 561148, 559658, 558112, 556196, 554223, 553029, 552814, 553358, 554966, 558104, 562563, 568027, 574965, 583854, 594089, 604733, 615773, 627531, 639362, 650052, 659154, 666952, 673653, 679633, 685948, 693534, 702276, 711763, 722441, 735118, 749855, 766378, 785111, 806821, 831544, 858655, 887604, 917794, 948114, 977230, 1003916, 1026654, 1043688, 1054177, 1058700, 1058171, 1053134, 1044704, 1035091, 1026225, 1018559, 1011824, 1005953, 1000430, 993854, 985152, 974414, 961687, 945931, 926149, 902704, 876786, 849617, 822921, 798796, 777969, 759296, 742057, 727469, 716708, 708743, 701611]
58523G01611o895o326o195o789o963o183n397n128m630l600k788k395j782j176
58509F35364j603k680k647j157P9K9l75k57o9j75j20L9m26j279j367o24j26J5
58491F22621P34J844K221K261L665O301P961P826P630Q683J0305J1953J4243J6918
58477G25166J8343J8103J7841J8406J8466J6840J4040J0590O031N79m286p771
58465H52348j0326j1836j1476r845q679p928n681j666J975M177O319R241J1693
58452H18316J2929J3998J5208J4946J2303Q448M248q73o613j1028j3296j4788
58440H53798j6251j6496j4935j2837j1021q894o688n726n589m051q79J485K098
58427G54014L023N343P210P428P580Q750R378Q280O711N532L445j7k993m556o346
$$ y = [701611, 694716, 688390, 682195, 675406, 668443, 662260, 656863, 651735, 647105, 643505, 640717, 638322, 636540, 635364, 633761, 631081, 628434, 627277, 627356, 627385, 627010, 626753, 626684, 626509, 626389, 626428, 626002, 624723, 623356, 622732, 622606, 622621, 623355, 625199, 627420, 629681, 633346, 639647, 647608, 655434, 663064, 671747, 682052, 694005, 708248, 725166, 743509, 761612, 779453, 797859, 816325, 833165, 847205, 857795, 863826, 864405, 860119, 852348, 842022, 830186, 818710, 808865, 800186, 792258, 786577, 784911, 786886, 791063, 797382, 806623, 818316, 831245, 845243, 860451, 875397, 887700, 896148, 900396, 899523, 892910, 881882, 868586, 853798, 837547, 821051, 806116, 793279, 782258, 773364, 766676, 760950, 755361, 751310, 750431, 751916, 754014, 757037, 762380, 769590, 777018, 784598, 793348, 802726, 811006, 817717, 823249, 826694, 826677, 823684, 819128, 812782]
58412H12782q991j0304r156p831q226q919q381p760q065p760n803m028l825l500
58398G10233j576L14N28M62J734L139L267L281M277M670L089J310J349K246K387
58383G40710K494L607M633M549M557N597O352O054O275P667Q106O616N690O990
58369H19897Q272P588O908Q294R956R719R054J0014J1344J1352J1456J3180J4661
58356I51695J3896J2455J2216J1581Q736N556M194L017M1k634k195p0Q45J131
58342A020464K697M470M596M413N895P709P935Q078J0147J2539J3106J3443J5732
58329A131224J8143J7981J6545J6270J5801J2758Q717O684O046M622L098K937
58317A260826K709J030K24K432N181N527N264P138R349R158Q408J0022J2319J2484
$$ y = [812782, 803791, 793487, 784331, 776500, 768274, 759355, 750974, 743214, 735149, 727389, 721586, 717558, 713733, 710233, 708657, 708971, 709499, 709961, 711695, 714834, 718101, 721382, 725659, 730329, 733418, 734728, 736077, 738323, 740710, 743204, 746811, 751444, 755993, 760550, 766147, 772499, 778553, 784828, 792495, 800601, 807217, 812907, 819897, 828169, 835757, 842665, 850959, 860915, 870634, 879688, 889702, 901046, 912398, 923854, 937034, 951695, 965591, 978046, 990262, 1001843, 1010579, 1016135, 1020329, 1023346, 1023387, 1020753, 1018558, 1018488, 1019333, 1020464, 1023161, 1027631, 1032227, 1036640, 1042535, 1050244, 1058179, 1066257, 1076404, 1088943, 1102049, 1115492, 1131224, 1149367, 1167348, 1183893, 1200163, 1215964, 1228722, 1237439, 1244123, 1250169, 1254791, 1257889, 1260826, 1263535, 1264565, 1264789, 1267221, 1272402, 1277929, 1283193, 1290331, 1299680, 1308838, 1317246, 1327268, 1339587, 1352071]
58303A352071J2258J4398J6857J6558J5547J7237J9806J9746J8587J9649K1380
58292A544094K0747J9943K2702K6927K8122K7246K8069K9684K8814K6813K7050
58281A830211K8087K6602K4214K4259K4896K2736K0072K0928K3453K4004K5020
58270B094482L0457L7175L9674L9891M3207M8268N0106N0068N3029N7838O0198
58259B604393O1670O6006P0031O8448O4269O3952O5805O4157O1291O3474O8667
58248C322163P0248O9853P4148Q1908Q6908R0531R8658J09045J15028J18722J27039
58237D364251J37865J44134J48192J57608J70243J78603J85338J98650K16122
58228E901006K29616K42179K62725K88101L08757L27933L55923L89805M19329
$$ y = [1352071, 1364329, 1378727, 1395584, 1412142, 1427689, 1444926, 1464732, 1484478, 1503065, 1522714, 1544094, 1564841, 1584784, 1607486, 1634413, 1662535, 1689781, 1717850, 1747534, 1776348, 1803161, 1830211, 1858298, 1884900, 1909114, 1933373, 1958269, 1981005, 2001077, 2022005, 2045458, 2069462, 2094482, 2124939, 2162114, 2201788, 2241679, 2284886, 2333154, 2383260, 2433328, 2486357, 2544195, 2604393, 2666063, 2732069, 2802100, 2870548, 2934817, 2998769, 3064574, 3128731, 3190022, 3253496, 3322163, 3392411, 3462264, 3536412, 3618320, 3705228, 3795759, 3894417, 4003462, 4118490, 4237212, 4364251, 4502116, 4646250, 4794442, 4952050, 5122293, 5300896, 5486234, 5684884, 5901006, 6130622, 6372801, 6635526, 6923627, 7232384, 7560317, 7916240, 8306045, 8725374]
58219H725374M48429M89148N38737N85771O34134O96616P69950Q42510R21531
58210A4652200J024537J149314J282824J434110J625616J858466K122656K435190
58202B7584913K829235L314416L893762M613357N545974O732622Q190985R965092
58194G2670356J2102514J4604904J7483212K0830979K4725565K9071642L3645060
58187B25134232L8133432M1708493M2456784L7849436K6611275J0394315o725442
58180D15562525k0741550k9866528l4578975l6194874l5730186l3781163l0828738
58173A93840511k7342628k3714030k0232563j7092349j4370706j2047379j0083067
58166F8957789q456618p131053o041647n137835m399239l800738l300154k870955
$$ y = [8725374, 9173803, 9662951, 10201688, 10787459, 11421593, 12118209, 12888159, 13730669, 14652200, 15676737, 16826051, 18108875, 19542985, 21168601, 23027067, 25149723, 27584913, 30414148, 33728564, 37622326, 42235683, 47781657, 54514279, 62705264, 72670356, 84772870, 99377774, 116860986, 137691965, 162417530, 191489172, 225134232, 263267664, 304976157, 347432941, 385282377, 411893652, 422287967, 415562525, 394820975, 364954447, 330375472, 294180598, 258450412, 224669249, 193840511, 166497883, 142783853, 122551290, 105458941, 91088235, 79040856, 68957789, 60501171, 53370118, 47328471, 42190636, 37791397, 33990659, 30690505, 27819550]
58158B7819550k512807k220007j969752j748650j561350j405686j266027j137029
58150A3998242j028068r38661q53862p68831o94402o33454n74675n14602m63589
58141G528098m24546l86792l46616l14070k93594k76579k58451k45218k37654
58132D744578k26452k08819j93576j84357j73494j57787j44939j38579j31611
58123C184964j20192j10610j06414j01808r3511q6842q4563q1421p4943p0360
58113B254300o9765o7405o0630n4958n3505n1673m6894m3562m3723m2622l8132
58102A681431l5148l6120l6254l2533k8733k7375k5427k2143k2436k8028l3334
58091A353900l4454l4375l5412l4492l0110k6312k5391k3894j9915j7223j8162
$$ y = [27819550, 25306743, 23086736, 21116984, 19368334, 17806984, 16401298, 15135271, 13998242, 12970174, 12031513, 11177651, 10408820, 9714418, 9080964, 8506289, 7991687, 7528098, 7103552, 6716760, 6370144, 6056074, 5762480, 5485901, 5227450, 4982232, 4744578, 4518126, 4309307, 4115731, 3931374, 3757880, 3600093, 3455154, 3316575, 3184964, 3064772, 2954162, 2847748, 2745940, 2652429, 2565587, 2481024, 2399603, 2324660, 2254300, 2184535, 2117130, 2056500, 2001542, 1948037, 1896364, 1849470, 1805908, 1762185, 1719563, 1681431, 1646283, 1610163, 1573909, 1541376, 1512643, 1485268, 1459841, 1437698, 1415262, 1387234, 1353900, 1319446, 1285071, 1249659, 1215167, 1185057, 1158745, 1133354, 1109460, 1089545, 1072322, 1054160]
58080A054160j9280j7937j6644j7234j7260j5640j5311j6958j6712j3418j1498
58069H76268j3134j4377j2556j0897j1967j2972j1583j0265j0848j0716q362p006
58057G41585q786j0772j0481j0005j1106j1563j0004r049j0127j0427q405p013
58045F23847p868p787m821k376l303m988m474l510m324n098l940l038m571o537
58031E57212o638o454p878r269q919q581r755j0250q179n857n868o683n911m611
58017D52359m745n337m717l774l758l631k550k088l151l694k310r19j235j660
58003D08790n24P51N70J30P10J058J63m29L67R85M13K97J305J028j730m086l506
57986D06292j700j197j376r09q57k128k970k092j321k176k896j844o89j176j866
$$ y = [1054160, 1034880, 1016943, 1000299, 983065, 965805, 950165, 934854, 917896, 901184, 887766, 876268, 863134, 848757, 836201, 825304, 813337, 800365, 788782, 778517, 767669, 756953, 748591, 741585, 732799, 722027, 711546, 701541, 690435, 678872, 668868, 659819, 649692, 639265, 630860, 623847, 615979, 608192, 603371, 600995, 597692, 592704, 588230, 584720, 580396, 575298, 571358, 568320, 563749, 557212, 550574, 544120, 536242, 526973, 518054, 509473, 499718, 489468, 481289, 475432, 469564, 462881, 456970, 452359, 447614, 442277, 437560, 433786, 430028, 426397, 423847, 421759, 418608, 414914, 412604, 411685, 410450, 408790, 408266, 409017, 409587, 409717, 410427, 411485, 411648, 411219, 411586, 412571, 412984, 413281, 414586, 415614, 413884, 409798, 406292, 404592, 403395, 402019, 401110, 400253, 398125, 395155, 393063, 391742, 389566, 386670, 384826, 384137, 382961, 381095]
57971C81095j143l84r05r85Q12K401J722M97R92J926J178j84k58m8j245k710k714
57954C80047k398l458m708m310l280l396l803k999j958k002j856j75J402J058
57940C48164L83J618L610M159M132N499P298P420O574O681O954N451K947J516
57926D12406O15j710m895o765p277p954q695q403p780q231r013q459o968n923
57912C20948m932l098j576j824k581j765k0O72N55J107J831J303K17P0R9j251
57896C09755k936k803j325n55m34M74J656J493N28M99R23J25j215j065J17J95
57880C05432o43k98J091J218j81q30J55J058P58K47L59P26J253K363L496L576
57864C19780L017L170L978M255L992M205M873N221N470O171O470N357L890L707
$$ y = [381095, 379952, 379568, 378663, 377678, 378490, 380891, 382613, 383110, 384102, 386028, 387206, 387022, 386764, 386716, 385471, 382761, 380047, 377649, 374191, 369483, 365173, 361893, 358497, 354694, 351695, 349737, 347735, 345879, 345704, 347106, 348164, 348547, 350165, 353775, 357934, 362066, 367565, 374863, 382283, 388857, 395538, 402492, 407943, 410890, 412406, 413021, 411311, 406416, 399651, 392374, 384420, 375725, 367322, 359542, 351311, 342298, 333839, 326871, 320948, 316016, 312918, 311342, 309518, 306937, 305172, 305152, 305824, 306379, 307486, 309317, 310620, 310837, 310907, 311006, 309755, 306819, 304016, 302691, 302136, 301702, 302176, 303832, 305325, 305853, 306352, 307275, 307400, 306185, 305120, 305237, 305432, 304789, 304491, 305582, 306800, 306619, 305789, 305944, 307002, 307760, 308007, 308366, 309092, 310345, 312708, 316204, 319780, 322797, 325967, 329945, 334200, 338192, 342397, 347270, 352491, 357961, 364132, 370602, 375959, 379849, 383556]
57850C83556M054K958O42r48j517k418l687l957l260l095l759m013l499l138l189
57835C54730l023k660k565k342j605j331k226k778j363P53J304Q02J336K547K311
57820C43890R26R73K912M331L912L080L125L560L788L850L109P05k411m268m785
57805C66697n471o381o128m883m481n244n562m939m656n010m670l427k831l384
57791B99630l599k642j508r09k48O17P28j17q58j020j170j246n07O51R57O21J199
57774B90579K856L995L915L542L263K361R70K18k1j125l060m147l959l974m698
57759B90715m688l300j989j880k113j704j029n32K65J489K319K437K635L322L952
57744B89899M301M776N192M864M065L715L573K642J335J207K418L496L782L897
$$ y = [383556, 387610, 390568, 391210, 390262, 388745, 386327, 382640, 378683, 375423, 372328, 368569, 364556, 361057, 357919, 354730, 351707, 349047, 346482, 344140, 342535, 341204, 338978, 336200, 334837, 335590, 336894, 337696, 339032, 341579, 343890, 344816, 345789, 348701, 353032, 356944, 360024, 363149, 366709, 370497, 374347, 377456, 378161, 375750, 371482, 366697, 361226, 354845, 348717, 343834, 339353, 334109, 328547, 323608, 318952, 313942, 309272, 305845, 303014, 299630, 296031, 293389, 291881, 290972, 290724, 291341, 292069, 291952, 291094, 290074, 288904, 287658, 287151, 287802, 288759, 289380, 290579, 293435, 297430, 301345, 304887, 308150, 310511, 311481, 311699, 311678, 310553, 307493, 303346, 299387, 295413, 290715, 286027, 282727, 280738, 278858, 276745, 275041, 274012, 273480, 273745, 275234, 277553, 279990, 282625, 285947, 289899, 294200, 298976, 304168, 309032, 313097, 316812, 320385, 323027, 324362, 325569, 327987, 331483, 335265, 339162]
57730C39162L819K772J300R77J754J891Q51k5j45m69j337j819j764k110k759k551
57714C39547j719j841k940l314k709k860m191m869m019l094l011k708j697j283
57700B99292j945k145j094j80k76j35J049J954J623J204J691K101J586J094J379
57685C07198J427O17L39J693L484M277M664N845P664R594J1977J4817J7186J9265
57671D10047K3073K9630L7254M4233N1147N8576O4019O3034N2459L1893M148k4349
57659H45164m5971n7183o0378n9445n5597m8932m1334l5075l0156k5466k1218
57648C64409j8048j5117j1444q064o554o381n719m163k677j656q03k72k31q3N06
57633B83703O27l80j504j545r77q77j105j057j126j796k342k059j734k355l324
$$ y = [339162, 342981, 345753, 347053, 348030, 349784, 351675, 352526, 352501, 352356, 351887, 350550, 348731, 346967, 344857, 342098, 339547, 337828, 335987, 333047, 329733, 327024, 324164, 319973, 315104, 311085, 307991, 304980, 302272, 300575, 299292, 297347, 295202, 294108, 293928, 293652, 293517, 294566, 296520, 298143, 299347, 301038, 303139, 304725, 305819, 307198, 308625, 309242, 309581, 311274, 314758, 319035, 323699, 329544, 337208, 346802, 358779, 373596, 390782, 410047, 433120, 462750, 500004, 544237, 595384, 653960, 717979, 781013, 833472, 865365, 869513, 845164, 799193, 742010, 681632, 622187, 566590, 517658, 476324, 441249, 411093, 385627, 364409, 346361, 331244, 319800, 311736, 305182, 298801, 293082, 288919, 286242, 284586, 283783, 283511, 283280, 283197, 283703, 284330, 283950, 282446, 280901, 279924, 279047, 277942, 276885, 275759, 273963, 271621, 269562, 267828, 265473, 262149]
57618B62149l522l143k848k256q97K76J56o32p50l18l39p54p52l56j74j02K03
57601B45941K23o13j652j909j643j707j995j907j695j993k560k713k514k463k532
57586B18268k449k365k347k012j359j052j156p37N15J474J283N02l13j577l184
57571B03491l772k785j729j876k388k141j755k050k155j089J53J42o17p53l00
57556A80376j3L67J212J601Q19J32R98K565L035K440J944J443J81j174j369q12
57540A93745p50r23k19R64J317R26Q72J020M35n28p39m52p72j324p88N91J246
57523A94621Q98P31J097J112N67K56L22J69m6M38J301J451Q64N22N86L62j02j13
57505B05036J55j9k81L55J588K150J834J488J158M7j661k807l007k823k300j063
$$ y = [262149, 258627, 255484, 252636, 250380, 249483, 249759, 249915, 249283, 248533, 248215, 247876, 247122, 246370, 246014, 245840, 245738, 245941, 246164, 245551, 243899, 241990, 240347, 238640, 236645, 234738, 233043, 231050, 228490, 225777, 223263, 220800, 218268, 215819, 213454, 211107, 209095, 207736, 206684, 205528, 204791, 205306, 206780, 208063, 208565, 208252, 206675, 203491, 199719, 196934, 195205, 193329, 190941, 188800, 187045, 184995, 182840, 181751, 181904, 182046, 181429, 180676, 180376, 180363, 180730, 181942, 183543, 184362, 184494, 185492, 188057, 191092, 193532, 195476, 196919, 197100, 195926, 194557, 193745, 192995, 192072, 191853, 192817, 194134, 195060, 195932, 196952, 197387, 196859, 196120, 195668, 194896, 193572, 192784, 193375, 194621, 195519, 196250, 197347, 198459, 199026, 199282, 199604, 199773, 199727, 200165, 201466, 202917, 203781, 204303, 204889, 205251, 205149, 205036, 205191, 205172, 204891, 205246, 206834, 208984, 210818, 212306, 213464, 213511, 211850, 209043, 206036, 203213, 200913, 199850]
57489A99850K64M81l40j054j312j604j759j118r0K65J23N26J342J377N23j26k36
57472A97112n29j099j289j249j823k849l222k756k215j656n64N44O03R3M89J613
57456A81203J657K00r68n88M85J031J020P81K44l66n05l62o30j021n95L61N43
57439A82490j15j74Q95J842J661Q68K17k31l31K93J123J032J41j31P10J566J679
57422A93535J664J998K047J314K94m53r68j159p07K2K03k7L08J352K195K515K835
57405B06968L042K255N51p97j176j268j555j713j747k105k381j537K44J572J980
57390B02333K327K845K658J730J374K162L173L791M494N201M836L320K132J997
57376B44373J794P42k29k99k62j005j938k224k169k264k058j182l84n05j279j975
$$ y = [199850, 200114, 200595, 200255, 199201, 197889, 196285, 194526, 193408, 193318, 193583, 193706, 194232, 195574, 196951, 197474, 197348, 197112, 196583, 195484, 194195, 192946, 191123, 188274, 185052, 182296, 180081, 178425, 177861, 178405, 179008, 179101, 179590, 181203, 182860, 183060, 182092, 181504, 181989, 183020, 184040, 184821, 185065, 184699, 184194, 183832, 183202, 182181, 181586, 181947, 182490, 182375, 182201, 183096, 184938, 186599, 187467, 187684, 187453, 187122, 187415, 188538, 189570, 189711, 189580, 190290, 191856, 193535, 195199, 197197, 199244, 200558, 200852, 200399, 199431, 198272, 197565, 197587, 197790, 197763, 198071, 199423, 201618, 204133, 206968, 210010, 212265, 212816, 212019, 210843, 209575, 208020, 206307, 204560, 202455, 200074, 198537, 198781, 200353, 202333, 204660, 207505, 210163, 211893, 213267, 215429, 218602, 222393, 226887, 232088, 236924, 240244, 242376, 244373, 246167, 246909, 246680, 246381, 246119, 245114, 243176, 240952, 238783, 236519, 234461, 233279, 232895, 232390, 231111, 229136]
57360B29136k304k159j473q59j152j916j714l73O35N58M66J197J952J884J524
57345B25402J568J634J287R94J058Q91K57l8L48N35M7k11L68Q52L44m61n53j71
57327B34151O2L82J093J554J187N42L54M27L72M06N86K73o53j208p79j40o5j42
57309B38402J42L67J84J85P29J077P21L85O81J003Q73J096K282L390L120J835
57293B56472P69K61n7j65L6J06j07J17J129J960J652O39j42n12n09K63J600K233
57275B65745J593R15J320K007J803J300J763K891L439L357L513L846L577K878
57261B99947K669K965K954K659L036M258N223M966L705K347J626J770K386K781
57247C43292K765K831L195L288K726K130K220K762L072L057L020K988K952L195
$$ y = [229136, 226832, 224673, 223200, 222341, 221189, 219273, 217559, 217186, 217821, 218379, 218845, 220042, 221994, 223878, 225402, 226970, 228604, 229891, 230885, 231943, 232834, 233091, 233053, 233401, 233936, 233983, 233772, 234140, 234992, 235336, 234875, 234322, 234151, 234213, 234595, 235688, 237242, 238429, 238971, 239325, 239752, 240124, 240530, 241116, 241389, 240736, 239528, 238749, 238609, 238544, 238402, 238544, 238911, 239095, 239280, 240009, 241086, 241807, 242192, 242873, 243876, 244749, 245845, 248127, 251517, 254637, 256472, 257241, 257502, 257445, 257280, 257316, 257422, 257315, 257432, 258561, 260521, 262173, 262812, 262670, 262158, 261649, 261912, 263512, 265745, 267338, 268253, 269573, 271580, 273383, 274683, 276446, 279337, 282776, 286133, 289646, 293492, 297069, 299947, 302616, 305581, 308535, 311194, 314230, 318488, 323711, 328677, 332382, 334729, 336355, 338125, 340511, 343292, 346057, 348888, 352083, 355371, 358097, 360227, 362447, 365209, 368281, 371338, 374358, 377346, 380298, 383493]
57233C83493L702L802L148K442K507L074L249K812K349K420L055L863M385M650
57219D28951N265O498P519P468O918P023P479O981N690N280O221P000O722O496
57205E21511P317Q420Q884R141R646R736R194R402J1370J3952J5483J5986J6331
57192F66373J6447J5923J5319J5347J5680J5890J6580J8207J9787K0242K0015
57181H55810K0081K0266K0013J9745J9957J9798J8188J5680J3721J2707J2005
57170A047971J1364J0986J0823J0869J1627J3253J4895J5814J6325J6811J6799
57159A197537J6062J5619J6511J8384K0260K1783K2811K2902K2183K1762K2302
57148A418116K3214K3924K4691K5482K5688K5912K8314L4056M1886N0308N9251
$$ y = [383493, 387195, 390997, 394145, 396587, 399094, 402168, 405417, 408229, 410578, 412998, 416053, 419916, 424301, 428951, 434216, 440714, 448233, 455701, 462619, 469642, 477121, 484102, 489792, 495072, 501293, 508293, 515015, 521511, 528828, 537248, 546132, 555273, 564919, 574655, 583849, 593251, 604621, 618573, 634056, 650042, 666373, 682820, 698743, 714062, 729409, 745089, 760979, 777559, 795766, 815553, 835795, 855810, 875891, 896157, 916170, 935915, 955872, 975670, 993858, 1009538, 1023259, 1035966, 1047971, 1059335, 1070321, 1081144, 1092013, 1103640, 1116893, 1131788, 1147602, 1163927, 1180738, 1197537, 1213599, 1229218, 1245729, 1264113, 1284373, 1306156, 1328967, 1351869, 1374052, 1395814, 1418116, 1441330, 1465254, 1489945, 1515427, 1541115, 1567027, 1595341, 1629397, 1671283, 1721591, 1780842]
57137A780842O8403P6067Q1408Q5986R1287R6523J00792J05591J12985J22642
57127B722526J32734J42465J51708J59534J64991J68346J69976J69479J67645
57118D149404J67593J72049J80862J92804K07874K25816K44342K61423K77975
57109F080142K96243L17117L41033L69916M06029M50658N06032N76819O67807
57100A0011796P82146R23753J098996J313729J570808J871854K217323K601671
57092B2392076L011473L431289L848242M249043M617727M939526N201433N386654
57084E7077463N477941N470612N364687N124425M655759L857408K714273J335603
57076I1078171j04058j455963k637574l616155m383247m944827n315865n512375
$$ y = [1780842, 1849245, 1925312, 2006720, 2092706, 2183993, 2280516, 2381308, 2486899, 2599884, 2722526, 2855260, 2997725, 3149433, 3308967, 3473958, 3642304, 3812280, 3981759, 4149404, 4316997, 4489046, 4669908, 4862712, 5070586, 5296402, 5540744, 5802167, 6080142, 6376385, 6693502, 7034535, 7404451, 7810480, 8261138, 8767170, 9343989, 10011796, 10793942, 11717695, 12816691, 14130420, 15701228, 17573082, 19790405, 22392076, 25403549, 28834838, 32683080, 36932123, 41549850, 46489376, 51690809, 57077463, 62555404, 68026016, 73390703, 78515128, 83170887, 87028295, 89742568, 91078171, 90974113, 89518150, 86880576, 83264421, 78881174, 73936347, 68620482, 63108107]
57068F3108107n549578n446732n228494m920965m550134m142989l724909l314717
57060B6229589k924537k563542k238535j951701j701251j484586j298938j140286
57052A0926213j004783q90921p97768p21590o56575n98463n45418m96187m49733
57043D764775m06314l66639l30243k96192k64846k37118k12628j90181j69525
57034B291089j50925j33577j16134r8353q0891o3835m6629k8968j1031O031J8680
57023A585457K1448J0761j1636l9778o7090q8499j01058j04688j01860r5294q6330
57012I21433p6029o6244n8261n1484m4848l8586l3432k9144k5081k1316j8026
57001D58982j4827j1732r597q527p171m800k732k215k266j251O01J968K714L694
$$ y = [63108107, 57558529, 52111797, 46883303, 41962338, 37412204, 33269215, 29544306, 26229589, 23305052, 20741510, 18502975, 16551274, 14850023, 13365437, 12066499, 10926213, 9921430, 9030509, 8232741, 7511151, 6854576, 6256113, 5710695, 5214508, 4764775, 4358461, 3991822, 3661579, 3365387, 3100541, 2863423, 2650795, 2460614, 2291089, 2140164, 2006587, 1890453, 1792100, 1711209, 1647374, 1600745, 1571777, 1560746, 1566777, 1585457, 1606905, 1617666, 1606030, 1566252, 1499162, 1410663, 1309605, 1204917, 1103057, 1007763, 921433, 845404, 779160, 720899, 669415, 624567, 585981, 552549, 523405, 498324, 477008, 458982, 444155, 432423, 422826, 414299, 407128, 402328, 399596, 397381, 395115, 393864, 394465, 396433, 399147, 402841]
56987D02841N046O306P632R422J1163J1858J1035Q348L130m431j2419j8634k2372
56974D18925k3965k3651k1844j9532j7259j4605j1532r093p723o108l000J040
56962B61653M888Q616J2655J6451J9399K1936K4149K4295K0404J2621K736p626
56950D22177j7005k3559k6285k6140k4583k1823j7752j3480j0243p628m411n39
56938B28729L240O895J0846J4848J8573K2588K7417L2194L5266L5288L0793K0333
56926D87010M785j1594k4343l2324l6762l8163l6354l2506k8619k5165k1287j7112
56914A87566j3934j2117j0647q874p211o019n074m213l438k460j110N4M36L37
56900A13296L44M26N17J248L005M991O400P707R690J1976J3944J6178J9539K3435
$$ y = [402841, 407887, 414193, 421825, 431247, 442410, 454268, 465303, 473651, 476781, 472350, 459931, 441297, 418925, 394960, 371309, 349465, 329933, 312674, 298069, 286537, 277444, 269721, 263613, 260613, 261653, 266541, 275157, 287812, 304263, 323662, 345598, 369747, 394042, 414446, 427067, 429803, 422177, 405172, 381613, 355328, 329188, 304605, 282782, 265030, 251550, 241307, 233679, 229268, 228729, 231969, 238864, 249710, 264558, 283131, 305719, 333136, 365330, 400596, 435884, 466677, 487010, 491795, 480201, 455858, 423534, 386772, 348609, 312255, 279749, 251130, 225965, 204678, 187566, 173632, 161515, 150868, 141994, 134783, 128764, 123690, 119477, 116039, 113579, 112469, 112523, 112959, 113296, 113640, 114066, 114583, 115831, 118836, 123827, 130227, 137934, 147624, 159600, 173544, 189722, 209261, 232696]
56886B32696K6458K8086K8301K6144K0462J1750K035o878j3876j8028j9046j7934
56874C00170j5892j2979q870m207O9M146Q810J4072J9515K5301L1681L8177M4504
56861D44497N1488N9582O7035P0549O7146N4843L3381O186j9810l8640m9230n3719
56849F93308n3417m8581m0793l2584k4767j6380p084K398J1973K2278L3257M4451
56837E84059N6396O9923Q4378R8223J10409J18624J16831R8137O1683J5043l0731
56826A382975o7294r0960j01844j02729r7374q8347p6678o3392n0085l7709k6055
56815E80508j4744l822O788J7468K8406L9645N1472O3799P5180Q2923Q3617P3400
56803A084640M9685J4778k3054n4322p4403q4165q6047q1861p3756o4352n5094
$$ y = [232696, 259154, 287240, 315541, 341685, 362147, 373897, 375932, 369054, 355178, 337150, 318104, 300170, 284278, 271299, 262429, 258222, 258291, 262437, 271247, 285319, 304834, 330135, 361816, 399993, 444497, 495985, 555567, 622602, 693151, 760297, 815140, 848521, 854707, 834897, 796257, 747027, 693308, 639891, 591310, 550517, 517933, 493166, 476786, 469702, 472100, 484073, 506351, 539608, 584059, 640455, 710378, 794756, 892979, 1003388, 1122012, 1238843, 1336980, 1398663, 1413706, 1382975, 1315681, 1224721, 1122877, 1020148, 922774, 834427, 757749, 694357, 644272, 606563, 580508, 565764, 561942, 568730, 586198, 614604, 654249, 705721, 769520, 844700, 927623, 1011240, 1084640, 1134325, 1149103, 1126049, 1071727, 997324, 913159, 827112, 745251, 671495, 607143, 552049]
56792E52049m5955l6933k8433k0329j2169m323K608R226J6619K4450L1421L7294
56780E25525M2374M4917M1208K8985R741j2289l2199m5945n2004n2169m9614m6063
56768D02467m1671l6850l2469k8556k4623k1025j8421j6212j3340j0314q579q114
56756A42293p560o510n676n075m096l217l423m036l448j992j634k617k931j716
56742H8362o10r39j739j639q15q5K98J79o72j575j301J0Q04M17q4J47O01P20P76
56723H2855R51R89J130J909K727K281P53j97J26O98P96R19J283J290J018J359
56707A00887K172K141J101N41J131J694J373R49J098J169O86L66O81R55Q46J140
56691A18930K141K726K147J319J321J801J840J316O44J28J58R52J787J596N94
$$ y = [552049, 506094, 469161, 440728, 420399, 408230, 403907, 406515, 415741, 432360, 456810, 488231, 525525, 567899, 612816, 654024, 683009, 692750, 680461, 648262, 602317, 550313, 498144, 448530, 402467, 360796, 323946, 291477, 262921, 238298, 217273, 198852, 182640, 169300, 158986, 150407, 142293, 134733, 128223, 122547, 117472, 113376, 110159, 106736, 102700, 99252, 97260, 95626, 93009, 90078, 88362, 87752, 86813, 85074, 83435, 82620, 82535, 82833, 83012, 82340, 80765, 79464, 79474, 80278, 80695, 80611, 80758, 81359, 82079, 82855, 83806, 84795, 85925, 87834, 90561, 92842, 93595, 93398, 93524, 94222, 95018, 95937, 97220, 98510, 99528, 100887, 103059, 105200, 106301, 106842, 107973, 109667, 111040, 111989, 113087, 114256, 114942, 115308, 115989, 116944, 117790, 118930, 121071, 123797, 125944, 127263, 128584, 130385, 132225, 133541, 134185, 134313, 134471, 135423, 137210, 138806, 139400]
56676A39400n3k09q42j872j921o06O54Q19M54K04j78o32m21L68N80n3m06l6P7
56657A35327n25r09n90l25l67J09J034R63l51r76K77J912K038R27j20p97j229
56640A36398r25J97R89O47KN3L67J45l33m15j99P3O41J383J466O08l73r02j310
56621A38512j627j207j94K08m10j022j022j048j293q94J99O50J0l30M79J244Q38
56604A33093o2n44r69j633j649n77M33M22Kj46m36q91l69J367K598K155J182R98
56586A34974J013M38J55R97J836J403O29J081K350K900K510K024J599R60O26J233
56570A56728K303K976L260L567L801L987M687N951P058Q034R983J2996J5303J5539
56556B56173J4188J1818P880K545k206m861o038o565n939m193l166l902m746l984
$$ y = [139400, 139347, 139138, 138296, 136424, 134503, 133897, 134551, 135370, 135824, 136028, 135850, 135218, 134797, 135165, 135745, 135692, 135286, 135250, 135327, 134802, 133893, 133303, 132978, 132611, 132720, 133754, 134717, 134366, 133390, 133667, 135579, 137617, 138544, 138424, 137627, 136398, 135473, 135670, 136659, 137306, 137308, 137361, 137728, 137873, 137540, 137125, 136926, 136999, 137640, 139023, 140489, 141097, 140724, 139822, 138512, 136885, 135678, 135484, 135692, 135282, 134260, 133238, 132190, 130897, 130003, 130202, 130852, 130862, 130532, 131011, 132255, 133093, 133031, 132487, 131518, 129885, 128236, 127659, 128092, 128514, 128516, 128370, 127934, 127043, 126674, 128041, 130639, 132794, 133976, 134974, 135987, 136425, 136580, 137577, 139413, 140816, 141445, 142526, 144876, 147776, 150286, 152310, 153909, 154869, 155495, 156728, 159031, 162007, 165267, 168834, 172635, 176622, 181309, 187260, 194318, 202352, 212335, 225331, 240634, 256173, 270361, 282179, 290059, 292604, 290398, 285537, 279499, 272934, 266995, 262802, 259636, 255734, 250988, 247004]
56542B47004k631k537l427l963m143m489m399l437k760l189l362k014m82n84j483
56527B04104j241j55N9n97p04j08R6l90j074j976l004l035j595l10o37j366o67
56510A87400O88O55o13j317j199j414j866j302J29R06N72M7k68o63p79l6Q64P67
56492A82571mk75m8j25l74k02p3o47j116l75Q10Q62n5n59m37m80n33R6P78L17
56472A80131q33j119l78K24L89Q91J847K516K604K221J108o23j633r26M69R88
56456A87876Q50J128J520J023J4l82k57l45l10M83J296J082M43N98J299J603J683
56439A99604J950J587R2j012l32P81L08j007j021P5L44m18p46m43n78j012p02
56422A97470j7j04m07M63J917K128J116L82J6r76j912j135P68J483O40J48P86
$$ y = [247004, 244373, 241836, 238409, 234446, 230303, 225814, 221415, 217978, 215218, 212029, 208667, 206653, 206171, 205587, 204104, 202863, 202708, 202767, 202170, 201466, 201358, 201454, 201064, 199990, 198014, 195010, 191975, 190380, 190070, 189433, 188067, 187400, 188088, 188743, 188130, 186813, 185614, 184200, 182334, 181032, 181161, 182067, 182639, 182686, 182418, 181755, 180976, 180940, 181804, 182571, 182567, 182292, 182244, 182119, 181745, 181543, 181470, 180823, 179707, 179332, 180142, 181004, 180949, 180390, 179953, 179473, 178940, 179036, 179814, 180131, 179298, 178179, 177801, 178025, 178414, 179305, 181152, 183668, 186272, 188493, 189601, 188978, 187345, 186419, 186888, 187876, 188726, 189854, 191374, 192397, 192411, 192029, 191772, 191427, 191117, 191600, 192896, 193978, 194421, 195019, 196318, 197921, 199604, 201554, 203141, 203233, 202221, 201889, 202670, 202978, 201971, 200950, 201025, 201369, 200951, 200205, 199762, 199184, 198172, 197470, 197453, 197349, 196942, 197405, 199322, 201450, 202566, 202948, 202964, 201988, 200076, 198941, 199709, 201192, 201832, 201980, 202766]
56405B02766J282R27M59K21j75k89O88J945J928R35N74R63R38N99R92J685J319
56388B17757K83R8N82L60k62J80J294J425Q65J281K258J799J61k19J151K154J795
56371B32962J317J252O15m50m00P53J243P61R01J902K075J065O15J347J746J142
56355B48846Q06J310J584J306J569K477K664J831J190R81K42o57j71J368J780
56340B67126P00K21J360K767L525M218M684L812K227K083L495M161L312K806L587
56325C10084M170L688L272L364K724J193N07J213J592O75l38o61j066j574q73
56310C27970J050K432K726L219M037L617J955J190J971K442J852J950L608N194
56296C65213N630N996O846O950N999N715O947Q315Q839R132R276Q499P630Q693
$$ y = [202766, 204048, 204975, 205434, 205655, 205480, 205191, 205879, 207824, 209752, 210687, 211261, 212224, 213162, 213761, 214753, 216438, 217757, 218040, 218138, 218720, 219080, 218818, 218998, 220292, 221717, 222582, 223863, 226121, 227920, 228081, 227862, 229013, 231167, 232962, 234279, 235531, 236146, 235696, 235296, 236049, 237292, 238053, 238954, 240856, 242931, 243996, 244611, 245958, 247704, 248846, 249652, 250962, 252546, 253852, 255421, 257898, 260562, 262393, 263583, 264564, 264806, 264149, 263978, 265346, 267126, 267826, 268047, 269407, 272174, 275699, 279917, 284601, 288413, 290640, 292723, 296218, 300379, 303691, 306497, 310084, 314254, 317942, 321214, 324578, 327302, 328495, 329002, 330215, 331807, 332482, 332144, 331483, 330417, 328843, 327970, 329020, 331452, 334178, 337397, 341434, 345051, 347006, 348196, 350167, 352609, 354461, 356411, 360019, 365213, 370843, 376839, 383685, 390635, 396634, 402349, 409296, 417611, 426450, 435582, 444858, 453357, 460987, 469680]
56282D69680J1233J2439J1707J1478J2698J3365J2766J3073J5119J6558J6076
56271F16192J5723J7058J8624J9355K0894K4261K7584K9384L1090L4058L7284
56260H91507M0142M4376N1145N8937O6486P4922Q5085R5651J05851J17192J30562
56249A761856J44527J58199J72710J88029K01469K11273K18633K24231K25945
56240C506872K21921K12807J99100J79385J53187J22455Q8561N1020J0924k7945
56230D718287o3225r5708j25320j49332j66609j79653j90139j96303j97132j95081
56220C159785j91971j86187j76740j66256j56938j47318j36001j24945j15913
56211A757516j07259r7530q8698q2561p7228p0496o3583n8276n3541m8060m3106
$$ y = [469680, 480913, 493352, 505059, 516537, 529235, 542600, 555366, 568439, 583558, 600116, 616192, 631915, 648973, 667597, 686952, 707846, 732107, 759691, 789075, 820165, 854223, 891507, 931649, 976025, 1027170, 1086107, 1152593, 1227515, 1312600, 1408251, 1514102, 1631294, 1761856, 1906383, 2064582, 2237292, 2425321, 2626790, 2838063, 3056696, 3280927, 3506872, 3728793, 3941600, 4140700, 4320085, 4473272, 4595727, 4684288, 4735308, 4746232, 4718287, 4655062, 4559354, 4434034, 4284702, 4118093, 3938440, 3748301, 3551998, 3354866, 3159785, 2967814, 2781627, 2604887, 2438631, 2281693, 2134375, 1998374, 1873429, 1757516, 1650257, 1552727, 1464029, 1381468, 1304240, 1233744, 1170161, 1111885, 1058344, 1010284, 967178]
56200I67178l9791l6515l2074k8247k6441k4909k2080j9372j7968j6253j3237
56189F90291j0948j0601r990p596n501n347n307m051l589n116o191n269m593n302
56175F00890m408m47K728K035L31J041K353J602Q65K875N525N790N372P012Q930
56160F42494Q330P029Q050R911R712Q774R795J1432J1132J0423J2083J4883J6344
56147G80392J7920K2242K8123L3316L9271M7991N7215O3938O9667P6831Q3104
56136A320010Q4686Q2150P7723P0238N8579M6869M0092L7277L4601L2033L0944
56125A915202K8485K1016J0633K101m213j0457j5433j7156j8581k4330l3878m3925
56113A809464n4606o7031p7549q1329p9512p6426p2199o4459n4752m6609l9607
$$ y = [967178, 927387, 890872, 858798, 830551, 804110, 779201, 757121, 737749, 719781, 703528, 690291, 679343, 668742, 658752, 651156, 645655, 640308, 635001, 630950, 627361, 622245, 616054, 610785, 606192, 600890, 596482, 596035, 598763, 600798, 601129, 602170, 604523, 606125, 606990, 609865, 615390, 621180, 626552, 633564, 642494, 650824, 657853, 665903, 675814, 685526, 694300, 704095, 715527, 726659, 737082, 749165, 764048, 780392, 798312, 820554, 848677, 881993, 921264, 969255, 1026470, 1090408, 1160075, 1236906, 1320010, 1404696, 1486846, 1564569, 1634807, 1693386, 1740255, 1780347, 1817624, 1852225, 1884258, 1915202, 1943687, 1964703, 1975336, 1977437, 1973224, 1962767, 1947334, 1930178, 1911597, 1887267, 1853389, 1809464, 1754858, 1687827, 1610278, 1528949, 1449437, 1373011, 1300812, 1236353, 1181601, 1134992, 1095385]
56102A095385l1694k4796k1603j9598j4999r825q180q451o299k604j133j040R38
56089I46101L424L019J406K446M848N091M711P056R852Q999O780Q042J1175J1321
56075A034271R615J0450J2472J1360Q939J0209J3755J4416J3143J4669J7766J7538
56063A188603J5304J6242J9311J9422J7737J9515K3502K3839K1017K0654K2682
56052A407828K2168J9519J9561K1708K1308J9389K0748K3988K3880K1756K2830
56041A644683K5324K3477J9177J8893K1183J9477J5308J6117K1608K5174K7290
56030A877711L4071M3787M8456M7931M8990N1552M9668M5136M5633N0177N0878
56019B393990M8375N0624N7148N9872N8944O2029O8431P0078O7866P0602P8040
$$ y = [1095385, 1063691, 1038895, 1017292, 997694, 982695, 972870, 964690, 956239, 949940, 947336, 946203, 945163, 946101, 949525, 952544, 953950, 956396, 961244, 966335, 971046, 978102, 987954, 996953, 1003733, 1011775, 1022950, 1034271, 1043886, 1054336, 1066808, 1078168, 1087107, 1097316, 1111071, 1125487, 1138630, 1153299, 1171065, 1188603, 1203907, 1220149, 1239460, 1258882, 1276619, 1296134, 1319636, 1343475, 1364492, 1385146, 1407828, 1429996, 1449515, 1469076, 1490784, 1512092, 1531481, 1552229, 1576217, 1600097, 1621853, 1644683, 1670007, 1693484, 1712661, 1731554, 1752737, 1772214, 1787522, 1803639, 1825247, 1850421, 1877711, 1911782, 1955569, 2004025, 2051956, 2100946, 2152498, 2202166, 2247302, 2292935, 2343112, 2393990, 2442365, 2492989, 2550137, 2610009, 2668953, 2730982, 2799413, 2869491, 2937357, 3007959, 3085999]
56008C085999Q1635Q1720Q6591R5195R8735R8858J05430J16844J22194J22625
55998D095826J29835J43385J51144J52735J60146J74181J83436J87925J99940
55989E578553K19645K34394K44206K62523K89637L11714L28452L54183L89237
55980H212544M19216M45172M83935N35653N83247O27157O86419P61887Q35188
55971A3590418R08200J004525J127255J257250J398639J580930J810439K068957
55963B4746613K367823K750647L236180L818813M535182N464965O654891Q111865
55955F1686979R876022J2014039J4536793J7433368K0791164K4733645K9208378
55948A90280388L3984065L8781483M2935102M4647099M1103676L0293232J3179296
$$ y = [3085999, 3167634, 3249354, 3335945, 3431140, 3529875, 3628733, 3734163, 3851007, 3973201, 4095826, 4225661, 4369046, 4520190, 4672925, 4833071, 5007252, 5190688, 5378613, 5578553, 5798198, 6032592, 6276798, 6539321, 6828958, 7140672, 7469124, 7823307, 8212544, 8631760, 9076932, 9560867, 10096520, 10679767, 11306924, 11993343, 12755230, 13590418, 14498618, 15503143, 16630398, 17887648, 19286287, 20867217, 22677656, 24746613, 27114436, 29865083, 33101263, 36920076, 41455258, 46920223, 53575114, 61686979, 71563001, 83577040, 98113833, 115547201, 136338365, 161072010, 190280388, 224264453, 263045936, 305981038, 350628137, 391731813, 422025045, 435204341]
55941D35204341o167766k2937977l4241272l9822398m0946710l9122502l5607701
55934B16358015l1371306k7052730k2974055j9293484j6115193j3458583j1247852
55927G4844812r402914p891306o674591n677519m842412m157891l609253l151613
55919B9437313k753738k420675k151943j919416j704669j518275j364824j225345
55911A4378428j090015r73419q82076p99049p14888o42948n90259n42358m90486
55902G652930m46226m15987l86990l51553l20679l01108k82037k56679k34898
55893D656773k22667k10010j90691j73914j65408j56072j40126j26170j19652
55884C152063j12054r7867q5612q1832q0084p5470p4465q0616q5346q2570p8592
$$ y = [435204341, 429036575, 406098598, 371857326, 332034928, 291088218, 251965716, 216358015, 184986709, 157933979, 134959924, 115666440, 99551247, 86092664, 74844812, 65441898, 57550592, 50876001, 45198482, 40356070, 36198179, 32588926, 29437313, 26683575, 24262900, 22110957, 20191541, 18486872, 16968597, 15603773, 14378428, 13288413, 12314994, 11432918, 10633869, 9918981, 9276033, 8685774, 8143416, 7652930, 7206704, 6790717, 6403727, 6052174, 5731495, 5430387, 5148350, 4891671, 4656773, 4434106, 4224096, 4033405, 3859491, 3694083, 3538011, 3397885, 3271715, 3152063, 3040009, 2942142, 2856530, 2774698, 2694614, 2619144, 2544679, 2464063, 2378717, 2296147, 2217555]
55873B217555p8712p7625p1650o7045o7571o6694o0339n4848n4374n2912m6735
55862A519050m2337m3923m4876l9841l3944l2132l0523k6152k4366k8506l2588
55851A139862l1998l1481l5003l7553l4759l1042l0705l0011k5504k1347k1069
55840H09390k0658j6844j3808j4751j5252j1879r070j0560j2125r807p377q583
55828F58676r718p053m267n386p341o505n829q566j1483j1032j0007j1600j3030
55815E46859j1464j0018j1488j2261q924n045m871n957m388j936j635j491J198
55802D68579M150M630M852P263R247Q063O152O162N613K002j820k786l220n827
55788E13060q046o997n228n832o527m455k398m320q659j1658j3443j5410j5623
$$ y = [2217555, 2138843, 2061218, 1989568, 1922523, 1854952, 1788258, 1727919, 1673071, 1618697, 1565785, 1519050, 1476713, 1432790, 1387914, 1348073, 1314129, 1281997, 1251474, 1225322, 1200956, 1172450, 1139862, 1107864, 1076383, 1041380, 1003827, 969068, 938026, 907321, 877310, 851806, 830459, 809390, 788732, 771888, 758080, 743329, 728077, 716198, 707128, 696568, 684443, 674636, 667259, 658676, 648958, 641905, 637638, 632252, 624911, 618406, 612577, 604011, 592528, 581496, 571489, 559889, 546859, 535395, 525377, 513889, 501628, 492704, 487659, 482788, 476831, 472443, 470507, 468872, 467381, 468579, 472729, 477359, 482211, 489474, 498721, 506784, 512936, 519098, 524711, 526713, 524893, 522107, 518887, 513060, 505014, 498017, 492789, 486957, 480430, 475975, 473577, 469257, 460598, 448940, 435497, 420087, 404464]
55775D04464j2294q172o270m819j320K405M058N409P904Q017K677m551q315q941
55761C80252r695j0239q523n900m846m347k636j509k945m688m132l435n573q588
55747C03196q939p519p114o903m866k766l255m574l488j115o35j546j384r12k315
55732B45865m325m182k649k235k447j567j011k916n385n129l184l032m585m944
55718A98274l773l095k906j565M20J227J333K387L699L587K870L263L880L000
55704B12601J685J818K289R19j490k881l868n987p891p395n561m767m444k854
55690A72174j257j909l504l079j037K6J73J380L201L569K864L037L696L128K123
55675A84585K603L522K393p6j112o97j091k295k275j106p16j004k38J085P88q42
$$ y = [404464, 392170, 383998, 377728, 372909, 371589, 373994, 378052, 383461, 391365, 399382, 402059, 397508, 389193, 380252, 370557, 360318, 351795, 345895, 341049, 336702, 334066, 332557, 329612, 324924, 320792, 317357, 311784, 303196, 294257, 286738, 279624, 272721, 267855, 265089, 261834, 257260, 253772, 252657, 252022, 250476, 249092, 248180, 245865, 241540, 237358, 234709, 232474, 230027, 228460, 227449, 224533, 219148, 214019, 210835, 207803, 203218, 198274, 194501, 191406, 188500, 186935, 187355, 188582, 189915, 192302, 196001, 199588, 202458, 205721, 209601, 212601, 214286, 216104, 218393, 219312, 217822, 214941, 211073, 205086, 197195, 189800, 184239, 179472, 175028, 172174, 170917, 169008, 165504, 162425, 161388, 161414, 161587, 162967, 166168, 169737, 172601, 175638, 179334, 182462, 184585, 187188, 190710, 193103, 193027, 191915, 191218, 190127, 187832, 185557, 184451, 183735, 182731, 182493, 183578, 184366, 183524]
55659A83524j275J12J576K442L422M011L031J476J453K609K825J895J320J108
55645B09529N7j439k126k668m445o413o562n581n590o151n296l663l676n072n230
55630A45674l651k391k279k237k160k846l374k067Q7N51n21o15O87J242K65q02
55614A25563j363k282l299l133k197k130k712k308j191j144j981j775m80j2o83
55599I8873q37j12O4o55j147j228j579j603k93J148P36p76j048k42m15j431j295
55582H8160j87j60j003m83J233J561K70M9J705K872K383K013K877L686L743M078
55566A12797M619L642J178l33O0L86o86j974k514l082l910l838k806k345k689
55551I8505k278r23l87r87q08O88J552R33N59J304J491J38j045o42K79M98O28
$$ y = [183524, 182249, 182361, 183937, 186379, 189801, 193812, 196843, 198319, 199772, 202381, 205206, 207101, 208421, 209529, 209586, 208147, 206021, 203353, 198908, 192495, 185933, 180352, 174762, 168611, 163315, 159652, 155976, 150904, 145674, 142023, 139632, 137353, 135116, 132956, 130110, 126736, 124669, 124756, 125307, 124786, 124171, 124858, 126100, 126365, 125563, 124200, 121918, 118619, 115486, 113289, 111159, 108447, 106139, 104948, 103804, 101823, 100048, 99568, 99556, 98873, 98036, 97924, 97988, 97333, 96186, 94958, 93379, 91776, 91483, 92631, 93367, 92591, 91543, 91301, 90886, 89455, 88160, 87973, 87813, 86810, 86327, 87560, 89121, 89391, 89440, 91145, 94017, 96400, 98413, 101290, 104976, 108719, 112797, 117416, 121058, 122236, 121903, 121963, 122349, 121663, 119689, 117175, 114093, 110183, 106345, 103539, 101194, 98505, 96227, 95304, 94917, 93930, 93122, 93810, 95362, 96295, 96854, 98158, 99649, 99787, 98742, 98100, 98379, 98877, 99505]
55534I9505J235J409P19K73N75N54k00n78l29p56k045k526j723j374k256k703
55518H9780j679o49r05j582j784k122k694k139l58M40q92k387k120r91n96n66
55502F8756J9O32N93N52R23P33l77q67L02J766J898J100M42j72r34r93k0P84O48
55483G5785N25J043J077n0r52m75K18l15j292j178k25L34L06J34l21j082j304
55466G2228o79k66o73p90K09J139O36o25j169r80r10r65o98l85l85k36L85P52
55448F6588K75l41k25L63P70R60R25K74p43j043l90O6k75m92N9N56L49J22L40
55429F8138K25n23o34O65J987J707L10o57p70n78l37j52l57p72n92J70L83k47
55411F7966m91K90R19M29l37l52m3j10j72J22J35l93n12J90N39j91q01j70Q14
$$ y = [99505, 100740, 102149, 102868, 103141, 103716, 104270, 104070, 103492, 103163, 102407, 100362, 97836, 96113, 94739, 92483, 89780, 88101, 87452, 86547, 84965, 83181, 81059, 78365, 76226, 75868, 76308, 75416, 73029, 70909, 69918, 69322, 68756, 68775, 69407, 70000, 70552, 71475, 72208, 71831, 70964, 71266, 73032, 74930, 76030, 76472, 76300, 75366, 74373, 74353, 75137, 75785, 76310, 77353, 78430, 78380, 77428, 76953, 77171, 76856, 75564, 74386, 74161, 74495, 74801, 74935, 74614, 73532, 72228, 71549, 71283, 70610, 69820, 70029, 71168, 71804, 71179, 70010, 69030, 68120, 67155, 66457, 66072, 65687, 65451, 65836, 66588, 66863, 66522, 66297, 66660, 67430, 68390, 69315, 69589, 68846, 67803, 67413, 67479, 67204, 66712, 66771, 67327, 67676, 67798, 68138, 68363, 67840, 67206, 67871, 69858, 71565, 71875, 71218, 70448, 69870, 69533, 69381, 69024, 68252, 67660, 67830, 68213, 67966, 67475, 67765, 68684, 69113, 68776, 68424, 68381, 68271, 68099, 68221, 68356, 67963, 67451, 67641, 68180, 67989, 67188, 67018, 67832]
55392F7832Q67L68K86L81N6k62q7p5p67j345r81k16K83R46K026K483J627M68M2
55373G3932k23r91j454q83k27m81q54l44K25l77j553j955j627j337r09n1L28m95
55355F0724j352p92N97J288J198J197J167N38j73j92m9n15q64m1J321J903J807
55338F7762J797J448J36j065p42K61k8j477k078j181j85NOK81K80k24n87m37j33
55319F3839J50O54J267J501J286R38N23L5k18j33j93n69n64J39O28J75m73m35
55301F8550k87r27j802j825j184o61K0J446K811K731J335p1r11j452j505p05L41
55284F5904O93N48P07J018P74J77j7J30R0O0M49P54L09l89m70j50j21j77J42L74
55264G0805Q4%O57R04l01j663j258L20Q06k14j031p85l25j68K39J009J466J478
$$ y = [67832, 68699, 69067, 69353, 69734, 69790, 69528, 69441, 69366, 68599, 67254, 66273, 66057, 66340, 67286, 69312, 71795, 73422, 73890, 73932, 73709, 72718, 71264, 70381, 70154, 69673, 68819, 68475, 68700, 68323, 66770, 64815, 63188, 61851, 60942, 60891, 61219, 60724, 59372, 58580, 59177, 60465, 61663, 62860, 64027, 64565, 64392, 64200, 64151, 63636, 62772, 62731, 64052, 65955, 67762, 69559, 71007, 71143, 70078, 69336, 69597, 69569, 68092, 66014, 64833, 64648, 64653, 64659, 64940, 65220, 64996, 64409, 63972, 63839, 63989, 64643, 65910, 67411, 68697, 69635, 70158, 70193, 69975, 69842, 69649, 69080, 68516, 68655, 69283, 69458, 68985, 68550, 68263, 67336, 65534, 63709, 62525, 61864, 61884, 63330, 66141, 68872, 70207, 70136, 69225, 67773, 66268, 65563, 65904, 66597, 67145, 67852, 68870, 69644, 69821, 69804, 69934, 70024, 70084, 70533, 71287, 71596, 71207, 70737, 70587, 70466, 70289, 70431, 70805, 70889, 70889, 71546, 72450, 72149, 70486, 69228, 69548, 70354, 70140, 69109, 68324, 67999, 67831, 68070, 69079, 70545, 72023]
55246G2023J480J193R4j007p20N87J111L06n80p33o80p49m64J62M08J83J38J67
55228G2919n59j912k621k062q70L38J458K038J525M98J83N79N41j84n44k0O61
55211G1968R38J083J215J006N75M07K95m03j352j492p23QK83N04O64L30j29P0
55193G5247N93L44n43q49m35m37j085j128MJ206J471J198J115J193J186J084O39
55176H0803m10j458j540q74n50o85l48N80J085Q26O70J046J323J160J008R19L40
55159H3895n51q10l52j11k59K7O98N65n33j110l28P30Q81M22M6l00o49m98M9n0
55139H1762j077j855j524p94n26m06P7N51O20P05J093J157M75k65l49j05r4j28
55121G9317Q6J99j43o58j014j225j056m2J425K079J439M18k27p96j431j321o6
$$ y = [72023, 73503, 74696, 74790, 73783, 73063, 73650, 74761, 75067, 74487, 73754, 73074, 72325, 71861, 72023, 72431, 72614, 72752, 72919, 72360, 70448, 67827, 65765, 64895, 65233, 66691, 68729, 70254, 70752, 70935, 71514, 72055, 71871, 71327, 71307, 71968, 72906, 73989, 75204, 76210, 76785, 77192, 77487, 77084, 75732, 74240, 73517, 73525, 73808, 74312, 74976, 75306, 75177, 75247, 75840, 76184, 75641, 74792, 74357, 73920, 72835, 71707, 71711, 72917, 74388, 75586, 76701, 77894, 79080, 80164, 80803, 80393, 78935, 77395, 76521, 75971, 75286, 74938, 75518, 76603, 77429, 78099, 79145, 80468, 81628, 82636, 83555, 83895, 83344, 82534, 82182, 82071, 81812, 81839, 82537, 83102, 82569, 81459, 81131, 81861, 82742, 83164, 83210, 82910, 82261, 81763, 81812, 81762, 80685, 78830, 77306, 76512, 75986, 75580, 75657, 76208, 76828, 77533, 78626, 79783, 80258, 79993, 79644, 79539, 79445, 79317, 79403, 79602, 79459, 78801, 77787, 76562, 75506, 75464, 76889, 78968, 80407, 80825, 80598, 79802, 78371, 77050, 76984]
55104G6984J305J676J283R79Q72N95J81j59m22m56J22J090J589J362J131J263
55088H9395J168N44J19M01P40M46j20l46l47l29N3R75J852K207K387K719K773
55071A04637K125J054r4j369k490k628j591l52K52M07L83j65j178j630r24K8J31
55054I6596l56n23k57PK73O87Q71M42k52o66q45j016r74n28n4Lk78o09q43p46
55034I0932j62L23k06j514k182j460j61P16J137J285Q99J17k38L8M0o31r60j96
55016H7777P89Q81L86J55N1m24q73o49j47j58n32n50j92P8K73O58R74Q39M89L38
54996I0163K87J32J45M99P38N76M85P78Q96L82k26l22k21l41k99K23N37P6m13
54977I4095K1Q69R41J97l94m13j77J85P41J095Q09K74K41P49J312J740K000J730
$$ y = [76984, 78289, 79965, 81248, 82227, 83099, 83694, 83875, 83716, 83294, 82838, 82960, 84050, 85639, 87001, 88132, 89395, 90563, 91107, 91226, 91627, 92367, 92813, 92693, 92347, 92000, 91671, 91724, 92699, 94551, 96758, 99145, 101864, 104637, 106762, 107816, 107722, 106353, 103863, 101235, 99644, 99292, 99544, 99951, 100334, 100169, 98991, 97361, 96437, 96465, 96596, 96240, 95717, 95460, 95467, 95740, 96427, 97298, 97740, 97488, 96822, 95977, 94961, 93987, 93459, 93405, 93408, 93130, 92521, 91678, 90932, 90770, 91093, 90887, 89373, 87191, 85731, 85570, 86286, 87423, 88708, 89607, 89724, 89486, 89524, 89564, 88933, 87973, 87777, 88566, 89447, 89833, 89988, 90039, 89615, 88742, 88093, 87946, 87788, 87256, 86706, 86514, 86592, 86865, 87523, 88497, 89336, 89825, 90163, 90450, 90582, 90727, 91226, 91964, 92540, 93025, 93803, 94699, 95081, 94855, 94533, 94312, 93971, 93672, 93895, 94432, 94508, 94095, 94116, 94985, 95926, 96123, 95729, 95316, 95139, 95324, 96065, 97160, 97969, 98243, 98484, 99233, 100545, 102285, 104285, 106015]
54959A06015P71k21n50m13l44k86n7l7n16r21o83k58l05n15k97j5l22q26o38J55
54939I9737P21Q27Q07N70j95j051j168m47N56J543K338K367J358K65L30J510K785
54922A12853L651M266M621M714N160O351P338O879N344M235L922L267J531p07
54908A73425k722m497o022o857o772o095n183m200l461l266l300k938k160j513
54894A14439j184q47l64J5J83K74L26L50N74J003J103N85J73P77K206L510M293
54877A27416M889N501O014O510P080P351O861N693M095J913q25l317m864n889
54863A68428p075p994p699o287m684l334k203j722k327l260l259k346j678j666
54849A12894j591j113q29j105j561j886k114k002j208k23N2k79j91O15J325J435
$$ y = [106015, 106786, 106565, 106015, 105602, 105258, 104972, 104915, 104878, 104362, 103441, 102758, 102500, 102195, 101680, 101383, 101368, 101046, 100220, 99582, 99737, 100458, 101285, 102092, 102662, 102467, 101416, 100248, 99801, 100357, 101900, 104238, 106605, 107963, 108228, 108558, 110068, 112853, 116504, 120770, 125391, 130105, 135265, 141616, 148954, 155833, 161177, 165412, 169334, 172601, 174132, 173425, 170703, 166206, 160184, 153327, 146555, 140460, 135277, 131077, 127616, 124350, 121050, 118112, 115952, 114439, 113255, 112408, 112044, 112059, 112242, 112516, 112842, 113192, 113766, 114769, 115872, 116457, 116630, 117407, 119613, 123123, 127416, 132305, 137806, 143820, 150330, 157410, 164761, 171622, 177315, 181410, 183323, 182498, 179181, 174317, 168428, 161353, 153359, 145660, 139373, 134689, 131355, 129152, 127430, 125103, 121843, 118584, 116238, 114560, 112894, 111303, 110190, 109361, 108256, 106695, 104809, 102695, 100693, 99485, 99262, 99314, 99035, 98844, 99459, 100784, 102219]
54833A02219J279R66R1j121j606j006l01l55p65p68l75JK60M13K44k64p63j055
54815I7094j224j065j39J256K011J549N91J47L17N84P23Q96J183J409J248M18
54799A06998r22j959j865q01J73L32j7j42J50L86L5p55j027K6J811K642J688M1
54781A06794p46m55J99R20J679J896J127K44N05J707K577K827L318M240M699M461
54765A35992M559N588O712O986O623O203N592M324K476N38j133k465l639n013
54751A73343o563p553p384o565n943n355m130k682k132k356j971n39O99P76K33
54736A21878j40m20p20n36K36P61N85M49R69J541J488J350J935K967L677M120
54720A40140M842N733O153N920N336M556L572K491J259m89k757m778n849o114
$$ y = [102219, 103498, 104464, 104555, 103434, 101828, 100822, 100521, 100166, 99401, 98633, 98258, 98259, 98519, 98932, 99176, 98912, 98149, 97094, 95870, 94805, 94666, 95922, 97933, 99482, 100073, 100220, 100537, 101121, 101844, 102740, 103923, 105332, 106580, 106998, 106076, 104117, 102252, 101451, 101624, 101956, 101939, 101797, 101947, 102333, 102368, 101613, 100586, 100612, 102423, 105065, 106753, 106794, 106048, 105593, 105792, 106712, 108391, 110287, 111414, 111658, 112163, 113870, 116447, 119274, 122592, 126832, 131531, 135992, 140551, 146139, 152851, 159837, 166460, 172663, 178255, 182579, 185055, 185593, 184460, 181995, 178356, 173343, 166780, 159227, 151843, 145278, 139335, 133980, 129850, 127168, 125036, 122680, 120709, 120170, 120869, 121645, 121878, 121738, 121318, 120598, 120062, 120298, 121059, 121644, 122093, 123062, 124603, 126091, 127441, 129376, 132343, 136020, 140140, 144982, 150715, 156868, 162788, 168124, 172680, 176252, 178743, 180002, 179513, 176756, 171978, 166129, 160015]
54706A60015o055n735n114m594m529m569m163l400k795k475k106j472o93o0J39
54691A12394q6j81M19J355J544O24m77q04n22l71n32o76o61n67m07k60l53o02
54673A09837n11O6N02K41l77o00l04k1j57o04r40p28J06R71J069L53l10k57J59
54654A08495J53m11r88j059n96L0L73L39L28P08J208J243Q17N09N89P40P12O04
54636A13794L86j93j040j661j824j687j204j82R94J508J228Q68Q39O89L9p38j153
54619A10663j175r29m55l4K5M7N85J248J017j0n01N9N24K9n57j18Q97J333J125
54600A13773R92R61N06k51n85k83J97M76M91J19o26j256j239o05K82J140J609
54583A15701J221K04l53J90J014R19l2p55p18l94l07m10m32k91q1j3k43o25p99
$$ y = [160015, 153960, 148225, 143111, 138517, 133988, 129419, 125256, 121856, 119061, 116586, 114480, 113008, 112315, 112255, 112394, 112308, 112127, 112546, 113901, 115445, 116069, 115592, 114788, 114266, 113895, 113363, 112687, 112026, 111459, 111052, 110792, 110439, 109837, 109326, 109392, 109894, 110135, 109758, 109158, 108854, 108833, 108676, 108072, 107132, 106404, 106510, 107481, 108550, 108903, 108593, 108336, 108495, 108648, 108237, 107249, 106190, 105594, 105624, 105997, 106336, 106664, 107372, 108580, 109823, 110640, 111149, 111738, 112478, 113190, 113794, 114180, 113987, 112947, 111286, 109462, 107775, 106571, 106389, 107383, 108891, 110119, 110987, 111826, 112515, 112554, 111816, 110663, 109488, 108559, 108104, 108070, 108095, 108142, 108727, 109975, 110992, 110982, 110481, 110540, 111064, 111093, 110536, 110418, 111315, 112648, 113773, 114765, 115726, 116232, 115981, 115396, 115113, 115310, 115786, 116277, 116396, 115770, 114514, 113275, 112670, 112952, 114092, 115701, 116922, 117126, 116773, 116963, 117977, 118896, 118864, 118109, 117391, 116997, 116690, 116280, 115848, 115557, 115476, 115463, 115220, 114595, 113796]
54564A13796p27p00p25l94L41Q92Q74O20N67O75Q01R74R39K54p94j150m03N47
54546A16387P97N62M44M39L82N07P86O15j07m42J38P60N61J40M26R33O02l31p22
54527A22877l45k0j16k49k54l51m51l37k39l32q1Q85J704J347K95j65L2j16p46
54508A23338r54n18k58m70m78r5j19q86j562j469r63m99O7P41R56N81M25J039
54490A18876J787J822J307Q90O46L06N5L16R05J118O08k40q28r04o76m73l15K05
54472A25405J349K599K969K083O73j50P9Q96J481J385Q80N45N39M54K4m11m39
54455A40361k51l00n71p10o29n06l35p3pm14r52r93n14j03j26m39q32j253j533
54436A29820j455j089o94k84K48O73N82Kn99q35o20L3R17J496J360P80L67L07
$$ y = [113796, 113069, 112369, 111644, 111250, 111591, 112483, 113357, 113977, 114544, 115219, 116020, 116994, 117933, 118187, 117393, 116243, 115840, 116387, 117184, 117746, 118190, 118629, 119011, 119518, 120304, 120919, 120812, 120370, 120508, 121268, 121829, 121969, 122395, 123328, 123930, 123599, 122877, 122532, 122512, 122396, 122147, 121893, 121542, 121091, 120754, 120515, 120183, 120102, 120987, 122691, 124038, 124333, 124168, 124200, 124084, 123338, 122384, 121866, 121608, 121138, 120660, 120565, 120446, 119560, 117998, 116529, 115566, 115067, 115134, 115875, 116831, 117412, 117837, 118876, 120663, 122485, 123792, 124682, 125328, 125634, 125689, 126005, 126910, 128028, 128636, 128396, 127568, 126664, 125988, 125515, 125200, 125405, 126754, 129353, 132322, 134405, 135078, 134928, 135007, 135903, 137384, 138769, 139649, 140194, 140733, 141187, 141211, 140800, 140361, 140110, 139810, 139239, 138529, 137900, 137394, 137059, 136986, 136979, 136565, 135613, 134620, 134106, 134003, 133877, 133438, 132606, 131353, 129820, 128365, 127276, 126582, 126298, 126546, 127219, 127801, 127803, 127204, 126369, 125749, 125782, 126699, 128195, 129555, 130335, 130702, 131009]
54418A31009L82N26Q27J051Q01J07n84r71j091j013p93n98m90k28K84O63N50J93
54400A30625J12M16R33J553K018J810R36L12O29J315J469J260J371J548R77j03
54384A47181n53q1M25M34M41P87J019Q53P37J008J329J449J704K336L050L631
54368A65750M257M792M536L159J298k45j336k141k593k615k420k128j582q88o06
54353A67238j003j588j813j757j763j799j686j555j648j882j989j909j744j516
54339A43586j178p23j94K93M99L23O9J19L45L10j5j53J46N57O66M11Jl09l03J4
54319A44464L64N99R77J590J863J225P9o20o15m41l82k56j95o64j432j525o10
54302A44421L73M19l58j143j425j133l99L12L44l85j037q14Q0P32N76j26o97o81
$$ y = [131009, 131391, 131917, 132744, 133795, 134596, 134703, 134119, 133148, 132057, 131044, 130251, 129653, 129163, 128935, 129219, 129882, 130432, 130625, 130737, 131153, 132086, 133639, 135657, 137467, 138403, 138715, 139344, 140659, 142128, 143388, 144759, 146307, 147284, 147181, 146628, 146547, 146972, 147406, 147847, 148634, 149653, 150506, 151243, 152251, 153580, 155029, 156733, 159069, 162119, 165750, 170007, 174799, 179335, 182494, 183792, 183547, 182211, 180070, 177477, 174862, 172442, 170314, 168732, 167844, 167238, 166235, 164647, 162834, 161077, 159314, 157515, 155829, 154274, 152626, 150744, 148755, 146846, 145102, 143586, 142408, 141685, 141491, 141784, 142283, 142606, 142675, 142794, 143139, 143449, 143434, 143281, 143427, 143984, 144650, 145061, 145062, 144753, 144450, 144464, 144828, 145427, 146404, 147994, 149857, 151082, 151161, 150541, 149926, 149485, 149103, 148847, 148652, 147988, 146556, 145031, 144421, 144794, 145213, 144855, 143712, 142287, 141154, 140755, 141067, 141411, 141026, 139989, 139175, 139255, 139987, 140563, 140437, 139740, 139059]
54284A39059j79L38O32R14J336J545J184N62K41J73j18n86o66j66N78J290J828
54267A47965J716N91q66j380o69K73O40O80Q36J037J149J353J592J385O70Q3L3
54250A57088J53Q1P7M23Q30R37Q14O29K98j91o62j166j842k223j565j49O98L95
54232A54625q3K34Q94R57M65J3m41j250k016j886q40J80M02p1o21o86j37N28N09
54213A50776m25j577k081j703p14M94J334J195J78o92o09P8M34J35m19q31j003
54196A44570r22o00q5N88J324J717J340M64q8KJ46k05p90j067q82k40Q93K107
54178A48272K557J982J171Q21N73j45r31r28j53N21N27Q0l65n69m75k22r8k16
54160A52402l97n42p40q36m45K85N56k0p97r96p19n05m46l38k27k03q6J68K22
$$ y = [139059, 138880, 139218, 139850, 140764, 142100, 143645, 144829, 145391, 145632, 145805, 145687, 145101, 144435, 144269, 144847, 146137, 147965, 149681, 150272, 149406, 148026, 147357, 147630, 148270, 148950, 149786, 150823, 151972, 153325, 154917, 156302, 156972, 157055, 157088, 157241, 157322, 157399, 157822, 158652, 159589, 160403, 161032, 161330, 161139, 160477, 159311, 157469, 155246, 153681, 153532, 154230, 154625, 154542, 154776, 155670, 156627, 157092, 157105, 156664, 155414, 153398, 151512, 150672, 150852, 151254, 151183, 150562, 149876, 149739, 150267, 150776, 150351, 148774, 146693, 144990, 144276, 144770, 146104, 147299, 147477, 146785, 146176, 146254, 146688, 146823, 146404, 145573, 144570, 143648, 143048, 142963, 143551, 144875, 146592, 147932, 148396, 148308, 148310, 148456, 148251, 147461, 146394, 145512, 145272, 146165, 148272, 150829, 152811, 153982, 154803, 155376, 155231, 154300, 153372, 153219, 153740, 154267, 154347, 153982, 153413, 152938, 152716, 152618, 152402, 152005, 151463, 150723, 149887, 149442, 149727, 150283, 150263, 149466, 148470, 147751, 147246, 146800, 146462, 146235, 146032, 145946, 146114, 146336]
54141A46336L0J65Q58J337Q80k0m05k85l34n51k69O33J499J863J893J775J384
54124A56789O95M1j56L86J653L097L824L534K996L119L854M521M838M914M563
54109A98668L340J294r28k719l868m403m480m257l679k683j766j701k354k585
54095A67879j880j200j352j449l14J311J568K33r69q99l32k86m76j77M13O52O14
54078A63336Q82J504J944J911J644J428J280J194J273J495J585J333R64R51J331
54063A84055J520J011O3o85j101j444j563j013m9M11J37NO48J499J821J788J825
54046A88928J674J031N12R19K057L147L989M796N383N578N970P059Q040P679O248
54031B53010N277N405N715N355M571L899L393L113L239L387K689J111j96l62Q3
$$ y = [146336, 146366, 146531, 147389, 148726, 149606, 149586, 149181, 148896, 148562, 148011, 147742, 148375, 149874, 151737, 153630, 155405, 156789, 157484, 157525, 157369, 157755, 159408, 162505, 166329, 169863, 172859, 175978, 179832, 184353, 189191, 194105, 198668, 202008, 203302, 202374, 199655, 195787, 191384, 186904, 182647, 178968, 176285, 174519, 172818, 170464, 167879, 165999, 164799, 163447, 161998, 161684, 162995, 164563, 164796, 163827, 162928, 162596, 162310, 161834, 161657, 162070, 162722, 163336, 164218, 165722, 167666, 169577, 171221, 172649, 173929, 175123, 176396, 177891, 179476, 180809, 181773, 182724, 184055, 185575, 186586, 186649, 185964, 184863, 183419, 181856, 180843, 180794, 181205, 181342, 181347, 181995, 183494, 185315, 187103, 188928, 190602, 191633, 192145, 193064, 195121, 198268, 202257, 207053, 212436, 218014, 223984, 231043, 239083, 246762, 253010, 258287, 263692, 269407, 274762, 279333, 283232, 286625, 289738, 292977, 296364, 299053, 300164, 299968, 299606, 299689]
54016B99689J05n44j462k437l500m493n140n381n322n090m898m966n151n020m469
54001B41921l928l690l450k755j703r04p86j161j436j236q54q66j285j359n10
53986B15998Q49J828K121K137K278K650L358M553O145P704Q675Q413O371K674
53972B75754j695n574q326r732r731q684p357o079m426k355r00q83j495j303k34
53957B06980N95P08O49O64L81n1J63J125J876J823J575J804K218K276K206K546
53941B27538L256L905M422N057N721N886N199M002L117K982L097K693J929J820
53927B80624K700L592L692L600M164M908M897M532M982O083O454N753N261N946
53913C47188P296Q435R096R046P901O121M982M833M481K973R60m06j028j438j771
$$ y = [299689, 299794, 299250, 297788, 295351, 291851, 287358, 282218, 276837, 271515, 266425, 261527, 256561, 251410, 246390, 241921, 237993, 234303, 230853, 228098, 226395, 225491, 224705, 223544, 222108, 220872, 220018, 219152, 217867, 216508, 215998, 216847, 218675, 220796, 222933, 225211, 227861, 231219, 235772, 241917, 249621, 258296, 266709, 273080, 275754, 274059, 268485, 260159, 250427, 240696, 232012, 224655, 218576, 214150, 211795, 210895, 210012, 208517, 207214, 206980, 207575, 208283, 208932, 209596, 209977, 209926, 210089, 211214, 213090, 214913, 216488, 218292, 220510, 222786, 224992, 227538, 230794, 234699, 239121, 244178, 249899, 255785, 260984, 264986, 268103, 271085, 274182, 276875, 278804, 280624, 283324, 286916, 290608, 294208, 298372, 303280, 308177, 312709, 317691, 323774, 330228, 335981, 341242, 347188, 354484, 362919, 372015, 381061, 388962, 395083, 400065, 404898, 409379, 412352, 413312, 412906, 411878, 410440, 408669]
53898D08669k007k559l698m868n408n525n916o760p647q140p974p155o277o223
53884C28512p097p889p651o535n346m524m024l699l382k960k668k881l414l611
53870B62831l346l295l875m561m638m032l078k054j279j099j444j856k148k400
53856B23726k383j781j114j345k320k705j890q37m76m77k81k09o22r59o33n3J46
53839B05787J43L52N31L39J00J36J23j55j85K51L85k41p49l61J91l2l90K36J304
53820B07765J375N33J97P29J052O62L26N42Q74J167J916L006L489L180L151M041
53804B34005N077N433N476N791O049N765N359N449N641N098L987L347L569L904
53790C03950L568K732K083J840J610J029K67k74n80j074k015l135m024m612n008
$$ y = [408669, 406662, 404103, 400405, 395537, 390129, 384604, 378688, 371928, 364281, 356141, 348167, 341012, 334735, 328512, 321415, 313526, 305875, 299340, 293994, 289470, 285446, 281747, 278365, 275405, 272737, 269856, 266442, 262831, 259485, 256190, 252315, 247754, 243116, 239084, 236006, 233952, 232673, 231574, 230130, 228274, 226126, 223726, 221343, 219562, 218448, 217103, 214783, 212078, 210188, 209351, 208875, 208398, 208117, 207908, 207286, 206327, 205694, 205641, 205787, 205930, 206282, 206813, 207152, 207252, 207388, 207511, 207356, 207171, 207422, 207807, 207566, 206817, 206456, 206647, 206615, 206225, 206461, 207765, 209140, 209673, 209870, 210599, 211651, 212313, 212639, 213181, 214055, 215222, 217138, 220144, 223633, 226813, 229964, 234005, 239082, 244515, 249991, 255782, 261831, 267596, 272955, 278404, 284045, 289143, 293130, 296477, 300046, 303950, 307518, 310250, 312333, 314173, 315783, 316812, 317079, 316805, 316225, 315151, 313136, 310001, 305977, 301365, 296357]
53775B96357n148n012m919n158n450n235m439l518k810k281j942k059k709l500
53761B42177l836l389k368j437j250j809k381k288j638j067r00r29q68p07o24
53746B16686p55j001r99n19O6J01l90n95p3N90P30O62J080J834K130J716J118
53729B22381P77O49O06N91M01j11n85l99N75J846K845L240K940K300K029K433
53713B42518K899K695J960J296P43q1r70j150l24J049K530M002N224N882O141
53698B74414O403O483N782M413L279K841K577J969J271R10P86O19M00J28l55r25
53682C10995j091p79o17r92j336q98O6N32k7j083j707j465o50R4K93j06q67j652
53664B98710j989j467l41L27k38j363j583m98O99Q38J83k49j26N3QJ26P96J686
$$ y = [296357, 291209, 286197, 281278, 276120, 270670, 265435, 260996, 257478, 254668, 252387, 250445, 248386, 245677, 242177, 238341, 234952, 232584, 231147, 229897, 228088, 225707, 223419, 221781, 220714, 219814, 218885, 218017, 217310, 216686, 215931, 214930, 213931, 213412, 213478, 213579, 213189, 212594, 212521, 213111, 213841, 214503, 215583, 217417, 219547, 221263, 222381, 223158, 223807, 224413, 225004, 225405, 225294, 224709, 224310, 224885, 226731, 229576, 232816, 235756, 238056, 240085, 242518, 245417, 248112, 250072, 251368, 252111, 252030, 251060, 249910, 249586, 250635, 253165, 257167, 262391, 268273, 274414, 280817, 287300, 293082, 297495, 300774, 303615, 306192, 308161, 309432, 310342, 311128, 311747, 312147, 312275, 311920, 310995, 309904, 309125, 308508, 307516, 306180, 305282, 305348, 305880, 305853, 304770, 303063, 301598, 300948, 301042, 301335, 301229, 300362, 298710, 296721, 295254, 294913, 295240, 295002, 293639, 292056, 291558, 292257, 293095, 293278, 293029, 292903, 292956, 292964, 293090, 293886, 295572]
53646B95572K007J429N74M54J357K554L249L471L664L745L293K486K066K281K562
53631C30764K508K481K819L100K670J569M99P7M41J332K297L018L586M198M563
53616C65922M149L096K294K300K708K993L301L835M079L437K315J750K086K740
53602D07005L222L561L635K910J297k75p33q9O47O58P7m94p98j102j609k074k144
53585D13694j951k025k522k836k322j240n35o84j186j427j571k118k882l056k354
53570C84985j480j199j403j544j524j627j745j403n41K97P42R88J226J198O57
53555C77627p4l91qR05J922K489K218J359O93O89J114J609K198K914L442L582
53539D02288L662L973M224M113M025M536N527O454P242Q155R023R407R463R863
$$ y = [295572, 297579, 299008, 299582, 300036, 301393, 303947, 307196, 310667, 314331, 318076, 321369, 323855, 325921, 328202, 330764, 333272, 335753, 338572, 341672, 344342, 345911, 346410, 346487, 346928, 348260, 350557, 353575, 357161, 361359, 365922, 370071, 373167, 375461, 377761, 380469, 383462, 386763, 390598, 394677, 398114, 400429, 402179, 404265, 407005, 410227, 413788, 417423, 420333, 421630, 421355, 420622, 420533, 421180, 421838, 421915, 421421, 420623, 419521, 417912, 415838, 413694, 411743, 409718, 407196, 404360, 402038, 400798, 400263, 399579, 398393, 396966, 395395, 393277, 390395, 387339, 384985, 383505, 382306, 380903, 379359, 377835, 376208, 374463, 373060, 372519, 372816, 373558, 374546, 375772, 376970, 377627, 377553, 377162, 377154, 378059, 379981, 382470, 384688, 386047, 386740, 387429, 388543, 390152, 392350, 395264, 398706, 402288, 405950, 409923, 414147, 418260, 422285, 426821, 432348, 438802, 446044, 454199, 463222, 472629, 482092, 491955]
53525D91955J0821J1872J2641J3173J3497J3537J3594J4173J5226J6159J6771
53514F43419J7538J8788K0215K1452K2505K3381K3884K4115K4572K5370K5916
53503H91155K5720K5076K4536K4089K3255K1738J9680J7580J6181J6001J6656
53492A121667J7017J6479J5705J5767J6779J7905J8439J8397J8094J7691J7231
53481A311171J6821J6547J6289J5763J4751J3200J1112Q439N273K148k24j757
53469A429533l233n393q014j0255j1687j2541j3058j3333j3644j4333j5268j6001
53457A292773j6549j7381j8531j9336j9420j9244j9377j9664j9597j9054j8267
53446A086353j7398j6549j5922j5504j4818j3334j1093q676o664n218m066k817
$$ y = [491955, 502776, 514648, 527289, 540462, 553959, 567496, 581090, 595263, 610489, 626648, 643419, 660957, 679745, 699960, 721412, 743917, 767298, 791182, 815297, 839869, 865239, 891155, 916875, 941951, 966487, 990576, 1013831, 1035569, 1055249, 1072829, 1089010, 1105011, 1121667, 1138684, 1155163, 1170868, 1186635, 1203414, 1221319, 1239758, 1258155, 1276249, 1293940, 1311171, 1327992, 1344539, 1360828, 1376591, 1391342, 1404542, 1415654, 1424093, 1429366, 1431514, 1431290, 1429533, 1426300, 1420907, 1412893, 1402638, 1390951, 1378410, 1365352, 1352019, 1338375, 1324042, 1308774, 1292773, 1276224, 1258843, 1240312, 1220976, 1201556, 1182312, 1162935, 1143271, 1123674, 1104620, 1086353, 1068955, 1052406, 1036484, 1020980, 1006162, 992828, 981735, 973059, 966395, 961177, 957111, 954294]
53434I54294j381j29N74R49J602K739M002N088O109P288Q677J0266J1908J3136
53420A025122J3642J4010J5336J7802K0312K1892K2819K3935K5426K6896K8204
53409A255396K9516L0791L1838L2859L4332L6343L8432M0168M1597M3091M4935
53398A659298M7042M8973N0367N1316N2211N3118N3732N3925N4013N4212N4221
53387B232428N3602N2341N0719M8911M6945M4847M2523L9670L6058L1774K7129
53376B706947K2427J7851J3312Q447L083k331p209j1750j6872k3062k9823l6343
53364B644677m2060m6471m9155n0436n1294n2146n2374n1552n0451n0004m9858
53353B098876m8887m6817m4453m2397m0547l8900l7972l8073l8712l9080l8808
$$ y = [954294, 952913, 952784, 953358, 954307, 955909, 958648, 962650, 967738, 973847, 981135, 989812, 1000078, 1011986, 1025122, 1038764, 1052774, 1068110, 1085912, 1106224, 1128116, 1150935, 1174870, 1200296, 1227192, 1255396, 1284912, 1315703, 1347541, 1380400, 1414732, 1451075, 1489507, 1529675, 1571272, 1614363, 1659298, 1706340, 1755313, 1805680, 1856996, 1909207, 1962325, 2016057, 2069982, 2123995, 2178207, 2232428, 2286030, 2338371, 2389090, 2438001, 2484946, 2529793, 2572316, 2611986, 2648044, 2679818, 2706947, 2729374, 2747225, 2760537, 2768984, 2772067, 2769736, 2762527, 2750777, 2733905, 2710843, 2681020, 2644677, 2602617, 2556146, 2506991, 2456555, 2405261, 2353115, 2300741, 2249189, 2198738, 2148734, 2098876, 2049989, 2003172, 1958719, 1916322, 1875775, 1836875, 1798903, 1760830, 1722118, 1683038, 1644230]
53342A644230l8012l6895l5413l3312l0388k6878k3526k1101j9838j9293j8602
53331A340972j6958j4284j1618j0395j0965j2185j2779j2765j2990j3736j4388
53320A197909j4365j3726j2783j1658j0407r152p884o410m601k666r68L08J292
53307A104889K242L189L926M478N426P315R803J1954J3526J5271J7674K0057K1544
53294A241294K2366K3395K4730K5615K5665K5382K5268K5146K4596K3542K2110
53283A509109K0211J7626J4420J1068Q134N783L539P19k736o071q553j0369j2309
53270A550571j4729j7208j9212k0699k1975k3264k4538k5609k6238k6327k6102
53259A304670k6020k6372k7014k7491k7518k7257k7083k7064k6843k6210k5477
$$ y = [1644230, 1606218, 1569323, 1533910, 1500598, 1470210, 1443332, 1419806, 1398705, 1378867, 1359574, 1340972, 1324014, 1309730, 1298112, 1287717, 1276752, 1264567, 1251788, 1239023, 1226033, 1212297, 1197909, 1183544, 1169818, 1157035, 1145377, 1134970, 1125818, 1117934, 1111524, 1106923, 1104257, 1103289, 1103597, 1104889, 1107131, 1110320, 1114246, 1118724, 1124150, 1131465, 1141268, 1153222, 1166748, 1182019, 1199693, 1219750, 1241294, 1263660, 1287055, 1311785, 1337400, 1363065, 1388447, 1413715, 1438861, 1463457, 1486999, 1509109, 1529320, 1546946, 1561366, 1572434, 1580568, 1586351, 1589890, 1590609, 1587873, 1581802, 1573249, 1562880, 1550571, 1535842, 1518634, 1499422, 1478723, 1456748, 1433484, 1408946, 1383337, 1357099, 1330772, 1304670, 1278650, 1252278, 1225264, 1197773, 1170255, 1142998, 1115915, 1088851, 1062008, 1035798, 1010321]
53248A010321k5041k4737k4151k3410k3088k3248k3195k2409k1138j9789j8339
53237G61776j6736j5347j4439j3593j2230j0530r249q687q338p616o620o023o388
53224F25980p543q703r284r588j0392j1856j3262j3892j3800j3476j3191j2812
53212D88181j1994j0423q357o873o932q020q461p460o117n879o710p438p435p183
53198C78899p373q081q733q576p422o094n699o248o611o053n115m550m269l950
53184B90125l850m151m212l434k329j776j736j585j286j193j189j016j069j750
53170B59549k435k217j402j038j175r37j94K22N7K9L84L74l56j050j064q47j035
53153B46865j374j236n97M7L03M4n72r22m01O90J242O86k93p46n76l85n91j077
$$ y = [1010321, 985280, 960543, 936392, 912982, 889894, 866646, 843451, 821042, 799904, 780115, 761776, 745040, 729693, 715254, 701661, 689431, 678901, 669652, 660965, 652627, 645011, 638391, 632368, 625980, 618437, 609734, 600450, 590862, 580470, 568614, 555352, 541460, 527660, 514184, 500993, 488181, 476187, 465764, 457407, 450534, 443602, 435582, 427121, 419661, 413544, 407665, 400955, 393517, 386082, 378899, 371526, 363445, 354712, 346136, 338714, 332620, 326921, 320673, 314062, 308009, 302894, 298344, 294075, 290125, 286275, 282124, 277912, 274478, 272149, 270373, 268637, 267052, 265766, 264573, 263384, 262368, 261299, 259549, 257114, 254897, 253495, 252457, 251282, 250345, 250151, 250373, 250430, 250459, 250843, 251217, 250861, 249811, 248747, 247900, 246865, 245491, 244255, 243658, 243705, 244008, 244052, 243480, 242558, 242157, 242847, 244089, 244775, 244482, 243736, 243160, 242775, 242184, 241107]
53135B41107j340q69K72J156Q82k01p65j57Q86J388J291J200J488K070K635K804
53119B53847K447J998K004K364K473K195K015K108K029J506Q35K46m26j142j483
53104B73016j390j423j883k364k525k589k692k494j915j548j731j875j406p30
53090B46451n67q62j083j152j275j212n73L40P47M00k68q46j270j470j320r51
53074B35089o61m70k21o1l44j000j407j116m69k29p56j616k056j726q69J26J121
53057B23335J995K351J886R70L99N34J048J538J918K139J988J332L30p12j451
53042B39600j584j240j096j599k199k003j074k97m9P7K18o8o98q10r2N71M69J87
53024B28313N94J473J980J892J513R23J57k58R7P32P85K24k67l42k22j02J2k7
$$ y = [241107, 239767, 238898, 239170, 240326, 241208, 241007, 240242, 240085, 240971, 242359, 243650, 244850, 246338, 248408, 251043, 253847, 256294, 258292, 260296, 262660, 265133, 267328, 269343, 271451, 273480, 274986, 275821, 276067, 275641, 274499, 273016, 271626, 270203, 268320, 265956, 263431, 260842, 258150, 255656, 253741, 252193, 250462, 248587, 247181, 246451, 245884, 245022, 243939, 242787, 241512, 240300, 239727, 240067, 240814, 241214, 240946, 240100, 238830, 237360, 236040, 235089, 234428, 233958, 233737, 233676, 233332, 232332, 230925, 229809, 229340, 229111, 228355, 226739, 224683, 222957, 222088, 222214, 223335, 225330, 227681, 229567, 230537, 230936, 231470, 232518, 234056, 235974, 238113, 240101, 241433, 241763, 241051, 239600, 238016, 236776, 235680, 234081, 231882, 229879, 228805, 228508, 228459, 228536, 228754, 228686, 227988, 227178, 227086, 227657, 228126, 228313, 228907, 230380, 232360, 234252, 235765, 236688, 236845, 236587, 236684, 237416, 238201, 238425, 238158, 237816, 237594, 237492, 237504, 237477]
53006B37477l35n74l68L5O1k72l77O0P62J327J531J278P21L28M06O69P32P31R94
52987B45186J322J316J139J341J943K415K488K343K037J363L97m74j137j756k148
52972B57775j790o76M01P65O05N10O55Q16Q77J013J361J762J855J419O51K6k01
52955B67824k37m04p38j122j506j742j539j012q78j597k516k538j611q11q50j253
52939B47470j210o78j84nNl4j75l71m05j81Q8O0l15o73o36l71m73j099j518r09
52919B38386M91J517J398N83M0P7J74j68p70j029o71r7L9m37r89r22j10Q42J168
52900B39522O62j59o30n80k81J65R71K012K465J698K25q01r93r24r49o92O8P52
52882B42531P51K34k31l53j9Q89K082K742K473J926J896K246K365K259K336K449
$$ y = [237477, 237142, 236568, 236200, 236235, 236296, 236024, 235647, 235707, 236469, 237796, 239327, 240605, 241326, 241654, 242060, 242729, 243461, 244192, 245186, 246508, 247824, 248963, 250304, 252247, 254662, 257150, 259493, 261530, 262893, 263290, 262816, 261679, 259923, 257775, 255985, 255309, 255710, 256475, 257080, 257590, 258245, 259061, 259938, 260951, 262312, 264074, 265929, 267348, 267999, 268025, 267824, 267587, 267183, 266445, 265323, 263817, 262075, 260536, 259524, 258646, 257049, 254533, 251995, 250384, 249573, 248723, 247470, 246260, 245582, 245398, 245393, 245398, 245364, 245189, 244818, 244413, 244232, 244320, 244380, 244065, 243392, 242756, 242385, 241912, 240813, 239295, 238386, 238877, 240394, 241792, 242375, 242415, 242492, 242666, 242498, 241728, 240699, 240028, 239931, 239970, 239533, 238544, 237622, 237512, 238354, 239522, 240184, 240025, 239395, 238815, 238534, 238699, 239670, 241682, 244147, 245845, 246070, 245269, 244276, 243352, 242403, 241711, 241779, 242531, 243282, 243516, 243285, 242932, 242913, 243802, 245884, 248626, 251099, 253025, 254921, 257167, 259532, 261791, 264127, 266576]
52866B66576K081J364J023J207J201N02n24j289j718k052k402k722k976l077k929
52851B54265k639k426k295k054j682j426j479j792k163k356k261k035j935j830
52837B25892j258k51L77Q0m96l32N09J027P74L59L58N47M86K18Mj59l84n50m38
52818B26763o5K65J88l65r01o90L12J142R64K48R8O35R35N65K11M23O88K71o80
52799B31007j491j907k063j903j319o15j96R6P21J528J667O65p98j514j031k8
52783B22819N69N60M07M01L36J00K4L20N56K65k02j10M63O32J9o73p56n19o50
52764B24561j149j406j116n42KM57P86Q85Q54J064J685K314K312J587Q55R18J720
52747B35787K385K233J522J011J017J218J171P53K04JN10J443J888J276J89k89
$$ y = [266576, 268657, 270021, 271044, 272251, 273452, 273954, 273430, 272141, 270423, 268371, 265969, 263247, 260271, 257194, 254265, 251626, 249200, 246905, 244851, 243169, 241743, 240264, 238472, 236309, 233953, 231692, 229657, 227722, 225892, 224634, 224383, 224760, 224840, 224344, 224012, 224521, 225548, 226322, 226681, 227039, 227586, 228072, 228290, 228294, 228135, 227751, 227201, 226763, 226698, 226963, 227151, 226786, 225885, 225195, 225507, 226649, 227613, 227861, 227959, 228594, 229529, 230094, 230305, 230728, 231416, 231687, 231007, 229516, 227609, 225546, 223643, 222324, 221709, 221513, 221609, 222330, 223858, 225525, 226190, 225392, 223878, 222847, 222819, 223388, 223948, 224355, 224756, 225092, 225192, 225216, 225536, 226092, 226357, 226155, 226045, 226508, 227140, 227159, 226486, 225730, 225211, 224561, 223412, 222006, 220890, 220348, 220350, 220807, 221593, 222478, 223332, 224396, 226081, 228395, 230707, 232294, 233149, 234067, 235787, 238172, 240405, 241927, 242938, 243955, 245173, 246344, 247097, 247301, 247302, 247812, 249255, 251143, 252419, 252608, 252319]
52731B52319M1L51M8m15k66M53Q89L22j033k220k433j731p98k6P27J384J285J67
52713B49064j061j288o64j94j30J31O27N14m45j198q95p2L70N11Q41J036M24o85
52695B46886j199p97k78l12o07o45m92n14o91o75l75p6j04m92j043j505j704j517
52677B33860q58J82J172J562J196M90j5j47l3K65P65J304J527J226O20J97K69
52660B43582O51Q70P49O86J155J992K518K439K274K624L250L237K015j1j884k875
52644B63272k873k227j429q54n99n25n13o83j160j589j220J71J715K354K190K204
52628B58234K653K675J864J229J653K215J348p42k188k050j390j395j701j375
52614B61030n77k38o32j167j339j093m99K65O96M08k39n17l17k27n54q57o33o7
$$ y = [252319, 252360, 252711, 252759, 252344, 252078, 252531, 253420, 253742, 252709, 250489, 248056, 246325, 245527, 245501, 246228, 247612, 248897, 249064, 248003, 246715, 246051, 245857, 245727, 245858, 246485, 246999, 246554, 245356, 244461, 244389, 244759, 245270, 246111, 247147, 247571, 246886, 245687, 244890, 244612, 244300, 243693, 243048, 242556, 242042, 241351, 240676, 240301, 240225, 240121, 239629, 238586, 237081, 235377, 233860, 233002, 233184, 234356, 235918, 237114, 237604, 237589, 237442, 237409, 237674, 238439, 239743, 241270, 242496, 243116, 243313, 243582, 244233, 245103, 245852, 246538, 247693, 249685, 252203, 254642, 256916, 259540, 262790, 266027, 268042, 268031, 266147, 263272, 260399, 258172, 256743, 255889, 255290, 254765, 254252, 253569, 252409, 250820, 249600, 249771, 251486, 253840, 256030, 258234, 260887, 263562, 265426, 266655, 268308, 270523, 271871, 271129, 268941, 266891, 265501, 264106, 262405, 261030, 260453, 260215, 259583, 258416, 257077, 255984, 255485, 255750, 256446, 256854, 256615, 256098, 255781, 255554, 255000, 254143, 253510, 253443]
52596B53443K95L00K92N32Q37Q95P17N91O48P49Q05R56J284J565J568J410J351
52579B68238J413J427J336J124O38j17o67n26J10O22Q08Q65P10O0p23p81p1K56
52561B74722o22j962k434j844j137r71j048r24p34q12j029q90k76K53Q5o01r44
52544B58832n01J71L54K04L46P52Q46O21O76J032R07O3n43j09Q81J479J548J458
52526B69017J232P77M84O14N82k02j132j070m3Q15R73J047J512J914J806J565
52510B79891J772K364K895L155L132K698J780N53p48j964k890l361l605m013m394
52495B77265m008k672j239o01o74q70j066j421j622j103lQ93J124R24N91K11J35
52478B65864Q87K179K784K003P69M90J243J863J661J119Q88J007J346K034K968
$$ y = [253443, 253738, 254038, 254330, 254862, 255699, 256594, 257311, 257902, 258550, 259299, 260104, 261060, 262344, 263909, 265477, 266887, 268238, 269651, 271078, 272414, 273538, 274176, 274059, 273392, 272866, 272976, 273598, 274406, 275271, 275981, 276041, 275318, 274537, 274466, 274722, 274100, 272138, 269704, 267860, 266723, 265752, 264704, 263780, 263046, 262234, 261205, 260315, 260039, 260292, 260377, 259776, 258832, 258331, 258502, 258856, 259060, 259406, 260158, 261004, 261625, 262301, 263333, 264240, 264303, 263760, 263651, 264532, 266011, 267559, 269017, 270249, 271026, 271510, 272124, 272706, 272504, 271372, 270302, 270259, 271074, 272047, 273094, 274606, 276520, 278326, 279891, 281663, 284027, 286922, 290077, 293209, 295907, 297687, 298240, 297492, 295528, 292638, 289277, 285672, 281659, 277265, 273257, 270585, 269346, 268745, 268071, 267201, 266135, 264714, 263092, 261989, 261986, 262879, 264003, 264927, 265518, 265729, 265864, 266751, 268930, 271714, 273717, 274486, 274976, 276219, 278082, 279743, 280862, 281750, 282757, 284103, 286137, 289105]
52463B89105L552L464L189L250L346K821J624K18j138k350l058k975k551k556
52449B95941l032l342l246l202l450l498k813j542l25K46j48j287k195j833k98
52434B65976J065J105M5j009j322r68m20j31k63n38m26L08J291J900J798J206
52418B69617P84J106J948K409K134K013L000M537N208M865M908O251Q108R355
52404C26243R928J0187R776Q077N210J771j848n188p355p891p546p332p105n998
52390C20929m038k325j620j587j560j392j343j545j729j379j89J389K402K458
52376C08471K182K283K628K791K976L630M472M763M461M269M491M548L772K161
52362C57898K13j495k455k425j622n46L83Q57O80N8l16M4Q42J471J805K038K139
$$ y = [289105, 292657, 296121, 299310, 302560, 305906, 308727, 310351, 310569, 309431, 307081, 304023, 301048, 298497, 295941, 292909, 289567, 286321, 283119, 279669, 276171, 273358, 271816, 271491, 271737, 271589, 270302, 268107, 266274, 265976, 267041, 268146, 268191, 267182, 265860, 264892, 264472, 264341, 264078, 263540, 263114, 263422, 264713, 266613, 268411, 269617, 270401, 271507, 273455, 275864, 277998, 280011, 283011, 287548, 292756, 297621, 302529, 308780, 316888, 326243, 336171, 346358, 356134, 364211, 369421, 371192, 369344, 364156, 356801, 348910, 341364, 334032, 326927, 320929, 316891, 314566, 312946, 311359, 309799, 308407, 307064, 305519, 303790, 302411, 302222, 303611, 306013, 308471, 310653, 312936, 315564, 318355, 321331, 324961, 329433, 334196, 338657, 342926, 347417, 351965, 355737, 357898, 358111, 356616, 354161, 351736, 350114, 349568, 349951, 350808, 351488, 351546, 351230, 351274, 352116, 353587, 355392, 357430, 359569]
52345C59569K000J905K149K442K330K089K404L320M287N159O293P534Q116P860
52331D17457P712Q575J0165J1605J2664J3805J5233J6552J7391J7945J8650J9492
52319E87246J9994J9905J9566J9329J8930J7955J6825J6568J7431J8453J8764
52308G90966J8580J8397J7960J6819J5353J4354J3922J3610J3347J3284J3029
52297I59621J1958J0209Q398O427L619J13k949m951o566q512j0345j1072j0464
52284I45486r212q088p388o917o240n026l425j916p74K08J464L247N436P518R012
52269I23385J0110J1517J3316J4469J4066J2678J1707J1628J1775J1716J1870
52258A058237J2612J3575J4208J4377J4206J3778J3172J2415J1307R689P730N511
$$ y = [359569, 361569, 363474, 365623, 368065, 370395, 372484, 374888, 378208, 382495, 387654, 393947, 401481, 409597, 417457, 425169, 433744, 443909, 455514, 468178, 481983, 497216, 513768, 531159, 549104, 567754, 587246, 607240, 627145, 646711, 666040, 684970, 702925, 719750, 736318, 753749, 772202, 790966, 809546, 827943, 845903, 862722, 878075, 892429, 906351, 919961, 933308, 946592, 959621, 971579, 981788, 990186, 996613, 1000232, 1000345, 997396, 992445, 985879, 977367, 967022, 955950, 945486, 936274, 928186, 920798, 913881, 907641, 902615, 899190, 897274, 896500, 896708, 898172, 901419, 906855, 914373, 923385, 933495, 945012, 958328, 972797, 986863, 999541, 1011248, 1022876, 1034651, 1046367, 1058237, 1070849, 1084424, 1098632, 1113009, 1127215, 1140993, 1154165, 1166580, 1177887, 1187576, 1195306, 1200817]
52246A200817K592j261n192q020r773j1454j3278j4215j3711j2739j2643j3592
52234A087531j4798j5572j5678j5099j3957j2523j1028r668q748q347p986p173
52222I46954o178n613n317m533l159j897j068k41Q17J792K620L646M774N413N570
52207I43580N825N991N067L075J557J434J740J419J158K061L633M537M678M990
52193I90745N656O040O075O339O769O664N976N371M771L137R2l193n346o253o712
52178A026131p225p741q168q548q842q868q438p440n971m449l397k913k470j439
52164I40222J88J710K474K631K923L705M491M695M395L898L026J574K16k9O45
52149I76764R32K56m79l90J33L96O41J349K035J832Q99K74M60R37J101R76J080
$$ y = [1200817, 1203409, 1202148, 1196956, 1188936, 1179163, 1167709, 1154431, 1140216, 1126505, 1113766, 1101123, 1087531, 1072733, 1057161, 1041483, 1026384, 1012427, 999904, 988876, 979208, 970460, 962113, 954127, 946954, 940776, 935163, 929846, 925313, 922154, 920257, 919189, 918948, 919765, 921557, 924177, 927823, 932597, 938010, 943580, 949405, 955396, 960463, 963538, 965095, 966529, 968269, 969688, 970846, 972907, 976540, 981077, 985755, 990745, 996401, 1002441, 1008516, 1014855, 1021624, 1028288, 1034264, 1039635, 1044406, 1047543, 1047635, 1044442, 1039096, 1032843, 1026131, 1018906, 1011165, 1002997, 994449, 985607, 976739, 968301, 960861, 954890, 950441, 947044, 944131, 941661, 940222, 940410, 942120, 944594, 947225, 950148, 953853, 958344, 963039, 967434, 971332, 974358, 975932, 976148, 976119, 976764, 977696, 977952, 977473, 977083, 977216, 977612, 978253, 979602, 981637, 983469, 984368, 984642, 985102, 986039, 987140, 988116, 989196]
52132I89196K038M207P175R928J1910J3669J5914J8376K0300K1731K3505K6005
52120A163954K8622L0522L1380L1378L0873L0127K9004K7098K4431K1700J9485
52109A468574J7492J5077J2190R319O805M780L435K694J933P56k60l87j09p54
52095A541545k814n441p731r709j1861j4366j7049j9556k1367k2061k1730k0789
52083A367071j9369j7358j5006j2828j0832q429n444k557m26J192L045N320P452
52070A291831Q951J0086J1566J3590J5431J6217J6019J5720J5787J5700J4924
52059A445822J3783J2866J2059J0878R465Q349P464O210M531L024J816J47k615
52046A533799o073r420j2397j5222j7853j9918k1278k2251k3142k3758k3613k2581
$$ y = [989196, 991234, 995441, 1002616, 1012544, 1024454, 1038123, 1054037, 1072413, 1092713, 1114444, 1137949, 1163954, 1192576, 1223098, 1254478, 1285856, 1316729, 1346856, 1375860, 1402958, 1427389, 1449089, 1468574, 1486066, 1501143, 1513333, 1522652, 1529457, 1534237, 1537672, 1540366, 1542299, 1543055, 1542795, 1542408, 1542299, 1541545, 1538731, 1533290, 1525559, 1515850, 1503989, 1489623, 1472574, 1453018, 1431651, 1409590, 1387860, 1367071, 1347702, 1330344, 1315338, 1302510, 1291678, 1283249, 1277805, 1275248, 1274822, 1276014, 1279059, 1284379, 1291831, 1300782, 1310868, 1322434, 1336024, 1351455, 1367672, 1383691, 1399411, 1415198, 1430898, 1445822, 1459605, 1472471, 1484530, 1495408, 1504873, 1513222, 1520686, 1526896, 1531427, 1534451, 1536267, 1536414, 1533799, 1527726, 1518306, 1505909, 1490687, 1472834, 1452916, 1431638, 1409387, 1386245, 1362487, 1338874, 1316293]
52034A316293k1200k0036j8945j7297j4996j2858j1663j1297j1137j0982j1104
52023A154778j1657j2461j3243j3713j3538j2648j1494j0629j0176r950r880r985
52011A015404j0149j0247j0369j0620j0994j1606j2709j4125j5164j5575j6002
52000H77844j6985j7969j7990j6990j5704j4541j3306j1805j0008p931o008n298
51988G23309o442q545r969j0132r711r380r263r591j0706j2250j3328j3705j4012
51975E86275j4498j4465j3339j1434r331p141m837k707r84N59K238M042N780P270
51961E27428Q259Q582Q419P987O972M904K145k11j593k383k918k902k055o55J067
51946E63046L395O501R903J3033J5897J8606K0572K0777J8671J4603R515M564
$$ y = [1316293, 1295093, 1275057, 1256112, 1238815, 1223819, 1210961, 1199298, 1188001, 1176864, 1165882, 1154778, 1143121, 1130660, 1117417, 1103704, 1090166, 1077518, 1066024, 1055395, 1045219, 1035269, 1025389, 1015404, 1005255, 995008, 984639, 974019, 963025, 951419, 938710, 924585, 909421, 893846, 877844, 860859, 842890, 824900, 807910, 792206, 777665, 764359, 752554, 742546, 734615, 728607, 723309, 716867, 708322, 698353, 688221, 678510, 669130, 659867, 650276, 639570, 627320, 613992, 600287, 586275, 571777, 557312, 543973, 532539, 523208, 516067, 511230, 508523, 507539, 508098, 510336, 514378, 520158, 527428, 535687, 544269, 552688, 560675, 567647, 572551, 574696, 574485, 572892, 570509, 567591, 564689, 562634, 561979, 563046, 566441, 572942, 582845, 595878, 611775, 630381, 650953, 671730, 690401, 705004, 714519, 719083]
51934G19083P63j461k455l053m127o167q911j1488j3162j4022j4631j5304j6074
51921F08991j7013j7989j8355j7634j6317j5214j4230j2669j0656r132q314p318
51909D44150n567l607k085r03K25J300K535M374O466P587P231O384O004N642M383
51894D84119K247k41l118o426r251j0526j0529j0382j0263r188o675l559r72P27
51880D05963J774K446L052L982N335O724P650P945P752P244O443N331L991K561
51866D78193R55j057l244m707m863m387m407m806m295k357p5J416K323L338M284
51851D56311M566M329M058L422J587j377m249n995o703p144p801q437q378p247
51837D16942n599m484m222m072l367k397j732j232l73Q94K174L178L562K808R26
$$ y = [719083, 719846, 718385, 715930, 712877, 708750, 702583, 693672, 682184, 669022, 655000, 640369, 625065, 608991, 591978, 573989, 555634, 538000, 521683, 506469, 492239, 479570, 468914, 459782, 451468, 444150, 438583, 434976, 432891, 431988, 432213, 433513, 436048, 440422, 446888, 454475, 461706, 468090, 474094, 479736, 484119, 486366, 486125, 483007, 476581, 467330, 456804, 446275, 435893, 425630, 416442, 409767, 406208, 405236, 405963, 407737, 410183, 413235, 417217, 422552, 429276, 436926, 444871, 452623, 459867, 466310, 471641, 475632, 478193, 479148, 478091, 474847, 470140, 465277, 460890, 456483, 451677, 447382, 445025, 444950, 446366, 448689, 452027, 456311, 460877, 465206, 469264, 472686, 474273, 472896, 468647, 462652, 455949, 448805, 441004, 432567, 424189, 416942, 411343, 406859, 402637, 398565, 395198, 392801, 391069, 389837, 389464, 390358, 392532, 395710, 399272, 402080, 403006]
51822D03006j083k221k628k970l201k795j888j166p84k98L33P00Q14J107J528
51807C88454J527J100Q79J020Q62K5r12j218q67k15N46J240J524J264P25J51n04
51790C95601j230j833k287k775l137k825j655k03Q46J338J382Q80k43j608k500
51775C79751k390j272K92J473J911K193L199M933O505P433Q224R295J0012R446
51761D41005P724N865M416K928Q35j781m460o924r013j0378j0684j0072r113q209
51747C92139p257o032m688l667l128k753k142j154J33J558K915M094N315O859
51733C82192Q375Q890P887O048M484L458K438J273O62J261K753M027M038K510
51719D40296K4k359l842m359m280l813k969k013j514j776k501l185l536l473k852
$$ y = [403006, 401923, 399702, 397074, 394104, 390903, 388108, 386220, 385054, 384270, 383972, 384305, 385005, 385819, 386926, 388454, 389981, 391081, 391960, 392980, 393842, 393867, 392955, 391737, 390870, 390655, 391201, 392441, 393965, 395229, 395954, 396105, 395601, 394371, 392538, 390251, 387476, 384339, 381514, 379859, 379656, 380502, 381840, 383222, 384102, 383859, 382251, 379751, 377361, 376089, 376381, 377854, 379765, 381958, 385157, 390090, 396595, 404028, 412252, 421547, 431559, 441005, 448729, 454594, 459010, 461938, 462773, 460992, 456532, 449608, 440595, 430217, 419533, 409461, 400348, 392139, 384882, 378850, 374162, 370495, 367367, 364614, 362472, 361318, 361451, 363009, 365924, 370018, 375333, 382192, 390567, 399457, 407344, 413392, 417876, 421334, 423772, 425045, 425707, 426968, 429721, 433748, 437786, 440296, 440320, 437961, 434119, 429760, 425480, 421667, 418698, 416685, 415171, 413395, 410894, 407709, 404173, 400700, 397848]
51704C97848j518M11K435L866M242L568K170L99j387k613k774k039j162n98n3
51689D02795O98J123O06n12j327j682k266l401m398m372l202j411M48J996L014
51674C88109L476L474L023K171J327J070J540K366L359M803O825Q809R742R044
51660D49138O826L567k24m051p274r042q628o104k576O62L273N812Q454J0246
51646D50079R871P036K827j119l714m921n451n982o628p091p267p390p639p884
51632D04727p927p732p264o354m904l170j655p23l60l21m81r68j846k753l147
51617C55122k954k685k720k840k682k317k003j645j029l42N8K58O32J163J483
51602C37499J543J635J842K148K980M869P386R316J0231J0976J2050J2303J0154
$$ y = [397848, 396330, 396741, 399176, 403042, 407284, 410852, 413022, 413421, 412034, 409421, 406647, 404608, 403446, 402848, 402795, 403493, 404616, 405222, 404710, 403383, 401701, 399435, 396034, 391636, 387264, 384062, 382651, 383099, 385095, 388109, 391585, 395059, 398082, 400253, 401580, 402650, 404190, 406556, 409915, 414718, 421543, 430352, 440094, 449138, 455964, 459531, 459307, 455256, 447982, 438940, 430312, 424208, 421632, 422294, 425567, 431379, 439833, 450079, 459950, 466986, 469813, 468694, 464980, 460059, 454608, 448626, 441998, 434907, 427640, 420250, 412611, 404727, 396800, 389068, 381804, 375450, 370546, 367376, 365721, 364998, 364638, 364317, 363836, 362868, 361022, 358269, 355122, 352168, 349483, 346763, 343923, 341241, 338924, 336921, 335276, 334247, 333905, 333963, 334221, 334853, 336016, 337499, 339042, 340677, 342519, 344667, 347647, 352516, 359902, 369218, 379449, 390425, 402475, 414778, 424932]
51589D24932N697P33l153n687p188p593o686m778k701j087Q4J248K694M316N885
51574D06716P413R032J0549J1464J1558J1328J1540J2445J3527J3962J3341J2067
51562E44942J1160J1567J3536J6681K0503K4564K8300L1041L2393L2157K9893
51551G96737K5073J8074J0553M154r82n882j1063j5760j8990k0715k1639k2307
51539G37253k2915k3655k4611k5327k5089k3845k2379k1294k0209j8426j6068
51528D93435j3976j2596j1507j0141q473o882n764n380n627n797n112l755k836
51515C95589l036l772m075l725l031k092r77k44m06j091j412j092n38K8P25J355
51499C72206J398Q03J62p4M4M59J250K187K758K852K801K590J761L76o41o39j93
$$ y = [424932, 430629, 431362, 428209, 422522, 415334, 407741, 401055, 396277, 393576, 392489, 392573, 393821, 396515, 400831, 406716, 414129, 423161, 433710, 445174, 456732, 468060, 479600, 492045, 505572, 519534, 532875, 544942, 556102, 567669, 581205, 597886, 618389, 642953, 671253, 702294, 734687, 766844, 796737, 821810, 839884, 850437, 854591, 853609, 847727, 836664, 820904, 801914, 781199, 759560, 737253, 714338, 690683, 666072, 640745, 615656, 591811, 569432, 548138, 527929, 509503, 493435, 479459, 466863, 455356, 445215, 436742, 429860, 424096, 418716, 413089, 407292, 402180, 398425, 395589, 392553, 388781, 384706, 380981, 377950, 375858, 374881, 374637, 374231, 373140, 371728, 370636, 370098, 370126, 370851, 372206, 373604, 374407, 374569, 374495, 374539, 374998, 376248, 378435, 381193, 384045, 386846, 389436, 391197, 391573, 390932, 390293, 390100]
51482C90100m07j573k998l880m024l842l888m287m557m259l722l571l632l055
51468C42405j753r05j479k845l557l058k021j270r96r65q70m84K19J025J683K104
51452C27233K312K446K856L850N210O364P216Q295R847J1376J2519J3748J5439
51439D28711J6613J5496J1399N560rm008o226o948o541n543m875n521p635j0085
51425D20388j1324j0836r363p742o117m452l123k477k239j899j336p01l5N37O88
51410C59969M53N59J490K636L044K726K555K932L383L439L179K822K412K096K135
51395C95830K497K804K877L001L518M520N884P318Q422R190J0339J2606J5724
51382D84530J8722K1355K4485K8668L3014L6148L8026M0119M3588M7484M8878
$$ y = [390100, 389693, 388120, 385122, 381242, 377218, 373376, 369488, 365201, 360644, 356385, 352663, 349092, 345460, 342405, 340652, 339747, 338268, 335423, 331866, 328808, 326787, 325517, 324521, 323556, 322686, 322202, 322421, 323446, 325129, 327233, 329545, 331991, 334847, 338697, 343907, 350271, 357487, 365782, 375629, 387005, 399524, 413272, 428711, 445324, 460820, 472219, 477779, 477770, 473762, 467536, 460588, 454047, 448504, 443629, 438108, 430473, 420388, 409064, 398228, 388865, 381123, 375006, 370554, 367431, 364954, 362715, 360816, 359480, 358779, 358744, 359281, 359969, 360422, 360981, 362471, 365107, 368151, 370877, 373432, 376364, 379747, 383186, 386365, 389187, 391599, 393695, 395830, 398327, 401131, 404008, 407009, 410527, 415047, 420931, 428249, 436671, 445861, 456200, 468806, 484530, 503252, 524607, 549092, 577760, 610774, 646922, 684948, 725067, 768655, 816139, 865017]
51371H65017M4989L5459K2771J0339K6q461j6065k2861k8266l2195l5301l8093
51359G97359m0283m1270m0837l9124l6202l2213k7854k4162k1419j8769j5321
51348D59905j1464q499p088o662o378n980n537m996m436m246m603n108n333n353
51334C74222n339n047m210l175k534k370k341k303k338k324k085j803j725j589
51320C35039r29J63J124J646J755J412P22L81R66J838J826J080J124K550L833
51305C54530L251J173o25j288j388j398r76J0Q01O52j99r92j439j742j863j447
51289C47060m92L97O86O08Q86J834L012L828M196M475M877N248N386N263M833
51274C92097L814J924o24k986m221m032k941j684m84R02K510L887M523M306L337
$$ y = [865017, 910006, 945465, 968236, 978575, 978601, 970140, 954075, 931214, 902948, 870753, 835452, 797359, 757076, 715806, 674969, 635845, 599643, 567430, 539576, 515414, 493995, 475226, 459905, 448441, 439942, 432854, 426192, 419814, 413834, 408297, 403301, 398865, 394619, 390016, 384908, 379575, 374222, 368883, 363836, 359626, 356451, 353917, 351547, 349206, 346903, 344565, 342241, 340156, 338353, 336628, 335039, 334110, 334273, 335397, 337043, 338798, 340210, 340932, 341313, 342279, 344117, 345943, 347023, 348147, 350697, 354530, 357781, 358954, 358329, 357041, 355653, 354255, 353279, 353289, 354090, 354742, 354543, 353551, 352112, 350370, 348507, 347060, 346568, 346965, 347651, 348259, 349145, 350979, 353991, 357819, 362015, 366490, 371367, 376615, 382001, 387264, 392097, 395911, 397835, 397211, 394225, 390004, 385972, 383031, 381347, 380863, 381765, 384275, 388162, 392685, 396991, 400328]
51259D00328J654n17k490l571l725l443k991k266j471j259j965k970l304k716
51245C69294j830j327j252j188r13o61p77j259j749j958j891j661j290q69p06
51230C49963r76j342j271p52l96o74j301j571j123k46N64J143J652K094K118J493
51214C49375P20P26J755K914L144K432J685J561J955K549L323M214M718M267K960
51199C88298J573P34K94l71j449k296k190j255l61p7r2J26N63Q59R15Q51O03P7
51181C86802m98p98r73j380j867j860j180l28J46J20l50j176k007k319j958j251
51165C69123n06J98O85P29O32J167K543L926M388L887K942J789M90n63r80r58
51149C89492r84r92n23L26P70K59r19k091k827k942k421j581r83q55q26m54K36
$$ y = [400328, 401982, 401465, 398975, 395404, 391679, 388236, 385245, 382979, 381508, 380249, 378284, 375314, 372010, 369294, 367464, 366137, 364885, 363697, 362784, 362123, 361346, 360087, 358338, 356380, 354489, 352828, 351538, 350669, 349963, 348987, 347645, 346374, 345622, 345226, 344552, 343251, 341680, 340557, 340311, 340875, 342018, 343670, 345764, 347882, 349375, 350095, 350821, 352576, 355490, 358634, 361066, 362751, 364312, 366267, 368816, 372139, 376353, 381071, 385338, 388298, 389871, 390605, 390899, 390528, 389079, 386783, 384593, 383338, 382977, 382900, 382808, 382934, 383497, 384356, 385271, 386122, 386725, 386802, 386304, 385506, 384533, 383153, 381286, 379426, 378246, 377918, 378064, 378184, 377834, 376658, 374651, 372332, 370374, 369123, 368617, 368815, 369500, 370229, 370861, 372028, 374571, 378497, 382885, 386772, 389714, 391503, 391993, 391430, 390450, 389492, 388508, 387516, 386993, 387319, 388089, 388348, 387429, 385338, 382511, 379569, 377148, 375567, 374584, 373729, 372903, 372449, 372685]
51132C72685Q67J162J029N19o4k45J01N84Q68J241K047K872K960K395K112K463
51116C93596K568J627K36l64K6N03M78K99L78N56O85J035J709K214K157J869J841
51099D11413J940J777J488J512J809J915J658J278R32N97L86M41O15O97Q12J005
51083D30275P47l97j684j815p29J79j8n61l11O18J303J517J871K664L510M032
51067D41201M383N001O274Q343J0885J3176J4904J6735J9537K2938K5248K4860
51055F13485K1422J5734R219L666P57J065L484N944O774N463K615n33k870m276
51041F81949n719q127j1203j3519j3840j2038q837n271k566k036m319q578j2790
51028E73106j5059j4769j2632r930p627n875m174j994O67L338N520O995P861Q524
$$ y = [372685, 373552, 374714, 375743, 376262, 376198, 375953, 376054, 376638, 377506, 378747, 380794, 383666, 386626, 389021, 391133, 393596, 396164, 397791, 398027, 397663, 397689, 398192, 398670, 398969, 399347, 399903, 400588, 401623, 403332, 405546, 407703, 409572, 411413, 413353, 415130, 416618, 418130, 419939, 421854, 423512, 424790, 425722, 426319, 426705, 427146, 427761, 428458, 429270, 430275, 431022, 430625, 428941, 427126, 426397, 426576, 426558, 425997, 425686, 426304, 427607, 429124, 430995, 433659, 437169, 441201, 445584, 450585, 456859, 465202, 476087, 489263, 504167, 520902, 540439, 563377, 588625, 613485, 634907, 650641, 659860, 663526, 664283, 665348, 668832, 674776, 681550, 687013, 689628, 689095, 686225, 681949, 676230, 668103, 656900, 643381, 629541, 617503, 608666, 603395, 600829, 598793, 594474, 585896, 573106, 558047, 543278, 530646, 520716, 513089, 507214, 503040, 501046, 501713, 505051, 510571, 517566, 525427, 533951]
51014E33951R475J0740J1634J1427J0213Q753P479O162M633L197K064R55l84j719
51000F18580k779l632m236m122l124j969j411j181n36M89J277J863K940M600O153
50985F12912P402R033J1364J3630J5217J6760J9084K1540K2430K1033J8483J6515
50973H05403J5973J6721J8523K1502K5764L0897L6086M0800M5153M9489N3771
50962A160082N7727O1414O5114O8576P0808P0970O9198O6367O3085N9145N3889
50951A866375M7048L9245L1627K4809J8421J1904N515J42l607n573n648m107k389
50938B023762k530n266r252j2580j4532j5572j6380j7521j9528k2480k5760k8770
50926A833591l1669l5016l8900m2979m6969n0581n3212n4348n4182n3275n1784
$$ y = [533951, 543426, 554166, 565800, 577227, 587440, 596193, 603672, 609834, 614467, 617664, 619728, 620683, 620299, 618580, 615801, 612169, 607933, 603811, 600687, 598718, 597307, 596126, 595590, 596079, 597356, 599219, 602159, 606759, 612912, 620314, 629347, 640711, 654341, 669558, 686318, 705402, 726942, 749372, 770405, 788888, 805403, 821376, 838097, 856620, 878122, 903886, 934783, 970869, 1011669, 1056822, 1106311, 1160082, 1217809, 1279223, 1344337, 1412913, 1483721, 1554691, 1623889, 1690256, 1753341, 1812486, 1866375, 1913423, 1952668, 1984295, 2009104, 2027525, 2039429, 2044944, 2045086, 2041479, 2035906, 2030258, 2026151, 2023762, 2021232, 2015966, 2006714, 1994134, 1979602, 1964030, 1947650, 1930129, 1910601, 1888121, 1862361, 1833591, 1801922, 1766906, 1728006, 1685027, 1638058, 1587477, 1534265, 1479917, 1425735, 1372460, 1320676]
50915A320676m9570m6887m4247m1593l8309l4266l0317k7400k5522k3904k1944
50904I36717j9762j7871j6515j5453j4392j3434j2787j2165j0956r125p392o226
50892G80639n228l939k741k230k134j658p06R3M87Q97J502J942K189K945M656
50877G76714O748Q360R383J0296J1264J1978J2280J2466J2980J4063J5709J7691
50865I19932J9650K1272K2491K3512K4753K6746K9829L3864L8404M3271M8752
50854A252476N5129O2296P0022P8364Q7499R7202J06907J16260J25382J34461
50844B185998J43172J50678J56158J59309J60353J59458J56167J49396J38121
50835C558810J22194J02559Q0757N8185L5807J4342n422k2587l6406m6496n2778
$$ y = [1320676, 1271106, 1224219, 1179972, 1138379, 1100070, 1065804, 1035487, 1008087, 982565, 958661, 936717, 916955, 899084, 882569, 867116, 852724, 839290, 826503, 814338, 803382, 794257, 786865, 780639, 775411, 771472, 768731, 766501, 764367, 762709, 762003, 762096, 762583, 763480, 764982, 766924, 769113, 772058, 776714, 783462, 791822, 801205, 811501, 822765, 834743, 847023, 859489, 872469, 886532, 902241, 919932, 939582, 960854, 983345, 1006857, 1031610, 1058356, 1088185, 1122049, 1160453, 1203724, 1252476, 1307605, 1369901, 1439923, 1518287, 1605786, 1702988, 1809895, 1926155, 2051537, 2185998, 2329170, 2479848, 2636006, 2795315, 2955668, 3115126, 3271293, 3420689, 3558810, 3681004, 3783563, 3864320, 3922505, 3958312, 3972654, 3967232, 3944645, 3908239, 3861743, 3808965]
50824C808965n5240n3832m8727m0682l1084k1494j3139o903l753m724j0240j9623
50812C499524l1544m4945n9292p4075q8534j01930j13827j23876j31582j36408
50802B593511j38007j36335j31717j24859j16576j07386r7556q7511p7892o9051
50792A506621o0790n2746m4864l7450l0922k5560k1245j7395j3589j0259q305
50781A183496p790p609o796n676n174n486o020o414o905p653q349q673q746q936
50767A083269r455j0232j1019j1559j1797j1897j1964j1880j1503j0789r587p655
50755I53932n186k986j600m90J444M562Q217J1657J4694J7406J9782K1906K4118
50742A067456K6744K9808L3178L6785M0652M4818M9302N4037N8868O3742O8692
$$ y = [3808965, 3753725, 3699893, 3651166, 3610484, 3579400, 3557906, 3544767, 3537864, 3534111, 3529387, 3519147, 3499524, 3467980, 3423035, 3363743, 3289668, 3201134, 3099204, 2985377, 2861501, 2729919, 2593511, 2455504, 2319169, 2187452, 2062593, 1946017, 1838631, 1741075, 1653564, 1575672, 1506621, 1445831, 1393085, 1348221, 1310771, 1279849, 1254289, 1233044, 1215649, 1202060, 1191801, 1183496, 1175706, 1168097, 1161301, 1155625, 1150451, 1144965, 1138945, 1132531, 1125626, 1117973, 1109624, 1100951, 1092205, 1083269, 1073814, 1063582, 1052563, 1041004, 1029207, 1017310, 1005346, 993466, 981963, 971174, 961587, 953932, 948746, 945760, 944160, 943670, 945114, 949676, 957893, 969550, 984244, 1001650, 1021432, 1043338, 1067456, 1094200, 1124008, 1157186, 1193971, 1234623, 1279441, 1328743, 1382780, 1441648, 1505390, 1574082]
50731A574082P3426P7108P9016P9376P9202P9211P9220P8486P6356P2663O7851
50720B415997O2648N7138N0141M0031K6343J0234o596k2809l7141m8127n4773
50709B493086n7214n6141n1943m5035l6653k8416k0922j3605o334m21K539K354
50697B181295Mm082j0532j9649l0372m1159n1343o0928o9379p5454p8242p7779
50685A662380p4665o9728o4089n8752n3689m7915m0853l3258k6385k0654j5556
50674A156836j0520n437n62L695P103R909J2540J4786J5818J5389J4465J4078
50662A248100J4080J3686J2917J2591J3093J4019J5059J6422J8228K0173K2071
50651A420439K4201K6811K9678L2325L4479L6263L8163M0760M4097M7481N0245
$$ y = [1574082, 1647508, 1724616, 1803632, 1883008, 1962210, 2041421, 2120641, 2199127, 2275483, 2348146, 2415997, 2478645, 2535783, 2585924, 2625955, 2652298, 2662532, 2655936, 2633127, 2595986, 2547859, 2493086, 2435872, 2379731, 2327788, 2282753, 2246100, 2217684, 2196762, 2183157, 2176823, 2176402, 2178941, 2181295, 2181299, 2177217, 2166685, 2147036, 2116664, 2075505, 2024162, 1963234, 1893855, 1818401, 1740159, 1662380, 1587715, 1517987, 1453898, 1395146, 1341457, 1293542, 1252689, 1219431, 1193046, 1172392, 1156836, 1146316, 1140879, 1140317, 1144012, 1151115, 1161024, 1173564, 1188350, 1204168, 1219557, 1234022, 1248100, 1262180, 1275866, 1288783, 1301374, 1314467, 1328486, 1343545, 1359967, 1378195, 1398368, 1420439, 1444640, 1471451, 1501129, 1533454, 1567933, 1604196, 1642359, 1683119, 1727216, 1774697, 1824942]
50640A824942N2562N4992N7398N9048N9720N9930N9768N8306N4695M9571M4752
50629B435684M1638M0161L9295L8311L7148L5252L0362J9549K403j7123l2986
50618B669694m1377m2568l9021l2886k5423j7624j0295l755J987O732R933J0907
50606B486304R175M767j858j0327k0565l2141m3716n3869o2312o9656p6042q0780
50594B048980q3379q4068q3154q0709p7213p3558o9860o5069n8466n1008m4447
50583A278049l9465l5338l1233k7144k3535k0554j7805j4785j1457q274n552k995
50571A039912j26K978N888Q520J1100J3547J5558J7249J8961K0445K1160K1404
50559A196596K2107K3267K3673K2762K1647K1593K2373K2956K3063K3111K3205
$$ y = [1824942, 1877504, 1932496, 1989894, 2048942, 2108662, 2168592, 2228360, 2286666, 2341361, 2390932, 2435684, 2477322, 2517483, 2556778, 2595089, 2632237, 2667489, 2697851, 2717400, 2719803, 2702680, 2669694, 2628317, 2585749, 2546728, 2513842, 2488419, 2470795, 2460500, 2456745, 2458732, 2465464, 2475397, 2486304, 2495479, 2500246, 2498388, 2488061, 2467496, 2435355, 2391639, 2337770, 2275458, 2205802, 2129760, 2048980, 1965601, 1881533, 1798379, 1717670, 1640457, 1566899, 1497039, 1431970, 1373504, 1322496, 1278049, 1238584, 1203246, 1172013, 1144869, 1121334, 1100780, 1082975, 1068190, 1056733, 1048459, 1042907, 1039912, 1039786, 1042764, 1048652, 1057172, 1068272, 1081819, 1097377, 1114626, 1133587, 1154032, 1175192, 1196596, 1218703, 1241970, 1265643, 1288405, 1310052, 1331645, 1354018, 1376974, 1400037, 1423148, 1446353]
50548A446353K3108K2847K2559K2098K1507K1482K2649K4788K7402L0626L4818
50537A720237L9858M5585N2474O0841O9832P8180Q5587R2444R8629J03882J09092
50526B556641J15657J23402J30379J35074J37640J38608J37656J34280J28526
50517C737863J20198J08248R2028P2655N2131L1431J0251j1576l3333n4031p2987
50506D052878q9490j02511j11155j15130j14533j09380r9669q5891o9174n0828
50496C105117l1862j3046M775K0754L4322M5052N2122N4218N0210L9737K3142
50485C384541J267k4302n1114p6461r8210j15086j26634j33307j36206j36250
50475B488238j33665j28661j22131j15055j07405r8479q8388p8390o9534o1636
$$ y = [1446353, 1469461, 1492308, 1514867, 1536965, 1558472, 1579954, 1602603, 1627391, 1654793, 1685419, 1720237, 1760095, 1805680, 1858154, 1918995, 1988827, 2067007, 2152594, 2245038, 2343667, 2447549, 2556641, 2672298, 2795700, 2926079, 3061153, 3198793, 3337401, 3475057, 3609337, 3737863, 3858061, 3966309, 4058337, 4130992, 4183123, 4214554, 4224805, 4213229, 4179896, 4125865, 4052878, 3963388, 3860877, 3749722, 3634592, 3520059, 3410679, 3311010, 3225119, 3155945, 3105117, 3073255, 3060209, 3064984, 3085738, 3120060, 3165112, 3217234, 3271452, 3321662, 3361399, 3384541, 3385808, 3361506, 3310392, 3233931, 3135721, 3020635, 2894001, 2760694, 2624488, 2488238, 2354573, 2225912, 2103781, 1988726, 1881321, 1782842, 1694454, 1616064, 1546530, 1484894]
50465A484894n4063m6947m1009l6388l2286k7827k2900j7945j3200q479l687Q33
50453A180996M759Q400J2346J6507K0014K2360K4098K6035K8203L0166L2005L4187
50441A440076L6465L7495L5759L0587K2425J2559K728n516j1368j4693j5653j4699
50429A556165j2764j0902r573q520p262n457k900L42L788O974J0025J3474J7610
50416A551000K2338K7577L3279L9109M4673N0070N5609O0953O5163O7765O9118
50405B086654O9497O8489O5741O1741N7261N2300M6156L8337K8968J8356O541
50394B600041o595k0945l5868n0205o2676p2426p9118q2614q2842q0051p4890
50383A951811o7937n9337m9093l7632k5904j4899n136L512J1401J8392K3490K5472
$$ y = [1484894, 1430831, 1383884, 1342875, 1306487, 1274201, 1246374, 1223474, 1205529, 1192329, 1183850, 1180163, 1180996, 1185755, 1194155, 1206501, 1223008, 1243022, 1265382, 1289480, 1315515, 1343718, 1373884, 1405889, 1440076, 1476541, 1514036, 1549795, 1580382, 1602807, 1615366, 1618094, 1612578, 1601210, 1586517, 1570864, 1556165, 1543401, 1532499, 1522926, 1514406, 1507144, 1501687, 1498787, 1499129, 1502917, 1509891, 1519916, 1533390, 1551000, 1573338, 1600915, 1634194, 1673303, 1717976, 1768046, 1823655, 1884608, 1949771, 2017536, 2086654, 2156151, 2224640, 2290381, 2352122, 2409383, 2461683, 2507839, 2546176, 2575144, 2593500, 2600041, 2593446, 2572501, 2536633, 2486428, 2423752, 2351326, 2272208, 2189594, 2106752, 2026701, 1951811, 1883874, 1824537, 1775444, 1737812, 1711908, 1697009, 1691873, 1695385, 1706786, 1725178, 1748668, 1774140]
50371A774140K3894J9287J2395L618o628j7422k7611l6407m3422m8192n0132m9120
50359A554400m5915m1804l7934l5162l4389l6441m1117m6585n0302n0889m8834
50348A085028m5365m1085l5986l0275k4565j9361j4809j0921p659m844k217M07
50336H48348L169O014Q347R269Q701P849P937Q690Q828P927O948O881P610Q414
50322I54932Q964R435J0047J0782J1300J1020R578P241M692K380M10j128k181
50309A037472k869l102k301j59K449M220N133O622R858J4535J9470K3786K7348
50296A142462L0829L5445M1948M9784N7892O5625P1238O9720N5017K6421q440
50285A637941l8751n8211o7025o8127o3958n6525m7890l9462l1760k5232k0379
$$ y = [1774140, 1798034, 1817321, 1829716, 1833334, 1826706, 1809284, 1781673, 1745266, 1701844, 1653652, 1603520, 1554400, 1508485, 1466681, 1428747, 1393585, 1359196, 1322755, 1281638, 1235053, 1184751, 1133862, 1085028, 1039663, 998578, 962592, 932317, 907752, 888391, 873582, 862661, 855002, 850158, 847941, 848348, 851517, 857531, 865878, 875147, 883848, 891697, 899634, 908324, 917152, 925079, 932027, 938908, 946518, 954932, 963896, 973331, 983378, 994160, 1005460, 1016480, 1026058, 1033299, 1037991, 1040371, 1040781, 1039653, 1037472, 1034603, 1031501, 1029200, 1029041, 1031490, 1035710, 1040843, 1047465, 1057323, 1071858, 1091328, 1115114, 1142462, 1173291, 1208736, 1250684, 1300468, 1358360, 1423985, 1495223, 1564943, 1619960, 1646381, 1637941, 1599190, 1540979, 1473954, 1405827, 1341869, 1285344, 1237454, 1197992, 1166232, 1141000, 1120621]
50274A120621j6802j3319r465n978l462j555K29J741K865M044N503O672P067P135
50260A105296P484P896P911P979Q979J0740J1983J1867J0827R617Q137N721K194
50247A216631j810n451q254j0150j1226j1517j0906r146o127k230J653M416N070
50234A150953K914k174r380j6973k3114k6840k8248k7921k6492k4685k3189k2131
50222I22720k0954j9186j7146j5530j4497j3610j2605j1758j1297j0889j0003
50211G65245q619p258o316n622m708l466k328j768j694j598j257j012j260j865
50197G16474k318k339k108k000k288l082m187n114n411n144m878n057n505n581
50183F61462m855l553k408j964k082k186j979j738j785j945j759j162n84l88m42
$$ y = [1120621, 1103819, 1090500, 1081035, 1075057, 1071595, 1070040, 1070269, 1072010, 1074875, 1078919, 1084422, 1091094, 1098161, 1105296, 1112780, 1120676, 1128587, 1136566, 1145545, 1156285, 1168268, 1180135, 1190962, 1200579, 1208716, 1214437, 1216631, 1214821, 1209370, 1201116, 1190966, 1179740, 1168223, 1157317, 1148171, 1142044, 1139814, 1141467, 1145883, 1150953, 1153867, 1151693, 1142313, 1125340, 1102226, 1075386, 1047138, 1019217, 992725, 968040, 944851, 922720, 901766, 882580, 865434, 849904, 835407, 821797, 809192, 797434, 786137, 775248, 765245, 756626, 749368, 743052, 737430, 732722, 729256, 726928, 725160, 723466, 721868, 720611, 719599, 718339, 716474, 714156, 711817, 709709, 707709, 705421, 702339, 698152, 693038, 687627, 682483, 677605, 672548, 667043, 661462, 656607, 653054, 650646, 648682, 646600, 644414, 642435, 640697, 638912, 636967, 635208, 634046, 633462, 633074, 632632]
50168F32632m14j92P1K97O22J214K101L204M412N544O431P189Q341J0315J2838
50153F94605J5172J7228J9882K3749K7942L0744L1552L1412L1449L1406L0241
50142I85382K7677K4646K2320K1235K1228K1849K2646K3221K3016K1157J6916
50131A231293J0482K948m697j2247j9565k5738k9647l1216l1400l0842k9263k6430
50119A003678k3027k0038j7667j5470j3404j2029j1578j1452j1041j0615j0774
50108H46583j1156j0496q274n661m229m132m282m016l715l676l467k805k345k859
50094G75470m041m831m616l545j929j8J700K668K903L050L671M825O270P677Q590
50079G97844Q610P871P028O545O227N583M467L218K273J774J508J141M93l94j395
$$ y = [632632, 632218, 632026, 632097, 632394, 633016, 634230, 636331, 639535, 643947, 649491, 655922, 663111, 671452, 681767, 694605, 709777, 727005, 746887, 770636, 798578, 829322, 860874, 892286, 923735, 955141, 985382, 1013059, 1037705, 1060025, 1081260, 1102488, 1124337, 1146983, 1170204, 1193220, 1214377, 1231293, 1241775, 1244723, 1240026, 1227779, 1208214, 1182476, 1152829, 1121613, 1090213, 1059371, 1030108, 1003678, 980651, 960613, 942946, 927476, 914072, 902043, 890465, 879013, 867972, 857357, 846583, 835427, 824931, 816657, 810996, 806767, 802635, 798353, 794337, 790622, 786946, 783479, 780674, 778329, 775470, 771429, 766598, 761982, 758437, 756508, 756490, 758190, 760858, 763761, 766811, 770482, 775307, 781577, 789254, 797844, 806454, 814325, 821353, 827898, 834125, 839708, 844175, 847393, 849666, 851440, 852948, 854089, 854582, 854188, 852793]
50064H52793k344k978l123l066l434m429n414n554m754l643k786k236j788j302
50050H05942o43L41J667L134M488N650O726P847Q972R882J0475J0949J1539J2151
50036H99120J2598J3145J4305J6038J7655J8684J9370K0073K0765K1369K1934
50025A095056K2014K0639J7599J4100J1441R573P813O337N795N781M935K530j109
50012A222504n755j1592j8164k4253k9171l3245l6560l8271l7746l5550l2578
50001I19619k8962k4465j9421j4549j0229o533l592j440J35J212J554J122L16
49988H14767o44j956l537m812n699p064r469j2136j3910j4652j4817j4330j2980
49975F98761j1505j0923j0880r945p690n375m240m136m251m293m349m259l902
$$ y = [852793, 850449, 847471, 844348, 841282, 837848, 833419, 828005, 822451, 817697, 814054, 811268, 809032, 807244, 805942, 805299, 805640, 807307, 810441, 814929, 820579, 827305, 835152, 844124, 854006, 864481, 875430, 886969, 899120, 911718, 924863, 939168, 955206, 972861, 991545, 1010915, 1030988, 1051753, 1073122, 1095056, 1117070, 1137709, 1155308, 1169408, 1180849, 1190422, 1198235, 1204572, 1210367, 1216148, 1221083, 1223613, 1222504, 1216749, 1205157, 1186993, 1162740, 1133569, 1100324, 1063764, 1025493, 987747, 952197, 919619, 890657, 866192, 846771, 832222, 821993, 815460, 811868, 810428, 810563, 811775, 813329, 814451, 814767, 814123, 812167, 808630, 803818, 798119, 791055, 781586, 769450, 755540, 740888, 726071, 711741, 698761, 687256, 676333, 665453, 655508, 647818, 642443, 638203, 634067, 629816, 625523, 621174, 616915, 613013]
49962F13013l655l902m324m138k977j166O86K115L008L713M867O726Q818J0397
49948F33181J1201J1525J1588J1148R838P726N421L636K678K331K175J851J114
49935G15413j87k023m278o918r919j2789j4495j4265j2466j0358q912q094p301
49922F03408o193m950l938l274k634j510K42K037K987K787K052J696K047K612
49908E97369K789K716L236M861O930Q229Q400Q272Q628R301R824J0306J0889J0862
49894G02612R273O425L787K265J359J97j411l311n529p842r474r907r658r633
49880F69153r995j0256j0142r769r140q116o853n684m640l471k185r83J64J373
49866E89456K319K472J988J777K384L297L699L555L642M676O562Q418R285R081
$$ y = [613013, 609358, 605456, 601132, 596994, 594017, 592851, 593537, 595652, 598660, 602373, 607240, 613966, 622784, 633181, 644382, 655907, 667495, 678643, 688481, 696207, 701628, 705264, 707942, 710273, 712448, 714299, 715413, 715226, 713203, 708925, 702007, 692088, 679299, 664804, 650539, 638073, 627715, 618803, 610709, 603408, 597215, 592265, 588327, 585053, 582419, 580909, 581151, 583188, 586175, 588962, 591014, 592710, 594757, 597369, 600158, 602874, 606110, 610971, 617901, 626130, 634530, 642802, 651430, 660731, 670555, 680861, 691750, 702612, 711885, 718310, 722097, 724362, 725721, 725918, 724507, 721196, 715667, 707825, 698351, 688444, 678786, 669153, 659158, 648902, 638760, 628991, 619851, 611735, 604882, 599198, 594558, 591087, 588902, 587919, 588083, 589456, 591775, 594247, 596235, 598012, 600396, 603693, 607392, 610947, 614589, 619265, 625827, 634245, 643530, 652611]
49852F52611Q801R384J0420J0501Q969O625M522K756J035l79j072j463k428m054
$$ y = [652611, 661412, 670796, 681216, 691717, 700686, 707311, 711833, 714589, 715624, 715245, 714173, 712710, 710282, 706228]
$$ [...]
##END NTUPLES=NMR SPECTRUM
##END=
