##TITLE=AC1567_ROEFFECT0020_8270620_MpqYOPbm69
##JCAMPDX= 6.0         $$ Bruker NMR JCAMP-DX V2.0
##DATA TYPE= NMR SPECTRUM
##DATA CLASS= NTUPLES
##ORIGIN= BRUKER
##OWNER= Administrator
$$ 1.72 TOPSPIN		Version 2.1
$$ 2013-10-12 19:04:32.331 -0700  Administrator@X
$$ Compression mode = diff/dup
##.OBSERVE FREQUENCY= 400.02188249412
##.OBSERVE NUCLEUS= ^1H
##.ACQUISITION MODE= SIMULTANEOUS (DQD)
##.ACQUISITION SCHEME= undefined
##.AVERAGES= 8
##.DIGITISER RES= 22
##SPECTROMETER/DATA SYSTEM= spect
##.PULSE SEQUENCE= zg30
##.SOLVENT NAME= COFFEE_meoh
##.SHIFT REFERENCE= INTERNAL, COFFEE_meoh, 1, 14.98509
##AUDIT TRAIL= $$ (NUMBER, WHEN, WHO, WHERE, PROCESS, VERSION, WHAT)
$$ ##TITLE= Audit trail, TOPSPIN		Version 2.1
$$ ##JCAMPDX= 5.01
$$ ##ORIGIN= Bruker BioSpin GmbH
$$ ##OWNER= Administrator
$$ $$ E:\/data/COFFEE/nmr/AC1567_ROEFFECT0020_8270620_MpqYOPbm69/10/pdata/1/auditp.txt
$$ ##AUDIT TRAIL=  $$ (NUMBER, WHEN, WHO, WHERE, PROCESS, VERSION, WHAT)
(   1,<2013-10-12 19:04:25.971 -0700>,<Administrator>,<X>,<go>,<TOPSPIN 2.1>,
      <created by zg
	started at 2013-10-12 19:03:20.315 -0700,
	POWCHK enabled, PULCHK disabled,
       configuration hash MD5:
       C8 4E 4E 5D D3 5C D8 9E 9F 52 82 E0 59 8A DE 15
       data hash MD5: 64K
       8E A7 55 E6 96 2E 91 45 01 85 5E 8B 98 B2 67 FC>)
(   2,<2013-10-12 19:04:28.862 -0700>,<Administrator>,<X>,<proc1d>,<TOPSPIN 2.1>,
      <Start of raw data processing
       efp LB = 0 FT_mod = 6 PKNL = 1 PHC0 = 0 PHC1 = 0 SI = 32K 
       data hash MD5: 32K
       0C 1D 24 1E 03 98 0F 6A A0 FD 5C FD 70 B8 26 E9>)
(   3,<2013-10-12 19:04:29.143 -0700>,<Administrator>,<X>,<proc1d>,<TOPSPIN 2.1>,
      <pk PHC0 = 96.51489 PHC1 = 0 
       data hash MD5: 32K
       D2 6A 59 14 23 FC E4 09 89 1C 49 62 C1 60 29 96>)
(   4,<2013-10-12 19:04:29.253 -0700>,<Administrator>,<X>,<proc1d>,<TOPSPIN 2.1>,
      <abs ABSG = 1 
       data hash MD5: 32K
       46 8B 23 D0 50 CF B5 85 4A 8A DC 84 7C 72 7A DF>)
(   5,<2013-10-12 19:04:29.346 -0700>,<Administrator>,<X>,<proc1d>,<TOPSPIN 2.1>,
      <abs ABSG = 2 
       data hash MD5: 32K
       19 E9 D4 A0 A9 47 E7 92 DD 1C 96 74 2A 0F 8A 4C>)
(   6,<2013-10-12 19:04:29.393 -0700>,<Administrator>,<X>,<proc1d>,<TOPSPIN 2.1>,
      <abs ABSG = 3 
       data hash MD5: 32K
       63 91 E4 41 59 A8 8C 25 A8 45 72 2B 51 E3 B8 99>)
(   7,<2013-10-12 19:04:29.440 -0700>,<Administrator>,<X>,<proc1d>,<TOPSPIN 2.1>,
      <abs ABSG = 4 
       data hash MD5: 32K
       F3 01 5F C2 59 7F F5 B5 E8 45 C6 C0 7D 9B DD 0F>)
(   8,<2013-10-12 19:04:29.503 -0700>,<Administrator>,<X>,<proc1d>,<TOPSPIN 2.1>,
      <abs ABSG = 5 
       data hash MD5: 32K
       7D F5 A8 62 2D 40 59 A2 32 9D DE F6 DB 6A 25 D5>)
$$ ##END=
$$ 
$$ $$ hash MD5
$$ $$ E8 99 60 E4 0D D7 EA E5 D6 4F FF 50 E1 C6 F1 3A
##$RELAX= 
##$RELAX= 
##$RELAX= 
##$RELAX= 
##$RELAX= 
##$RELAX= 
##$RELAX= 
$$ Bruker specific parameters
$$ --------------------------
##$DU= <E:\>
##$EXPNO= 10
$$ [...]
150 150 150 150 150 150 150 150
##$TP07= 0
##$TPNAME0= <>
##$TPNAME1= <>
##$TPNAME2= <>
##$TPNAME3= <>
##$TPNAME4= <>
##$TPNAME5= <>
##$TPNAME6= <>
##$TPNAME7= <>
##$TPOAL= (0..7)
0.5 0.5 0.5 0.5 0.5 0.5 0.5 0.5
##$TPOFFS= (0..7)
0 0 0 0 0 0 0 0
##$TUNHIN= 0
##$TUNHOUT= 0
##$TUNXOUT= 0
##$USERA1= <user>
##$USERA2= <user>
##$USERA3= <user>
##$USERA4= <user>
##$USERA5= <user>
##$V9= 5
##$VALIST= <valist>
##$VCLIST= <CCCCCCCCCCCCCCC>
##$VD= 0
##$VDLIST= <DDDDDDDDDDDDDDD>
##$VPLIST= <PPPPPPPPPPPPPPP>
##$VTLIST= <TTTTTTTTTTTTTTT>
##$WBST= 1024
##$WBSW= 4
##$XGAIN= (0..3)
0 0 0 0
##$XL= 0
##$YL= 0
##$YMAX_a= 634843
##$YMIN_a= -540307
##$ZGOPTNS= <>
##$ZL1= 120
##$ZL2= 120
##$ZL3= 120
##$ZL4= 120
##$ABSF1= 14.98509
##$ABSF2= -5.573092
##$ABSG= 5
##$ABSL= 3
##$ALPHA= 0
##$AQORDER= 0
##$ASSFAC= 0
##$ASSFACI= 0
##$ASSFACX= 0
##$ASSWID= 0
##$AUNMP= <proc_prof1d_extract_pilot.lims>
##$AXLEFT= 0
##$AXNAME= <>
##$AXNUC= <1H>
##$AXRIGHT= 0
##$AXTYPE= 0
##$AXUNIT= <>
##$AZFE= 0.1
##$AZFW= 0.1
##$BCFW= 0
##$BC_mod= 0
##$BYTORDP= 0
##$COROFFS= 0
##$CY= 15
##$DATMOD= 1
##$DC= 0
##$DFILT= <>
##$DTYPP= 0
##$F1P= 0
##$F2P= 0
##$FCOR= 0.5
##$FTSIZE= 32768
##$FT_mod= 6
##$GAMMA= 0
##$GB= 0
##$INTBC= 1
##$INTSCL= 1
##$ISEN= 128
##$LB= 0
##$LEV0= 0
##$LPBIN= 0
##$MAXI= 10000
##$MC2= 0
##$MEAN= 0
##$ME_mod= 0
##$MI= 0
##$NCOEF= 0
##$NC_proc= -8
##$NLEV= 6
##$NOISF1= 0
##$NOISF2= 0
##$NSP= 0
##$NTH_PI= 0
##$NZP= 0
##$OFFSET= 14.98509
##$PC= 1
##$PHC0= 96.51489
##$PHC1= 0
##$PH_mod= 1
##$PKNL= yes
##$PPARMOD= 0
##$PPDIAG= 0
##$PPIPTYP= 0
##$PPMPNUM= 2147483647
##$PPRESOL= 1
##$PSCAL= 4
##$PSIGN= 0
##$PYNMP= <proc.py>
##$REVERSE= no
##$SF= 400.02
##$SI= 32768
##$SIGF1= 0
##$SIGF2= 0
##$SINO= 400
##$SIOLD= 32768
##$SPECTYP= <>
##$SREGLST= <1H.CDCl3>
##$SSB= 0
##$STSI= 32768
##$STSR= 0
##$SW_p= 8223.68421052631
##$SYMM= 0
##$S_DEV= 0
##$TDeff= 65536
##$TDoff= 0
##$TI= <>
##$TILT= no
##$TM1= 0
##$TM2= 0
##$TOPLEV= 0
##$USERP1= <user>
##$USERP2= <user>
##$USERP3= <user>
##$USERP4= <user>
##$USERP5= <user>
##$WDW= 1
##$XDIM= 32768
##$YMAX_p= 446997523
##$YMIN_p= -698831
##$CURPLOT= <Network HP LaserJet P1505>
##$CURPRIN= <$Network HP LaserJet P1505>
##$DFORMAT= <normdp>
##$LAYOUT= <+/1D_H.xwp>
##$LFORMAT= <normlp>
##$PFORMAT= <normpl>
##$SURQMSG= 1
$$ End of Bruker specific parameters
$$ ---------------------------------
##NTUPLES= NMR SPECTRUM
##VAR_NAME=  FREQUENCY,     SPECTRUM/REAL,   SPECTRUM/IMAG
##SYMBOL=    X,             R,               I
##VAR_TYPE=  INDEPENDENT,   DEPENDENT,       DEPENDENT
##VAR_FORM=  AFFN,          ASDF,            ASDF
##VAR_DIM=   32768,         32768,           32768
##UNITS=     HZ,            ARBITRARY UNITS, ARBITRARY UNITS
##FACTOR=    0.250966925370066, 1,           1
##FIRST=     8223.43324360094, -144806,      -186057
##LAST=      0,             -13341,          -24565
##MIN=       0,             -698831,         0
##MAX=       8223.43324360094, 446997523,    0
$$ Real data points
##PAGE= N=1
##DATA TABLE= (X++(R..R)), XYDATA
$$ [...]
19553a78962A88572b2507q3342B35603m3268a63613B43014A6909b33270A94814
19542a03010A23498b54977C8967a37508f8289B2834f7116k61249R6850F394h016
19530b20123D1391I043g3318j3418A46285b54004j49755c2139k39762P0372M0602
19519a60927k30851G9159j1085g9425p4214A17453b38933A2153b25552O2345j38273
19508c01480E5240d8250F2196c13943A52849c25169F3910b00926j64023i844k35440
19497b45284e3448E4076Q9834c87599A9860J27144o4149a60505J4969N5155j69679
19486b60060d4229k8713D23672e0367j96268N8460h5177B21727G987M8533a82979
19474h0297l1449A46699j9841c14074d3810k7228J7627a3881k50114C25568a02525
$$ y = [-178962, 188572, -22507, -105849, 235603, 192335, -163613, 243014, 16909, -233270, 194814, -103010, 123498, -254977, 38967, -137508, -68289, 22834, -67116, -328365, -231515, 6394, -8016, -220123, 41391, 9043, -73318, -86736, 146285, -254004, -403759, -32139, -271901, -201529, -160927, -391778, 79159, 68074, -79425, -153639, 117453, -238933, 12153, -225552, -163207, -301480, 55240, -48250, 62196, -313943, 152849, -325169, 63910, -200926, -364949, -9844, -245284, -53448, 54076, 143910, -387599, 19860, 147004, 82855, -160505, -145536, -90381, -260060, -44229, -72942, 423672, -50367, -246635, -188175, -85177, 221727, 7987, 56520, -182979, -80297, -111746, 146699, 126858, -314074, -43810, -71038, -53411, -13881, -263995, 325568, -102525]
19462g4613J1179A47069J36840e110j47871e0109E7032c57010Q9687k3678i1415
19450a556k45927R057C03431c12829h1489E2053j9251f7971j75858C2029c37002
19438a2491k25998a16679J3235j98530j76313c8414j48367f8548j3137K033l8428
19427a18080A77026d7564j92266p543C69712h9525A32736A7547c51375J40248
19417b11127A51587g4906C1800J3502N314e0651A96475C3106a19960j70032a05644
19405A61911j4161i2810G0746i8640i187B05076a08049B73225A29509g7011J6663
19394f0348o2225d6774B44609G0906L8793m1157b87690N121J15877A84365K5439
19383B09804p1357a56670f6545K760C324L6200h4321a1668B9451K63994c10097
$$ y = [-74613, -63434, 147069, 283909, -5110, -152981, -50109, 57032, -357010, -267323, -291001, -91415, -1556, -247483, -238426, 303431, -312829, -81489, 52053, 32802, -67971, -243829, 32029, -337002, -12491, -238489, -116679, -103444, -301974, -478287, -38414, -186781, -68548, -81685, -79652, -118080, 177026, -47564, -239830, -247373, 369712, -89525, 132736, 17547, -351375, -211127, 151587, -74906, 31800, 45302, 50616, -50651, 196475, 33106, -119960, -289992, -105644, 161911, 147750, -92810, 70746, -98640, -9187, 205076, -108049, 273225, 129509, -77011, -60348, -122573, -46774, 244609, 70906, 109699, 68542, -287690, -282569, -166692, 184365, 209804, 138447, -156670, -66545, -63785, 3324, 39524, -84321, -11668, 29451, 293445, -310097]
19371b0636j5706j25813B1323a88p6835C4593a6521n51189h5714j78708A73844
19359D4798a33520F6412g8854c5341G0274K5875d1831B09287b61539R1967l8547
19348b08119k47088A43063D3348a39566K2950q1956R08M9376l1943H8362K0923
19337A09285a42921A04045b06270j19047C6585a39342j95148I1721a24599j69589
19327b94188B4211i0676C4416b08623l0630B85260b35812e2385B13987e3301K2819
19316c0482k30468I2992N3442E8531c94240a25111o9604a158r601k17538b9615
19304C1595a38113A71478P1901I2833b40262C21332a86628B42227h5291F7507
19293C23877C4860a74497o4937I431b32482J15973d4826E8991i6759j83416F7299
$$ y = [-20636, -36342, -162155, 21323, -188, -77023, 34593, -16521, -567710, -85714, -264422, 173844, 44798, -133520, 66412, -78854, -35341, 70274, 96149, -41831, 209287, -261539, -169572, -208119, -455207, 143063, 43348, -139566, -116616, -198572, -197664, -148288, -180231, 88362, 109285, -142921, 104045, -206270, -325317, 36585, -139342, -334490, 91721, -124599, -294188, 24211, -90676, 34416, -208623, -239253, 285260, -235812, -52385, 213987, -53301, -30482, -260950, 92992, 146434, 58531, -394240, -125111, -194715, -1158, -10759, -228297, -29615, 31595, -138113, 171478, 243379, 92833, -240262, 321332, -186628, 242227, -85291, 67507, 323877, 34860, -174497, -239434, 9431, -232482, -116509, -44826, 58991, -96759, -280175, 67299]
19281d77827i0912L3309j0575K101k12714i3414l2204B22791i0298j16594o3835
19270b70727H0149h6343m4143n0631B2910d64446E9872a66668B46619a21021p21
19259a21742l97576F0342K21859b85884N4589b4696A11922b04613A05262g778
19248I5485k1597b74343A68328G5022a9077n1584j01404C14021G5412l7024d273
19236A76359D3791l909J8152f1260A09622N5984n5649a44927a6325A67418b89713
19224F91d4509m0994o7714e7807n5481a2686o8189K2516B54191F0291a02687q9383
19212a92070K2548i595j86369d7678B8214f3183j62434a4301j51742e0903j07724
19201a58627c646k46802p5142a44036j63449g3523H9923k7304a37755G666g1991
$$ y = [-477827, -90912, -57603, -68178, -66077, -278791, -93414, -125618, 222791, -90298, -206892, -270727, 80149, -86343, -130486, -181117, 22910, -464446, 59872, -166668, 246619, -121021, -121742, -519318, 60342, 282201, -285884, -231295, -24696, 111922, -204613, 105262, -7778, 95485, 73888, -274343, 168328, 75022, -19077, -70661, -172065, 314021, 75412, 38388, -4273, 176359, 43791, 39882, 58034, -61260, 109622, 165606, 109957, -144927, -16325, 167418, -289713, 691, -44509, -85503, -153217, -57807, -113288, -12686, -80875, -58359, 254191, 60291, -102687, -192070, -169522, -9595, -195964, -47678, 28214, -63183, -225617, -14301, -166043, -50903, -158627, -3646, -250448, -325590, -144036, -307485, -73523, 89923, 62619, -137755, 7666, -71991]
19189H3623L8752B5133Q7685M6697c41851B78316b63810E3578P1169b9327n6537
19178h5864j8727o8182M7409A48328b7154l13396B3270b96015d5125F2668e1013
19166i7927j57480A4678J21446o6141h2147C24924A28412c58757N4360d6043A54287
19154D65980b42796J07113B65526I162c73161a11090L8346n8033F975a80358A3952
19142a09807B01946c343B9674L9934f299j83894A55056d29163J35093B28752b26426
19130a08746n7277f133k0371l32498a73249A3171b03935P8646j44526d2914M087
19119c8827l112A55554a86638A0649b71580A45017b5943A26357a77765O4998F8962
19107a70701A51115b42763E3213b25966d6393o4262n5362A19904i7711E4910Q2522
$$ y = [83623, 122375, 25133, 112818, 159515, -341851, 278316, -263810, 53578, 124747, -29327, -85864, -104591, -172773, -125364, 148328, -27154, -340550, 23270, -296015, -45125, 62668, -51013, -97927, -255407, 14678, 136124, 69983, -82147, 324924, 128412, -358757, -304397, -46043, 154287, 465980, -242796, -135683, 265526, 9162, -373161, -111090, -72744, -130777, 6975, -180358, 13952, -109807, 201946, -3343, 29674, 69608, -6299, -190193, 155056, -429163, -294070, 228752, -226426, -108746, -166023, -6133, -26504, -359002, -173249, 13171, -203935, -125289, -269815, -42914, -38827, -41939, 155554, -186638, 10649, -271580, 145017, -25943, 126357, -177765, -112767, 68962, -170701, 151115, -242763, 53213, -225966, -46393, -110655, -166017, 119904, -97711, 54910, 137432]
19096A37432a23673A22075e264C51885j13422d8821j45243K717h9710A06589B4337
19084F0570K7827a5998j77339e1127C2540c36964b1724j54532b3301B54093b4490
19072e7888l05625h5286p7140B10477i3540c9061a5323A52719a19074A64419d8051
19060b78893D7132j1893b22135A0904c3592H1996L39489d9019A73198h2659B57219
19048a62295f2774K0229G8380a49735A14260l015h3183l0117B6120h3106C3430
19036B1940b01601D8872A7763Q9211a6883C43711i436C19997l3904B4523K58478
19025B83001a8141Q052A47568k1477B5257b10095C9593e13837e0039m3109C9247
19013i3863M986j535b6863B520K9803K9417b76465A20591a08095j37282C7435
$$ y = [137432, -123673, 122075, -5264, 351885, 238463, -48821, -194064, -191347, -89710, 106589, 24337, 60570, 88397, -15998, -193337, -51127, 32540, -336964, -21724, -176256, -23301, 254093, -24490, -57888, -363513, -85286, -162426, 210477, -93540, -39061, -15323, 152719, -119074, 164419, -48051, -278893, 47132, 35239, -222135, 10904, -33592, 81996, 421485, -49019, 173198, -82659, 257219, -162295, -62774, -42545, 78380, -149735, 114260, 111245, -83183, -113300, 26120, -83106, 33430, 21940, -201601, 48872, 17763, 106974, -16883, 343711, -9436, 319997, 286093, 24523, 283001, -18141, -10089, 147568, 126091, 25257, -210095, 39593, -513837, -50039, -93148, 39247, -93863, -88877, -90412, -26863, 2520, 32323, 61740, -276465, 120591, -108095, -245377, 37435]
19001H7949a45885H8903J69864M9839g7548B74971M0293a0303k52878a10714J0063
18990a00651K9921B79804r3960C1464d38086M9919g5346D7967d7219j32902C224
18978b15953c8961O294o469B03127L6820b15065C78573b39928J18077a7122j20812
18967a37934F5297f1429b4756m9871A4878K69150a47143C59595F501J27148b07921
18955b9003n6922k45B94333F5459d3429j14104g6506G2401e9185G4529c46986
18943A26364K3847b78445a8628C50653c74758I0577l9933j9237J48448B0747K39045
18932B59792b89359K2112A19796E7588e1567k43449N7203E4484B5912O70d5692
18920A76686b79632B59765a78994c5780j09450q9009l7546f5260k07401J6558
$$ y = [87949, -145885, 88903, 258767, 308606, -77548, 274971, 315264, -10303, -263181, -110714, -100651, -70730, 279804, 185844, 31464, -438086, -388167, -75346, 47967, -47219, -180121, 3224, -215953, -38961, -32667, -39136, 203127, 239947, -215065, 378573, -239928, -121851, -17122, -137934, 65297, -61429, -24756, -74627, 14878, 284028, -147143, 359595, 6501, 133649, -207921, -29003, -85925, -86170, 294333, 65459, -43429, -157533, -76506, 72401, -59185, 74529, -346986, 126364, 150211, -278445, -18628, 350653, -374758, 90577, 50644, 31407, 179855, 20747, 259792, -289359, -267247, 119796, 57588, -51567, -295016, -237813, 54484, 25912, 26582, -45692, 176686, -279632, 259765, -178994, -35780, -145230, -234239, -271785, -65260, -272661, -256103]
18910b56103r9768p5143A31941o2233A6256c05287J09568b9861p4766i547B8016
18898b57146p5524D7g0298r4528f3902n9162C82122D3475a16446A85400c21158
18886B54573F3494M3509a40417A5174a17313m1388A99241b2551G2840R2337R6377
18875B61554a6660l3656A47854b52928I8181J86752B236e30945d9591B5942a26876
18863b02943q2440M7963j5901b0403l9966G7463a51257d2173a5773k09901F0642
18851a52212A77863B4897J42586n8685F233f6376A13199b07950O0416o5772C0059
18839a10892j75969A9213J45581E9168c69443A45903b4328j24639k9362d0113
18828g3904A36694J6648b83132f0403j67959i7518j57706B0700A0205b42976d2991
$$ y = [-256103, -355871, -431014, 131941, 69708, 16256, -305287, -195719, -29861, -104627, -9547, 28016, -257146, -332670, 47, -70298, -164826, -63902, -123064, 382122, 43475, -116446, 185400, -321158, 254573, 63494, 107003, -140417, 15174, -117313, -158701, 199241, -22551, 72840, 165177, 261554, -16660, -50316, 147854, -252928, 98181, 284933, 2236, -530945, -49591, 25942, -126876, -202943, -285383, -237420, -253321, -20403, -60369, 77463, -151257, -42173, -15773, -225674, 60642, -152212, 177863, 24897, 167483, 108798, 6233, -66376, 113199, -207950, -147534, -213306, 30059, -110892, -286861, 19213, 164794, 59168, -369443, 145903, -24328, -148967, -178329, -40113, -73904, 136694, 153342, -283132, -60403, -228362, -97518, -255224, 20700, 10205, -242976, -42991]
18816A91997F5951b49275d3213J3248B06829a26958A74178H2464C4402a22124
18805F8726g4297q140q0280q1019A35822F7718c91235a6037D8074a514A47971
18793A27346a49002a5922j23061A36037m4739g4451k02802a28963f2835j2727
18783g5562j67413F2365a24826n07255C23539b383E4326a43950m6298A8486d4615
18771b66864g1048I3759R8336c76621j26785a03415p5785f8642A6316d32867A17156
18759a9026A0029c06573C86621D3033J47163b27934R7950d3279j35858m3123J0147
18748b12113A64495b62729F3581a14442n5900P0238L9930m5748r613C78360H3145
18736B0591a16301A67717J29405R7408h4899L3836j05926A08206l6119K25661
$$ y = [191997, 65951, -249275, -43213, -29965, 206829, -126958, 174178, 82464, 34402, -122124, 68726, -74297, -82437, -162717, -243736, 135822, 67718, -391235, -16037, 48074, -1514, 147971, 127346, -149002, -15922, -138983, 136037, 91298, -74451, -277253, -128963, -62835, -75562, -242975, 62365, -124826, -632081, 323539, -2383, 54326, -143950, -190248, 18486, -44615, -266864, -71048, 93759, 192095, -376621, -503406, -103415, -179200, -68642, 16316, -432867, 117156, -19026, 10029, -306573, 386621, 43033, 190196, -227934, -129984, -43279, -179137, -222260, -212113, 164495, -262729, 63581, -114442, -170342, -100104, -60174, -105922, -115535, 378360, 83145, 20591, -116301, 167717, 297122, 394530, -84899, -51063, -156989, 108206, 72087, 297748]
18726B97748j35411c3503A02219a28303k73446a17221B06909i3170f16j28599
18716a29215N7156C6952a03163M89A27791g8353n0083A21320E2857c9663k1538
18705f1201K0579a7310q0077q3263k9292A94932j6266c03996C49977j43911a3987
18693D84593c36000g6401m5639J3768K2848j41264K9393D7185b24026k6420f6673
18681h1701A28310J3603d5823G8534h7763F4558K41992b5326k35452A23184c736
18669C0106c63985a49620O0278E7161a88911g9036B18047N420a24945A72621E7312
18657C59188d3771l0050D5659g1891F3042e824j70312L5490B30729c12210A61931
18645H8936b57396F215a79756c1717j5262B17965b7761a1840m02930d2454j89440
$$ y = [297748, 162337, -33503, 102219, -128303, -401749, -117221, 206909, -93170, -616, -129215, -72059, 36952, -103163, -102674, 127791, -78353, -128436, 121320, 52857, -39663, -61201, -40622, -17310, -97387, -180650, -209942, 194932, 178666, -303996, 349977, 206066, -13987, 484593, -336000, -76401, -122040, -108272, -85424, -226688, -197295, 47185, -224026, -250446, -66673, -81701, 128310, 141913, -45823, 78534, -87763, 64558, 306550, -25326, -260778, 123184, -3736, 30106, -363985, -149620, -89342, 57161, -188911, -79036, 218047, 223467, -124945, 172621, 57312, 359188, -43771, -73821, 45659, -71891, 63042, -5824, -176136, -140646, 230729, -312210, 161931, 88936, -257396, 6215, -179756, -31717, -46979, 217965, -27761, -11840, -414770, -42454, -231894]
18634b31894N4729L7216d9083j68971n1177A43383a00445l17058G0913A6278i5089
18622a1740k9025a861B9095a615k8521k80292C9193b31575H094a47505A97820
18610a03190E6724b59556A75847K2061a73714p3293J14547C00949a05871I2013
18599C23037b75352a19978A0334K233b64774P7494j40370i8369B15959p3217c49331
18587f5554B8265J11116M6151a09915k5162p7737R2892k22420R4879e9130k42837
18576c01967a00202o0252R375B7710O4075J63280j08921a91057Q5892j07046j66051
18565c78262a8632Q261k93727a32189j49045a8271k43028C80745b52453F2983
18554b97911a31616j40529k20217C29231b47715J06483k72672a74817f5200C06986
$$ y = [-231894, -177165, -139949, -49083, -218054, -269231, 143383, -100445, -417503, 70913, 16278, -95089, -11740, -40765, -1861, 29095, -1615, -30136, -310428, 39193, -231575, 8094, -147505, 197820, -103190, 56724, -259556, 175847, 197908, -173714, -247007, -132460, 300949, -105871, 92013, 323037, -275352, -119978, 10334, 12567, -264774, -187280, -327650, -98369, 215959, 142742, -349331, -65554, 28265, 139381, 185532, -109915, -135077, -212814, -119922, -342342, -247463, -59130, -301967, -100202, -160454, -151079, 27710, 91785, 255065, 146144, -191057, -105165, -212211, -378262, -18632, -10371, -304098, -132189, -281234, -18271, -261299, 380745, -252453, 62983, -297911, -131616, -272145, -492362, 329231, -247715, -141232, -413904, -174817, -65200, 306986]
18543b91460e0083o358p6195l00360B12088b27480b1433k45000J23133A52386
18532f4176j83238c0742o649j4727m0710j59338N4187d6889j14819b5014A5994
18520e6814J197k8928j46658j02420b5469j60336d791j69927D7715k3674c62538
18508b78102A4095i2543E8915b36148c9831j38268B24503H6871b0524D690L3634
18497C8324b39003c8342g26k69107C1151b87311b0008F3651a75914H2843J44446
18486B27289C7902f9172o0782N6209a9219p5076A09513a14243a8981C3109J75499
18475B08608a9905H1960B5527d29036A71397f2975j34149j8953C9726a0909k41866
18464b52775F5008a39506j8857A4609c09392h9826k37834b2309A59592b74631
$$ y = [-291460, -50083, -56441, -132636, -432996, 212088, -227480, -21433, -266433, -143300, 152386, -64176, -247414, -30742, -37391, -52118, -92828, -252166, -197979, -46889, -161708, -25014, 15994, -56814, -55617, -84545, -231203, -333623, -25469, -185805, -4791, -174718, 47715, 24041, -362538, -278102, 14095, -92543, 58915, -236148, -39831, -178099, 224503, 86871, -20524, 4690, 38324, -239003, -38342, -726, -269833, 31151, -287311, -20008, 63651, -175914, 82843, 227289, 37902, -69172, -129954, -73745, -19219, -94295, 109513, -114243, -18981, 33109, 208608, -19905, 81960, 25527, -429036, 171397, -62975, -197124, -216077, 39726, -10909, -252775, 65008, -139506, -158363, 14609, -309392, -89826, -327660, -22309, 159592, -274631]
18453b05497a6237D276a10611c8270n2858m5509A3323J28042b59521r550A05245
18441B14644c76962e2737j20993E8351f4597A34069C8173N6642C1428a27026A64840
18429f0564B17568b09991C285c27180D6707J0938b16442h7723I1034m1643O8733
18418A18124a23592c866B0961J15299b24326e2242r2237b3400k68563d8294m4239
18407i2533A52303c5290D75656A00636d2900l6997A41237C0650a95425B13501
18396c17215h869j00271A30565E3603j6403A8101J00561b35482i2553p2918f324
18384H5408j7895A5009g5202o7341E574d3054j41973g6916B83138a75109a6892
18372b0234k0623k43465A21826D6729a9515j15040A31763a71252h2220G6285g4013
$$ y = [-205497, -16237, 4276, -110611, -38270, -91128, -136637, 13323, 141365, -259521, -269071, 105245, 214644, -376962, -52737, -173730, 58351, -64597, 134069, 38173, 94815, 31428, -127026, 164840, -60564, 217568, -209991, 3285, -327180, 46707, 57645, -216442, -87723, 91034, 49391, 118124, -123592, -3866, 20961, 136260, -224326, -52242, -144479, -23400, -291963, -48294, -92533, 152303, -35290, 475656, 100636, -42900, -79897, 141237, 30650, -195425, 213501, -317215, -8869, -109140, 130565, 53603, 37200, 18101, 118662, -235482, -92553, -165471, -6324, 85408, 67513, 15009, -75202, -142543, 5574, -43054, -185027, -76916, 283138, -175109, -16892, -20234, -40857, -284322, 121826, 46729, -19515, -134555, 131763, -171252, -82220, 76285, -74013]
18360A81364O7648B0393M4610f3427A97128G2954C1548a39664j54940A00576J10310
18349B10886a53220f4508k09906G6639b36036a0702B3155f2472B2526c27696A78719
18337C1840J79867h9530o9784J5587A40471a50762O3507j09645G4401a33907B36330
18325a91872Q2234j57950e9206B79026B2499E701a35440L2484k32701I9382a52619
18313A154a48804L0033B39039B8925L17602I6735b08835D062J53745G7050c55625
18301H0435J98881a57488B02657a06406k68143J24689a19368k2084A03261d8431
18290b09896a8468O166j60371m6529A96282h9847k09239h8079A49480m6028A2355
18278b94953A9430J64689a01j2642l3437l4355J3898H4314J79082a98564e3137
$$ y = [181364, 249012, 20393, 65003, -63427, 197128, 72954, 31548, -139664, -294604, 100576, 210886, -153220, -64508, -274414, 76639, -236036, -10702, 23155, -62472, 22526, -327696, 178719, 31840, 211707, -89530, -159314, -143727, 140471, -150762, -87255, -196900, 74401, -133907, 236330, -191872, -109638, -267588, -59206, 279026, 22499, 5701, -135440, -102956, -335657, 99382, -152619, 1154, -148804, -118771, 239039, 28925, 346527, 96735, -208835, 4062, 157807, 77050, -355625, 80435, 279316, -157488, 202657, -106406, -374549, -249860, -119368, -141452, 103261, -48431, -209896, -18468, -12302, -172673, -219202, 196282, -89847, -299086, -88079, 149480, 103452, 12355, -294953, 19430, 184119, -101, -12743, -46180, -80535, -66637, 84314, 263396, -198564, -53137]
18266a30238J4490N4046O376a6783N333j7814o8085k28270C5860b12040b3734
18254B95114A07451J13815A2888N2486A8324M0424c37053f8272A99903b04008
18243b08859B8654J08161a95046k32989e282D5648a60737l428E8976M6769g1164
18231a04743E2694J50911b778p6075A66852O484o1863E0580f5906F4052i1660
18219C04572b04974a7421A888a34698d1873j36470M411H2495a48117q563B11187
18207a40431G1779i4984A220a01041j33389j77116A44M9204a32583H8498c44179
18195e3737j37184j8707J6020P3165B69239E4615R3972b1114E0107h9952o353
18184i6305l4856B37993c40595h5056k3017C54905a19453j06233E3769i2366A25882
$$ y = [-130238, -115748, -61702, -55326, -16783, -11450, -29264, -97349, -325619, 35860, -212040, -23734, 295114, 107451, 221266, 12888, 65374, 18324, 58748, -337053, -68272, 199903, -204008, -208859, 28654, 136815, -195046, -428035, -5282, 45648, -160737, -164165, 58976, 105745, -71164, -104743, 52694, 203605, -2778, -78853, 166852, 173336, 111473, 50580, -65906, 64052, -91660, 304572, -204974, -17421, 1888, -134698, -41873, -178343, -173932, 82495, -148117, -156680, 211187, -140431, 71779, -94984, 1220, -101041, -234430, -411546, 144, 49348, -132583, 88498, -344179, -53737, -190921, -209628, -193608, -120443, 269239, 54615, 148587, -21114, 50107, -89952, -96305, -131161, 237993, -340595, -85056, -108073, 354905, -119453, -225686, 53769, -92366, 125882]
18172I8571i135k72110A37226A2377L71085E087a92371O9199e0707A16535a47370
18160C1626a54011D6065f7318K2787D20422c81825a28938H5261m1806a41503C5328
18148a52370l3768r7162a9713f774A26495M4691G3896j3918b68769B1480J48513
18137A69993p4554J67909I615N3561a94269A23599a76154n2066d4736p2164L1965
18126h4935K0141B4960h5911M1947J7668C54573A7340c2665n5358o6779I4854
18114a3671q5128e347p3920j90232J24498j14496g6945j32832C5841a02434j05824
18103b08258D15982d87254R6936A5882a10243I4140L03648i7749B10761J35057
18093C45818a38038K2989A48389o0301e7834A30624c17059N2084c3235F4989d0630
$$ y = [98571, -9135, -281245, 137226, 12377, 383462, 5087, -192371, -123172, -50707, 116535, -147370, 31626, -154011, 46065, -67318, -44531, 420422, -381825, -128938, 85261, 43455, -141503, 35328, -152370, -186138, -283300, -19713, -6774, 126495, 171186, 73896, 59978, -268769, 21480, 169993, 95439, 263348, 9615, 63176, -194269, 123599, -176154, -228220, -44736, -116900, -84935, -64794, 24960, -85911, -43964, -26296, 354573, 17340, -32665, -88023, -154802, 94854, -13671, -98799, -5347, -79267, -269499, -145001, -259497, -76945, -209777, 35841, -102434, -208258, 415982, -487254, -390318, 15882, -110243, 94140, 397788, -97749, 210761, 345818, -138038, -115049, 148389, 88088, -57834, 130624, -317059, -264975, -33235, 64989, -40630]
18081f9557b5969l87964I2482K07716b39230E6552i9037c6370A79259a32666A88106
18069i8206k9113A00746j8276c147l20172J16578h2954j40056m2763j2903a7626
18057a12458k3743B30206j7316K51409a12819K3048j73388j8553E520f6272j42231
18046b08503C32966f1633k81568C0906h8410o7975o0589A10248d01188A44715
18035b61522A78063G6487k9009a44229A19955D4802K54202b99643a07771A38079
18024C5687D171b6244B29402g8176A90080K14658A53054b81673a22152O0542h923
18012a26966G3904j9749O0628a6178B28897B9176J72027N0187a18863A18874E0428
18000c8775e705A5950b42376N8589A1503K8095a79649B81695b1699k36148H0066
$$ y = [-69557, -25969, -413933, 92482, 300198, -239230, 56552, -99037, -36370, 179259, -132666, 188106, -98206, -127319, 100746, 82470, -3147, -323319, -206741, -82954, -223010, -265773, -278676, -17626, -112458, -136201, 230206, 212890, 464299, -112819, -89771, -263159, -281712, 5520, -66272, -208503, 332966, -61633, -343201, 30906, -88410, -156385, -216974, 110248, -401188, 144715, -261522, 178063, 76487, 47478, -144229, 119955, 44802, 299004, -299643, -107771, 138079, 35687, 4171, -26244, 229402, -78176, 190080, 404738, 153054, -281673, -122152, -61610, -8923, -126966, 73904, 54155, 114783, -16178, 228897, 29176, 201203, 251390, -118863, 118874, 50428, -38775, -5705, 15950, -242376, -183787, 11503, 39598, -179649, 281695, -21699, -257847, 80066]
17988A13577c7371j12007A12703b86830f5481j12147A76069d98571B26150c5794
17977C06446j14830b8786m0049m4735A6637b12309a4080A87350r2382N0161i8225
17965F6029j3842O4088c73693a2881B25934a46193G2963i9752m304A40387j1430
17954A28957D8583N5957c30864a21612E0350L6090l9496c827l8778A11951b8310
17942b30716A64405b08345A96759c08966P4285B40904c0095a4665p5569k22572
17932c12806B07071a09693j46131O8368E7896a71834J5113M8777A1436i1440m3414
17921a34854A25765C5864a87929O6549A28225R2958a38424C3882N42c10094A16088
17909h6310B51645f9712M945A27998L390P3015a80126a863j43246b4137e567A67223
$$ y = [113577, -37371, -149378, 112703, -286830, -65481, -177628, 176069, -498571, 226150, -35794, 306446, 191616, -28786, -68835, -113570, 16637, -212309, -14080, 187350, 94968, 145129, -98225, 66029, 52187, 116275, -373693, -12881, 225934, -146193, 72963, -99752, -104056, 140387, 128957, 48583, 104540, -330864, -121612, 50350, 86440, 46944, -3827, -42605, 111951, -28310, -230716, 164405, -208345, 196759, -308966, -234681, 240904, -30095, -14665, -90234, -312806, 207071, -109693, -255824, -187456, 57896, -171834, -156721, -107944, 11436, -91440, -134854, 125765, 35864, -187929, -121380, 128225, 221183, -138424, 33882, 34424, -310094, 116088, -86310, 251645, -69712, -64767, 127998, 131388, 204403, -180126, -1863, -145109, -24137, -5567, 167223]
17896a25536H6412e0445a4738b788n3339j60600A03885a2378j8511A83076b16580
17884h1805n592k04410A70388b9580B64593G5945a37436B8386a57280o7267D9688
17872a6012F7536J83140d0659j63367A70842J01691j13880Q7156a94120H0483
17861B04609N8746h3566A5307f1162j78300A61621D6209b00547B75052i5174D326
17849G6954J68229j11293A6274J11202D7731a6764j50263I9469D7675J3651J44147
17838B05473L3330E6393K34952c44887d0902a6893j60220B1242a74649G8481i9975
17826A40402h2989k24477B7204K6035a01747n9969j31493J3616i7381c4313r4731
17815a29044m5166D5477e113B08975G9143a13066l3833K6400p9782A40816C7517
$$ y = [-125536, 86412, -50445, -14738, -2788, -56127, -216727, 103885, -12378, -30889, 183076, -216580, -81805, -87397, -291807, 170388, -29580, 264593, 75945, -137436, 28386, -157280, -224547, 49688, -16012, 67536, 250676, -40659, -204026, 170842, 272533, 158653, 245809, -194120, 80483, 204609, 263355, -83566, 15307, -61162, -239462, 161621, 46209, -200547, 275052, -95174, 4326, 76954, 245183, 133890, 16274, 127476, 47731, -16764, -167027, 99469, 47675, 61326, 205473, 238803, 56393, 291345, -344887, -40902, -16893, -177113, 21242, -174649, 78481, -99975, 140402, -82989, -307466, 27204, 53239, -101747, -161716, -293209, -279593, -97381, -34313, -129044, -174210, 45477, -5113, 208975, 79143, -113066, -146899, -120499, -200281, 140816, 37517]
17803b26681a293B25504A6293O6487a18583r8074B0350b13414B18374e1874j06204
17792a58078p1451M3081c8251E8634M3670C6191a07713l9943A13077h0536o7234
17781a47770b4051H9674J360a43782H0418J86637G8606M6204M62874i6899A40189
17769a11140B69871C6561K59514G584N6666L54437a6435A58778a58961r5017O9686
17758a84292a8335A85955d62394H1571a15762C60591A74012b03557G2887b26953
17747b71239c0982m2898L5911B01041F7084M1023b52912i881K251A8633J9783
17736C8416a0645j41069J7351B3448J99684i1555A15761b9779A70066b98049F8988
17724A28777a95046h4332a1852p8566J6776r5711B32600j7568o3663J7077a5387
$$ y = [-226681, -1293, 225504, 16293, 82780, -118583, -216657, 20350, -213414, 218374, -51874, -158078, -229529, -186448, -38251, 58634, 102304, 36191, -107713, -147656, 113077, -80536, -147770, -24051, 89674, 91034, -143782, 80418, 267055, 78606, 124810, 587684, -96899, 140189, -111140, 269871, 36561, 296075, 7584, 64250, 418687, -16435, 158778, -158961, -253978, -184292, -18335, 185955, -462394, 81571, -115762, 360591, 174012, -203557, 72887, -226953, -271239, -30982, -73880, -37969, 201041, 67084, 108107, -252912, -9881, -7630, 18633, 38416, -10645, -151714, -134363, 23448, 223132, -91555, 115761, -29779, 170066, -298049, 68988, 128777, -195046, -84332, -11852, -90418, -73642, -169353, 232600, 215032, 151369, 168446, -15387]
17712B35753b07550I9763A7531g4672A00851L9074k9147b65354A57071J55293
17702C12364m5621c311B3834K37057D3964K38107n5110a57778j47292L9131A10269
17690A05995b02823d0435j49793A775J70198a5506A51640a04460C48178n1065
17680B97113g3383K0488B7107h2103L6198j6661l658A16425C2673P2915a37629
17668b04403A81553a15171A51776b0438A99763a78810A3761a81700e9725K4470
17658c5255q3220p9791G1685a28327E3986d4088A69071o0718a39169L0429B60142
17646A3635c6895B98197H6371P9514d250l5834k8124E3195a8707j16284k6519
17635a61510g0598B97306D974Q0328L6018J3600M7367G0694J2762l8825K25757
$$ y = [235753, -207550, 99763, 17531, -74672, 100851, 139925, 110778, -265354, 157071, 312364, 266743, -3311, 23834, 260891, 43964, 282071, 226961, -157778, -305070, -265939, 110269, 105995, -202823, -40435, -190228, 1775, 171973, -15506, 151640, -104460, 348178, 297113, -73383, -52895, 27107, -82103, -45905, -62566, -66224, 116425, 32673, 105588, -137629, -204403, 181553, -115171, 151776, -20438, 199763, -178810, 13761, -181700, -59725, -35255, -118475, -198266, 71685, -128327, 53986, -44088, 169071, 108353, -139169, -108740, 260142, 13635, -36895, 298197, 86371, 165885, -4250, -40084, -68208, 53195, -18707, -134991, -161510, -70598, 297306, 4974, 85302, 121320, 134920, 182287, 70694, 83456, 44631, 270388]
17624B70388c50610a63752A4870R007L5701a11087j1105C9317L0254c6500m2878
17613g9378H6443O7981a09521A61858e5309A21533a86106P5827A33891D3719K56278
17602B99997a99245C00028c7112A98281M0876c1278C78461H0077a60061I8643
17591a14617C02781A3308c0340H077K16378a37101c5556n8913j53904B09421c9875
17579b6474A3099b13175A96098h3198D2990R6888c27073f6609A16676O6546h7338
17567B09401K0855F1288a4552k74171a14341n1472D19624A96387a16795B5143
17556a0278k05733f1228A15370e01C26168F6126j7833J44061L9591a8062E6675
17544a34944H0309J47665H9434M26764a12494B56798p4177a14145N2657D22428
$$ y = [270388, -350610, -163752, 14870, 23877, 59578, -111087, -122192, 39317, 69571, -36500, -79378, 86443, 154424, -109521, 161858, -55309, 121533, -186106, -110279, 133891, 43719, 299997, -199245, 300028, -37112, 198281, 239157, -31278, 378461, 80077, -160061, 98643, -114617, 302781, 13308, -30340, 8077, 224455, -137101, -35556, -94469, -248373, 209421, -39875, -26474, 13099, -213175, 196098, -83198, 42990, 139878, -327073, -66609, 116676, 183222, -87338, 209401, 230256, 61288, -14552, -288723, -114341, -165813, 419624, 196387, -116795, 25143, -10278, -216011, -61228, 115370, -501, 326168, 66126, 48293, 192354, 231945, -18062, 56675, -134944, 80309, 227974, 89434, 516198, -112494, 256798, 182621, -114145, -61488, 422428]
17533A35834K07506c5807r082A16033a82862c2523D5814A7994J64814o9420J68773
17522B82161b34984A5699o01p396a32256A64262a09000F4202a67632g305l3154
17511d0459A40681a06771p4819G78a37245j59038E9115h7513B86829j06695k3506
17500A56628B7285J88186p4127R2983K23322D1854K99854j9265C813J16711K18040
17489C38564r1398a8066C86519A25764Q4213M9107j19545b37566M2673B1177K39624
17478B60801k4791r4403j5902c07752A58400o9862b32790B20758K48524A61209
17467B18624A05644J00799K20061K0562j88987a55239A7177J20484n5751k448
17457G9462J69187b23253F5885R9307a84039A43047K31906g844B76202A11221
$$ y = [135834, 343340, -35807, -44889, 116033, -182862, -32523, 45814, 17994, 182808, 113388, 282161, -234984, 15699, 15098, 7702, -132256, 164262, -109000, 64202, -167632, -7305, -40459, 140681, -106771, -181590, 778, -137245, -296283, 59115, -87513, 286829, 180134, 156628, 27285, 215471, 141344, 234327, 457649, 41854, 341708, 322443, 3813, 120524, 338564, 247166, -18066, 386519, 125764, 209977, 259084, 139539, -237566, -194893, 21177, 260801, 236010, 141607, 125705, -307752, 158400, 88538, -232790, 220758, 469282, 161209, 218624, 105644, 206443, 426504, 447066, 258079, -155239, 17177, 137661, 81910, 79462, 248649, -223253, 65885, 165192, -184039, 143047, 374953, -7844, 276202, 111221]
17446e1969A45070L5302a36109B22719f0380G8339L41276j70249K09977e7425
17435h9483B19864i4404b2076n1513A46825n1200L4652k3484B5847P5396M1068
17424A42311J01914i4378A42583N0748J20665Q3197R0467h3125H0510K8176q401
17413A00285K32093O3097C6812D38a22395B90024E2982J0306K09223F6806m353
17402F2453P3361J10654M8663M4025j42338a49732I9909J25644M5444j30127B1423
17390F86184j98339E7331K16232a46859A93673q2753K11444A3620A328J62821
17380A64149e2245j9848A15264J89419D7116n729g9623C38833A30087J35798J961
17369B67846a46087L9192D95486A99421P3214h3036j21934D72274k05166L8294
$$ y = [-51969, 145070, 180372, -136109, 222719, -60380, 78339, 419615, 249366, 459343, -57425, -89483, 219864, -94404, -22076, -73589, 146825, 95625, 130277, 106793, 25847, 101243, 142311, 244225, -94378, 142583, 193331, 313996, 397193, 487660, -83125, 80510, 108686, 100285, 332378, 395475, 36812, 438, -122395, 290024, 52982, 63288, 272511, 66806, 62453, 135814, 246468, 295131, 339156, 196818, -149732, 99909, 225553, 270997, 140870, 21423, 686184, 487845, 57331, 273563, -146859, 193673, 110920, 322364, 13620, 1328, 164149, -52245, -72093, 115264, 304683, 47116, 41387, -79623, 338833, 130087, 265885, 267846, -146087, -106895, 495486, 199421, 272635, -83036, -204970, 472274, 267108, 305402]
17359C05402G1122h2768B24683n070A2129J06606K6485Q0161e713A2189J2636
17348B4825M84273g8875A62814J3509M3986b1115j03851A25854K22510b94874
17337e8980G4534P3903n8455J53564N1581j40435E3221L89390m5574F5774L0229
17326I6003D4512L05625r4414C4537o292J09985o5115A3087K33403l2703p2198
17315A41589K125C7485J65457J01288J55774J1820A28209K77189a30344L2912
17305i7432C46937G2268L6127N5748m9932a79159A76004D3231N9909k9581N212
17294G8771M5885K63535A4416a7542A35450P5132J91841o8598K8796F4633K00715
17283B65348J01648i1890A97363K96348A19960M6268l2936R7184F2291O6537C2773
$$ y = [305402, 71122, -82768, 224683, 219613, 12129, 118735, 145220, 225381, -5713, 12189, 24825, 509098, -78875, 162814, 176323, 220309, -21115, -124966, 125854, 348364, -294874, -58980, 74534, 148437, 89982, 243546, 295127, 154692, 53221, 442611, 397037, 65774, 96003, 44512, 350137, 255723, 34537, 28245, 138230, 73115, 13087, 246490, 213787, 141589, 143714, 37485, 202942, 304230, 460004, 471824, 128209, 405398, -130344, -97432, 346937, 72268, 108395, 164143, 114211, -179159, 176004, 43231, 103140, 73559, 78771, 124656, 388191, 14416, -17542, 135450, 210582, 402423, 333825, 362621, 64633, 265348, 366996, -91890, 197363, 493711, 119960, 166228, 133292, 230476, 62291, 128828, 32773]
17271B26517J60859p1008G5141M81352F9438K63059e5407B42623N2396P5789D4277
17259A34334P8165J00815L7318C7094j4645D959K07664P7876q7043Q7626K6307
17248C17389o6525a92984A65118e7685C21967I3019J2021r668B4522M28898j82383
17237B71037J56435j67216I9837C9153J10442K41073j32093J6053J78093j58810
17227B93911a55143D07321c7274A67987K90597b12403E65199B72761K64307j93806
17217C43262n341A19814R5765g0921C23448j18907o9259J60325M11558A78576
17206B61547D7868K24372r2273J91356A12952L91412j57641m2623I6240N4015
17196A50255a60795C35146H6571J19095n0369G7298Q2408n2921O5501J41885j55685
$$ y = [226517, 387376, 316368, 75141, 556493, 69438, 332497, -55407, 242623, 295019, 370808, 44277, 134334, 212499, 313314, 350632, 37094, 22449, 4959, 212623, 290499, 203456, 291082, 317389, 250864, -192984, 165118, -57685, 321967, 93019, 105040, 95372, 24522, 453420, 271037, 427472, 260256, 99837, 39153, 149595, 390668, 258575, 274628, 452721, 293911, -155143, 407321, -37274, 167987, 458584, -212403, 565199, 272761, 537068, 343262, 337921, 119814, 215579, -70921, 323448, 204541, 135282, 295607, 707165, 178576, 261547, 47868, 272240, 179967, 371323, 112952, 504364, 346723, 304100, 96240, 150255, -160795, 335146, 86571, 205666, 155297, 77298, 159706, 106785, 172286, 314171, 158486]
17185A58486J15891j8738C4304M18970j15237m6023P2552r4186j195h2682K5554
17174e7128p0595D4209L84221j6041A90261M1704C7240L13191q3045P6639G5274
17162e8922A80019O81K90324j25520Q9086q0308q3236K06562j60494J17525k12492
17151B22147N6137j19866L93270k16440A61372K0194J84593N2768F1415K54707
17141C16122j43470K78766K3193q1895a9756B84394n9203R5562j37916L7290J73805
17130C93932A76212J01316J23094a42099D19047j78044L74369j68586j82395M0552
17120C04943j45956l1668N32385C23182K62808j08284j57399r2328O0421O4033
17110C52433R1426E2934N32617B44255O1623J04644L28716B85200J72533p0339
$$ y = [158486, 274377, 255639, 34304, 453274, 338037, 292014, 364566, 270380, 269185, -82682, -57128, -127723, 44209, 428430, 412389, 190261, 231965, 37240, 350431, 267386, 344025, 75274, -58922, 180019, 180700, 471024, 345504, 434590, 354282, 271046, 477608, 317114, 434639, 222147, 278284, 158418, 551688, 335248, 161372, 181566, 366159, 418927, 61415, 316122, 172652, 451418, 474611, 392716, -19756, 284394, 225191, 320753, 182837, 220127, 393932, 176212, 277528, 400622, -142099, 419047, 241003, 615372, 446786, 264391, 304943, 158987, 127319, 659704, 323182, 585990, 477706, 320307, 227979, 288400, 352433, 443859, 52934, 585551, 244255, 305878, 410522, 739238, 285200, 457733, 387394]
17100C87394R7034K46757B86854K04187j40307A6821N47431p3393K7554J95997
17090G14410j64539B74280J72674K60080k5436k14227j77737M358J26725K6081
17080D46798N324J0298K56126k89352L53347k60887B29830L62346B44612M07129
17070F51741k77910j54516K67408L2581l7681P3751n4096K6659J48909k80474
17060C96372J75839k74535J89486k16841K43328k30861K82260k08608P5148J90362
17050F21950R8156A04872M65394J11345K7768l9935j91436k7736J8516J72328
17040F41116k98497J67920j50792K25479J04031l35293K80878k54817N136K12620
17030E97781q7113P1952j60091K13025o8197L58168m39915J32200j81442J46195
$$ y = [387394, 484428, 731185, 286854, 491041, 350734, 16821, 564252, 490859, 518413, 714410, 549871, 274280, 446954, 707034, 681598, 467371, 289634, 293992, 420717, 446798, 452122, 462420, 718546, 429194, 782541, 521654, 229830, 592176, 244612, 651741, 373831, 219315, 486723, 519304, 481623, 555374, 501278, 527937, 676846, 396372, 572211, 297676, 487162, 270321, 513649, 282788, 565048, 356440, 431588, 621950, 720106, 104872, 570266, 681611, 709379, 669444, 478008, 450272, 468788, 641116, 342619, 510539, 359747, 585226, 689257, 353964, 634842, 380025, 385161, 597781, 510668, 582620, 422529, 635554, 567357, 925525, 485610, 617810, 436368, 582563]
17020E82563j93707P6760Q8710M3416j10743L48124j45080l3981Q5160k21570
17010E19652L48724j90647J46627A46150N32857K32878j27694J86012l16961k3637
17000F29605j1970j72083M57123O2739j42855Q1308l80144J94227K89769l30925
16990F76794J86651j22257K66403j69986Q2981j81156J65400k23861J04201l23526
16980D61644K52079n7051J56748C76448K28496L52775M625J6558j56253r1801
16970G30848M10396k45839M2066l56979K08060O069M7472o9026J9952M7778k77959
16959E62838J95819N05489l49709K72621K6339n12831K79220j6666k405k31695
16949G29020N02224p4387Q8627J23818m40603L8032J71754j41528k950L80936
$$ y = [582563, 388856, 465616, 554326, 597742, 486999, 835123, 690043, 656062, 741222, 519652, 868376, 677729, 824356, 146150, 679007, 911885, 784191, 970203, 653242, 629605, 617635, 445552, 902675, 965414, 822559, 903867, 523723, 717950, 1007719, 676794, 863445, 741188, 1007591, 837605, 920586, 739430, 904830, 680969, 785170, 461644, 713723, 656672, 813420, 376448, 604944, 957719, 962344, 978902, 822649, 730848, 1141244, 895405, 937471, 580492, 788552, 794621, 842093, 773067, 793019, 840797, 562838, 758657, 1264146, 914437, 1187058, 1213397, 700566, 979786, 963120, 960715, 729020, 1231244, 1156857, 1245484, 1369302, 928699, 966731, 1138485, 996957, 994007, 1374943]
16939A374943k47862k7649P3154J15738n290K79311L0352p65021M51403L45404
16929A624483k23065k47950M3149K03201k79629N61703l24515J05630j66016Q9582
16919A386573j36956P3502K89202k26120K9724j44431J05762K9564M8106J19034
16909A573960j57088n7579K57013J51599q8624p7992j97101L52461L9836j54702
16899A641783M3518r7032L07471n47533L36543O0526J63170J7001K408l4008j73889
16888A719958j52762N33889k42820M32704l58778m257K20420j30274q7772K18176
16878B148484m1449J44089J56084l46348K78003k053J50820j63124r1825J914
16868B234595j11236L42447K63687l76903M17561j89763j27744J47746K21670
$$ y = [1374943, 1127081, 1099432, 1172586, 1288324, 1283034, 1562345, 1592697, 827676, 1279079, 1624483, 1401418, 1153468, 1196617, 1399818, 1120189, 1681892, 1357377, 1463007, 1296991, 1386573, 1249617, 1323119, 1612321, 1386201, 1415925, 1271494, 1377256, 1406820, 1454926, 1573960, 1416872, 1359293, 1616306, 1767905, 1679281, 1601289, 1404188, 1756649, 1796485, 1641783, 1685301, 1588269, 1895740, 1348207, 1684750, 1745276, 1908446, 1925447, 1927855, 1893847, 1719958, 1567196, 2101085, 1858265, 2290969, 1932191, 1927934, 2148354, 2018080, 1930308, 2148484, 2107035, 2251124, 2407208, 2060860, 2338863, 2336810, 2487630, 2324506, 2232681, 2234595, 2123359, 2465806, 2729493, 2352590, 2770151, 2580388, 2452644, 2600390, 2822060]
16859B822060o118k27977O73065j4425l03969J85423j70360l49668K00478M13452
16849C221961P3622R1260j40517j59110O2497J36701M7773O9425L44649k24173
16839C524088N4820o0867O5731K82232J01655k37440J50829L96730j92911O9718
16829D154585L56702N7671l96848M55549j63095K03514k1935L13702L0895M09010
16819E399750l00430K49080J51254j44384M41711J23439m6825r5573M46232l71430
16809E852824L68772L40330k46842O37589p9996K78339j14631M31227j53850O77387
16799G991149p9668J52200r1103M78786L0837O8892L27514K42010L63482K67073
16789I751172J95906R4892K97557L23434M05275M32092n2075P55414J49494L01850
$$ y = [2822060, 2815942, 2587965, 3261030, 3246605, 2942636, 3128059, 2957699, 2608031, 2808509, 3221961, 3295583, 3386843, 3246326, 3087216, 3149713, 3286414, 3334187, 3403612, 3748261, 3524088, 3578908, 3518041, 3583772, 3866004, 3967659, 3730219, 3881048, 4277778, 4084867, 4154585, 4511287, 4568958, 4172110, 4627659, 4464564, 4668078, 4646143, 4959845, 4990740, 5399750, 5099320, 5348400, 5499654, 5355270, 5796981, 5920420, 5873595, 5778022, 6224254, 5852824, 6221596, 6561926, 6315084, 6952673, 6872677, 7151016, 7036385, 7467612, 7313762, 7991149, 7911481, 8063681, 7972578, 8451364, 8482201, 8551093, 8878607, 9120617, 9484099, 9751172, 9947078, 10041970, 10339527, 10662961, 11068236, 11500328, 11448253, 12203667, 12353161, 12655011]
16779A2655011M56113J53462O41232M46015N43216L71806O85615K94579M78809
16770A6725858P67332M48049Q18654O85132R11223P59062M97735P03538P18663
16761B3035246J083566R99535P14617J658302J286012Q33655J425641J153672
16753C2190246J670575J664158J833829J408204J872057K161670K434330K103971
16745D7339040K531212K936529K991435K952278L525396L525182L774338M457245
16737G4032655M402809M922296N080012N572855N726442O268265O716567P016469
16729A19738370P368370P582498P925743P958710P629755Q054719P348556P125631
16721A80732352O006144M964390M405528K443219J224939j04957j820076k908048
$$ y = [12655011, 13111124, 13264586, 13905818, 14351833, 14895049, 15266855, 15952470, 16247049, 16725858, 17493190, 17941239, 18759893, 19445025, 20356248, 21115310, 21613045, 22316583, 23035246, 24118812, 25118347, 25832964, 27491266, 28777278, 29610933, 31036574, 32190246, 33860821, 35524979, 37358808, 38767012, 40639069, 42800739, 45235069, 47339040, 49870252, 52806781, 55798216, 58750494, 62275890, 65801072, 69575410, 74032655, 78435464, 83357760, 88437772, 94010627, 99737069, 106005334, 112721901, 119738370, 127106740, 134689238, 142614981, 150573691, 158203446, 166258165, 173606721, 180732352, 186738496, 191702886, 196108414, 198551633, 199776572, 199671615, 197851539, 194943491]
16713A94943491m646233n654531o245131p977034p202644q053943q319898p888614
16705A38955463q224471p776203p270711o987091o928138o346052o088653n419724
16697H3914420m749239n251038m321111l788095m173490l480927l351790k907487
16689E1891243k934793k624914k801817k281771k114537j865586j409425k245382
16681C3613018j534603j535039j693816q23040j244770p87038j694162p86132
16673B3514418j320653l78254r69760j030395q72046n16293q45027p74196k78824
16664A6528970p29391m97329m65692o23483o31491l6995k48749p98978k42264
16655A2254598l79407o22714j20217m79806m42644k48863j44799n75039l77430
$$ y = [194943491, 190297258, 184642727, 178397596, 170420562, 163217918, 155163975, 146844077, 138955463, 130730992, 122954789, 115684078, 108696987, 101768849, 95422797, 89334144, 83914420, 79165181, 73914143, 69593032, 65804937, 61631447, 58150520, 54798730, 51891243, 48956450, 46331536, 43529719, 41247948, 39133411, 37267825, 35858400, 33613018, 32078415, 30543376, 28849560, 28026520, 26781750, 25994712, 24300550, 23514418, 22193765, 21815511, 20845751, 19815356, 18943310, 18427017, 17581990, 16807794, 16528970, 15799579, 15302250, 14836558, 14213075, 13581584, 13544589, 13295840, 12496862, 12254598, 11875191, 11252477, 11132260, 10652454, 10209810, 9960947, 9816148, 9241109, 8863679]
16646H863679j51358N887m17842j63087l15090k87587J3542m52776J90582l81017
16636F904933P9431o02438J83055m6092m12442k25122k3747k4244n26551J84691
16626E491474m14295J60578k7995m62009J65636J75934m03106j0858O1520k67674
16616D469205j3029j94975Q1561j7373m68735J92311m68548J11359k00580J13755
16606C604951l18507R6410l5170M3417l39594K01084m4664l01798K79121k24897
16596B960353N10062o48474K11624j55114j65567k84249M4650k14845L82824l48070
16586B293194K3831K31079j68546P64j02081m05389L90854j67679l2246J49370
16576B213151l39604J82302k44181j41276N55071m65949K8446L12445O4830k45464
$$ y = [8863679, 8712321, 8718208, 8300366, 8137279, 7822189, 7534602, 7548144, 7095368, 7285950, 6904933, 6984364, 6381926, 6564981, 6518889, 6106447, 5881325, 5857578, 5833334, 5306783, 5491474, 5077179, 5237757, 5209762, 4747753, 4913389, 5089323, 4686217, 4675359, 4736879, 4469205, 4456176, 4261201, 4342762, 4325389, 3856654, 4048965, 3580417, 3691776, 3491196, 3604951, 3286444, 3382854, 3347684, 3391101, 3051507, 3252591, 3207927, 2906129, 3185250, 2960353, 3470415, 2821941, 3033565, 2878451, 2712884, 2428635, 2473285, 2258440, 2641264, 2293194, 2317025, 2548104, 2379558, 2380322, 2278241, 1872852, 2263706, 2096027, 2063781, 2213151, 1873547, 2055849, 1811668, 1670392, 2225463, 1759514, 1787960, 2100405, 2165235, 1919771]
16566A919771L8143j92311l6275j06884K39469q6514n605j70118k8023J27625
16556A699278j64519j85840R4421k75772N31582N958q1190m89785N71338k03116
16546A502355k03112N6127o8058p6308K6203O0735L07675n15595J8920J66635
16536A275577k74418M87922m65905K49507l41743M04930p5486P4249l28516J47780
16526A153897r5687j2757Q1642k32115R6836J24860l04333K11209Q910q4372j68176
16515G79914m8454J01240k24110o4953M50131j8191l93720N46812j02684k21519
16505H04466m5197j68058K33525J11311l00165j4859K15507C62111P93784m04998
16495G50897O9990P1934l40877M0809J0581A99641M53006L46124l26789o317K00207
$$ y = [1919771, 1957914, 1765603, 1729328, 1622444, 1861913, 1775399, 1769794, 1599676, 1571653, 1699278, 1534759, 1348919, 1443340, 1167568, 1699150, 1705108, 1623918, 1134133, 1705471, 1502355, 1299243, 1355370, 1287312, 1211004, 1237207, 1297942, 1605617, 1090022, 1108942, 1275577, 1001159, 1489081, 1023176, 1272683, 930940, 1335870, 1260384, 1334633, 1006117, 1153897, 1058210, 1045453, 1127095, 894980, 991816, 1116676, 812343, 1023552, 1032462, 948090, 779914, 731460, 832700, 608590, 543637, 993768, 975577, 581857, 1128669, 1025985, 804466, 759269, 591211, 824736, 936047, 635882, 621023, 836530, 362111, 1155895, 750897, 820887, 892821, 551944, 592753, 603334, 199641, 652647, 998771, 671982, 665665, 865872]
16484H65872j52617J06423l11852J96665K98947C95861M26231l03262L10117j35954
16474F92993j69798m5549J22571Q2331l9930p45j95707J38243k33123K80554N6878
16463F88718R5294C65919K38838J22825k97260L55492j65484j76276j99229M09201
16453F54026k20007O5932N2090j7003B24669J41796j63365K24845N1271j25302
16443C53914L00214j53447J5447J5750n3703I7661L47556J15001A55879J92600
16433C48479P0266M17727A75116N61367g0105B41630O9943O8336n1105p966R1705
16422D12543j8349j56358J33545L2053j67011R9745j7303J60178B14734m0605
16412A74129Q4185j25365K08679d9710B60804b7663A96854K58386j00518r8826
$$ y = [865872, 713255, 819678, 507826, 704491, 1003438, 395861, 822092, 518830, 828947, 692993, 523195, 477646, 600217, 682548, 642618, 641873, 446166, 584409, 351286, 631840, 688718, 784012, 365919, 604757, 727582, 430322, 785814, 620330, 444054, 244825, 654026, 434019, 499951, 552041, 535038, 224669, 366465, 203100, 427945, 479216, 353914, 654128, 500681, 516128, 531878, 478175, 97661, 445217, 560218, 155879, 348479, 418745, 836472, 175116, 736483, -70105, 241630, 311573, 379909, 328804, 320838, 412543, 394194, 237836, 371381, 403434, 236423, 336168, 318865, 479043, 214734, 174129, 258314, 132949, 341628, -49710, 260804, -27663, 196854, 455240, 354722, 255896]
16402B55896j8957J52038A31458K74115j93109J08008J13856k07710H9188Q3826
16392A73014R0121j2490K05427A31400J63484b7170A52023J85000a72862B40279
16381a4954A19119J71082K645m4903K87724A42898J82043K4050L636i6638A20001
16369B88048m2913q726K94103F7653K17054K30729j91364A53873K9143n1459J88569
16358C20126K1859k4353A29431M64820k04375E7641M37504j12949j60490J75107
16348C96813j75242A08667K09373b19851e5200A93266J95745A64837C8726a63845
16337E12023F1358A1434K91818c6171D3836J46283q9763J04303a25814A9927J34671
16326A54598J72496j58828g7883n4102A63679P5224e703A34649m4932N9076n067
$$ y = [255896, 236939, 388977, 131458, 405573, 212464, 320472, 434328, 226618, 89188, 173014, 263135, 250645, 456072, 131400, 294884, -27170, 152023, 337023, -172862, 240279, -14954, 119119, 290201, 292846, 247943, 535667, 142898, 324941, 348991, 352627, -96638, 120001, 288048, 245135, 236409, 530512, 67653, 284707, 515436, 324072, 153873, 183016, 131557, 320126, 341985, 317632, 129431, 594251, 389876, 57641, 495145, 382196, 221706, 396813, 221571, 108667, 318040, -219851, -55200, 193266, 389011, 164837, 38726, -163845, 512023, 61358, 11434, 303252, -36171, 43836, 190119, 100356, 204659, -125814, 19927, 154598, 327094, 168266, -77883, -131985, 163679, 238903, -5703, 134649, 89717, 148793, 143726]
16315A43726R3906K6986f5874B10926l3764D0907l508K39711p5385J23253j23507
16304B01471A6753L65441a21877A61664N386D7083j5761K30785M6645a39084G5432
16292C44274a03648N0033D79359A23217L9790J76201G6834c1031B1651N0965R9175
16281A71791M9447c78614A73847q0420K57810f2789c27A01106h898E9759a6148
16269A79704B4376b28213f164C51177G9249f2029A29964k3733K1200L7789H1965
16257A65839n736J95317E1025K04756a08385I8999d8632A38101N2168P0482A08870
16245A34719c5593j47429g2936o7301D914N3598a87075A96590b04361B00858E4052
16233A01376Q5056h1845a6849A2140b50691A71220M3321a64449A06078Q0685K25322
$$ y = [143726, 237632, 264618, -65874, 210926, 177162, 40907, 37399, 277110, 201725, 324978, 201471, 16753, 382194, -121877, 161664, 167050, 47083, 31322, 262107, 308752, -139084, 75432, 344274, -103648, -53615, 479359, 123217, 163007, 339208, 76834, -31031, 21651, 72616, 171791, 221238, -378614, 173847, 93427, 351237, -62789, -327, 101106, -8898, 59759, -16148, 179704, 24376, -228213, -6164, 351177, 79249, -62029, 129964, 106231, 127431, 165220, 81965, 165839, 160103, 355420, 51025, 255781, -108385, 98999, -48632, 138101, 190269, 260751, 108870, 134719, -35593, -183022, -72936, -140237, 4914, 58512, -187075, 196590, -204361, 200858, 54052, 101376, 186432, -81845, -16849, 12140, -250691, 171220, 214541, -164449, 106078, 186763, 412085]
16222D12085a40263A42798a83417A27609D9601J68523a01665l0307a5821B59462
16211e8450j81405H7045C921a23225A43061K35088C0448a26399K192d3534A09301
16199A24483c23715a46456e1678D7062f6557C64130C4651Q3766K34851h3974C26315
16187a26020A23696f1305k4430K2123j35785H3369J06436D833b14503A94943E2033
16175f3728A1417Q1193A2839J19157a20282k12150A75880J02297g567G4004J58772
16164B32776b33894A35283F1807f3387d33k28540O2860g3142k07310N7014D40076
16152B62586c1111l65962B6329a33444A83510K1315b00072A83251a7005E6123
16141I9779Q985J91006b94179C43977c11710A35422b5370H5134a64747B71644
$$ y = [412085, -140263, 142798, -183417, 127609, 49601, 218124, -101665, -131972, -15821, 259462, -58450, -239855, 87045, 3921, -123225, 143061, 378149, 30448, -126399, -124207, -43534, 109301, 124483, -323715, -146456, -51678, 47062, -66557, 364130, 34651, 118417, 353268, -83974, 326315, -126020, 123696, -61305, -85735, -63612, -199397, 83369, 189805, 4833, -214503, 194943, 52033, -63728, 11417, 92610, 12839, 131996, -120282, -332432, 175880, 278177, -7567, 74004, 232776, -233894, 135283, 61807, -63387, -433, -228973, -166113, -73142, -280452, -223438, 440076, 262586, -31111, -397073, 26329, -133444, 183510, 204825, -200072, 183251, -17005, 56123, 99779, 108764, 299770, -294179, 343977, -311710, 135422, -25370, 85134, -164747, 271644]
16130f7930D2696L21109j77336a40238C6141b29151B18922J43331A68371b60086
16119A93163b6794C14006b72804a7272B74706c1444n9801j92860G0656J66268
16109B36924A12548B858b67084H7072a05970H4420a2928D5949e086B91367D7124
16097b00641A07960Q7458a23551N4985B23433E112c06409A92172f8129O726A27028
16085g8903A74410a48834d1934A25882J23282j9477a71054j41269B18399a43128
16074C2867a8302C2066J76042J82745A11341J04591L1055C7194a30988L6848j77997
16063b72137D6150H008Q5487e9224q9999l44789B0445R0786J39924A293b62958
16051a14475m0021A35578J08953C7309m409b31642A68251i7501d1867a969l2204
$$ y = [-67930, 42696, 363805, 186469, -140238, 36141, -229151, 218922, 362253, 168371, -260086, 193163, -26794, 314006, -272804, -17272, 274706, -31444, -91245, -284105, 70656, 236924, 112548, 2858, -267084, 87072, -105970, 84420, -12928, 45949, -5086, 291367, 47124, -200641, 107960, 195418, -123551, -68566, 223433, 5112, -306409, 192172, -68129, -61403, 127028, -78903, 174410, -148834, -41934, 125882, 249164, 229687, -171054, -312323, 218399, -143128, 32867, -18302, 32066, 208108, 390853, 111341, 215932, 246987, 37194, -130988, -94140, -272137, 46150, 8008, 93495, -59224, -149223, -494012, 20445, 111231, 251155, 1293, -262958, -114475, -154496, 135578, 244531, 37309, 32900, -231642, 168251, -97501, -41867, -1969, -34173]
16040c4173B14223k6050c8255k83937a09794b6440j0347G9971a35103C1680b9175
16028a92728f3213p665L3436j24879a3217C6014e8712j16599B35053c8985H3752
16016i534B46045B3244b85435A45288j5291a09152C19873A57832f4261o0017o1978
16005a86256B0612J77774a32490B31793H616J96534F1050a9743j05550e3042j96805
15994b49847a08244F28a09923q8383A32651N7181E4386J73185a88771B43674P9795
15983C23469i0410h302B48549K0010F6601r612J13763i8659k7654e6782E7c02938
15970b199j77527l4687C27114a47668j58336a32112l7592k7932n6407B12237F52
15958C28774D5557d55297A13915e5176j69062E959a29691A71766a03115j6973
$$ y = [-34173, 214223, 188173, -38255, -322192, -109794, -26440, -36787, 79971, -135103, 31680, -29175, -192728, -63213, -70878, -37442, -162321, -13217, 36014, -58712, -175311, 235053, -38985, 83752, -9534, 246045, 23244, -285435, 145288, 129997, -109152, 319873, 157832, -64261, -124278, -186256, 20612, 198386, -132490, 231793, 8616, 205150, 61050, -19743, -125293, -53042, -249847, -108244, 628, -109923, -198306, 132651, 189832, 54386, 227571, -188771, 243674, 323469, -90410, -8302, 248549, 268559, 66601, 56989, 170752, -98659, -126313, -56782, 57, -302938, -2199, -179726, -214413, 327114, -147668, -306004, -132112, -169704, -197636, -254043, 212237, 652, 328774, 45557, -455297, 113915, -55176, -224238, 5959, -129691, 171766, -103115, -120088]
15948a20088n2309A1410J3054a83588g7823A53974J27017b46613i459j36405A50680
15936b4912b030B1623a31633A91328i4423B42816h0796A61524a66942E089J89598
15925A94687e3353k12784G892L1845f3132j9315j7778A9324f7314B5297J60279
15914A85576q0027c51668D7949a6278E3683a85543b8622H9458a27898r8062l03838
15903e29798a6892l03815A69643f6311k27861P9774h2312a4991n5807j45681l6363
15892b52842a13909b6268B0519e20385a6558q7363B0900a36412A22319b46989
15881d1989A26931k9406B6959c8913O699p3639q9197A4430D756a44684A87843
15869H5337J31066f3621A17657b5506I5139a65104A35668a43153d4188j89423
$$ y = [-120088, -172397, 11410, 24464, -183588, -77823, 153974, 280991, -246613, -9459, -145864, 150680, -24912, -2030, 21623, -131633, 191328, -94423, 242816, -80796, 161524, -166942, 5089, 194687, -53353, -266137, 7892, 39737, -63132, -82447, -100225, 19324, -67314, 25297, 185576, 105549, -351668, 47949, -16278, 53683, -185543, -28622, 89458, -127898, -225960, -529798, -16892, -320707, 169643, -66311, -294172, -214398, -82312, -14991, -70798, -216479, -252842, -113909, -26268, 20519, -520385, -16558, -103921, 20900, -136412, 122319, -246989, -41989, 126931, 97525, 26959, -38913, -32214, -105853, -195050, 14430, 4756, -144684, 187843, 85337, 216403, -63621, 117657, -25506, 95139, -165104, 135668, -143153, -44188, -233611]
15859b33611B60558A7893c00634M6983R0944A63453K5456a60201a0266l30974
15849c41240a6781p6958C7620a7991j82955Q9956d8155A09814i5514E1311e4692
15837f4916q4803A32537a43278k5562G025K54533D0097c9281j47079c6424A18199
15825a04939q8818g1441A4483a89334Q244B50638f7714F34b38059E2373b1511
15813a05155j74995Q1271A23644P3498b1308A89662b3796j13426a3896A62300
15802A6203c50411B6207f8577B4123J2783j7277Q0654L1299b75292e1268C912
15790B505f9097j46206b2554j39764e9979j74077B1430c8209k1591o213l3941
15779i9954j5654r4853E6250M69262i1330q9950G6759c5703C2636a35530m8812
$$ y = [-233611, 260558, 17893, -300634, -253651, -162707, 163453, 188909, -160201, -10266, -341240, -16781, -93739, 37620, -17991, -200946, -110990, -48155, 109814, -95514, 51311, -54692, -64916, -149719, 132537, -143278, -168840, 7025, 261558, 40097, -39281, -186360, -36424, 118199, -104939, -193757, -71441, 14483, -189334, -181090, 250638, -67714, 634, -238059, 52373, -21511, -105155, -280150, -198879, 123644, 197142, -21308, 189662, -23796, -137222, -13896, 162300, 16203, -350411, 26207, -68577, 24123, 36906, 19629, 100283, 131582, -275292, -51268, 3912, 2505, -69097, -215303, -22554, -162318, -59979, -234056, 21430, -38209, -59800, -66013, -99954, -115608, -210461, 56250, 525512, -91330, -181280, 76759, -35703, 32636, -135530, -184342]
15768a84342a0069j74772q5151e6795I8288b61461j32260B95833b54119c4584
15757a20820C29061a10994A07595f3208j90069B49906o4097a01640j81936O3744
15747b19832A27314a9285B41902l9264g8595H96b25780f1673G8111K1782a05928
15735b90194D25588A20809K4606b47534H1639a0497q0071j63593a13621j46928
15725b60549B62157q3089B3566J72529k526a48304b2781j55703A32382a02775
15714b61013A12954n4818a50092I5894l5140e3752E6578A404O4235J07170m1114
15703A31695c82364c3044I3940m544a23640B37210d16758D3096i0327D5452J3272
15692E8724J06938b24582A2283J23754h3588r4268M0299A46786b61137A13133
$$ y = [-184342, -10069, -184841, -269992, -56795, 98288, -261461, -393721, 295833, -254119, -34584, -120820, 329061, -110994, 107595, -63208, -253277, 249906, 185809, -101640, -283576, -219832, 127314, -19285, 241902, 202638, -78595, 896, -225780, -61673, 78111, 99893, -105928, -290194, 425588, 120809, 145415, -247534, 81639, -10497, -90568, -254161, -113621, -260549, 262157, 179068, 23566, 196095, 193569, -148304, -22781, -178484, 132382, -102775, -261013, 112954, 58136, -150092, 95894, 60754, -53752, 56578, 1404, 65639, 172809, 131695, -382364, -33044, 93940, 89396, -123640, 237210, -416758, 43096, -90327, 45452, 58724, 165662, -224582, 12283, 136037, -83588, -177856, -137557, 146786, -261137, 113133]
15681C14363j50781n5744a97149d1052p2020c6711I4129J33744A11125f2126j8474
15670h0600B04411a00025J8355b1902r7391J073j87545D2537J30379b90722i1864
15658H5514k7291i8940A24021g2220L774b4693a0014k29390A61319c75357A83432
15646a87881D9159C27M003J4342a75295A75546K45055F7212a55466A8735O1940
15635H0675f1991l34794a74597j7637b0219D82J36564a00236D47080i5887H4540
15623b40495F8548l0994a25062B76276c26018d3539a8020j60872k82191a33396
15612a61553D96668a79155g9688b1622l1998G9943b50558A68078K5537a61606
15601a25094A37652b46086d5991E5036a23490D8396b51920a02271A2546b65856
$$ y = [314363, 163582, 107838, -197149, -41052, -113072, -36711, 94129, 227873, 111125, -62126, -80600, 204411, -100025, -81670, -21902, -119293, -118220, -305765, 42537, 172916, -290722, -91864, 85514, 58223, -98940, 124021, -72220, -68446, -24693, -10014, -239404, 161319, -375357, 183432, -187881, 49159, 327, 4330, 18672, -175295, 175546, 420601, 67212, -155466, 18735, 80675, -61991, -396785, -174597, -192234, -20219, 482, 137046, -100236, 447080, -95887, 84540, -240495, 68548, 37554, -125062, 276276, -326018, -43539, -18020, -178892, -461083, -133396, -161553, 496668, -179155, -79688, -21622, -53620, 79943, -250558, 168078, 193615, -161606, -125094, 137652, -246086, -45991, 55036, -123490, 48396, -251920, -102271, 12546, -265856]
15590C8868K0364N8475R726h7079A58718l7823b9309A42175a20410j74795A30649
15578a32413B52264f2850j21468m3257h0977o7527M5899B4679b6969C5067Q7207
15567A22274D2889a25410k3358A97855h7634j32449g7307q8862E4527K5281b12083
15555C95452d22198A86017a38486I96a80651P5697o6004c9111A35545Q0425a43107
15543d92107A55631l4257c65328J76344c5313D4313b55362a6270I667j23L6732
15532D6276a74414c0133A60338A5546h6877l0156j64188J5476A8867b69702C69383
15520B9925J3251J63114I3602b70196A22029f1202p1850A66421a05162A31603
15509b07420e7842K193k47265Q5209A89771b8718H6626a96228B74670I5515B6359
$$ y = [38868, 59232, 117707, 127433, -87079, 158718, 120895, -29309, 142175, -120410, -295205, 130649, -132413, 252264, -62850, -184318, -227575, -80977, -148504, -102605, 24679, -26969, 35067, 122274, 42889, -125410, -148768, 197855, -87634, -220083, -77307, -166169, 54527, 79808, -212083, 395452, -422198, 186017, -138486, 996, -180651, -104954, -170958, -39111, 135545, 215970, -143107, -492107, 155631, 121374, -365328, -188984, -35313, 44313, -255362, -16270, 9667, 9544, 46276, -174414, -30133, 160338, 15546, -86877, -117033, -281221, -265745, 18867, -269702, 369383, 29925, 43176, 206290, 93602, -270196, 122029, -61202, -133052, 166421, -105162, 131603, -207420, -57842, -55649, -302914, -217705, 189771, -28718, 86626, -196228, 274670, 95515, 26359]
15497c03350G5989f1883A02783b72450A23357E8603J46994c86819i9321B03571
15486B11080b85808J34414j34787g6976H7403d9719J0686j70569M8736H879d0664
15474f7331A97162c8220B10994e6506l4235c0680j7789k83671A13527a39225O1880
15463g7345k3329A26882J27116g775j32233I9638b22361f8282D0379h4566e11
15451B09459O1b8949I3535a97704H9979Q152a39705H3300K45280E1173J74826
15440B25999a84962B23800r5832b15899P5249J0487A04590n1812L8526J10537
15430B01841D3590b9200A77263G4979J39000G5283a79811c5800A09563A4462a6628
15418E6395h9643B02976b892o3915l998A8500P5294j7805M8875a20231e267D2690
$$ y = [-303350, 75989, -61883, 102783, -272450, 123357, 58603, 205597, -386819, -99321, 203571, 211080, -285808, -151394, -286181, -76976, 87403, -49719, -39033, -209602, -160866, 8879, -40664, -67331, 197162, -38220, 210994, -56506, -90741, -30680, -48469, -332140, 113527, -139225, -77345, -100674, 126882, 253998, -7775, -140008, 99638, -222361, -68282, 40379, -84566, -511, 209459, 209520, -28949, 93535, -197704, 89979, 98131, -139705, 83300, 328580, 51173, 225999, -184962, 223800, 127968, -215899, -140650, -130163, 104590, 52778, 91304, 201841, 43590, -29200, 177263, 74979, 213979, 75283, -179811, -35800, 109563, 14462, -16628, 56395, -89643, 202976, -2892, -66807, -70805, 18500, 93794, 75989, 124864, -120231, -5267, 42690]
15405A05578D2911c3799j47728d0629k30806j83841K3460a25416b7436B71888
15394c4584A94199B2870J2190L44812i0594j41749H3289J79712q3020R4956a151
15382C0346a21494a4517j30936G8098K17386g0829a772H155a88108C28630a12241
15370F436c96573A73895m2365J16577E6999H713e7242D3878K4117a9081D0021
15358B59212N6859j22904G9472g3589A97778C6521R1351d0445J9010B74030b4610
15346b02400I4284j2856O819f0702A77169E8901J07267P7728a28950B05811c3000
15334B01249L2170I0059a12782e2857b0518p9072j51213a1569F9004J53620C889
15322b54047B12006H6167j6430J2933a94813A26615J29127B5162e5016k88466
$$ y = [105578, 42911, -33799, -181527, -40629, -271435, -455276, -431816, -125416, -27436, 271888, -34584, 194199, 22870, 35060, 379872, -90594, -232343, 83289, 263001, 179981, 274937, -1151, 30346, -121494, -14517, -145453, 78098, 295484, -70829, -1772, 8155, -188108, 328630, -112241, 6436, -396573, 173895, 131530, 248107, 56999, 8713, -57242, 43878, 67995, -19081, 40021, 259212, 316071, 193167, 79472, -73589, 197778, 36521, 127872, -40445, -21435, 274030, -24610, -202400, 94284, 81428, 88247, -60702, 177169, 58901, 166168, 243896, -128950, 205811, -33000, 201249, 233419, 90059, -112782, -52857, -20518, -99590, -250803, -11569, 69004, 222624, 3889, -254047, 212006, 86167, 69737, 82670, -194813, 126615, 255742, 25162, -55016, -343482]
15312c43482B15548q2669L5722a43359C09196A31398b0921A23643a2988k09379
15302b22367B23493K2856a4650o8541c8635F6316d0023l51605H40J17220D5660
15290a77458L7025b2722m0575A57398j4019J46728j20378K6975K3638b7905j34063
15279a61968A35231a6941B08400f5230D20980j22245F5595f7428H811J09978b56302
15267I8549E045J38318J0005L48581a30590C2980J27393b15863f097k26881C10728
15255A35627e5160A74830C7852M7360J22033D6157M79235Q55917m45411M44054
15245A379952P4918E38190b9894D99145n7173A86583D6007K59855b8226A77996
15234A19772E5075L04226G69O21J7502K58833H9645g5522B14229A3288C538a2513
$$ y = [-343482, 215548, 132879, 168601, -143359, 309196, 131398, -20921, 123643, -12988, -222367, 223493, 246349, -14650, -83191, -38635, 66316, -40023, -391628, 840, 118060, 45660, -177458, -140433, -22722, -63297, 157398, 143379, 290107, 169729, 196704, 220342, -27905, -161968, 135231, -16941, 208400, -65230, 420980, 298735, 65595, -67428, 8811, 118789, -256302, 98549, 5045, 143363, 153368, 501949, -130590, 32980, 160373, -215863, -6097, -232978, 310728, 135627, -55160, 174830, 37852, 85212, 207245, 46157, 525392, 1381309, 935898, 1379952, 1454870, 538190, -29894, 499145, 441972, 186583, 46007, 305862, -28226, 177996, 119772, 55075, 359301, 769, 1390, 18892, 277725, 89645, -75522, 214229, 13288, 3538, -12513]
15221B1199J75440K2260b04550A04011J09139b31379C27003a51692B75313K74817
15211E50130D832K11938I5944l6095N5813L9264a40171A79266A8980J6379Q5858
15200A21217P4023o1588h710A96837Q4742a54878A61214m0263M0054K193m7139
15189A16059j3468h6656B55034i463p2951m720i736F1937B3017P3351J69772g8289
15176E6728M50124A31331a8892B92700j31824h3104B47227a97899C52561H2865
15165D0617J58299Q1830h5362A94671f2792I5743a7537j03490e3788k03527a6530
15153b01583E1279J8130a58784A05622O945J66977E0799L99981G1953a39742C69291
15141B33898b27918A38879o4226L80878A307J10946L1701K99060E6479a46260
$$ y = [21199, 196639, 218899, -204550, 104011, 213150, -231379, 327003, -151692, 275313, 550130, 4832, 216770, 95944, 59849, 115662, 154926, -140171, 179266, 18980, 35359, 121217, 195240, 133652, -8710, 196837, 281579, -154878, 161214, 120951, 161005, 163198, 116059, 102591, -86656, 255034, -9463, -82414, -87134, -9736, 61937, 23017, 96368, 266140, -78289, 56728, 506852, 131331, -18892, 292700, 160876, -83104, 247227, -197899, 352561, 82865, 40617, 198916, 280746, -85362, 194671, -62792, 95743, -17537, -121027, -53788, -257315, -16530, -201583, 51279, 69409, -158784, 105622, 112567, 279544, 50799, 450780, 71953, -139742, 369291, 233898, -227918, 138879, 74653, 455531, 1307, 112253, 143954, 443014, 56479, -146260]
15130c32634A26488B7404K5669k0282J60007J66254E5309f2964A82804G5427M40346
15119E15773A59759J17961j15261O9870p8831a4779A1399K76994q7159E6904J62228
15108B19132M3447A21978l3667J75869a4006D69110i1707C08852B0007d240m8854
15097e3094A53066l7803J10632K14584j48069Q2563r7454J45802I3119j9734L13213
15086C86598D1122J74197q6531l9167M6174L9896e1409C75570E0768M91607a49335
15074A4877P5209a29427D39988A84152L6231P7843J09896A75678J51834b9705
15063H6582b4995C65811j06790E4990M0385P8574H1577J41045a0022E2859K14828
15052B67687q5348C2780J21398J46280b37825a01827G4361L90557A30415L2331
$$ y = [-332634, 126488, 27404, 53073, 32791, 192798, 359052, 55309, -62964, 182804, 75427, 515773, 159759, 277720, 162459, 232329, 153498, -14779, 11399, 288393, 201234, 56904, 219132, 262579, 121978, 88311, 264180, -14006, 469110, -91707, 308852, 20007, -4240, -53094, 153066, 115263, 225895, 440479, 292410, 374973, 277519, 423321, 93119, 73385, 386598, 41122, 215319, 128788, 89621, 135795, 175691, -51409, 375570, 50768, 542375, -149335, 14877, 90086, -129427, 439988, 184152, 220383, 298226, 408122, 175678, 327512, -29705, 86582, -24995, 365811, 259021, 54990, 95375, 173949, 81577, 222622, -10022, 52859, 267687, 182339, 32780, 154178, 300458, -237825, -101827, 74361, 464918, 130415, 162746]
15042A62746J04036E8511K73152A47573o8379c5904p7415C93563j56464j8969
15032B18130J42853j23320E4749Q644b08408C26076e6896D65271B6860b47477
15021B46113O4790p0461N1704j0629j02502a50558C95741j61700L55513A00057
15010C10962K71652B20806f439C69321j8188A13797r272l5643e6949D48048j19350
14999C28698A35569J58296j2205K05807l9044o5280J5157j62633B5665b7833D93538
14987A05411P941J76688E9635J98073n4490K76537k07994L3585j37230a1533A15519
14975C15826B1634L54009L729F6022J41606H0476J35462L5035e0151D96349J81266
14964F77615B58351O9851j11714N6316m0438l0379j1328J92912k304A43749J60011
$$ y = [162746, 266782, 58511, 331663, 147573, 79194, -35904, -113319, 393563, 237099, 218130, 360983, 237663, 54749, 63393, -208408, 326076, -56896, 465271, 26860, -247477, 246113, 310903, 240442, 292146, 281517, 179015, -150558, 395741, 234041, 589554, 100057, 310962, 582614, 220806, -6439, 369321, 351133, 113797, 104525, 68882, -56949, 448048, 328698, 135569, 293865, 281660, 487467, 448423, 383143, 398300, 235667, 25665, -27833, 493538, 105411, 113352, 290040, 59635, 257708, 203218, 479755, 271761, 305346, 168116, -11533, 115519, 315826, 21634, 375643, 379372, 66022, 207628, 80476, 215938, 250973, -50151, 496349, 677615, 258351, 328202, 216488, 272804, 232366, 201987, 190659, 383571, 381267, 143749, 303760]
14953C03760d8053A50022K33618J0299j9430A33363P9373J18376K21934B25988
14942A5648L19278A27827K03443A63800C5610K45798l6551K32316A2287J70832
14932A83119J74727A69127N5039G5138L12835A4286K47408P0444J01205q4682
14922C48661A51943M16842j28371j16724A04934L01073j87399J79854j44970l1498
14912B21994G8580J131L10790J17472B27833L07511j42811M420E0912J94293M2793
14901B87998l8691K63326C520K08668I6299K41527l1303N0160L4075j85002M8202
14890B53958p0183J89562A72194K14954I4971M15359o3354r857Q8859m8214A31842
14878C47754J93318j45864J35803k53605J51534l9382L10309l15189J10599N2695
$$ y = [303760, -48053, 150022, 383640, 393939, 374509, 133363, 212736, 331112, 553046, 225988, 15648, 334926, 127827, 331270, 163800, 35610, 281408, 244857, 477173, 12287, 183119, 357846, 169127, 224166, 75138, 387973, 14286, 261694, 332138, 433343, 348661, 151943, 568785, 440414, 323690, 104934, 406007, 218608, 398462, 253492, 221994, 78580, 79711, 390501, 507973, 227833, 535344, 392533, 396953, 50912, 245205, 287998, 249307, 512633, 3520, 212188, 96299, 337826, 306523, 356683, 390758, 205756, 253958, 183775, 373337, 172194, 387148, 94971, 510330, 446976, 437119, 525978, 477764, 131842, 347754, 541072, 395208, 531011, 277406, 428940, 389558, 699867, 384678, 495277, 547972]
14868E47972j75452J5221j71212J22770A7994K42870J46229K28047k02346A43751
14857B83749J35720m1751k0274Q8704M7899J81101B98141j26652L55306j28133
14847C98662o6669l8455J34977p2587L97859l72827L40364C02122n0069K96666
14837E48719l9098k44566r961L3798K24937J82348j40257j48758m1675A40386
14826C38625M73465k34292B63924K45858j10582K2030P4126M4233j45019J83221
14816E77791K3894L5130l7401p3379j08787L96542C92649K69835k81757J0809
14806C91536J38411J88921C56763L83829k76334j47735L78073j40157j06668L64131
14796H11902C63830J52001o6448J55579K38946l34761o1160L43754O751B63833
$$ y = [547972, 372520, 387741, 216529, 339299, 17994, 260864, 407093, 635140, 432794, 143751, 283749, 419469, 377718, 357444, 446148, 494047, 675148, 298141, 171489, 526795, 398662, 331993, 293538, 428515, 355928, 753787, 380960, 721324, 302122, 252053, 548719, 509621, 265055, 255094, 288892, 513829, 696177, 555920, 407162, 365487, 140386, 338625, 812090, 577798, 263924, 509782, 399200, 421230, 495356, 539589, 394570, 577791, 601685, 636815, 599414, 526035, 417248, 813790, 392649, 662484, 380727, 391536, 529947, 718868, 356763, 740592, 464258, 316523, 694596, 554439, 447771, 811902, 363830, 515831, 449383, 604962, 843908, 509147, 447987, 791741, 798492, 263833]
14785H04370l22483J71669B74750K87533J65490p3132P2056N340j78537B17708
14774F30992j03740N9466K3462K6443J37573J69932j3071j69962l48890J75063
14764E87268l9769J47595C38885J89169K37336l59930J96689N1688J82856j01874
14754G34819l8055m9151N4579J56457k60485M8281K62213k43791q5422L31172
14744I10617l12578K55865M4825l02742J07922J3164J16000P1328j63587l45924
14734C94890N66328k4039j97929N2978J50447k28726K3135J43492p5841r3666
14724G11069J37935j70614L19087l45454L11355D77645M00428J10288m29608N02371
14714A061124m10766L65838j80219J02483j69293J25594j60609J33379j66800
$$ y = [804370, 481887, 653556, 274750, 562283, 727773, 654641, 726697, 732037, 553500, 217708, 630992, 527252, 586718, 610180, 636623, 774196, 944128, 931057, 761095, 412205, 587268, 547499, 695094, 338885, 528054, 765390, 405460, 602149, 653837, 836693, 734819, 696764, 647613, 702192, 858649, 598164, 646445, 908658, 664867, 579445, 910617, 598039, 853904, 898729, 595987, 703909, 717073, 833073, 904401, 740814, 394890, 961218, 937179, 739250, 792228, 942675, 713949, 737084, 880576, 804735, 711069, 849004, 678390, 997477, 652023, 963378, 477645, 878073, 988361, 558753, 1061124, 650358, 1016196, 835977, 938460, 769167, 894761, 734152, 867531, 700731]
14705G00731J83671k41417j92340N10684m55441M10931k69820L23421k7707j82088
14695G60625k26317K83807L2460p0170J68238J7982K60424E50521J19944J47627
14685H18092J96369j62295M28089k14476k9366j32534j49548J99668J94759r2307
14675A056451j59864P2791M14004o57273M52161J37041m58725O60647j72195j34650
14665A210388r6455k19159J46174j12277o9970M48252m49106K79615o9698K38151
14655A305915O0066j68425k04312K75799j36319K781j23367M03504l05313J11584
14645A221913K34107j8265l80316Q5247K2609Q6792K9867j08949k08496M53149
14635A417658l03687N0051m0030K49554p1785r0334J86449Q5086o3650j5321k34746
$$ y = [700731, 884402, 642985, 450645, 961329, 505888, 916819, 646999, 970420, 942713, 760625, 534308, 818115, 850575, 780405, 948643, 966625, 1227049, 550521, 670465, 818092, 1014461, 852166, 1280255, 1065779, 1036413, 903879, 754331, 953999, 1148758, 1056451, 896587, 969378, 1383382, 726109, 1178270, 1315311, 856586, 1517233, 1345038, 1210388, 1113933, 894774, 1040948, 928671, 858701, 1306953, 857847, 1137462, 1067764, 1305915, 1365981, 1197556, 993244, 1269043, 1132724, 1135505, 1012138, 1415642, 1110329, 1221913, 1456020, 1437755, 1057439, 1142686, 1165295, 1252087, 1281954, 1173005, 964509, 1417658, 1113971, 1164022, 1123992, 1373546, 1301761, 1211427, 1397876, 1482962, 1419312, 1403991, 1169245]
14624A169245K99963j23013l0183K18418l29342L25946j2202m6353j68142J75500
14614A479837j32698j32165K48627o035R956k45458K51841N6842M3843K6759M4054
14603A645403k39081R7628J67509o4123l8446J93191R1082j53601J0534k6814
14593A683282J90255j05107J78478l47057L39695k11236R5857J2808Q1528n6872
14583A861631K48004K30349l20255j43419j28418M5293L28130j10236L9742J19344
14573B170165l38929P0952K46911J3236l7986R7186J31946p9081J97004M2487
14563B513891Q3697k27917J22609L05944P757J902L48929J59538j05545K44570
14553C455375L62025K80245O92803N90447J903828L707722R584848J9133675L706362
$$ y = [1169245, 1469208, 1346195, 1316012, 1534430, 1205088, 1531034, 1518832, 1472479, 1304337, 1479837, 1347139, 1214974, 1463601, 1457566, 1467522, 1222064, 1473905, 1530747, 1574590, 1601349, 1645403, 1406322, 1503950, 1671459, 1607336, 1568890, 1762081, 1853163, 1699562, 1710096, 1683282, 1873537, 1768430, 1946908, 1599851, 1939546, 1728310, 1824167, 1836975, 1918503, 1861631, 2109635, 2339984, 2019729, 1876310, 1747892, 1793185, 2121315, 2011079, 2050821, 2170165, 1831236, 1902188, 2149099, 2162335, 2124349, 2221535, 2353481, 2274400, 2471404, 2513891, 2597588, 2369671, 2492280, 2798224, 2805981, 2807883, 3156812, 3316350, 3210805, 3455375, 3817400, 4097645, 4790448, 5380895, 7284723, 10992445, 20577293, 39710968, 43417330]
14544D3417330k1678982I209850m372649j749521m93208m830m67997P3798m05341
14535A790102L74085m2494k04148K24048N267K0655k467j17816K22297k52785
14525B016744L72433J45184k59076M13392R2694l24893K92442k12444j27674N27265
14515B936067l92326n8100N84327k04823l30682L85414l47359K91159M6929Q0798
14505B991404l38240L00534P8721j16027O2918K25888K56831R2707k38636J35726
14495C451826K4474j90165J07018q3903J38615J82710K01124m91015K71270L42952
14485C954906l97403M91727j52757k69572K45087J86591k66701J26683J27989
14476D046550j27212r486L40039r8069K04081M6412p5251L76889l13251R2625
$$ y = [43417330, 21738348, 9209850, 4837201, 3087680, 2594472, 2589642, 2121645, 2195443, 1790102, 2164187, 2121693, 1917545, 2141593, 2146860, 2167515, 2165048, 2047232, 2269529, 2016744, 2389177, 2534361, 2275285, 2688677, 2781371, 2456478, 2748920, 2536476, 2408802, 2936067, 2543741, 2485641, 3069968, 2865145, 2534463, 2919877, 2572518, 2863677, 2910606, 2991404, 2653164, 2953698, 3032419, 2916392, 2979310, 3205198, 3462029, 3554736, 3316100, 3451826, 3476300, 3286135, 3393153, 3309250, 3447865, 3630575, 3831699, 3340684, 3611954, 3954906, 3557503, 4049230, 3896473, 3626901, 3871988, 4058579, 3791878, 3918561, 4046550, 3919338, 3909852, 4249891, 4151822, 4355903, 4402315, 4327064, 4703953, 4390702, 4483327]
14466D483327K15954q0555o167p187K90453k76354J75405Q8293J23195J1032m98
14455E016898q5744K54726k09980J96667L4758K29047K21232j35450m1511R9067
14445E579710J40066j2676J81502L59609m17841K20779Q2279K41846J46470K6498
14435F548242K2740M1916L86923l55819L46582P4765k839K8377j05947M62205
14425G447145R4590J4074m0610L39704k24475L09978k6151L27736l7878L71971
14415H576084Q8633k43515K70709K67015l1076K78124J02030J09644K29552p2025
14405I575175K58923K19457J80353p5428M39313k06218L38568L71537K10891Q3545
14395A1396116K35117N8455K4302M71184n8254M53693J7781L60159K82410J61136
$$ y = [4483327, 4699281, 4618726, 4612559, 4605372, 4895825, 4619471, 4794876, 4883169, 5006364, 5017396, 5016898, 4931154, 5185880, 4975900, 5172567, 5207325, 5436372, 5657604, 5522154, 5480643, 5579710, 5719776, 5707100, 5888602, 6248211, 5830370, 6051149, 6133428, 6375274, 6521744, 6548242, 6570982, 6612898, 6999821, 6644002, 6990584, 7065349, 7062510, 7090887, 6984940, 7447145, 7541735, 7555809, 7515199, 7854903, 7630428, 7940406, 7914255, 8241991, 8204113, 8576084, 8664717, 8421202, 8691911, 8958926, 8927850, 9205974, 9308004, 9417648, 9647200, 9575175, 9834098, 10053555, 10233908, 10158480, 10597793, 10391575, 10730143, 11101680, 11312571, 11396116, 11631233, 11689688, 11713990, 12185174, 12126920, 12580613, 12598394, 12958553, 13240963, 13402099]
14385A3402099L79929J42486J79162L3633N63520K73911K50619K07385L10595
14376A5743339O56529k57106M83993K62957N31971J17875j8887P01459J63529
14367A8385659P10760K67714P00826O4721N45466K90388M33427N04362N30496
14358B2433819O20401J64912P96353M60375L86455Q09618M58599P44063O41423
14349B7516018P25281P65689L40701J068743P55123R24496Q83533O48067J033193
14340C4660844N54238J109515R67783P70716J542174J238446J126887J118208
14332D3088811J321427J080087J548811J445107J778221J303978J687814J793999
14324E5048255J608915J971232K240397J872470K137142K147394K545593K513470
$$ y = [13402099, 13782028, 13924514, 14103676, 14137309, 14700829, 14974740, 15225359, 15432744, 15743339, 16399868, 16142762, 16626755, 16889712, 17421683, 17539558, 17520671, 18222130, 18385659, 19096419, 19364133, 20064959, 20129680, 20675146, 20965534, 21398961, 21903323, 22433819, 23054220, 23219132, 24015485, 24475860, 24862315, 25671933, 26130532, 26874595, 27516018, 28241299, 29006988, 29347689, 30416432, 31171555, 32096051, 32979584, 33627651, 34660844, 35215082, 36324597, 37292380, 38063096, 39605270, 40843716, 41970603, 43088811, 44410238, 45490325, 47039136, 48484243, 50262464, 51566442, 53254256, 55048255, 56657170, 58628402, 60868799, 62741269, 64878411, 67025805, 69571398, 72084868]
14316G2084868K550405L029082L366074K786055L086195L647484L368832M111785
14308I8030780L911831M350286M637909M906754M951973N616322N436417N949733
14300A37792005O460805O681195P313154P659217P913679Q571763R053762R223174
14292B00668754J0075453J0719744J1238715J1514230J2193284J2554687J2863515
14285B81828382J3282833J3796130J3878424J4295387J4005035J4076546J3913333
14278C79076070J2990655J2334984J1487430J0149534R184233O858670M229390
14271D46310966O86557j241040K51307l389718k800757o081801q085811r517109
14263D16132594j0686183j1914509j3397626j3930647j4475262j4864602j4874513
$$ y = [72084868, 74635273, 77664355, 81030429, 83816484, 86902679, 90550163, 93918995, 98030780, 101942611, 106292897, 110930806, 115837560, 120789533, 126405855, 131842272, 137792005, 144252810, 150934005, 158247159, 165906376, 173820055, 182391818, 191445580, 200668754, 210744207, 221463951, 232702666, 244216896, 256410180, 268964867, 281828382, 295111215, 308907345, 322785769, 337081156, 351086191, 365162737, 379076070, 392066725, 404401709, 415889139, 426038673, 435222906, 442081576, 446310966, 446997523, 445756483, 446007790, 442618072, 439817315, 433735514, 425649703, 416132594, 405446411, 393531902, 380134276, 366203629, 351728367, 336863765, 321989252]
14256C21989252j4717535j3970012j3045556j3542511j2796997j2266456j2037301
14249B29612884j1180953j0744112j0035314r419791r044187p797829q454841
14242A62935857p600878p126373o991086n929807o205137n122983n381543n430013
14234A13148037m687225m650306l864343l842093l940519l687262l816499l026950
14226H1632840k905586l247647k512581k799600k056015k742661k134235j780838
14218F1453677k267762j857812k134849j382805j690792j540316j356875j715876
14210D7506590j846022j203918j047427q93856j033957j473315j274335j117780
14202C7615980j078401n96022o63207j066352j011602j088019n31477r72877m97540
$$ y = [321989252, 307271717, 293301705, 280256149, 266713638, 253916641, 241650185, 229612884, 218431931, 207687819, 197652505, 188232714, 179188527, 171390698, 162935857, 155334979, 148208606, 141217520, 135287713, 129082576, 123959593, 118578050, 113148037, 108460812, 103810506, 99946163, 96104070, 92163551, 88476289, 84659790, 81632840, 78727254, 75479607, 72967026, 70167426, 68111411, 65368750, 63234515, 61453677, 59185915, 57328103, 55193254, 53810449, 52119657, 50579341, 49222466, 47506590, 45660568, 44456650, 43409223, 42515367, 41481410, 40008095, 38733760, 37615980, 36537579, 35941557, 35278350, 34211998, 33200396, 32112377, 31580900, 30608023, 30110483]
14193C0110483j066209l99696q26033n07800j044595m14623n48602p45403o02991
14184B3954531m62688m79812m31586o20909j20968m94230n30078p20320r6909
14175A9997031o16029l37075l88393k47457m51204m32101j88097n84241l38710
14166A6413724O8768m66894o8951p08656r9757j67276l85351l38528r2032p7717
14156A4077330p57645R9670m52034K52945j60360m93642r2601l69309j73472q5168
14146A1845714j46862m50185j73612k30829m9530j29285o7831M9887o89652q9233
14136I868582j53617J19680l42282K39314q5677l45586l64521k01972k0324N03340
14126I216937n55026J71086k49973o19245L91959j95228M7463n16975N1693l27693
$$ y = [30110483, 29044274, 28644578, 27818545, 27310745, 26266150, 25851527, 25302925, 24557522, 23954531, 23491843, 23012031, 22580445, 21959536, 21838568, 21344338, 20814260, 20093940, 19997031, 19381002, 19043927, 18655534, 18408077, 17956873, 17524772, 17336675, 16752434, 16413724, 16482492, 16015598, 15946647, 15237991, 15138234, 14970958, 14585607, 14247079, 14155047, 14077330, 13319685, 13419355, 12967321, 13220266, 13059906, 12566264, 12473663, 12104354, 11930882, 11845714, 11698852, 11248667, 11075055, 10844226, 10794696, 10665411, 10597580, 10647467, 9957815, 9868582, 9714965, 9834645, 9492363, 9731677, 9646000, 9300414, 8935893, 8733921, 8713597, 9216937, 8661911, 8832997, 8583024, 7963779, 8355738, 8160510, 8207973, 7690998, 7742691, 7414998]
14116G414998R4817J76821o15350K7677K02189l67423J2220n6647p0164k96286
14106F522852P6664k82438l3188J6678n7366j51835K18221J39287n82734N4082
14096E920223o7449J05250l44235M62778o94411r2888K85093O0213m51474J49422
14086E332522L6371k05324K00911j37946n2562m14457J32979k9408K50596m07973
14076D705709P9447l8255l32483L04477j33805k74110K02090n6688j15615L11229
14066D651996l49401o9079j79735M6747j36213R8225J81894o6217J1843j25157
14056D064903M059J1238j71247j45032R5835j61468Q6537l87278K25839n510j63854
14045C454022k2275N11197o45249O0887J36528l09794j05415K77515l91189K38951
$$ y = [7414998, 7509815, 7686636, 7071286, 7098963, 7301152, 6933729, 6945949, 6889302, 6819138, 6522852, 6599516, 6317078, 6283890, 6300568, 6243202, 6091367, 6309588, 6448875, 5866141, 5920223, 5852774, 5958024, 5613789, 6076567, 5382156, 5289268, 5574361, 5634574, 5183100, 5332522, 5368893, 5163569, 5364480, 5226534, 5173972, 4759515, 4892494, 4863086, 5113682, 4705709, 4785156, 4746901, 4414418, 4718895, 4585090, 4310980, 4513070, 4456382, 4340767, 4651996, 4302595, 4233516, 4053781, 4100528, 3964315, 4062540, 4244434, 4178217, 4190060, 4064903, 4068962, 4080200, 3908953, 3763921, 3859756, 3698288, 3784825, 3397547, 3623386, 3617876, 3454022, 3431747, 3942944, 3297695, 3358582, 3495110, 3185316, 3079901, 3357416, 2966227, 3205178]
14035C205178R0242n20211M02878m8827m9366k39670N18801k10637k08069K2193
14025B962512l13409P1620J98880K4375l86990R7958l1044J50770l86203J23419
14015B511888K15710j51602j36045R8895J71107l54878J48452K07465k66525r5725
14005B348742l17711J29946L58248o1851j62915k78924K81724q0351J64316j80266
13995B200958j38674J87487j28041q6778K36293M60603J182282J755166P511918
13986A3181214J9460401J2314870j9479633j2110966n066483k492995o90995j013577
13978D101836l49248j5964n61782l72303o2435L33895j46527l74542J51590k60679
13968B443841Q0331q6200J99996k34196j47178j43227J950L43572n57741J20878
$$ y = [3205178, 3295420, 2775209, 3178087, 3129260, 3079894, 2840224, 3359025, 3148388, 2940319, 2962512, 2649103, 2720723, 2919603, 2943978, 2556988, 2654946, 2623902, 2774672, 2388469, 2511888, 2727598, 2575996, 2439951, 2538846, 2709953, 2355075, 2503527, 2710992, 2444467, 2348742, 2031031, 2160977, 2519225, 2457374, 2294459, 2015535, 2297259, 2216908, 2381224, 2200958, 2062284, 2249771, 2121730, 2034952, 2271245, 2731848, 3914130, 5669296, 13181214, 32641615, 44956485, 25476852, 13365886, 8299403, 5806408, 5115413, 4101836, 3752588, 3736624, 3174842, 2802539, 2740104, 3073999, 2927472, 2552930, 2704520, 2443841, 2524172, 2437972, 2637968, 2403772, 2256594, 2113367, 2115317, 2458889, 1901148, 2022026]
13958B022026k8272J61281L00529o65621K79982J20137k41753k41620L64363R1918
13948B162970r5090J09243l87341p1941o2255r9792M94589j07258j16076k57123
13938A569926r6457N31227n93950K61789J57236l22648L50853m27004K16967j09387
13928A538552O4077K4346K94131k31187J1152k43281j97224L02541r5326j07308
13918A360473L88365k17677J65162K12609n70151O9732J34175J07595k36483j54287
13908A259513J87405M74890o35683K37428M1724k77782O6384K33492k01717L35343
13898A720997m60192m27328J83043K27554j07015L91537o58212N74215l81733
13889A062866K39846j0627M1628k11841J73696l9483k7217k1466k23855Q3471
$$ y = [2022026, 1993754, 2155035, 2455564, 1789943, 2069925, 2190062, 1948309, 1706689, 2071052, 2162970, 2067880, 2177123, 1789782, 1717841, 1655586, 1555794, 2050383, 1943125, 1827049, 1569926, 1473469, 2004696, 1410746, 1672535, 1829771, 1507123, 1857976, 1430972, 1647939, 1538552, 1602629, 1626975, 1921106, 1689919, 1701071, 1457790, 1260566, 1563107, 1467781, 1360473, 1748838, 1531161, 1696323, 1908932, 1338781, 1408513, 1542688, 1650283, 1413800, 1259513, 1446918, 1921808, 1286125, 1523553, 1565277, 1287495, 1353879, 1587371, 1385654, 1720997, 1260805, 833477, 1016520, 1244074, 1137059, 1528596, 870384, 1444599, 1062866, 1302712, 1292085, 1333713, 1121872, 1295568, 1256085, 1228868, 1207402, 983547, 1067018]
13879A067018r6354J1528N17362l77974K15020j31643K0889j8751O9636K5252
13869A301983j56742N57071m69917l27775L00488J16060j72341m1033j01895J90362
13859A196261l0445p0904j91362J53494K11966n2394k72961K87877m6717j21526
13849A063289j44229p72r7357j176K13464L56723m43795o1273L39953m87872j04563
13838F32392M63429j92660J55114j58956j24779J57406P7969j56248L63517m58994
13828G58190k1766J66511k45162O16619l67301P4689K1956j50792J6357j65270
13818G04031M00813p1348r9464l35402J79429J56185m169J50120K3801l11828
13808G92168n3590R8159J30103Q9080k21969J34132j20360J98811j0728l3594
$$ y = [1067018, 970664, 982192, 1499554, 1121580, 1336600, 1204957, 1225846, 1207095, 1276731, 1301983, 1145241, 1702312, 1232395, 904620, 1205108, 1321168, 1148827, 1107794, 1005899, 1196261, 1165816, 1094912, 903550, 1057044, 1269010, 1216616, 943655, 1231532, 1184815, 1063289, 919060, 918288, 820931, 819755, 1033219, 1389942, 946147, 884874, 1224827, 736955, 632392, 1095821, 903161, 1058275, 899319, 774540, 931946, 1009915, 853667, 1217184, 758190, 736424, 902935, 657773, 1274392, 907091, 981780, 1003736, 852944, 869301, 704031, 1104844, 1033496, 934032, 598630, 778059, 934244, 930075, 1080195, 1103996, 792168, 738578, 836737, 966840, 1055920, 833951, 968083, 847723, 1046534, 1035806, 1002212]
13798A002212j59942k03988N068K44759J82692k11165J31086k9431k4119k29229
13788G07943m3657L3699j09694K72425n844k65355K91011j19542J98149l11275
13778F47860J38179M4500j17672r6556K31193k18220L13946k88849m8196L13706
13768I19891L0472m66047L05203J6742k49109r6047L26127l29461L82376l25951
13758E14196M94311m67173j90742J88031L9051N2019j83806J88551L7167O5434
13748G37039J51524C99961L82367k25006J94865J02106J09004q1869k56136j63681
13738D61611K73963L11030m39174k02957L16893m2895K7348m088k96179N09589
13728I15141D20800J72347J17722l27236O3085j02054L32172o1031r730r0636
$$ y = [1002212, 842270, 638282, 643350, 888109, 1070801, 859636, 990722, 961291, 937172, 707943, 664286, 697985, 588291, 860716, 854872, 589517, 880528, 760986, 959135, 647860, 786039, 830539, 712867, 616311, 847504, 629284, 943230, 654381, 606185, 919891, 950363, 484316, 789519, 806261, 557152, 461105, 787232, 457771, 840147, 514196, 1008507, 541334, 350592, 538623, 577674, 629693, 445887, 634438, 671605, 737039, 888563, 399961, 782328, 557322, 752187, 854293, 963297, 881428, 625292, 461611, 735574, 1046604, 607430, 404473, 721366, 678471, 705819, 701731, 405552, 915141, 420800, 593147, 710869, 383633, 446718, 344664, 676836, 615805, 606075, 515439]
13718E15439J84326q6056J29979A21787M69475P392p1766p8236r8002K27336m2632
13707E35354L3468R3198A55581O00027j06241m4472j1470k50192M1707J43920
13697E28860B20652K50387J64236j87319O5405q556L5982j65346K92266k58765
13687D08942Q7386N1338Q1128k35579L03036j96755J9009j24131I7287N72944
13677F70231q0742B20683J3097K46581K64081k41778j00845n896J7944K10814
13667F24681k34517J76076j63288K4603j27130M05001l49079K0979l3652K02945
13657E46619q5940j38635K67667j88253L1841N0421k13421l8223L28945k5224
13647E35797J39928C14234J62435j21611n7101L21286o0712N8054q3615N2569
$$ y = [515439, 699765, 613709, 743688, 121787, 591262, 598654, 526888, 448652, 350650, 577986, 535354, 568822, 662020, 155581, 755608, 649367, 604895, 593425, 343233, 384940, 528860, 220652, 471039, 635275, 447956, 513361, 504805, 540787, 375441, 667707, 408942, 496328, 547666, 628794, 393215, 696251, 499496, 518505, 394374, 97287, 670231, 589489, 220683, 233780, 480361, 744442, 502664, 401819, 395923, 413867, 624681, 390164, 566240, 402952, 427555, 300425, 705426, 356347, 377326, 343674, 546619, 460679, 322044, 589711, 401458, 433299, 483720, 270299, 232076, 561021, 535797, 675725, 314234, 476669, 355058, 297957, 619243, 558531, 616585, 532970, 585539]
13637E85539B48360M42909B92901J29002L11968A86978q732K67184j43377q13
13627C01240J89689j47566R3887j4665A30048J40663J38101N1352B17537M20605
13617F38142G4255J81498q4198K12916o7419J48866A56380N80521l28920A15434
13606B78785K25180j46924A58083K24180A82495K49731N0813n0719A31640N52271
13596F83911k66387J10245A13638L000K52295M451I4718L46618q8200J60786F7867
13584E31392J4269A87792L4179j3875K5538j0482e9497A10513K64424A40106B235
13572D23336p2262L4450R3976J58683A52833K41096A50267J25602l9410K2442
13562B58901M0080J71429a5872A88994L97261A36385K98994k7291a30886B56550
$$ y = [585539, 248360, 691269, 292901, 421903, 733871, 186978, 178246, 445430, 302053, 301240, 490929, 343363, 437250, 422585, 130048, 270711, 408812, 460164, 217537, 638142, 74255, 255753, 171555, 384471, 317052, 465918, 156380, 736901, 407981, 115434, 278785, 503965, 357041, 158083, 382263, 182495, 432226, 483039, 432320, 131640, 683911, 417524, 527769, 113638, 116638, 368933, 373384, 94718, 441336, 353136, 513922, 67867, 531392, 545661, 187792, 221971, 208096, 233634, 223152, -59497, 110513, 374937, 140106, 2235, 423336, 351074, 385524, 479500, 638183, 152833, 393929, 150267, 275869, 236459, 258901, 298981, 470410, -15872, 188994, 586255, 136385, 435379, 408088, -130886, 256550]
13551F06480k36856l3271j22875k368K08091K40105B16665K58477m079p7895m3343
13540C49825J30380k33821L67065k88969m5281J37277A66850K08473C2826O64663
13530F97489k30811J95j25058j46209k0309H4618Q3376k2204K40323j67911E7612
13518B64197J23665I3991l3631K52491j39618O5468P2443H6202K07939r4835L09239
13507E08545j02950j18569g1849B57888N7963A57683K84178N9109k47375k1245
13497B32350a2696B15853K793r6980J94913n6615q6787O757N3714P1265a7234
13485D89161A62754M2419J38721k5574K59165j76248b0215A44917J60953A747
13474B99707k9305J59561N1292B13340J26817F6150L20213p211J68169A80826
$$ y = [606480, 369624, 336353, 213478, 211110, 419201, 659306, 216665, 475142, 471063, 393168, 349825, 480205, 246384, 613449, 324480, 279199, 416476, 166850, 375323, 32826, 697489, 466678, 466873, 341815, 195606, 175297, 84618, 167994, 145790, 386113, 218202, 57612, 264197, 387862, 93991, 60360, 312851, 173233, 238701, 311144, 86202, 294141, 199306, 508545, 405595, 287026, -71849, 257888, 315851, 157683, 441861, 500970, 253595, 232350, -12696, 215853, 218646, 121666, 316579, 259964, 173177, 179934, 233648, 304913, -17234, 489161, 162754, 205173, 343894, 318320, 577485, 401237, -20215, 144917, 305870, 1747, 299707, 270402, 429963, 481255, 213340, 340157, 66150, 386363, 379152, 547321, 180826]
13463B44213r109L14155A7606L74386h678m3783J2174B75223A2237J5829a45023
13451i7732A84657i7057C10690N0972j42139J37960H1968B3754L13391O4166d6712
13439H9896J64654J84801r2015A11624O1505J78089M9726j14148G3554g6899D29832
13427A74471O8526K27489H0068L2441J41981k0977k2625J54205a4193A64785J39681
13416C04466b71960B49197K0059I0700L87678E1994L61746b718D78358A05079
13405B73054j16595o894K73682l0935A92859o4281L58989A92074J1541K05667
13395D09282A98598i172B67800H7757h1683A96354J85821A3701N7704k4920J34441
13384A80926L71504j80564J17026D0736J94065M7247a21839B49626n1044l338
$$ y = [244213, 235104, 549259, 17606, 391992, -8678, -52461, -40287, 275223, 12237, 28066, -145023, -97732, 184657, -97057, 310690, 361662, 219523, 357483, 81968, 23754, 337145, 401311, -46712, 89896, 254550, 439351, 347336, 111624, 173129, 351218, 400944, 286796, 73554, -76899, 429832, 174471, 242997, 470486, 80068, 112509, 254490, 233513, 210888, 365093, -14193, 164785, 304466, -271960, 249197, 269256, 90700, 478378, 51994, 413740, -2718, 478358, 105079, 273054, 156459, 149565, 423247, 392312, 192859, 128578, 487567, 192074, 203615, 409282, 198598, -9172, 267800, 87757, -81683, 196354, 382175, 13701, 71405, 46485, 180926, 552430, 371866, 488892, 40736, 234801, 282048, -121839, 249626, 198582, 195244]
13374A95244P5748a23525C46244r4100J27775M9884k902k4713A34737N4376J2522
13363B01635J05916o659m5524j07118K6401J6342P2927m6394D7324K85520j22301
13352B10543b13529B81832J30432j08988E1069L32396j30413l5488J07293C903
13341h5586D18514k04293m9251F0978Q5520A8352K53080L04835A63582M25157
13331E88739A82966p9952a22607E4858N19182B2621J23813K62124k00172L67282
13321E75668A27823a8399B86664j17431m739k7320e8234D07207I9736C4758e5730
13309D88039k12584M3970O5375A42068p220J6246J29870F2208b8996f725C75498
13297C93598H3588j5009a17504H0116M4679J14049K24127g7673m597A21163l6811
$$ y = [195244, 270992, -123525, 346244, 252144, 379919, 429803, 426901, 402188, 134737, 189113, 201635, 307551, 300892, 255368, 148250, 174651, 190993, 263920, 217526, 47324, 332844, 210543, -213529, 281832, 412264, 303276, 51069, 383465, 253052, 217564, 324857, 3903, -85586, 418514, 214221, 164970, 60978, 146498, 18352, 271432, 576267, 163582, 588739, 182966, 103014, -122607, 54858, 574040, 22621, 146434, 408558, 208386, 575668, 127823, -18399, 286664, 169233, 164494, 137174, -58234, 407207, 99736, 34758, -55730, 488039, 275455, 319425, 384800, 142068, 134848, 151094, 280964, 62208, -28996, -6725, 375498, 393598, 83588, 68579, -117504, 80116, 124795, 238844, 462971, -77673, -82270, 121163, 84352]
13286H4352a23485d5432k6176A80908h8386j07470e0530A9702J79090E0242J88964
13275B39206R3040p6689H7248a20972B42119d5601B82577d8479n992B3447J91677
13264B15124J98143A53597A4688e5298A0133M4185K03951J70223a41266C03983
13253d0790A57301J02971A2253J14281a07936p6166C01501j11991d886D32893
13242A24979J81526j03230J95189j65792B5012e7864q5056A97490M867o0868f8333
13230A21708n9246J31461q0358M9358a67952b9592j3351l11450C63061a22778
13219D15767j96388M7817A14747J61909h3100j12998D1519K46211d4962A39004
13208G2311J5269b03851A28211M0312j0693P7364N3246J4283o4332o1890J8709
$$ y = [84352, -123485, -45432, -71608, 180908, -88386, -195856, -50530, 19702, 198792, 50242, 239206, 332246, 255557, 87248, -120972, 242119, -45601, 282577, -48479, -54471, 23447, 215124, 413267, 153597, 14688, -55298, 10133, 54318, 258269, 428492, -141266, 303983, -40790, 157301, 260272, 12253, 126534, -107936, -184102, 301501, 189510, -4886, 432893, 124979, 306505, 203275, 398464, 232672, 25012, -57864, -142920, 197490, 202357, 141489, -68333, 121708, 62462, 193923, 113565, 162923, -167952, -29592, -42943, -354393, 363061, -122778, 415767, 219379, 267196, 114747, 276656, -83100, -196098, 41519, 287730, -44962, 139004, 72311, 87580, -203851, 128211, 168523, 157830, 235194, 288440, 302723, 238391, 176501, 195210]
13197A95210a94570C20866b9730I1597N9758c08496B28829a01972A78063o1541
13187A16522P1930b44510a09692A40924a38669g527B8851K70313j7431C9289A1635
13175B75143c790A69913L0516c20566d0119A30127g9468Q575l4759D3829g0330
13163b12943F6052K13261b05357g8214A29494J48085e1287D14351j93043a2912
13152C17501a07325E5954l144a52854C29054F313a39374N5194F9559b3782B69309
13140A01736B5454M4610R6488N7476J43409E1500J03948d3046p2193A06598l772
13129A02826a10218d2777B54892m4102N1215J55260c0424A05026m8759b07282
13118B01155c32244A68918J56119A48065L4798K61471A17527f3972q0532C8857
$$ y = [195210, -194570, 320866, -29730, 91597, 151355, -308496, 228829, -101972, 178063, 116522, 188452, -244510, -109692, 140924, -138669, -7527, 28851, 299164, 281733, 39289, 11635, 275143, -3790, 169913, 200429, -320566, -40119, 130127, -79468, -70893, -105652, 43829, -70330, -212943, 66052, 279313, -205357, -78214, 129494, 277579, -51287, 414351, 221308, -12912, 317501, -107325, 55954, 52810, -152854, 329054, 6313, -139374, -84180, 69559, -23782, 269309, 101736, 25454, 70064, 166552, 224028, 367437, 51500, 155448, -43046, -115239, 106598, 102826, -110218, -42777, 254892, 210790, 262005, 417265, -30424, 105026, 56267, -207282, 201155, -332244, 168918, 325037, 148065, 182863, 444334, 117527, -63972, -144504, 38857]
13107H6907J18768K277m4655B0528J78677K4459l0663b0608C53129H4613K28509
13096C13122j34335O8920k2188b83709F3809j5738h0704j0432A06528C5262P7317
13085A12579E1270J34563m8602c17268C20278i7357d6422o1285d4019A33604c4183
13073b33275H5362j2148M97856A75138a94281A21598n9501O352K66075j23576
13063B10948a36261J6254C90425A19905Q5307I6660K06633j23859c8541H4804
13052A77763J417a82334A65963B649J54365K6968L5279a52017A42460j0344a66806
13040E758M3428g0475G5577f3606A48060e0015A52330K999d8230b0869B77791
13028A9146Q0254L25606F4346P404N5702o2575R672g6256C04500A08660b02258
$$ y = [86907, 205675, 207952, 163297, 20528, 199205, 223664, 193001, -20608, 353129, 84613, 313122, 178787, 247707, 225519, -283709, 63809, 48071, -80704, -91136, 106528, 35262, 112579, 51270, 185833, 137231, -317268, 320278, -97357, -46422, -107707, -44019, 133604, -34183, -233275, 85362, 73214, 571070, 175138, -194281, 121598, 62097, 68449, 334524, 210948, -136261, -120007, 390425, 119905, 205212, 96660, 303293, 179434, -38541, 84804, 177763, 179180, -182334, 165963, 2649, 157014, 183982, 219261, -152017, 142460, 132116, -166806, 5758, 49186, -70475, 75577, -63606, 148060, -50015, 152330, 155329, -48230, -20869, 277791, 19146, 99400, 425006, 64346, 71750, 127452, 64877, 74549, -76256, 304500, 108660, -202258]
13016A70334P7310G8665e915B43810a63038B9466e5926H9223J25338c7264o8611
13005a05875A44122J03478o787j8837a2791j53398A39465a43907A18772n2000
12995F6772O362J76567a71336l0441B42775q5635a3719G7366c53362h9651G9895
12983C6624a22290l2986e4130A06838a40733D8151K27882E4949a15770A09311
12972f5879B08140F4709a1696B6136h9377B61981r2494b01994R3532F3486P5521
12961A39007b45669A28443b1234G403K96348c1870A58334R1049a23948B9642i825
12949a14713C39343a94651A57222g1194B12792n5658H687a2000H6533K07292E4556
12937c2520M735j45538G5553J52627D6909a85870A25106m5128c78027J68351I4889
$$ y = [170334, 247644, 78665, -5915, 243810, -163038, 29466, -55926, 89223, 214561, -37264, -105875, 144122, 247600, 240813, 221976, -12791, -166189, 139465, -143907, 118772, 66772, 73134, 249701, -171336, -201777, 242775, 157140, -13719, 77366, -353362, -89651, 79895, 36624, -122290, -155276, -54130, 106838, -140733, 48151, 276033, 54949, -115770, 109311, -65879, 208140, 64709, -11696, 26136, -89377, 261981, 169487, -201994, -108462, 63486, 139007, -245669, 128443, -21234, 7403, 303751, -31870, 158334, 249383, -123948, 29642, -9825, -114713, 339343, -194651, 157222, -71194, 212792, 157134, 8687, -12000, 86533, 293825, 54556, -32520, -27785, -173323, 75553, 228180, 46909, -185870, 125106, 79978, -378027, -209676, 94889]
12925B1153P0720a83818A16133c19003A4302L26875A03382O1458C2132a26974
12914E0994d33160H0474C9337h2304B26866d6451I1830K02184a86192E2261K111
12903E4372g5966j21964A4793c07529A55035n2170g6169I3705j6851j0034J6477
12892H3297A9018R217Q2061J47110a36615B9580J2793J42020k2527E4419J22687
12881A77106c40411A44948c70972E3049b41153c4208A05135a4861q0875d6803
12870G3189K0535D3794K69835b58237I4910a53273B24025a51802g852j09126C8431
12858A53112N2011N2395D4869L61768A19968b21702k3953l5128J23449B22576
12847A32018E3553f7407c2957B74770A0972f4762I1571K23061q0852a59241A46683
$$ y = [21153, 91873, -183818, 116133, -319003, 14302, 341177, 103382, 164840, 32132, -126974, 50994, -433160, 80474, 39337, -82304, 226866, -46451, 91830, 294014, -186192, 52261, 54372, -75966, -197930, 14793, -307529, 155035, 102865, -76169, 93705, 76854, 66820, 83297, 19018, 28235, 110296, 257406, -136615, 29580, 42373, 184393, 161866, 54419, 177106, -340411, 144948, -370972, 53049, -241153, -34208, 105135, -14861, -95736, -46803, 73189, 93724, 43794, 313629, -258237, 94910, -153273, 224025, -151802, -7852, -116978, 38431, 153112, 205123, 257518, 44869, 406637, 119968, -221702, -245655, -280783, -157334, 222576, 132018, 53553, -67407, -32957, 274770, 10972, -64762, 91571, 314632, 233780, -159241, 146683]
12835H7670Q109B1795J7640J06558o5890c37509A52952K57599H7209K20152e1757
12823D1068A9695b48982q9717J17729D805N27298a90272n7996H223K47033C5675
12811c4573H4798J95834E477R9953d2508C76337g6119E6800O9807d7338E8461
12799c6874A29193E2145b17799f055E4428J12870d26410d233A91666A4723c2665
12787d4045k70103a21829o4478b0692j19201I4510a66066o2888C7648K94446a65604
12775b51637C43941B4114J76394b063C6491b33468G0577A9789a00421C25334F1898
12763b79152P4573l8958h3818M242m9870C9991J5314M0044j130o072A8061a42670
12750a52605A08314c94409b2212B35606a6765j56584B56925h482G9919N9932b74230
$$ y = [87670, 95779, 21795, 39435, 145993, 80103, -337509, 152952, 410551, 87209, 307361, -51757, 41068, 19695, -248982, -338699, -220970, 4805, 532103, -190272, -248268, 8223, 255256, 35675, -34573, 84798, 280632, 5477, 105430, -42508, 376337, -76119, 56800, 126607, -47338, 58461, -36874, 129193, 52145, -217799, -6055, 54428, 167298, -426410, -4233, 191666, 14723, -32665, -44045, -314148, -121829, -186307, -20692, -139893, 94510, -166066, -228954, 37648, 332094, -165604, -251637, 343941, 24114, 200508, -2063, 36491, -233468, 70577, 19789, -100421, 325334, 61898, -279152, -204579, -243537, -83818, -79576, -129446, 39991, 55305, 95349, 94219, 88147, 18061, -142670, -152605, 108314, -394409, -22212, 235606, -16765, -173349, 256925, -8482, 79919, 139851, -274230]
12738a26642A3095Q3730J41249i13A48241i8328D5082J38517E6639a08595j88177
12727b96772E3503R4203a6151B8234L5731L5274j9029a0692G1575c74393A54856
12715A68185b36331B28415A02090a71001I1222L16392d1740F2876L25302J0655
12705C98833d9182l2011d649F8071e3984A74946K27818A11925C7227c05221A43171
12693a70303j56721D6996a80674A7771a51189M0265M5209H3822i038A15054B1740
12681D3631M6621k5122N5774k7919Q2309Q4846j01279P2286d4559A64542A2743
12669D4981j3835K7807g0626L3321B45977G3404c6456j17423I2889b35683i1821
12657d7198C85345D7741j1033i7858A00947O7633J3896N8172b22572A16724D6820
$$ y = [-126642, 13095, 96825, 238074, -913, 148241, -98328, 45082, 183599, 56639, -108595, -296772, 53503, 147706, -16151, 28234, 63965, 99239, 80210, -10692, 71575, -374393, 154856, 168185, -236331, 228415, 102090, -171001, 91222, 407614, -41740, 62876, 388178, 398833, -49182, -81193, -4649, 68071, -53984, 174946, 402764, 111925, 37227, -305221, 143171, -170303, -327024, 46996, -180674, 17771, -151189, -110924, -65715, 83822, -9038, 115054, 21740, 43631, 90252, 65130, 120904, 92985, 175294, 260140, 158861, 231147, -44559, 164542, 12743, 44981, 31146, 58953, -70626, -37305, 245977, 73404, -36456, -153879, 92889, -235683, -91821, -47198, 385345, 47741, 36708, -97858, 100947, 168580, 182476, 240648, -222572, 116724, 46820]
12645f6030A39818A1504P9602J17488k9475P364p1404a25607B92086J2197B5818
12633A65568R3054J10437I0342M15525I2374K90229A7610L44328A60254o0993
12623I9261b05844C40041J527K02371a08882E78506c5910B41234A05604P7834
12613A83438N4917B0381a25022N5744A99022J25365M9952a45609D5960b7235I133
12601c1315A94891c1758B33463o5086J77831a6019o6535b7895C238c0913C7605
12589c00356c3977C8338b13436f0709j02414d9359C5553b37299I3890j3649f5612
12577A58749a14248a7652k18137a09714G0867j2490L74793k10129i4175o3542
12567a57717A04276b03209A911d3247A16630n3993a77731A67862p1280J5712b28356
$$ y = [-66030, 139818, 11504, 91106, 208594, 179119, 186483, 115079, -125607, 292086, 304283, 25818, 165568, 258622, 369059, 90342, 505867, 92374, 382603, 17610, 361938, 160254, 99261, -205844, 340041, 341568, 543939, -108882, 578506, -35910, 241234, 105604, 183438, 238355, 20381, -125022, -69278, 199022, 324387, 374339, -145609, 45960, -27235, 9133, -31315, 194891, -31758, 233463, 168377, 346208, -16019, -82554, -27895, 3238, -30913, 37605, -300356, -33977, 38338, -213436, -60709, -163123, -49359, 35553, -237299, 93890, 80241, -65612, 158749, -114248, -17652, -235789, -109714, 70867, 58377, 433170, 223041, -94175, -157717, 104276, -203209, 1911, -43247, 116630, 62637, -177731, 167862, 96582, 112294, -228356]
12555G0777G29g728j7603B15923c0300I0653J49515a74669c4551J5954C30734
12543i9621G8837e1255Q529j5990r6011d7819A58588p6191J76766G2530Q3864
12532A56394C9805K32043A34206P1422G4895c1232j94309A26387b44485I1906
12521B66872a05354d3211l7523E8185k5021g2166M920J324m3919n0076A24194
12509f8364K3995j68266A47995b1346i369j55477k18412i6652r2726A59657a06438
12497E9843J5023R2765b58131A06806E1827h3658k81800a48952F9472J47953P5704
12486B93129a6870l2845n5390j19095A65140R7909E2345L208K37006o2606B4999
12474D331J79161b74658D8101g8955a9064j05320A17893A2190J97240b1957h82
$$ y = [70777, 729, -7728, -25331, 215923, -30300, 90653, 240168, -174669, -34551, -18597, 330734, -99621, 78837, -51255, -42726, -58716, -154727, -47819, 158588, 82397, 259163, 72530, 156394, 39805, 271848, 134206, 205628, 74895, -31232, -225541, 126387, -244485, 91906, 266872, -105354, -43211, -80734, 58185, 33164, -72166, -67246, -65922, -109841, -159917, 124194, -68364, -44369, -212635, 147995, -21346, -9369, -164846, -383258, -96652, -189378, 159657, -106438, 59843, 74866, 167631, -258131, 106806, 51827, -83658, -365458, -148952, 69472, 217425, 293129, -16870, -49715, -105105, -224200, 165140, 263049, 52345, 55553, 292559, 229953, 24999, 4331, 183492, -274658, 48101, -78955, -19064, -124384, 117893, 12190, 209430, -21957, -882]
12462C24061E5806L3J09457a48288K4965A62873E7792J24823f9428j89525K6024
12451b32929B13826a58093A2846f717B4257h9418C5286Q6384f1998B40842r4810
12440A46032g2684a7136A4219O90f1668A45859a3659B32888b86517A19064j8904
12429A00160C9230g2097b7419A40071E6378c2179m469j01285B8814c4909k70533
12418c05442F0c29848K6108I0964c58681L399F1209j6623e8177b8028B3666d9379
12405A73349J8829c7023A3730J40772d7356F5447A9788c14571D8894b46582G9962
12393b79333b9498B36198d86011A52115J44291d1764j1366k00417P2847j18391
12383b99091A02910A6231J26937A7131m341L1472d5672G3117K414a50257A2509
$$ y = [324061, 55806, 55839, 165296, -148288, -123323, 162873, 57792, 182615, -69428, -258953, -232929, 213826, -158093, 12846, -6717, 24257, -89418, 35286, 121670, -61998, 240842, 146032, -72684, -17136, 14219, 14909, -61668, 145859, -13659, 232888, -286517, 119064, 100160, 39230, -72097, -27419, 140071, 56378, -32179, -36648, -137933, 28814, -34909, -305442, 60, -329848, -303740, 90964, -358681, -355282, 61209, 44586, -58177, -28028, 23666, -49379, 173349, 192178, -37023, 13730, 154502, -47356, 65447, 19788, -314571, 48894, -246582, 79962, -279333, -29498, 236198, -486011, 152115, 296406, -41764, -53130, -253547, -180700, -299091, 102910, 16231, 143168, 17131, 12790, 44262, -45672, 73117, 75531, -150257, 12509]
12371b31509A13933l3497P9931a16952L4292g573A0059J63452D7300J04570J38913
12360B90783a11759p2407J4037N1845J3157q1778k14215h0852k63957C6018O3007
12349I9025J22187a40194A59456O3391b99698A20390L21910b26519R5911A7432
12338A35040K156E4965e9711A69897R977e241C469b05101G9735f9387p7627C61707
12325H8128B002a21721A6531a24729O347j77209A95622a6591A03497Q068A8551
12313A48739d5086j57620A63433d20419I5580c3636A35687b12123F0669a63604
12302E7516a98238B6900K15470N1727E1818b37265N3864N0090N8071C785a09718
12290d1887A95728j1694q2151M8621K09211A12648c9183m6679a8867G8476L56634
$$ y = [-231509, 113933, 80436, 160367, -116952, -82660, -7573, 10059, 173511, 47300, 151870, 290783, -111759, -184166, -170129, -118284, -105127, -186905, -401120, -80852, -344809, 36018, 99025, 221212, -140194, 159456, 222847, -299698, 120390, 442300, -226519, -130608, 17432, 135040, 137196, 54965, -59711, 169897, 179874, -5241, 3469, -205101, 79735, -69387, -147014, 361707, 88128, 2002, -121721, 16531, -124729, -118382, -295591, 195622, -16591, 103497, 111565, 18551, 148739, -45086, -202706, 163433, -420419, 95580, -33636, 135687, -212123, 60669, -163604, 57516, -198238, 26900, 242370, 294097, 51818, -237265, -183401, -133311, -75240, 3785, -109718, -41887, 195728, 184034, 101883, 150504, 359715, 112648, -39183, -85862, -18867, 78476, 435110]
12279D35110A55961b26041A16531f805G325O0008J38176I4035L5348j3391B2062
12267D7521J55463j3475a17629M3236A40700j1764l1138J70985A7150L44193B4570
12255A402h7624j4186B13983F0467L7382J14649L876K92427D6868J63347c4263
12243G3871b39227A21110J01981j09910h1769H6459e6982j62941h6065A58554
12232h9287B34694j11325b08789B47616k3627j08245K99682A25001K32647m6394
12222C11254J30523A56761O4716J33732p5731p2304L2747D0363N0366a24805c5046
12210A11599J67483e5488l4920q8484C01300l6079M2940A10559L7252J31359j12094
12199A67076c2829p4406D8381f1178B00712J46891Q073j54980n8958J12760C5096
$$ y = [435110, 155961, -226041, 116531, -6805, 7325, 67333, 205509, 94035, 129383, 115992, 22062, 47521, 202984, 189509, -117629, -74393, 140700, 128936, 97798, 268783, 17150, 361343, 24570, 1402, -87624, -101810, 213983, 60467, 97849, 212498, 216374, 508801, 46868, 210215, -34263, 73871, -239227, 121110, 223091, 113181, -81769, 86459, -56982, -219923, -86065, 158554, -89287, 234694, 123369, -208789, 247616, 223989, 115744, 415426, 125001, 357648, 311254, 441777, 156761, 221477, 355209, 279478, 207174, 239921, 40363, 90729, -124805, -35046, 111599, 279082, -55488, -90408, -178892, 301300, 265221, 308161, 110559, 147811, 279170, 167076, -32829, -107235, 48381, -61178, 200712, 347603, 355676, 200696, 141738, 254498, 35096]
12187D12138A41689B1307M34852B09317C8761J14835l7218E4027a19733A30425
12176A66768L1797r720o6590l3574O0659e0820a3119n6985B23565c7230B66957
12164d7079A97883q765J9950a2913H8749a35200B89815J18820A96197c9687j45352
12153a85039k0660C0621J76757A8368a44090k37044I1822J6551m1046J11610C2227
12141a46107C23596c7480O133m4916r1626A12946n6090a63105B80888a23147D0556
12129h1670j1142A1526c26014a31109B119e6701j14568A51149c14757A23665e6682
12117c3417A64692h6844C76911B5335c23187G4929b67134A37129e1058A38488
12106B36726a33682A24971l2232a5423k42565O3408C12673C1516K2806J91261
$$ y = [412138, 141689, 21307, 456159, 209317, 38761, 153596, 116378, 54027, -119733, 130425, 166768, 198565, 188845, 122255, 88681, 149340, -50820, -13119, -70104, 223565, -37230, 266957, -47079, 197883, 189118, 209068, -12913, 88749, -135200, 289815, 408635, 196197, -39687, -185039, -205699, 30621, 207378, 18368, -144090, -381134, 91822, 108373, 67327, 178937, 32227, -146107, 323596, -37480, -31347, -76263, -167889, 112946, 56856, -163105, 280888, -123147, 40556, -81670, -92812, 11526, -326014, -131109, 2119, -56701, -171269, 151149, -314757, 123665, -56682, -33417, 164692, -86844, 376911, 25335, -323187, 74929, -267134, 137129, -51058, 138488, 236726, -133682, 124971, 92739, -15423, -257988, -194580, 312673, 31516, 54322, 245583]
12096B45583b0995k2413j52863D8901R7937f143B53724H9160R565b48219B00568
12084a31382q0504A32952A0733N7433K03756K6669J009555M73524H24227B02930
12073B13662q4084h9388B9010c15847H4086J00289J3698k9376c5775E9024A4449
12061e0960K1493A6823f894B07077m7757a16194e410A03462K634J13568b22094
12049b19409B8212J12607l1339h1413j44751M2329B49816G6768N8509a2020j79662
12038a91682A45858a34024j09759B3966q266b0443O634j35978H0679a38938B55500
12026c33035D03714b15625h894l4193B95184C121c3073A01136J60013b04796A26253
12014h4931A47918C3590b18958H6635D6b14157A45055a08955P561A40724b5871
$$ y = [245583, -20995, -43408, -196271, 48901, 146838, -6143, 253724, 89160, 98725, -248219, 200568, -131382, -211886, 132952, 10733, 68166, 271922, 298591, 1308146, 1781670, 824227, 202930, 213662, 129578, -89388, 29010, -315847, 84086, 184375, 198073, 168697, -35775, 59024, 14449, -50960, -29467, 16823, -6894, 207077, 159320, -116194, -5410, 103462, 106096, 219664, -222094, -219409, 28212, 140819, 109480, -81413, -226164, -183835, 249816, 76768, 135277, -12020, -191682, 145858, -134024, -243783, 23966, 15700, -20443, -13809, -149787, 80679, -138938, 255500, -333035, 403714, -215625, -8894, -43087, 295184, 3121, -33073, 101136, 261149, -204796, 126253, -84931, 147918, 33590, -218958, 86635, 46, -214157, 145055, -108955, -101394, 140724, -25871]
12002a98220n2634B01366D2255a4562j02303A223J68073f5658l27155a13668B7759
11990D2681i8665l6338k60702a01218l4085r0858b1079l7344k48988A58376J47995
11979C06371H9862a5830l31094D09705b38358A73318c32519A1817k354e1921a110
11967D5936d77000B08279m6004b19518C19777c7193n8510j14960N1283A27984
11956A22888i7416j62115K1992A06697a53856j58603F0398c158A62141M1598B9985
11944E3344e6422A41714a45020K5714A77987D2405b60422A1190a46297j05878
11934b52175E3460p951J28664i4312K6281L0354j541k9330B62330a44720O2786
11923h1934m15082d0320a2450H6605C2990b30237A26027i6389q9144A6052K10482
$$ y = [-198220, -250854, 201366, 42255, -14562, -116865, 1223, 169296, -65658, -392813, -113668, 27759, 42681, -98665, -135003, -395705, -101218, -135303, -226161, -21079, -58423, -307411, 158376, 306371, 89862, -15830, -346924, 409705, -238358, 173318, -332519, 11817, 9463, -51921, -1110, 45936, -477000, 208279, 162275, -219518, 319777, -37193, -95703, -210663, -159380, 127984, 122888, -97416, -259531, -237539, 106697, -153856, -312459, 60398, -3158, 162141, 203739, 29985, 53344, -56422, 141714, -145020, -119306, 177987, 42405, -260422, 11190, -146297, -252175, 53460, 45509, 174173, -94312, -68031, -37677, -39218, -68548, 262330, -144720, -81934, -497016, -40320, -12450, 86605, 32990, -230237, 126027, -96389, -185533, 16052, 226534]
11912B26534a29768E41366a27354A8047b07288P3748j22703f166j61776e6206
11901f7776E6524R3444d47826J73711C64336C766e213o2642A4820c28374A09612
11889b0075n6318B66722e170j93285N4962o9171g8391c2762A43325P7704a28631
11877D0251e3286D4545i5396l05096a6894A5223b16926N8540A29785b23650e1349
11865a32832o01M9647h325D5476a04256m3327C58193I7857L8554Q9921b33695
11853A57830E7218i3266b2672q0148k73618A17582a5745l69634a82756e0356A48186
11841a28179d7921p2198G3101k0150a5404j04668B16744D823i8148G1018L52441
11830D23459A14191g810j70262H3988a45134K7728K581A20901i681j03460H4845
$$ y = [226534, -129768, 541366, -127354, 18047, -207288, -133540, -256243, -6166, -167942, -56206, -67776, 56524, 149968, -447826, -274115, 364336, 3766, -5213, -67855, 14820, -328374, 109612, -20075, -76393, 266722, -5170, -198455, -143493, -212664, -78391, -32762, 143325, 221029, -128631, 40251, -53286, 44545, -95396, -400492, -16894, 15223, -216926, -158386, 129785, -223650, -51349, -132832, -133433, -83786, -8325, 45476, -104256, -147583, 358193, 97857, 136411, 226332, -233695, 157830, 57218, -93266, -22672, -102820, -376438, 117582, -15745, -385379, -182756, -50356, 148186, -128179, -47921, -120119, 73101, 52951, -15404, -120072, 216744, 4823, -98148, 71018, 423459, 114191, -7810, -178072, 83988, -145134, -117406, -114825, 120901, -9681, -113141, 84845]
11818h9845c4226A2818K73974a07908f415B09706J0017i4885K2020p0793J0711
11807a32947N3131k27236a43530M7843f792l10583A78572g7543C4140a15101r5078
11796b10179b3406A4830g7740j08540i2500B10857f6435j24639A26832b12002
11785a19823J1859J5562k8336L8109B0902J84386d15584B8070R4087a7541A77499
11773D55215e4110H1812M3300J56940B4990O2882J77349c67059e7206A87193O4264
11762B51457a68680o4947c5483k3835B06315I2695D779N3383e4999k20485c5737
11750B0027K24083q6675J127P6688o1063O8840J02176A10525n1125g4643q0883
11739a55526j08059J27820E7132a09723A04418K38651A9849J62941b6846A12682
$$ y = [-89845, -34226, 12818, 286792, -107908, -6415, 209706, 219723, -94885, -72865, -143658, -132947, -79816, -307052, -143530, -95687, -6792, -317375, 178572, -77543, 34140, -115101, -210179, -23406, 14830, -77740, -186280, -92500, 210857, -66435, -191074, 126832, -212002, -119823, -107964, -92402, -120738, -82629, 20902, 205288, -415584, 28070, 122157, -17541, 177499, 455215, -54110, 81812, 125112, 282052, 24990, 87872, 265221, -367059, -57206, 187193, 251457, -168680, -233627, -35483, -59318, 206315, 92695, 4779, 58162, -54999, -275484, -35737, 20027, 244110, 157435, 158562, 235250, 174187, 243027, 345203, 110525, 59400, -74643, -155526, -263585, -135765, 57132, -109723, 104418, 343069, 19849, 182790, -26846, 112682]
11728A13795a48595H4328J13865J118l6405k4953n7630c1204B6813b99876B23466
11716b55595J16286e2531A21273C1701b15406A39039p793E7N1788K5856C7765
11704e9630B06075A4138b96791g9798j56432A53858m4807b37438k47420A40199
11693a26084A71405N9636B49Q7008c5249E3044L232J11152i8253A27225a11240
11681D8871a46913A17352b7418j6603F4324l1583K27970b9270q9739mJ5801L7650
11669f5562j05640c2325k78808i531j80677f9376j93910B87881a54255B61951
11658F7358l0587J03654j7518b69132C56135A5050K28115b5087r7065d1669B01159
11646B46916A19807a18095B84521a8152A50210b46233a18627A10774a33389B45654
$$ y = [113795, -148595, 84328, 198193, 199311, 162906, 137953, 80323, -31204, 26813, -299876, 223466, -255595, -139309, -52531, 121273, 31701, -215406, 139039, 131246, 57, 51845, 77701, 37765, -59630, 206075, 14138, -296791, -79798, -236230, 153858, 109051, -237438, -484858, 140199, -126084, 171405, 231041, 249, 87257, -35249, 53044, 56276, 167428, -98253, 127225, -111240, 48871, -146913, 117352, -27418, -44021, 64324, 32741, 260711, -29270, -119009, -119013, -103212, -65562, -171202, -32325, -311133, -9531, -190208, -69376, -263286, 287881, -154255, 261951, 67358, 36771, 140425, 122907, -269132, 356135, 15050, 243165, -25087, -122152, -41669, 201159, 246916, 119807, -118095, 284521, -18152, 150210, -246233, -118627, 110774, -133389, 245654]
11635i6766K3872L1595j54285N2537h226A65593c7209k1594J7606E2771g5182
11623C44252d4468l2755q9431E5054O8657a15350H9102j4692j8610K46396b6139
11611A35908f7536F1831O3621E8063M3989B1781K16368n4103a68740j91092C1966
11599C27100D0500J36770H96K08470D0728J0462A7659R2237e5175A67785b58913
11587c08461C1214d7242J2171A87184l4894e9049A06717d402E0090J50162f1336
11575a45364B07517D668e4144C08065J3351A0111c23047P1707H2550b3667A31346
11563a12589e2380H3271J53152K6681A07321a8901q1660A87794j974g1137j84253
11552b55390C73737D7958K68771D6380a38448G2474O9888g2987n7461b217A92004
$$ y = [-96766, -72894, -41299, -195584, -143047, -8226, 165593, -37209, -58803, -41197, 52771, -75182, 344252, -44468, -77223, -166654, 55054, 123711, -115350, 89102, 74410, 55800, 302196, -26139, 135908, -67536, 61831, 125452, 58063, 102052, 21781, 238149, 184046, -168740, -359832, 31966, 327100, 40500, 177270, 896, 209366, 40728, 51190, 17659, 109896, -55175, 167785, -258913, -308461, 31214, -47242, -35071, 187184, 152290, -59049, 106717, -4402, 50090, 200252, -61336, -145364, 207517, 4668, -54144, 308065, 321416, 10111, -323047, -251340, 82550, -23667, 131346, -112589, -52380, 83271, 236423, 263104, 107321, -18901, -100561, 187794, 185820, -71137, -255390, 373737, 47958, 316729, 46380, -138448, 72474, 142362, -72987, -130448, -2217, 192004]
11540b09499B11331M6402a34133c3520f787A17653K06260j37005j5984P8843n4479
11529A95288o7072E5958d4678B32216A0569f3031D725a06779F9981J78247a05833
11517D89609A56707c2439I2480e7045A06444P448C4343J06920a2471K978A31140
11505F6942J00945N7575a46420B50454r6391K6976M47668A60828a03562C06644
11494D2177Q0915d487B40989C7742a06795A90787b59330E6884J63013i5070p1774
11483a66844F3432K56069j46989n3143M0276E0027K71586A46645e4850C97930
11472B48896a5886E372J30365n2395J27435r6886J81875d1861A43230J5294J23096
11461B81620c867B04402N410A1432J96247A933R5535a55738k27727A45351b68258
$$ y = [-209499, 211331, 257733, -134133, -33520, -6787, 117653, 323913, 186908, 170924, 249767, 195288, 128216, 55958, -44678, 232216, 10569, -63031, 4725, -106779, 69981, 248228, -105833, 489609, 156707, -32439, 92480, -57045, 106444, 113892, 34343, 141263, -12471, -9493, 131140, 66942, 167887, 225462, -146420, 250454, 154063, 181039, 628707, 160828, -103562, 306644, 42177, 123092, -4487, 240989, 37742, -106795, 190787, -259330, 56884, 219897, -95070, -166844, 63432, 319501, 172512, 119369, 159645, 50027, 321613, 146645, -54850, 397930, 248896, -15886, 5372, 135737, 83342, 210777, 113891, 295766, -41861, 143230, 158524, 281620, -3867, 204402, 209812, 11432, 207679, 1933, 97468, -155738, -383465, 145351, -268258]
11449a39169A24102C2196a76893D66114A7368K03082O9333g1992l4360p6460g6700
11437A04681f1824o3432F7711K19815k4319c66245a21605D06152a0367q3133c8145
11425f2569b3149j54837a1943B00624Q096f7580D4728N4072k0604j794a30913
11413b48545A42284B1991J87888e6195A57381E7147k1669M1964b40935A06783
11402A3971J15290O4837O1847a7616G5823J93793E8423c3606K836l6170A73012
11390A18917k7893a57462c3905C20713b47631J09515l0041n02A62743d94482F2551
11378e5508D5085L4113R5905h4384A95563O0644c43735B44178A18094b25813e7708
11366b54902L4140i0108A03222B1221h7673m5475D47805I972J87897C350K10700
$$ y = [-139169, 124102, 32196, -176893, 466114, 17368, 220450, 289783, -71992, -106352, -182812, -76700, 104681, -61824, -125256, 67711, 287526, 263207, -366245, -121605, 406152, -10367, -93500, -38145, -62569, -23149, -177986, -11943, 200624, 208720, -67580, 44728, 98800, 78196, 76402, -130913, -248545, 142284, 21991, 209879, -56195, 157381, 57147, 35478, 77442, -240935, 106783, 13971, 129261, 194098, 255945, -17616, 75823, 269616, 58423, -33606, -30770, -66940, 173012, 118917, 91024, -157462, -33905, 320713, -247631, -138116, -168157, -168659, 162743, -494482, 62551, -55508, 45085, 79198, 175103, -84384, 195563, 256207, -343735, 244178, 118094, -225813, -57708, -254902, -220762, -90108, 103222, 21221, -87673, -133148, 447805, 9972, 197869, 3350, 214050]
11355B14050a9217k3486A02017a69202r5639a291q7849H9417b50152e1423E19176
11343A81914A7569K25813a34928D3632a10957E6257K81689a65259k59970A10482
11332d9969A08748c1245C02270j30431F7613g9930k31823o2261C85827a14336
11321A17786o349B8726J50478b50929A09505j9406K5580h8648b9121F7656A197
11309G0117f9415c4075k02087n7989a5506j9694A41115b53010g8539A76226b73407
11297i6487I2474d7107k2324m6962N6800p6719N3663l01052B2247K9731b59747
11285B7960a52819o9951M1047A1892a19073A51889a75675Q7302k2611A98661k0209
11274A78452H2695a06772O64k21588c2343n07423a23430H6726a26040l7214f24
$$ y = [214050, -19217, -42703, 102017, -169202, -264841, -1291, -89140, 89417, -250152, -51423, 519176, 181914, 17569, 243382, -134928, 43632, -110957, 56257, 337946, -165259, -425229, 110482, -49969, 108748, -31245, 302270, 171839, 67613, -79930, -311753, -374014, 385827, -114336, 117786, 111437, 28726, 179204, -250929, 109505, 90099, 115679, -88648, -29121, 67656, 1197, 70117, -69415, -34075, -236162, -294151, -15506, -35200, 141115, -253010, -78539, 176226, -273407, -96487, 92474, -47107, -69431, -116393, -59593, -136312, -82649, -383701, 22247, 51978, -259747, 27960, -152819, -222770, -181723, 11892, -119073, 151889, -175675, -88373, -110984, 198661, 178452, 82695, -106772, -106108, -327696, -32343, -539766, -123430, 86726, -126040, -163254, -624]
11262a55987k9895A94181H9891a83664F6196K0307N9280i5452m8501p533B15208
11250b54088P8426H5661a42163B126f4108B31404b95605H5735b8205A48710c63349
11238A93018b96728Q7743F0834b62428A64285d6239l02304d166k43818a18131
11227a07515n0003B7711J28197d01728Q8451A6564f1105l00548e0059A99088a02248
11215f3940B4523d22447B4817b00221j1128A38111b23679O2463k10956D9749j8032
11204C1717J14795a16838j04135g2879B68836b9417A26239c8647C32094j57180
11194A74914f2657r4521K9728A12792j1475D592b6264j91570g5629A6360f9713
11182b49311F9233J72463a4096I1445K5560d448l4980j79022D17538A8749a3576
$$ y = [-155987, -185882, 194181, 89891, -183664, 66196, 86503, 145783, -95452, -143953, -151486, 215208, -254088, -175662, 85661, -142163, 2126, -64108, 231404, -295605, 85735, -28205, 148710, -363349, 193018, -296728, -208985, 60834, -262428, 164285, -46239, -348543, -4166, -247984, -118131, -107515, -157518, 27711, 155908, -401728, -313277, 16564, -61105, -361653, -50059, 199088, -102248, -63940, 24523, -422447, 24817, -200221, -211349, 138111, -223679, -161216, -372172, 49749, 31717, 146512, -116838, -220973, -72879, 268836, -29417, 126239, -38647, 332094, 174914, -62657, -157178, -127450, 112792, 101317, 4592, -26264, -217834, -75629, 16360, -69713, -249311, 69233, 241696, -14096, 91445, 117005, -4448, -39428, -218450, 417538, 18749, -13576]
11170c3365f34j59868P0491d3891A10327b39104H0375c75630J001J33457A67794
11158c6150C5397j0048Q9558i5558c9220A39136h0432A53966Q0025i1720C7252
11146B36120p9052f5580k03971A69285e0026j4699a5384A49661n4916a29804D45964
11134B46432F5596L57152K1740h5208D6471c0757B18618c33544a0783A28678i921
11122A48025K25875B4118a85371B31414D5516L8055R1799K0273A698b36772d5035
11110E7046i3572A97730c18579A77064R8114c90869A35145N7479o5396J93234
11100C20462i5647P919B85034q4181b3599A45590m8769N806D2203i4305A09899
11088a10039E96639A78214l5759F1724b9762D04334A52426K5401D629J93672n5136
$$ y = [-33365, -634, -160502, -90011, -43891, 110327, -239104, 80375, -375630, -374629, -241172, 167794, -36150, 35397, 25349, 114907, -95558, -39220, 139136, -80432, 153966, 233991, -91720, 37252, 236120, 157068, -65580, -269551, 169285, -50026, -64725, -15384, 149661, 94745, -129804, 445964, 246432, 65596, 422748, 444488, -85208, 46471, -30757, 218618, -333544, -10783, 128678, -9921, 148025, 373900, 24118, -185371, 231414, 45516, 83571, 175370, 195643, 1698, -236772, -45035, 57046, -93572, 197730, -318579, 177064, 275178, -390869, 135145, 192624, 127228, 320462, -95647, -87728, 285034, 200853, -23599, 145590, 96821, 102627, 42203, -94305, 109899, -110039, 596639, 178214, 142455, 61724, -29762, 404334, 152426, 177827, 4629, 198301, 143165]
11077A43165G600M53534G1251L00069P0710A5676K24156J47670a4101A11189J75414
11066B86603K04248B29767M9293m1417K87830k17382L81419k33315n6433C2575
11055H73907j25409B99300J13937N23211l53239q3222L932J20011J73836l47765
11045D50001L91879K2641k42057m9934j37992J15027L38146m08659L24990k13868
11035E90174j13471K32863m8034j05614P7568j46135J65833k4373o7835J19292
11025F80268O4883J09324l3102k77907k8384j65886J87344M5485N710k02042R5473
11014D81166M168N4684k23965L78857o5489j16653k4076j64397M65498j83764
11004F06029k77998K14321j01460L21126j75932J25244j0082k12977K47707j54700
$$ y = [143165, 7600, 461134, 71251, 371320, 442030, 15676, 239832, 387502, -14101, 111189, 286603, 490851, 229767, 279060, 237643, 525473, 308091, 689510, 456195, 399762, 32575, 873907, 748498, 299300, 413237, 936448, 583209, 499987, 503919, 623930, 797766, 450001, 841880, 864521, 622464, 572530, 434538, 549565, 887711, 479052, 804042, 590174, 476703, 709566, 661532, 555918, 633486, 487351, 653184, 628811, 560976, 680268, 745151, 854475, 821373, 543466, 515082, 349196, 536540, 582025, 587735, 385693, 481166, 485334, 540018, 316053, 694910, 629421, 512768, 488692, 324295, 789793, 606029, 328031, 542352, 440892, 762018, 586086, 711330, 701248, 488271, 735978, 581278]
10994E81278p2900K58215j55450r0147N0584K33682n7628K10891r9093L98016
10984A257448n80227J86538K21609o5143n8252j95396Q14764m21672O12722j58019
10974A614372J94439L57679K70673j6465J1531k26918J28458l27474l75288q355
10964A622652P6745m9387j43244J04538l348J34104J48401q4800k69463M0471
10954A576669q8057m31169O7083j35002k62927r8817k00359k02166L01271j36109
10944C90417I9177M6128J56198H0530J97454k5338I8329l3483N3981a20733D8278
10932d8097F0018K88800b51314i9221C00645A09769D0887g6159L3991p8770A99334
10920F758J05419j2173a77627B26709h0824F6361d52988h0792n0415k32263k1665
$$ y = [581278, 508378, 766593, 611143, 520996, 571580, 805262, 747634, 958525, 859432, 1257448, 677221, 863759, 1085368, 1020225, 961973, 766577, 1581341, 1159669, 1772391, 1614372, 1808811, 2166490, 2437163, 2420698, 2432229, 2205311, 2333769, 2006295, 1631007, 1622652, 1699397, 1650010, 1506766, 1611304, 1607956, 1742060, 1890461, 1805661, 1536198, 1576669, 1488612, 1057443, 1124526, 989524, 726597, 627780, 427421, 225255, 526526, 390417, 99177, 145305, 301503, 80530, 277984, 252646, 98329, 64846, 118827, -120733, 48278, -48097, 60018, 348818, -251314, -99221, 300645, 109769, 40887, -76159, -42168, -120938, 199334, 6758, 112177, 100004, -177627, 226709, -80824, 66361, -452988, -80792, -131207, -363470, -385135]
10909c85135h1643M0478J6391A85636g5077A11786b28226d9870k31936a26347
10898C6004f2470j73272H5926a2799C34011b38017R1205q4374G249L54045b12580
10886B22837b2760m29179F5875A8325b52675b0630k03002B33113Q2154j52796
10876A62471c08611a45398L0698J4672C35375a51493M6712m0333j07606B05495
10865G1532B6260c5839l1134q0421B85125i5404q5043O2752e5393F169d5980p7002
10853a22982b3538A10727a9063j7094m8326A54498g4458B1379a11927a5141A55931
10841B56787d0556j823j19693H410J81662n4589a79066j76427A53628K6542b31500
10829a23583c7626A5605b75247c5029A20352Q7728a67812B81074A3382N4164a00808
$$ y = [-385135, -81643, -41165, -24774, 185636, -75077, 111786, -228226, -49870, -281806, -126347, 36004, -62470, -235742, 85926, -12799, 334011, -238017, -146812, -231186, 7249, 361294, -212580, 222837, -22760, -451939, 65875, 18325, -252675, -20630, -223632, 233113, 315267, 162471, -308611, -145398, -114700, -100028, 335375, -151493, -104781, -145114, -252720, 205495, 71532, 26260, -35839, -66973, -147394, 285125, -95404, -180447, -117695, -55393, 6169, -45980, -122982, -23538, 110727, -19063, -36157, -84483, 154498, -74458, 21379, -111927, -15141, 155931, 256787, -40556, -42379, -162072, 8410, 190072, 135483, -179066, -355493, 153628, 180170, -231500, -123583, -37626, 15605, -275247, -35029, 120352, 208080, -167812, 281074, 13382, 67546, -100808]
10817B2479a0573B34557B1883a51786o970A83416e7953L374j01553J8491A91464
10805b3012C47530H2536a09169o9881L1108B6507L07915d1542m48289G6689b6289
10793I4042l0046b09103P5049H8618c4271J2220A06174e1778l36730A83002a43006
10781H6980b90291J42490J4702K1320M1356A23226K0849o9739b6480j62821B46544
10769C11794i4068A33122a82965q742h3831J8292k3723q0060A86977G7447J32231
10758B09678B1943O4689a59018q9800c2983p5624G0620D86c06113J2272C7092
10746a58932g2216A51320b54143g5357m8623K8739q9721b5655l74098a0010m9433
10735e9443k39972B28719A7517J10265j3245M942g9297j27061c4505a1508k21934
$$ y = [22479, -10573, 234557, 21883, -151786, -158756, 183416, -57953, -54579, -156132, -137641, 191464, -23012, 347530, 82536, -109169, -179050, -147942, 26507, 334422, -41542, -489831, 76689, -26289, 94042, 63996, -209103, -134054, 88618, -34271, -22051, 106174, -51778, -388508, 183002, -143006, 86980, -290291, -147801, -133099, -111779, -70423, 123226, 144075, 74336, -26480, -189301, 246544, 311794, -94068, 133122, -182965, -191707, -83831, -65539, -89262, -169322, 186977, 77447, 209678, 21943, 86632, -159018, -248818, -32983, -108607, 70620, 486, -306113, -293841, 37092, -158932, -72216, 151320, -254143, -75357, -123980, -95241, -184962, -25655, -399753, -10010, -59443, -299415, 228719, 17517, 127782, 114537, 119479, -79297, -206358, -34505, -11508, -233442]
10724b33442i1170j58020A74504j3616P4107E3200e9484k4249r2129j074p0371
10713b47307D5795c79927f1308j70508h8071B06324B1242a84332C5930K8678a17621
10701B102c1279k25382m9333P978a5372j21819a5919r5268M7867m7786m7098j07630
10689b65834J2499A9818d75009A67170d5997n5762E0637a75563B09082G5824J18765
10678A94589a91608a7105C771b45835d8931D84813a38685K1500k00037A76267
10667A18938m6584J71773H7710k5594K7972J09138J00275C7542d49632A48027
10656b94849J04264o5444I2190c2006R58j21161M1230A55454h0960a1617A90007
10644a67971p9176C0736d548K018B01508g2106R209j20539m3739B86724G9872
$$ y = [-233442, -91170, -249190, 174504, 160888, 234995, 53200, -59484, -83733, -175862, -176936, -247307, 45795, -379927, -61308, -231816, -88071, 206324, 21242, -184332, 35930, 64608, -117621, 2102, -31279, -256661, -305994, -298016, -15372, -137191, -15919, -111187, -63320, -111106, -158204, -265834, -253335, 19818, -475009, 167170, -45997, -101759, 50637, -175563, 209082, 75824, 194589, -191608, -17105, 3771, -245835, -48931, 484813, -138685, -117185, -317222, 176267, 118938, 72354, 244127, 87710, 62116, 90088, 199226, 299501, 37542, -449632, 148027, -294849, -190585, -256029, 92190, -32006, -31048, -152209, -110979, 155454, -80960, -11617, 190007, -167971, -247147, 30736, -4548, -2530, 201508, -72106, -62897, -183436, -227175, 286724, 79872]
10632a21223L2589k229j42121q5064f6853p4145A96617a40353m1399H1455C1689
10620b97737a20340j10497l2845P8401M3985A45380m0277a98781B44190a81654
10609h3140a6985A00466O1392a62083B08856n4668b88855A23411i6867r6876I4437
10597c3030A0482J5342J39169a08633K7221k27245A67423C9457J41354a28995
10586e0633q1475n3443f6196D7620O3447a64087l36044e7536j71427k63971J88648
10575c04286a32098f5144r8844A93761c698A33154O1355j7549a87498O6980k67729
10564c88247I6411k6205C504K2796b0450j64649A65643b66795j605B25505C3611
10552a02605k02127A96038B8664c59973b5724A56262K12446b93235J12562A28637
$$ y = [-121223, -88634, -90863, -232984, -318048, -66853, -140998, 196617, -140353, -181752, 81455, 31689, -297737, -120340, -230837, -263682, -185281, -141296, 145380, 105103, -198781, 244190, -181654, -83140, -16985, 100466, 161858, -162083, 208856, 154188, -288855, 123411, -96867, -193743, 94437, -33030, 10482, 25824, 164993, -108633, -81412, -308657, 167423, 39457, 180811, -128995, -50633, -132108, -185551, -66196, 47620, 111067, -164087, -500131, -57536, -228963, -492934, -304286, -132098, -65144, -163988, 193761, -3698, 133154, 194509, 176960, -187498, -120518, -388247, 96411, 70206, 3504, 26300, -20450, -185099, 165643, -266795, -268400, 225505, 33611, -102605, -304732, 196038, 28664, -359973, -25724, 156262, 368708, -293235, -180673, 128637]
10541A72582o0207f4980B7636c34305E7557h9723j9808A0725c49988A88474a09104
10529e3650B72402i0593m9899k54859C60944g9227J2128A13049e2357m7119r886
10518a09362b5846l24395a06269a9586I331b14893k99239L7759b379m1500j54448
10507a98327C3942J99134c9884k75882a30237d5765j92705e0840A77682m0674
10497A37008f4347B484b64078D3693o531K15464b16688I8987a77285a6337B66415
10485a6169k30353A65973j4669l963K67530m290C721N76779B85127A07907a58972
10473A35696K9189J01335a3973q8075A71049p0274K69132C6254g2848k87569g6571
10461G9168m674g6135G7942Q525M329I611a09277A80527F3056b20267C7256J22955
$$ y = [172582, 112375, -64980, 27636, -334305, 57557, -89723, -109531, 10725, -349988, 188474, -109104, -53650, 272402, -90593, -140492, -395351, 360944, -79227, -67099, 113049, -52357, -99476, -109362, -25846, -350241, -106269, -19586, 9331, -214893, -514132, -476373, -2379, -43879, -198327, 33942, 233076, -39884, -315766, -130237, -45765, -238470, -50840, 177682, 137008, -64347, 2484, -264078, 43693, 37162, 252626, -216688, 98987, -177285, -16337, 266415, -16169, -246522, 165973, 151304, 147341, 414871, 410581, 3721, 580500, 285127, 107907, -158972, 135696, 164885, 266220, -13973, -102048, 171049, 100775, 369907, 36254, -72848, -360417, -76571, 79168, 74494, -76135, 77942, 86467, 90796, 9611, -109277, 180527, 63056, -220267, 37256, 160211]
10449A60211L49653I8512e0517j20240A08121a77305A7136a42889B79964b60303
10438A7316J65935d03049e9241H6785b60603D9725J35748H8953H86a44520b9660
10426A51561b74993a5563B9697i8877I456M2037K86856a8567p1834e621A1886
10414a70336r3946O9303A08548a06594E0406b1335A26566C844b20327C7356J3399
10403E0755J7734e1970r9253f1865j34506o214A61051E9609d2489B53930a6242
10391H3178K10534J1599k2871a73376A55983f9383H4859J75057f7113r8624A00295
10379B82433j10240b43859C09778e5139B73522K67G6912M813L85699k14602G5621
10367F54312l03968F6399J29429O0860K53339F3645J18126L929R4141G9263a29006
$$ y = [160211, 509864, 98512, -50517, -170757, 108121, -177305, 17136, -142889, 279964, -260303, 17316, 183251, -403049, -59241, 86785, -260603, 49725, 185473, 88953, 886, -144520, -29660, 151561, -274993, -15563, 29697, -98877, 9456, 51493, 338349, -18567, -90401, -5621, 11886, -170336, -264282, -194979, 108548, -106594, 50406, -21335, 126566, 3844, -220327, 37356, 50755, 68489, -51970, -151223, -61865, -196371, -202585, 161051, 59609, -42489, 253930, -16242, 83178, 293712, 305311, 282440, -173376, 155983, -69383, 84859, 259916, -67113, -165737, 100295, 282433, 172193, -243859, 309778, -55139, 273522, 273789, 76912, 81725, 467424, 252822, 75621, 654312, 350344, 66399, 195828, 256688, 510027, 63645, 181771, 185700, 279841, 79263, -129006]
10355D52508b14147h0509B61529K47867q3201L53662k34661j45123j84359J62919
10345C78633C816N92220B50014p4731m7550k5082i722A45658k2326k4785j8045
10334H0502b36377A54975J79838D6020c04704C3643K2104L90503A2271N6281Q1658
10323A50210h4200E4563L73321j49940k5348N2909I9462O504A1108b49950C31254
10311B43002G2265c88435B09518j01623m6129a65067A35958J29794p542h773B9305
10299a28188L2674A83526g4373K1807A20148n6275b5937B56328a16321k71036
10289c87357a679j23042m7748O6245k96741J88515A81677d7052n458j38535o3299
10278b54344B04659b20523b1405k40808A61084E8125a91451d6070J3248A45509
$$ y = [452508, -214147, -80509, 261529, 509396, 426195, 779857, 545196, 400073, 215714, 378633, 3816, 596036, 250014, 175283, 127733, 102651, -9722, 145658, 123332, 98547, 80502, -236377, 154975, 334813, 46020, -304704, 33643, 55747, 446250, 12271, 68552, 150210, -84200, 54563, 427884, 277944, 252596, 305505, 99462, 105966, 11108, -249950, 331254, 243002, 72265, -388435, 209518, 107895, 61766, -165067, 135958, 265752, 258210, -8773, 29305, -128188, -95514, 183526, -74373, -52566, 120148, 63873, -25937, 256328, -116321, -387357, -1679, -124721, -172469, -106224, -402965, -214450, 181677, -47052, -52510, -191045, -254344, 204659, -220523, -21405, -262213, 161084, 58125, -191451, -46070, -32822, 145509]
10267a13388A48456a43326A96379E4527M321L01398e8615B45139H5049J83005
10257B68054J6212j40078M2063l8224a60116H1648A2478K49797J2377a78198B56561
10245A6732J33888d46503C1622A0882J89427H5896f6258m304j52131J09068c3745
10233G6952b02101G4957A2384J29567j4628b20526k051D1856K3289L5037l1288
10222F8894a63846d4278A40127b51828r1027J50218f808C3641N757g0179k19038
10211b89217A72069c767A83422c5493l74137d8624l50219B702a55058g1908c5869
10199G02c74225a58190C65484p9569b76682N8720B6815f2558F4682e136C7170
10187A36040b7934r2863k74168b627D56184a82845n8121g6798m50313e6108k41585
$$ y = [-113388, 148456, -143326, 196379, 54527, 58848, 360246, -58615, 245139, 85049, 268054, 284266, 144188, 186251, 148027, -160116, 81648, 12478, 262275, 274652, -178198, 256561, 16732, 150620, -446503, 31622, 10882, 200309, 85896, -66258, -70562, -222693, -113625, -33745, 76952, -202101, 74957, 12384, 141951, 127323, -220526, -222577, 41856, 65145, 100182, 68894, -163846, -44278, 140127, -251828, -342855, -192637, -6808, 33641, 39398, -70179, -289217, 172069, -3767, 183422, -35493, -409630, -48624, -398843, 2702, -155058, -71908, -35869, 702, -374225, -158190, 365484, 285915, -276682, -217962, 26815, -62558, 64682, -5136, 37170, 136040, -27934, -120797, -394965, -2627, 456184, -182845, -240966, -76798, -527111, -56108, -297693]
10176b97693E2101a55567f4939A39093J38646c12734C9054j1151a3801B13023
10165A7969f5086H904P9543a26633D5298Q0682Q989b51070A6646J93102R4047
10154C03795a58587f1998l7434B46717d43822a02027G9280K86658d62108c4312
10143A06290C7751c31205O9793B99880A18220a71477n8688N3607e9385j98467
10133b57852A19382i4979j75842F6707b07377p0222i001O59H5427b02659b2307
10121B20928j04012l0996K1976m9362p078a28943e2686k3678F5142Q7312b42618
10109b08800L9662b3342I4594c53609a3910m8219j15408b4995o4078j26548f9140
10097d23266C9310b87012a610B1642a5231A15065J61869J15344b21769M8372h774
$$ y = [-297693, 52101, -155567, -64939, 139093, 277739, -312734, 39054, 27903, -13801, 213023, 17969, -65086, 8904, 88447, -126633, 45298, 125980, 134969, -251070, 16646, 209748, 303795, -158587, -61998, -99432, 246717, -443822, -102027, 79280, 365938, -462108, -34312, 106290, 37751, -331205, -261412, 299880, 118220, -171477, -230165, -176558, -59385, -257852, 119382, -94979, -270821, 66707, -207377, -277599, -9001, -8342, 85427, -202659, -22307, 220928, 116916, 85920, 107896, 58534, 51456, -128943, -52686, -76364, 65142, 152454, -242618, -208800, -169138, -23342, 94594, -353609, -13910, -62129, -177537, -24995, -89073, -215621, -69140, -423266, 39310, -287012, -1610, 21642, -15231, 115065, 276934, 392278, -221769, -173397, -8774]
10085b8474j01777k75353F5589m427a68290N3016K0494k3423k35490C62867d6260
10073d6455j88093a3787o1058C4009b498k05725h5634k23708R8830g8009B04026
10061A29714d1439j00510j5491l2449K3969B7177J69405q8465k8802a95886h2510
10049a42063B19246n8635m3170R27n2959A1094e6170l20039A09109b24425d2314
10037a40073M3998d4677o7873A47213d13310A03415a51862b1668k98627b0735
10026h5087J32k8050F9312l2142J46230b06312i7070r5503j0430j30636h0304
10014a70476G8627d67303a66780P5342I6360b2975q3926A39051l2877i4384M0534
10003e3850h303A33201C7937a1754j03741A04571a6123K688j01968B25363h8403
$$ y = [-28474, -130251, -405604, 65589, 61162, -168290, -115274, -94780, -118203, -353693, 362867, -46260, -46455, -234548, -13787, -74845, 34009, -2498, -208223, -85634, -309342, -210512, -78009, 204026, 129714, -41439, -141949, -157440, -189889, -165920, 27177, 196582, 108117, 79315, -195886, -82510, -142063, 219246, 160611, 117441, 118368, 65409, 11094, -56170, -376209, 109109, -224425, -42314, -140073, -96075, -44677, -112550, 147213, -413310, 103415, -151862, -21668, -320295, -20735, -85087, -84955, -113005, 69312, 37170, 183400, -206312, -97070, -192573, -203003, -333639, -80304, -170476, 78627, -467303, -166780, -91438, 96360, -22975, -106901, 139051, 106174, -94384, -53850, -8303, 133201, 37937, -11754, -115495, 104571, -16123, -13435, -115403, 225363, -88403]
9991a856j2974H752c5219q1097l84540b29746N8313A22996A1663b03625O9952
9980a33673r553I0420L1729b85839f455l47975a47534n2623R7319L2251F0466
9968B4804K97260b82475C99838E2857c41563f9988k0990K9378A07618a44584L1278
9957a13306a2413j22415A19750J48040c5457A78767f606j14903M0270F7132J08075
9946A75207b66605A04124j7496m3272I025a92624B4741N0365b10796i9547L4837
9935f4710p9925k17835e1630J5321A54333c43075J47766I7561l8276J66649b44777
9923B55596d5470M225k64437P7192b2870l24054B9395i1821F5550R0299R3153
9912B49002b54023B80582A8756K25058j09421i7535I5276a46135B6877J11227
$$ y = [-1856, -14830, 8752, -35219, -116316, -500856, -229746, -171433, 122996, 11663, -203625, -133673, -143226, 90420, 122149, -285839, -6455, -354430, -147534, -200157, -102838, -70587, 60466, 24804, 322064, -282475, 399838, 52857, -341563, -69988, -90978, -61600, 107618, -144584, -113306, -12413, -134828, 119750, 267790, -35457, 178767, -6606, -121509, -81239, 67132, 175207, -266605, 104124, 86628, 43356, 9025, -192624, 24741, 75106, -210796, -99547, -64710, -144635, -362470, -51630, -36309, 154333, -343075, -195309, 97561, 59285, 225934, -244777, 255596, -45470, -41245, -305682, -228490, -22870, -346924, 29395, -91821, 65550, 155849, 249002, -254023, 280582, 18756, 243814, 134393, -97535, 95276, -146135, 26877, 138104]
9902A38104B3659a64895m3898h6017r3353P3596A48678c19618M9198M46C06937
9890d4008p4188F6793a3375k83284h285j35035N5360q8226A42296b04203h1369
9878A6157a7262A35858B1459M72i584A23632c86720a35260B80766A31923D4985
9866G2560d52713B2531J10468c768B0858a0454j5865l49931f5585A37324K02142
9855C39466c05771E0620N7744a98023q4661B84906c6592l10512O283d97j27053
9844a27550L8357n7188r267j23439q3603a29672j17690N4099A77526F5863g6411
9832b16756J01308A98758a75580p6817J11320F7832R4520o5566M6281a3110j94203
9821b07313d3190A01616a11905k3500J3987j80265J7606c1468A54493G125K0647
$$ y = [138104, 23659, -164895, -208793, -86017, -179370, -105774, 148678, -319618, -270420, -269974, 306937, -44008, -118196, 66793, -13375, -296659, -8285, -143320, -87960, -176186, 142296, -204203, -81369, 16157, -17262, 135858, 21459, 21931, -9584, 123632, -386720, -135260, 280766, 131923, 44985, 72560, -452713, 22531, 132999, -3768, 20858, -10454, -26319, -376250, -65585, 137324, 339466, -305771, 50620, 108364, -198023, -282684, 284906, -36592, -347104, -340821, -497, -127550, -89193, -146381, -155648, -279087, -362690, -129672, -247362, -193263, 177526, 65863, -76411, -216756, -115448, 198758, -175580, -252397, -141077, 67832, 162352, 96786, 143067, -13110, -207313, -43190, 101616, -111905, -135405, -121418, -301683, -284077, -31468, 154493, 7125, 27772]
9810B7772c72320J51330C67634a73901H9091g1102A40026C6082b3326j09134A05996
9798d7035j65786b8538A30420f645j29376L3554k07580h6871k08569C15928I111
9786e7578N844k19908j33514L9546F1919a22911b8014A9590J7142a52736O7418
9775h5318b9339j99128R0085f5150E8897b71617B08124f8734A16655b24646M6417
9764a78229A45773f4565b3822j02287k7615C6254d95340A45991b52770b6864B6716
9752c8964j1528j79018A23152h5704c9187q671j31321j44512R2295O1605K0335
9741a49456b6866Q160A02138N7780a71001a4095j24311B35491b05960f2400h73
9729e4623k43331f8045j699j24385M4971f2503K8609j919q3400A56370l022n2197
$$ y = [27772, -372320, -220990, 367634, -173901, 89091, -71102, 140026, 36082, -23326, -132460, 105996, -47035, -212821, -28538, 130420, -6645, -136021, -102467, -310047, -86871, -295440, 315928, 9111, -57578, -51734, -271642, -405156, -365610, 61919, -122911, -28014, 19590, 36732, -152736, -85318, -29339, -228467, -138382, -65150, 58897, -271617, 208124, -68734, 116655, -224646, -178229, 145773, -64565, -23822, -126109, -153724, 36254, -495340, 145991, -252770, -26864, 26716, -38964, -50492, -229510, 123152, -85704, -39187, -47858, -179179, -323691, -231396, -169791, -149456, -26866, -18706, 102138, 159918, -171001, -14095, -138406, 235491, -205960, -62400, -873, -54623, -297954, -68045, -69744, -194129, -149158, -62503, -33894, -35813, -119213, 156370, 153348, 101151]
9717A01151a19371N2865A8127P6534e3568j9764k0792j99833a01069m0611A19390
9705b4666m2675H0563a08857G4049c04326B66402C6284a30608o6940b9885A55941
9693b9503B88522A11186C4455Q0842b55997R1139r9295A2016N4266g4426L2702
9682d1724C1470c48631a32567e6736j35502L5586e6172m7409c5544o7633B6475
9670a05385K1424b3248q9535I0573a13605E2669a37852m33055a67817A57369i8128
9658D53873g5909E2813a81555l876P1506p7793d3810r8473A22050a36810K2752
9647a14058L7760D77301d00522a79676B6856b32417J08354p4020L3630g7206K9296
9636d7910j23859N3809A47583b19190P4705O1022D3183d4262A701i6376c0123
$$ y = [101151, -119371, -66506, 18127, 94661, -53568, -73332, -94124, -293957, -101069, -141680, 119390, -24666, -67341, 80563, -108857, 74049, -304326, 266402, 36284, -130608, -197548, -29885, 155941, -29503, 288522, 111186, 34455, 115297, -255997, -164858, -264153, 12016, 66282, -74426, -41724, 31470, -348631, -132567, -56736, -192238, -156652, -56172, -103581, -35544, -103177, 26475, -105385, -83961, -23248, -112783, 90573, -113605, 52669, -137852, -570907, -167817, 157369, -98128, 453873, -75909, 52813, -181555, -185431, -113925, -191718, -43810, -142283, 122050, -136810, -114058, -76298, 477301, -400522, -179676, 26856, -232417, -124063, -198083, -164453, -77206, -47910, -171769, -117960, 147583, -219190, -144485, -83463, 43183, -44262, 1701, -96376, -30123]
9624c79613A15472c56283A03555J49930i0075B27729a22382k8692A30175m0134
9614I0041J52229f3943A0969a04423E0615d5429F6288c3703o5542D68513B00923
9602a48467A33782a77474r550N4540A82740A9163K29711a11938L9009H2520L9021
9591A21541C6284f2846A2531L3345a88914A61163D077a75961f4043B08952r5228
9580A13724b08926a9162M846E3909b85229N0579f1735k45709g9754j23976p4539
9569b78269e187B29164A11613d5916k07832P334i0860j72530B6969R348J31827
9558A68144c19567I9706l7698A8370g9545n9801b7459A11808p171D148O5532b3683
9545A20987c53160J02432q103O8980B0591a7426j73235p1071f1923A31289J07276
$$ y = [-379613, 115472, -356283, 103555, 253485, -90075, 227729, -122382, -151074, 130175, 90041, 242270, -63943, 10969, -104423, 50615, -45429, 66288, -33703, -99245, 468513, 200923, -148467, 133782, -177474, -187024, -132484, 182740, 19163, 248874, -111938, -72929, 82520, 121541, 36284, -62846, 12531, 45876, -188914, 161163, 4077, -175961, -64043, 208952, 113724, -208926, -19162, -14316, 53909, -285229, -234650, -61735, -307444, -79754, -203730, -278269, -5187, 229164, 111613, -45916, -253748, -246414, -90860, -263390, 26969, 36317, 168144, -319567, 99706, 62008, 18370, -79545, -139346, -27459, 111808, 104637, 4148, 69680, -23683, 120987, -353160, -250728, -258831, -189851, 20591, -17426, -190661, -261732, -61923, 131289, 238565]
9534B38565e8196m1606G255K406L2064a09124E248R7066M5644i990l41294B0332
9521C1268c55168i81A8172k983K8700a26630b1636k5367k6734r4036M7927A08086
9508e8990D5927a298p6498k16235B32457c62515A08661K2133l1420e6332A10656
9496E6708Q421e8739k39733J06376G3310a32447k07369J60226r3289f0246C14809
9484g8359B38495B5569b11673h6034l13785a99793C845b04596b1190j21811A00024
9472a94738a2470j99371f2710a0814k24635n313G722b04235k5428f5180o3114
9461a28294d0076k3443o3748n3545c1879k26398H5195l5525J43983b07830e3655
9449a45531k02784C3849k169c5310B0372A418K27509g9442d236j29496B39029
$$ y = [238565, -58196, -99802, 7255, 9661, 41725, -109124, 5248, 102314, 147958, -9990, -351284, 20332, 31268, -355168, -981, 18172, 15189, 43889, -126630, -21636, -47003, -73737, -167773, -119846, 108086, -58990, 45927, -1298, -77796, -294031, 232457, -362515, 108661, 130794, 99374, -56332, 110656, 56708, 65129, -58739, -298472, -192096, 73310, -132447, -339816, -179590, -272879, -60246, 314809, -78359, 238495, 25569, -211673, -86034, -399819, -199793, 3845, -204596, -21190, -143001, 100024, -194738, -12470, -211841, -62710, -10814, -235449, -240762, 7722, -204235, -229663, -65180, -128294, -40076, -63519, -127267, -180812, -31879, -258277, 85195, 49670, 193653, -207830, -53655, -145531, -348315, 33849, 31680, -35310, 20372, 1418, 228927, -79442, -4236, -133732, 239029]
9437a02224L8786l26345F670f5588a7300a595l70229O4639A31754c11738A18851
9425a30527f3550p9233A820f2483C7691a12505A62553g9153B0018a50977I7915
9413e300l0497j17810j97434J60448a1093A28545B2722i056A21014a10093d9233
9401a69836j3960B1385b8194j7995q7813B14908a42930O1313o6974A2129J71640
9390A83769A0563M792d14440H8014l9236J06386A1189h0908H7371m971L3819K9698
9378A45917b84160a30824F4111L2132b02837l0959i1692B42970e688k29167J01715
9367a33140H2211h3668k21120O5061l48155b0212j36056r1111H7772l4370a58873
9355d720j7960r7967M3160I5946c5839d21l09227e4660j10808a5519A49243o9533
$$ y = [-102224, -63438, -389783, 6670, -65588, -17300, -1595, -371824, -307185, 131754, -311738, 118851, -130527, -63550, -142783, 1820, -62483, 37691, -112505, 162553, -79153, 20018, -150977, 97915, -5300, -35797, -153607, -351041, -190593, -11093, 128545, 22722, -9056, 121014, -110093, -49233, -169836, -183796, 21385, -28194, -46189, -134002, 214908, -142930, -81617, -148591, 12129, 183769, 10563, 15355, -414440, 88014, 48778, 155164, 11189, -80908, 87371, 82400, 116219, 145917, -284160, -130824, 64111, 96243, -202837, -233796, -91692, 242970, -5688, -234855, -133140, 82211, -83668, -304788, -239727, -587882, -20212, -156268, -247379, 87772, 53402, -158873, -4720, -22680, -120647, -77487, 95946, -35839, -421, -309648, -54660, -165468, -15519, 149243, 79710]
9343G9710N102l0301b17662I4157G473J68711a60707j17886D971b12075A48163
9331a51854f8320k97821a21188J0235n0841A33128a3687A46475a19338A09241
9320b69677F8577K23419a22514A09935J23131J7649c32813a53621O9292k33397
9310c17726B56661A5920A421a87397O6482n5257j2618H545c04537F6574a96918
9298a44055A06503J9310b26867b0445d362j39003A3008K09076c92796a4733A9761
9286a76853m5638J6919j7960a634A26330c15526a17539r8574C83254b59871B05703
9274A71920b49240m9848a02850A11366a59662P4333m9022c2511D2979K63121A17944
9262E4205a99587A28071b00879m1225B55473E0020c5076B32598I8660D993a09068
$$ y = [79710, 84812, 54511, -217662, 94157, 7473, 176184, -160707, -278593, 4971, -212075, 148163, -151854, -68320, -366141, -121188, -110953, -161794, 133128, -13687, 146475, -119338, 109241, -269677, 68577, 291996, -122514, 109935, 233066, 250715, -332813, -153621, -84329, -317726, 256661, 15920, 1421, -187397, -120915, -176172, -188790, 8545, -304537, 66574, -196918, -144055, 106503, 125813, -226867, -20445, -4362, -143365, 13008, 222084, -392796, -14733, 19761, -176853, -222491, -205572, -223532, -1634, 126330, -315526, -117539, -216113, 383254, -259871, 205703, 171920, -249240, -299088, -102850, 111366, -159662, -85329, -134351, -32511, 42979, 306100, 117944, 54205, -199587, 128071, -200879, -242104, 255473, 50020, -35076, 232598, 98660, 4993, -109068]
9250F3058J16706c01238B34237c9044C9477b5196k90419F3950a49058k1507J6118
9239a54447k44325e4668o3199A05614b19198a8759j53287c7402C26163a01271
9228A21579b63823A52374a59544A71592b22441a01036k25606B60891p1845p4303
9218A14743a36041q9293A17287b37656a5910E42R2345a46480e9227j04259A2419
9206C0163J7500d06605a44477f2732j46132i5006E1410A5387b98463C9102K18336
9195B57438N1042F369a17202b6807F9010B0407g813r6039c7970A02668e21295
9183B00526c3092B23171p5384J94189d5801Q081l3619J0759J0565A06069f09774
9171B1969M3927e1188A56495a95490D4028g3178m49017A07084l9953J35229o3047
$$ y = [63058, 179764, -301238, 234237, -39044, 39477, -25196, -315615, 63950, -149058, -170565, -154447, -398772, -54668, -117867, 105614, -219198, -18759, -172046, -37402, 326163, -101271, 121579, -263823, 152374, -159544, 171592, -222441, -101036, -326642, 260891, 189046, 114743, -136041, -225334, 117287, -237656, -15910, 542, 92887, -146480, -59227, -163486, 12419, 30163, 47663, -406605, -144477, -62732, -208864, -95006, 51410, 15387, -298463, 39102, 257438, 308480, 6369, -117202, -26807, 69010, 20407, -7813, -103852, -37970, 102668, -521295, 200526, -33092, 223171, 147787, 341976, -45801, -37720, -71339, -60580, -50015, 106069, -609774, 21969, 65896, -51188, 156495, -195490, 44028, -73178, -522195, 107084, 67131, 202360, 139313]
9160A39313d3956p6510F872a587p2996D4109b35607C47561A4577l811c25158m3664
9148c68822a29037A19971a81317A20931c35877A32700j7743A5802a37300p9081
9138b16381A909b36805C9275a271n9600H791b3547r4602k33028b1716k84078A14054
9125d8019q9846E5540k0805g9557a7568n0001k46k5973L8452l13149i4686j0262
9113a04948k1952C1735P7904c6560j05064C02656a88407H8866a89109M6158j26301
9102b69252N9387A03449c08422c5031H3990P9175d61190J26907a1793k6836E068
9090b4915A34278f9805D8477i208j6453j81961a1111D98039a69993A37531n6329
9079H1202M7929a13175b2633k05381A5175i4215G1103b44050J11704n0618d2302
$$ y = [139313, -43956, -120466, 6872, -1587, -74583, 44109, -235607, 347561, 14577, 10766, -325158, -368822, -129037, 119971, -181317, 120931, -335877, 132700, 114957, 15802, -137300, -216381, 1909, -236805, 39275, -1271, -60871, 8791, -23547, -118149, -351177, -21716, -305794, 114054, -48019, -137865, 55540, 34735, -79557, -17568, -67569, -67815, -93788, -55336, -368485, -94686, -104948, -126900, 31735, 109639, -36560, -141624, 302656, -188407, 88866, -189109, -142951, -269252, -209865, 103449, -308422, -35031, 83990, 163165, -461190, -334283, -11793, -38629, 5068, -24915, 134278, -69805, 48477, -9208, -25661, -207622, -11111, 498039, -169993, 137531, 81202, 129131, -113175, -22633, -228014, 15175, -94215, 71103, -244050, -132346, -182964, -42302]
9067b5620r9603M1967j19362P7691I1978B7377h3966k9874A74017a26601A47896
9055a76621r861k3183b8245D54591G3119h6038B1766e2874k36176a33094E103
9043i8334A00329J19088F9118A7213a13349M6153A22934c08128I7998L61384B26280
9031i0790B7710a13435C68263d83698Q3532G7011d09901C15635b42759k7312g9700
9019b46018A41282h2645j15892j39487A80803m7771a57846A39643q827f2835A03283
9007f3206I3828P6049D6135a39248D6761a20195B31817b65652a20109A21314c87755
8995e0284r1743D8830b46127A23277Q4987b13372C7296M8232a26464e4236l1100
8984h5336m3166E2622c97018m4071E806P9045b3197r6218B71657D986K5506M31302
$$ y = [-25620, -125223, -83256, -202618, -124927, 91978, 27377, -83966, -113840, 174017, -126601, 147896, -176621, -186482, -209665, -28245, 454591, 73119, -86038, 21766, -52874, -289050, -133094, 5103, -98334, 100329, 219417, 69118, 17213, -113349, -67196, 122934, -308128, 97998, 459382, 226280, -90790, 27710, -113435, 368263, -483698, -400166, 77011, -409901, 315635, -242759, -270071, -79700, -246018, 141282, -82645, -198537, -338024, 180803, 133032, -157846, 139643, 130816, -62835, 103283, -63206, 93828, 169877, 46135, -139248, 46761, -120195, 231817, -265652, -120109, 121314, -387755, -50284, -142027, 48830, -246127, 123277, 208264, -213372, 37296, 85528, -126464, -54236, -85336, -128502, 52622, -397018, -441089, 5806, 84851, -23197, -119415, 271657, 4986, 30492, 461794]
8972D61794b06729k2720A95613h0895D56237j73712B7523K067b31616N4218j29174
8961c06572a47221M7994B05629p6013C5353b08906m9592O7171r0748B2250J1113
8950C3363P420M0818a19492d2414k3423E4301M5580h0946n1670d9196m5190B32315
8937b51396i9510B25760G0816L44733I3687f208B732P7563C0690a6741H6408M16426
8925E02834M09338K11177L022893R550970k963378B786182I65001k77212B97687
8915B94219p6176l1598a7061E7032a20997J2034B97157j02615b66471J11327G0739
8903C9108b37202H7211K20285E4164j166a7651C4246g3210C9987f3254B83509
8891a64083A88390e5328k20840c2546k09314e1838A83618E4180N2206E0935a34695
$$ y = [461794, -206729, -229449, 195613, -80895, 456237, 282525, 27523, 29590, -231616, -177398, -306572, -147221, -99227, 205629, 129616, 35353, -208906, -258498, -191327, -282075, 22250, 33363, 40783, 81601, -119492, -42414, -65837, 54301, 99881, -80946, -132616, -49196, -94386, 232315, -251396, -99510, 225760, 70816, 415549, 93687, -6208, 2732, 80295, 30690, -16741, 86408, 502834, 912172, 1123349, 4146242, 13697212, 10733834, 2786182, 965001, 687789, 297687, 294219, 218043, 186445, -17061, 57032, -120997, -108963, 297157, 194542, -266471, -155144, 70739, 39108, -237202, 87211, 307496, 54164, 52998, -17651, 34246, -73210, 39987, -63254, 283509, -164083, 188390, -55328, -276168, -32546, -241860, -51838, 183618, 54180, 106386, 50935, -134695]
8879B18615a65561N7851o4501N6345A2282m256a7460A77626b06676r7777d1316
8867c92248A09518a05307F0820b43486D2386C672a09365D0771b82281I6754J19230
8856B15984q2523h7504q5674O5240l40433a98675B30454a27642A52105a26169
8845d2072j89750A01286e0527j31610Q7572k1900J503D3305a76663B75902n4302
8834B21600a20447r5107a06537B12683J09469g173j36833A20393C1468b20710
$$ y = [218615, -165561, -107710, -172211, -115866, 12282, 8026, -17460, 177626, -206676, -304453, -41316, -392248, 109518, -105307, 60820, -243486, 42386, 3672, -109365, 40771, -282281, 96754, 215984, 133461, -87504, -173178, -107938, -448371, -198675, 230454, -127642, 152105, -126169, -42072, -231822, 101286, -50527, -182137, -94565, -116465, -114962, 43305, -176663, 275902, 221600, -120447, -215554, -106537, 212683, 322152, -7173, -144006, 120393, 31468, -220710]
$$ [...]
##END NTUPLES=NMR SPECTRUM
##END=
