##TITLE=AC1567_ROEFFECT0020_8270620_MpqYOPbm69
##JCAMPDX= 6.0         $$ Bruker NMR JCAMP-DX V2.0
##DATA TYPE= NMR SPECTRUM
##DATA CLASS= NTUPLES
##ORIGIN= BRUKER
##OWNER= Administrator
$$ 1.72 TOPSPIN		Version 2.1
$$ 2013-10-12 19:17:30.944 -0700  Administrator@X
$$ Compression mode = diff/dup
##.OBSERVE FREQUENCY= 400.02188249412
##.OBSERVE NUCLEUS= ^1H
##.ACQUISITION MODE= SIMULTANEOUS (DQD)
##.ACQUISITION SCHEME= undefined
##.AVERAGES= 64
##.DIGITISER RES= 22
##SPECTROMETER/DATA SYSTEM= spect
##.PULSE SEQUENCE= noesygpps1d.comp
##.SOLVENT NAME= COFFEE_meoh
##.SHIFT REFERENCE= INTERNAL, COFFEE_meoh, 1, 14.96083
##AUDIT TRAIL= $$ (NUMBER, WHEN, WHO, WHERE, PROCESS, VERSION, WHAT)
$$ ##TITLE= Audit trail, TOPSPIN		Version 2.1
$$ ##JCAMPDX= 5.01
$$ ##ORIGIN= Bruker BioSpin GmbH
$$ ##OWNER= Administrator
$$ $$ E:\/data/COFFEE/nmr/AC1567_ROEFFECT0020_8270620_MpqYOPbm69/12/pdata/1/auditp.txt
$$ ##AUDIT TRAIL=  $$ (NUMBER, WHEN, WHO, WHERE, PROCESS, VERSION, WHAT)
(   1,<2013-10-12 19:17:25.959 -0700>,<Administrator>,<X>,<go>,<TOPSPIN 2.1>,
      <created by zg
	started at 2013-10-12 19:05:56.331 -0700,
	POWCHK enabled, PULCHK disabled,
       configuration hash MD5:
       C8 4E 4E 5D D3 5C D8 9E 9F 52 82 E0 59 8A DE 15
       data hash MD5: 64K
       85 DB 1F EB 44 20 DF AF 4D CA 9C A2 E2 02 64 F1>)
(   2,<2013-10-12 19:17:28.928 -0700>,<Administrator>,<X>,<proc1d>,<TOPSPIN 2.1>,
      <Start of raw data processing
       efp LB = 0.3 FT_mod = 6 PKNL = 1 PHC0 = 0 PHC1 = 0 SI = 128K 
       data hash MD5: 128K
       45 C7 10 B5 64 E3 89 29 C5 6E 1B 31 EC 97 74 18>)
(   3,<2013-10-12 19:17:29.959 -0700>,<Administrator>,<X>,<proc1d>,<TOPSPIN 2.1>,
      <pk PHC0 = -80.45837 PHC1 = 0 
       data hash MD5: 128K
       8E CF 6B 1A FD EC DE 0A C1 2C 18 C9 F0 E3 64 E4>)
(   4,<2013-10-12 19:17:30.381 -0700>,<Administrator>,<X>,<proc1d>,<TOPSPIN 2.1>,
      <abs ABSG = 1 
       data hash MD5: 128K
       FE 5E 26 ED E0 AA 1E B7 80 E1 0F B0 22 38 78 00>)
(   5,<2013-10-12 19:17:30.475 -0700>,<Administrator>,<X>,<proc1d>,<TOPSPIN 2.1>,
      <abs ABSG = 2 
       data hash MD5: 128K
       73 03 2C EF 87 CB A2 32 1A F1 AD 5E 62 06 91 6E>)
(   6,<2013-10-12 19:17:30.553 -0700>,<Administrator>,<X>,<proc1d>,<TOPSPIN 2.1>,
      <abs ABSG = 3 
       data hash MD5: 128K
       40 69 CC E8 AF 43 8B 3D 98 0D 95 AD A4 3A 19 C8>)
(   7,<2013-10-12 19:17:30.647 -0700>,<Administrator>,<X>,<proc1d>,<TOPSPIN 2.1>,
      <abs ABSG = 4 
       data hash MD5: 128K
       92 79 D2 15 30 BC 38 43 19 E6 7C E4 F2 ED 84 2F>)
(   8,<2013-10-12 19:17:30.741 -0700>,<Administrator>,<X>,<proc1d>,<TOPSPIN 2.1>,
      <abs ABSG = 5 
       data hash MD5: 128K
       D5 5E D4 DC 55 7F 95 63 7B 61 24 4F FB 2A AE 7D>)
$$ ##END=
$$ 
$$ $$ hash MD5
$$ $$ 96 37 34 65 72 A0 4C 8C 8A 1B C6 3F 09 CA F2 99
##$RELAX= 
##$RELAX= 
##$RELAX= 
##$RELAX= 
##$RELAX= 
##$RELAX= 
##$RELAX= 
##$RELAX= 
$$ Bruker specific parameters
$$ --------------------------
##$DU= <E:\>
##$EXPNO= 12
$$ [...]
##$TP07= 0
##$TPNAME0= <>
##$TPNAME1= <>
##$TPNAME2= <>
##$TPNAME3= <>
##$TPNAME4= <>
##$TPNAME5= <>
##$TPNAME6= <>
##$TPNAME7= <>
##$TPOAL= (0..7)
0.5 0.5 0.5 0.5 0.5 0.5 0.5 0.5
##$TPOFFS= (0..7)
0 0 0 0 0 0 0 0
##$TUNHIN= 0
##$TUNHOUT= 0
##$TUNXOUT= 0
##$USERA1= <user>
##$USERA2= <user>
##$USERA3= <user>
##$USERA4= <user>
##$USERA5= <user>
##$V9= 5
##$VALIST= <valist>
##$VCLIST= <CCCCCCCCCCCCCCC>
##$VD= 0
##$VDLIST= <DDDDDDDDDDDDDDD>
##$VPLIST= <PPPPPPPPPPPPPPP>
##$VTLIST= <TTTTTTTTTTTTTTT>
##$WBST= 1024
##$WBSW= 4
##$XGAIN= (0..3)
0 0 0 0
##$XL= 0
##$YL= 0
##$YMAX_a= 7316262
##$YMIN_a= -8372486
##$ZGOPTNS= <>
##$ZL1= 120
##$ZL2= 120
##$ZL3= 120
##$ZL4= 120
##$ABSF1= 14.96083
##$ABSF2= -5.597352
##$ABSG= 5
##$ABSL= 3
##$ALPHA= 0
##$AQORDER= 0
##$ASSFAC= 0
##$ASSFACI= 0
##$ASSFACX= 0
##$ASSWID= 0
##$AUNMP= <proc_prof1d_extract.lims>
##$AXLEFT= 0
##$AXNAME= <>
##$AXNUC= <1H>
##$AXRIGHT= 0
##$AXTYPE= 0
##$AXUNIT= <>
##$AZFE= 0.1
##$AZFW= 0.1
##$BCFW= 0
##$BC_mod= 0
##$BYTORDP= 0
##$COROFFS= 0
##$CY= 15
##$DATMOD= 1
##$DC= 0
##$DFILT= <>
##$DTYPP= 0
##$F1P= 0
##$F2P= 0
##$FCOR= 0.5
##$FTSIZE= 131072
##$FT_mod= 6
##$GAMMA= 0
##$GB= 0
##$INTBC= 1
##$INTSCL= 1
##$ISEN= 128
##$LB= 0.3
##$LEV0= 0
##$LPBIN= 0
##$MAXI= 10000
##$MC2= 0
##$MEAN= 0
##$ME_mod= 0
##$MI= 0
##$NCOEF= 0
##$NC_proc= -2
##$NLEV= 6
##$NOISF1= 0
##$NOISF2= 0
##$NSP= 0
##$NTH_PI= 0
##$NZP= 0
##$OFFSET= 14.96083
##$PC= 1
##$PHC0= -80.45837
##$PHC1= 0
##$PH_mod= 1
##$PKNL= yes
##$PPARMOD= 0
##$PPDIAG= 0
##$PPIPTYP= 0
##$PPMPNUM= 2147483647
##$PPRESOL= 1
##$PSCAL= 4
##$PSIGN= 0
##$PYNMP= <proc.py>
##$REVERSE= no
##$SF= 400.020009704377
##$SI= 131072
##$SIGF1= 0
##$SIGF2= 0
##$SINO= 400
##$SIOLD= 131072
##$SPECTYP= <>
##$SREGLST= <1H.CDCl3>
##$SSB= 0
##$STSI= 131072
##$STSR= 0
##$SW_p= 8223.68421052631
##$SYMM= 0
##$S_DEV= 0
##$TDeff= 65536
##$TDoff= 0
##$TI= <>
##$TILT= no
##$TM1= 0
##$TM2= 0
##$TOPLEV= 0
##$USERP1= <user>
##$USERP2= <user>
##$USERP3= <user>
##$USERP4= <user>
##$USERP5= <user>
##$WDW= 1
##$XDIM= 131072
##$YMAX_p= 293165216
##$YMIN_p= -308186401
##$CURPLOT= <Network HP LaserJet P1505>
##$CURPRIN= <$Network HP LaserJet P1505>
##$DFORMAT= <normdp>
##$LAYOUT= <+/1D_H.xwp>
##$LFORMAT= <normlp>
##$PFORMAT= <normpl>
##$SURQMSG= 1
$$ End of Bruker specific parameters
$$ ---------------------------------
##NTUPLES= NMR SPECTRUM
##VAR_NAME=  FREQUENCY,     SPECTRUM/REAL,   SPECTRUM/IMAG
##SYMBOL=    X,             R,               I
##VAR_TYPE=  INDEPENDENT,   DEPENDENT,       DEPENDENT
##VAR_FORM=  AFFN,          ASDF,            ASDF
##VAR_DIM=   131072,        131072,          131072
##UNITS=     HZ,            ARBITRARY UNITS, ARBITRARY UNITS
##FACTOR=    0.0627417313425164, 1,          1
##FIRST=     8223.62146879497, 1932,         -46481
##LAST=      0,             2635,            -45385
##MIN=       0,             -308186401,      0
##MAX=       8223.62146879497, 293165216,    0
$$ Real data points
##PAGE= N=1
##DATA TABLE= (X++(R..R)), XYDATA
$$ [...]
62861D45636k225j980j158j96M52O63N92M27K70J36n6l59o28o90o34o77o79k65
62843D38629M65Q26M24l05p85j042j295j344r98p82j347k325k614j832p86l37
62827D24552m45n81m36K4P64J565K121K439K808L246L385L110K820K855L110L437
62811D54774L946M611N099N301N565N990O077N548N089N597O991Q419R454J0357
62797E42818J1271J1892J2084J2286J3053J4485J6269J8040J9636K1236K3355
62786G16425K6526L0909L6233M2000M7639N2728N7390O2346O8180P4609Q0753
62775A295738Q6027R0398R3788R5579R4884R1126Q4437P5604O5523N4428M1744
62764B169276K7017J0848n482k1169l6150n0176o2312p1664p8324q3040q6263
$$ plain form
62861 445636 443411 441431 440273 440077 440529 441192 441784 442211 442481 442617 442561 442202 441574 440884 440250 439573 438894 438629
62843 438629 439094 439920 440344 440039 439254 438212 436917 435573 434575 433793 432446 430121 427507 425675 424889 424552
62827 424552 424107 423526 423090 423114 423878 425443 427564 430003 432811 436057 439442 442552 445372 448227 451337 454774
62811 454774 458720 463331 468430 473731 479296 485286 491363 496911 502000 507597 514588 523007 532461 542818
62797 542818 554089 565981 578065 590351 603404 617889 634158 652198 671834 693070 716425
62786 716425 742951 773860 810093 852093 899732 952460 1009850 1072196 1140376 1214985 1295738
62775 1295738 1381765 1472163 1565951 1661530 1756414 1847540 1931977 2007581 2073104 2127532 2169276
62764 2169276 2196293 2207141 2201659 2180490 2144340 2094164 2031852 1960188 1881864 1798824 1712561
62753A712561q7790q7389q5413q2632p9557p6043p1684o6569o1457n7010n3027
62742I03990m8745m3861l8920l4585l0921k7588k4490k1777j9368j6843j3990
62731E82902j1209r152p984p251o449n541m763m115l321k359j597j251r39p2J428
62716E18327L073M446N600O838Q357J0185J2203J4126J5625J6724J8015K0293
62704F53812K3844K8148L2342L6034L9625M3786M8662N3654N8009O1462O4272
62693A143650O6769O8936P0337P0362O8608O5021N9592N2060M2207L0518J8115
62682A756175N845o316j8730l1155m2687n2411n9889o5103o8321o9984p0492p0026
62670A206906o8592o6156o2662n8203n3294m8714m4838m1304l7644l3942l0622
$$ plain form
62753 1712561 1624771 1537382 1451969 1369337 1289780 1213737 1142053 1075484 1014027 957017 903990
62742 903990 855245 811384 772464 737879 706958 679370 654880 633103 613735 596892 582902
62731 582902 571693 562541 554557 547306 540857 535316 530553 526438 523117 520758 519161 517910 516971 516899 518327
62716 518327 521400 525846 531446 538284 546641 556826 569029 583155 598780 615504 633519 653812
62704 653812 677656 705804 738146 774180 813805 857591 906253 959907 1017916 1079378 1143650
62693 1143650 1210419 1279355 1349692 1420054 1488662 1553683 1613275 1665335 1707542 1738060 1756175
62682 1756175 1762020 1755704 1736974 1705819 1663132 1610721 1550832 1485729 1417408 1347424 1276932 1206906
62670 1206906 1138314 1072158 1009496 951293 897999 849285 804447 763143 725499 691557 660935
62659F60935k7810k5272k2799k0305j7783j5461j3758j2668j1554j0019q680q340
62647D66486q664q521p609o804o725o787o141m855l608k766k229j878j631j307
62633C96961q22l96k38k22j63k19o56j368j903j986j753j525j417j224o72K24
62617C82621J133J829K434L050L466L676M284N786P554Q400Q184P966Q441R144
62603D57968R658J0574J2528J5051J7278J9342K2052K5554K9140L2351L5384L8399
62591G25279M1090M3067M4197M4481M3997M2815M0604L6564L0374K2950J5593
62580A131011Q471P66p724j6019k3184k9168l4086l7527l9210l9731l9918l9832
62568H33849l9045l7560l5730l3458l0337k6648k3452k1347j9730j7760j5592
$$ plain form
62659 660935 633125 607853 585054 564749 546966 531505 517747 505079 493525 483506 474826 466486
62647 466486 457822 449301 441692 434888 428163 421376 415235 410380 406772 404006 401777 399899 398268 396961
62633 396961 396139 395743 395505 395283 395120 394901 394245 392877 390974 388988 387235 385710 384293 383069 382397 382621
62617 382621 383754 385583 388017 391067 394533 398209 402493 408279 415833 424233 432417 440383 448824 457968
62603 457968 467626 478200 490728 505779 523057 542399 564451 590005 619145 651496 686880 725279
62591 725279 766369 809436 853633 898114 942111 984926 1025530 1062094 1092468 1115418 1131011
62580 1131011 1139482 1140248 1132524 1116505 1093321 1064153 1030067 992540 953330 913599 873681 833849
62568 833849 794804 757244 721514 688056 657719 631071 607619 586272 566542 548782 533190
62557E33190j4078j3346j2458j0571q036n918m811m428m169l681k950k197j693
62544D44854j381q13K13J131J230P19N05Q32R71M74n6L6M62O81R40J744K737L101
62526D58380K954L345M896P178R519J1704J3734J5627J7582J9840K2240K4480
62514F11479K6792K9693L3025L5989L8204M0001M1495M2183M1753M0450L8345
62503A019409L5016L0445K5411K0438J5152R219L213k201p186j1943j5664j7339
62491A103970j7183j6102j4022j0074m398J498O567J1380J6941K3170K9194L4574
62479A165515L9532M4236M8330N1106N1845N0115M5953L9689L1607K2057J1873
62468A601858K117o871j5854k5770l6557m7043n5771o1866o5405o7193o7968o7637
$$ plain form
62557 533190 519112 505766 493308 482737 474701 468783 463972 459544 455375 451694 448744 446547 444854
62544 444854 443473 442660 442873 444004 445234 445953 446458 447290 448261 448735 448679 448715 449177 449858 450798 452542 455279 458380
62526 458380 461334 464679 469575 476753 486272 497976 511710 527337 544919 564759 586999 611479
62514 611479 638271 667964 700989 736978 775182 815183 856678 898861 940614 981064 1019409
62503 1019409 1054425 1084870 1110281 1130719 1145871 1155090 1158303 1156102 1148916 1136973 1121309 1103970
62491 1103970 1086787 1070685 1056663 1046589 1042191 1043689 1050256 1061636 1078577 1101747 1130941 1165515
62479 1165515 1205047 1249283 1297613 1348719 1400564 1450679 1496632 1536321 1567928 1589985 1601858
62468 1601858 1603975 1597104 1581250 1555480 1518923 1471880 1416109 1354243 1288838 1221645 1153677 1086040
62456A086040o5473o1247n5804n0282m5001l9533l3686k8027k3321j9725j6644
62445F47297j3306r488n719k780q73N61K127L736M826N273N697O644P711P810
62431F59516O390M061J801k05k599n664q751j1054j2564j3737j4524j4427j3510
62418E74733j2551j2029j1476j0332q916q050p914p863p318o365n426m750m381
62405D67362m267m246m181m173m450m887m857l867k196o70K14O76J172J755K143
62390D35528K228K236K354K477K416K249K216K427K820L357M041M796N505O139
62376D80789O683O965O829O492O448O949P749Q537R315J0249J1329J2406J3443
62363E94183J4591J6041J7941K0347K3174K6296K9786L3864L8489M3114M7038
$$ plain form
62456 1086040 1020567 959320 903516 853234 808233 768700 735014 706987 683666 663941 647297
62445 647297 633991 624503 618784 616004 615131 615692 617819 621555 626381 631654 637351 643995 651706 659516
62431 659516 665906 669967 671768 671563 668964 663300 654549 643495 630931 617194 602670 588243 574733
62418 574733 562182 550153 538677 528345 519429 511379 503465 495602 488284 481919 476493 471743 467362
62405 467362 463095 458849 454668 450495 446045 441158 436301 432434 430238 429568 429782 430458 431630 433385 435528
62390 435528 437756 439992 442346 444823 447239 449488 451704 454131 456951 460308 464349 469145 474650 480789
62376 480789 487472 494437 501266 507758 514206 521155 528904 537441 546756 557005 568334 580740 594183
62363 594183 608774 624815 642756 663103 686277 712573 742359 776223 814712 857826 904864
62352I04864M9855N1481N1909N1067M8798M4834L8953L1385K2892J4293O055j597
62340A314789q390j4191j9262k4018k8547l2551l5617l7356l7494l6182l4004
62329A007177l1363k8074k3986j9730j6243j3697j1580r806q972r269r949j0304
62317H14204j0599j1441j2748j3961j4833j5418j5509j4886j3978j3524j3517
62306F63790j3140j1931j0424r366q800q319p751p188o650o140n900o161o675
62293E55345o889o556n816m767l374j891q51m15l4Q62K047K794K824K549K498
62278E38326K850L592M628N610O052N929N805O168O880P586Q317R320J0553J1750
62264F33366J2860J3962J4961J5926J7563K0674K5070K9593L3435L6894M0695
$$ plain form
62352 904864 954719 1006200 1058109 1109176 1157974 1202808 1241761 1273146 1296038 1310331 1316386 1314789
62340 1314789 1306399 1292208 1272946 1248928 1220381 1187830 1152213 1114857 1077363 1041181 1007177
62329 1007177 975814 947740 923754 904024 887781 874084 862504 852698 843726 834457 824508 814204
62317 814204 803605 792164 779416 765455 750622 735204 719695 704809 690831 677307 663790
62306 663790 650650 638719 628295 618929 610129 601810 594059 586871 580221 574081 568181 562020 555345
62293 555345 548456 541900 536084 531317 527943 526052 525201 524786 524752 525614 527661 530455 533279 535828 538326
62278 538326 541176 544768 549396 555006 561058 566987 572792 578960 585840 593426 601743 611063 621616 633366
62264 633366 646226 660188 675149 691075 708638 729312 754382 783975 817410 854304 894999
62253H94999M5022M9423N3186N5548N6019N4802N2385M8509M2218L3414K3687
62242A409212J4901P390K49p029j4160k1031k8001l5078m1648m7149n1324n3728
62230A132604n3842n1988m9409m6934m4181m0527l6208l1908k7804k3780k0235
62219G05788j7803j6303j4726j2429r816p630o120n072m332l855l453k867k087
62206E99295j414j091r97p65j50P44J633K370L080L973N034N901O128N688N192
62191F34621N407O414P435P663P140O554O280O037N537N126N501O886Q621R596
62177G28818R138P586N962M977M502M125L978M614O241Q599J1503J4990J8865
62164H33898K2692K6396L0283L4199L7238L8642L8473L6995L3998K9310K3503
$$ plain form
62253 894999 940021 989444 1042630 1098178 1154197 1208999 1261384 1309893 1352111 1385525 1409212
62242 1409212 1424113 1431503 1431752 1424723 1410563 1389532 1361531 1326453 1284805 1237656 1186332 1132604
62230 1132604 1078762 1026774 977365 930431 886250 845723 809515 777607 749803 726023 705788
62219 705788 687985 671682 656956 644527 634711 627081 620961 615889 611557 607702 604249 601382 599295
62206 599295 597881 596790 595793 595028 594878 595622 597255 599625 602705 606678 611712 617613 623741 629429 634621
62191 634621 640028 646442 653877 661540 668680 675234 681514 687551 693088 698214 703715 710601 719222 728818
62177 728818 737956 745542 751504 756481 760983 765108 769086 773700 779941 788540 800043 815033 833898
62164 833898 856590 882986 913269 947468 984706 1023348 1061821 1098816 1132814 1162124 1185627
62153A185627J7350J0957M149k468p806j1650j4968j8647k2617k6307k9349l1462
62141A052809l2311l1853l0539k8763k6453k3492k0149j6781j3423j0123p361
62130H11561n612m627l702k723k407l305m863n847n555m389l178k188j018O10
62116G62757K150K627J666j17j868l437n222p150q273p751o103m979n486p083
62102G11731q500r426j0654j2515j3974j3777j2002r790p775n609l076q70J70
62089F03933J44m2L19J224K226K873L001K922L286M435N960P138P781Q399R542
62074F63141J1323J3506J5736J7534J8480J8662J8754J9374K0463K1546K2474
62063H60993K3531K4868K6194K7181K7794K8005K7429K5611K2557J8661J4235
$$ plain form
62153 1185627 1202977 1213934 1218083 1215615 1207809 1196159 1181191 1162544 1139927 1113620 1084271 1052809
62141 1052809 1020498 988645 958106 929343 902890 879398 859249 842468 829045 818922 811561
62130 811561 805949 801322 797620 794897 792490 789185 784322 778475 772920 768531 765353 763165 762147 762757
62116 762757 764907 767534 769200 769083 767215 763778 758556 751406 743133 735382 729279 724300 718814 711731
62102 711731 703231 693805 683151 670636 656662 642885 630883 621093 613318 607709 604633 603763 603933
62089 603933 604077 604035 604354 605578 607804 610677 613678 616600 619886 624321 630281 637419 645200 653599 663141
62074 663141 674464 687970 703706 721240 739720 758382 777136 796510 816973 838519 860993
62063 860993 884524 909392 935586 962767 990561 1018566 1045995 1071606 1094163 1112824 1127059
62052A127059R349M123j165o295j1121j5450j9243k2899k6908l1056l4441l6518
62040I35435l7669l8494l8890l8258l6329l3382k9981k6800k4425k2817k1261
62029E87129j9264j7261j5834j4645j2919j0813r307q678q118p174o564o948p689
62016D41915p724p073o584o472o047m934l689k925k505j952j229p07n58n69m94
62001C88453k64R6O26J320K038K648L224L948M653M766L899K446J212N22K2n74
61985D19035j028j158j423k414l933n050n184m717m456m674m884m488l498k527
61971C69601k111k162k163j854j423j105q99q17j028j528j903j762j242q40q40
61956C47924j155j580j847j618p63L46J063J100P21M20N44J194K168L055L619
$$ plain form
62052 1127059 1136408 1140531 1139366 1133071 1121950 1106500 1087257 1064358 1037450 1006394 971953 935435
62040 935435 897766 859272 820382 782124 745795 712413 682432 655632 631207 608390 587129
62029 587129 567865 550604 534770 520125 507206 496393 487086 478408 470290 463116 456552 449604 441915
62016 441915 434191 427118 420534 414062 408015 403081 399392 396467 393962 392010 390781 390074 389516 388947 388453
62001 388453 388189 388285 388911 390231 392269 394917 398141 402089 406742 411508 415407 417853 419065 419587 419609 419035
61985 419035 418007 416849 415426 413012 409079 404029 398845 394128 389672 384998 380114 375626 372128 369601
61971 369601 367490 365328 363165 361311 359888 358783 357884 357067 356039 354511 352608 350846 349604 348764 347924
61956 347924 346769 345189 343342 341724 340961 341307 342370 343470 344191 344611 345155 346349 348517 351572 355191
61941C55191M049M665N405N939O214O602P383Q394R280R785R719Q950P692O566
61927D55834O135O377O775O806O221M976L140R46j217k962m067m486m292l661
61913D76525k820j937r74J56J337K308L129M352O347Q488R542Q996P593O339N389
61898E34770M335L135K108J215N6j320k257k384k169k264k690l032l112l046k849
61883E20496k388j731j214j109j515k532m245o374q176q927q526p569o827o611
61869D52752o582o094m796k964j265k22J48K28M28Q99J552K261L044M058N393
61854D48840O935Q455R839J1097J2136J2642J2484J2174J2539J3750J4934J5098
61842E90923J4242J3161J2223J0884Q584N639K875O73j208l002m513n364n419
$$ plain form
61941 355191 359240 363905 369310 375249 381463 388065 395448 403842 413122 422907 432626 441576 449268 455834
61927 455834 461969 468346 475121 481927 488148 493124 496264 497210 495993 493031 488964 484478 480186 476525
61913 476525 473705 471768 470794 470950 472287 474595 477724 482076 488423 496911 506453 515449 523042 529381 534770
61898 534770 539105 542240 544348 545563 545619 544299 542042 539658 537489 535225 532535 529503 526391 523345 520496
61883 520496 518108 516377 515163 514054 512539 510007 505762 499388 491212 482285 473759 466190 459363 452752
61869 452752 446170 440076 435280 432316 431051 430829 430977 431205 431633 432532 434084 436345 439389 443447 448840
61854 448840 455775 464230 474069 485166 497302 509944 522428 534602 547141 560891 575825 590923
61842 590923 605165 618326 630549 641433 650017 655656 658531 659204 657996 654994 650481 645117 639698
61829F39698m814l765k384p26J058K668L924N020O303P691Q602Q540P526N802
61815F85143L456N87k358m822o606p889q900r767j0534j1025j0844r815q311o898
61801E91417n800m971m543m807n776p080q304r148r409r052q332p525o693n846
61787D94131n197m865m572m033l467l253l254l026k581k295k129j616p59k02k61
61772D52621m89m65m24o85r97r55o63m02k9P93J911K775L129L222L336L509L770
61755D69957M287N105N823N721M381K223L14n78p22r59j712k756l823m805n399
61740D77057n228m582m305m623m674l730k360j625j550j218k60N90N63r6n37l70
61724D43052L2K08K32N33J136J430R38O6l50j93j61o15j019q38m29m80j034j627
$$ plain form
61829 639698 634884 631119 628735 628009 629067 631735 635659 640679 646982 654673 663275 671815 679341 685143
61815 685143 688599 689186 686828 682006 675400 667511 658611 648844 638310 627285 616441 606626 598315 591417
61801 591417 585617 580646 576103 571296 565520 558440 550136 540988 531579 522527 514195 506670 499977 494131
61787 494131 488934 484069 479497 475464 471997 468744 465490 462464 459883 457588 455459 453843 453084 452882 452621
61772 452621 452132 451667 451243 450558 449561 448606 447943 447541 447512 448305 450216 452991 456120 459342 462678 466187 469957
61755 469957 474244 479349 485172 490893 495274 497497 497811 497233 496511 495552 493840 491084 487261 482456 477057
61740 477057 471829 467247 462942 458319 453645 449915 447555 445930 444380 443162 442902 443492 444055 443959 443422 443052
61724 443052 443084 443292 443524 444057 445193 446623 447561 447627 447277 447084 446923 446308 445289 444451 444022 443542 442508 440881
61706D40881k029k294k341k115j978k328k951l255l102k914k998l223l332l212
61692D02809k944k838l214l797l809l057k484k893l645l477k371j516j495j690
61678C63579j587j500j579j228k20N00k4j336k120j774p81J75P67Q62M50k52r49
61661C52983j421j393n95P12J686J845J720K048K680K914K719K811L510M191M188
61646C80598L638L061K481J451n6j250j248j48R39J113O98P33J504K174J984J249
61630C98921P61P27Q21R82J391J842J770R87j69j477l017m556n407n211m455l862
61614C80048l614l525l645m068m429m142l212k379k282k754l131l061k786k756
61600C34264l116l575l718l391k820k348k091j956j886j954k084j926j205k06
$$ plain form
61706 440881 438852 436558 434217 432102 430124 427796 424845 421590 418488 415574 412576 409353 406021 402809
61692 402809 399865 397027 393813 390016 386207 383150 380666 377773 374128 370651 368280 366764 365269 363579
61678 363579 361992 360492 358913 357685 357465 357965 357941 356605 354485 352711 351930 352105 352872 353734 354184 353932 352983
61661 352983 351562 350169 349574 350286 351972 353817 355537 357585 360265 363179 365898 368709 372219 376410 380598
61646 380598 384236 387297 389778 391229 391173 389923 388675 388527 389466 390579 391277 392010 393514 395688 397672 398921
61630 398921 399682 400409 401230 402212 403603 405445 407215 408202 408033 406556 403539 398983 393576 388365 383910 380048
61614 380048 376434 372909 369264 365196 360767 356625 353413 351034 348752 345998 342867 339806 337020 334264
61600 334264 331148 327573 323855 320464 317644 315296 313205 311249 309363 307409 305325 303399 302194 301988
61586C01988L39q3j197k146k246j583q82p92j266j608j207j55Q48J187Q12J02
61570B92111n47r20r57o78j42N66J331K021K525K755K601J973J086N07O71J322
61554C06225J751J621J235R25O07J68j39o9J37J03p9pL73P05P43N58K94N0m1K7
61534C15187J2k19l72j49K63N38Q28J373J750J305K62m26m60m92q83j136r82j002
61516C15397j512j750j001J44O51O18Q62J348J245M76m1J37K76k77j050j163n45
61499C13815K26Q14J334J879K361K708K903K892K662K347K058J720J230O46J50
61484C39745j28j37Q4L40M12L27L38N92R54J295J687K200K636K725K416J831J024
61467C58341k6j198k183k677k605k161j735j643j897k197k231j995j747j666j610
$$ plain form
61586 301988 302327 302244 301047 298901 296655 295072 294190 293398 292132 290524 289317 289162 290010 291197 292009 292111
61570 292111 291564 290644 289687 289009 288867 289433 290764 292785 295310 298065 300666 302639 303725 304232 304903 306225
61554 306225 307976 309597 310832 311757 312364 312532 312393 312324 312461 312564 312485 312478 312851 313556 314299 314857 315151 315201 315160 315187
61534 315187 315199 314980 314608 314459 314722 315260 316088 317461 319211 320516 320778 320352 319892 319400 318517 317381 316399 315397
61516 315397 313885 312135 311134 311278 311929 312547 313409 314757 316002 316478 316437 316574 316850 316573 315523 314360 313815
61499 313815 314041 314855 316189 318068 320429 323137 326040 328932 331594 333941 335999 337719 338949 339595 339745
61484 339745 339617 339480 339564 339904 340316 340643 340981 341573 342527 343822 345509 347709 350345 353070 355486 357317 358341
61467 358341 358315 357117 354934 352257 349652 347491 345756 344113 342216 340019 337788 335793 334046 332380 330770
61452C30770j266n11L91J027J192J048R21J042J403J804J998J956J890J962J991
61437C47618J763J438J382J547J502J185J102J540K052K156K077K230K320J763
61423C71675Q01L49O80J042Q30M61O43J359J993K145J809J028p5j047j339q97
61407C81457k79l4j09J9O72J504J837J453Q70O38O74N67L44L63N27L06l59p87
61389C89663n48j75l67r51j205q74k85L68J178J957K183J692R07K69k80r21j453
61372C91158j513j088n55k58k41l80n83q06r93j064r61o98l89k00k26l43k30L44
61354C80974J179J725J686J460J759K746L783M143L790L246K908K761K720K879
61340D17759L290L663L607L139K786L022L695M168M001L374K771K404K125J724
$$ plain form
61452 330770 329504 328993 329384 330411 331603 332651 333572 334614 336017 337821 339819 341775 343665 345627 347618
61437 347618 349381 350819 352201 353748 355250 356435 357537 359077 361129 363285 365362 367592 369912 371675
61423 371675 372476 372825 373505 374547 375377 375838 376481 377840 379833 381978 383787 384815 384740 383693 382354 381457
61407 381457 381178 381144 381035 381054 381726 383230 385067 386520 387390 388028 388702 389269 389613 389976 390503 390809 390450 389663
61389 389663 389115 388940 388573 387622 386417 385543 385258 385626 386804 388761 390944 392636 393543 393812 393532 392611 391158
61372 391158 389645 388557 388002 387744 387503 387123 386540 385734 384741 383677 382716 382018 381629 381429 381203 380860 380630 380974
61354 380974 382153 383878 385564 387024 388783 391529 395312 399455 403245 406491 409399 412160 414880 417759
61340 417759 421049 424712 428319 431458 434244 437266 440961 445129 449130 452504 455275 457679 459804 461528
61326D61528J145N13J03K00P65J332J481J337J347J667K095K563L220M043M794
61311D88133N517O631Q290J0015J1284J2109J2829J3574J4201J4518J4300J3367
61299F24768J1892J0367Q969P260M866K131l18k370m256n865o903p629q721j0282
61285F23909j1601j2128j2146j2200j2264j1920j1044r889q599p102n504m241
61273E05271l634l410k944k009j078p12p81n63L15J394J993K001J874K044K650
61258E02411L612M637N180M834L775K628J849J415J050N89J58R1N99J440K068
61243E36336K281K401K660K799K471J725P36m55j502j570l10J383K348K597K917
61228E56817L412L549L600M673P017R393J0611J0781J0525J0009R367R140R499
$$ plain form
61326 461528 462673 463186 463289 463489 464254 465586 467067 468404 469751 471418 473513 476076 479296 483339 488133
61311 488133 493650 500281 508571 518586 529870 541979 554808 568382 582583 597101 611401 624768
61299 624768 636660 647027 655996 663256 668122 670253 669935 667565 663309 657444 650541 642912 634191 623909
61285 623909 612308 600180 588034 575834 563570 551650 540606 530717 522118 515016 509512 505271
61273 505271 501637 498227 495283 493274 492196 491484 490703 490140 490455 491849 493842 495843 497717 499761 502411
61258 502411 506023 510660 515840 520674 524449 527077 528926 530341 531391 531980 532138 532229 532828 534268 536336
61243 536336 538617 541018 543678 546477 548948 550673 551409 550954 549452 547882 547572 548955 551303 553900 556817
61228 556817 560229 563778 567378 572051 579068 588461 599072 609853 620378 630387 639754 648894 658393
61215F58393R763R505R374R921J0366R648Q100O878O111M927L189J866J516J595
61201G51152J552J597K046K799L872N598P857R810J0851J1157J0957J0018Q368
61188H37634O734N534M081J618j309l383m197m524n049n687o215o755p365p736
61174H03381p678p513p646q000q191q097p997q148q481q726q749q698q754q835
61160F87868q696q348q148q290q367p714o146m164k457j354p24k37L72J111J687
61145F26393J786J387P89K84q9m98j056j623j853j452m56Q36K158L462M758N970
61129F40796P050Q088R197J0395J1722J3319J5208J7182J9101K1128K3414K5703
61117H22303K7578K9026L0423L1934L3282L4239L4996L5880L6877L7617L7721
$$ plain form
61215 658393 668156 677661 687035 696956 707322 716970 725070 731948 738059 742986 746175 748041 749557 751152
61201 751152 752704 754301 756347 759146 763018 768616 776473 786283 797134 808291 819248 829266 837634
61188 837634 844368 849902 853983 855601 854292 850909 846712 842188 837139 831452 825237 818482 811117 803381
61174 803381 795703 788190 780544 772544 764353 756256 748259 740111 731630 722904 714155 705457 696703 687868
61160 687868 679172 670824 662676 654386 646019 638305 632159 627995 625538 624184 623460 623223 623595 624706 626393
61145 626393 628179 629566 630355 630639 630550 630052 628996 627373 625520 624068 623612 624448 626606 630068 634826 640796
61129 640796 647846 655934 665131 675526 687248 700567 715775 732957 752058 773186 796600 822303
61117 822303 849881 878907 909330 941264 974546 1008785 1043781 1079661 1116538 1154155 1191876
61106A191876L7151L6336L5913L6036L5946L4576L1758K8406K5348K2400J8927
61095A534673J4877J0685O420J817k914o998j0106j2840j5934j9352k2583k5398
61083A452347k7870k9957l1600l2960l3979l3939l2246k9656k7900k7727k8037
61072A116476k7386k5724k3971k2467k0772j8784j7005j5624j4196j2566j1293
61061I06688j0719j0291r383q271p504o826n531l743k444k096j956j076O45K618
61047H40111M371N826P093Q365R789J1244J2471J3565J4956J6726J8294J9233
61035I82044K0072K1723K4306K7039K9321L1375L3697L6304L8821M0957M2626
61024A328285M3806M4609M5471M6973M9474N3081N7964O4436P2626Q2181R2451
$$ plain form
61106 1191876 1229027 1265363 1301276 1337312 1373258 1407834 1439592 1467998 1493346 1515746 1534673
61095 1534673 1549550 1560235 1566655 1568472 1565558 1558560 1548454 1535614 1519680 1500328 1477745 1452347
61083 1452347 1424477 1394520 1362920 1329960 1295981 1262042 1229796 1200140 1172240 1144513 1116476
61072 1116476 1089090 1063366 1039395 1016928 996156 977372 960367 944743 930547 917981 906688
61061 906688 895969 885678 876295 868024 860520 853694 848163 844420 841976 839880 837924 836848 837493 840111
61047 840111 844482 850308 857401 865766 875555 886799 899270 912835 927791 944517 962811 982044
61035 982044 1002116 1023839 1048145 1075184 1104505 1135880 1169577 1205881 1244702 1285659 1328285
61024 1328285 1372091 1416700 1462171 1509144 1558618 1611699 1669663 1734099 1806725 1888906 1981357
61013A981357J03033J14178J26994J43428J65916J96594K36817K87706L51483
61004C707506M32029N33909O60385Q11325R81496J160711J337558J504184J653850
60995A2782953J767243J799811J692372J410638R85792N16324J21667j16937j83971
60986B0775892j16998J7655J36780J48927j7969l74636q50096j320116j669111
60977A6730328j840355j843699j728053j547999j345227j145628r63059q03471
60969E512837o67925n54806m61307l84379l21282k69882k28668j96475j71870
60960B256243j52754j36848j22712j09982r8515q7786p7436o7827n9419n1966
60950A290998m5021l8992l4836l2752l1857l1187l0307k8915k6844k4626k3194
$$ plain form
61013 1981357 2084390 2198568 2325562 2468990 2634906 2831500 3068317 3356023 3707506
61004 3707506 4139535 4673444 5333829 6145154 7126650 8287361 9624919 11129103 12782953
60995 12782953 14550196 16350007 18042379 19453017 20438809 20955133 21076800 20959863 20775892
60986 20775892 20658894 20676549 20813329 20962256 20944287 20569651 19719555 18399439 16730328
60977 16730328 14889973 13046274 11318221 9770222 8424995 7279367 6316308 5512837
60969 5512837 4844912 4290106 3828799 3444420 3123138 2853256 2624588 2428113 2256243
60960 2256243 2103489 1966641 1843929 1733947 1635432 1547646 1470210 1402383 1342964 1290998
60950 1290998 1245977 1206985 1172149 1139397 1107540 1076353 1046046 1017131 990287 965661 942467
60939I42467k2549k1562j9644j7824j7370j7972j8201j7410j6219j5317j4709
60928G43690j4214j3830j3416j2663j1615j0761j0355j0136r858r644r539r137
60916F08522q118o875o175o224o392n925m869m061m160m776m877m083l140k842
60902E36005k963k744k176k002k511l075l092k731k434k231k002j932k256k845
60888E01011l405l898m375m692m763m841n185n572n649n531n552n532m862l437
60874D33717k006j366j465j530q91M30J754K293J903J323J487K521L627M049L817
60859D49663L432L149K877K573K346K222K091J905J699J454J147R32R21Q44K43
60844D77498p99j548j552j368j915l244m562n414o198p244q014p800o855o171
$$ plain form
60939 942467 919918 898356 878712 860888 843518 825546 807345 789935 773716 758399 743690
60928 743690 729476 715646 702230 689567 677952 667191 656836 646700 636842 627198 617659 608522
60916 608522 600404 593529 587354 581130 574738 568813 563944 559883 555723 550947 546070 541987 538847 536005
60902 536005 533042 530298 528122 526120 523609 520534 517442 514711 512277 510046 508044 506112 503856 501011
60888 501011 497606 493708 489333 484641 479878 475037 469852 464280 458631 453100 447548 442016 437154 433717
60874 433717 431711 430345 428880 427350 426459 426889 428643 430936 432839 434162 435649 438170 441797 445846 449663
60859 449663 453095 456244 459121 461694 464040 466262 468353 470258 471957 473411 474558 475490 476411 477255 477498
60844 477498 476699 475151 473599 472231 470316 467072 462510 457096 450898 443654 435640 427840 420985 414814
60830D14814o190o362o059n344m611l981l427l177l518m218m574m084k906j686
60816C54677j063j285k053k663k507j569m09L66N15J61m77j175j660j655j086
60801C38117k16N22Q68R00R05J132J647K189K285J710R13O87J224J792J663J032
60785C57370O28O20M82j32r78j722k268k455k032j207p13r50j438j518j182q63
60769C41642p59q11j014j253j128m70J74J34n08j127j452j646j610r93K9O08J85
60752C30001p83j334r53N0Q88R91N66M55J115J950K097J649J444J687J580N45
60736C41948r57k109k637k675k308j725j306j114p04J75J109J637J804J734J182
60721C34054K00l64J56J184J635J426J337J593J614J180P96P01M32k34p66p28
$$ plain form
60830 414814 408624 402262 396203 390859 386248 382267 378840 375663 372145 367927 363353 359269 356363 354677
60816 354677 353614 352329 350276 347613 345106 343537 343128 343494 344009 344170 343693 342518 340858 339203 338117
60801 338117 337901 338423 339291 340191 341096 342228 343875 346064 348349 350059 350972 351659 352883 354675 356338 357370
60785 357370 357998 358618 359100 358968 357990 356268 354000 351545 349513 348306 347593 346643 345205 343687 342505 341642
60769 341642 340883 340072 339058 337805 336677 336207 336381 336515 336007 334880 333428 331782 330172 329179 329208 329816 330001
60752 330001 329218 327884 326931 326981 327869 328860 329426 329881 330996 332946 335043 336692 338136 339823 341403 341948
60736 341948 340991 338882 336245 333570 331262 329537 328231 327117 326413 326588 327697 329334 331138 332872 334054
60721 334054 334254 333890 334046 335230 336865 338291 339628 341221 342835 344015 344811 345512 345944 345710 344944 344216
60705C44216m95n86r15j217j630k266k697k523k091j972k032j754j242j108j436
60690C20252j599j254q21p16p50n61j80J55L97N66N93O10J041K018K950L186K873
60673C28760K668K724K629K287K161K358K147R35o95j623j624j547j975k510k550
60658C34145k205j897j519n81Q58K033K308J840J295J198J632K286K693K613K259
60643C48958J952J581P57n17j672k298k583k836k937k694k376k357k411j942r27
60628C27698k9K73K53L98P44R97R66O11rn73n56J58Q66O68m91j718k051j286J2
60609C26931J030J313J065Q81J023J057M99l54o07J20J161J588J213O31M42P06
60593C38699J035J058Q34Q09J269J799J637O61k99m30J20O12Q05J093J633J975
$$ plain form
60705 344216 343721 343135 342220 341003 339373 337107 334410 331887 329796 327824 325792 324038 322796 321688 320252
60690 320252 318653 317399 316578 315862 315112 314551 314371 314526 314923 315489 316082 316692 317733 319751 322701 325887 328760
60673 328760 331428 334152 336781 339068 341229 343587 345734 346669 345974 344351 342727 341180 339205 336695 334145
60658 334145 331940 330043 328524 327943 328801 330834 333142 334982 336277 337475 339107 341393 344086 346699 348958
60643 348958 350910 352491 353248 352731 351059 348761 346178 343342 340405 337711 335335 332978 330567 328625 327698
60628 327698 327669 327942 328195 328593 329337 330334 331300 331911 331902 331329 330773 330931 331797 332465 331974 330256 328205 326919 326931
60609 326931 327961 329274 330339 331220 332243 333300 333799 333445 332838 332958 334119 335707 336920 337551 337993 338699
60593 338699 339734 340792 341626 342435 343704 345503 347140 347801 347502 347072 347192 347804 348609 349702 351335 353310
60577C53310J734J223J041J383K055K930M027N232O343P411Q661J0012J0967J1163
60563D27492J0814J0388R974R139P427M805J698j254l453m594m850m682m429m108
60549D54367l620k974k161j046M15J962L311M604O175P918R272J0025J0796J2283
60535E11327J4403J6475J8085J9271J9933J9617J8086J5660J2765R400N378Q92
60523F81292l447p063r661j1144j1649j1684j1829j2087j1719j0117p714n684
60511E67494m620l878k507n09J310K600L950N901Q146J0180J2263J5080J8671
60498F34081K2427K6100L0043L4260L7893M0062M0721M0288L8869L6376L3078
60487A014198K9439K5518K1012J5922J0680N561L09n548j2237j9599k7125l4068
$$ plain form
60577 353310 355044 356267 357308 358691 360746 363676 367703 372935 379278 386689 395350 405362 416329 427492
60563 427492 438306 448694 458668 467807 475234 480039 481737 480483 477030 472436 467586 462904 458475 454367
60549 454367 450747 447773 445612 444566 444981 446943 450254 454858 461033 468951 478223 488248 499044 511327
60535 511327 525730 542205 560290 579561 599494 619111 637197 652857 665622 675022 680400 681292
60523 681292 677845 670782 661121 649977 638328 626644 614815 602728 591009 580892 573178 567494
60511 567494 562874 558996 556489 555980 557290 559890 563840 569741 577887 588067 600330 615410 634081
60498 634081 656508 682608 712651 746911 784804 824866 865587 905875 944744 981120 1014198
60487 1014198 1043637 1069155 1090167 1106089 1116769 1122330 1122639 1117091 1104854 1085255 1058130 1024062
60475A024062l9761m3927m6583m7743m7361m5547m2584l8783l4558l0556k7291
60464E79368k4595k1789j8569j5393j2904j1197r862q544p265o309n928o007o025
60451D24981n567m832m344m108l549k463j512j367j767j969j799j688j785j731
60437C86500j344r36p90q17r06j134j430j504j374j491k017k372j940q74J94R33
60421C68698J309J158M43k42j26O26R84L81n43q52m14K68Q89J548K292K928L241
60404C82588L136K686K127J744J565J416J338J666K457L200L357K938K294J706
60390D14218J529K208L563M416L692J819L01QN20J147J714K221K467K422K403
60375D44648K526K552K471K615K907K654J592M69M0Q2Pp4L06R89J364J304J219
$$ plain form
60475 1024062 984301 940374 893791 846048 798687 753140 710556 671773 637215 606659 579368
60464 579368 554773 532984 514415 499022 486118 474921 465059 456515 449250 442941 437013 431006 424981
60451 424981 419414 414582 410238 406130 402581 400118 398606 397239 395472 393503 391704 390016 388231 386500
60437 386500 385156 384220 383430 382613 381707 380573 379143 377639 376265 374774 372757 370385 368445 367571 367765 368698
60421 368698 370007 371165 371608 371366 371240 371866 372850 373231 372688 371836 371422 371690 372579 374127 376419 379347 382588
60404 382588 385724 388410 390537 392281 393846 395262 396600 398266 400723 403923 407280 410218 412512 414218
60390 414218 415747 417955 421518 425934 429626 431445 431746 431754 432274 433421 435135 437356 439823 442245 444648
60375 444648 447174 449726 452197 454812 457719 460373 461965 462434 462474 462556 462563 462489 462795 463784 465148 466452 467671
60358D67671J373J888L132N213P236Q005P590P326Q004Q857Q690P242N108K898
60344E50233R76m56j545k710m128n484o402o738o414n500m628m607n251n337m241
60329D87768k947k670l128l126k419j908k074k288j952j380j106r82m81N30J819
60314D63656L239M809O471Q078R475J0456J0873J0987J1322J1957J2237J1561
60302E75121J0174Q803P702O508M858K722K02k565n301p831j0386j3198j5698
60289E61111j6784j6048j4258j2249j0005p288m630k894k111j569r96p83j019
60276D70477j188j118j426k528l849m556m533m141l512k765k411k796l404l492
60262D28758l180l099l196k815j972j477j593j511o04N80J118R42O64O73R67J521
$$ plain form
60358 467671 469044 470932 474064 479277 486513 494518 502108 509434 517438 526295 534985 542227 547335 550233
60344 550233 551209 550753 549208 546498 542370 536886 530484 523746 517332 511832 507204 502597 497346 492009 487768
60329 487768 484821 482151 479023 475897 473478 471570 469496 467208 465256 463876 462770 461788 461307 461837 463656
60314 463656 466895 471704 478175 486253 495728 506184 517057 528044 539366 551323 563560 575121
60302 575121 585295 594098 601800 608308 613166 615888 616090 613525 608224 600393 590007 576809 561111
60289 561111 544327 528279 514021 501772 491767 484479 479849 476955 474844 473275 472279 471496 470477
60276 470477 469289 468171 466745 464217 460368 455812 451279 447138 443626 440861 438450 435654 432250 428758
60262 428758 425578 422479 419283 416468 414496 413019 411426 409915 409311 409891 411009 411951 412615 413288 414255 415776
60246D15776K262K893L176L225L213L014K511J937J505J033K94m26o34l12J30
60231D39597M36O69R13J125J251J239J117J185J795K704L129K811K560L142M059
60216D67732M270L801L766M758O145P089P492P668P691P561P462P484P423P181
60202E57523P066P392P992Q335P950O712M992L593L128L326L307K674J885J364
60188F27239Q14k38j637k833l598m087m410m579m738n024n372n710o240o996p403
60173E65188o769n227l692k786k339k021j950k293k669k503j865j476j810k478
60159E25310k704k167j223m57j90l93p71q97m92K47P54O25Q0k87j15M27R57J279
60141E19983J471J630J689J552J435J870L170M887O140O536O443O260N810M781
$$ plain form
60246 415776 418038 420931 424107 427332 430545 433559 436070 438007 439512 440545 440839 440413 439779 439467 439597
60231 439597 440033 440702 441615 442740 443991 445230 446347 447532 449327 452031 455160 457971 460531 463673 467732
60216 467732 472002 475803 479569 484327 490472 497561 505053 512721 520412 527973 535435 542919 550342 557523
60202 557523 564589 571981 579973 588308 596258 602970 607962 611555 614683 618009 621316 623990 625875 627239
60188 627239 628053 627815 626178 623345 619747 615660 611250 606671 601933 596909 591537 585827 579587 572591 565188
60173 565188 558419 553192 549500 546714 544375 542354 540404 538111 535442 532939 531074 529598 527788 525310
60159 525310 522606 520439 519216 518759 518569 518176 517405 516508 516016 516263 517017 517642 517722 517435 517320 517747 518704 519983
60141 519983 521454 523084 524773 526325 527760 529630 532800 537687 543827 550363 556806 563066 568876 573657
60127E73657L456K534K361K721L222L522L335K664K017J947K391K874L291L892
60113F13884M574M787M348L703L197K705K209K128K521K637J838N66k75o13j168
60098F47041k223l205l543l371l196l311l704m194m442m111l207k178j515j406
60084F03435j745k291k745k892k781k669k711k798k701k307j750j403j666k620
60070E70356l927n184o304p315p903p561o324n078m758n315n755n308m313l702
60056D91609l777l896l448k698k326k372k224j525n40M73J660L029M042M245L988
60041D86240M017M577N374O230P180P894P665O193M111K474J887K144K480K063
60027E50529N86j449l141m038m503n174o234p332q048q224p979p537p130o886
$$ plain form
60127 573657 577113 579647 582008 584729 587951 591473 594808 597472 599489 601436 603827 606701 609992 613884
60113 613884 618458 623245 627593 631296 634493 637198 639407 641535 644056 646693 648531 649097 648822 648209 647041
60098 647041 644818 641613 638070 634699 631503 628192 624488 620294 615852 611741 608534 606356 604841 603435
60084 603435 601690 599399 596654 593762 590981 588312 585601 582803 580102 577795 576045 574642 572976 570356
60070 570356 566429 561245 554941 547626 539723 532162 525838 520760 516002 510687 504932 499624 495311 491609
60056 491609 487832 483936 480488 477790 475464 473092 470868 469343 468803 469276 470936 473965 478007 482252 486240
60041 486240 490257 494834 500208 506438 513618 521512 529177 535370 539481 541955 543842 545986 548466 550529
60027 550529 551115 549666 546525 542487 537984 532810 526576 519244 511196 502972 494993 487456 480326 473440
60013D73440o701o248n312m168l465l546m018m133l611k731j817j015o01r14j725
59998D23435k121j507l54M23N85O00Q24J258J924K869L719L905L437K995L039
59983D45031L315L399L252K911K122P46o87j377j194q88j258k282l209l411l046
59968D43424k776k898k978k479j522o98k27K82J131K030K533K681K914L377L647
59953D48441L186K010P50M4q8j63n31r90j210j190j050o32K01J106J526J433J207
59936D54050Q72R6q91j133j45J294K103K301K776L921N118N585N175M143K651
59921D87916Q08r92k144k357j966j623j626j627j087K0J147J825K107K318K594
59906D85313K845K939K750K200J424Q03N58M48Q0n15q75p03k69q9k84l87R9J028
$$ plain form
60013 473440 466739 460491 455179 451011 447546 444000 439982 435849 432238 429507 427690 426675 426074 425160 423435
59998 423435 421314 419807 419453 419876 420461 421061 421885 423143 425067 427936 431655 435560 438997 441992 445031
59983 445031 448346 451745 454997 457908 460030 460776 460089 458712 457518 456630 455372 453090 449881 446470 443424
59968 443424 440648 437750 434772 432293 430771 430073 429846 430128 431259 433289 435822 438503 441417 444794 448441
59953 448441 451627 453637 454387 454431 454343 454180 453649 452659 451449 450259 449209 448577 448778 449884 451410 452843 454050
59936 454050 454922 455018 454127 452994 452849 454143 456246 458547 461323 465244 470362 475947 481122 485265 487916
59921 487916 488724 487732 485588 483231 481265 479642 478016 476389 475302 475322 476469 478294 480401 482719 485313
59906 485313 488158 491097 493847 496047 497471 498274 498832 499280 499360 498845 497970 497267 496998 496909 496625 496238 496337 497365
59888D97365J775K103K582L713N014N526N183M904N254N724N725N517N564N560
59874E61509M991M194L923L937L112J101r94k054k267k518l002l159k709k049
59860E64015j613j414j278j170j018n72L55J602K807L821M796N829O732P301P719
59845E97912Q335Q968Q770P106M452K024N39k91r80j460j363q09m00n64j214k094
59829F28931l053l878m250m150m093m596n462n940n640n038m870n317n938o225
59815E60481n907m893l392k055j570j839j921j080L14J251J270Q21M98M05M09
59800E42792O07J140J715J684P44o70j819k381k580k726k828k741k468k185k035
59785E26249k023k067k042j892j764j941k459k927k956k631k323k055j539q33
$$ plain form
59888 497365 499140 501243 503825 507538 512552 518078 523261 528165 533419 539143 544868 550385 555949 561509
59874 561509 566500 570694 574617 578554 581666 582767 581773 579719 577452 574934 571932 568773 566064 564015
59860 564015 562402 560988 559710 558540 557522 556950 557305 558907 561714 565535 570331 576160 582892 590193 597912
59845 597912 606247 615215 623985 631091 635543 637567 638106 637815 636835 635375 634012 633203 632803 632239 631025 628931
59829 628931 625878 622000 617750 613600 609507 604911 599449 593509 587869 582831 577961 572644 566706 560481
59815 560481 554574 549681 546289 544234 542664 540825 538904 537824 538138 539389 540659 541480 541978 542383 542792
59800 542792 543399 544539 546254 547938 548682 548012 546193 543812 541232 538506 535678 532937 530469 528284 526249
59785 526249 524226 522159 520117 518225 516461 514520 512061 509134 506178 503547 501224 499169 497630 496797
59771D96797m91p88j149p97K54J215J516J445J724K672L864M582M551M183M078
59756E23656M381M882N591O768Q320R564R965R708R326R056Q894Q949R212R253
59742F37525Q674P726O969O396N474M029K519J313K56q20j664j982j907j776j704
59727F71028j656j734k074k578k979l137l158l181l206l019k487j935k057l070
59713F34757m077l844k282o87k35o87r05l14O21J232J466J842K772M052N013N276
59697F44000N235N510N987N937N264M943N685O679O423M616K474J143N28q4r59
59682G03381j825k476k928l173l218l288l700m467n252n738n981o245o625o845
59668F41620o615o107n874o106o228n555m226l004k179j226K42J734K514K604
$$ plain form
59771 496797 496306 495518 494369 493572 493826 495041 496557 498002 499726 502398 506262 510844 515395 519578 523656
59756 523656 528037 532919 538510 545278 553598 563162 573127 582835 592161 601217 610111 619060 628272 637525
59742 637525 646199 653925 660894 667290 672764 676793 679312 680625 680881 680061 678397 676415 674508 672732 671028
59727 671028 669372 667638 665564 662986 660007 656870 653712 650531 647325 644306 641819 639884 637827 634757
59713 634757 630680 626836 624554 623867 623632 622945 622040 621726 622347 623579 625045 626887 629659 633711 638724 644000
59697 644000 649235 654745 660732 666669 671933 676876 682561 689240 695663 700279 702753 703896 704424 704340 703381
59682 703381 701556 699080 696152 692979 689761 686473 682773 678306 673054 667316 661335 655090 648465 641620
59668 641620 635005 628898 623024 616918 610690 605135 600909 597905 595726 594500 594742 596476 598990 601594
59654F01594K645L006L513L959M295M337L856L072K516K253J671L17j520l292
59640F32222m812o056o862p286p837q717r150q220o240m545l901l836l674l398
59626E47688l221l053k863l002l608m219m466m668n121n289m528l266k618k923
59612D94843l468l642l515l186k418j253k66K44O97J453K125K151J638J090P04
59597D87197L76J96L50P38J128J482J732J475N04n15n95K78J008P18k67r69r31
59580D93905m98k66n55j241j896k182k237k518l180l828m071l968l710l089j816
59565D58850k27P69O64r1o30n91k74j09k39n93j055j432j385o15Q12K271K911
59548D59036K414J466J218K064L206L666L578M011N604P871R928J1386J2377J3218
$$ plain form
59654 601594 604239 607245 610758 614717 619012 623349 627205 630277 632793 635046 636717 637034 635514 632222
59640 632222 627410 621354 614492 607206 599369 590652 581502 573282 567042 562497 558596 554760 551086 547688
59626 547688 544467 541414 538551 535549 531941 527722 523256 518588 513467 508178 503650 500384 497766 494843
59612 494843 491375 487733 484218 481032 478614 477361 477095 477339 478036 479489 481614 483765 485403 486493 487197
59597 487197 487573 487769 488119 488857 489985 491467 493199 494674 495178 494663 494068 494346 495354 496072 495805 494836 493905
59580 493905 493407 493141 492586 491345 489449 487267 485030 482512 479332 475504 471433 467465 463755 460666 458850
59565 458850 458623 459392 460056 459965 459335 458744 458470 458361 458122 457529 456474 455042 453657 453042 453854 456125 459036
59548 459036 461450 462916 464134 466198 469404 473070 476648 480659 486263 494134 504062 515448 527825 541043
59534E41043J4322J5813J6626J4627Q598J36p192j0788j0766q933o835n033l458
59521E58160j933m49P27J358J600J680J266j82k368m140m879n139n547n806n487
59506E28861n081n302n785n526m472l661l703m004l778l056k366k060k185k550
59492D75332k622j864m55P59J329J650K190K726K787K405K010J942K433L583M917
59477D99122N390M509L143K573K947L342L261L144L307L169K104N54l54j68L96
59462E36439M03k44q10o21K83J417K499L593M651N300N318N038M934M955M697
59447E77852M123L663L547L478L095K381J423J76j290k633l601m272m670m467
59433E78805l495k234j361r46o04k00J24N28J399K642L679M325N061O194P420
$$ plain form
59534 541043 555365 571178 587804 602431 611029 611165 603973 593185 582419 573486 566651 561618 558160
59521 558160 556227 555778 556505 557863 559463 561143 562409 562227 559859 555719 550840 545701 540154 534348 528861
59506 528861 523780 518478 512693 507167 502695 499034 495331 491327 487549 484493 482127 480067 477882 475332
59492 475332 472710 470846 470391 471150 472479 474129 476319 479045 481832 484237 486247 488189 490622 494205 499122
59477 499122 504512 509021 512164 514737 517684 521026 524287 527431 530738 533907 536011 536565 536211 536043 536439
59462 536439 536842 536598 535788 535167 535450 536867 539366 542959 547610 552910 558228 563266 568200 573155 577852
59447 577852 581975 585638 589185 592663 595758 598139 599562 599738 598448 595815 592214 587942 583272 578805
59433 578805 575310 573076 571715 570769 570165 569965 570089 570617 572016 574658 578337 582662 587723 593917 601337
59418F01337Q612J0382J3239J6589J9285K0942K2091K3223K4268K4904K4597K2341
59406H31810J7206R565J336n268q980r531p321l447N57L644N758O954O407K953
59392H51643l352j0765j7055k0918k2272k1676j9848j7512j5335j3728j2578j1316
59380F65288r436p052m833l287k362j740j273q84l55M51J306J840J927J634R85
59365F42209J43l49K3J046J969K458L015M192N689O600O489N900N731O254O948
59350F98317P352P793Q949J0798J2383J2829J2277J1534J1119J0965J0773J0220
59338H25309Q948O852M371K112J85j746l768n575p029q460j0145j1844j3108j3779
59324G72323j4053j4175j4231j4099j3501j2318j0854r659q986q644q328p860
$$ plain form
59418 601337 609949 620331 633570 650159 669444 690386 712477 735700 759968 784872 809469 831810
59406 831810 849016 858581 859917 854649 845669 836138 828817 825370 825927 829571 835329 842283 848690 851643
59392 851643 848291 837526 820471 799553 777281 755605 735757 718245 702910 689182 676604 665288
59380 665288 655852 648800 643967 640680 638318 636578 635305 634421 634066 634517 635823 637663 639590 641224 642209
59365 642209 642352 642003 642026 643072 645041 647499 650514 654706 660395 666995 673484 679384 685115 691369 698317
59350 698317 705669 713462 722411 733209 745592 758421 770698 782232 793351 804316 815089 825309
59338 825309 834257 841109 845480 847592 847777 846031 842263 836688 829659 821199 811054 799210 786102 772323
59324 772323 758270 744095 729864 715765 702264 689946 679092 669433 660447 651803 643475 635615
59312F35615p091n943m680l830l634l732l537k716j279N56K461M248O088Q230
59298F20756J0335J1383J0478P636L653n92m640q315j1376j3315j3688j2690j1139
59285E88486r562p623m983k405j132j165j083J47K049L670M914O175P421Q490
59271E93399R668J1133J2278J2497J2320J2736J3599J3759J2755J1332J0127Q829
59259G34432O989M775K507J93j987l357l549l156l059l343l436l000k266j623
59245G20120j278j204j235j275j544k295l166l351k732k313k976m187m666m120
59231F83778l541l720m250m331l986l943m597n560o251o505o490o315n989n694
59217F12606n783o291o626o046m513k736j413o73l83n60j102j455j069j24O67
$$ plain form
59312 635615 628524 622581 617901 614071 610437 606705 603168 600452 599173 599729 602190 606438 612526 620756
59298 620756 631091 642474 652952 660588 664241 663649 659009 650694 639318 626003 612315 599625 588486
59285 588486 578924 571301 566318 563913 562781 561616 560533 560680 562729 566399 571313 577488 584909 593399
59271 593399 603067 614200 626478 638975 651295 664031 677630 691389 704144 715476 725603 734432
59259 734432 741421 746196 748703 748896 746909 743552 740003 736847 733788 730445 727009 724009 721743 720120
59245 720120 718842 717638 716403 715128 713584 711289 708123 704772 702040 699727 696751 692564 687898 683778
59231 683778 680237 676517 672267 667936 663950 660007 655410 649850 643599 637094 630604 624289 618300 612606
59217 612606 606823 600532 593906 587860 583347 580611 579198 578525 578142 577582 576480 575025 573956 573832 574499
59202E74499R94J277J899K531K542J851J036O53O97Q14P62N20J09m55r26q44n7
59185E87902Q71J111M89k87n06k56j49m26p77r29j091j592k318k701k249j073
59169E76019J29O32L01m13j000j261j088l05J013K294K888K622J646O1j882l453
59153E78203m012l935m241n193n932n803n300n238n598n851n921o052n981n118
59139E04028l577k290j919k234k699l099l328l072k217j220p34r06j277j191k32
59124D74033J492L299M430M798N097N947P179Q177Q646Q805Q955R208R470R434
59110E68970Q773P660O852O866P145O589M918L091K171K204K456K340J744P37
59096F32516n98j983k981l382l397l350l293k992k266j301n67l90o03o92m13j87
$$ plain form
59202 574499 575493 576770 578669 581200 583742 585593 586629 587282 587979 588793 589555 590075 590184 589729 588803 587959 587902
59185 587902 588773 589884 590373 590086 589580 589324 589175 588749 587972 587043 585952 584360 582042 579341 577092 576019
59169 576019 576148 576780 577081 576668 575668 574407 573319 573014 574027 576321 579209 581831 583477 583538 581656 578203
59153 578203 574191 570256 566015 560822 554890 549087 543787 538549 532951 527100 521179 515127 509146 504028
59139 504028 500451 498161 496242 494008 491309 488210 484882 481810 479593 478373 477639 476733 475456 474265 474033
59124 474033 475525 478824 483254 488052 493149 499096 506275 514452 523098 531903 540858 550066 559536 568970
59110 568970 577743 585403 592255 599121 606266 612855 617773 620864 623035 625239 627695 630035 631779 632516
59096 632516 631918 629935 626954 623572 620175 616825 613532 610540 608274 606973 606406 606016 605413 604721 604308 604121
59080F04121p31k290m316n993o917p205p100o690o024n251m540l927l377k931
59066E36829k691k681k779k811k758k834l277l849l768k518q03j41j152k668l083
59051D99016k262j472j537j913j744j074n93o32r25j075q93n01l00n33p93l46
59035D82423P84J656J683J480J890K718L240L456L995M916N606N868O209O972
59021E32896P925Q896J0013J1086J1500J1068J0324R601Q446O404L821J370p26
59008F32624k524l831m404m413m250m018l549k744j624k74J071K131K944L738
58994F10877M327M129L074J876J117O43K88M30J152J572R31j18l07M33J048J137
58978F32609J566L080N196O888P758Q266R151J0830J2941J4453J4644J3928J3245
$$ plain form
59080 604121 603390 601100 596784 590791 583874 576669 569569 562879 556855 551604 547064 543137 539760 536829
59066 536829 534138 531457 528678 525867 523109 520275 516998 513149 509381 506863 506060 505919 504767 502099 499016
59051 499016 496754 495282 493745 491832 490088 489014 488421 487789 486864 485789 484896 484395 484095 483562 482769 482423
59035 482423 483207 484863 486546 488026 489916 492634 495874 499330 503325 508241 513847 519715 525924 532896
59021 532896 540821 549717 559730 570816 582316 593384 603708 613309 621755 628159 631980 633350 632624
59008 632624 630100 626269 621865 617452 613202 609184 605635 602891 601267 600993 602064 604195 607139 610877
58994 610877 615204 619333 622407 624283 625400 626043 626331 626761 627913 629485 630416 630298 629991 630424 631472 632609
58978 632609 634175 637255 642451 649339 657097 665363 674514 685344 698285 712738 727382 741310 754555
58965G54555J2872J2496J2225J2519J2992J2396J0193P316M831K691L55k078m165
58952H49198n960p835r774j1541j3242j5008j6394j6754j6081j4962j3767j2532
58940F95348j1388j0510r672q441o828n300m132l219k475j851j002M72K245L348
58926F36595L205K246J266O53M22N48Q62R39N24j30n69p07q34j181j669j973j743
58909F38454q56L98J546K393L115L821M381M889N921P903J0375J2352J3262J3249
58895G21203J2649J1714J0883J0710J1285J2117J2820J3590J4676J5729J6193
58884H63569J6041J5653J5080J3976J2335J0676R301P819N743L228Q65j107k926
58871I70253m785o490p693q226q227q022p930q008q003p725p321p085p060p026
$$ plain form
58965 754555 767427 779923 792148 804667 817659 830055 840248 847564 852395 855086 855441 853363 849198
58952 849198 843238 835403 825629 814088 800846 785838 769444 752690 736609 721647 707880 695348
58940 695348 683960 673450 663778 655337 648509 643209 639077 635858 633383 631532 630530 631002 633247 636595
58926 636595 639800 642046 643312 643965 644387 644935 645797 646736 647260 647130 646561 645854 645020 643839 642170 640197 638454
58909 638454 637598 637996 639542 641935 645050 648871 653252 658141 664062 671965 682340 694692 707954 721203
58895 721203 733852 745566 756449 767159 778444 790561 803381 816971 831647 847376 863569
58884 863569 879610 895263 910343 924319 936654 947330 956631 964450 970193 973421 974286 973179 970253
58871 970253 965468 958978 951285 943059 934832 926810 918880 910872 902869 895144 887823 880738 873678 866652
58857H66652o840o626o655p143q158r475j0658j1365j1555j1294j0551r407q261
58844G48664p505p069o677o473p010q475j0268j1482j1598j0736r497q566q204
58831F35104q051p635p032o617o238n203l270j064P55K284L871N207N586M928
58817F12625M034L737M125M690N003N068N117N207N053M331L072J653M22m58r64
58802F62715j338k200l990o195p632p797p458p522p833p627o819o180o346p152
58788E76626p929p964o829m731k567j155m46K06J050J771K179K528K971L274L281
58773E62265L211L169K732J368q54l170m726n221n129n275n950o564o418n703
58759E23735n215n140m777l677k386j613j193n29K93O03K70M0N00J267J570J337
$$ plain form
58857 866652 859812 853186 846531 839388 831230 821755 811097 799732 788177 776883 766332 756925 748664
58844 748664 741159 734090 727413 720940 713930 705455 695187 683705 672107 661371 651874 643308 635104
58831 635104 627053 619418 612386 605769 599531 594328 591058 589994 590749 593033 596904 602111 607697 612625
58817 612625 616659 620396 624521 629211 634214 639282 644399 649606 654659 658990 662062 663715 664137 663679 662715
58802 662715 661377 659177 655187 648992 641360 633563 626105 618583 610750 603123 596304 590124 583778 576626
58788 576626 568697 560733 553904 549173 546606 545451 545005 545211 546261 548032 550211 552739 555710 558984 562265
58773 562265 565476 568645 571377 572745 571891 568721 563995 558774 553645 548370 542420 535856 529438 523735
58759 523735 518520 513380 508603 504926 502540 500927 499734 499205 499498 500101 500371 500411 500911 502178 503748 505085
58743E05085J235J731K518K989K999K938L149L590M131M859N867O843P201O618
58729E61753N350L961K899K302K047J936J890J968K211K535K881L317L905M628
58715F03583N515O614P634P968P419O578O046N464M040J826k16j595k919m847
58701F53110p043q730r826j0912j2289j3598j4421j4856j5296j5760j5633j4237
58689E00509j1779r370p859o933n857m734m243m333m190l648l421l599l106j474
58675D25963K8J04n82m62N43J187J117J312K196K912K968L229M539O290P304P321
58659D65969O838N956M313J934n42k420l415l659l622l773m132m317m223m260
58645D50647m675n050m832m056l207k619k298k099j811j325q12m34K01J612L290
$$ plain form
58743 505085 506320 508051 510569 513558 516557 519495 522644 526234 530365 535224 541091 547934 555135 561753
58729 561753 567103 571064 573963 576265 578312 580248 582138 584106 586317 588852 591733 595050 598955 603583
58715 603583 609098 615712 623346 631314 638733 645311 651357 656821 660861 662687 662471 660876 657957 653110
58701 653110 646067 637337 627511 616599 604310 590712 576291 561435 546139 530379 514746 500509
58689 500509 488730 479360 471501 464568 458711 453977 449734 445401 441211 437563 434142 430543 427437 425963
58675 425963 425991 426095 425513 425051 425594 426781 427898 429210 431406 434318 437286 440515 445054 451344 458648 465969
58659 465969 472807 478763 483076 485010 484468 482048 478633 474974 471352 467579 463447 459130 454907 450647
58645 450647 445972 440922 436090 432034 428827 426208 423910 421811 420000 418675 417863 417429 417630 419242 422532
58630D22532L798K573Q86K43M51K20p75j548j381o93k04j05k58m59k88O42K038
58613D27672L133L657M055M566M814M529M039L633L073K199J515J581K205K677
58599D73348K584J975J045O7o18r42j231j618j687j096k65J68L92J251L044N047
58583D81464O388O977P329P851Q444Q707Q379P679P194P282P604P509O895O389
58569E86091O621P588Q908J0444J2367J4690J7002J8827K0118K1328K2914K4745
58557G71643K5974K5588K3209J9446J5356J1472P456K908j583m664n685n548n669
58544H79903o348o763o427n952o266p719j0148j3276j6543j9104k0468k0932k0955
58531G19002k0457j9154j7312j5527j3995j2465j0864r419q193p024n946n267
$$ plain form
58630 422532 426330 428903 429789 430032 430483 430703 429928 428380 426999 426306 426102 425997 425739 425280 424992 425634 427672
58613 427672 430805 434462 438517 443083 447897 452426 456465 460098 463171 465370 466885 468466 470671 473348
58599 473348 475932 477907 478952 479019 478401 477459 476228 474610 472923 471827 471562 471730 472122 473373 476417 481464
58583 481464 487852 494829 502158 510009 518453 527160 535539 543218 550412 557694 565298 572807 579702 586091
58569 586091 592712 600300 609208 619652 632019 646709 663711 682538 702656 723984 746898 771643
58557 771643 797617 823205 846414 865860 881216 892688 900144 903052 901469 896805 891120 885572 879903
58544 879903 873555 866792 860365 854413 848147 840428 830280 817004 800461 781357 760889 739957 719002
58531 719002 698545 679391 662079 646552 632557 620092 609228 599809 591616 584592 578646 573379
58519E73379n106n206n215m915m249l468l147l535l981l521k132p90j89J0L23
58504E28258N04j3j039j678j399o57k50l92o02m18j5J24J6L45J557L088L925L851
58486E35205L664M189N455O955Q236R109R702J0528J2125J4373J6362J7193J6680
58473F69776J5213J3279J1249R221O776L311j055n162p835q957r263r246q790
58460F78517p679n966l822j390J138L575N864P972R691J0738J1036J0633R503
58447G29810P672N424K984P4l724q058j1661j3412j3333j2301j1057r805q611
58434F54002p660o926n935m210j915K23J666K528L223L912M523N066N603O029
58420F60129O202O200O065N375L576Q93j655l405m767o424q194r241r148q232
$$ plain form
58519 573379 568273 563067 557852 552937 548688 545220 542073 538538 534557 531036 528904 528114 527925 527935 528258
58504 528258 528762 528749 527710 526032 524633 523976 523726 523334 522732 522314 522299 522423 522439 522784 524341 527429 531354 535205
58486 535205 538869 543058 548513 555468 563704 572813 582515 593043 605168 619541 635903 653096 669776
58473 669776 684989 698268 709517 718738 725514 728825 727770 722608 714773 705816 696553 687307 678517
58460 678517 670838 664872 661050 659660 660798 664373 670237 678209 687900 698638 709674 720307 729810
58447 729810 737482 742906 745890 745964 742240 734182 722521 709109 695776 683475 672418 662613 654002
58434 654002 646342 639416 633481 629271 627356 627579 629245 631773 634996 638908 643431 648497 654100 660129
58420 660129 666331 672531 678596 683971 687547 688440 686785 683380 678613 672189 663995 654754 645606 637374
58406F37374o938n483m241l815m351n052m826l412j652n76l62l33J77J149K135
58391E99794K917L632M305M612M220L237K146J461J400J786K150K162J994K096
58377F37912K627L349M088M868N537N679N250M878N138N823O346O654P199Q119
58363G13467Q976R349R335R282R443R952J0823J1699J1895J0931R037O919N069
58350H36177L448J833L13p03r31n10K57J240K373L361L884M118M700N967P566
58335H73093Q945R941J0608J0902J0913J1178J2171J3483J4023J3251J1799J0606
58323A010913R709Q363O239M074K881K807L129L233L173L251L542M094N138O653
58309A077199Q050Q749Q914R133R615J0152J0716J1445J2150J2530J2783J3357
$$ plain form
58406 637374 630436 624953 620712 616897 612546 607494 602668 599256 597604 597028 596666 596333 596510 597659 599794
58391 599794 602711 606343 610648 615260 619480 622717 624863 626324 627724 629510 631660 633822 635816 637912
58377 637912 640539 643888 647976 652844 658381 664060 669310 674188 679326 685149 691495 698149 705348 713467
58363 713467 722443 731792 741127 750409 759852 769804 780627 792326 804221 815152 824189 831108 836177
58350 836177 839625 841458 841771 841068 840137 839627 839884 841124 843497 846858 850742 854860 859560 865527 873093
58335 873093 882038 891979 902587 913489 924402 935580 947751 961234 975257 988508 1000307 1010913
58323 1010913 1020622 1028985 1035224 1039298 1042179 1044986 1048115 1051348 1054521 1057772 1061314 1065408 1070546 1077199
58309 1077199 1085249 1093998 1102912 1112045 1121660 1131812 1142528 1153973 1166123 1178653 1191436 1204793
58297A204793J4046J4126J3565J3245J3678J4327J4618J4923J5888J7285J8259
58286A368753J8467J8432J8889K0131K1843K3311K4015K4141K4336K4911K5642
58275A612871K6299K6913K7506K8097K9035L0656L2655L4413L5969L7778L9563
58264A961755M0530M0920M2140M4872M8152N0874N3024N4866N6101N6626N7026
58253B506886N7520N7477N6871N6960N8538O0648O2343O4526O8552P3930P9032
58242C203283Q3459Q8175R3763R9969J06677J14029J21756J29477J37349J45654
58232D323591J54212J62997J72588J83229J94402K06150K19734K35970K54068
58223F106941K73291K94311L17863L43601L71711M03791M40542M80499N23037
$$ plain form
58297 1204793 1218839 1232965 1246530 1259775 1273453 1287780 1302398 1317321 1333209 1350494 1368753
58286 1368753 1387220 1405652 1424541 1444672 1466515 1489826 1513841 1537982 1562318 1587229 1612871
58275 1612871 1639170 1666083 1693589 1721686 1750721 1781377 1814032 1848445 1884414 1922192 1961755
58264 1961755 2002285 2043205 2085345 2130217 2178369 2229243 2282267 2337133 2393234 2449860 2506886
58253 2506886 2564406 2621883 2678754 2735714 2794252 2854900 2917243 2981769 3050321 3124251 3203283
58242 3203283 3286742 3374917 3468680 3568649 3675326 3789355 3911111 4040588 4177937 4323591
58232 4323591 4477803 4640800 4813388 4996617 5191019 5397169 5616903 5852873 6106941
58223 6106941 6380232 6674543 6992406 7336007 7707718 8111509 8552051 9032550 9555587
58214I555587N70610O25870O88782P59106Q39455R33006J040553J163305J306427
58205A7482701J476447J677836J916540K204598K557392K990204L523925M191824
58197C8021467N034947O095297P422119R078176J1117153J3534524J6229844J9009754
58189A25543281K1628019K3834913K5385267K5956036K5023192K1897174J6083970
58182B85351852P813364j734632j0828961j7982336k2537222k4664337k4942756
58175A90474972k3957828k2155337j9875458j7400618j4956733j2697903j0704337
58168F8726758q996728p559899o364730n378523m566555l895517l339132k877750
58160B5747924k493026k167554j889813j654609j457228j290482j148006j026632
$$ plain form
58214 9555587 10126197 10752067 11440849 12199955 13039410 13972416 15012969 16176274 17482701
58205 17482701 18959148 20636984 22553524 24758122 27315514 30305718 33829643 38021467
58197 38021467 43056414 49151711 56573830 65652006 76769159 90303683 106533527 125543281
58189 125543281 147171300 171006213 196391480 222347516 247370708 269267882 285351852
58182 285351852 293165216 291430584 280601623 262619287 240082065 215417728 190474972
58175 190474972 166517144 144361807 124486349 107085731 92128998 79431095 68726758
58168 68726758 59730030 52170131 45805401 40426878 35860323 31964806 28625674 25747924
58160 25747924 23254898 21087344 19197531 17542922 16085694 14795212 13647206 12620574
58152A2620574r23888q35946p59326o92214o32891n78768n28017m80629m37155
58143F751740l97582l61803l29812l01182k75436k52917k34196k18884k06103
58134D173825j95483j86439j77139j66059j54026j43079j33653j24692j16038
58125B777217j08674j02686r6957r0975q5305q0161p5165p0561o7087o4498o1762
58114A873386n8768n6307n4304n1727m8417m5456m3361m1386l9012l6759l5135
58103A362754l3900l2753l1738l0751k9622k8677k8291k7941k6898k5548k4766
58092A041869k4209k2795k0784j9623j9556j9168j7692j6007j4854j3764j2519
58081H40898j2031j2797j3825j4134j4104j4373j4481j3752j2603j1908j1677
$$ plain form
58152 12620574 11696686 10860740 10101414 9409200 8776309 8197541 7669524 7188895 6751740
58143 6751740 6354158 5992355 5662543 5361361 5085925 4833008 4598812 4379928 4173825
58134 4173825 3978342 3791903 3614764 3448705 3294679 3151600 3017947 2893255 2777217
58125 2777217 2668543 2565857 2468900 2377925 2292620 2212459 2137294 2066733 1999646 1935148 1873386
58114 1873386 1814618 1758311 1704007 1652280 1603863 1558407 1515046 1473660 1434648 1397889 1362754
58103 1362754 1328854 1296101 1264363 1233612 1203990 1175313 1147022 1119081 1092183 1066635 1041869
58092 1041869 1017660 994865 974081 954458 934902 915734 898042 882035 867181 853417 840898
58081 840898 828867 816070 802245 788111 774007 759634 745153 731401 718798 706890 695213
58070F95213j1409j1148j1206j1271j0715r608q643q205p986p471o568n789n856
58057E79338o835p798p908p561p783q575q943q458p728p108o183m901m052m081
58043D81424m392m439m525m910n121m876m745n080n217m612l989m332n363o051
58029D13772o137o227o674p234p610p567o849n636m745m690m894m573l932l743
58015C33261m035m114l702l170k737k194j494r41p82j053j771k747l353l020j914
58000B96234o80L36J118J509J404J225J556K315K894L139L420L736L478K327P88
57985C24799m77j303j767j841j671j775k422l102l120k584k284k610k984k585
57971B94274j344J7P72P55L04j03r2L88R57J095P14K49k7m35j320k268k500j992
$$ plain form
58070 695213 683804 672656 661450 650179 639464 629856 621213 613008 605022 597551 590983 585194 579338
58057 579338 572503 564705 556797 549236 541453 532878 523935 515477 507749 500641 494458 489557 485505 481424
58043 481424 477032 472593 468068 463158 458037 453161 448416 443336 438119 433507 429518 425186 419823 413772
58029 413772 407635 401408 394734 387500 379890 372323 365474 359838 355093 350403 345509 340936 337004 333261
58015 333261 329226 325112 321410 318240 315503 313309 311815 310874 310092 309039 307268 304521 301168 298148 296234
58000 296234 295554 295890 297008 298517 299921 301146 302702 305017 307911 311050 314470 318206 321684 324011 324799
57985 324799 324322 323019 321252 319411 317740 315965 313543 310441 307321 304737 302453 299843 296859 294274
57971 294274 292930 292947 293719 294474 294778 294675 294583 294971 295928 297023 297737 297986 297959 297524 296204 293936 291436 289444
57953B89444j628k068k917l347l100k620k387k443k472k131j447q92q34r46m92
57938B59720O68J838K422K679L151L759L972L655L238L007K697J904O55o31j617
57923B91117k375l232m312n280n638n278m635m261m307m428m187l557k942k594
57909B34091k083q62O38J127J18j180j365o69l79q39j241j237j461k196k788k854
57893B16820k862k982k513j253k98m87r92o43J82L21j08P0J055J725J428Q23N89
57876B10875M64N8l30k08L66J046J675K199K583L048L866M683M687L725K700K427
57860B43864K689K793K618K489K476K443K529K987L554L588K888J956J346J094
57846B79314R29P06L76k36j294k546l356l291k599k004k016k533l116l422l398
$$ plain form
57953 289444 287816 285748 282831 279484 276384 273764 271377 268934 266462 264331 262884 261992 261158 260212 259720
57938 259720 260388 262226 264648 267327 270478 274237 278209 281864 285102 288109 290806 292710 293365 292734 291117
57923 291117 288742 285510 281198 275918 270280 265002 260367 256106 251799 247371 243184 239627 236685 234091
57909 234091 232008 231146 231784 232911 233029 231849 230484 229815 229436 228597 227356 226119 224658 222462 219674 216820
57893 216820 213958 210976 208463 207210 206912 206425 205433 204790 204972 205293 205185 205255 206310 208035 209463 210286 210875
57876 210875 211339 211397 211067 210859 211225 212271 213946 216145 218728 221776 225642 230325 235012 238737 241437 243864
57860 243864 246553 249346 251964 254453 256929 259372 261901 264888 268442 272030 274918 276874 278220 279314
57846 279314 280243 280949 281325 281089 279795 277249 273893 270602 268003 265999 263983 261450 258334 254912 251514
57831B51514l143k790k408j939j285n32M2K96M30O78R08Q35O20Q98J965L176L509
57814B52774K772J912J807K053J439l97k359l273l264l260l550l664l485l544
57800B35961m056m490m446m231m172l970l283k461k080k161k322k375k273j831
57786A91810j126p81j169j643j263j45O95P96O92Q77J118J088J046J350J727J533
57770A96605O47k44l10N04J298J032l72j905k583k403k078k114k478k846k783
57755A79970j980p40K9j25m55P8J392K497K921L069L235L193K878K657K598K273
57739B03490J580J081J112J298J310J446J894K166J878J560J913K699L059K747
57725B29233K269J973J686J264Q43M17l34j553k894l830m078l671k910k318k343
$$ plain form
57831 251514 248371 245581 243173 241234 239949 239417 239459 239755 240185 240863 241771 242606 243226 244124 246089 249265 252774
57814 252774 255546 257458 259265 261318 262757 262360 260001 256728 253464 250204 246654 242990 239505 235961
57800 235961 231905 227415 222969 218738 214566 210596 207313 204852 202772 200611 198289 195914 193641 191810
57786 191810 190684 189903 188734 187091 185828 185683 186378 187174 187866 188743 189861 190949 191995 193345 195072 196605
57770 196605 197252 197008 196698 197202 198500 199532 199160 197255 194672 192269 190191 188077 185599 182753 179970
57755 179970 177990 177250 177279 177154 176699 176777 178169 180666 183587 186656 189891 193084 195962 198619 201217 203490
57739 203490 205070 206151 207263 208561 209871 211317 213211 215377 217255 218815 220728 223427 226486 229233
57725 229233 231502 233475 235161 236425 237268 237685 237351 235798 232904 229074 224996 221325 218415 216097 213754
57710B13754k941l550l636l233k888l052l531l634l016k186j932k259k365j801
57696A73730j113j005j254r86J17J437K226K356K231K252K483K639K364J713J288
57681A90478J748L072M555N482N739N808O431Q193J1145J4710J8150K1233K4344
57668C21088K7915L1780L5130L6927L6259L2412K4806J3211j562j7204l0567l9289
57656D70906m2970m2699l9774l5105k9615k4436k0285j6992j3945j0938q316o396
57644A79435n059l985l039k236j507p45l9L67M03K55l7p08j719k309j705k30Q31
57627A57973O82j66q26j214j725k240k208j655j274j425j737j935k345l182l900
57612A32823l879l345k999k925k575j763j001o72m84j4N68P24L35j48k55n5o1
$$ plain form
57710 213754 210813 207263 203627 200394 197506 194454 190923 187289 184273 182087 180155 177896 175531 173730
57696 173730 172617 171612 170358 169372 169489 170926 173152 175508 177739 179991 182474 185113 187477 189190 190478
57681 190478 192226 195298 199853 205335 211074 216882 223313 231506 242651 257361 275511 296744 321088
57668 321088 349003 380783 415913 452840 489099 521511 546317 559528 557966 540762 510195 470906
57656 470906 427936 385237 345463 310358 280743 256307 236022 219030 205085 194147 185831 179435
57644 179435 174376 170391 167352 165116 163609 162864 162825 163192 163595 163850 163813 163105 161386 159077 157372 157142 157973
57627 157973 158655 158489 157663 156449 154724 152484 150276 148621 147347 145922 144185 142250 139905 136723 132823
57612 132823 128944 125599 122600 119675 117100 115337 114336 113664 113180 113166 113734 114458 114793 114645 114390 114335 114274
57595A14274o55j621k359k545k411k231j847j138o52j071k057k427j743r94j146
57580H9377j739j690r90o05q91j119p27j63j20o28j273j831k284k541k511k226
57564F8039j717j047n99q46j628k170k029j617j414j209n72L07Q46Q53N87K97
57548E6081R8J68M94O52K81m03r63j370j766j804r97L58J233J077L73r0o1J87
57530E3548L16J13l93q87j067j038j077j021l76Q31J750J606O16k69m25r6Q6r5
57512E2122k25Q8N57M98j91p88p50m88p05j342j786j844j872k027k075j901j601
57495C5670j119m48j04o56j779k481k434k261k341k218j516o65j90N4L47M46N4
57478A8359n18o91l61J57N73O38J60o67j292j526j710j901j588p25k66r31k030
$$ plain form
57595 114274 113619 111998 109639 107094 104683 102452 100605 99467 98815 97744 95687 93260 91517 90523 89377
57580 89377 87638 85948 84958 84353 83462 82343 81616 81453 81333 80705 79432 77601 75317 72776 70265 68039
57564 68039 66322 65275 64676 63830 62202 60032 58003 56386 54972 53763 53191 53498 54344 55197 55784 56081
57548 56081 56179 56347 56841 57493 57774 57371 56408 55038 53272 51468 50471 50829 52062 53139 53512 53422 53361 53548
57530 53548 53864 53977 53584 52697 51630 50592 49515 48494 48118 48949 50699 52305 52921 52652 52227 52131 52217 52122
57512 52122 51897 51985 52542 53040 52849 52061 51311 50823 50118 48776 46990 45146 43274 41247 39172 37271 35670
57495 35670 34551 34103 33999 33343 31564 29083 26649 24388 22047 19829 18313 17648 17458 17512 17859 18305 18359
57478 18359 17841 17150 16789 16946 17519 18157 18317 17650 16358 14832 13122 11221 9633 8908 8642 7711 5681
57461E681k397A287c85j687j544j064o79n74m79l48m62p77r00q71j132j626j629
57444a4157q28J35M78J32m72r49j043o46l5L36M25N45O60L23m09p81m08N7j01
57425a6738n54m61L04J075J339J137O33r0q02j195j323j557j972k160j769j002
57409b5135l92k35m07o40q34j049j277j390j380j524k026k507k249j171j57j28
57393d2501r13j484j218m46K37O87R94J022O58L27N84J215J273L48o88p03J66
57376d0442P14L50j63R7Q64J119M64n64j341j760j954k019k045k085j943j419
57360e2127p87o45j140j717j846j604j369j286j247j100p35j73K42R3n77j262
57344f7280j697k073k428k337j660j010r56j176j049p34q61j347j405q29m54j008
$$ plain form
57461 5681 3284 1287 -385 -2072 -3616 -4680 -5359 -5933 -6412 -6760 -7222 -7999 -8899 -9770 -10902 -12528 -14157
57444 -14157 -14985 -14850 -14372 -14240 -14712 -15661 -16704 -17350 -17385 -17049 -16624 -16079 -15419 -15096 -15505 -16286 -16694 -16637 -16738
57425 -16738 -17292 -17753 -17449 -16374 -15035 -13898 -13265 -13355 -14157 -15352 -16675 -18232 -20204 -22364 -24133 -25135
57409 -25135 -25527 -25762 -26169 -26809 -27643 -28692 -29969 -31359 -32739 -34263 -36289 -38796 -41045 -42216 -42373 -42501
57393 -42501 -43414 -44898 -46116 -46562 -46325 -45638 -44644 -43622 -42964 -42637 -42053 -40838 -39565 -39217 -39905 -40608 -40442
57376 -40442 -39728 -39378 -39541 -39444 -38580 -37461 -36997 -37561 -38902 -40662 -42616 -44635 -46680 -48765 -50708 -52127
57360 -52127 -52914 -53559 -54699 -56416 -58262 -59866 -61235 -62521 -63768 -64868 -65603 -65776 -65534 -65441 -66018 -67280
57344 -67280 -68977 -71050 -73478 -75815 -77475 -78485 -79441 -80617 -81666 -82400 -83261 -84608 -86013 -86842 -87296 -88304
57328h8304k144k914k805k036j203r34j455k282k654k494k523l167l851l835l251
57313a25852k812k794k894k891k853k760k505k281k409k728k685k137j622j627
57299a60850k002k326k455k469k411k297k145j814j179n62n66j131j291m07Q00
57284a83105J060K18o88r24q35j003j360j619j959k723l670m120l819l277l235
57269b11059m063n566p130q091q250q042p975p968p541o645n874n691n788n501
57255c05184m692l875l542l634l729l514l063k778l138m270n725o789p127o953
57241c68013o601o166n724n543n723n896n691n364n503o068o325n918n443n617
57227d49595o293o809o966p059p128o948o700p019q020q898q873q170p621p591
$$ plain form
57328 -88304 -90448 -93362 -96167 -98203 -99406 -100340 -101795 -104077 -106731 -109225 -111748 -114915 -118766 -122601 -125852
57313 -125852 -128664 -131458 -134352 -137243 -140096 -142856 -145361 -147642 -150051 -152779 -155464 -157601 -159223 -160850
57299 -160850 -162852 -165178 -167633 -170102 -172513 -174810 -176955 -178769 -179948 -180510 -181076 -182207 -183498 -183905 -183105
57284 -183105 -182045 -181827 -182515 -183439 -184274 -185277 -186637 -188256 -190215 -192938 -196608 -200728 -204547 -207824 -211059
57269 -211059 -215122 -220688 -227818 -235909 -244159 -252201 -260176 -268144 -275685 -282330 -288204 -293895 -299683 -305184
57255 -305184 -309876 -313751 -317293 -320927 -324656 -328170 -331233 -334011 -337149 -341419 -347144 -353933 -361060 -368013
57241 -368013 -374614 -380780 -386504 -392047 -397770 -403666 -409357 -414721 -420224 -426292 -432617 -438535 -443978 -449595
57227 -449595 -455888 -462697 -469663 -476722 -483850 -490798 -497498 -504517 -512537 -521435 -530308 -538478 -546099 -553690
57213e53690p747p789p834q104q641r416j0409j1404j1999j2067j1947j1959j1933
57200f84939j1593j1274j1726j3100j4510j4944j4373j3620j3354j3615j4215
57189h31263j5095j6089j6774j6869j6585j6310j6134j5855j5392j4953j4835
57178a006154j5201j5950j6756j7336j7801j8498j9372j9733j8991j7430j5923
57167a199145j4921j4061j2853j1461j0642j0994j2340j3872j4916j5534j6312
57156a347051j7648j9451k1497k3653k5764k7721k9800l2452l5461l7794l8649
57145a656941l8276l7339l5983l4185l2704l2881l5589m1031m9554o1850p8061
57134b134394r7098j16991j35671j51554j63998j73394j80603j86284j91107j96409
$$ plain form
57213 -553690 -561437 -569226 -577060 -585164 -593805 -603221 -613630 -625034 -637033 -649100 -661047 -673006 -684939
57200 -684939 -696532 -707806 -719532 -732632 -747142 -762086 -776459 -790079 -803433 -817048 -831263
57189 -831263 -846358 -862447 -879221 -896090 -912675 -928985 -945119 -960974 -976366 -991319 -1006154
57178 -1006154 -1021355 -1037305 -1054061 -1071397 -1089198 -1107696 -1127068 -1146801 -1165792 -1183222 -1199145
57167 -1199145 -1214066 -1228127 -1240980 -1252441 -1263083 -1274077 -1286417 -1300289 -1315205 -1330739 -1347051
57156 -1347051 -1364699 -1384150 -1405647 -1429300 -1455064 -1482785 -1512585 -1545037 -1580498 -1618292 -1656941
57145 -1656941 -1695217 -1732556 -1768539 -1802724 -1835428 -1868309 -1903898 -1944929 -1994483 -2056333 -2134394
57134 -2134394 -2231492 -2348483 -2484154 -2635708 -2799706 -2973100 -3153703 -3339987 -3531094 -3727503
57124c727503k03897k14586k28343k44629k63209k84124l07439l33363l62378
57115f169471l95204m32794m76193n26078n82479o45415p15919p96341q89794
57106a1629688r99573j129040j282051j463985j682843j949229k275333k674661
57098b5086403l162812l757209m474622n328206o325161p463159q725348j0077663
57090g4400583j1471096j2847155j4146286j5321711j6353032j7242853j7990021
57083a79772737j8560210j8878670j8838316j8295764j7059126j4914515j1720660
57076b98039998p526340k620063K536683P454951J1756330J5236265J7842104
57069b53360068J9605228K0582638K0839039K0458214J9552184J8252639J6694123
$$ plain form
57124 -3727503 -3931400 -4145986 -4374329 -4618958 -4882167 -5166291 -5473730 -5807093 -6169471
57115 -6169471 -6564675 -6997469 -7473662 -7999740 -8582219 -9227634 -9943553 -10739894 -11629688
57106 -11629688 -12629261 -13758301 -15040352 -16504337 -18187180 -20136409 -22411742 -25086403
57098 -25086403 -28249215 -32006424 -36481046 -41809252 -48134413 -55597572 -64322920 -74400583
57090 -74400583 -85871679 -98718834 -112865120 -128186831 -144539863 -161782716 -179772737
57083 -179772737 -198332947 -217211617 -236049933 -254345697 -271404823 -286319338 -298039998
57076 -298039998 -305566338 -308186401 -305649718 -298194767 -286438437 -271202172 -253360068
57069 -253360068 -233754840 -213172202 -192333163 -171874949 -152322765 -134070126 -117376003
57062a17376003J5001510J3281991J1618263J0065746Q656625P406279O317050
57055d5028539N380817M583441L909099L341678K865038K464563K128474J846737
57047a8508692J609639J408599J237401J091469R66476Q58705P65837O86224O17886
57038i266456N59076N08974M66698M30268L97704L68573L43368L21794L02744
57029e567257K85566K70168K56045K42150K27590K11777J94324J75614J57165
57020c546858J40499J25914J13146J02716R5547R1289Q8211Q4924Q1489P8668
57010b544455P6712P5118P3173P0652O8106O6276O4981O3017N9666N5780N2783
56999a818191N0975M9565M8010M6513M5241M3897M2206M0275L8452L7207L6947
$$ plain form
57062 -117376003 -102374493 -89092502 -77474239 -67408493 -58751868 -51345589 -45028539
57055 -45028539 -39647722 -35064281 -31155182 -27813504 -24948466 -22483903 -20355429 -18508692
57047 -18508692 -16899053 -15490454 -14253053 -13161584 -12195108 -11336403 -10570566 -9884342 -9266456
57038 -9266456 -8707380 -8198406 -7731708 -7301440 -6903736 -6535163 -6191795 -5870001 -5567257
57029 -5567257 -5281691 -5011523 -4755478 -4513328 -4285738 -4073961 -3879637 -3704023 -3546858
57020 -3546858 -3406359 -3280445 -3167299 -3064583 -2969036 -2877747 -2789536 -2704612 -2623123 -2544455
57010 -2544455 -2467743 -2392625 -2319452 -2248800 -2180694 -2114418 -2049437 -1986420 -1926754 -1870974 -1818191
56999 -1818191 -1767216 -1717651 -1669641 -1623128 -1577887 -1533990 -1491784 -1451509 -1413057 -1375850 -1338903
56988a338903L7542L8190L8299L8237L8599L9002L8393L6381L3516L0263K6558
56977i43923K2538J8920J6331J4805J4189J4506J5534J6564J7014J7060J7281
56966g59181J7906J8721J9610K0768K2299K3835K4814K5124K5246K5575K5730
56955e09553K4865K2523J8891J4361R310M477Q38j168j968k114j647m65J212L097
56941d17341N132P126Q631R735J1384J4205J7380J9549K0616K1722K3406K4658
56929b33797K4059K1177J6494J0573L886k826q527j2440j4447j4900j4108j2201
56917b37057r560p057n420m373l002j051O55J341J205Q98O95O96J261K462L522
56902b54785L660L253L432M551N879O782P510Q580J0008J1367J2338J3062J4117
$$ plain form
56988 -1338903 -1301361 -1263171 -1224872 -1186635 -1148036 -1109034 -1070641 -1034260 -1000744 -970481 -943923
56977 -943923 -921385 -902465 -886134 -871329 -857140 -842634 -827100 -810536 -793522 -776462 -759181
56966 -759181 -741275 -722554 -702944 -682176 -659877 -636042 -611228 -586104 -560858 -535283 -509553
56955 -509553 -484688 -462165 -443274 -428913 -419603 -415126 -414288 -415456 -417424 -419538 -421185 -421650 -420438 -417341
56941 -417341 -412209 -405083 -396452 -386717 -375333 -361128 -343748 -324199 -303583 -281861 -258455 -233797
56929 -233797 -209738 -188561 -172067 -161494 -157608 -160434 -168961 -181401 -195848 -210748 -224856 -237057
56917 -237057 -246617 -253674 -259094 -263467 -266469 -267520 -266865 -265524 -264319 -263421 -262726 -262030 -260769 -258307 -254785
56902 -254785 -251125 -247872 -244440 -239889 -234010 -227228 -219718 -211138 -201130 -189763 -177425 -164363 -150246
56889a50246J5993J8373K0178K0682K0244J9429a7490b777G423N564J658j580
56877A3065m197C216b418m708l611k472j131J85J144K024L608a027H903J3633
56863B2536J6932J9670K1884K3606K4741K4988K3667J9840J3038M113m910j2191
56851A97914j7119j9939k0765j9442j6201j1869p383l375n8K877O191J0558J5969
56838A17358K1878K7683L2841L6856L9611M1435M2190M0400L4052K2563P679p565
56826D56981k0486k9609l4718l6463l5681l2952k8785k3933j9058j4223r156l931
56814A67986J062N769J0497J5312J9824K3665K6715K8795K9449K8048K3760J5816
56802C96698M479q189j9275k6941l1106l2435l1423k8644k5070k1526j8122j4511
$$ plain form
56889 -150246 -134253 -115880 -95702 -75020 -54776 -35347 -17490 -2777 7423 12987 14645 13065
56877 13065 8868 3216 -2418 -7126 -10737 -13209 -14340 -14155 -13011 -10987 -7379 -1027 8903 22536
56863 22536 39468 59138 81022 104628 129369 154357 178024 197864 210902 215015 210105 197914
56851 197914 180795 160856 140091 120649 104448 92579 85196 81821 81763 84640 90831 101389 117358
56838 117358 139236 166919 199760 236616 276227 317662 359852 400252 434304 456867 464546 456981
56826 456981 436495 406886 372168 335705 300024 267072 238287 214354 195296 181073 171917 167986
56814 167986 169048 174817 185314 200626 220450 244115 270830 299625 329074 357122 380882 396698
56802 396698 401177 392988 373713 346772 315666 283231 251808 223164 198094 176568 158446 143935
56790A43935j0524o378k546N85L107N658Q658J1675J3915J5263J6059J5981J3956
56777B29344R483L381l021q885j3818j7491j9743k0624k0066j8050j5278j3027
56765I2205j1809j0816r149p089n520m612l833k956k269j910j707j660j908k156
56751B4811j758o92J05k08j267j882j427m58J33K13L12O93R92R20P67R48J355
56734B3557J578J475J086K98p67j238k00J879L237K734J145R6Q8K46k17r16q45
56717C3236L42J879K665K353J545J005R23J008J032R81Q46O83P55J247J861K127
56701E4488K010J869J845J737J580J709K131K287J754Q48K04K3kj74m58n95l27
56684G0929L97J328K016K050J288M7r20r12JR79J344J214J001O73O8m87n05j53
$$ plain form
56790 143935 133411 127033 124487 125072 128179 133837 142495 154170 168085 183348 199407 215388 229344
56777 229344 238827 242208 239187 230302 216484 198993 179250 158626 138560 120510 105232 92205
56765 92205 80396 69580 60431 53342 47822 43210 39377 36421 34152 32242 30535 28875 26967 24811
56751 24811 23053 22361 22466 22258 20991 19109 17682 17224 17357 17570 17882 18575 19567 20487 21254 22202 23557
56734 23557 25135 26610 27696 27994 27227 25989 25789 27668 30905 33639 34784 34880 34968 35214 34997 34081 33236
56717 33236 33578 35457 38122 40475 42020 43025 43948 44956 45988 46969 47815 48498 49253 50500 52361 54488
56701 54488 56498 58367 60212 61949 63529 65238 67369 69656 71410 72258 72462 72485 72483 72309 71851 71256 70929
56684 70929 71326 72654 74670 76720 78008 78055 77135 76223 76224 77203 78547 79761 80762 81435 81503 81016 80511 80358
56666H0358lq1O9M10K99m47j109j026m51k7Q6J59K85K73O1q3J52P34J168J000
56646H1827M28J98O46J202J177O02q5p49j350j452p61J88O41O68Q27J064R65Q20
56628H6856J246J889J688O05j76l9K62l6o41r92j071r28l63L91O20K39N9M12N52
56609I0573N8l38j11j4p83j688j556o27j19m62r75j028n48L75J456K059J818J252
56591H9342J030R74N25j66m74l38k14j21L40J067J382J026N34M73P84J021Q71
56574I8056M26J79P09K038L428M087L850L006J865Q84P49J760L334M599N317N803
56558A40090O270O682O972O963O251M650K584O82p91j843k412k495k329k143j991
56543A67140k012k373k773k541j560n75j80j54j69l87q37r18k71M18K59o35j440
$$ plain form
56666 80358 80355 80274 80343 80753 81052 80605 79496 78470 78019 77992 78078 78237 78522 78795 78856 78773 78925 79659 80827 81827
56646 81827 82255 82453 83099 84301 85478 86080 85995 85246 83896 82444 81683 81871 82512 83180 84007 85071 86036 86856
56628 86856 88102 89991 91679 92284 92108 92069 92331 92295 91654 90662 89591 88663 88300 88691 89311 89550 89609 90021 90573
56609 90573 90631 90293 90182 90168 89385 87697 86141 85514 85395 84933 83958 82930 82382 82757 84213 86272 88090 89342
56591 89342 90372 91346 91871 91705 91231 90893 90679 90558 90898 91965 93347 94373 94907 95380 96164 97185 98056
56574 98056 98482 98661 99370 101408 104836 108923 112773 115779 117644 118528 119277 121037 124371 128970 134287 140090
56558 140090 146360 153042 160014 166977 173228 177878 180462 181144 180353 178510 176098 173603 171274 169131 167140
56543 167140 165128 162755 159982 157441 155881 155306 155126 154972 154803 154416 153579 152661 152390 152808 153067 152432 150992
56526A50992j693j427p55M9M97N02N92R27Q39j01j203j632j592j647j702j507
56510A41139j493j968k186j366q7O25R19J500J953J307m2p30o22r11j856k171
56494A34011j143K23P49N28P5o20j439j566n69O66R79M45Q9M67J217J692J530
56477A37334P79j56p80r34q26o21k65K04N38N51K63j72m61k44M44R83R09N63N07
56458A38616N85K97j67j30L83N53pp24r48p04k55L64J137J799K111K075J786J350
56440A48121R86Q99J024J149J186J106Q51N80O10P68L46q12j740j565p30k26j39
56423A52414P8L50J09n69j026j036q51m71J48M79J18k26L86J464J634P46L4J89
56405A53970O14P56Q04P52J57q35j380j224r81q22k22O79Q30k0o79k05P85J267
$$ plain form
56526 150992 149299 147872 147117 147166 147663 148165 148757 149684 150523 150422 149219 147587 145995 144348 142646 141139
56510 141139 139646 137678 135492 134126 134039 134664 135583 137083 139036 140343 140301 139571 138949 138038 136182 134011
56494 134011 132868 133091 133840 134368 134443 133823 132384 130818 130249 130915 131894 132339 132428 132895 134112 135804 137334
56477 137334 138113 137957 137177 136243 135417 134796 134531 134735 135273 135824 136087 135915 135454 135210 135654 136637 137546 138109 138616
56458 138616 139201 139498 139331 139201 139584 140137 140130 139406 138458 137754 137499 137863 139000 140799 142910 144985 146771 148121
56440 148121 149107 150006 151030 152179 153365 154471 155322 155902 156512 157280 157626 156814 155074 153509 152779 152553 152414
56423 152414 152492 152842 152951 152382 151356 150320 149469 148998 149146 149625 149743 149517 149903 151367 153001 153747 153781 153970
56405 153970 154584 155340 156144 156896 157053 156218 154838 153614 152633 151811 151589 152268 153098 153078 152399 152194 152979 154246
56387A54246J155Q45L94r9j76J72K60j22j37P35J717J878J494J388J568J389O55
56370A67362j43l92K38J516K544K457J544R27R71Q87K86%P44J897K448K290J880
56353A87456J288N27J12M10R00Q85N65O34J221J840K180K254K064J637J212J039
56337B06224J137J414J721J757J417J275K040L407M268M227M017M088L840K823
56323B43655J789J733K497L004K498J125l43j053q44n14p90j101l76J083J796
56308B54159J408J258K153L077K992K548K821L563L912L960M309M805M885M658
56294C00508M539M353L860L618M257N343O016O316O907P766Q234Q169Q157Q635
56280C86678R497J0502J1424J1947J1900J1475J0984J0665J0931J2210J4210J5996
$$ plain form
56387 154246 155401 156246 156640 156541 156365 156537 156797 156675 156538 157273 158990 160868 162362 163750 165318 166707 167362
56370 167362 167219 166827 167065 168581 171125 173582 175126 176053 177024 177911 178197 178197 178941 180838 183286 185576 187456
56353 187456 188744 189271 189383 189793 190693 191578 192143 192777 193998 195838 198018 200272 202336 203973 205185 206224
56337 206224 207361 208775 210496 212253 213670 214945 216985 220392 224660 228887 232904 236992 240832 243655
56323 243655 245444 247177 249674 252678 255176 256301 255958 254905 254061 253547 252757 251656 251280 252363 254159
56308 254159 255567 256825 258978 262055 265047 267595 270416 273979 277891 281851 286160 290965 295850 300508
56294 300508 305047 309400 313260 316878 321135 326478 332494 338810 345717 353483 361717 369886 378043 386678
56280 386678 396175 406677 418101 430048 441948 453423 464407 475072 486003 498213 512423 528419
56268E28419J7157J8214J9589K1042K2562K4845K8190L1788L4934L8063M1914
56257H26717M6397N1251N6994O4284P2846Q1924R1319J01328J12123J23772J36211
56246A765166J48627J59661J68827J76812J83725J88092J88351J84362J76509
56237C340132J64384J47516J26400J01691P3284M1497Q326k3786n3745q1303j05658
56226C738738j25942j42343j55301j64254j68617j69417j68354j65640j60317
56217B318553j52452j43502j34579j25718j16784j07964r9380r1145q3681p7132
56207A186216p0868o4355n8057n2537m7459m2524l8539l6119l4095l0886k6883
56196F83894k3781k1876j9904j7394j5349j4367j3715j2666j1316r821q080o505
$$ plain form
56268 528419 545576 563790 583379 604421 626983 651828 680018 711806 746740 784803 826717
56257 826717 873114 924365 981359 1045643 1118489 1200413 1291732 1393060 1505183 1628955 1765166
56246 1765166 1913793 2073454 2242281 2419093 2602818 2790910 2979261 3163623 3340132
56237 3340132 3504516 3652032 3778432 3880123 3953407 3994904 4003230 3979444 3925699 3844396 3738738
56226 3738738 3612796 3470453 3315152 3150898 2982281 2812864 2644510 2478870 2318553
56217 2318553 2166101 2022599 1888020 1762302 1645518 1537554 1438174 1347029 1263348 1186216
56207 1186216 1115348 1050993 992936 940399 892940 850416 811877 775758 741663 710777 683894
56196 683894 660113 638237 618333 600939 585590 571223 557508 544842 533526 523705 515625 509120
56184E09120n921o277o478n843m822m039l500l045k775k710k510j858p51M82J228
56169D60301J036L14J17P75J493J749K141L157M133M524N051O359P501P321O517
56154E12489O725Q089R340R887J0225J0632J1039J1892J3830J6624J9780K3721
56142F64273K9016L4872L9889M3939M7798N1307N3389N3627N2306M9300M4443
56131A164159L8741L3608K9294K5421K2507K1054J9673J6191J0574M831J08m223
56119A381938q570j2303j5298j8588k2991k8412l4546m0902m6160m9024m9709
56108A055435m9271m7649m4021l8834l3702k9260k4839k0211j6050j2611r595
56097G29392p296o259n855m795k995j417k82R43K061K424K388K740L086K674K320
$$ plain form
56184 509120 503199 496922 490444 484601 479779 475740 472240 469195 466420 463710 461200 459342 458591 459073 460301
56169 460301 461337 461651 461768 462543 464036 465785 467926 471083 475216 479740 484791 491150 498651 505972 512489
56154 512489 519214 527303 536643 546530 556755 567387 578426 590318 604148 620772 640552 664273
56142 664273 693289 728161 768050 811989 859787 911094 964483 1018110 1070416 1119716 1164159
56131 1164159 1202900 1236508 1265802 1291223 1313730 1334784 1354457 1370648 1381222 1386053 1386161 1381938
56119 1381938 1373368 1361065 1345767 1327179 1304188 1275776 1241230 1200328 1154168 1105144 1055435
56108 1055435 1006164 958515 914494 875660 841958 812698 787859 767648 751598 738987 729392
56097 729392 722096 715837 709982 705187 702192 700775 700493 701436 703497 705921 708309 711049 714135 716809 719129
56082G19129L406N333O264O032O017O474O420O110O945Q859J0231J0577J0933
56069H12730J1535J1586J1417J2235J3525J3432J1955J1192J1981J3015J3628
56058I48231J4682J6132J6518J5611J4997J5283J5237J4363J3771J3897J3766
56047A112488J3199J3252J3999J4307J4221J5000J6481J7216J7434J8853K1196
56036A287646K2163K1445K1409K3082K4743K5379K6188K7731K8852K9444L0975
56025A569057L3271L4203L3525L3661L5616L7600L8714M0343M2833M4445M4869
56014A988137M6036M8371N0129N1421N4626N9588O2993O4084O6246P1118P5929
56003B638678P8773Q1746Q6468R1232R5155J00462J08027J15193J20636J26756
$$ plain form
56082 719129 722535 727868 734132 740164 746181 752655 759075 765185 772130 780989 791220 801797 812730
56069 812730 824265 835851 847268 859503 873028 886460 898415 909607 921588 934603 948231
56058 948231 962913 979045 995563 1011174 1026171 1041454 1056691 1071054 1084825 1098722 1112488
56047 1112488 1125687 1138939 1152938 1167245 1181466 1196466 1212947 1230163 1247597 1266450 1287646
56036 1287646 1309809 1331254 1352663 1375745 1400488 1425867 1452055 1479786 1508638 1538082 1569057
56025 1569057 1602328 1636531 1670056 1703717 1739333 1776933 1815647 1855990 1898823 1943268 1988137
56014 1988137 2034173 2082544 2132673 2184094 2238720 2298308 2361301 2425385 2491631 2562749 2638678
56003 2638678 2717451 2799197 2885665 2976897 3072052 3172514 3280541 3395734 3516370 3643126
55993C643126J34703J41959J47621J54957J65819J77571J88573K01400K17453
55984E173182K33925K49474K67419K89813L14021L38598L66552L99376M34288
55975H066648M71048N14437N66221O22248O81715P51142Q34555R28870J034369
55966A4471253J160231J313719J494505J706888J966900K290128K685353L169944
55958C0258921L778929M549338N511570O709811Q212518J0076889J2299780J4799084
55950I6196840J7415807J9926537K2093990K3718083K4551266K4076290K1456329
55943B49435142J5966888P704287k090588j1496981j8826351k3271351k4940987
55936A92480059k4489810k2712916k0288940j7678643j5142914j2819791j0782280
$$ plain form
55993 3643126 3777829 3919788 4067409 4222366 4388185 4565756 4754329 4955729 5173182
55984 5173182 5407107 5656581 5924000 6213813 6527834 6866432 7232984 7632360 8066648
55975 8066648 8537696 9052133 9618354 10240602 10922317 11673459 12508014 13436884 14471253
55966 14471253 15631484 16945203 18439708 20146596 22113496 24403624 27088977 30258921
55958 30258921 34037850 38587188 44098758 50808569 59021087 69097976 81397756 96196840
55950 96196840 113612647 133539184 155633174 179351257 203902523 227978813 249435142
55943 249435142 265402030 273106317 271015729 259518748 240692397 217421046 192480059
55936 192480059 167990249 145277333 124988393 107309750 92166836 79347045 68564765
55929F8564765r050784p601427o395607n401645m588573l918856l360158k894650
55921B5353065k509052k185380j908406j672619j474314j304485j155475j026748
55913A2116586r18051q23586p38332o63535o00785n46499m97004m53194m15790
55904F459810l81547l48538l19762k97227k77494k57120k37634k21109k05666
55895C913713j89412j74371j62369j51183j38699j26988j18352j11002j02571
55886B638766r4351q8302q3031p6572p0233o6145o3660o1418o0401o1533o2819
55875A850301o2059o0237n9208n8208n5636n2190m9439m7036m4068m1379m0028
55864A280813l9037l6964l4224l1855k9680k7483k6153k5860k5026k2949k1349
$$ plain form
55929 68564765 59513981 51912554 45516947 40115302 35526729 31607873 28247715 25353065
55921 25353065 22844013 20658633 18750227 17077608 15603294 14298809 13143334 12116586
55913 12116586 11198535 10374949 9636617 8973082 8372297 7825798 7328794 6875600 6459810
55904 6459810 6078263 5729725 5409963 5112736 4835242 4578122 4340488 4119379 3913713
55895 3913713 3724301 3549930 3387561 3236378 3097679 2970691 2852339 2741337 2638766
55886 2638766 2544415 2456113 2373082 2296510 2226277 2160132 2096472 2035054 1974653 1913120 1850301
55875 1850301 1788242 1728005 1668797 1610589 1554953 1502763 1453324 1406288 1362220 1320841 1280813
55864 1280813 1241776 1204812 1170588 1138733 1109053 1081570 1055417 1029557 1004531 981582 960233
55853I60233k1513k2020k1244j9983j9490j9123j8062j7412j8202j9147j8663
55842G45374j7446j6879j6521j5395j4132j3709j3442j2385j1253j0935j0564
55831E92713r139p603p271p552p223o682o855p237p036o964p833q697q441p956
55817D86224q551r413q928p495o678o513n923n106n040n269m411k567j130m30
55803D08770M40J632K303K283K356K841L304L581L814L674K761J558Q30L87m35
55788D40099j509k264k821l566m099l849l305l498m590o047p708r508j0669j0417
55774C66249r131p686o059l661o65K106M271N813O324N342L077J3l689p503r989
55759C44812j0141q732p299o290n254m278l914m062m074l828l686l666l495l247
$$ plain form
55853 960233 938720 916700 895456 875473 855983 836860 818798 801386 783184 764037 745374
55842 745374 727928 711049 694528 679133 665001 651292 637850 625465 614212 603277 592713
55831 592713 583574 575971 568700 561148 553925 547243 540388 533151 526115 519151 511318 502621 494180 486224
55817 486224 477673 468260 459332 451837 445159 438646 432723 427617 422577 417308 412897 410330 409200 408770
55803 408770 409210 410842 413145 415428 417784 420625 423929 427510 431324 434998 437759 439317 440147 440534 440099
55788 440099 438590 436326 433505 429939 425840 421991 418686 415188 410598 404551 396843 387335 376666 366249
55774 366249 357118 349432 343373 339712 339047 341153 345424 351237 357561 362903 365980 365993 362304 354801 344812
55759 344812 334671 325939 318640 312350 307096 302818 298904 294842 290768 286940 283254 279588 276093 272846
55745B72846l073k734k061j457j267j236j231j707k706l288k911k446k708l007
55731B41014k432j636j818k659k935k629k778l525l951l782l720m009m059l601
55717A97480l057k520j567k28P62J001R75J445K729M449N588N129L164R91m12
55702B15929j363k404l178l313l483m410n430n414m557l965l864l555k847k195
55688A65951j687j124p89r22p60N66K371L096K510J839J791J917J920K135K465
55673A81279K169J149K32j47m47r40j183r60p27p75q09p14q37j157j034j80Q08
55656A75727J276J209R39P43R23J604K289K260J533P99L73k2m69o63o97j212k401
55639A84211l534l823l326k778k874l756m835n203m585l705l295l100k490j574
$$ plain form
55745 272846 269773 267039 264978 263521 262254 261018 259787 258080 255374 252086 249175 246729 244021 241014
55731 241014 238582 236946 235128 232469 229534 226905 224127 220602 216651 212869 209149 205140 201081 197480
55717 197480 194423 191903 190336 190108 190870 191871 192846 194291 197020 201469 207057 212186 215350 216341 215929
55702 215929 214566 212162 208984 205671 202188 197778 192348 186934 182377 178412 174548 170993 168146 165951
55688 165951 164264 163140 162351 161429 160669 161235 163606 166702 169212 171051 172842 174759 176679 178814 181279
55673 181279 183448 184597 184829 184682 184235 183295 182112 181152 180425 179650 178841 178127 177290 176133 175099 174919 175727
55656 175727 177003 178212 179151 179894 180817 182421 184710 186970 188503 189302 189675 189653 189184 188521 187824 186612 184211
55639 184211 180677 176854 173528 170750 167876 164120 159285 154082 149497 145792 142497 139397 136907 135333
55625A35333q54k48N54J052N06n90r09k26K96q6q44j413k001k619k568j680j020
55608A22683j424k114j768m86L43j19j220j804j461o78j42j26m51q67j328j792
55592A07246j982j662r80l05J56K94p8r05j622j692j291j009r93r15n74m1O52
55575I4299J419J897J851J637J647J583R67J74M2N59Q25L98j74l86m72p83j119
55558A04364j066n98k8K87J46l04n80m37k95o00j018q84l28j47n81r62p05N1Q45
55539I7160J400J558J295R15P78Q09O52K96L4o7r1J21P20J337J488J275J018M60
55521A11158p88k120k343j281j06P8p18j823k620k709k133j536j468j579j175
55506H8837m42k31o91j084r76o94n46m82n85j001j337j086o01n86p21o9J132J528
$$ plain form
55625 135333 134479 134231 134785 135837 136343 135753 134844 134618 134914 134828 133984 132571 130570 127951 125383 123703 122683
55608 122683 121259 119145 117377 116891 117234 117115 115895 114091 112630 111952 111810 111684 111233 110366 109038 107246
55592 107246 105264 103602 102622 102317 102473 102767 102689 101784 100162 98470 97179 96170 95177 94262 93688 93647 94299
55575 94299 95718 97615 99466 101103 102750 104333 105300 105474 105516 106075 106900 107298 107124 106738 106266 105483 104364
55558 104364 103298 102700 102672 102959 103105 102801 102221 101784 101489 100889 99871 98987 98659 98512 97931 96969 96264 96315 97160
55539 97160 98560 100118 101413 102328 103106 103915 104567 104863 104897 104830 104739 104860 105580 106917 108405 109680 110698 111158
55521 111158 110370 108250 105907 104626 104520 104598 103880 102057 99437 96728 94595 93059 91591 90012 88837
55506 88837 88395 88164 87473 86389 85413 84719 84173 83691 83106 82105 80768 79682 79081 78495 77774 77705 78837 80365
55488H0365O96k39m48l75l93o4N78M93n65j142j40J287J314J1j022r39k68L87
55470G9536R52J334J279Q33K58l49q88j045p51n02o51q05m71J22M57N56P19Q58
55452H1442O44Q2o12j302j731j481o01K45P05J124J609J510N81k25m1N14L18m78
55434H2303q24m91j54pL97Q98O17n80j565j384m54J29m8n43q59r89j211j523j435
55415G2277n14Q34J582J312P54O93R10P99M81L98K58n72j725j975r50K65N64Q1
55397G5472m11o48q25r36p61l59j8J74L87O84R50J118J188J026M39l85p94l16
55379G5985O86J262Q44k69j377j992j902j143j88K24n4k53K68J037J168P02M15
55362G5413N01M19Kk86l09m23m95P3J000J014k88j561j542p60m48o39m58K80R95
$$ plain form
55488 80365 81061 80822 80374 79999 79606 79542 80120 80613 80048 78906 78766 80053 81367 81378 80356 79417 79149 79536
55470 79536 80488 81822 83101 83934 84192 83843 82955 81910 81159 80657 80006 79201 78730 78852 79309 79865 80584 81442
55452 81442 82086 82168 81556 80254 78523 77042 76441 76686 77391 78515 80124 81634 82215 81990 81949 82463 82781 82303
55434 82303 81479 80988 80834 80827 81224 82122 82739 82159 80594 79210 78756 78885 78837 78294 77435 76446 75235 73712 72277
55415 72277 71763 72597 74179 75491 76245 76938 77848 78647 79128 79526 79784 79212 77487 75512 74562 74827 75391 75472
55397 75472 75061 74413 73588 72652 71891 71532 71514 71688 72075 72759 73709 74827 76015 77041 77480 77095 76301 75985
55379 75985 76671 77933 78777 78508 77131 75139 73237 72094 71906 72130 72076 71823 72091 73128 74296 74998 75413
55362 75413 75914 76333 76335 76049 75740 75317 74822 74895 75895 76909 76621 75060 73518 72758 72310 71671 71213 71493 72488
55343G2488J417J701J653R36p5n83m86l87n71o94n18k37k9J05J26J06L63R52J190
55324G7457L94j027j925j739r09m8N72Q15O15K31N4J14J58J09j4l35p59p26M9
55305G3086Q72Q48J53k77j24J52L12N58P47M84M7K17Q89R75J00o04q5J133J795
55286H1278J549R76M17k73r52j079n37J2j10p50j108o61K59Q05M89l61j021j090
55268G7843o96j64L15O68Q04N60j25r12j057j38J212J766J118J28k92j93k5K55
55250H1067P32Q20j6j135j339n74K2k32q04r99q16m70M3N34N06n1l74KM94L27
55230G7737l08n57j41L89M74J73n9M1K88K40k76q78j005o11j87j04j97j33R1K44
55210G5221K25J15mj61m11o51n77O1R98J512J151K61m55o90n79k30L08P77Q70
$$ plain form
55343 72488 73905 75606 77259 78195 78120 77537 77051 76664 76093 75399 74881 74644 74615 74720 74846 74952 75315 76267 77457
55324 77457 77851 76824 74899 73160 72251 72203 72775 73590 74205 74436 74490 74604 74762 74871 74857 74522 73763 73037 73086
55305 73086 73958 74806 74959 74682 74558 74710 75022 75580 76327 76811 76858 77075 77964 78939 79039 78435 78350 79483 81278
55286 81278 82827 83803 84220 83947 82995 81916 81379 81391 81281 80531 79423 78762 79021 79826 80315 79954 78933 77843
55268 77843 77147 76983 77298 77966 78770 79330 79205 78293 77236 77098 78310 80076 81194 81322 81030 80837 80812 81067
55250 81067 81799 82619 82603 81468 80129 79555 79577 79345 78541 77542 76726 76256 76299 76833 77339 77288 76914 76916 77410 77737
55230 77737 77429 76872 76731 77120 77594 77767 77708 77749 78037 78277 78001 77123 76118 75507 75320 75216 75019 74886 74977 75221
55210 75221 75446 75561 75557 75396 74985 74334 73757 73818 74816 76328 77479 77740 77285 76595 76016 75786 76094 76871 77741
55191G7741O22K89j7k03J9O80J170Q93K06pM14Q03P54N38L10k11r89j376r90k86
55171H0360J54L15L71J37n17j129j065k48Q54J757K183K030J456R19Q15J088J261
55154I0741Q10l47j541j811r98j45k79j047j286p36k26j85p0M36P66N41L11N13
55136H5447N90k6p73p64k20m0l56n04k65j18k54k99j02k4j94k00J51L99J35k67
55116H2316j14O22J198R64R0o59p21k68R4M2j72j28K76Q10J185J274J168J089
55098H9066J088R54N69K49K81K89l08j113r22N70J984J950R06L86Q66J342J067
55081I9224N91P43J394J791J678J382J056L47r66k367k935k205o66O81J155Q36
55065A01739K33k19m13m95o38q03o81q7O72J025P93L42m0m66j030j388j114l38
$$ plain form
55191 77741 78363 78652 78635 78432 78451 79131 80301 81194 81400 81393 81807 82610 83364 83902 84212 84001 83012 81636 80646 80360
55171 80360 80514 80829 81200 81337 80820 79691 78626 78378 79232 80989 83172 85202 86658 87577 88392 89480 90741
55154 90741 91551 91204 89663 87852 86854 86709 86430 85383 84097 83361 83135 82950 82880 83316 84082 84623 84934 85447
55136 85447 86037 86011 85238 84474 84254 84214 83858 83354 83089 82971 82717 82418 82316 82292 82098 81898 82049 82448 82583 82316
55116 82316 82202 82824 84022 84986 85076 84417 83696 83428 83522 83564 83392 83264 83540 84350 85535 86809 87977 89066
55098 89066 90154 91108 91677 91926 92207 92496 92188 91075 90153 90723 92707 94657 95563 95949 96815 98157 99224
55081 99224 99815 100558 101952 103743 105421 106803 107859 108206 107240 104873 101938 99733 99067 99748 100903 101739
55065 101739 101972 101753 101340 100845 100207 99404 98723 98636 99308 100333 101126 101468 101428 100962 99932 98544 97430 97092
55047I7092L43M66L0o36j158j349j326j287j136n72L15Q92P17J23k69m06p27j338
55029H9774j724j353l41O43J006P34L23K25M24O55R02J293J573J203J91o78p68
55012I4082l68j76l35n01n17m60k26L54J051J412J414J410J462J233O36O7j89
54995A00349l52p10j088j077n81O9M45L34j30n09l86J67N82L75l03q40q57n99
54977I4889n30o92o29r1M55L18m65j002n87M92J350J479J061N34J63RJ7P8J42
54958I6991J81J21q7k51p7L58N50K27k49l86j73J34M56P72Q66O55M84N74M55l45
54938A01256j323j540j029p84j146j236l81P61J181Q91N77M36K50K59R77K189
54922A01338L024L153L138L424L774L974M419N431O510O823O122M759L126J562
$$ plain form
55047 97092 97435 97901 97931 97295 96137 94788 93462 92175 91039 90467 90782 91674 92391 92514 92245 91839 91112 89774
55029 89774 88050 86697 86356 86999 88005 88739 89062 89287 89711 90366 91268 92561 94134 95337 95528 94850 94082
55012 94082 93714 93538 93203 92702 92185 91725 91499 91853 92904 94316 95730 97140 98602 99835 100471 100538 100349
54995 100349 99997 99287 98199 97122 96541 96610 97055 97389 97259 96750 96364 96531 97113 97488 97185 96345 95488 94889
54977 94889 94359 93667 93038 92947 93402 93720 93255 92253 91666 92158 93508 94987 96048 96582 96745 96754 96771 96849 96991
54958 96991 97172 97293 97206 96955 96878 97236 97786 98013 97764 97378 97205 97339 97795 98567 99433 100088 100572 101146 101601 101256
54938 101256 99933 98393 97364 96580 95434 94198 93817 94578 95759 96650 97227 97663 97913 98172 99149 101338
54922 101338 104362 107515 110653 114077 117851 121825 126244 131675 138185 145008 151130 155889 159015 160577
54908A60577M05l93j438l048m566n183n162n368n777n482m333l337l067k758j675
54893A09395l83K65N37J146J747J384J22r36j179r71o06P4R52J506J623J686J759
54876A18121J683K007L624O084P523O895N209L932L189K429J796J634J314j57
54862A65283k607m844o111o527o302n473m430l787l695l794l791l585l029k210
54848A05098j705j849j998j332j72L95J17k37k68m93j165j585j155l54o9l61n78
54831I2289l01K45O38O69L45j79p09r94p63L0Q63R02K9p28l41Q66J677J663J539
54812I7740J807J946J350L24l88n49m54l44k66j98o8J57K77Q0r6L40J184J360
54794A04202L73p84q49L7O83N89M33P75J165Q87M0o07n69o0L97M88K64J9N9M21
$$ plain form
54908 160577 160982 160589 159151 156103 151537 146354 141192 135824 130047 124565 120232 116895 113828 111070 109395
54893 109395 109012 109277 109814 110960 112707 114091 114213 113277 112098 111127 110521 110595 111547 113053 114676 116362 118121
54876 118121 119804 121811 125435 131519 139042 145937 151146 155078 158267 160696 162492 164126 165440 165283
54862 165283 162676 157832 151721 145194 138892 133419 128989 125202 121507 117713 113922 110337 107308 105098
54848 105098 103393 101544 99546 98214 98042 98437 98554 98317 98049 97556 96391 94806 93651 93297 93228 92867 92289
54831 92289 91988 92233 92871 93540 93885 93706 92997 92003 91240 91270 92133 93035 93064 92336 91995 92861 94538 96201 97740
54812 97740 99547 101493 102843 103167 102779 102230 101776 101432 101166 100968 100900 101057 101334 101414 101318 101658 102842 104202
54794 104202 104575 103791 102942 102979 103662 104251 104684 105459 106624 107511 107551 106944 106375 106315 106712 107200 107464 107483 107542 107963
54774A07963Q31J006R76R64R79Q26O09Q70J897L121L725L781M137N093N845N676
54758A48299M985M543M149K979R37j131k584l522m070l983l342k928l324m110
54744A36898m384l834k927k247k019k098k125j834j384j190j289j195n54L30R23
54729A11071J152J327J583J747J684J541J646K261L316M322M745M575M345M422
54715A49737M575M377L777K984K031Q14n97k022l435m816n841o086n548m683l886
54700A31381l204k598k097j638j047m86n58j571k840l210k365j222q13j124j400
54685A05208j233q42m30O8M73K82n73j357j340o30J56O62Q06M55l03q50o18N7
54667I9991L25Mk81j16J36k4n33r71j040o70L1P17R97Q32N74N63Q64J307J548
$$ plain form
54774 107963 108794 109800 110776 111740 112719 113545 114154 115024 116921 120042 123767 127548 131685 136778 142623 148299
54758 148299 153284 157827 161976 164955 165892 164761 162177 158655 154585 150602 147260 144332 141008 136898
54744 136898 132514 128680 125753 123506 121487 119389 117264 115430 114046 112856 111567 110372 109818 110148 111071
54729 111071 112223 113550 115133 116880 118564 120105 121751 124012 127328 131650 136395 140970 145315 149737
54715 149737 154312 158689 162466 165450 167481 168295 167698 165676 162241 157425 151584 145498 139950 135267 131381
54700 131381 128177 125579 123482 121844 120797 120311 119753 118182 115342 112132 109767 108545 107732 106608 105208
54685 105208 103975 103133 102703 102771 103244 103526 102953 101596 100256 99626 99782 100444 101250 101705 101402 100552 99934 99991
54667 99991 100316 100320 100039 99923 100059 100035 99502 98531 97491 96821 96852 97569 98566 99398 99972 100535 101399 102706 104254
54648A04254J225M09k94n10o58j226j737j269O3J135J399J503J987K245J458p2
54632A09912j193j166k46P16R02J73o86p15L4N28J76m54o14m03l20m32n74q14
54614A04824j087q68O7R45Q56K2m68o0P77J337J351R38L99L6j61m68q67q43k02
54595A06528M07L36o8j2M45M82j99r31r70l01N25Q87N06k15l81L18J024P57j35
54576A09003m11L20J118J099M57j66n34o90o10l65j93p7L09Q93J002K56p55j135
54558A09521p69k80j15j18N0M54Q51R52O90L24K65O46J165J424J286R27N42J98
54540A18013q2k15j29J6j15n50p05oJ133J510O49m27n02J82L59m38j296j248m35
54521A15714L87Q11Q84O98L05j95p17j175j276p09L03R28O27j70n78l37m5k75
$$ plain form
54648 104254 105479 105888 105594 105084 104426 103200 101463 100194 100257 101392 102791 104294 106281 108526 109984 109912
54632 109912 108719 107553 107307 108023 108925 109098 108412 107697 107731 108259 108435 107981 107367 106964 106644 106212 105638 104824
54614 104824 103737 102869 102936 103881 104737 104759 104291 104231 105008 106345 107696 108634 109033 109069 108908 108440 107573 106730 106528
54595 106528 106935 107271 107203 107191 107636 108118 107919 106988 106018 105717 106242 107129 107635 107420 107039 107357 108381 109138 109003
54576 109003 108592 108912 110030 111129 111586 111420 110886 110196 109586 109221 109028 108951 109260 110153 111155 111411 110656 109521
54558 109521 108752 108472 108357 108239 108289 108743 109594 110546 111236 111560 111825 112471 113636 115060 116346 117273 117815 118013
54540 118013 117931 117716 117587 117603 117488 116938 116233 116227 117360 118870 119519 119092 118590 118772 119131 118693 117397 116149 115714
54521 115714 116101 116912 117796 118494 118799 118604 117887 116712 115436 114727 115030 115958 116585 116415 115837 115500 115455 115180
54503A15180q39j072p80n11p59j121p41M20J316J111K46l01l02k17j81P3L88K21
54485A12131l89o09O3J131J823J955J767J419J009O81M17Q9r8K74R83J170N35
54468A24351p5J06N78L88l26n48P8Q46J183J318J455J114j07j571k101j378k94
54451A25017J28k00o07o28m53m72o73p15m14O3M52N69K86l92j111j314p88O0O61
54432A19469Q21P20N15K05k42p48j163j306j036l85L73R00J049R44Q17P97Q12
54415A22542P36N85M66L43M9l23l44J79P63P68K70rL50J044J505J454R19J27n11
54396A30913o50l75k8L15Q18J333J418J006N42L26K15J22K00L22O5m01j70J038
54378A37009K139K033J188Q67J248J423J110J165K071L058L242K858K705K895
$$ plain form
54503 115180 114341 113269 112489 111978 111219 110098 109357 109777 111093 112204 112450 112149 111847 111630 111449 111522 111910 112131
54485 112131 111742 111133 111196 112327 114150 116105 117872 119291 120300 120981 121398 121487 121389 121663 122646 123816 124351
54468 124351 124276 124382 124960 125348 125022 124474 124552 125398 126581 127899 129354 130468 130361 128790 126689 125311 125017
54451 125017 125145 124945 124338 123710 123257 122785 122112 121397 120983 121046 121498 122067 122353 121961 120850 119536 118748 118808 119469
54432 119469 120290 121010 121525 121730 121488 120740 119577 118271 117235 116850 117223 118123 119172 120116 120933 121730 122542
54415 122542 123278 123863 124329 124672 124721 124398 124054 124233 124996 125764 126034 126025 126375 127419 128924 130378 131297 131424 130913
54396 130913 130263 129888 129860 130175 130993 132326 133744 134750 135292 135618 135833 135955 136155 136477 136542 136141 135971 137009
54378 137009 139148 141181 142369 143236 144484 145907 147017 148182 150253 153311 156553 159411 162116 165011
54364A65011K854K177R21p23k378l292k847j486n19p66j658k026j548j038j376
54349A51306k473l455l602k929j959j159o30k10J74L10l7o65r94p41l02j89l20
54332A32125k29J77N16N89N51M64J99j16r7K36L11j72p77j032j054j133j134q16
54314A28608k94K14P54J238J176M14k77j69K71N3p74j199p98k58j53k26j46j48
54296A28286m17n47j90L30N45N55P33J024J106R25O40K23l82r10r19l27N01J119
54278A32295J273R85N32K21O0k12o32q36n19K00R39J361J216N48o9K3N82N17o53
54259A37831j912j897n44J075K158K686K796K500K092J979J963J390J91q50j155
54244A50303j085j251j672j979k020j789j195m04j7k81n00J76J392J870J092j2
$$ plain form
54364 165011 167865 170042 170963 170240 167862 164570 161723 160237 159718 158952 157294 155268 153720 152682 151306
54349 151306 148833 145378 141776 138847 136888 135729 135099 134889 135063 135373 135336 134671 133677 132936 132634 132445 132125
54332 132125 131896 132073 132589 133178 133729 134193 134392 134276 134179 134415 134726 134554 133777 132745 131691 130558 129424 128608
54314 128608 128314 128528 129282 130520 131696 132110 131833 131664 131935 131988 131214 130015 129217 128959 128806 128580 128434 128286
54296 128286 127869 127322 127132 127462 128007 128562 129295 130319 131425 132350 132990 133213 132831 131921 131002 130675 131176 132295
54278 132295 133568 134553 135085 135306 135366 135154 134522 133686 133167 133367 134306 135667 136883 137431 137362 137385 137967 138484 137831
54259 137831 135919 134022 133478 134553 136711 139397 142193 144693 146785 148764 150727 152117 152308 151458 150303
54244 150303 149218 147967 146295 144316 142296 140507 139312 138908 138891 138610 138110 138286 139678 141548 142640 142628
54228A42628l71j31j61o25q14l46J84R2l78m10K18Q87R93O08J13l47p29p67k38
54209A40406N49R75P97L13j74o29r98j013n89j27j44o36j070r72m34J9K0k43l29
54190A35721j42j6q5L3O19J260J423J350J656K113J752M14p03o29Q3L29Q3M8J55
54171A45464l49j378j708o16J031J866J586Q83L02j97o96r68p95l66j18k27l65
54154A43349j33K78K11n29j211j111n81m94q72q47o0P60Q87N02J07j92l73j23
54136A39568N53R08M44j53O5Q05Q79m6r40q77j48M13N46N39N66N94P83J460K597
54117A48556L569L680K965K303K530L499M292M394M149L944L467K258N52j006
54103A89152k193l111l572l275k559k209k396k458j953j324j246j741k190j985
$$ plain form
54228 142628 142257 142126 141965 141340 140526 140180 140364 140456 140078 139668 139886 140773 141766 142374 142487 142140 141411 140644 140406
54209 140406 140955 141930 142727 143040 142866 142237 141239 140226 139637 139510 139366 138730 137660 136688 136254 136273 136293 136050 135721
54190 135721 135579 135563 135478 135511 136130 137390 138813 140163 141819 143932 145684 146098 145395 144766 144849 145178 145261 145309 145464
54171 145464 145115 143737 142029 141413 142444 144310 145896 146779 147081 146884 146188 145220 144425 144059 143941 143714 143349
54154 143349 143216 143494 143705 143176 141965 140854 140273 139779 138907 138060 138000 138760 139647 140149 140256 140064 139691 139568
54136 139568 140121 141029 141473 141320 141385 142190 143069 143023 142083 141206 141058 141471 142017 142556 143122 143716 144499 145959 148556
54117 148556 152125 155805 158770 161073 163603 167102 171394 175788 179937 183881 187348 189606 190158 189152
54103 189152 186959 183848 180276 177001 174442 172233 169837 167379 165426 164102 162856 161115 158925 156940
54089A56940j036J02O20K83k44k47L9j38p24q43j26P92J284J464J493J050J05
54072A60814n31j58P82J369J475J654K035K125J654R57M83L46L79L00j12o90q74
54055A72008l83K95M68J38n4L47J251K286K982K881K001J156J299K511L905M604
54039A97695M423L800L426L894N208O654P414P336O781N973N002M250M146M446
54025B70448M374L646K803K289J848J093K50j69j84l99j298k714l966m439m141
54010B69441l645l398l198k678k141k402l671n139n872n667m832l614k327j515
53996B19342j487j773j655j131q86j277j845k003j834j835k094k084j316N9J482
53981A99663K618L519M280M834N286N949O796P036N765L021k01k968n031o391
$$ plain form
54089 156940 155904 156006 156626 156909 156665 156418 156457 156319 155595 154752 154626 155418 156702 158166 159659 160709 160814
54072 160814 160283 160125 160907 162276 163751 165405 167440 169565 171219 172176 172659 173005 173384 173684 173572 172882 172008
54055 172008 171625 171920 172388 172526 172472 172819 174070 176356 179338 182219 184220 185376 186675 189186 193091 197695
54039 197695 202118 205918 209344 213238 218446 225100 232514 239850 246631 252604 257606 261856 266002 270448
54025 270448 274822 278468 281271 283560 285408 286501 286751 286582 286398 285999 284701 281987 278021 273582 269441
54010 269441 265796 262398 259200 256522 254381 251979 248308 243169 237297 231630 226798 223184 220857 219342
53996 219342 217855 216082 214427 213296 212410 211133 209288 207285 205451 203616 201522 199438 198122 198181 199663
53981 199663 202281 205800 210080 214914 220200 226149 232945 239981 245746 248767 248566 245598 240567 234176
53967B34176o845o342n335m434l835l398l015k591j878q26P6K56j62m56k42J64
53951A95313M04O36J162J853K346K566K743K949L088L222L545L966M098L825L546
53936B35262L604L782L607L028K418K060J978K174K625L066L210L257L699M489
53922B78259M881M447L830M050N261O680P575P854P755P463P153P045P177P273
53908C66703O959O028M581K988J685P70o4j055j991k561k886l296l729l851l754
53893C66527l978m690n381n650n827o412p244p673p375o620n825n200m800m603
53879B85249m445m166l866l840m168m520m457l908l247k883k853k887k850k971
53865B34188l422l925m016l677l309l026k437j350k99J3m29j038j402j531j442
$$ plain form
53967 234176 227331 220989 215654 211220 207385 203987 200972 198381 196503 195677 195753 196009 195847 195391 195149 195313
53951 195313 195717 196353 197515 199368 201714 204280 207023 209972 213060 216282 219827 223793 227891 231716 235262
53936 235262 238866 242648 246255 249283 251701 253761 255739 257913 260538 263604 266814 270071 273770 278259
53922 278259 283140 287587 291417 295467 300728 307408 314983 322837 330592 338055 345208 352253 359430 366703
53908 366703 373662 379690 384271 387259 388944 389714 389650 388595 386604 384043 381157 377861 374132 370281 366527
53893 366527 362549 357859 352478 346828 341001 334589 327345 319672 312297 305677 299852 294652 289852 285249
53879 285249 280804 276638 272772 268932 264764 260244 255787 251879 248632 245749 242896 240009 237159 234188
53865 234188 230766 226841 222825 219148 215839 212813 210376 209026 208727 208740 208311 207273 205871 204340 202898
53850B02898j055n81n32j036j522j438r95q12r56q72k58L98M65jl90l68j88k27
53832A92530m54n07j29N78J191J315R32M38J65L2j38p1O56J704J904O29j153j733
53814A97889n60J244K250K195J870J983K461K818K843K830L250M256N516O429
53800B37274O570O058N506N459N748N617M657L438K816K768K528J792J182J202
53786B92615J459J361J011Q16O93L08k26o40j225k503m238n560o084o177o071
53771B65539n521m524l682l479l766m166m462m385l621k453j751j970k497k472
53757B16790j796j022n91o45j178j897k223j900j383j229j325j149o10j30qq9
53741A99615k3M07J129J677J464M13q35j567j620j184l30P55J455J226L67k30
$$ plain form
53850 202898 201843 201262 200730 199694 198172 196734 195739 194927 193971 193099 192841 193239 193704 193703 193313 192945 192757 192530
53832 192530 192076 191569 191440 192018 193209 194524 195456 195894 196059 196091 195953 195882 196538 198242 200146 200775 199622 197889
53814 197889 197329 198573 200823 203018 204888 206871 209332 212150 214993 217823 221073 225329 230845 237274
53800 237274 243844 249902 255408 260867 266615 272232 276889 280327 283143 285911 288439 290231 291413 292615
53786 292615 294074 295435 296446 297262 297955 298263 298037 297397 296172 293669 289431 283871 277787 271610 265539
53771 265539 260018 255494 251812 248333 244567 240401 235939 231554 227933 225480 223729 221759 219262 216790
53757 216790 214994 213972 213381 212736 211558 209661 207438 205538 204155 202926 201601 200452 199842 199712 199704 199615
53741 199615 199592 199999 201128 202805 204269 204682 203847 202280 200660 199476 199146 199901 201356 202582 202949 202719
53725B02719j30L27O73Q52J032J330J755K150K151J607J021J154K040K825K831
53710B24337K398K324K723K905K398J669J588K350L249L561L335L080K967K752
53696B61636K459K584L300L956L778K829J858J317J041Q07P14Q16P91L09m56r99
53680B86740j155j282j701k157k123j590j138j061q69j14O06K43j094j958j313
53665B70034J50R90P55J21l29o41r19r44n94j32J54L04M80P09R10J019R80P97
53647B73844O40P59J200J739K118K240K211K262K611L223L759L862L394K438J306
53632C07606N46N83J102J215N91L1M16J428J957J623J145J143J387J516J787K582
53616C26658L579M052L841L473L338L242K964K752K925L218L051K431K061K354
$$ plain form
53725 202719 202589 202916 203589 204441 205473 206803 208558 210708 212859 214466 215487 216641 218681 221506 224337
53710 224337 226735 229059 231782 234687 237085 238754 240342 242692 245941 249502 252837 255917 258884 261636
53696 261636 264095 266679 269979 273935 277713 280542 282400 283717 284758 285565 286279 287095 287886 288195 287739 286740
53680 286740 285585 284303 282602 280445 278322 276732 275594 274533 273664 273550 274156 274399 273305 271347 270034
53665 270034 270184 271174 271929 272050 271721 271080 270161 269217 268623 268491 268645 268949 269429 270138 271048 272067 273047 273844
53647 273844 274484 275243 276443 278182 280300 282540 284751 287013 289624 292847 296606 300468 303862 306300 307606
53632 307606 308152 308735 309837 311052 311643 311674 312090 313518 315475 317098 318243 319386 320773 322289 324076 326658
53616 326658 330237 334289 338130 341603 344941 348183 351147 353899 356824 360042 363093 365524 367585 369939
53602C69939K808K790K524K598K724J958L10q31m42O87J002K00o51p36m43n67
53586C83870j277k091k470k289j930j912k323k689k661k478k464k422k028j570
53572C53266j572j891j805j093l08Q0K16L63M18K34m2j73j26k5k1k42n83o30j46
53553C45920M96P40O80Q83J463J972K164K241K229J817J081O97J115K008K861
53538C68367L582M256M738M920N025N284N649O066O671P401P898Q103Q528R574
53524D56062J0868J1687J1782J1478J1268J1521J2301J3194J3661J3818J4460
53513E92100J6001J7779J8874J9219J9524K0319K1504K2620K3245K3239K2916
53502H17340K2702K2481K1627K0005J8433J7750J7740J7547J6764J5669J4561
$$ plain form
53602 369939 372747 375537 378061 380659 383383 385341 385651 384820 384378 385065 386067 386267 385616 384880 384437 383870
53586 383870 382593 380502 378032 375743 373813 371901 369578 366889 364228 361750 359286 356864 354836 353266
53572 353266 351694 349803 347998 346905 346597 346677 346893 347256 347674 347908 347866 347693 347567 347542 347521 347279 346696 346066 345920
53553 345920 346416 347156 347836 348719 350182 352154 354318 356559 358788 360605 361686 362383 363498 365506 368367
53538 368367 371949 376205 380943 385863 390888 396172 401821 407887 414558 421959 429857 437960 446488 456062
53524 456062 466930 478617 490399 501877 513145 524666 536967 550161 563822 577640 592100
53513 592100 608101 625880 644754 663973 683497 703816 725320 747940 771185 794424 817340
53502 817340 840042 862523 884150 904155 922588 940338 958078 975625 992389 1008058 1022619
53491A022619J3522J2766J2640J3242J4304J5415J6158J6210J5679J5126J4968
53480A182649J5004J4856J4567J4267J3570J1889R282O501M149K230M50j471l739
53467A284204o295q628j0127j0715j0864j1076j1524j2115j2611j2874j3211j4187
53455A149977j5738j6930j7106j6902j7376j8320j8463j7322j5927j5342j5304
53444I65247j4777j3333j1423r640q228p116o020m685l195j926j020k16O75J407
53430H85750J790K116K815L764M436M675N002N995P607R260J0575J1802J3402
53417I68989J5307J6894J7855J8731K0219K2172K3806K4836K5810K7173K8647
53406A210439K9871L1099L2729L4467L5633L6151L6706L7800L9237M0646M2097
$$ plain form
53491 1022619 1036141 1048907 1061547 1074789 1089093 1104508 1120666 1136876 1152555 1167681 1182649
53480 1182649 1197653 1212509 1227076 1241343 1254913 1266802 1276084 1282585 1286734 1288964 1289414 1287943 1284204
53467 1284204 1277909 1269281 1259154 1248439 1237575 1226499 1214975 1202860 1190249 1177375 1164164 1149977
53455 1149977 1134239 1117309 1100203 1083301 1065925 1047605 1029142 1011820 995893 980551 965247
53444 965247 950470 937137 925714 916074 907846 900730 894710 890025 886830 884904 883884 883668 884343 885750
53430 885750 887540 889656 892471 896235 900671 905346 910348 916343 923950 933210 943785 955587 968989
53417 968989 984296 1001190 1019045 1037776 1057995 1080167 1103973 1128809 1154619 1181792 1210439
53406 1210439 1240310 1271409 1304138 1338605 1374238 1410389 1447095 1484895 1524132 1564778 1606875
53395A606875M3776M5405M6397M6577M6402M6406M6658M6891M6879M6494M5529
53384B114289M3823M1581L9309L7299L5370L3136L0340K6881K2741J8179J3750
53373B456698R800N999J730l111q021j2665j7413k2773k8523l3690l7461l9900
53361B270670m1630m3040m4009m4368m4268m3939m3370m2542m1751m1235m0572
53350A799946l8972l6354l3741l2300l2297l3114l3927l4065l3154l1371k9354
53339A431297k7520k5691k3693k1914k0789j9998j8781j6966j5068j3461j2090
53328A215326j1038j0706j1236j2231j3254j4180j4833j4795j3919j2716j1806
53317A074612j1211j0436r178p634o200n073m131l160k088j021j7R82J950K730
$$ plain form
53395 1606875 1650651 1696056 1742453 1789030 1835432 1881838 1928496 1975387 2022266 2068760 2114289
53384 2114289 2158112 2199693 2239002 2276301 2311671 2344807 2375147 2402028 2424769 2442948 2456698
53373 2456698 2466498 2472497 2474227 2471116 2463095 2450430 2433017 2410244 2381721 2348031 2310570 2270670
53361 2270670 2229040 2186000 2141991 2097623 2053355 2009416 1966046 1923504 1881753 1840518 1799946
53350 1799946 1760974 1724620 1690879 1658579 1626282 1593168 1559241 1525176 1492022 1460651 1431297
53339 1431297 1403777 1378086 1354393 1332479 1311690 1291692 1272911 1255945 1240877 1227416 1215326
53328 1215326 1204288 1193582 1182346 1170115 1156861 1142681 1127848 1113053 1099134 1086418 1074612
53317 1074612 1063401 1052965 1043787 1036153 1029953 1024880 1020749 1017589 1015501 1014480 1014463 1015445 1017395 1020125
53303A020125L455M698O775R119J0861J1966J3176J4822J6420J7630J8877K0579
53291A168503K2311K3229K3105K2378K1504K0636J9763J8732J7261J5216J2846
53280A385484J0495Q241O013L826J604q79l566n879p408q632j0383j2712j4844
53267A351360j6314j7572j9190k0996k2338k2918k2975k2843k2651k2466k2358
53256A118739k2364k2468k2673k2946k3132k3053k2694k2164k1563k0995k0682
53245H74005k0779k1015k0817j9998j9060j8526j8155j7221j5555j3825j2680
53234F76374j2057j1548j0979j0339r451q270p212o740o739o731o700p151q358
53221E64099r947j1264j1892j1828j1487j1464j1874j2046j1343j0140r358r097
$$ plain form
53303 1020125 1023580 1028278 1035053 1044172 1055033 1066999 1080175 1094997 1111417 1129047 1147924 1168503
53291 1168503 1190814 1214043 1237148 1259526 1281030 1301666 1321429 1340161 1357422 1372638 1385484
53280 1385484 1395979 1404220 1410233 1414059 1415663 1414784 1411218 1405339 1397931 1389299 1378916 1366204 1351360
53267 1351360 1335046 1317474 1298284 1277288 1254950 1232032 1209057 1186214 1163563 1141097 1118739
53256 1118739 1096375 1073907 1051234 1028288 1005156 982103 959409 937245 915682 894687 874005
53245 874005 853226 832211 811394 791396 772336 753810 735655 718434 702879 689054 676374
53234 676374 664317 652769 641790 631451 622000 613730 606518 599778 593039 586308 579608 572457 564099
53221 564099 554152 542888 530996 519168 507681 496217 484343 472297 460954 450814 441456 432359
53209D32359q602p633o918o907o977o509n981o171o842p131o878o750p145p771
53195C34144q191q130p389o159n323n543o153n800m352l148l097l497l275k544
53181B61543k081j960j678j274j286j678j750j291r67j227j534j195m70j95o01
53166B42356j090j184j097j230j510j513j054m42j26k36m44l44RQ8m10r86q56
53149B29931KO95M84l48r99j121r91r01q88r39j102j239j094n78J18P79J233J299
53131B24341R31M14J08pj76l25p3O37J305J490J304J130J191J490J912K173K028
53114B39873J670J622J986K191J741Q99L10K31M41O19N04l2p61j163j121j235
53098B47775k045l165l700l335k516j685r18l32k27o65j247j504j298q05m22n79
$$ plain form
53209 432359 423757 416124 409206 402299 395322 388813 382832 376661 369819 362688 355810 349060 341915 334144
53195 334144 325953 317823 310434 304275 298952 293409 287256 281456 277104 273956 270859 267362 264087 261543
53181 261543 259462 257502 255824 254550 253264 251586 249836 248545 247578 246351 244817 243622 243152 242957 242356
53166 242356 241266 240082 238985 237755 236245 234732 233678 233236 233110 232874 232430 232086 232095 232183 231773 230787 229931
53149 229931 229933 230628 231112 230764 229765 228644 227653 226752 225864 224925 223823 222584 221490 220912 221030 221809 223042 224341
53131 224341 225272 225686 225794 225787 225611 225286 225213 225850 227155 228645 229949 231079 232270 233760 235672 237845 239873
53114 239873 241543 243165 245151 247342 249083 249982 250292 250523 250964 251583 252087 252055 251294 250131 249010 247775
53098 247775 245730 242565 238865 235530 233014 231329 230411 230079 229852 229187 227940 226436 225138 224333 223911 223332
53082B23332j291j908j785j145q45j171j431r92j85J85j51p33j049r21m74k7M4
53065B09453l00n87l85P3J30l73q57p76k88J69O07J338K211K539J930Q52M3k50
53047B15529j98J65Q17J327J089J61p23j086j187j302j138m17M10O38K34l07p61
53030B13251j199j377q41K30J001J030P86Q43J062R72O22M87P38J037J049P56
53014B20447L35m6k27j37N1O2j48k82r2K49L49N4m01p08p19l80L22J097J326P15
52994B21867j14j63P20J613J677J140Q51J195J808K113J781R31J55J34Q52J445
52978B38005J174K95m40p87r86j070q60n08l33k05K04O36N28J22L47J359K108
52961B39589J837J133Q79R14N28k16o12n16n52j070j693j963j941j862j637j012
$$ plain form
53082 223332 222041 220133 218348 217203 216358 215187 213756 212764 212579 212764 212613 211880 210831 209910 209436 209409 209453
53065 209453 209153 208566 208181 208254 208384 208011 207154 206378 206090 206259 206866 208204 210415 212954 214884 215736 215779 215529
53047 215529 215331 215496 216313 217640 218729 218890 218167 217081 215894 214592 213454 213037 213447 214085 214319 214012 213251
53030 213251 212052 210675 209834 210064 211065 212095 212881 213724 214786 215758 216380 216867 217605 218642 219691 220447
53014 220447 220782 220736 220509 220372 220423 220485 220337 220055 219963 220212 220561 220615 220214 219506 218787 218407 218729 219826 221152 221867
52994 221867 221753 221590 222310 223923 225600 226740 227591 228786 230594 232707 234488 235419 235574 235708 236560 238005
52978 238005 239179 239474 239034 238247 237261 236191 235331 234823 234490 234285 234489 235125 235653 235775 236122 237481 239589
52961 239589 241426 242559 243438 244352 244880 244664 244052 243536 242984 241914 240221 238258 236317 234455 232818 231806
52945B31806q8O11O00m9p86j159j224j237j095n38K07M78K8o44j025j147j181
52928B23557j002o23m91p92q76m0J334K126J813Q63j05q28j174j047p04n97p37
52911B20677n93J35J066J598J512J053O65O83R47P64l26j774k485k116j327o80
52895B19799M5J049J808J752J215J012J241J264P81K85K42L90K26j96l66r9K16
52878B30664K09j4j72k70m53n17j4J125K349L095L256K954K240J394J080J605
52862B48531K272K123J238N83M91J32j124k610l190k784k362k624l308l762l653
52847B29953l065k317j823j842k198k429k247j757j222q35p11q63j097j064n88
52832B05895J41P59J106J342J669J938J680O81n38j104p65k71n36j607k559k407
$$ plain form
52945 231806 231718 232329 232929 232880 232094 230935 229711 228474 227379 226841 227048 227526 227554 226910 225885 224738 223557
52928 223557 222555 221932 221441 220649 219773 219733 221067 223193 225006 225869 225764 224936 223762 222715 222011 221414 220677
52911 220677 220084 220219 221285 222883 224395 225448 226113 226796 227743 228507 228181 226407 223922 221806 220479 219799
52895 219799 219844 220893 222701 224453 225668 226680 227921 229185 229966 230251 230493 230883 231109 230913 230547 230448 230664
52878 230664 230873 230859 230687 230417 229964 229447 229433 230558 232907 236002 239258 242212 244452 245846 246926 248531
52862 248531 250803 252926 254164 254747 255238 255370 254246 251636 248446 245662 243300 240676 237368 233606 229953
52847 229953 226888 224571 222748 220906 218708 216279 214032 212275 211053 210218 209507 208644 207547 206483 205895
52832 205895 206036 206795 207901 209243 210912 212850 214530 215211 214673 213569 212804 212533 211997 210390 207831 205424
52816B05424r75R61K301K470J826J124O78K58j87k74J39M70J99k84k20K62K15
52799B14387p51j839k087j461o21n7J08j57p47j240j196o90k46k14m17m62j88
52782B02122K29M83M09P8k45k25L34J244J889J639N38o26j055o68J13R44J554
52765B08757J471M99o35q24j1O81M81q5k51k26o12j177j116l07N82J101J344J323
52747B10995Q95L98N27J315J966K054K093K510K744K098R54M40J055K196K963
52732B35203K862J900N50m18n92m16o52j288j520r69l42n36j442k117j986j410
52716B26827j048j059j132r94n56J84J014J360P54m28j156r47m53m19n73j38P97
52699B22033J339J132P72O58L73l42q86o88j58mj04P9L66J10n51p25r3N97O60
$$ plain form
52816 205424 204449 205410 207711 210181 212007 213131 213809 214067 213880 213606 213745 214215 214414 214130 213910 214172 214387
52799 214387 213636 211797 209710 208249 207628 207571 207679 207522 206775 205535 204339 203649 203403 203189 202772 202310 202122
52782 202122 202351 202834 203243 203321 203076 202851 203185 204429 206318 207957 208495 207869 206814 206146 206259 207203 208757
52765 208757 210228 210727 210092 209268 209257 209938 210419 210334 210083 209857 209245 208068 206952 206645 207227 208328 209672 210995
52747 210995 211890 212288 212815 214130 216096 218150 220243 222753 225497 227595 228549 228989 230044 232240 235203
52732 235203 238065 239965 240515 240097 239505 239089 238437 237149 235629 234660 234318 233782 232340 230223 228237 226827
52716 226827 225779 224720 223588 222594 222038 222222 223236 224596 225350 224922 223766 222819 222366 221947 221374 221236 222033
52699 222033 223372 224504 225276 225934 226307 225965 225079 224391 224233 224229 224125 224204 224570 224680 224129 223404 223311 223908 224568
52680B24568K74r9l66n42m44j20p9o10j211j171m89K22N48O03O72Q70J095J108
52662B24829P62K88J74N88J145J381J281J057P89N88Q15J651K540K607J669M51
52646B42615l41p88j345k008k234j714q57l44k70q3N70J187R77l5q74p00K48J034
52628B35038J029M09j56m0Q59J906K097J060m24j167q43j82R1R9L97J003J250
52611B42426O83k42o32k55K45K57NNJ29j72q00r28j82P50J087R03O60L95qj89
52591B44137K31Q17Q26L64K45O45Q04L14j67R6Q99J551J797J776J508J034P20
52574B57597P81P42l3j332k222k165j548j004o85l85n5J11o2n20r90j157r01l70
52556B45802J98O59Q36M73m29j338j594j149n91l89m27l67j75l2K4J05K78N22
$$ plain form
52680 224568 224842 224743 224377 223835 223391 223271 223192 222582 221371 220200 219711 219933 220481 221084 221756 222626 223721 224829
52662 224829 225591 225879 226053 226641 227786 229167 230448 231505 232294 232882 233697 235348 237888 240495 242164 242615
52646 242615 242274 241486 240141 238133 235899 234185 233328 232984 232714 232631 233201 234388 235365 235330 234456 233756 234004 235038
52628 235038 236067 236476 236320 236280 237139 239045 241142 242202 241778 240611 239768 239586 239677 239776 240173 241176 242426
52611 242426 243109 242867 242235 241980 242225 242482 242487 242492 242621 242449 241649 240721 240539 241289 242376 243279 243939 244334 244326 244137
52591 244137 244368 245185 246011 246375 246620 247265 248069 248383 248216 248312 249211 250762 252559 254335 255843 256877 257597
52574 257597 258378 259120 259087 257755 255533 253368 251820 250816 250131 249746 249691 249802 249740 249220 248230 247073 246172 245802
52556 245802 246000 246659 247495 247968 247539 246201 244607 243458 242867 242478 242051 241684 241509 241477 241501 241606 241884 242406
52538B42406Q42J170J289J046N68J16k32n26o45l47L42J048J412J392J041L67
52522B51289m58r41o86R1P26Q16N53L65N00R52J599K215K585K710K805K992L124
52505B71237L030K681K048J033k12j185j619j952k706l559l608k666j657j438
52491B59427j780j941j746j536j321q01j31J00j77k76K18P79P22J82k05k37j34
52474B51143J41P93J514J625J081O66Q62J181J029P34J071K004K697K679K438
52459B71658K574K960L041K665K183J769J059l86k322l845m216l620k859k417
52445B68244k064j504r63q66j193j560j774j859j719j252p65p49j121j229p31
52430B48895o8K12J57J59L84O96R01P81K73k24o5P63J408J194N02K04N55J249
$$ plain form
52538 242406 243248 244418 245707 246753 247321 247437 247205 246679 246034 245687 246029 247077 248489 249881 250922 251289
52522 251289 250831 249890 249204 249295 250021 250837 251390 251755 252255 253207 254806 257021 259606 262316 265121 268113 271237
52505 271237 274267 276948 278996 280029 279817 278632 277013 275061 272355 268796 265188 262522 260865 259427
52491 259427 257647 255706 253960 252424 251103 250302 250171 250271 250094 249818 250036 250815 251537 251719 251514 251277 251143
52474 251143 251284 252077 253591 255216 256297 256963 257825 259006 260035 260769 261840 263844 266541 269220 271658
52459 271658 274232 277192 280233 282898 285081 286850 287909 287523 285201 281356 277140 273520 270661 268244
52445 268244 266180 264676 263713 262847 261654 260094 258320 256461 254742 253490 252725 251976 250855 249626 248895
52430 248895 248827 249039 249196 249355 249739 250435 251336 252117 252390 252166 252101 252864 254272 255466 255968 256172 256727 257976
52412B57976K160L305M268M543M463N011O486Q015Q632Q319P645O863N741L983
52398C37410J467j564m370o099o603o599o698o668n944m524k963j714r25o23o65
52383B82918o01p1O72J038Q53N43N64R86J600K124K320K260K447L336M638N458
52367C11085N316M677M304M276L948K807J150j18l72J53O56O65M05K47J00k33
52351C39066m51o6P29J125Q32N04P39J249J519J734K427L467M206M499M841N380
52335C71800N628N414N518O752Q839J0708J1755J2309J2966J3947J5182J6629
52323D97447J8216J9617K0316K0057J9245J8737J9002J9553J9438J8365J6996
52312G06989J6084J5730J5724J6090J6819J7342J6940J5643J4220J3293J2852
$$ plain form
52412 257976 260136 263441 267709 272252 276715 281726 288212 296227 304859 313178 320823 327686 333427 337410
52398 337410 338877 337313 332943 326844 320241 313642 306944 300276 294332 289808 286845 285131 284206 283583 282918
52383 282918 282317 282246 282918 283956 284809 285352 285916 286902 288502 290626 292946 295206 297653 300989 305627 311085
52367 311085 316401 321078 325382 329658 333606 336413 337563 337445 337073 337226 337882 338547 338952 339199 339299 339066
52351 339066 338615 338549 339278 340403 341235 341739 342478 343727 345246 346980 349407 352874 357080 361579 366420 371800
52335 371800 377428 382842 388360 395112 403951 414659 426414 438723 451689 465636 480818 497447
52323 497447 515663 535280 555596 575653 594898 613635 632637 652190 671628 689993 706989
52312 706989 723073 738803 754527 770617 787436 804778 821718 837361 851581 864874 877726
52301H77726J2614J2324J1646J0315Q573P047N981M906L212P61k094m787o728
52288I41496p711q283r195j0370j0909j0301r024p654o061m053k081o59N63K285
52274H58043M426O246P452Q434R503J0596J1656J2673J3320J3223J2670J2427
52262I80669J2800J3414J3904J4148J3804J2502J0657R344R060R229R239R116
52250A117886Q859P909N995L773J903K7k533n473p843r441j0994j2889j4583j5388
52236A067208j5232j4445j3368j2399j1954j2012j1982j1392j0477r863r762r671
52224I24651q903p362n734m824m670m436l399j810n77j61j30K51J294K807M329
52209H91326N363N595N137M545M399M772N101M699L511K377K256L148M035M101
$$ plain form
52301 877726 890340 902664 914310 924625 933198 940245 946226 951132 954344 955105 953011 948224 941496
52288 941496 933785 925502 916307 905937 895028 884727 875703 868049 861988 857935 855854 855195 855758 858043
52274 858043 862469 868715 876167 884601 894104 904700 916356 929029 942349 955572 968242 980669
52262 980669 993469 1006883 1020787 1034935 1048739 1061241 1071898 1081242 1090302 1099531 1108770 1117886
52250 1117886 1126745 1134654 1140649 1144422 1146325 1146352 1143819 1138346 1130503 1121062 1110068 1097179 1082596 1067208
52236 1067208 1051976 1037531 1024163 1011764 999810 987798 975816 964424 953947 944084 934322 924651
52224 924651 915748 908386 902652 897828 893158 888722 885323 883513 882936 882775 882645 882896 884190 886997 891326
52209 891326 896689 902284 907421 911966 916365 921137 926238 930937 934448 936825 939081 942229 946264 950365
52195I50365L669L635M250M945N209N097M807M331L668L017K440J700O68k80p16
52180I96805q32j348k718m683o644q222r300r712r258q065o682n589m733l792
52166I15227k785k058j670j134o0J269K267K801L259L928M630M966M660L664K241
52151I41205R76M75Q19J437J581R84M7n17k84N77J538K249K675K856K773K610
52135I62001K755L343M026M543N200O437Q125R760J1288J3176J5685J8499K1169
52122A086007K3487K5360K6730K7755K8688K9399K9395K8506K7254K6239K5385
52111A384205K4029K1636J8360J5008J2376J0389Q037M621R04j561k345k567l241
52098A489851m040m322m532n597p357q748r429j0230j1781j3576j4874j5740j6671
$$ plain form
52195 950365 954034 957669 961919 966864 972073 977170 981977 986308 989976 992993 995433 997133 997801 997521 996805
52180 996805 995973 994625 991907 987224 980580 972358 963058 953346 944088 936023 929341 923752 919019 915227
52166 915227 912442 910384 908714 907580 907520 908789 911056 913857 917116 921044 925674 930640 935300 938964 941205
52151 941205 942181 942656 943475 944912 946493 947477 947524 947007 946723 947300 948838 951087 953762 956618 959391 962001
52135 962001 964756 968099 972125 976668 981868 988305 996430 1006190 1017478 1030654 1046339 1064838 1086007
52122 1086007 1109494 1134854 1161584 1189339 1218027 1247426 1276821 1305327 1332581 1358820 1384205
52111 1384205 1408234 1429870 1448230 1463238 1475614 1486003 1494040 1498661 1499565 1498004 1495659 1493092 1489851
52098 1489851 1485811 1481489 1476957 1471360 1464003 1455255 1445826 1435596 1423815 1410239 1395365 1379625 1362954
52085A362954j7654j8163j7803j6518j4415j1849r450p545n676l166k18K216L645
52072A246358M726O375Q662J0950J2806J4207J5067J5189J4850J4778J5254J5557
52060A394779J4785J2968J0961R380Q119O914N830N015M330L500K413J000r42
52047A479052l525o527r547j2361j4964j7358j9476k1280k2729k3726k4180k4071
52035A279308k3414k2311k1087k0103j9244j7842j5491j2741j0677r821r798r988
52023A086791j0132j0282j0563j1020j1485j1477j0661r429q684q821r275r326
52011I65636r043r104r938j1349j2869j4081j4725j4845j4878j5272j5990j6542
51999H07000j6580j6172j5549j4817j4004j3132j2208j1232j0233r183p971o651
$$ plain form
52085 1362954 1345300 1327137 1309334 1292816 1278401 1266552 1257102 1249557 1243881 1240715 1240497 1242713 1246358
52072 1246358 1251084 1257459 1266121 1277071 1289877 1304084 1319151 1334340 1349190 1363968 1379222 1394779
52060 1394779 1409564 1422532 1433493 1442873 1450992 1457906 1463736 1468751 1473081 1476581 1478994 1479994 1479052
52047 1479052 1475527 1469000 1459453 1447092 1432128 1414770 1395294 1374014 1351285 1327559 1303379 1279308
52035 1279308 1255894 1233583 1212496 1192393 1173149 1155307 1139816 1127075 1116398 1106577 1096779 1086791
52023 1086791 1076659 1066377 1055814 1044794 1033309 1021832 1011171 1001742 993058 984237 974962 965636
52011 965636 956593 947489 937551 926202 913333 899252 884527 869682 854804 839532 823542 807000
51999 807000 790420 774248 758699 743882 729878 716746 704538 693306 683073 673890 665919 659268
51987F59268n617n236n389n748o386p611r190j0319j0621j0583j0672j0648j0279
51974E50969j0131j0764j1515j1059r149o920n298m041k626j172J39J740M006
51961D84179O316P674P992P981P924P359O045M435K992J666L24q40j666k255k466
51946E37660j622P57M157P454R976J1847J3457J4947J6046J6066J4252J0672O655
51933F62324L711J992L30k026m418n933o874q359j0702j3038j4534j5274j5707
51920E71492j5933j5897j5836j5945j5898j5255j4098j2857j1542r785p601n627
51908D15218m377l716l211k604j731m11J237K644L427L935M793O028O983P025
51894D35240O016M162J799o55k907n005p035q613r098q470p512o773n746l668
$$ plain form
51987 659268 653651 648415 643026 637278 630892 623281 614091 603772 593151 582568 571896 561248 550969
51974 550969 540838 530074 518559 507500 498351 491431 486133 482092 479466 478294 478433 480173 484179
51961 484179 490495 498169 506161 514142 522066 529425 535470 539905 542897 544563 544887 544047 542381 540126 537660
51946 537660 536038 536795 540952 548406 558382 570229 583686 598633 614679 630745 644997 655669 662324
51933 662324 666035 668027 668357 666331 661913 655980 649106 640747 630045 617007 602473 587199 571492
51920 571492 555559 539662 523826 507881 491983 476728 462630 449773 438231 428446 420845 415218
51908 415218 410841 407125 403914 401310 399579 399168 400405 403049 406476 410411 415204 421232 428215 435240
51894 435240 441256 445418 447217 446562 443655 438650 431615 423002 413904 405434 397922 391149 385403 381735
51880C81735r33J023J542J712K980N151O632O591N982N961O172N478L843K431
51866D36300J783J106l05j890k744k977l340l946m222l899l237k345r83P64K294
51851D12359L137L464L713M026M132L542J895n96l060m668n367n664n814n756
51837D05343n672n966o565o776o061m536k640p78O06J156J086J080J439J638J078
51822C74432q6j167j700j751j710j978k582k977k514j234J30J041J551J783J599
51807C62837J149J091J791K658K851K280J426N30m90j484k033j975j546j092q46
51792C67147r02j116j206j125j141j328j390j195j084j209j114m15M77R30R24
51777C56253P55L05n58j262j089l59m1k07R2J313K758L750M608N893P355Q238
$$ plain form
51880 381735 380802 381825 383367 385079 388059 393210 399842 406433 412415 418376 424548 430026 433869 436300
51866 436300 438083 439189 438884 436994 434250 431273 427933 423987 419765 415866 412629 410284 409301 410065 412359
51851 412359 415496 418960 422673 426699 430831 434373 436268 435672 432612 427944 422577 416913 411099 405343
51837 405343 399671 393705 387140 380364 374303 369767 367127 366349 366955 368111 369197 370277 371716 373354 374432
51822 374432 374346 373179 371479 369728 368018 366040 363458 360481 357967 356733 356863 357904 359455 361238 362837
51807 362837 363986 365077 366868 369526 372377 374657 376083 376613 376123 374639 372606 370631 369085 367993 367147
51792 367147 366245 365129 363923 362798 361657 360329 358939 357744 356660 355451 354337 353922 354399 355329 356253
51777 356253 357008 357313 356755 355493 354404 354045 354004 353797 353889 355202 357960 361710 366318 372211 379566 387804
51761C87804Q228P584O699N802M836L344R35j959m230n353n952o763p578p763
51747C85634p369o972o705o141n084l870k831j986j269o19K68J781L770N472O251
51732C60330O221N928N699N469N069M373L322K078J114Q80J259J598J394P78J01
51717D05613p22k030l606m530m199l087k165j817j766j843k216k825l153k800
51703C68854j897p73M24J598K493K872K700K015R09j75o26m07k68p55j334j099
51687C74531j53L23m67j964l025l207k931k603k160j429n89J34R24K127L479M053
51671C67043L307J985J489K403M007N283N871N921N521M731L831L022K069O04
51657D17087j253k962m210n043n392m899l355j023J534L759N217N771N618M938
$$ plain form
51761 387804 396032 403616 410315 416117 420953 424297 425232 423273 419043 413690 407738 400975 393397 385634
51747 385634 378265 371293 364588 358447 353363 349493 346662 344676 343407 342788 343056 344837 348607 354079 360330
51732 360330 366551 372479 378178 383647 388716 393089 396411 398489 399603 400483 401742 403340 404734 405512 405613
51717 405613 404891 402861 399255 394725 390526 387439 385274 383457 381691 379848 377632 374807 371654 368854
51703 368854 366957 366184 366608 368206 370699 373571 376271 378286 379195 379020 378394 377987 377719 376964 375630 374531
51687 374531 374378 374701 374234 372270 369245 366038 363107 360504 358344 356915 356326 356460 357384 359511 362990 367043
51671 367043 370350 372335 373824 376227 380234 385517 391388 397309 402830 407561 411392 414414 416483 417087
51657 417087 415834 412872 408662 403619 398227 393328 389973 388950 390484 394243 399460 405231 410849 415787
51643D15787L523J193j435l206l787m137n187o519p067o778o635p023p054n882
51629C55793m024k704k382k514k538k365k002j389p67o71j313k239k827k841k398
51614C22819j673q85l56k97o30j120j561j777j670j315q53k34O76J712K484K954
51598C18274L503M339N258O175P394Q892R939R881Q924P514N445K323j291m138
51584C92432n590n986n671m610l055j735q74K08K080M278N975P061P998Q888R369
51569D10768R401R573J0490J2010J3285J3516J2747J1884J1875J2885J4421J6178
51557E59033J8360K1226K4544K7543K9116K8249K4759J9649J4258Q979L340k695
51545G76361q262j2621j5927j8535k0266k0897k0818k0675k0653k0624k0486k0005
$$ plain form
51643 415787 419310 420503 419068 415862 412075 407938 402751 396232 389165 382387 375752 368729 361675 355793
51629 355793 351769 349065 346683 344169 341631 339266 337264 335875 335108 334437 333124 330885 328058 325217 322819
51614 322819 321146 320261 319905 319608 318978 317858 316297 314520 312850 311535 310682 310448 311124 312836 315320 318274
51598 318274 321777 326116 331374 337549 344943 353835 363774 373655 382579 390093 395538 397861 396570 392432
51584 392432 386842 380856 375185 370575 367520 365785 364911 365119 367199 371477 377452 384513 392511 401399 410768
51569 410768 420169 429742 440232 452242 465527 479043 491790 503674 515549 528434 542855 559033
51557 559033 577393 598619 623163 650706 679822 708071 732830 752479 766737 775716 779056 776361
51545 776361 768099 755478 739551 721016 700750 679853 659035 638360 617707 597083 576597 556592
51533E56592j8757j6869j5252j4541j4259j3651j2835j2265j1549r947p763o210
51521D02694n800n894n903n930n980n540m438l332k800k568k102j472j056q26
51507C49053m82K8M93P37N70j93j309k054j895j040J4J088K064K463J976J195
51491C52708J169K081K997L054K428J846J559J186L88o95j755k688l528m192m481
51476C52077m346l970l576l313l257l394l477l165k422j678j441j770k255k429
51462C11584k172j800j748j962j717m49J190J779R45Q3O16K173L312L638M039
51447C19511M954N700N815N980O927Q339R525J0456J1379J1881J1240R343O600
51434D27650L255l94l399m754m689m582n337o498p171p223p189p370p466o996
$$ plain form
51533 556592 537835 520966 505714 491173 476914 463263 450428 438163 426614 416667 408904 402694
51521 402694 396894 391000 385097 379167 373187 367647 363209 359877 357077 354509 352407 350935 349879 349053
51507 349053 348571 348599 349092 349829 350399 350206 348897 346843 344948 343908 343922 345010 347074 349537 351513 352708
51491 352708 353877 355958 358955 362009 364437 366283 367842 369028 369416 368721 366966 364278 360750 356558 352077
51476 352077 347731 343761 340185 336872 333615 330221 326744 323579 321157 319479 318038 316268 314013 311584
51462 311584 309412 307612 305864 303902 302185 301736 302926 304705 305650 305733 306349 308522 311834 315472 319511
51447 319511 324465 330165 335980 341960 348887 357226 366751 377207 388586 400467 411707 421050 427650
51434 427650 430905 430511 427112 422358 417669 413087 407750 401252 394081 386858 379669 372299 364833 357837
51420C57837n828m383l374l140l206k795j771p67k55P2P29J625K201K217J984
51405C41146J879J988K214K505K831L123L324L330K969K214J464J309J867K635
51391C74798L222L904N097O516P430P705Q068R146J0929J3347J6714K1007K5214
51378E13097K8173K9883L1282L2982L4920L7013L8994L9490L6460K9255J9598
51367H71147R858J073o887j3940j9753k4580k9016l2912l5390l6114l5773l5107
51355F12606l4100l2321k9546k5867k1727j7984j5405j3788j2108r759p246n387
51343C87368m322l704l410l508l805l912l709l382l101k957l046l349l615l608
51329C37940l373l058k706k377k191k054j650j032p94j179j458q50K10N70K2m03
$$ plain form
51420 357837 352009 347626 344252 341112 337906 335111 333340 332573 332318 332390 333119 334744 336945 339162 341146
51405 341146 343025 345013 347227 349732 352563 355686 359010 362340 365309 367523 368987 370296 372163 374798
51391 374798 378020 381924 387021 393537 400967 408672 416740 425886 436815 450162 466876 487883 513097
51378 513097 541270 571153 602435 635417 670337 707350 746344 785834 822294 851549 871147
51367 871147 881005 882078 875191 861251 841498 816918 787902 754990 719600 683486 647713 612606
51355 612606 578506 546185 516639 490772 469045 451061 435656 421868 409760 400001 392755 387368
51343 387368 383046 379342 375932 372424 368619 364707 360998 357616 354515 351558 348512 345163 341548 337940
51329 337940 334567 331509 328803 326426 324235 322181 320531 319499 318705 317526 316068 315218 315428 315998 316020 315617
51313C15617L5Q44J259J330J519J766J646J160P28O06P30J009J304J325R72O16
51297C32466N91O61M55J59J94L42j4q71j521j572j301q76k2J271K423L045L415
51280C38845L752L772L415L272L585L526K348O90k54m35o87j075q34K0M57J49
51264C60546J93J366K777L121K466J751J099j01j721k777k931l073l920m836m619
51249C49341l099j363n66q93j675k109j825j001j89L5n39j519k139j885j019l72
51233C29183n37j314j953j847j003qM09l2q70j311j000k79L33O64P68O48L31J01
51215C22283K99R47J714K243K411K393K517K932L298L121K479K072K303K714K693
51200C56419K431K475K617J977L71j159j547j018o47r06j270j197r35j005j273
$$ plain form
51313 315617 315652 316496 317755 319085 320604 322370 324016 325176 325904 326510 327240 328249 329553 330878 331850 332466
51297 332466 333057 333718 334173 334332 334526 334868 334854 333983 332462 330890 329589 328713 328691 329962 332385 335430 338845
51280 338845 342597 346369 349784 353056 356641 360167 362515 363205 362951 362516 361829 360754 359920 359940 360397 360546
51264 360546 360739 362105 364882 368003 370469 372220 373319 373218 371497 368720 365789 362716 358796 353960 349341
51249 349341 346242 344879 344313 343420 341745 339636 337811 336810 336621 336656 336117 334598 332459 330574 329555 329183
51233 329183 328646 327332 325379 323532 322529 322521 322930 322898 322028 320717 319717 319438 319771 320435 321203 321851 322182 322283
51215 322283 322582 323529 325243 327486 329897 332290 334807 337739 341037 344158 346637 348709 351012 353726 356419
51200 356419 358850 361325 363942 365919 366290 365131 363584 362566 361919 361013 359743 358546 357611 356606 355333
51185C55333j010N0J159J377O86n5k95l68q07j428j606j195p51p68j034r46l20
51168C48022K56pj177k323k403j353j0J060K106L376M337M245L227K124J423R19
51152C63822M42K22M01O11L80k95r37r90k59P60J095J84j401k475k484j907j425
51135C55744j189j001p29l31J85O12O65L79J04J7K8K05Q08J732K450K702K770
51118C65151K800K480J734J099R44Q61M71K50P64J520J556R45P15J228J691J487
51102C85696J094J180J590J775J684J627J547J099K76m77p35l55N48J518J864
51087C99931J268L20j1N31J257J438J079O62M35K75Ll42n73m72R2J003J898K420
51069D11214K554K586K848L496M497N703O987Q446J0336J2671J4980J6773J8105
$$ plain form
51185 355333 354323 354373 355532 356909 357595 357540 357245 356877 356070 354642 353036 351841 351090 350322 349288 348342 348022
51168 348022 348278 348271 347094 344771 342368 341015 341005 342065 344171 347547 351884 356129 359356 361480 362903 363822
51152 363822 364264 364486 364887 365498 365878 365583 364646 363656 363397 364157 365252 365436 364035 361560 359076 357169 355744
51135 355744 354555 353554 352825 352494 352679 353291 353956 354335 354439 354456 354484 354689 355497 357229 359679 362381 365151
51118 365151 367951 370431 372165 373264 374208 375069 375540 375790 376554 378074 379630 380575 381290 382518 384209 385696
51102 385696 386790 387970 389560 391335 393019 394646 396193 397292 397568 397091 396356 396001 396549 398067 399931
51087 399931 401199 401519 401508 402039 403296 404734 405813 406475 406910 407185 407188 406846 406273 405801 405893 406896 408794 411214
51069 411214 413768 416354 419202 422698 427195 432898 439885 448331 458667 471338 486318 503091 521196
51056E21196J9211J9560J8001J4258R786O547N141M823M953N526O143N568L010
51043F43723p36m067o153p279p992q565r121r574r450q357o719n569n552o516
51029E48073q067r923j1555j2134j1210r194o829m432j950N28K656M150N038N702
51015D90853O693Q218R679J0099R296Q237P892Q027P721O743N747N068M118K281
51001E90672r6k027k922k963k645k365k280k252j959j246l09O71J869L464N115
50986E80727O244O881P777R500J1735J3698J4984J5804J6595J7618J8743J9452
50974G39758J9311J8633J8417J9358K1169K3281K5827K9373L3828L8408M2732
50963A030095M7155N1789N5934N9057O1690O4636O7539O9026O8149O5169O0907
$$ plain form
51056 521196 540407 559967 577968 592226 602012 608559 613700 618523 623476 629002 635145 640713 643723
51043 643723 642987 638920 632767 625488 617496 608931 599810 590236 580786 572429 565710 560141 554589 548073
51029 548073 540006 530083 518528 506394 495184 485990 479161 474729 472779 473307 475963 480113 485151 490853
51015 490853 497546 505764 515443 525542 534838 543075 550967 558994 566715 573458 579205 584273 588391 590672
51001 590672 590576 588549 585627 582664 580019 577654 575374 573122 571163 569917 569608 570279 572148 575612 580727
50986 580727 586971 593852 601629 611129 622864 636562 651546 667350 683945 701563 720306 739758
50974 739758 759069 777702 796119 815477 836646 859927 885754 915127 948955 987363 1030095
50963 1030095 1077250 1129039 1184973 1244030 1305720 1370356 1437895 1506921 1575070 1640239 1701146
50952A701146N5963N0590M4834L8559L1675K4518J7684J1486N950J281k163m456
50940A977067o132p372p846p635p689q769j0420j1737j2813j4548j7126j9644
50928A845336k1519k3438k6449l0566l4875l8673m2000m5106m7947n0198n1579
50917A432986n2046n1834n1109m9571m6679m2557l8374l5213l2798k9996k6576
50906I76233k3690k2235k1497k0115j7905j5918j4837j4209j3384j2415j1573
50895G88455j0592r048p137n482m301l279k279j598j422j469j391j187r49m63
$$ plain form
50952 1701146 1757109 1807699 1852533 1891092 1922767 1947285 1964969 1976455 1982405 1983686 1981523 1977067
50940 1977067 1970935 1963563 1955717 1948082 1940393 1931624 1921204 1909467 1896654 1882106 1864980 1845336
50928 1845336 1823817 1800379 1773930 1743364 1708489 1669816 1627816 1582710 1534763 1484565 1432986
50917 1432986 1380940 1329106 1277997 1228426 1181747 1139190 1100816 1065603 1032805 1002809 976233
50906 976233 952543 930308 908811 888696 870791 854873 840036 825827 812443 800028 788455
50895 788455 777863 768815 761678 756196 751895 748616 746337 744739 743317 741848 740457 739270 738321 737858
$$ [...]
##END NTUPLES=NMR SPECTRUM
##END=
