##TITLE=AC1568_ROEFFECT0020_8270884_IHj4B1YpuO
##JCAMPDX= 6.0         $$ Bruker NMR JCAMP-DX V2.0
##DATA TYPE= NMR SPECTRUM
##DATA CLASS= NTUPLES
##ORIGIN= BRUKER
##OWNER= Administrator
$$ 1.72 TOPSPIN		Version 2.1
$$ 2013-10-12 18:09:13.643 -0700  Administrator@X
$$ Compression mode = diff/dup
##.OBSERVE FREQUENCY= 400.02188249412
##.OBSERVE NUCLEUS= ^1H
##.ACQUISITION MODE= SIMULTANEOUS (DQD)
##.ACQUISITION SCHEME= undefined
##.AVERAGES= 64
##.DIGITISER RES= 22
##SPECTROMETER/DATA SYSTEM= spect
##.PULSE SEQUENCE= noesygpps1d.comp
##.SOLVENT NAME= COFFEE_meoh
##.SHIFT REFERENCE= INTERNAL, COFFEE_meoh, 1, 14.96079
##AUDIT TRAIL= $$ (NUMBER, WHEN, WHO, WHERE, PROCESS, VERSION, WHAT)
$$ ##TITLE= Audit trail, TOPSPIN		Version 2.1
$$ ##JCAMPDX= 5.01
$$ ##ORIGIN= Bruker BioSpin GmbH
$$ ##OWNER= Administrator
$$ $$ E:\/data/COFFEE/nmr/AC1568_ROEFFECT0020_8270884_IHj4B1YpuO/12/pdata/1/auditp.txt
$$ ##AUDIT TRAIL=  $$ (NUMBER, WHEN, WHO, WHERE, PROCESS, VERSION, WHAT)
(   1,<2013-10-12 18:09:08.465 -0700>,<Administrator>,<X>,<go>,<TOPSPIN 2.1>,
      <created by zg
	started at 2013-10-12 17:57:37.813 -0700,
	POWCHK enabled, PULCHK disabled,
       configuration hash MD5:
       C8 4E 4E 5D D3 5C D8 9E 9F 52 82 E0 59 8A DE 15
       data hash MD5: 64K
       EC F7 6A 00 67 79 A9 3B 35 16 D9 6E 7F 39 8D 0E>)
(   2,<2013-10-12 18:09:11.587 -0700>,<Administrator>,<X>,<proc1d>,<TOPSPIN 2.1>,
      <Start of raw data processing
       efp LB = 0.3 FT_mod = 6 PKNL = 1 PHC0 = 0 PHC1 = 0 SI = 128K 
       data hash MD5: 128K
       42 98 3E 58 E3 65 7D 5E 09 E5 6B 94 81 F8 89 66>)
(   3,<2013-10-12 18:09:12.615 -0700>,<Administrator>,<X>,<proc1d>,<TOPSPIN 2.1>,
      <pk PHC0 = -79.51904 PHC1 = 0 
       data hash MD5: 128K
       15 79 D4 CC 69 9F 87 1C 92 05 AF F1 91 61 90 B0>)
(   4,<2013-10-12 18:09:13.053 -0700>,<Administrator>,<X>,<proc1d>,<TOPSPIN 2.1>,
      <abs ABSG = 1 
       data hash MD5: 128K
       5C 11 2A F7 EA 8C F2 8B 4E E4 A8 5A 1D A5 19 51>)
(   5,<2013-10-12 18:09:13.154 -0700>,<Administrator>,<X>,<proc1d>,<TOPSPIN 2.1>,
      <abs ABSG = 2 
       data hash MD5: 128K
       9E 14 9D 8F CB F9 F1 5C B4 B9 7A 77 33 FC 5D 1D>)
(   6,<2013-10-12 18:09:13.238 -0700>,<Administrator>,<X>,<proc1d>,<TOPSPIN 2.1>,
      <abs ABSG = 3 
       data hash MD5: 128K
       8F C7 50 4E 99 B4 E4 F1 A0 D0 C2 27 53 50 2D 4A>)
(   7,<2013-10-12 18:09:13.356 -0700>,<Administrator>,<X>,<proc1d>,<TOPSPIN 2.1>,
      <abs ABSG = 4 
       data hash MD5: 128K
       0D 6B 07 CC ED F1 05 9C C0 F4 A1 60 88 5E 18 22>)
(   8,<2013-10-12 18:09:13.440 -0700>,<Administrator>,<X>,<proc1d>,<TOPSPIN 2.1>,
      <abs ABSG = 5 
       data hash MD5: 128K
       C6 DD 41 15 EC F9 E7 94 15 6A C8 A6 5E B9 A6 91>)
$$ ##END=
$$ 
$$ $$ hash MD5
$$ $$ 38 58 9F DA 49 4F A9 A3 B5 D2 B8 6E 2F AA E9 48
##$RELAX= 
##$RELAX= 
##$RELAX= 
##$RELAX= 
##$RELAX= 
##$RELAX= 
##$RELAX= 
##$RELAX= 
$$ Bruker specific parameters
$$ --------------------------
##$DU= <E:\>
##$EXPNO= 12
$$ [...]
##$TP07= 0
##$TPNAME0= <>
##$TPNAME1= <>
##$TPNAME2= <>
##$TPNAME3= <>
##$TPNAME4= <>
##$TPNAME5= <>
##$TPNAME6= <>
##$TPNAME7= <>
##$TPOAL= (0..7)
0.5 0.5 0.5 0.5 0.5 0.5 0.5 0.5
##$TPOFFS= (0..7)
0 0 0 0 0 0 0 0
##$TUNHIN= 0
##$TUNHOUT= 0
##$TUNXOUT= 0
##$USERA1= <user>
##$USERA2= <user>
##$USERA3= <user>
##$USERA4= <user>
##$USERA5= <user>
##$V9= 5
##$VALIST= <valist>
##$VCLIST= <CCCCCCCCCCCCCCC>
##$VD= 0
##$VDLIST= <DDDDDDDDDDDDDDD>
##$VPLIST= <PPPPPPPPPPPPPPP>
##$VTLIST= <TTTTTTTTTTTTTTT>
##$WBST= 1024
##$WBSW= 4
##$XGAIN= (0..3)
0 0 0 0
##$XL= 0
##$YL= 0
##$YMAX_a= 5954588
##$YMIN_a= -12330332
##$ZGOPTNS= <>
##$ZL1= 120
##$ZL2= 120
##$ZL3= 120
##$ZL4= 120
##$ABSF1= 14.96079
##$ABSF2= -5.597392
##$ABSG= 5
##$ABSL= 3
##$ALPHA= 0
##$AQORDER= 0
##$ASSFAC= 0
##$ASSFACI= 0
##$ASSFACX= 0
##$ASSWID= 0
##$AUNMP= <proc_prof1d_extract.lims>
##$AXLEFT= 0
##$AXNAME= <>
##$AXNUC= <1H>
##$AXRIGHT= 0
##$AXTYPE= 0
##$AXUNIT= <>
##$AZFE= 0.1
##$AZFW= 0.1
##$BCFW= 0
##$BC_mod= 0
##$BYTORDP= 0
##$COROFFS= 0
##$CY= 15
##$DATMOD= 1
##$DC= 0
##$DFILT= <>
##$DTYPP= 0
##$F1P= 0
##$F2P= 0
##$FCOR= 0.5
##$FTSIZE= 131072
##$FT_mod= 6
##$GAMMA= 0
##$GB= 0
##$INTBC= 1
##$INTSCL= 1
##$ISEN= 128
##$LB= 0.3
##$LEV0= 0
##$LPBIN= 0
##$MAXI= 10000
##$MC2= 0
##$MEAN= 0
##$ME_mod= 0
##$MI= 0
##$NCOEF= 0
##$NC_proc= -2
##$NLEV= 6
##$NOISF1= 0
##$NOISF2= 0
##$NSP= 0
##$NTH_PI= 0
##$NZP= 0
##$OFFSET= 14.96079
##$PC= 1
##$PHC0= -79.51904
##$PHC1= 0
##$PH_mod= 1
##$PKNL= yes
##$PPARMOD= 0
##$PPDIAG= 0
##$PPIPTYP= 0
##$PPMPNUM= 2147483647
##$PPRESOL= 1
##$PSCAL= 4
##$PSIGN= 0
##$PYNMP= <proc.py>
##$REVERSE= no
##$SF= 400.020009720063
##$SI= 131072
##$SIGF1= 0
##$SIGF2= 0
##$SINO= 400
##$SIOLD= 131072
##$SPECTYP= <>
##$SREGLST= <1H.CDCl3>
##$SSB= 0
##$STSI= 131072
##$STSR= 0
##$SW_p= 8223.68421052631
##$SYMM= 0
##$S_DEV= 0
##$TDeff= 65536
##$TDoff= 0
##$TI= <>
##$TILT= no
##$TM1= 0
##$TM2= 0
##$TOPLEV= 0
##$USERP1= <user>
##$USERP2= <user>
##$USERP3= <user>
##$USERP4= <user>
##$USERP5= <user>
##$WDW= 1
##$XDIM= 131072
##$YMAX_p= 441531982
##$YMIN_p= -12837
##$CURPLOT= <Network HP LaserJet P1505>
##$CURPRIN= <$Network HP LaserJet P1505>
##$DFORMAT= <normdp>
##$LAYOUT= <+/1D_H.xwp>
##$LFORMAT= <normlp>
##$PFORMAT= <normpl>
##$SURQMSG= 1
$$ End of Bruker specific parameters
$$ ---------------------------------
##NTUPLES= NMR SPECTRUM
##VAR_NAME=  FREQUENCY,     SPECTRUM/REAL,   SPECTRUM/IMAG
##SYMBOL=    X,             R,               I
##VAR_TYPE=  INDEPENDENT,   DEPENDENT,       DEPENDENT
##VAR_FORM=  AFFN,          ASDF,            ASDF
##VAR_DIM=   131072,        131072,          131072
##UNITS=     HZ,            ARBITRARY UNITS, ARBITRARY UNITS
##FACTOR=    0.0627417313425164, 1,          1
##FIRST=     8223.62146879497, 838,          -59900
##LAST=      0,             2732,            -60156
##MIN=       0,             -12837,          0
##MAX=       8223.62146879497, 441531982,    0
$$ Real data points
##PAGE= N=1
##DATA TABLE= (X++(R..R)), XYDATA
$$ [...]
63940B453924K37427K51034K62300K69993K73555K72625K66199K53072K32926
$$ 2453924 2691351 2942385 3204685 3474678 3748233 4020858 4287057 4540129 4773055
63931D773055K06525J75054J39687J01687O2255K2077j8672n9766j00422j39370
$$ 4773055 4979580 5154634 5294321 5396008 5458263 5480340 5461668 5401902 5301480 5162110
63921E162110j75155k06282k31360k49474k60589k65511k65366k61073k53182
$$ 5162110 4986955 4780673 4549313 4299839 4039250 3773739 3508373 3247300 2994118
63912B994118k42097k28252k12197j94585j76123j57379j38754j20714j03991
$$ 2994118 2752021 2523769 2311572 2116987 1940864 1783485 1644731 1524017 1420026
63903A420026q9285p6787o6270n7540n0471m4578l9098l3722k8937k5365k3075
$$ 1420026 1330741 1253954 1187684 1130144 1079673 1035095 995997 962275 933338 907973 884898
63892H84898k1781k1314k1473k1769k1821k1830k2154k2464k1949k0389j8537
$$ 884898 863117 841803 820330 798561 776740 754910 732756 710292 688343 667954 649417
63881F49417j7154j6096j4641j2477r975p580n234k609L13L083N236O735P862
$$ 649417 632263 616167 601526 589049 579074 571494 566260 563651 563964 567047 572283 579018 586880
63868E86880Q814R619J0371J1286J2417J3511J4251J4508J4284J3617J2570J1219
$$ 586880 595694 605313 615684 626970 639387 652898 667149 681657 695941 709558 722128 733347
63856G33347R643P997O543N293L817J761n00k196l230m349o112q240j0272j2249
$$ 733347 742990 750987 757530 762823 766640 768401 767901 765705 762475 758126 752014 743774 733502 721253
63842G21253j4317j6136j7298j8023j8862j9921k0889k1641k2221k2376k1714
$$ 721253 706936 690800 673502 655479 636617 616696 595807 574166 551945 529569 507855
63831E07855k0363j8970j7934j7045j6029j5051j4421j4027j3347j2042j0378
$$ 507855 487492 468522 450588 433543 417514 402463 388042 374015 360668 348626 338248
63820C38248r018q313p928p293o336n464m929m571m269m149m142l869l191k472
$$ 338248 329230 320917 312989 305696 299360 293896 288967 284396 280127 275978 271836 267967 264776 262304
63806B62304k001j604j137q63r22r24n86k63l16m30k69l37j318k837l751l556
$$ 262304 260303 258699 257562 256699 255777 254853 254267 254004 253688 253258 252989 252652 251334 248497 244746 241190
63790B41190k754j973j524j659k345k828k342j331j029j702k340k237j858j688
$$ 241190 238436 236463 234939 233280 230935 228107 225765 224434 223405 221703 219363 217126 215268 213580
63776B13580j307l43N88P71N76Q45J463J500N59p66j742k073j736q89n4J84j61
$$ 213580 212273 211930 212518 213289 213865 214710 216173 217673 218232 217466 215724 213651 211915 211026 210972 211156 210995
63759B10995n29n59l68j01L24Q17J002P82O74J157J909K180J776J207Q45M77l1
$$ 210995 210466 209907 209539 209438 209762 210579 211581 212363 213037 214194 216103 218283 220059 221266 222111 222588 222557
63742B22557k01M52J567K296K440K544K863K934K454J924J876K002J683J071Q93
$$ 222557 222356 222808 224375 226671 229111 231655 234518 237452 239906 241830 243706 245708 247391 248462 249355
63727B49355J350J927K245K482K818L042K945K717K749L272M215N115N212M085
$$ 249355 250705 252632 254877 257359 260177 263219 266164 268881 271630 274902 279117 284232 289444 293529
63713B93529K202N20n13j144j626j887j938k052k283k349k146k013k173k304j919
$$ 293529 295731 296251 295738 294594 292968 291081 289143 287091 284808 282459 280313 278300 276127 273823 271904
63698B71904r19L94J540K045J811J467J887L123M254M567M386M409M638M554L976
$$ 271904 270985 271379 272919 274964 276775 278242 280129 283252 287506 292073 296459 300868 305506 310060 314036
63683C14036L187K364J442N15j47n63j125j974k607k359j269j51K35l4k80p7L97
$$ 314036 317223 319587 321029 321544 321397 320834 319709 317735 315128 312769 311500 311349 311584 311550 311270 311193 311590
63666C11590Q46J193J303Q29j90j025j088q48j222k320l459m294n077n776n859
$$ 311590 312436 313629 314932 315761 315571 314546 313458 312610 311388 309068 305609 301315 296238 290462 284603
63651B84603n175m292l673l239k997l146l247k251p8J762K008J367J341J955J952
$$ 284603 279428 275136 271463 268224 265227 262081 258834 256583 256505 258267 260275 261642 262983 264938 266890
63636B66890J065O24J627L273M031L474K498K151K737L900N086N944O424O632
$$ 266890 267955 268579 270206 273479 277510 280984 283482 285633 288370 292270 297356 303300 309724 316356
63622C16356O652O621O812P423Q345R359J0466J1785J3214J4550J5890J7605J9801
$$ 316356 323008 329629 336441 343864 352209 361568 372034 383819 397033 411583 427473 445078 464879
63609D64879K2087K4014K5624K7390K9545L1549L2311L1121K8254K4437J9866
$$ 464879 486966 510980 536604 563994 593539 625088 657399 688520 716774 741211 761077
63598G61077J4285Q023K308j896m789p032q585r003q561q259q736r815j1248j3219
$$ 761077 775362 783385 785693 783797 779008 771976 763391 754388 745827 737568 728832 719017 707769 694550
63584F94550j5850j8704k1137k2847k3811k3971k3209k1609j9456j7053j4521
$$ 694550 678700 659996 638859 616012 592201 568230 545021 523412 503956 486903 472382
63573D72382j1853r160o819n138l840k198M8K260L723M585N411O149O282N967
$$ 472382 460529 451369 444550 439412 435572 433374 433422 435682 439405 443990 449401 455550 461832 467799
63559D67799O171P368Q792R418R234R046R427J0396J1932J4143J6934J9933K2904
$$ 467799 473970 481338 490130 499548 508782 517828 527255 537651 549583 563726 580660 600593 623497
63546F23497K5949K9216L2654L6077L9024M0323L8167L1384K0899R557P0o729
$$ 623497 649446 678662 711316 747393 786417 826740 864907 896291 917190 926747 926817 920088
63534I20088j1455j4415j5032j3069r730o981o030o800q649j1122j4159j7888
$$ 920088 908633 894218 879186 866117 856387 849406 843376 836576 827927 816805 802646 784758
63522G84758k2256k6618k9919l1584l2035l1984l1384k9653k6859k4015k1999
$$ 784758 762502 735884 705965 674381 642346 610362 578978 549325 522466 498451 476452
63511D76452k0662j9280j7456j5241j2733j0050p607n970n279n003m447l456k544
$$ 476452 455790 436510 419054 403813 391080 381030 373423 367453 362174 357171 352724 349268 346724
63498C46724k311k748l246l291k993k719k397j525N0J700K543K350J673J139P83
$$ 346724 344413 341665 338419 335128 332135 329416 327019 325494 325544 327244 329787 332137 333810 334949 335732
63483C35732K03o18j022l85J007K198K728L033L536L841L353K232J117R2j271
$$ 335732 335935 335317 334295 333910 334917 337115 339843 342876 346412 350253 353606 355838 356955 357047 355776
63468C55776k843l706l321k415k220l158m541n353n073l889k432j257m01M38J290
$$ 355776 352933 349227 345906 343491 341271 338113 333572 328219 323146 319257 316825 315568 315167 315605 316895
63453C16895J744J519R75Q00J345K381L469M324M974N675O674P916R012R590R649
$$ 316895 318639 320158 321133 321933 323278 325659 329128 333452 338426 344101 350775 358691 367703 377293 386942
63438C86942R600J0010J1232J3165J5390J7699K0297K3274K5885K6806K5237K1581
$$ 386942 396542 406552 417784 430949 446339 464038 484335 507609 533494 560300 585537 607118
63426F07118J7041J2833R767Q076P431P390Q066J0015J3344J7355K1373K5499
$$ 607118 624159 636992 646759 654835 662266 669656 677722 687737 701081 718436 739809 765308
63414G65308L0021L4384L7312L7851L5825L1437K5014J7303R411K199m017q989
$$ 765308 795329 829713 867025 904876 940701 972138 997152 1014455 1023866 1026065 1022048 1013059
63402A013059j2172j3246j2814j2193j2397j3519j5144j7190k0038k3838k7905
$$ 1013059 1000887 987641 974827 962634 950237 936718 921574 904384 884346 860508 832603
63391H32603l1076l2708l3059l2699l1840l0430k8568k6476k4169k1555j8798
$$ 832603 801527 768819 735760 703061 671221 640791 612223 585747 561578 540023 521225
63380E21225j6239j3926j1593r136o769m648k681p62J114L132N582Q293J0536
$$ 521225 504986 491060 479467 470331 463562 458914 456233 455471 456585 459717 465299 473592 484128
63367D84128J1842J2579J3334J4057J4367J4493J5247J7003J9281K1474K3498
$$ 484128 495970 508549 521883 535940 550307 564800 580047 597050 616331 637805 661303
63356F61303K5580K7796L0094L2405L4384L5309L4532L1885K7528K1776J5213
$$ 661303 686883 714679 744773 777178 811562 846871 881403 913288 940816 962592 977805
63345I77805Q595K293l746r128j2638j3408j2275j1192j1382j2726j4785j7519
$$ 977805 986400 988693 984947 975819 963181 949773 937498 926306 914924 902198 887413 869894
63333H69894k0721k3651k5794k7426k8904k9826k9500k7928k5732k3332k0703
$$ 869894 849173 825522 799728 772302 743398 713572 684072 656144 630412 607080 586377
63322E86377j7801j4723j1456p959m490j575K31L02j938o283j1236j4969j6819
$$ 586377 568576 553853 542397 534438 529948 528373 528604 528906 526968 520685 509449 494480 477661
63309D77661j7298j6818j5213j2715j0399r047q200o987n362l808k343p68L51
$$ 477661 460363 443545 428332 415617 405218 396171 387971 380984 375622 371814 369471 368703 369054
63296C69054J09j184j968j435o61j109k708m229n013n314n256m601l664l356l891
$$ 369054 369163 367979 366011 364576 363915 362806 360098 355869 350856 345542 340286 335685 332021 328665 324774
63281C24774m331l917l073k494k006j170m21n16j136j178m21J31j53n56r3J139
$$ 324774 320443 316526 313453 310959 308953 307783 307362 306846 305710 304532 304111 304242 304089 303533 303440 304579
63265C04579K285K794K717K303J881J800K120K486K619K705L008L436L740L895
$$ 304579 306864 309658 312375 314678 316559 318359 320479 322965 325584 328289 331297 334733 338473 342368
63251C42368M002M094M261M657N198N642O182P399R313J1055J1936J2388J3249
$$ 342368 346370 350464 354725 359382 364580 370222 376404 383803 393116 404171 416107 428495 441744
63238D41744J4614J5993J7154J8136J8882J9587K0954K3218K5285K5837K5126
$$ 441744 456358 472351 489505 507641 526523 546110 567064 590282 615567 641404 666530
63227F66530K4588K4815K5087K4919K4765K4855K4582K3702K3086K3439K4115
$$ 666530 691118 715933 741020 765939 790704 815559 840141 863843 886929 910368 934483
63216I34483K4039K3249K2580K2168K1208J8969J5369J0662N253k84n588j0821
$$ 934483 958522 981771 1004351 1026519 1047727 1066696 1082065 1092727 1097980 1097696 1092108 1081287
63204A081287j6161k1130k5006k7839l0259l2245l2765l1090k7926k4738k2155
$$ 1081287 1065126 1043996 1018990 991151 960892 928647 895882 864792 836866 812128 789973
63193G89973j9508j5939j1577p415m297k220n90J140L205N616Q203J0599J2469
$$ 789973 770465 754526 742949 735534 731237 729017 728427 729567 732772 738388 746591 757190 769659
63180G69659J3802J4824J5636J6210J6685J7324J8047J8370J7995J7248J6680
$$ 769659 783461 798285 813921 830131 846816 864140 882187 900557 918552 935800 952480
63169I52480J6362J5768J4331J1996R251O520L578l28n452j0920j5561j9191k2594
$$ 952480 968842 984610 998941 1010937 1020188 1026708 1030286 1029958 1024506 1013586 998025 978834 956240
63156I56240k6201k9526l2005l3640l4411l3798l1601k8670k6130k4061k1768
$$ 956240 930039 900513 868508 834868 800457 766659 735058 706388 680258 656197 634429
63145F34429j9069j6559j4609j2961j1402j0163r333q542p535o561n777m782l217
$$ 634429 615360 598801 584192 571231 559829 549666 540333 531791 524256 517695 511918 507136 503919
63132E03919j445j25O92J457K286K872L171L553M142M605M929N761P423R037R318
$$ 503919 502474 502349 503041 504498 506784 509656 512827 516380 520522 525127 530056 535817 543240 552277 561595
63117E61595Q117O468N149L972K672J678J504J883K106J891J388O63k51r72j086
$$ 561595 569712 576180 581329 585301 587973 589651 591155 593038 595144 597035 598423 599086 598835 597863 596777
63102E96777q04p48j102j486j616j566j381j058q98j234j722j529n52K84K08m53
$$ 596777 595973 595225 594123 592637 591021 589455 588074 587016 586118 584884 583162 581633 581081 581365 581573 581120
63086E81120q68p35k27N63J570K482L025L400L987M836N735O575P248P483P163
$$ 581120 580252 579517 579290 579853 581423 583905 586930 590330 594317 599153 604888 611463 618711 626194 633357
63071F33357O711O753P512Q726J0041J1205J2100J2880J3909J5296J6815J8442
$$ 633357 640068 646821 654333 663059 673100 684305 696405 709285 723194 738490 755305 773747
63059G73747K0632K3647K6984K9980L2667L5581L8909M2335M5548M8453N0980
$$ 773747 794379 818026 845010 874990 907657 943238 982147 1024482 1070030 1118483 1169463
63048A169463N3165N5230N7123N8272N8303N7746N7445N7392N6926N5948N5172
$$ 1169463 1222628 1277858 1334981 1393253 1451556 1509302 1566747 1624139 1681065 1737013 1792185
63037A792185N5119N5581N6153N6645N6738N5894N3835N0533M5595L8384K8976
$$ 1792185 1847304 1902885 1959038 2015683 2072421 2128315 2182150 2232683 2278278 2316662 2345638
63026B345638J8247O712n968j9809l3621m5971n6454o5308p2270p6719p8617p8475
$$ 2345638 2363885 2370597 2364629 2344820 2311199 2265228 2208774 2143466 2071196 1994477 1915860 1837385
63014A837385p6488p2588o7223o1209n4640m6907l8049k9335k1943j5618r250
$$ 1837385 1760897 1688309 1621086 1559877 1505237 1458330 1420281 1390946 1369003 1353385 1344135
63003A344135k382M425J0490J5652K0063K3821K6958K9518L1453L2628L2987L2619
$$ 1344135 1341753 1346178 1356668 1372320 1392383 1416204 1443162 1472680 1504133 1536761 1569748 1602367
62991A602367L1824L1108L0936L1198L1124K9966K7659K4560K0711J5777R657
$$ 1602367 1634191 1665299 1696235 1727433 1758557 1788523 1816182 1840742 1861453 1877230 1886887
62980A886887K623n094j3411k1970l0156l7730m4951n1756n7305o0779o2206o2140
$$ 1886887 1889510 1884416 1871005 1849035 1818879 1781149 1736198 1684442 1627137 1566358 1504152 1442012
62968A442012o0848n8352n4976n1242m7405m3584m0087l7062l4081l0775k7687
$$ 1442012 1381164 1322812 1267836 1216594 1169189 1125605 1085518 1048456 1014375 983600 955913
62957I55913k5726k4788k3794k2259k0915k0435k0405k0043j9232j8239j7031
$$ 955913 930187 905399 881605 859346 838431 817996 797591 777548 758316 740077 723046
62946G23046j5553j4280j3751j3836j3961j3857j3496j2547j0704q473p000o836
$$ 723046 707493 693213 679462 665626 651665 637808 624312 611765 601061 592588 585588 578752
62934E78752p298p238o162m583l436l225l560l515k572j119P2O61Q66R62J017
$$ 578752 571454 564216 558054 553471 550035 546810 543250 539735 537163 536044 536116 536777 537643 538605 539622
62919E39622R24N28k68j240j907k094k242k860l796m353m111l375k853l018l747
$$ 539622 540546 541074 540806 539566 537659 535565 533323 530463 526667 522314 518203 514828 511975 508957 505210
62904E05210m434m595m395m368m537m234l012j365j70K46J71o0l00m92p00j036
$$ 505210 500776 496181 491786 487418 482881 478647 475635 474270 474100 474346 474517 474457 474157 473665 472965 471929
62888D71929j287r44J5P52M62o04j512j749j443q59k10J84K70N38J316J967J512
$$ 471929 470642 469698 469713 470465 470927 470323 468811 467062 465619 464760 464550 464734 465004 465542 466858 468825 470337
62871D70337J1j419j982j914j764j693j671j727j742j471j001p59r29j187j121
$$ 470337 470348 468929 466947 465033 463269 461576 459905 458178 456436 454965 453964 453205 452276 451089 449968
62856D49968n88L41J352J813J295K34l66l6Q08J538J869J742J187M55j93q71j755
$$ 449968 449380 449721 451073 452886 454181 454415 454049 454013 454821 456359 458228 459970 461157 461612 461419 460548 458793
62839D58793k530k682k370k279k600k785k457j881j366r07n20l60k68R9N74O46
$$ 458793 456263 453581 451211 448932 446332 443547 441090 439209 437843 436936 436416 436056 435788 435887 436461 437107
62823D37107M78Q66J957K887L037K824K733K549K162K263L375M835N588N517N210
$$ 437107 437585 438451 440408 443295 446332 449156 451889 454438 456600 458863 462238 467073 472661 478178 483388
62808D83388M937M707M857N691O734P193P009O799O959P527Q630J0367J2271J3639
$$ 483388 488325 493032 497889 503580 510314 517507 524516 531315 538274 545801 554431 564798 577069 590708
62794E90708J4347J4835J5436J6261J7530J9372K1484K3674K6583L1082L6973
$$ 590708 605055 619890 635326 651587 669117 688489 709973 733647 760230 791312 828285
62783H28285M3087M8724N4262O0185O6253P2007P7491Q3013Q8489R3406R7201
$$ 828285 871372 920096 974358 1034543 1100796 1172803 1250294 1333307 1421796 1515202 1612403
62772A612403R9400R9460R6801R1049Q2361P1398N8799M4584K8488J0973o589
$$ 1612403 1711803 1811263 1908064 1999113 2081474 2152872 2211671 2256255 2284743 2295716 2289127
62761B289127k3101l8542n3069o5826p5566q2214q6897r0451r2645r3006r1558
$$ 2289127 2266026 2227484 2174415 2108589 2033023 1950809 1863912 1773461 1680816 1587810 1496252
62750A496252q8561q4285p9359p4629p0260o5488n9757n3642m8208m3756l9714
$$ 1496252 1407691 1323406 1244047 1169418 1099158 1033670 973913 920271 872063 828307 788593
62739G88593l5515l1196k7222k4001k1617j9806j8225j6690j5090j3251j1193
$$ 788593 753078 721882 694660 670659 649042 629236 611011 594321 579231 565980 554787
62728E54787r404q341p683o553m641k532q23N52J770K538K576K339K623L677N155
$$ 554787 545383 537042 529359 522806 518165 515633 514810 515362 517132 519670 522246 524585 527208 530885 536040
62713E36040O780Q542J0340J1942J3432J5296J7923K1171K4519K7501L0117L2936
$$ 536040 542820 551362 561702 573644 587076 602372 620295 641466 665985 693486 723603 756539
62701G56539L6689M1485M6526N0925N4697N8600O2937O7025O9976P1632P2434
$$ 756539 793228 834713 881239 932164 986861 1045461 1108398 1175423 1245399 1317031 1389465
62690A389465P2619P1825O9357O4502N6794M6349L4061K1019P695o124k0405l4224
$$ 1389465 1462084 1533909 1603266 1667768 1724562 1770911 1804972 1825991 1833686 1827562 1807157 1772933
62678A772933m6317n6102o3819o9775p3817p5696p5618p4214p2009o9075o5175
$$ 1772933 1726616 1670514 1606695 1536920 1463103 1387407 1311789 1237575 1165566 1096491 1031316
62667A031316o0241n4766m9654m5526m2201l9011l5587l2115k8867k5868k3079
$$ 1031316 971075 916309 866655 821129 778928 739917 704330 672215 643348 617480 594401
62656E94401k0572j8371j6366j4591j3265j2393j1611j0680r834r329q874p949
$$ 594401 573829 555458 539092 524501 511236 498843 487232 476552 466718 457389 448515 440566
62644D40566o511n037l941l324l214l597m153m310l680k319n98R35J701J457O26
$$ 440566 434055 429018 425077 421753 418539 414942 410789 406479 402799 400480 399882 400817 402518 403975 404601
62629D04601q0m15p00j186j648j788j650j476j312j064o77j12P15J757K659L123
$$ 404601 404521 404106 403406 402220 400572 398784 397134 395658 394346 393282 392605 392493 393208 394965 397624 400747
62613D00747L361L926M986O046O600O859P460Q546R578J0176J0709J1686J3047
$$ 400747 404108 408034 413020 419066 425666 432525 439985 448531 458109 468285 478994 490680 503727
62600E03727J4559J6609J9735K3448K6525K8693L1129L4730L8739M1886M4185
$$ 503727 518286 534895 554630 578078 604603 633296 664425 699155 737894 779780 823965
62589H23965M6478M8592M9180M7425M3870L9270L3558K6425J8208R596R08p871
$$ 823965 870443 919035 968215 1015640 1059510 1098780 1132338 1158763 1176971 1186567 1187475 1179604
62577A179604j6528k4558l1419l6676m0059m1689m2078m1751m1014m0070l8986
$$ 1179604 1163076 1138518 1107099 1070423 1030364 988675 946597 904846 863832 823762 784776
62566G84776l7432l4939l1708k8692k6532k4733k2423j9612j7159j5483j3946
$$ 784776 747344 712405 680697 652005 625473 600740 578317 558705 541546 526063 512117
62555E12117j1747r018o680n364m776m229l489k885k633k428j874j041l18J06
$$ 512117 500370 491352 484672 479308 474532 470303 466814 463929 461296 458868 456994 455953 455635 455741
62541D55741L10K86j3l11j17O44J405J573J125N64M45R73J797K201J910J689K665
$$ 455741 456051 456337 456324 456013 455896 456540 457945 459518 460643 461207 461652 462625 464422 466623 468533 470222 472887
62524D72887M965P545R585J1417J3687J6204J8301K0020K2121K5016K8333L1615
$$ 472887 477852 485397 494982 506399 520086 536290 554591 574611 596732 621748 650081 681696
62512F81696L4824L7954M0632M2525M3775M4658M4914M3832M1016L6835L1978
$$ 681696 716520 754474 795106 837631 881406 926064 970978 1014810 1055826 1092661 1124639
62501A124639K6786K1208J5235R093K955l140q891j3550j6508j7899j8219j7419
$$ 1124639 1151425 1172633 1187868 1196961 1199916 1196776 1187885 1174335 1157827 1139928 1121709 1104290
62489A104290j4849j0232m217K219Q528J4603K0477K6335L2465L8760M4500M9053
$$ 1104290 1089441 1079209 1074992 1077211 1085739 1100342 1120819 1147154 1179619 1218379 1262879 1311932
62477A311932N2550N5369N6945N5631N0012M0270K8281J6498O493j914j0382k0623
$$ 1311932 1364482 1419851 1476796 1532427 1582439 1622709 1650990 1667488 1673981 1672067 1661685 1641062
62465A641062l2873m5580n6549o4390o9052p1272p1733p0758o8613o5727o2341
$$ 1641062 1608189 1562609 1506060 1441670 1372618 1301346 1229613 1158855 1090242 1024515 962174
62454I62174n8130n2612m5999l9285l3242k7803k2660j8062j4446j1571q675n516
$$ 962174 904044 851432 805433 766148 732906 705103 682443 664381 649935 638364 629689 624173
62442F24173k630m23J387L222M977O328P359Q359R189R297Q368O651M557K263
$$ 624173 621543 621120 622507 625729 630706 637034 644393 652752 661941 671238 679606 686257 690814 693077
62428F93077k49l003n981r029j1671j3269j3674j3540j3669j4076j4050j3196
$$ 693077 692828 689825 683844 674815 663144 649875 636201 622661 608992 594916 580866 567670
62416E67670j1980j1103j0617j0023r076q120p592p479p307o640n562m752m844
$$ 567670 555690 544587 533970 523947 514871 506751 499159 491680 484373 477733 472171 467419 462575
62403D62575n529n639m388k386r18m72m54k61J34O99J656K866L554L247K551K408
$$ 462575 457046 451407 447019 444633 443715 443243 442789 442528 442662 443361 445017 447883 451437 454684 457235 459643
62387D59643K840L039K544J800J503J875K588L156L388L627M404N649O564O604
$$ 459643 462483 465522 468066 469866 471369 473244 475832 478988 482376 486003 490407 496056 502620 509224
62373E09224O289O538P461Q405R057R745J0616J1320J1796J2690J4563J7127J9713
$$ 509224 515513 522051 529512 537917 546974 556719 567335 578655 590451 603141 617704 634831 654544
62360F54544K2178K4904K8140L1774L5601L9491M3332M7056N0617N3676N5449
$$ 654544 676722 701626 729766 761540 797141 836632 879964 927020 977637 1031313 1086762
62349A086762N5126N2369M7231L9845L0562K0392J0805K860l473r002j4380j9522
$$ 1086762 1141888 1194257 1241488 1281333 1311895 1332287 1343092 1345952 1342479 1333477 1319097 1299575
62337A299575k3921k7482l0753l4138l7007l8094l6881l4136l0890k7365k3392
$$ 1299575 1275654 1248172 1217419 1183281 1146274 1108180 1071299 1037163 1006273 978908 955516
62326I55516j9366j6038j3555j1370r307p987p954q908j0150j1372j2664j4011
$$ 955516 936150 920112 906557 895187 885880 877893 869939 861031 850881 839509 826845 812834
62314H12834j5226j6219j6998j7504j7677j7562j7165j6423j5480j4738j4263
$$ 812834 797608 781389 764391 746887 729210 711648 694483 678060 662580 647842 633579
62303F33579j3436j1696r480p884p445p693p888p642o776n229l486k540k864l680
$$ 633579 620143 608447 598967 591083 583638 575945 568057 560415 553639 548410 544924 542384 539520 535840
62289E35840l653k236q0J746K586K464J931J712K175L050L757L971L837L767M166
$$ 535840 532187 529951 529871 531617 534203 536667 538598 540310 542485 545535 549292 553263 557100 560867 565033
62274E65033N140O306P017P068O996P466Q517R675J0633J1461J2328J3396J4926
$$ 565033 570173 576479 583496 590564 597560 605026 613543 623218 633851 645312 657640 671036 685962
62261F85962J7037J9466K1987K4991K9076L4058L9019M3496M7944N2648N6802
$$ 685962 702999 722465 744452 769443 798519 832577 871596 915092 963036 1015684 1072486
62250A072486N9215N9569N8283N5393N0257M2519L2900K2847J3579N575j409q005
$$ 1072486 1131701 1191270 1249553 1304946 1355203 1397722 1430622 1453469 1467048 1472623 1471214 1463209
62238A463209j4843k2244l0165l8219m5659n1532n5207n6758n6712n5374n2708
$$ 1463209 1448366 1426122 1395957 1357738 1312079 1260547 1205340 1148582 1091870 1036496 983788
62227I83788m8794m4186l9577l5242l1005k6699k2554j9088j6663j5147j4006
$$ 983788 934994 890808 851231 815989 784984 758285 735731 716643 699980 684833 670827
62216F70827j2654j0841q755o879n627m957m337l265j827o06M9M21R44J561J867
$$ 670827 658173 647332 638577 631698 626071 621114 616777 613512 611685 611079 611128 611549 612493 614054 615921
62201F15921J855K148L228M668N469N188M520M463N153N813N848N588N697O177
$$ 615921 617776 619924 623152 627820 633289 638477 642997 647460 652613 658426 664274 669862 675559 681736
62187F81736O445O305O301O883P612P644O845O046O083O802P261O831N865N132
$$ 681736 688181 694486 700787 707670 715282 722926 729771 735817 741900 748702 755963 762794 768659 773791
62173G73791M843M594M296M688O511R480J2575J5333J8282K2025K6391L0732L4637
$$ 773791 778634 783228 787524 792212 798723 808203 820778 836111 854393 876418 902809 933541 968178
62160I68178L7929M0195M0831L9458L6049L0723K3745J5802P955J132m324q639
$$ 968178 1006107 1046302 1087133 1126591 1162640 1193363 1217108 1232910 1240865 1241997 1237673 1229034
62148A229034j2340j6023k0068k4340k8147l0709l1891l2309l2536l2204l0324
$$ 1229034 1216694 1200671 1180603 1156263 1128116 1097407 1065516 1033207 1000671 968467 938143
62137I38143k6681k2477j9109j6581j3734j0089o683m730m095l691l000k438k425
$$ 938143 911462 888985 869876 853295 839561 829472 822789 818059 813964 810273 807273 804835 802410
62124H02410k771l199l735m291m296l304j747m97K63J114K154K251K29l468o964
$$ 802410 799639 796440 792705 788414 784118 780814 779067 778570 778833 779947 782101 784352 784581 781113 774149
62109G74149q848r243q870p897o341m960m779n909p619r477j1527j3287j3630
$$ 774149 765301 756058 747188 739291 732950 727990 723211 717302 709683 700206 688679 675392 661762
62096F61762j2120r724p645n967m107k070n02K84O70J109J670K210K631K934L237
$$ 661762 649642 639918 632273 626306 622199 620129 619627 619911 620581 621690 623360 625570 628201 631135 634372
62081F34372L796M780O130P680R265J0683J1838J3057J4852J7137J9100K0202
$$ 634372 638168 642948 649078 656758 666023 676706 688544 701601 716453 733590 752690 772892
62069G72892K0854K1576K1980K1311J9834J8887J9542K1712K4619K7456K9487
$$ 772892 793746 815322 837302 858613 878447 897334 916876 938588 963207 990663 1020150
62058A020150L0142K9282K7114K3683J8833J2845O645J146l435p462j1351j5350
$$ 1020150 1050292 1079574 1106688 1130371 1149204 1162049 1168694 1169840 1166405 1158943 1147592 1132242
62046A132242j9540k3798k7850l1477l4549l6869l8169l8400l7846l6791l5316
$$ 1132242 1112702 1088904 1061054 1029577 995028 958159 919990 881590 843744 806953 771637
62035G71637l3449l1425k9509k7652k5510k2875k0003j7437j5456j3842j2236
$$ 771637 738188 706763 677254 649602 624092 601217 581214 563777 548321 534479 522243
62024E22243j0655r438q749q356p963p554p294p325p635p950p687o510m919l885
$$ 522243 511588 502150 493401 485045 477082 469528 462234 454909 447274 439324 431637 425127 420208 416323
62010D16323l668l538k956k437k660l267l174j954j92J328K245K527K442K577
$$ 416323 412655 409117 406161 403724 401064 397797 394623 392669 392477 393805 396050 398577 401019 403596
61996D03596L393M598N394N352M718L948L321K917K530J725M05q57j504j795k326
$$ 403596 406989 411587 416981 422333 427051 430999 434320 437237 439767 441492 441897 441040 439536 437741 435415
61981D35415l032l407l569m150n141n753n591n146m830m423l777l264l061k735
$$ 435415 432383 428976 425407 421257 416116 410363 404772 399626 394796 390373 386596 383332 380271 377536
61967C77536k091j703k045k672k904k774k642k408j848j312j257j360q86K16J265
$$ 377536 375445 373742 371697 369025 366121 363347 360705 358297 356449 355137 353880 352520 351634 351850 353115
61952C53115J809J933J676R60J70Q7R18J911K319K313K646L673N083O395P403
$$ 353115 354924 356857 358533 359493 359663 359750 360668 362579 364898 367211 369857 373530 378613 385008 392411
61937C92411Q137Q669R048R323R544R687R616R207Q499P694O978O409N916N311
$$ 392411 400548 409217 418265 427588 437132 446819 456435 465642 474141 481835 488813 495222 501138 506449
61923E06449M344K907J234k79j495k541l429l915l897l646l418l003j963k37J756
$$ 506449 510793 513700 514934 514655 513160 510619 507190 503275 499378 495732 492314 489311 487348 487111 488867
61908D88867L597N261O899Q410R363R457Q917Q175P257N780L790K071J216P03
$$ 488867 492464 497725 504624 513034 522397 531854 540771 548946 556203 561983 565773 567844 569060 569763
61894E69763m27k176l570m042l993l872l497k721k037j915k084k080k057k384
$$ 569763 569336 567160 563590 559548 555555 551683 548186 545465 543428 541513 539429 537349 535292 532908
61880E32908k845k984l047l758n196o613p485q036q527q679q163p174o089m894
$$ 532908 530063 527079 524032 520274 515078 508465 500980 492944 484417 475738 467575 460401 454312 449418
61866D49418l431j981j046o11r7Q29J837K512L004L705M579N330O158P679R905
$$ 449418 445987 444006 442960 442349 442252 443081 444918 447430 450434 454139 458718 464048 470206 477885 487790
61851D87790J1956J3159J3912J4958J6243J7173J7595J7731J7352J5934J3667
$$ 487790 499746 512905 526817 541775 558018 575191 592786 610517 627869 643803 657470
61840F57470J1401R392P025M099J419l75j822l720n836p214p402o628n207l386
$$ 657470 668871 678263 685288 689387 690806 690431 688609 684889 679053 671839 664437 657809 652602 649216
61826F49216j511L44K609N446P990R107Q820Q189P852P356O037L795Q91k396n632
$$ 649216 647705 648049 650658 656104 664094 673201 682021 690210 698062 705418 711455 715250 716141 713745 708113
61811G08113q217r834j0651j0867j0404r227p752o633o268o521o919p053o907
$$ 708113 699896 690062 679411 668544 658140 648913 641161 634528 628260 621739 614820 607767 600860
61798F00860o858p273q193r293r982r597q012o176n466o123o802o184m576l302
$$ 600860 594002 586729 578536 569243 559261 549664 541652 535476 530010 523887 517085 510901 506325 503023
61784E03023k934k949k921l040l399l600l379l005k683k210j456p84o11r00j346
$$ 503023 500089 497140 494219 491179 487780 484180 480801 477796 475113 472903 471447 470663 470052 469152 467806
61769D67806j655j489o04O90J539J396O68K38O44J869L590N345O659P366P636
$$ 467806 466151 464662 464058 464748 466287 467683 468351 468589 469233 471102 474692 480037 486696 494062 501698
61754E01698P559O963N832M527L357K185P59q06k208l335m187m683m847m970n215
$$ 501698 509257 516220 522052 526579 529936 532121 532880 532074 529866 526531 522344 517661 512814 507844 502629
61739E02629n298m984m642m779n143m986m150l240k617j906q59j4K5m33n93k07
$$ 502629 497331 492347 487705 482926 477783 472797 468647 465407 462790 460884 460025 460011 460036 459603 459010 458803
61723D58803L80J023J819K485K420J620P93L63k6o21q66k51P02R91M07m87j353
$$ 458803 459183 460206 462025 464510 466930 468550 469343 469706 469680 469059 468193 467942 468644 469635 470042 469555 468202
61706D68202k269l022l083k500k039k188k581k681k528k490k761l411m387n181
$$ 468202 465933 462911 459828 457328 455289 453101 450520 447839 445311 442821 440060 436649 432262 427081
61692D27081n037l889k743k553l112l474l224k786k639k767k842k637k255k060
$$ 427081 422044 418155 415412 412859 409747 406273 403049 400263 397624 394857 392015 389378 387123 385063
61678C85063k338k839k945k339j366o01l72p10j397j918j798j172o16l15kK97
$$ 385063 382725 379886 376941 374602 373236 372635 372263 371553 370156 368238 366440 365268 364652 364337 364335 364632
61662C64632K16kN21J864K824K610K135K634L768M248L859L549L735L742L017
$$ 364632 364848 364846 365367 367231 370055 372665 374800 377434 381202 385450 389309 392858 396593 400335 403352
61647D03352J902J055Q18J213J866K026J407P75R68J564J488P63N05J141J791
$$ 403352 405254 406309 407127 408340 410206 412232 413639 414414 415382 416946 418434 419197 419702 420843 422634
61632D22634J649J027O63R08J781K977L553K526J49k129l338l826m222m511m513
$$ 422634 424283 425310 425973 426881 428662 431639 435192 437718 437867 435738 432400 428574 424352 419841 415328
61617D15328m449m521m558m517m622m681m060k741j661j506j969k570l387m371
$$ 415328 410879 406358 401800 397283 392661 387980 383920 381179 379518 378012 376043 373473 370086 365715
61603C65715m801m204l169k528k309k133k075k357k684k673k523k626k836k783
$$ 365715 360914 356710 353541 351013 348704 346571 344496 342139 339455 336782 334259 331633 328797 326014
61589C26014k534k360k226j995j808j676j216l13M10L68k08q32j470k056j923
$$ 326014 323480 321120 318894 316899 315091 313415 312199 311886 312296 312664 312456 311624 310154 308098 306175
61574C06175p21O52R98M35P2L30O23N89N99Q96J115R05M13nq2M11J427K388K674
$$ 306175 305454 306106 307104 307539 307611 307941 308564 309153 309752 310648 311763 312668 313081 313076 312994 313405 314832 317220 319894
61555C19894K367K012J757J333Q40Q31J436K028J967J315O17K61J80ln27j118
$$ 319894 322261 324273 326030 327363 328203 329034 330470 332498 334465 335780 336397 336658 336838 336835 336308 335190
61539C35190j186o06J7J72J21L53P64Q63N54P6m69r30p82K36J382J549O31m90
$$ 335190 334004 333398 333415 333587 333708 334061 334825 335688 336242 336318 335849 334919 334137 334373 335755 337304 337935 337445
61521C37445j177j535j759j762j537j226p46K0P33Q34L97N5J23L45N39Q06J072
$$ 337445 336268 334733 332974 331212 329675 328449 327703 327723 328456 329290 329687 329742 329865 330210 330749 331555 332627
61504C32627J070Q47O58M60J57K25J216K630L254K771K143K111K277K040J579
$$ 332627 333697 334544 335202 335662 335819 336044 337260 339890 343144 345915 348058 350169 352446 354486 356065
61489C56065J341J290J148R04N58j3o02n74K78J363K055K375K497K305J883J834
$$ 356065 357406 358696 359844 360748 361306 361293 360691 360117 360395 361758 363813 366188 368685 370990 372873 374707
61473C74707K477L189L092K112Q28l34j272j914k193k201k012j654j434j796k600
$$ 374707 377184 380373 383465 385577 386405 386071 384799 382885 380692 378491 376479 374825 373391 371595 368995
61458C68995l102k968k738k822k678j642r5R79J173Q65M71K03K48N70P71O56O93
$$ 368995 365893 362925 360187 357365 354687 353045 352950 353929 355102 355967 356438 356641 356889 357459 358230 358886 359579
61441C59579J330K178K505K308K167K280K349K262K181K016J522R22P53J046J269
$$ 359579 360909 363087 365592 367900 370067 372347 374696 376958 379139 381155 382677 383599 384352 385398 386667
61426C86667J148R39Q18O53M54M90P87J063J250J602K114K404K328K181K059J611
$$ 386667 387815 388754 389572 390225 390679 391169 391956 393019 394269 395871 397985 400389 402717 404898 406957 408568
61410D08568O87k32o40n76l04J48P26J028P92M56O06J040Q95j40j298j584q84
$$ 408568 409255 409023 408383 407807 407503 407651 408377 409405 410197 410653 411259 412299 413194 413054 411756 410172 409288
61393D09288L5M42K87J6n2k5k13o97j227j443j231q23n27l82j89J25L20K28R4
$$ 409288 409323 409765 410052 410068 410016 409991 409778 409081 407854 406411 405180 404357 403830 403448 403259 403384 403704 403932 404026
61374D04026K77O58P65M91K62L33L55l9n91p97o49n45n92n11j94O4L8r2M3N79
$$ 404026 404303 404961 405726 406217 406479 406812 407167 407128 406537 405740 405091 404546 403954 403443 403249 403313 403351 403259 403302 403881
61354D03881J274J729J774J736K135L059M075M843N410N670N105L610K123J694
$$ 403881 405155 406884 408658 410394 412529 415588 419663 424506 429916 435586 440691 444301 446424 448118
61340D48118K163K534K500K702L487M312M623M487M075L212J996J111J021J274
$$ 448118 450281 452815 455315 458017 461504 465816 470439 474926 479001 482213 484209 485320 486341 487615
61326D87615J169O58J78o2j24k2J39J10N2O87K340M173N112N224N461O225P051
$$ 487615 488784 489442 489620 489558 489434 489412 489551 489661 489713 490400 492740 496913 502025 507249 512710 518935 525986
61309E25986P649Q452R868J1686J3455J4961J6070J6599J6498J5818J4340J1825
$$ 525986 533635 542087 551955 563641 577096 592057 608127 624726 641224 657042 671382 683207
61297F83207Q645N689L333J122j283l489n138o665q582j0474j1479j1556j1530
$$ 683207 691852 697541 700874 701996 700713 697224 692086 685421 676839 666365 654886 643330 631800
61284F31800j1912j2357j2335j1752j0794r682q749q272q017p324n874m033k351
$$ 631800 619888 607531 595196 583444 572650 562968 554219 545947 537930 530606 524732 520699 518348
61271E18348j066k45K7r8j69M0K56K00J07L68R84J694K424L235L946M272M193
$$ 518348 517282 517037 517064 516966 516797 516837 517093 517293 517400 517768 518752 520446 522870 526105 530051 534323 538516
61254E38516L846L225K357J646J584K068K461K330J876J561J651K054K331K028
$$ 538516 542362 545587 547944 549590 551174 553242 555703 558033 559909 561470 563121 565175 567506 569534
61240E69534J254P71J029J406J016J35j40M50R80R30J088K194L618M289M354M901
$$ 569534 570788 571559 572588 573994 575010 575145 575005 575455 576435 577365 578453 580647 584265 588554 592908 597809
61224E97809O415Q367J0168J1607J2423J2298J1453J0603J0136R835R464R103
$$ 597809 604224 612591 622759 634366 646789 659087 670540 681143 691279 701114 710578 719681
61212G19681Q782Q328P688O999O274N489M919M868N002M612L669K997L165L775
$$ 719681 728463 736791 744479 751478 757752 763241 768160 773028 778030 782642 786311 789308 792473 796248
61198G96248M216M513N089O078P278Q491R521J0121J0162R616Q279N964L113O98
$$ 796248 800464 804977 810066 816144 823422 831913 841434 851555 861717 871333 879612 885576 888689 889387
61184H89387q55k072l510m944n916o505o962p137o940o948p742q915r497r264
$$ 889387 888532 886460 882950 878006 872090 865585 858623 851486 844546 837598 829856 820941 811444 802180
61170H02180q848q696q661q637q800r113r227r124r195r498r452q622p363o404
$$ 802180 793332 784636 775975 767338 758538 749425 740198 731074 721879 712381 702929 694307 686944 680540
61156F80540o118o393o862p023o458n110l237j091J008K439K725K283K063K316
$$ 680540 674422 668029 661167 654144 647686 642576 639339 638248 639256 641695 644420 646703 648766 651082
61142F51082K301J513N07Lj55m58o25R6J739L480M800O057P726R610J1133J2124
$$ 651082 653383 654896 655403 655406 655251 654793 654168 654264 656003 659483 664283 670340 678066 687676 698809 710933
61126G10933J2970J4127J5666J7330J8952K0737K3022K5726K8277L0271L1975
$$ 710933 723903 738030 753696 771026 789978 810715 833737 859463 887740 918011 949986
61115I49986L3917L6138L8236M0011M1631M3095M3966M3885M3044M1951M0862
$$ 949986 983903 1020041 1058277 1098288 1139919 1183014 1226980 1270865 1313909 1355860 1396722
61104A396722L9683L8239L6390L3960L0857K7223K3276J8968J4045Q492K732k794
$$ 1396722 1436405 1474644 1511034 1544994 1575851 1603074 1626350 1645318 1659363 1667855 1670587 1667793
61092A667793q089j3386j8578k3171k6829k9761l2371l4755l6700l7952l8341
$$ 1667793 1659704 1646318 1627740 1604569 1577740 1547979 1515608 1480853 1444153 1406201 1367860
61081A367860l7833l6754l5794l5428l5340l4696l3024l0576k7842k5195k2965
$$ 1367860 1330027 1293273 1257479 1222051 1186711 1152015 1118991 1088415 1060573 1035378 1012413
61070A012413k1434k0383j9030j6849j4278j2306j1361j0975j0592j0241j0153
$$ 1012413 990979 970596 951566 934717 920439 908133 896772 885797 875205 864964 854811
61059H54811r976q885o619m076k471k080k098j708q48J45J124K163L364M892O922
$$ 854811 844835 835950 829331 825255 822784 820704 818606 816898 816050 816195 817319 819482 822846 827738 834660
61044H34660R226J1223J2646J3842J5077J6130J6970J8181K0022K1707K2542K3226
$$ 834660 843886 855109 867755 881597 896674 912804 929774 947955 967977 989684 1012226 1035452
61032A035452K4952K7540K9859L1804L4397L7769M0578M1829M2018M1947M1756
$$ 1035452 1060404 1087944 1117803 1149607 1184004 1221773 1262351 1304180 1346198 1388145 1429901
61021A429901M1782M3157M6732N2376N9887O9449Q0466R1310J01146J11090J22935
$$ 1429901 1471683 1514840 1561572 1613948 1673835 1743284 1823750 1915060 2016206 2127296 2250231
61010B250231J38268J59671J90817K33908K88639L54953M34558N27960O33161
$$ 2250231 2388499 2548170 2738987 2972895 3261534 3616487 4051045 4579005 5212166
61001E212166P50819Q88451J056008J260134J505361J788644K070462K246790
$$ 5212166 5962985 6851436 7907444 9167578 10672939 12461583 14532045 16778835
60993A6778835K178576J789174J149876M58674p9984l62009l90280k17220Q0838
$$ 16778835 18957411 20746585 21896461 22355135 22275151 21913142 21522862 21305642 21386480
60984B1386480L78063N00448L09190j94789q56410j465744j878863k062004k054984
$$ 21386480 21764543 22264991 22574181 22379392 21522982 20057238 18178375 16116371 14061387
60975A4061387j918659j710181j477390j253129j051862q76264p26545o02259
$$ 14061387 12142728 10432547 8955157 7702028 6650166 5773902 5047357 4445098
60967D445098m99880m14412l43320k86298k42064k07852j81221j60180j42329
$$ 4445098 3945218 3530806 3187486 2901188 2659124 2451272 2270051 2109871 1967542
60958A967542j26012j11738j00436r0978q1242p0938o1354n2871m4887l7830l3049
$$ 1967542 1841530 1729792 1629356 1538378 1457136 1386198 1324844 1271973 1227086 1189256 1156207
60947A156207l0626k9272k8401k8354k8468k7092k4071k1378k0437k0416j9951
$$ 1156207 1125581 1096309 1067908 1039554 1011086 983994 959923 938545 918108 897692 877741
60936H77741j9126j8748j8797j8668j8184j7516j6679j5796j5246j4992j4346
$$ 877741 858615 839867 821070 802402 784218 766702 750023 734227 718981 703989 689643
60925F89643j2967j1538j0830j0582r872q381o795o005o207o706o653n999n489
$$ 689643 676676 665138 654308 643726 633854 625473 618678 612673 606466 599760 593107 587108 581619
60912E81619n501n380m530l619l795m913n614n102l921k944k523k750l499l993
$$ 581619 576118 570738 566208 562589 558794 553881 548267 543165 539244 536300 533777 531027 527528 523535
60898E23535l331j799p03o43q65p50q58j878l340m172m020l388k925l073l977
$$ 523535 520204 518405 517702 517059 516194 515444 514586 512708 509368 505196 501176 497788 494863 491790 487813
60883D87813n227n991n855n210m601m100l619l328l352l425l082k103o37P80J438
$$ 487813 482586 476595 470740 465530 460929 456829 453210 449882 446530 443105 440023 437920 437283 438063 439501
60868D39501J197Q65J254J986K076J619J820L201M795N519N385M883M092L039
$$ 439501 440698 441563 442817 444803 446879 448498 450318 453519 458314 463833 469218 474101 478193 481232
60854D81232K100J500J022O32P18J169J123K09p14p29j51J09k48r28j775k758
$$ 481232 483332 484832 485854 486486 487204 488373 489496 489705 488991 488262 488111 488220 487972 487044 485269 482511
60838D82511l711m651n854p185p982q084q186q605q573p539o300n859n888n362
$$ 482511 478800 474149 468295 461110 453128 445044 436858 428253 419680 412141 405841 399982 394094 388732
60824C88732m187l105k459k082k043k437k709k245j405j102j471j911k136k293
$$ 388732 384545 381440 378981 376899 374856 372419 369710 367465 366060 364958 363487 361576 359440 357147
60810C57147k174j444n34l17q35j196q18J8Q12J293J234O31M8P5N01P88J136K063
$$ 357147 354973 353529 352995 352678 351843 350647 349829 349847 350659 351952 353186 353817 353865 353940 354441 355229 356365 358428
60792C58428L089L004J678N03N84J415J844J526R04L89J14N1j17q47k097l122
$$ 358428 361517 364521 366199 366702 367286 368701 370545 372071 372975 373364 373478 373529 373412 372565 370468 367346
60776C67346l212k403j337o87p82j440k053k153j908j700j440q25j35j3l94m70
$$ 367346 364134 361731 360394 359707 358925 357485 355432 353279 351371 349671 348231 347406 347271 347258 346864 346394
60760C46394Q3O38O36L69K75J96j13l18k9L92L16q4N4J043K153K535K272K172
$$ 346394 346477 347115 347751 348120 348395 348591 348478 348160 348131 348523 348839 348755 348809 349852 352005 354540 356812 358984
60742C58984K658L194K904J526l81k077l206l718l656l170k494j680p05P6R4m92
$$ 358984 361642 364836 367740 369266 368885 366808 363602 359884 356228 353058 350564 348884 348179 348255 348349 347857
60726C47857o18K87J288J171K88J53J247K411K575K034J576J278Q04K75M2Nk08
$$ 347857 347239 347526 348814 349985 350273 350426 351673 354084 356659 358693 360269 361547 362351 362626 362668 362673 362465
60709C62465o01q57r13r65j056j044r97j157j532j761j548r83m55l05o56j380
$$ 362465 361864 361007 360094 359129 358073 357029 356032 354875 353343 351582 350034 349051 348596 348291 347635 346255
60693C46255k124k413j992j224q66j280j900j879j152m46j63J17Q30J674K094
$$ 346255 344131 341718 339726 338502 337636 336356 334456 332577 331425 330979 330816 330933 331763 333437 335531
60678C35531K085K016K028K060K145K253K138J856J981K708L143K231K00j629
$$ 335531 337616 339632 341660 343720 345865 348118 350256 352112 354093 356801 359944 362175 362375 360746
60664C60746k332k073j520j271j664k455k769k035p90N4M67J078J932K482K581
$$ 360746 358414 356341 354821 353550 351886 349431 346662 344627 343837 343891 344358 345436 347368 349850 352431
60649C52431K603K616K486K611L409M147L511J538k88j093j487j988k063j463
$$ 352431 355034 357650 360136 362747 366156 370303 373814 375352 375064 373971 372484 370496 368433 366970
60635C66970j206k157l549l985l279k294j514p71j9M48M68J15m08o59j82P72J301
$$ 366970 365764 363607 360058 356073 352794 350500 348986 348215 348196 348644 349112 349227 348819 348160 347978 348750 350051
60618C50051J035O55P92J011O10k56r31j200j212r22l80l3p9L1P23J447J488J073
$$ 350051 351086 351741 352533 353544 354154 353898 352967 351767 350555 349633 349253 349220 349141 349172 349895 351342 352830 353903
60600C53903Q10N76j1m59R7J361K100J857J404J369J502J527J720K184K344J707
$$ 353903 354713 355289 355278 354819 354916 356277 358377 360234 361638 363007 364509 366036 367756 369940 372284 373991
60584C73991O17j75k93J31P12R94P91N49R47J988K921L268L470M215N539O960
$$ 373991 374608 374433 374140 374271 374983 375977 376768 377317 378264 380252 383173 386441 389911 394126 399665 406625
60568D06625Q165R177R941J0231R973R496R265R385R353Q396O114K832o92l678
$$ 406625 414790 423967 433908 444139 454112 463608 472873 482258 491611 500007 506121 508953 508261 504583
60554E04583n507n861n090m217m079m478m423l294j423N03K202L755N071N887
$$ 504583 499076 493215 488125 483908 479829 475351 470928 467634 466211 466714 468916 472671 477742 483629
60540D83629O318P083Q806J1217J3413J4982J6475J8498K0725K2260K2624K1712
$$ 483629 489947 497030 505836 517053 530466 545448 561923 580421 601146 623406 646030 667742
60528F67742J9156J4620Q861L505n98m025p491j0682j2951j4329j5124j5051j3649
$$ 667742 686898 701518 710379 713884 713286 709261 701770 691088 678137 663808 648684 633633 619984
60515F19984j1254q809o905n583m810m439l882k540n23J572L517N537P756J0104
$$ 619984 608730 599921 593016 587433 582623 578184 574302 571762 571239 572811 576328 581865 589621 599725
60501E99725J2706J5804J9322K3018K6918L1120L5272L8770M1359M3040M3555
$$ 599725 612431 628235 647557 670575 697493 728613 763885 802655 844014 887054 930609
60490I30609M2555M0147L6734L2493K7621K2819J8725J4870J0051L762l514j1470
$$ 930609 973164 1013311 1050045 1082538 1110159 1132978 1151703 1166573 1176624 1180386 1176872 1165402
60478A165402k0414l0132l9183m5947m9920n1587n1495m9999m7441m4106m0074
$$ 1165402 1144988 1114856 1075673 1029726 979806 928219 876724 826725 779284 735178 695104
60467F95104l5559l1179k7535k4630k1971j9206j6457j4117j2373j0938r317p487
$$ 695104 659545 628366 600831 576201 554230 535024 518567 504450 492077 481139 471822 464335
60455D64335o139n847o196o173n452m646m237l902l256k643k621l031l158k690
$$ 464335 458196 452349 446153 439980 434528 429882 425645 421743 418487 415844 413223 410192 407034 404344
60441D04344k014j544j278j065r47j018j108r43n82m90j017j830k154j621p48
$$ 404344 402330 400786 399508 398443 397496 396478 395370 394427 393845 393355 392338 390508 388354 386733 385985
60426C85985l37n78r80j068q65o30m27r0M96J218J831K191K394K579K658K471
$$ 385985 385648 385070 384090 383022 382157 381527 381100 381010 381506 382724 384555 386746 389140 391719 394377 396848
60410C96848K201K294K710K671J647L23k5R14K094K435K002J655J839K212K257
$$ 396848 399049 401343 404053 406724 408371 408694 408669 409583 411677 414112 416114 417769 419608 421820 424077
60395D24077J979J848K194K806L163L070K867K983L367L553L182K299J245M03
$$ 424077 426056 427904 430098 432904 436067 439137 442004 444987 448354 451907 455089 457388 458633 459036
60381D59036K4J35O08J285J980K390K307J978J934K328K707K611K096J513J107
$$ 459036 459060 459195 459803 461088 463068 465458 467765 469743 471677 474005 476712 479323 481419 482932 484039
60366D84039J065J514K101K086J286N68Q22J807K641L159L968N309O672P648Q442
$$ 484039 485104 486618 488719 490805 492091 492659 493481 495288 497929 501088 505056 510365 517037 524685 533127
60351E33127R243R732R489Q544P222N713M017K105l7k285m256n581o361p071p908
$$ 533127 542370 552102 561591 570135 577357 583070 587087 589192 589155 586870 582614 577033 570672 563601 555693
60336E55693q414p962o537m942m097m117m159l500k595k609l772m885m794l731
$$ 555693 547279 539317 532780 527838 523741 519624 515465 511965 509370 506761 502989 498104 493310 489579
60322D89579k698k084j608j139p13M7J578L514M943N654O405P826R652J1168J1911
$$ 489579 486881 484797 483189 482050 481337 481384 482962 486476 491419 497073 503478 511304 520956 532124 544035
60307E44035J1902J1602J1639J2138J2396J1741J0501R492Q712P322M928J950
$$ 544035 555937 567539 579178 591316 603712 615453 625954 635446 644158 651480 656408 658358
60295F58358j392n505j0450j5173j8268j9156j8285j6542j4652j2779j0528p608
$$ 658358 656966 651461 641011 625838 607570 588414 570129 553587 538935 526156 515628 508020
60283E08020m526k247j194r52r08p29l56m6l19j336k421k842k864l295m151m638
$$ 508020 503494 501247 500053 499101 498193 497464 497108 497062 496743 495407 492986 490144 487280 483985 479834 475196
60267D75196m435m026l722l311k784k571k722k741k479k293k156j521l77M73N46
$$ 475196 470761 466735 463013 459702 456918 454347 451625 448884 446405 444112 441956 440435 440058 440531 441077
60252D41077J98k17p27r59j77J366K258J845J253J639K429K374J488Q24P83Q59
$$ 441077 441275 441058 440331 439372 439195 440561 442819 444664 445917 447556 449985 452359 453847 454671 455454 456313
60236D56313P10N99P91J208J548J392O03n7N87K491L981L683K214J159J091J540
$$ 456313 457023 457622 458413 459621 461169 462561 463164 463107 463694 466185 470166 473849 476063 477222 478313 479853
60220D79853K255L316M357M810M821N046N632O220O659O992O984O518O202O677
$$ 479853 482108 485424 489781 494591 499412 504458 510090 516310 522969 529961 536945 543463 549665 556342
60206E56342P566P962P796P775Q114Q298Q100P905P928P882P522O838N722M107
$$ 556342 563908 571870 579666 587441 595555 603853 611953 619858 627786 635668 643190 650028 655750 659857
60192F59857K482J480J008M73k31o68q47j340k332l326m008m640n444o218o795
$$ 659857 662339 663819 664827 665300 665069 664401 663554 662214 659882 656556 652548 647908 642464 636246 629451
60177F29451p257p514p215o294n107l958k998k516k681l002k823k397k612l562
$$ 629451 622194 614680 607465 601171 596064 592106 589108 586592 583911 580909 578086 575689 573077 569515
60163E69515m261m047l402k978k702k343k144k209j852n08J178J902J255K5q86
$$ 569515 565254 561207 557805 554827 552125 549782 547638 545429 543577 543069 544247 546149 547404 547429 546543
60148E46543j257j263r96m86J33O73J019J187J346J720K378L221M197N348O530
$$ 546543 545286 544023 543027 542541 542674 543347 544366 545553 546899 548619 550997 554218 558415 563763 570293
60133E70293P331P520P423P540P794P456O031M015K539K198K511K674K554K570
$$ 570293 577624 585144 592567 600107 607901 615357 621388 625403 627942 630140 632651 635325 637879 640449
60119F40449K790K802K497K420K945L640L861L586L205K894K680K767L094K976
$$ 640449 643239 646041 648538 650958 653903 657543 661404 664990 668195 671089 673769 676536 679630 682606
60105F82606J924O76N06J433J965R24j162k837l360l187l177l733m573n018m615
$$ 682606 684530 685206 685712 687145 689110 690034 688872 686035 682675 679488 676311 672578 668005 662987 658372
60090F58372l622k755k469k630k884l043l088l066l036k951k613j984j490j689
$$ 658372 654750 651995 649526 646896 644012 640969 637881 634815 631779 628828 626215 624231 622741 621052
60076F21052k630l815m707n020m666l881l334l608m525n334n701n976o483o974
$$ 621052 618422 614607 609900 604880 600214 596333 592999 589391 584866 579532 573831 567855 561372 554398
60062E54398p035o633o012n336m658m014l394k780k296k105k114j989j534q44
$$ 554398 547363 540730 534718 529382 524724 520710 517316 514536 512240 510135 508021 506032 504498 503654
60048E03654j03N66J059J419J949K915M080M930N379N918O840P677P679O754N665
$$ 503654 503551 504117 505176 506595 508544 511459 515539 520469 525848 531766 538606 546283 553962 560716 566381
60033E66381N269N560N636M688K936J297K20p08j884l079m050n168o773q417r418
$$ 566381 571650 577210 582846 587534 590470 591767 591987 591279 589395 586316 582266 577098 570325 561908 552490
60018E52490r888j0404j0881j0598r318p615o112n017m384m154l924l379k882
$$ 552490 542602 532198 521317 510719 501401 493786 487674 482657 478273 474119 470195 466816 463934
60005D63934k926l091k475j195m04n84q75n15P1J54j30j83J36O37J245J782J872
$$ 463934 461008 457917 455442 454247 453843 453259 452384 451869 451940 452094 451964 451781 451917 452554 453799 455581 457453
59988D57453J679K069L393M625M608L645K978L036L133K769K262J904J331J04
$$ 457453 459132 461201 464594 469219 473827 477472 480450 483486 486619 489388 491650 493554 494885 494989
59974D94989j564l009l804l989l920l909l976l831l267k459j686r02J47J449K621
$$ 494989 493425 490416 486612 482623 478703 474794 470818 466987 463720 461261 459575 458673 458820 460269 462890
59959D62890L349L672L789L752L430K743J863J144P51M79N4m11n42k74M5J85K87
$$ 462890 466239 469911 473700 477452 480882 483625 485488 486632 487383 487862 487916 487505 486963 486689 486734 486919 487206
59942D87206M94O28M91K31J06J29J74L25P31J318J806K103K433L082M017M810
$$ 487206 487700 488328 488819 489050 489156 489285 489459 489784 490515 491833 493639 495742 498175 501257 505274 510084
59926E10084M950M332L363K409J312k31j944l069l238k860k459k076j510q07j75
$$ 510084 515034 519366 522729 525138 526450 526219 524275 521206 517968 515108 512649 510573 509063 508256 508081
59911E08081L48Q62J430K097K878L592L877L589L002K444J928J278M85k40o83
$$ 508081 508429 509291 510721 512818 515696 519288 523165 526754 529756 532200 534128 535406 535891 535651 534968
59896E34968q47r82j306j608j288j07J310K133K367K774L751M878N594N815N735
$$ 534968 534121 533139 531833 530225 528937 528830 530140 532273 534640 537414 541165 546043 551637 557452 563187
59881E63187N534N395N405N349N049M895N329N804N194L515K268K417K860J825
$$ 563187 568721 574116 579521 584870 589919 594814 600143 605947 611141 614656 616924 619341 622201 624026
59867F24026p69l282m421m428m230m179l948l163j909p05n8N7J37N67J328K351
$$ 624026 623257 619975 615554 611126 606896 602717 598769 595606 593697 592992 592934 592991 593128 593695 595023 597374
59851E97374L727N385O887P931Q717R532J0313J0732J0396Q718N301Q84k642l792
$$ 597374 601101 606486 613373 621304 630021 639553 649866 660598 670994 679712 685013 685897 683255 679463
59837F79463k764p94J185K683L027J744n83k678l893m558n064n292n080m680m482
$$ 679463 676699 675905 677090 679773 682800 684544 683961 681283 677390 672832 667768 662476 657396 652716 648234
59822F48234m719n477o639p732q191p903p202o372n449m472l496k390j027L51
$$ 648234 643515 638038 631399 623667 615476 607573 600371 593999 588550 584078 580582 578192 577165 577516
59808E77516J273J599J589J437J124P01L52J23q9k53l02m27q73j439j612j289
$$ 577516 578789 580388 581977 583414 584538 585239 585591 585714 585625 585372 585070 584643 583770 582331 580719 579430
59792E79430r77j063j295j236r13p19q65j208j612k205l177m343n093m915l993
$$ 579430 578453 577390 576095 574859 573946 573227 572362 571154 569542 567337 564160 559817 554724 549809 545816
59777E45816l074k632k399j935j350j101j216j170n77L48J113J499J691J983K454
$$ 545816 542742 540110 537711 535776 534426 533325 532109 530939 530362 530710 531823 533322 535013 536996 539450
59762E39450K872K988K966L361M439N695O361O270N950N934O350P128Q195R323
$$ 539450 542322 545310 548276 551637 556076 561771 568132 574402 580352 586286 592636 599764 607959 617282
59748F17282J0151J0588J0946J1393J1520J0747R160P639O938O849O445N153L303
$$ 617282 627433 638021 648967 660360 671880 682627 691787 699426 706364 713213 719658 724811 728114
59735G28114J614L94m88j100j371j438j689k255k826l140l339l672m015m021l648
$$ 728114 729728 730122 729634 728534 727163 725725 724036 721781 718955 715815 712476 708804 704789 700768 697120
59720F97120l319l459l945m155l636k706k141k221k398k143j723j630j654j181
$$ 697120 693801 690342 686397 682242 678606 675900 673759 671538 669140 666997 665274 663644 661990 660809
59706F60809k19O36J260K198L603M760N039M713M404M279M163M096M324N003O048
$$ 660809 660590 661226 662486 664684 668287 673047 678086 682799 687203 691482 695645 699741 704065 709068 715116
59691G15116O987O977N596L613K330J983J643Q34K38L11L41l84j363j822k059
$$ 715116 722103 729080 734676 738289 740619 742602 744245 745079 745317 745628 745969 745585 744222 742400 740341
59676G40341k838m006m837n359o193p308p963p881p572p419p208o668n803m723
$$ 740341 737503 733497 728660 723301 717108 709800 701837 693956 686384 678965 671757 665089 659286 654563
59662F54563l607k752k264j790j012j11P30J771L094M036M072L765M018M687M922
$$ 654563 650956 648204 645940 644150 643138 643027 643757 645528 648622 652658 656730 660495 664513 669200 674122
59647F74122M516L863K879J150r28k434l385m735o705q301q854q871q900q605
$$ 674122 678638 682501 685380 686530 685602 683168 679783 675048 668343 660042 651188 642317 633417 624812
59633F24812p625o461n735n213m381l511l331l886m372m132l428l142l845n192
$$ 624812 617187 610726 604991 599778 595397 591886 588555 584669 580297 576165 572737 569595 565750 560558
59619E60558o222o389o060n835n705n326m780m361l849k804j539q72q27m39Q08
$$ 560558 554336 547947 541887 536052 530347 525021 520241 515880 512031 509227 507688 506816 505989 505550 506358
59604E06358K177K704K390J923J688J554J285P77J36k91j54N25J454K442L276
$$ 506358 508535 511239 513629 515552 517240 518794 520079 520856 520992 520701 520547 521072 522526 524968 528244
59589E28244L364K259N39n26m57o0k51j002j717k036j932j519j191j439k214k804
$$ 528244 531608 533867 534406 533880 533423 533363 533112 532110 530393 528357 526425 524906 523715 522276 520062 517258
59573E17258k711k291k200k557k934k934k481j764j082o40m24m18p18j182j252
$$ 517258 514547 512256 510056 507499 504565 501631 499150 497386 496304 495664 495240 494822 494104 492922 491670
59558D91670o12J76L24r7l60k09rJ34M85R67J207J396K132L267L932L987M380
$$ 491670 491058 491234 491558 491461 491101 490892 490883 491017 491502 492469 493676 495072 497204 500471 504403 508390 512770
59541E12770N673P178Q162R017J0649J3454J7327K1617K4341K2580J5092M228
$$ 512770 518443 525621 533783 542800 553449 566903 584230 605847 630188 652768 667860 672088
59529F72088n662j1635j3519j2648j0411p846n561l627j880m05M96P58O40M99
$$ 672088 666426 654791 641272 628624 618213 610367 604806 601179 599299 598894 599390 600148 600788 601287
59515F01287N52O83L82p31k275l452m121m910o105p235p945q460q713p968o054
$$ 601287 601839 602522 602904 602173 599898 596446 592325 587415 581310 574075 566130 557670 548957 540989 534935
59500E34935m142l430l609l549k935k282j711p97M54J439J786J685J396J058R75
$$ 534935 530793 527363 523754 520205 517270 514988 513277 512480 512934 514373 516159 517844 519240 520298 521273
59485E21273J466K307K857K761K209J533R99R24J560K768M061M973N260M963M447
$$ 521273 522739 525046 527903 530664 532873 534406 535405 536329 537889 540657 544718 549691 554951 559914 564361
59470E64361M132L931L280J997P03Q2M5M0j29k17n6K71N74O81O15P82J639K985
$$ 564361 568493 572424 575704 577701 578404 578486 578531 578571 578442 578225 578169 578440 579014 579695 580310 581092 582731 585716
59452E85716M093M690N210N873O251O109N875N750N177L845K411J408K70j601
$$ 585716 589809 594499 599709 605582 611833 617942 623817 629567 634744 638589 641000 642408 642678 641077
59438F41077l515m410m522m901n587n607m687l665l080k476j373N9J533L060M544
$$ 641077 637562 633152 628630 623729 618142 612535 607848 604183 601103 598627 597254 597313 598846 601906 606450
59423F06450N674O484P454Q876J0685J2855J5338J7611J9018J9659K0361K1771
$$ 606450 612124 618608 626062 634938 645623 658478 673816 691427 710445 730104 750465 772236
59411G72236K4043K7164L0508L2012K9014K0639Q959k411j0498j4034j3570j0977
$$ 772236 796279 823443 853951 885963 914977 935616 944575 942164 931666 917632 904062 893085
59399H93085p909m180J549Q913J4448J4065O769m485j5286k2640k5961k6328k5123
$$ 893085 885176 880996 882545 891458 905906 919971 926740 922255 906969 884329 858368 832040 806917
59386H06917k3110k0481j7528j4858j2756j0838q677o492m857l868l074k105j052
$$ 806917 783807 763326 745798 730940 718184 707346 698669 692177 687320 683452 680378 678273 677221
59373F77221j90L68O25N52J93j61j03M39J054J396J759K715M106M975M838M461
$$ 677221 677031 677399 678024 678576 678769 678608 678505 678944 679998 681394 683153 685868 689974 694949 699787 704248
59357G04248M859N892O649O907P295Q007Q402Q256Q499R954J1954J2983J2562
$$ 704248 709107 714999 721648 728555 735850 743857 752259 760515 769014 778968 790922 803905 816467
59344H16467J1725J1576J2001J2036J1144R655Q067O358M227J767m63k140l644
$$ 816467 828192 839768 851769 863805 874949 884604 892671 899029 903256 905023 904560 902420 898776
59331H98776n511p695r608j0927j1930j3032j4183j4887j4747j3864j2739j1810
$$ 898776 893265 885570 875962 865035 853105 840073 825890 811003 796256 782392 769653 757843
59319G57843j1171j0684j0254r826r285q593q015p821p794p372o338m999l656
$$ 757843 746672 735988 725734 715908 706623 698030 690015 682194 674400 667028 660690 655691 652035
59306F52035k354j243n68l7J171L350N823Q014J0313J3073J5175J4573J0312L400
$$ 652035 649681 648438 647870 647833 649004 652354 658177 666191 676504 689577 704752 719325 729637 733037
59292G33037m153j0569j4728j6305j5818j4183j2080r893q017o626n293l450j272
$$ 733037 728884 718315 703587 687282 671464 657281 645201 635308 627291 620665 615372 611922 610650
59279F10650M98J689K974M801O600P594P970Q767J0610J2951J4706J5427J5587
$$ 610650 611148 612837 615811 620612 627212 634806 642776 651543 662153 675104 689810 705237 720824
59266G20824J5694J5544J4641J3076J1424R822P856N505L418J945N59j211k955
$$ 720824 736518 752062 766703 779779 791203 801025 808881 814386 817804 819749 820308 819097 816142
59253H16142m066m718n390n940n908n394m841m216l232k149j540j481j684k244
$$ 816142 812076 807358 801968 796028 790120 784726 779885 775669 772437 770288 768748 767267 765583 763339
59239G63339l372m584n030m636m076l679l216k736k665l014l347l644m291n104
$$ 763339 759967 755383 750353 745717 741641 737962 734746 732010 729345 726331 722984 719340 715049 709945
59225G09945n291m740m422n082o328p384q017q234p754o464m934l930l607l536
$$ 709945 704654 699914 695492 690410 684082 676698 668681 660447 652693 646229 641295 637365 633758 630222
59211F30222l310k773j981j199p48o50o04l40J87R44J838K607L000L033K768K054
$$ 630222 626912 624139 622158 620959 620211 619561 618957 618617 618804 619748 621586 624193 627193 630226 632994 635048
59195F35048J003L74P97J685J718M93j053j935k071j783j169l54K56M13K58p0
$$ 635048 636051 636425 637222 638907 640625 641118 640065 638130 636059 634276 633107 632753 633009 633422 633680 633610
59179F33610n83r48n55N54J388J113P4o83o60k95k86q31j463j504p64L30J360
$$ 633610 633027 632079 631524 632078 633466 634579 634653 633970 633310 633015 632729 631898 630435 628931 628167 628497 629857
59162F29857K327L119L104J957N13j14r0n85k046l738n049o167p162p531p152
$$ 629857 632184 635303 638407 640364 640877 640763 640673 640088 638042 634304 629255 623088 615926 608395 601243
59147F01243o739o805o937o624o084n683n309m844m596m630m359l413k328j711
$$ 601243 594504 587699 580762 574138 568054 562371 557062 552218 547622 542992 538633 535220 532892 531181
59133E31181j352q64n97j073j894k110j469n07M43J580K978M275N166N753O272
$$ 531181 529829 528965 528368 527295 525401 523291 521822 521315 521758 523338 526316 530591 535757 541510 547782
59118E47782O844P549Q426R336R985J0201J0119J0025J0013R781Q960P720O780
$$ 547782 554626 562175 570601 579937 589922 600123 610242 620267 630280 640061 649021 656741 663521
59105F63521O533O422N625M132K662J602P48o2p18j310k117k976l355l220l126
$$ 663521 670054 676476 682101 686233 688895 690497 691245 691183 690465 689155 687038 684062 680707 677487 674361
59090F74361l272l121k306j268o52n54o82q51j042j353j978k961l929m625n419
$$ 674361 671089 667968 665662 664394 663742 663188 662506 661655 660613 659260 657282 654321 650392 645767 640348
59075F40348o681p774p690o623n851n823n601m508l223k611k547k515k539k752
$$ 640348 633667 625893 618203 611580 605729 599906 594305 589797 586574 583963 581416 578901 576362 573610
59061E73610k867k784k989l642l985l457k654k396k472k212j745j690j960j896
$$ 573610 570743 567959 564970 561328 557343 553886 551232 548836 546364 544152 542407 540717 538757 536861
59047E36861j377r33p74m69L14J238J648J267N19J78N01Q50N05k20l79K43R59
$$ 536861 535484 534551 533777 533308 533622 534860 536508 537775 538294 538472 538973 539823 540328 540108 539729 539972 540931
59030E40931J440K167L259M023M157M422N461O846Q035R383J1344J3367J4477
$$ 540931 542371 544538 547797 551820 555977 560399 565860 572706 580741 590124 601468 614835 629312
59017F29312J4466J3726J2437J0605Q479O250L775J128j088k553l714m912n693
$$ 629312 643778 657504 669941 680546 689025 695275 699050 700178 699090 696537 692823 687911 682218
59004F82218n613n010m272l098j203Q50K343L291L932M040L541L108L258L454
$$ 682218 676605 671595 667323 664225 663022 663872 666215 669506 673438 677478 681019 684127 687385 690839
58990F90839K956J917Q95o0r37j164n02J59k7n28l10N38J244J875L172N255P577
$$ 690839 693795 695712 696607 696547 695610 694446 693944 694103 694076 693548 693238 693776 695020 696895 700067 705322 712899
58973G12899R821J1881J3380J4224J5160J6739J8188J8417J7570J6544J5476J3992
$$ 712899 722720 734601 747981 762205 777365 794104 812292 830709 848279 864823 880299 894291
58961H94291J2335J0945R332O839M080K161P73j426m679p872j0290j2180j3658
$$ 894291 906626 917571 926903 933742 937822 939983 940756 939330 934651 926779 916489 904309 890651
58948H90651j4494j5052j6004j7057j7304j6801j6380j5938j4523j2148r915q133
$$ 890651 876157 861105 845101 828044 810740 793939 777559 761621 747098 734950 725035 716902
58936G16902o007l609k317k563k749j457O44K065K582K920L218L008K239J425
$$ 716902 710895 707286 704969 702406 699657 698200 698844 700909 703491 706411 709629 712637 714876 716301
58922G16301R49Q02P01K68n94j373j496j250j491k334k967k819k114j114K43J666
$$ 716301 717250 718052 718753 719021 718427 717054 715558 714308 712817 710483 707516 704697 702583 701469 701712 703378
58906G03378K530K924L807N636P704R271J0540J1915J3144J3781J3919J3840J3443
$$ 703378 705908 708832 712639 718275 725979 735250 745790 757705 770849 784630 798549 812389 825832
58893H25832J2607J1779J1651J2443J3753J4965J5719J6268J7220J8565J9238
$$ 825832 838439 850218 861869 874312 888065 903030 918749 935017 952237 970802 990040
58882I90040J8282J6147J3997J1965R255N902L092J400n4k151m562o534p988r113
$$ 990040 1008322 1024469 1038466 1050431 1059686 1065588 1068680 1070080 1070026 1067875 1063313 1056779 1048791 1039678
58868A039678r697r591r245r059q710p730o337n191m699m927n806p033q196r306
$$ 1039678 1029981 1020390 1011145 1002086 993376 985646 979309 974118 969419 964492 958686 951653 943457 934151
58854I34151j0754j2408j3412j3204j2338j1745j1561j1121r924q273p053o977
$$ 934151 923397 910989 897577 884373 872035 860290 848729 837608 827684 819411 812358 805381
58842H05381p904q958r567j0108j1074j1964j1758j0476r274q888q772q093o890
$$ 805381 797477 788519 778952 768844 757770 745806 734048 723572 714298 705410 696638 688545 681655
58829F81655n798n172m768m052k669q83M78R25J023J668K913M126N076O016O825
$$ 681655 675857 670685 665917 661865 659196 658313 658791 659716 660739 662407 665320 669446 674522 680538 687363
58814F87363P022O639O225N897N221M133L142K461J806J046L20n93k062l733m789
$$ 687363 694385 701024 707249 713146 718367 722500 725642 728103 729909 730955 731275 730682 728620 724887 720098
58799G20098n134n454o044o596p174q269r632j0178r438q159p173o533o019n501
$$ 720098 714964 709510 703466 696870 689696 681427 671795 661617 652179 644020 636847 630314 624295 618794
58785F18794m617l054j364m20M8J194L107M489M708M705N264N704N181L989K642
$$ 618794 614177 611123 609759 609339 609387 610581 613688 618177 622885 627590 632854 638558 643739 647728 650370
58770F50370P61j982m689o247o895p596q395q379p174n502m224l496k940k246
$$ 650370 651131 649149 644460 638213 631318 623722 615327 606948 599774 594272 590048 586552 583612 581366
58756E81366j521j067q69m90K57Q79R46Q50J137J481J242P25P46J255J584J842
$$ 581366 579845 578778 577909 577419 577676 578555 579501 580351 581488 582969 584211 584936 585682 586937 588521 590363
58740E90363K714L930M492M423M752N559N722M972M474M783M943M353L982M674
$$ 590363 593077 597007 601499 605922 610674 616233 621955 626927 631401 636184 641127 645480 649462 654136
58726F54136N684N853N145M147L215K850L700N344O225N653M750M745N541O583
$$ 654136 659820 665673 670818 674965 678180 681030 684730 690074 696299 701952 706702 711447 716988 723571
58712G23571P768Q652Q300O871N885N865N220K623r63l943o320q793j1010j2415
$$ 723571 731339 739991 748291 755162 761047 766912 772132 774755 773792 769849 763529 754736 743726 731311
58698G31311j3667j5514j7207j7670j7386j7438j7457j6273j3977j1686r773p920
$$ 731311 717644 702130 684923 667253 649867 632429 614972 598699 584722 573036 563263 555343
58686E55343o510o275o820o932o259n405m639l732k893k577k528j992q77K01Q61
$$ 555343 548833 542558 535738 528806 522547 517142 512503 508771 505878 503301 500773 498781 497904 498105 498966
58671D98966J229J524J961K694L320L193K722L425N853Q496R720R698R284Q085
$$ 498966 500195 501719 503680 506374 509694 512887 515609 519034 524887 533383 543103 552801 562085 570170
58657E70170N241J346k020m191n518o074n691m932m630m754m699m412m132l621
$$ 570170 575411 576757 574737 570546 565028 558954 553263 548331 543701 538947 534248 529836 525704 522083
58643E22083k697k023k191k618k472k065k027j840o41J032J829J606J390J545
$$ 522083 519386 517363 515172 512554 510082 508017 505990 504150 503509 504541 506370 507976 509366 510911
58629E10911J455Q49J72l68r27j289j105p15p69j124j127o94k03L84J332K374
$$ 510911 512366 513215 513387 513019 512092 510803 509698 508983 508214 507090 505963 505269 505066 505450 506782 509156
58613E09156L070L640M490N313N529N292N125M970M464L727L063K324J390P12
$$ 509156 512226 515866 520356 525669 531198 536490 541615 546585 551049 554776 557839 560163 561553 562265
58599E62265O18O70M35J94J82Mm31m61M2Q2p71j228n8K199M415O485Q501R699
$$ 562265 562883 563553 563988 564182 564364 564368 563937 563476 563518 563600 562829 561601 561543 563742 568157 574642 583143 592842
58581E92842R772R907J0884J1474J0424Q736Q014P900P240O525O902P858Q235
$$ 592842 602614 612521 623405 634879 645303 654039 662053 669953 677193 683718 690620 698478 706713
58568G06713Q601J0128J2149J3289J4251J6753K0388K3273K5248K7533K9641K9626
$$ 706713 715314 725442 737591 750880 765131 781884 802272 825545 850793 878326 907967 937593
58556I37593K7442K5044K2941J9500J4099Q292L275j338n583q357r306r396r049
$$ 937593 965035 990079 1013020 1032520 1046619 1054911 1058186 1056848 1051265 1042908 1033602 1024206 1015157
58543A015157p701n729m717n325o802r004j2711j7500k1414k3459k4490k5104
$$ 1015157 1007456 1001727 997010 991685 984883 975879 963168 945668 924254 900795 876305 851201
58531H51201k4682k3093k1346j9771j7454j4170j1104r012p431o245o149o905
$$ 851201 826519 803426 782080 762309 744855 730685 719581 710569 703138 696893 690744 683839
58519F83839o985n794m548m214m236l974l718l574k945j824j138j175j127o61
$$ 683839 676854 671060 666512 662298 658062 654088 650370 646796 643851 642027 640889 639714 638587 637926
58505F37926l88l55K35J250J369K63o53l97J81Rn92o58J14J434K770L397L106
$$ 637926 637538 637183 637418 638668 640037 640300 639647 639250 639431 639440 638848 638190 638304 639738 642508 645905 649011
58488F49011K922L874N350O018O082O865Q467R804J0816J2538J4883J6560J7299
$$ 649011 651933 655807 661157 667175 673257 680122 688589 698393 709209 721747 736630 753190 770489
58475G70489J8088J9015J9011J7863J6283J3867R404L453j790n536q878j1953
$$ 770489 788577 807592 826603 844466 860749 874616 884020 887473 885683 880147 871269 859316
58463H59316j3277j2427j0811r100o501l173p22O18K596N838Q763J0510J2253
$$ 859316 846039 833612 822801 813701 807200 804027 803305 803923 806519 812357 821120 831630 843883
58450H43883J4411J5240J3601J0662P509L477j688o387r505j1995j4635j6271
$$ 843883 858294 873534 887135 897797 905306 908783 907095 900708 891203 879208 864573 848302
58438H48302j5808j4113j2391j0497q095n757l799j724K48J072J052J971M135
$$ 848302 832494 818381 805990 795493 787398 781641 777842 776118 776366 777438 778490 780461 784596
58425G84596N727O022O653Q500R957R695Q602P479N393K008r55k432l836o361
$$ 784596 790323 796345 802998 811498 821455 831150 839752 847231 852624 854632 853677 851245 847409 841048
58411H41048q728r552r692j0299j0515r277p562o769o424n340l721k432j502o62
$$ 841048 832320 822768 813076 802777 792262 782985 775423 768654 762230 756890 753169 750737 749235 748573
58397G48573l4O34J969L500L984L730M333N599N363L187J294Q49M10o95o82J315
$$ 748573 748539 749173 751142 754642 758626 762356 766689 772288 777651 780838 782132 782981 783391 782696 782014 783329
58381G83329L346L955M407N791O791O444O222P305Q488Q699Q930R764R929R132
$$ 783329 786675 790630 795037 800828 807619 814063 820285 827590 836078 844777 853707 863471 873400 882532
58367H82532R301J0971J1702J0266R048R946J1301J1443J1884J3964J5650J4882
$$ 882532 891833 902804 914506 924772 933820 943766 955067 966510 978394 992358 1008008 1022890
58355A022890J3069J2183J1237Q789O104M648L260R41m46N30J770J220N83K060
$$ 1022890 1035959 1048142 1059379 1068168 1074272 1078920 1082180 1083121 1082675 1083205 1084975 1086195 1086778 1088838
58341A088838M313N213N836P891R924R999R615J1056J3196J3822J3774J4941J6406
$$ 1088838 1093151 1098364 1104200 1112091 1122015 1132014 1141629 1152685 1165881 1179703 1193477 1208418 1224824
58328A224824J6436J6095J6974J7501J5471J2169J0179R070P020M639L520L006
$$ 1224824 1241260 1257355 1274329 1291830 1307301 1319470 1329649 1338719 1345739 1350378 1353898 1356904
58316A356904J996J791L590N463N378M944O513R059J0483J1419J3110J4195J3418
$$ 1356904 1358900 1360691 1364281 1369744 1375122 1380066 1386579 1395638 1406121 1417540 1430650 1444845 1458263
58303A458263J2722J3914J5220J4841J4647J6369J7692J6473J5212J6710J8955
$$ 1458263 1470985 1484899 1500119 1514960 1529607 1545976 1563668 1580141 1595353 1612063 1631018
58292A631018J9156J9130K1359K3572K2785K1207K2279K4294K4000K3161K5176
$$ 1631018 1650174 1669304 1690663 1714235 1737020 1758227 1780506 1804800 1828800 1851961 1877137
58281A877137K8353K8938K7976K8795L0547L0593L0466L3063L6758L8532L9929
$$ 1877137 1905490 1934428 1962404 1991199 2021746 2052339 2082805 2115868 2152626 2191158 2231087
58270B231087M3476M6688M6365M5371M7986N2068N3149N2812N5210N8853N9890
$$ 2231087 2274563 2321251 2367616 2412987 2460973 2513041 2566190 2619002 2674212 2733065 2792955
58259B792955O0137O3532O7930O8940O8462P0740P3494P2161O9484P1280P6040
$$ 2792955 2853092 2916624 2984554 3053494 3121956 3192696 3266190 3338351 3407835 3479115 3555155
58248C555155P8452P9864Q5012R1734R4633R5871J01436J09820J15624J21110
$$ 3555155 3633607 3713471 3798483 3890217 3984850 4080721 4182157 4291977 4407601 4528711
58238D528711J32372J46981J57662J65446J76861J90858K01402K10297K24243
$$ 4528711 4661083 4808064 4965726 5131172 5308033 5498891 5700293 5910590 6134833
58229F134833K41791K56495K70149K89157L11176L29784L48749L76465M10116
$$ 6134833 6376624 6633119 6903268 7192425 7503601 7833385 8182134 8558599 8968715
58220H968715M41396M73707N16351N66289O14326O64979P30318Q08575Q90091
$$ 8968715 9410111 9883818 10400169 10966458 11580784 12245763 12976081 13784656 14674747
58211A4674747R79854J091466J223725J367817J532991J738911J988179K275379
$$ 14674747 15654601 16746067 17969792 19337609 20870600 22609511 24597690 26873069
58203B6873069K617850L046775L575883M215881N013515O035117P314936Q859125
$$ 26873069 29490919 32537694 36113577 40329458 45342973 51378090 58693026 67552151
58195F7552151J0688628J2828725J5274738J8038375K1220657K4964302K9331404
$$ 67552151 78240779 91069504 106344242 124382617 145603274 170567576 199898980
58188A99898980L4241756L9322113M3452265M4444339L9772655K8378436J2021438
$$ 199898980 234140736 273462849 316915114 361359453 401132108 429510544 441531982
58181D41531982n385828k0061065l0188841l5935163l8278454l8111993l6129339
$$ 441531982 436146154 416085089 385896248 349961085 311682631 273570638 237441299
58174B37441299l2978199k9243509k5359111k1620000j8225186j5270088j2754779
$$ 237441299 204463100 175219591 149860480 128240480 110015294 94745206 81990427
58167H1990427j0645511q911805p506525o360047n415902m644762m016117l487699
$$ 81990427 71344916 62433111 54926586 48566539 43150637 38505875 34489758 31002059
58159C1002059l031859k644557k319857k039646j794009j587193j416631j267418
$$ 31002059 27970200 25325643 23005786 20966140 19172131 17584938 16168307 14900889
58151A4900889j132660j018624r24912q39069p55633o81949o20566n63306n07096
$$ 14900889 13768229 12749605 11824693 10985624 10229991 9548042 8927476 8364170 7857074
58142G857074m58789m19765l81715l42202l09485k87381k69301k51282k37369
$$ 7857074 7398285 6978520 6596805 6254603 5945118 5657737 5388436 5137154 4899785
58133D899785k27954k15917j98819j83061j71980j61080j48498j39011j34032
$$ 4899785 4671831 4455914 4257095 4074034 3902054 3740974 3592476 3453465 3319433
58124C319433j28240j19597j12627j08747j03316r5186q9353q7140q3415p6502
$$ 3319433 3191193 3071596 2958969 2850222 2746906 2651720 2562367 2475227 2391812 2315310
58114B315310p1387o9980o7476o1677n6992n5814n4351n0496m7751m7924m7522
$$ 2315310 2243923 2173943 2106467 2044790 1987798 1931984 1877633 1827137 1779386 1731462 1683940
58103A683940m4715m2695m2990m2353l9207l6541l5783l4299l1257k9492k9405
$$ 1683940 1639225 1596530 1553540 1511187 1471980 1435439 1399656 1365357 1334100 1304608 1275203
58092A275203k7677k4034k2552k4080k4212k1099j8544j8869j9273j7962j7477
$$ 1275203 1247526 1223492 1200940 1176860 1152648 1131549 1113005 1094136 1074863 1056901 1039424
58081A039424j9144k0287j9550j9338k0436k0025j7373j5746j6414j6396j4473
$$ 1039424 1020280 999993 980443 961105 940669 920644 903271 887525 871111 854715 840242
58070H40242j3563j4791j5004j2840j1433j2457j3009j1256r723j0096j0016p970
$$ 840242 826679 811888 796884 784044 772611 760154 747145 735889 726166 716070 706054 698084
58058F98084o444p238q420q563r287j1105j1572j0073r648j1479j2443j0775r171
$$ 698084 691640 684402 675982 667419 658132 647027 635455 625382 615734 604255 591812 581037 571866
58045E71866r531r558p641o274p337q506p636o485o842p079n791m822n489n747
$$ 571866 562335 552777 545136 538862 531525 523019 515383 508898 502056 494977 489186 484364 478875 473128
58031D73128m250l425n207p464p808p459q136q677p906p510q772r671q334o315
$$ 473128 468878 465453 460246 452782 444974 437515 429379 420702 412796 405286 396514 386843 378509 372194
58017C72194n558n177m108l740m926n530m021k466k977m117l824l039l312l629
$$ 372194 366636 361459 357351 353611 348685 343155 339134 336668 333691 329574 325750 322711 319399 315770
58003C15770k642j485j402j188K20J214L89o30J0J401K384M179P566J0210R942
$$ 315770 313128 311643 310241 309053 309273 310487 310876 310246 310256 311657 314041 318220 325786 335996 345938
57988C45938Q273P444O554L872O58q06j059k042l506m004l842m192m670m434m122
$$ 345938 354211 361655 368209 372081 372739 371933 370874 368832 365326 361322 357480 353288 348618 344184 340062
57973C40062m280l649j391P81J198R92J762K543J821O03N97J110N84m27n83m21
$$ 340062 335782 332133 330742 331523 332721 333713 335475 338018 339839 340442 341039 342149 342733 342306 341723 341302
57957C41302j034j607j040n00j609l505m327m263m516m710l935l064l332l859
$$ 341302 340268 338661 337621 337121 335512 332007 327680 323417 318901 314191 310256 307192 303860 300001
57943C00001l101j566o48j0J389K932L536L922N233O598O608O037O479P391P056
$$ 300001 296900 295334 294686 294676 296065 298997 302533 306455 311688 318286 324894 330931 337410 344801 351857
57928C51857N563M243L053R56j772l943n473o961q077q323q459r155r362p977
$$ 351857 357420 361663 364716 365672 363900 359957 354484 347523 339446 331123 322664 313509 304147 296170
57914B96170n987m990m720m154l650l774l381j413O94R62J42L49J356J062r24
$$ 296170 290183 285193 280473 276319 272669 268895 265514 264101 264795 265757 265899 266248 267604 268666 267742
57899B67742k807l432l242k674j755r97q71p89j58L42L2k10N45J350R39L3Q1P48
$$ 267742 264935 261503 258261 255587 253832 252835 251964 251175 251017 251359 251391 251181 251726 253076 254015 254048 254129 254877
57881B54877Q35N87Q55J088M26k74J69Q71L26p86p51J50M64N10J705L542M084
$$ 254877 255712 256299 257154 258242 258668 258394 258563 259434 259760 258974 258223 258373 258837 259347 261052 264594 268678
57864B68678L148K385K447K611K950M283O034O618O004N695O200O600O471O154
$$ 268678 271826 274211 276658 279269 282219 286502 292536 299154 305158 310853 317053 323653 330124 336278
57850C36278N308L346J119P2o1p17j921k492k453k982m050m448m146m363n167
$$ 336278 341586 344932 346051 346123 346062 345345 343424 340932 338479 335497 331447 326999 322853 318490 313323
57835C13323n211m081k935k496k218j689j184p26q3L45J31MQ20J854J825J172
$$ 313323 308112 304031 301096 298600 296382 294693 293509 292783 292700 293045 293176 293180 294000 295854 297679 298851
57819B98851J353K305K663K230K104K556K782K615K522K105O31j241k250k789
$$ 298851 300204 302509 305172 307402 309506 312062 314844 317459 319981 322086 322717 321476 319226 316437
57805C16437m253o362p407p039o511o203n231l627k618k460k134j476j439k067
$$ 316437 312184 305822 298415 291376 284865 278662 273431 269804 267186 264726 262592 261116 259677 257610
57791B57610k263j903k072k830k840j636l66J92M90P25L84l50m94J28P63J407
$$ 257610 255347 253444 251372 248542 245702 244066 243700 243892 244382 245107 245491 245141 244647 244775 245538 246945
57775B46945K666L923L687K128J191J724K394J983Q57l75j820l305m093m159m301
$$ 246945 249611 253534 257221 259349 260540 262264 264658 266641 267498 267123 265303 261998 257905 253746 249445
57760B49445m602m294l416k952l079k890k099j347p22L05J349J445J061J767L606
$$ 249445 244843 240549 237133 234181 231102 228212 226113 224766 224044 224349 225698 227143 228204 229971 233577
57745B33577M825M536L685L085K566K446L547N203N444L926K573K557K799K355
$$ 233577 238402 242938 246623 249708 252274 254720 258267 263470 268914 272840 275413 277970 280769 283124
57731B83124K061K704L486L535L311L318L026K110J321J096O93l95j517k108k525
$$ 283124 285185 287889 291375 294910 298221 301539 304565 306675 307996 309092 309785 309390 307873 305765 303240
57716C03240k971l001k707k850l353l244k579k711l972n023n132n194n635n365
$$ 303240 300269 297268 294561 291711 288358 285114 282535 279824 275852 270829 265697 260503 254868 249503
57702B49503l856k389k046k159j927j808k057j650NJ693K099J555R53L55j57K71
$$ 249503 245647 243258 241212 239053 237126 235318 233261 231611 231616 233309 235408 236963 237916 238271 238114 238385
57686B38385J868L392L869L908M263M492M260M469N785P388Q614J0378J3557J7226
$$ 238385 240253 243645 247514 251422 255685 260177 264437 268906 274691 282079 290693 301071 314628 331854
57672C31854K0196K3134K7567L3615M0397M7754N5727O2543O4468N7926M1518
$$ 331854 352050 375184 402751 436366 476763 524517 580244 642787 707255 765181 806699
57661H06699J7026j0616l5202n2461o1590o3882o0993n4890m7869m1323l5257
$$ 806699 823725 813109 777907 725446 663856 599974 538981 484091 436222 394899 359642
57650C59642k9526k4541k0254j5849j1275p758n967n003m014l359l227k642j024
$$ 359642 330116 305575 285321 269472 258197 250439 244472 239469 235455 232096 228869 226227 225203
57637B25203N86J119R88Q95M65o20j449j183m38r9R9N62O62j55j231j911k669
$$ 225203 225789 226908 227896 228791 229256 228636 227187 226004 225566 225467 225566 226128 226790 226635 225404 223493 220824
57620B20824l755m076k936j581j371j685j249m49m75j184j659j990k652k950j971
$$ 220824 217069 212993 210057 208476 207105 205420 204171 203722 203247 202063 200404 198414 195762 192812 190841
57605A90841m81J3m23n13k1J68k05n74q56j431k053k194k143k449k674k103j260
$$ 190841 190360 190373 189950 189437 189416 189584 189379 188805 187949 186518 184465 182271 180128 177679 175005 172902 171642
57588A71642j280k118k756k872k826k480j481m41l67j096j627j760k011k229j827
$$ 171642 170362 168244 165488 162616 159790 157310 155829 155388 155021 153925 152298 150538 148527 146298 144471
57573A44471j150j169j861k306k245k249k342j913j052o65j051j511j514j261
$$ 144471 143321 142152 140291 137985 135740 133491 131149 129236 128184 127519 126468 124957 123443 122182
57559A22182j005o86l64j72J21P33J278J338J334J908K743K973K479J755Q61m54
$$ 122182 121177 120491 120127 119955 120076 120809 122087 123425 124759 126667 129410 132383 134862 136617 137478 137024
57543A37024j756k208j776j162o32Q5R05J305J146P68L80L8RL83O41L30j96l86
$$ 137024 135268 133060 131284 130122 129490 129575 130480 131785 132931 133699 134079 134117 134126 134509 135150 135480 135284 134898
57525A34898l48m24m17j75k17q22j152l99P70J131P09M33N44O45Q83J590K138
$$ 134898 134550 134126 133709 133534 133317 132495 131343 130944 131714 132845 133554 133987 134531 135176 136059 137649 139787
57508A39787J618N22K29R55J523J218N75K12M1j66m57r51j596j874j568j467k278
$$ 139787 141405 141927 142156 143111 144634 145852 146427 146639 146680 146514 146057 145106 143510 141636 140068 138601 136323
57491A36323l301l340k568k105k071j577n26N8k38o11l75J33L31J58r2n6M92J100
$$ 136323 133022 129682 127114 125009 122938 121361 120835 120893 120655 120044 119669 119802 120133 120291 120199 120143 120635 121735
57473A21735P02r09k338k403j942k359l110k555q82l9o86j364j048n10n17n43
$$ 121735 122437 121528 119190 116787 114845 112486 109376 106821 105939 105900 105214 103850 102802 102292 101775 101232
57457A01232k22l39j278j881j059M63J180P49o6o85r87p90o1P17R88P90M97K29
$$ 101232 101010 100671 99393 97512 96453 96916 98096 98845 98779 98094 97107 96317 96256 96973 97961 98751 99248 99477
57439I9477j16m84o78n47p5N25Q17N71J65J92P49J470J978J979J316M29L05J190
$$ 99477 99361 98877 98199 97652 97577 98102 98919 99490 99655 99847 100596 102066 104044 106023 107339 107768 108073 109263
57421A09263J924J355k1q81j009j199j582j442o95j10N3M07J196J853K063K183
$$ 109263 111187 112542 112521 111640 110631 109432 107850 106408 105713 105603 105656 106063 107259 109112 111175 113358
57405A13358K271J754N26n98j015j123j539k192k574k369j569n36K5k95r16q67
$$ 113358 115629 117383 117909 117311 116296 115173 113634 111442 108868 106499 104930 104394 104419 104124 103208 102341
57389A02341m2Q04J252J653K278K891L242L330L084K423J641J158R83Q74Q27P82
$$ 102341 102299 103103 104355 106008 108286 111177 114419 117749 120833 123256 124897 126055 127038 127912 128739 129521
57373A29521K51r79k121k294j804j636j994k330k473k607k463j738j080j349k093
$$ 129521 129772 128793 126672 124378 122574 120938 118944 116614 114141 111534 109071 107333 106253 104904 102811
57358A02811j987p94M07Q98J008J053Q88N69L81J31m43p27MJ067R72l73j515j621
$$ 102811 100824 100030 100437 101335 102343 103396 104284 104853 105234 105365 104922 104195 104199 105266 106238 105865 104350 102729
57340A02729j316j223j107q48q23r50o03J81O22N49O04Q70O81N0j33K85K88n71
$$ 102729 101413 100190 99083 98235 97412 96462 95859 96040 96662 97211 97815 98685 99366 99416 99283 99568 99856 99285
57322I9285j388j409j036q12n51q3K40L21N98J103J278J087J193J692J838J378
$$ 99285 97897 96488 95452 94640 94089 94006 94246 94567 95165 96268 97546 98633 99826 101518 103356 104734
57306A04734J011J138J259J010O29J79n39j069o36M15R11P84J162K241K757K137
$$ 104734 105745 106883 108142 109152 109781 109960 109421 108352 107716 108131 109042 109826 110988 113229 115986 118123
57290A18123J448J552J928K013K138K425K331J982K363L379L478K135R56J215
$$ 118123 119571 121123 123051 125064 127202 129627 131958 133940 136303 139682 143160 145295 146251 147466
57276A47466J955J876J371J296J169K39q98j306j317j715k280k481k651l092l043
$$ 147466 149421 151297 152668 153964 155133 155372 154474 153168 151851 150136 147856 145375 142724 139632 136589
57261A36589j917o90o17j363j765j660j607j481q08P0M46M10M42M26R4j19K44
$$ 136589 134672 133982 133365 132002 130237 128577 126970 125489 124681 124751 125197 125607 126049 126475 126569 126450 126694
57244A26694P04O19K33P2k4k08J93J665L355M147M161M061L619K370J102J136
$$ 126694 127398 128017 128250 128322 128298 128090 128283 129948 133303 137450 141611 145672 149291 151661 152763 153899
57228A53899K375L359L176K230J267O65O51J321K455L766N147O281O629O288O188
$$ 153899 156274 159633 162809 165039 166306 166971 167622 168943 171398 175164 180311 186592 193221 199509 205697
57213B05697O784P242O667N489M851N247O378P713Q533Q226P190O677P126P545
$$ 205697 212481 219723 226390 231879 236730 241977 248355 256068 264601 272827 280017 286694 293820 301365
57199C01365P180O687O867P370P630P938Q594R040Q957R132J0142J1154J1252
$$ 301365 308545 315232 322099 329469 337099 345037 353631 362671 371628 380760 390902 402056 413308
57186D13308J0907J0925J1013J0714J0690J1660J2999J3838J4644J6139J7635
$$ 413308 424215 435140 446153 456867 467557 479217 492216 506054 520698 536837 554472
57175E54472J8098J8094J8935K0544K1829K2654K3711K4875K5310K4954K4485
$$ 554472 572570 590664 609599 630143 651972 674626 698337 723212 748522 773476 797961
57164G97961K4121K3737K3654K3967K3745K2249K0398J9528J9378J8845J8110
$$ 797961 822082 845819 869473 893440 917185 939434 959832 979360 998738 1017583 1035693
57153A035693J8272J9426K0822K2582K5563K9889L5155M1500M8574N3969N4781
$$ 1035693 1053965 1073391 1094213 1116795 1142358 1172247 1207402 1248902 1297476 1351445 1406226
57142A406226N0994M5602M1410L9000L7485L5659L2917L0928L4020M5680O4366
$$ 1406226 1457220 1502822 1544232 1583232 1620717 1656376 1689293 1720221 1754241 1799921 1864287
57131A864287Q4287J00181J09845J12833J09650J02760R5981R1751R0069R0370
$$ 1864287 1948574 2048755 2158600 2271433 2381083 2483843 2579824 2671575 2761644 2852014
57121B852014R2637R6512J01118J06316J12539J18920J23276J24628J24562J25698
$$ 2852014 2944651 3041163 3142281 3248597 3361136 3480056 3603332 3727960 3852522 3978220
57111C978220J30010J38652J51779J68224J86914K08937K36922K72343L15147
$$ 3978220 4108230 4246882 4398661 4566885 4753799 4962736 5199658 5472001 5787148
57102E787148L66175M28268N04789N98830P13809Q52665J015739J201003J406206
$$ 5787148 6153323 6581591 7086380 7685210 8399019 9251684 10267423 11468426 12874632
57093A2874632J628435J861456K096487K326633K548204K757156K947291L113082
$$ 12874632 14503067 16364523 18461010 20787643 23335847 26093003 29040294 32153376
57085C2153376L250919L356370L424586L454910L446074L374939L179863K778734
$$ 32153376 35404295 38760665 42185251 45640161 49086235 52461174 55641037 58419771
57077E8419771K119691J224457J87483q65815j827045k629884l248766l684395
$$ 58419771 60539462 61763919 61951402 61085587 59258542 56628658 53379892 49695497
57069D9695497l949333m059751m033893l893987l666807l380481l060121k726276
$$ 49695497 45746164 41686413 37652520 33758533 30091726 26711245 23651124 20924848
57061B0924848k396229k084521j801335j551561j336541j155938j007330q85586
$$ 20924848 18528619 16444098 14642763 13091202 11754661 10598723 9591393 8705807
57053H705807p84791p00698o30279n69849n15702m66412m22515l83697l48077
$$ 8705807 7921016 7220318 6590039 6020190 5504488 5038076 4615561 4231864 3883787
57044C883787l14514k83702k56325k31729k09114j88544j69938j52446j35610
$$ 3883787 3569273 3285571 3029246 2797517 2588403 2399859 2229921 2077475 1941865
57035A941865j19978j05752r2086p8482o5594n3776m2052k9359j5559m28J6429
$$ 1941865 1821887 1716135 1624049 1545567 1479973 1426197 1384145 1354786 1339227 1338799 1355228
57024A355228L2673M1502L5652J3878j7277m8065p1238q4262q8231q5739p9252
$$ 1355228 1387901 1429403 1465055 1478933 1461656 1413591 1342353 1258091 1169860 1084121 1004869
57013A004869p0574o1223n2592m5384l9327l3939k9248k5442k2319j9619j7511
$$ 1004869 934295 873072 820480 775096 735769 701830 672582 647140 624821 605202 587691
57002E87691j6227j5521j4935j4309j3660j2860j1820j0790j0076r606r000p874
$$ 587691 571464 555943 541008 526699 513039 500179 488359 477569 467493 457887 448887 441013
56990D41013o079l855j789j79J429L663O294Q451R592R548P697L288l128r596
$$ 441013 434934 431079 429290 429111 430540 434203 440497 448948 458540 468088 475785 479073 475945 466349
56976D66349j4439j7335j8547j8155j6546j4689j3115j1310q792o173m329l048
$$ 466349 451910 434575 416028 397873 381327 366638 353523 342213 333421 327248 322919 319871
56964C19871j318J292M196O771R209J2247J6175K0157K2620K2289J8738J2062
$$ 319871 318553 319845 324041 330812 340021 352268 368443 388600 411220 433509 452247 464309
56952D64309K833p191j5266j9641k1012k1085k0265j7978j4661j1751r624p198
$$ 464309 467142 459951 444685 425044 404032 382947 362682 344704 330043 318292 308668 301470
56940C01470l864l90K546N268Q124J0841J3525J7109K2011K7250L1251L2572K9607
$$ 301470 297606 297216 299762 305030 313154 323995 337520 354629 376640 403890 435141 467713 497320
56927D97320K1127Q120n985j7788k5967l0555l1682k9984k7128k4629k2568k0316
$$ 497320 518447 526567 520582 502794 476827 446272 414590 384606 357478 332849 310281 289965
56915B89965j7844j5639j3912j2590j1561j0415q614o436m981m728m868m555l933
$$ 289965 272121 256482 242570 229980 218419 208004 199390 192954 187973 183245 178377 173822 169889
56902A69889l304k307p64N46R60J146K268M393O590Q265R682J1415J3863J7070
$$ 169889 166585 164278 163514 164060 165020 166166 168434 172827 179417 187682 197364 208779 222642 239712
56888B39712K0629K3959K6845K9181L0187K8517K3535J5920P013j723q699j2876
$$ 239712 260341 284300 311145 340326 370513 399030 422565 438485 445498 443775 435076 422200
56876D22200j4722j5504j5406j3465r594n261j651J603N241R234J3507J8501K4157
$$ 422200 407478 391974 376568 363103 353509 348248 346597 348200 353441 362675 376182 394683 418840
56863D18840K9519L4326L9841M6952N4048N7631N4543M3406K5328M114j5335l0006
$$ 418840 448359 482685 522526 569478 623526 681157 735700 779106 804434 808548 793213 763207
56851G63207l9720m4975m5394m1119l4136k6697j9347j1633l801L566J0713J8251
$$ 763207 723487 678512 633118 591999 557863 531166 511819 500186 496385 499951 510664 528915
56839E28915K6214L4617M4141N5122O6580P7262Q6538R2659R1022P6453M7962
$$ 528915 555129 589746 633887 689009 755589 832851 919389 1012048 1103070 1179523 1227485
56828A227485J0709k6670n6522p5209q3487q4296p9939p1496o0476m9317l9428
$$ 1227485 1238194 1211524 1155002 1079793 996306 912010 832071 760575 700099 650782 611354
56817F11354l0086k0267j0457j566O727J5223K3781L2079M0866N0899O0848O7399
$$ 611354 581268 561001 550544 548978 555705 570928 594709 626788 667654 718553 779401 846800
56805H46800O7008N7112L7082R660j9211m3603o0661p0156p2460o8519o0745n1897
$$ 846800 913808 970920 1008002 1017662 998451 954848 894187 824031 751571 683052 622307 570410
56793E70410m3226l4803k7033k0458j4669q947l527J145N819J1680J8512K5067
$$ 570410 527184 492381 465348 444890 430221 421274 417747 418892 424711 436391 454903 479970
56781D79970L0697L5051L6477L2509K2275P459q944k3857l4684m0284m1628m0589
$$ 479970 510667 545718 582195 614704 636979 644438 635494 611637 576953 536669 495041 454452
56769D54452l8214l4775l0869k7233k3885k0570j7610j5302j3090j0507q321p441
$$ 454452 416238 381463 350594 323361 299476 278906 261296 245994 232904 222397 214076 206635
56757B06635p277o577n401m751m694m423l873l736l968l733k816j828j125n87
$$ 206635 199358 192781 187380 182629 177935 173512 169639 165903 161935 158202 155386 153558 152433 151846
56743A51846l69o79j060r43o15o12o56l55l01j092j879j441k32K97M5J56Q65J164
$$ 151846 151477 150798 149738 148795 148180 147568 146912 146557 146256 145164 143285 141844 141612 141909 141954 142110 142975 144139
56725A44139P07K88L71O04R85J975L225L576K633J233J63n51j027j176j015n32
$$ 144139 144846 145134 145505 146109 147094 149069 152294 155870 158503 159736 159899 159348 158321 157145 156130 155598
56709A55598N15J890K556K063J498J833K157J176l56o28L12P42J12l40Q5O54Q92
$$ 155598 156113 158003 160559 162622 164120 165953 168110 169286 168930 168302 168614 169356 169468 169128 169213 169867 170759
56692A70759J282J933K174J850J565J425R67L73L08N13J44m61p1J230J963J571
$$ 170759 172041 173974 176148 177998 179563 180988 181955 182328 182636 183149 183293 182832 182761 183991 185954 187525
56676A87525J083J101R00L8q15j181j403j502r21R7L58m47j162r04j24N04R10
$$ 187525 188608 189709 190609 190647 189832 188651 187248 185746 184825 184922 185280 184833 183671 182767 182643 183147 184057
56659A84057R49K36q00j079m76r1m88r87r91o98j76P94J670J444M22J46J042J648
$$ 184057 185006 185242 184442 183363 182887 182796 182308 181321 180330 179632 179456 180250 181920 183364 183786 183932 184974 186622
56641A86622Q65m52r18l73N25J288J482P00o89j626j644j190n88K34Q14L50q56
$$ 186622 187487 187035 186117 185744 186269 187557 189039 189739 189050 187424 185780 184590 184002 184236 185050 185400 184544
56624A84544j485j068n17m27k95J57K83k54q22r27r07j029j041r80j192j342o26
$$ 184544 183059 181991 181474 181047 180752 180909 181192 180938 180116 179189 178282 177253 176212 175232 174040 172698 172072
56607A72072P12J398R87L33n1o10j385j543p89J26P44J327J652J020j04j76J067
$$ 172072 172784 174182 175169 175502 175451 174841 173456 171913 171124 171250 171994 173321 174973 175993 175889 175713 176780
56590A76780J942J336K50j3K57J67j95j92K84R90J800K408K419K027J679J116
$$ 176780 178722 180058 180308 180295 180552 180719 180524 180332 180616 181606 183406 185814 188233 190260 191939 193055
56574A93055j22j238q25R16K243K397K319K625K783K806L771N859P675Q342Q683
$$ 193055 192933 191695 190870 191786 194029 196426 198745 201370 204153 206959 210730 216589 224264 232606 241289
56559B41289R555J0698J1810J3005J3428J1335O623J592j756l630m807n019m175
$$ 241289 250844 261542 273352 286357 299785 311120 317743 319335 317579 313949 309142 304123 299948
56546B99948l457l765m343m153l479l102l023k936k936l006k870k767l236l817
$$ 299948 296491 292726 288383 284230 280751 277649 274626 271690 268754 265748 262878 260111 256875 253058
56532B53058l484k486k041k007j003Q44J600O24m65o53q49j368p90J284K857K470
$$ 253058 249574 247088 245047 243040 242037 242881 244481 245105 244640 243987 243138 241770 240980 242264 245121 247591
56516B47591J306O93Lj350k087j327n12j088k143k336k249k744k888j734m33l71
$$ 247591 248897 249590 249593 248243 246156 244829 244317 243229 241086 238750 236501 233757 230869 229135 228702 228331
56500B28331p67l36K21l38j389j671j601k120k589k046j273j359j474l42J187
$$ 228331 227564 227228 227449 227111 225722 224051 222450 220330 217741 215695 214422 213063 211589 211247 212434
56485B12434J381M94O7L00K55k6K05P26P89O06P00O31Nl74P0L48k78o14L82J407
$$ 212434 213815 214309 214376 214676 214931 214905 215110 215836 216625 217231 217931 218562 218567 218193 218263 218611 218333 217719 218101 219508
56465B19508R07j08J78J172J072J39m2L48j23j117r24M55J281J015Q05J138J309
$$ 219508 220415 220307 220485 221657 222729 222868 222826 223174 223051 221934 221010 221465 222746 223761 224566 225704 227013
56448B27013J253J693K441K517J971J779J960J578M95m90j058j381j144j56O23
$$ 227013 228266 229959 232400 234917 236888 238667 240627 242205 242700 242210 241152 239771 238627 238471 239094
56433B39094K37o36p82n26r01j554j359n23j10j05K04N06J05l53J86J151J205
$$ 239094 239331 238695 237913 237387 236486 234932 233573 233050 232940 232835 233039 233545 233650 233297 233483 234634 235839
56416B35839N79M68P45L74l95m37O5k6n88m98K36O21O25R66J342Q66NP1J023J658
$$ 235839 236418 236886 237631 238005 237610 237173 237238 237212 236624 236126 236362 236983 237608 238574 239916 240782 240787 240858 241881 243539
56396B43539J680J714J604P01m40n16N52J725K490K790K063K02j243p85P16J358
$$ 243539 245219 246933 248537 249238 248798 248282 248834 250559 253049 255839 257902 258104 256861 256076 256792 258150
56380B58150R86O90N06j71o77J8J150J191M16J40K29k26n85L78J877K171J554
$$ 258150 259136 259826 260332 260161 259484 259502 260652 261843 262259 262399 262628 262402 261817 262195 264072 266243 267797
56363B67797J558J901J222K71J105L278M041K592J063J008J643K011K262K344
$$ 267797 269355 271256 272478 272749 273854 277132 281173 283765 284828 285836 287479 289490 291752 294096
56349B94096J749R70J032J514J118N7l13Q6L26O55J852K948K380J085J378L105
$$ 294096 295845 296815 297847 299361 300479 300536 300223 300309 300635 301290 303142 306090 308470 309555 310933 314038
56333C14038L946L441L374M130M053K769J971K344K734K843L746N134N082L260
$$ 314038 317984 321425 324799 328929 332982 335751 337722 340066 342800 345643 349389 354523 359605 362865
56319C62865J567R42L12p49j112m98o2n7M62J179O21r23j337r2J179J820K909
$$ 362865 364432 365374 365686 364937 363825 363327 363265 363208 363670 364849 365470 364547 363210 363118 364297 366117 369026
56302C69026M428M824M060M070N391O308O009N693N844N476M699M988O217O522
$$ 369026 373454 378278 382338 386408 391799 398107 404116 409809 415653 421129 425828 430816 437033 443555
56288D43555N767N865P051P311O340O404Q255R716R696R925J1315J2151J1603
$$ 443555 449322 455187 462238 469549 475889 482293 490548 500264 509960 519885 531200 543351 554954
56275E54954J1515J2977J4366J4627J5239J7076J8548J8829J9770K2519K5261
$$ 554954 566469 579446 593812 608439 623678 640754 659302 678131 697901 720420 745681
56264G45681K6571K8073L1465L5549L8634M1494M5660N0988N6953O4278P3364
$$ 745681 772252 800325 831790 867339 905973 947467 993127 1044115 1101068 1165346 1238710
56253A238710Q3151R3122J04328J17057J29888J42405J56116J71152J84920J95711
$$ 1238710 1321861 1414983 1519311 1636368 1766256 1908661 2064777 2235929 2420849 2616560
56243B616560K04768K12864K17780K17401K12577K04528J91904J72861J47911
$$ 2616560 2821328 3034192 3251972 3469373 3681950 3886478 4078382 4251243 4399154
56234D399154J18572Q5206M8354J0243k6973o2692r6024j24717j47490j65391
$$ 4399154 4517726 4602932 4651286 4661529 4634556 4571864 4475840 4351123 4203633 4038242
56224D038242j79311j88454j92634j93597j92473j88433j81364j73161j64902
$$ 4038242 3858931 3670477 3477843 3284246 3091773 2903340 2721976 2548815 2383913
56215B383913j55418j44344j33594j24117j14190j02956r2618q4985p8645p1733
$$ 2383913 2228495 2084151 1950557 1826440 1712250 1609294 1516676 1431691 1353046 1281313
56205A281313o4821n8974n3561m8115m3636m0197l6058l1019k7549k6623k5682
$$ 1281313 1216492 1157518 1103957 1055842 1012206 972009 935951 904932 877383 850760 825078
56194H25078k2895k0070j8917j7902j5537j3444j3098j2692j0374p661o544n983
$$ 825078 802183 782113 763196 745294 729757 716313 703215 690523 680149 672488 665944 659961
56182F59961m409l075l683n114n502n215n041l875j103J197J293N90Q48J243P76
$$ 659961 655552 652477 648794 643680 638178 632963 627922 624047 622944 624141 625434 626024 626872 628115 628891
56167F28891P57K143L263K963L119N202P379P897Q174R534J0235Q979Q030R354
$$ 628891 629648 631791 635054 638017 641136 646338 653717 661614 669788 679322 689557 698536 706566 715920
56153G15920J0978J0738J0324J1778J3383J3143J3115J5994K0338K3581K7032
$$ 715920 726898 737636 747960 759738 773121 786264 799379 815373 835711 859292 886324
56142H86324L3361M1669M9379N6704O4833P2085P5991P6964P5953P1156O1459
$$ 886324 919685 961354 1010733 1067437 1132270 1204355 1280346 1357310 1433263 1504419 1565878
56131A565878N0512M2902L8512L4856L2146L1281K9469K3129J3422M286l170r912
$$ 1565878 1616390 1659292 1697804 1732660 1764806 1796087 1825556 1848685 1862107 1866393 1863223 1853311
56119A853311j4911j6674j7197j9903k5275l2332m1909n4060o4749o9881p0480
$$ 1853311 1838400 1821726 1804529 1784626 1759351 1727019 1685110 1631050 1566301 1496420 1425940
56108A425940o9484o6113n8439m8889m1614l6426l0484k4069j9474j6092j1875
$$ 1425940 1356456 1290343 1231904 1183015 1141401 1104975 1074491 1050422 1030948 1014856 1002981
56097A002981p900o305n613l124r5O17M6J068K910K972K193L236N264N759N622
$$ 1002981 995081 988776 983163 980039 979944 980561 980607 981675 984585 987557 989750 992986 998250 1004009 1009631
56082A009631P148R071Q907Q001Q925J0239R354Q059R350J1487J1272J0501J2672
$$ 1009631 1016779 1025850 1034757 1042758 1051683 1061922 1071276 1079335 1088685 1100172 1111444 1121945 1134617
56069A134617J5890J5947J4091J4688J7181J7544J5945J5863J7156J7025J6301
$$ 1134617 1150507 1166454 1180545 1195233 1212414 1229958 1245903 1261766 1278922 1295947 1312248
56058A312248J7868K0344K0228J8613J8995K0280J9023J6588J6737J8180J7065
$$ 1312248 1330116 1350460 1370688 1389301 1408296 1428576 1447599 1464187 1480924 1499104 1516169
56047A516169J4801J5656J8496J8937J7817J9294K2377K2735K1233K2247K5092
$$ 1516169 1530970 1546626 1565122 1584059 1601876 1621170 1643547 1666282 1687515 1709762 1734854
56036A734854K5746K5351K8192L2834L4298L3504L5428L9439M0769M0027M1757
$$ 1734854 1760600 1785951 1814143 1846977 1881275 1914779 1950207 1989646 2030415 2070442 2112199
56025B112199M5023M5116M3110M3863M6294M5778M4389M7985N4795N7906N7674
$$ 2112199 2157222 2202338 2245448 2289311 2335605 2381383 2425772 2473757 2528552 2586458 2644132
56014B644132O0294O5550O7764O7741P1640P8850Q3019Q4265Q8220R4101R6341
$$ 2644132 2704426 2769976 2837740 2905481 2977121 3055971 3138990 3223255 3311475 3405576 3501917
56003C501917R6750J02024J10571J15270J17906J26523J39912J49527J55562J65721
$$ 3501917 3598667 3700691 3811262 3926532 4044438 4170961 4310873 4460400 4615962 4781683
55993D781683J79288J88601J95151K07438K23895K35505K44310K60788K83762
$$ 4781683 4960971 5149572 5344723 5552161 5776056 6011561 6255871 6516659 6800421
55984F800421L02493L17990L41766L73795M03297M31215M69247N16378N60342
$$ 6800421 7102914 7420904 7762670 8136465 8539762 8970977 9440224 9956602 10516944
55975A0516944O03000O59255P30037Q02826Q79813R77345J096411J224159J366259
$$ 10516944 11119944 11779199 12509236 13312062 14191875 15169220 16265631 17489790 18856049
55966A8856049J545595J767388K021163K319737K698795L176514L756929M476428
$$ 18856049 20401644 22169032 24190195 26509932 29208727 32385241 36142170 40618598
55958D0618598N398944O558558P954826R604976J1541519J3761417J6258367J9116640
$$ 40618598 46017542 52576100 60530926 70135902 81677421 95438838 111697205 130813845
55950A30813845K2487814K6456449L0977585L5797703M0056388M1827573L8541799
$$ 130813845 153301659 179758108 210735693 246533396 286589784 328417357 366959156
55943C66959156K8630710J3137205m421639k0007637l1072692l7093153l8829995
$$ 366959156 395589866 408727071 404305432 384297795 353225103 316131950 277301955
55936B77301955l7472065l4228458l0142166k5927741k1953757j8392362j5333870
$$ 277301955 239829890 205601432 175459266 149531525 127577768 109185406 93851536
55929I3851536j2783173j0668366q916784p490544o344420n408239m630276l994039
$$ 93851536 81068363 70399997 61483213 53992669 47648249 42240010 37609734 33615695
55921C3615695l478407l041797k657994k330119k056628j816361j597461j409344
$$ 33615695 30137288 27095491 24437497 22107378 20050750 18234389 16636928 15227584
55913A5227584j254762j117896r89836q79681p91095p12066o36558n73457n25756
$$ 15227584 13972822 12854926 11865090 10985409 10194314 9482248 8845690 8272233 7746477
55904G746477m82150m37021l98716l70685l43558l12902k86613k67933k48525
$$ 7746477 7264327 6827306 6428590 6057905 5714347 5401445 5114832 4846899 4598374
55895D598374k24881k04975j92307j79189j61880j47218j38448j29252j17380
$$ 4598374 4373493 4168518 3976211 3797022 3635142 3487924 3349476 3220224 3102844
55886C102844j09702j08105j04271r4239q4842q0394p6134p0190o8895p4238p8296
$$ 3102844 2993142 2885037 2780766 2686527 2601685 2521291 2445157 2374967 2306072 2231834 2153538
55875B153538p6184p3054p2759p0978o5319o1181o1544o1210n6912n3317n3450
$$ 2153538 2077354 2004300 1931541 1860563 1795244 1734063 1672519 1611309 1554397 1501080 1447630
55864A447630n2708m7912m3152m1318l8699l3193k9173k9075k8479k4647k1740
$$ 1447630 1394922 1347010 1303858 1262540 1223841 1190648 1161475 1132400 1103921 1079274 1057534
55853A057534k2618k3429k1297j9691k1228k2627k1535k1160k3460k4863k3256
$$ 1057534 1034916 1011487 990190 970499 949271 926644 905109 883949 860489 835626 812370
55842H12370k2186k3654k3807k0366j7315j7554j7649j4779j2153j2609j3152
$$ 812370 790184 766530 742723 722357 705042 687488 669839 655060 642907 630298 617146
55831F17146j0945q771r357r988p801n265n380o380n949n912q151j0357j0279
$$ 617146 606201 597430 588073 578085 570284 565019 559639 553259 547310 541398 533247 522890 512611
55818E12611r867j1094j1913j0375q567q551q584p040n922o754p159n150k845
$$ 512611 502744 491650 479737 469362 460795 452244 443660 436620 430698 423944 416785 411635 408790
55805D08790k356j945K26K381K681K722M202N715N850N831O273N223K217J80M62
$$ 408790 406434 404489 404715 407096 409777 412499 416701 422416 428266 434097 440370 445593 447810 447990 448452
55790D48452K35k198l999k970j699k843m477l894k421k697m520o750r843j3357
$$ 448452 448687 446489 442490 439520 437821 434978 430501 426607 424186 421489 416969 410219 400376 387019
55776C87019j4479j2279r870r303q094m075M40K868M703P546Q657M965j411o051
$$ 387019 372540 360261 350391 341088 332994 328919 329359 332227 336930 344476 353133 358098 356687 350636
55762C50636q130r490j0320r728q551q027p447o044n082n415n379l824k616l308
$$ 350636 342506 333016 322696 312968 304417 296390 288943 282899 277817 272402 267023 263199 260583 257275
55748B57275m157l325k210k584l221k541j828k622l533k877j913k275k786j957
$$ 257275 253118 249793 247583 244999 241778 239237 237409 234787 231254 228377 226464 224189 221403 219446
55734B19446j130j879k828k284j526k209l067k456j747k753m245m382m163n012
$$ 219446 218316 216437 213609 211325 209799 207590 204523 202067 200320 197567 193322 188940 184777 179765
55720A79765n418l734j845k218l416k561k79Q39R59K081L858M362L924M372N410
$$ 179765 174347 170613 168768 166550 163134 160573 160294 161133 162092 164173 168031 172393 176317 180689 186099
55705A86099N292M140L267K190l52l324m690m890n844p297p325n830m542m027
$$ 186099 191391 195531 198798 200988 200636 197312 192622 187732 181888 174591 167266 161436 156894 152867
55691A52867l463k778k487k088j006j78m64o29O63K269K539K362L430M873M695
$$ 152867 149404 146626 144139 142051 141045 140867 140403 139774 140437 142706 145245 147607 151037 155910 160605
55676A60605L350K711K576J361n20j253r77j398k507k602j386l26j12j61l19q08
$$ 160605 163955 166666 169242 170603 170083 168830 167853 166455 163948 161346 159960 159634 159522 159361 159042 158234
55660A58234r26L1J108J026M70Q49J745J833J466J864K590K260J096L76J13m79
$$ 158234 157308 157339 158447 159473 159943 160792 162537 164370 165836 167700 170290 172550 173646 174022 174135 173656
55644A73656r82o22k30j003k146k210j867k837m850o167o388o303n768m267k805
$$ 173656 172674 172052 171822 170819 168673 166463 164596 161759 156909 150742 144354 138051 132283 128016 125211
55629A25211k682l116k573j606j698k202j329M73J109L14k90k16l66o11O8J159
$$ 125211 122529 119413 116840 115234 113536 111334 110005 110478 111587 111901 111611 111395 111029 110418 110486 111645
55613A11645J082j02r48j305k170l214l123k195j916k192j675o50o91j594j550
$$ 111645 112727 112625 111677 110372 108202 104988 101865 99670 97754 95562 93887 93237 92546 90952 89402
55598H9402m77k73j383k000j188k44k79q50j517k488l203k499p10M01K56OK77
$$ 89402 88925 88652 87269 85269 84081 83837 83558 82708 81191 78703 75500 73001 72291 72692 72948 72954 73231
55581G3231M09K65N61J136R00k8k43N65J110P93M63N81N41K44M43J130J375J060
$$ 73231 73640 73905 74466 75602 76502 76474 76231 76796 77906 78699 79162 79743 80284 80528 80971 82101 83476 84536
55563H4536J020J190N42q74j707j484j214j542k002k322k680k505r78J075J732
$$ 84536 85556 86746 87288 86414 84707 83223 82009 80467 78465 76143 73463 70958 69980 71055 72787
55548G2787P17k23k1N26N75M10L86L70N70J297J776Q92p62j384n67M45J104K035
$$ 72787 73504 73281 73260 73786 74361 74771 75157 75527 76097 77394 79170 80062 79300 77916 77349 77794 78898 80933
55530H0933L043K837J231l43r65j100j027m32J34n35k101k685j655n04m28r39
$$ 80933 83976 86813 88044 87701 86736 85636 84609 84177 84311 83776 81675 78990 77335 76831 76403 75464
55514G5464j398j964k372j769m59j3r01j754j615j162j079r68o10n51p50l77M72
$$ 75464 74066 72102 69730 67961 67502 67489 66588 64834 63219 62057 60978 60010 59400 58849 58099 57722 58194
55497E8194N99p6k7J358K638K525J519N00n88j658j774o38O50J185J284J227N15
$$ 58194 58793 58717 58690 60048 62686 65211 66730 67230 66642 64984 63210 62572 63222 64407 65691 66918 67433
55480F7433p86j499j018j67L49Q68J481J446P23M51R92J042k18j671k027j626
$$ 67433 66647 65148 64130 63963 64312 65180 66661 68107 68830 69281 70273 71315 71097 69426 67399 65773
55464F5773j407j319r18m21j73p1k33j045j944j586qR36K48o02O2J666K479K007
$$ 65773 64366 63047 62129 61708 61535 61464 61231 60186 58242 56656 56648 57584 57832 57230 57292 58958 61437 63444
55446F3444R76q6j011j442j231q91q48q85q20q86j010o35J80O04L76K44O29R85
$$ 63444 64420 64334 63323 61881 60650 59759 58911 58026 57206 56320 55310 54675 54855 55459 55835 56079 56708 57693
55428E7693J027J198J526J331O71N30R98Q08m72j485j240o35o75p34K6R68J016
$$ 57693 58720 59918 61444 62775 63446 63976 64974 65782 65310 63825 62585 61950 61275 60541 60567 61535 62551
55411F2551M08N1N8P7K07N16N56K10P6K39j27j134j535p76j76p64j315k18J809
$$ 62551 62959 63010 63068 63145 63352 63868 64424 64634 64710 64949 64822 63688 62153 61377 61201 60437 59122 58904 60713
55392F0713K654J806P11N27R82J290J059L20n66j157j475j847j973j121L34Q64
$$ 60713 63367 65173 65884 66411 67393 68683 69742 70062 69496 68339 66864 65017 63044 61923 62257 63121
55376F3121j8q09k56P24O05m02r79q17o42o56l84K00N61M79J95n7m4M94J330J700
$$ 63121 63103 62294 62038 62762 63367 62965 61986 61169 60527 59871 59487 59687 60248 60727 60922 60865 60821 61315 62645 64345
55356F4345J288O66K95o7n34o37l42m08j019j148j59R55R65J29m73n33m40m01
$$ 64345 65633 66299 66594 66527 65993 65356 65014 64606 63587 62439 62280 63235 64200 64329 63856 63323 62883 62482
55338F2482m77p99r86k08J421K480K052R32K44o2m32n89k75n3k48j06Q44J651
$$ 62482 62005 61206 60220 60012 61433 63913 65965 66897 67141 67079 66647 66058 65783 65730 65482 65376 66220 67871
55320F7871J310L44k63o48j303j669j038m3J73l24o41n95n55m23O6N39O50Q43
$$ 67871 69181 69525 69262 68614 67311 65642 64604 64561 64734 64410 63769 63174 62619 62196 62262 62801 63451 64294
55302F4294J409J538N44p46j128p26l48K0O90R85J62j063j372p66j52L71J262
$$ 64294 65703 67241 67785 67039 65911 65185 64837 64857 65547 66532 66694 65631 64259 63493 63341 63712 64974
55285F4974K094J944R99K56p8m69p49l23M85P47M60L80O57P78O97O91M68l31j008
$$ 64974 67068 69012 70011 70267 70189 69720 68971 68648 69133 69880 70340 70720 71377 72155 72852 73543 74011 73680 72672
55266G2672o05M85J008P47N32O32N56K77K12J46m67j168r58l7L27k44p56m95J33
$$ 72672 72067 72552 73560 74307 74839 75471 76027 76304 76516 76662 76195 75027 74069 74032 74359 74115 73359 72864 72997
55247G2997N63O96M47k85j015j064n94l79n69p01p32j000j272r35j08M16L40J3
$$ 72997 73560 74256 74703 74418 73403 72339 71745 71366 70797 70096 69364 68364 67092 66157 66049 66465 66805 66818
55229F6818l57p16o99j71J22l93r42n14L59M39n6J29R82J184M38l0M37J043J151
$$ 66818 66461 65745 65046 64875 64997 64604 63662 63148 63507 63946 63890 64019 65001 66185 66623 66593 67030 68073 69224
55210F9224J136J156O69k75o84k10K77K27J77L86J07r71j811j424k83N38P38O63
$$ 69224 70360 71516 72185 71910 71226 71016 71293 71520 71697 72083 72190 71219 69408 67984 67701 68239 68977 69640
55192F9640N43N94J070J635J425L11o62o33ML88L39Q0l44p96p73j12N81P28O16
$$ 69640 70183 70777 71847 73482 74907 75218 74556 73923 73927 74315 74654 74734 74390 73594 72821 72709 73290 74018 74634
55173G4634Q21J278J421J044N52M33O90P69J39q64j160l07O59N23l83o99o5N51
$$ 74634 75455 76733 78154 79198 79750 80183 80873 81642 81781 80917 79757 79450 80109 80632 80249 79550 79485 80036
55155H0036N26L15K92J7q28j732k113k064j887j649j534j895k469k323j028N70
$$ 80036 80562 80877 81169 81186 80358 78626 76513 74449 72562 70913 69379 67484 65015 62692 61664 62234
55139F2234J326J011L21M1M84J287J623J093M06O27J664K283J749P10J56J91K59
$$ 62234 63560 64571 64892 64933 65417 66704 68327 69420 69826 70453 72117 74400 76149 76859 77015 77206 77465
55122G7465ln41j097j390j283r77p23m05K20R64J373J344J144R39P23N60L72j46
$$ 77465 77462 76921 75824 74434 73151 72174 71451 71046 71266 72230 73603 74947 76091 77030 77753 78313 78685 78539
55104G8539q97j096l56N15O15L88Q24J660J671N83n76r55n95K49J247J621R06
$$ 78539 77642 76546 76190 76705 77320 77708 78532 80192 81863 82446 81870 80915 80320 80569 81816 83437 84343
55087H4343L5L17J427J841J228P65R22Q16J61K5R04J688J446P82N06L21j74m62
$$ 84343 84378 84695 86122 87963 89191 89956 90878 91694 91855 91880 92784 94472 95918 96700 97206 97527 97353 96891
55069I6891j75Jm51q20m52n3n37j444j699j210n61J52J057J680J513R77P27N07
$$ 96891 96716 96717 96266 95446 94994 94941 94404 92960 91261 90051 89490 89642 90699 92379 93892 94869 95596 96103
55051I6103l26j473k022j792j433j280r96l25M98J074J113N14m21j073j111p74
$$ 96103 95777 94304 92282 90490 89057 87777 86781 86456 86954 88028 89141 89655 89234 88161 87050 86276
55035H6276l22K77Q76R85N10M3L7J93J15p7j49j65p9L56Q60O84j14l29P13K040
$$ 86276 85954 86231 87107 88092 88602 88645 88682 88875 88990 88913 88764 88599 88520 88876 89736 90420 90306 89977 90690 92730
55015I2730K366J737R54J69q70j790j934j351n52L43J268J555P05n27r41n13j66
$$ 92730 95096 96833 97787 97956 97086 95296 93362 92011 91459 91802 93070 94625 95330 94803 93862 93349 93183
54998I3183j06L66J343J837J199J54j60M49J210J370Q30J9n66p89q80j017j057
$$ 93183 93077 93443 94786 96623 97822 97976 97816 98265 99475 100845 101675 101694 101128 100339 99459 98442 97385
54981I7385q37n27m71p60j178j345r29M2R32J055N52K45M86P41N51K31J70Q6m00
$$ 97385 96548 96021 95550 94790 93612 92267 91338 91380 92312 93367 93919 94164 94650 95391 95942 96173 96343 96429 96029
54962I6029r30q34n2Q71J478J598J193M73o0j55j44l86o77n92j62J81J54j65m98
$$ 96029 95099 94265 94213 95084 96562 98160 99353 99826 99766 99611 99467 99081 98404 97812 97650 97831 97985 97820 97322
54943I7322n89m36l56m62l46K55O73J32q11p96K30P85J51m69Q9J182J600J489
$$ 97322 96733 96297 95941 95479 95133 95388 96061 96193 95382 94586 94816 95601 95752 95283 95372 96554 98154 99643
54925I9643J764K389K623K450K549L062L544L902M443N178N832O364O692O321
$$ 99643 101407 103796 106419 108869 111418 114480 118024 121926 126369 131547 137379 143743 150435 156756
54911A56756M922K955J024r06k922m413m876m857n125n327m682l541l011l246
$$ 156756 161678 164633 165657 164751 161829 157416 152540 147683 142558 137231 132549 129008 125997 122751
54897A22751l364l000k696k708k497j716p25K8M54N08K13K2M55J317J924K007
$$ 122751 119387 116387 113691 110983 108486 106770 106045 106073 106527 107035 107248 107270 107725 109042 110966 112973
54881A12973J794J403R34R20J799L026L661L689L908M595N275N722O087N956M487
$$ 112973 114767 116170 117104 118024 119823 122849 126510 130199 134107 138702 143977 149699 155786 161742 166229
54866A66229J760r88k821l948m836n388n424n168m880m552m228l982l502k382
$$ 166229 167989 167001 164180 160232 155396 150008 144584 139416 134536 129984 125756 121774 118272 115890
54852A15890j031m70r61j671j973k189k662k944k541j786j306j121q31l92q4J5
$$ 115890 114859 114389 113428 111757 109784 107595 104933 101989 99448 97662 96356 95235 94404 94012 93928 93943
54836I3943Q3K79O48J084J237P91Rl60K4O40P67K73m71j081j289r35j59N56P30
$$ 93943 94026 94305 94953 96037 97274 98065 98074 97714 97738 98378 99145 99418 98947 97866 96577 95642 95483 96039 96769
54817I6769K77m44q24l90O63J444J234L54k77k78k1J97N04R01J028P20L37K74
$$ 96769 97046 96602 95778 95388 96051 97495 98729 99083 98806 98528 98507 98704 99208 100109 101137 101857 102194 102468
54799A02468M93P16P63O15M48N60R56J137P18N0l38o48j364k081j797n08N70P25
$$ 102468 102961 103677 104440 105055 105503 106063 107019 108156 108874 108924 108586 107938 106574 104493 102696 102188 102758 103483
54781A03483O58J154J742J484M48l55k21O79J661K058J692J188J401K279K804
$$ 103483 104141 105295 107037 108521 108969 108614 108393 109072 110733 112791 114483 115671 117072 119351 122155
54766A22155K500K274L142M725N833O117O219O483O448N636M110K132n8k029l337
$$ 122155 124655 126929 130071 134796 140629 146746 152965 159448 165896 171532 175642 177774 177716 175687 172350
54751A72350m053m671n355n712n517n083m720m277l543k726k120j658j142o93
$$ 172350 168297 163626 158271 152559 147042 141959 137239 132962 129419 126693 124573 122915 121773 121080
54737A21080n58n84l63J07K94j59r30j365j107k80P49J584J964J952J874J971
$$ 121080 120522 119938 119575 119682 119976 119817 118887 117522 116415 116135 116884 118468 120432 122384 124258 126229
54721A26229K227K627L319M268N084N467N659N891N698M364J991m98k464l982
$$ 126229 128456 131083 134402 138670 143754 149221 154880 160771 166469 170833 172824 172326 169862 165880
54707A65880n055n266m598l922l978m404m342l654k897k404k072j891j963k078
$$ 165880 160825 155559 150961 147039 143061 138657 134315 130661 127764 125360 123288 121397 119434 117356
54693A17356j838j219n74j08J87J46m46j272j566r47N4N70K82l37o07m56n08j181
$$ 117356 115518 114299 113725 113617 113804 113950 113504 112232 110666 109719 109773 110343 110625 110288 109681 109225 108717 107536
54675A07536j833j409k8Q81M77k57J3R11R31k73j450j673j444j444j324m86O49
$$ 107536 105703 104294 104266 105147 105624 105367 105380 106291 107222 106949 105499 103826 102382 100938 99614 99128 99777
54658I9777J087O81K28K54L68L2n37o39o3N81O21P2n02o67l43M07J335J851J510
$$ 99777 100864 101545 101773 102027 102395 102427 101890 101251 101188 101769 102390 102462 101960 101293 100950 101357 102692 104543 106053
54639A06053P84O63J269J513O05q36j625j463q90m17l27q64j741j962r75L05N57
$$ 106053 106837 107500 108769 110282 110887 110051 108426 106963 106073 105656 105329 104465 102724 100762 99787 100092 100649
54622A00649j48n82j84M35P90J172J752K058J748J136N66m1o65q71m34J77L48
$$ 100649 100501 99919 99735 100170 100960 102132 103884 105942 107690 108826 109392 109351 108686 107815 107381 107558 107906
54605A07906rn37q54p34k25K66L56J63J17K92M11L89M57O87Q68Q67P09L77j2p0
$$ 107906 107897 107360 106506 105772 105547 105813 106169 106332 106449 106741 107152 107541 107998 108685 109553 110420 111129 111506 111494 111424
54585A11424L38O50L18l00m50j54l2j43l0J99q5q13j123o75l8M46J075J735J570
$$ 111424 111762 112412 112730 112430 111980 111826 111794 111651 111621 111820 111735 110922 109799 109124 109086 109532 110607 112342 113912
54566A13912L36r16j201q49p09q55p98m86k78l20m96o60n11L25J636K495K213
$$ 113912 114248 113332 112131 111282 110573 109718 108920 108434 108156 107836 107340 106680 106169 106494 108130 110625 112838
54549A12838J129Q9m32m22l2M90Q79J142J395J425R88N36P90J461J377K31p85
$$ 112838 113967 114056 113624 113202 113170 113660 114539 115681 117076 118501 119489 120025 120815 122276 123653 123884 123099
54532A23099o69M3L03O2j33k92p64j291j219m90K82N81L49j47m75m01l57r35j694
$$ 123099 122430 122473 122776 122838 122705 122413 121649 120358 119139 118649 118931 119512 119861 119714 119239 118838 118481 117546 115852
54513A15852j285N94K303K174O82l64k14K83K20l80j030j321r53K3R53J171Q09
$$ 115852 114567 115161 117464 119638 120320 119956 119742 120025 120245 119865 118835 117514 116561 116584 117537 118708 119517
54496A19517N12N19N90O21O69M94k00j086j399q88l8O46J082J320J235P12j75
$$ 119517 120029 120548 121138 121759 122428 122922 122722 121636 120237 119349 119311 119957 121039 122359 123594 124306 124131
54479A24131j106j589j274m22K60N09P61J248J397P29j98m43N3O27R89J381J819
$$ 124131 123025 121436 120162 119740 120000 120509 121270 122518 123915 124644 124446 124003 124056 124683 125672 127053 128872
54462A28872K000J905J790J610J164P05O63P88L83n19j048q04m76p59j304j306
$$ 128872 130872 132777 134567 136177 137341 138046 138709 139497 139880 139361 138313 137509 137033 136274 134970 133664
54446A33664p16k63m14q60j041q79p41q28q83o26k81l22p49j055r84q60r11q04
$$ 133664 132948 132685 132271 131411 130370 129491 128750 127922 127039 126413 126132 125810 125061 124006 123022 122162 121251 120447
54428A20447k22N67J132J533J966K134J602O70K01N57J199J425J051L72k24m86
$$ 120447 120225 120792 121924 123457 125423 127557 129159 129829 130030 130587 131786 133211 134262 134634 134410 133924
54412A33924m36l36l75m85n48o02o41m84n8M34Q66J361J839J800J059K97L24J028
$$ 133924 133488 133152 132777 132292 131744 131142 130501 130017 129959 130393 131259 132620 134459 136259 137318 137615 137939 138967
54394A38967J552J373P18Q6j48K38J102J802J699Q46j27p30r79j130j284j282
$$ 138967 140519 141892 142610 142696 142548 142786 143888 145690 147389 148235 148108 147378 146399 145269 143985 142703
54378A42703p73L29J504K089K148K349K808K824K159J712K265L236L514K935K099
$$ 142703 141930 142259 143763 145852 148000 150349 153157 155981 158140 159852 162117 165353 168867 171802 173901
54363A73901J192J1j212k006k439k774k611j486l7N03Kn26n76o81j107j233p35
$$ 173901 175093 175104 173892 171886 169447 166673 164062 162576 162539 163042 163044 162518 161942 161261 160154 158921 158186
54346A58186l53q17j733k145j724r70o40j219k522l571l399k129q03n3L58O27
$$ 158186 157833 157016 155283 153138 151414 150444 149804 148585 146063 142492 139093 136964 136161 136108 136466 137093
54330A37093M68j17m75k83j18m82r16p22m6M67O53P74Q33O36L37K42K19o5m59
$$ 137093 137561 137444 136969 136686 136568 136086 135170 134448 134402 134869 135522 136296 137129 137765 138102 138344 138563 138498 138039
54311A38039n13k68k02l25l5Q54J591J384M76k71n55q03j199j225n28L23N08R8
$$ 138039 137526 137258 137056 136731 136696 137550 139141 140525 141001 140730 140175 139372 138173 136948 136420 136743 137251 137349
54293A37349j19R9J02n31j183j020j68M89M67J44J41O67J386J704J256L50k48
$$ 137349 137230 137329 137431 136900 135717 134697 134529 135018 135485 135629 135770 136437 137823 139527 140783 141133 140885
54276A40885k12n4l56q77q81j37Q43J498J699J667J701J879J834J069j82q70l58
$$ 140885 140673 140619 140263 139386 138505 138368 139211 140709 142408 144075 145776 147655 149489 150558 150376 149506 149148
54259A49148O36R38M51M4J81M59M55K96J97J30Q3J63L48N31P90J149J236P35O2
$$ 149148 149784 150722 151173 151217 151398 151857 152312 152608 152805 152935 153018 153181 153529 154060 154850 155999 157235 157970 158032
54240A58032n1L19L73k24r37j290j416j456j188o99p07j614k663k671j453n5M72
$$ 158032 157981 158300 158673 158449 157512 156222 154806 153350 152162 151463 150756 149142 146479 143808 142355 142300 142772
54223A42772K11J56R07J769J484r6j572j615n66J82J4n07q55j188j651j878j552
$$ 142772 142983 143139 144046 145815 147299 147203 145631 144016 143450 143632 143646 143139 142284 141096 139445 137567 136015
54206A36015r04l12J48N21P46P91P22N93M85N80Q18P35R4n26m09K19N44L70K01
$$ 136015 135111 134799 134947 135468 136214 137005 137727 138320 138805 139385 140203 140938 141032 140506 140097 140316 140860 141230 141431
54187A41431J91m7m63m25K80J054J423J526J520J301J093J430K226K608K056J025
$$ 141431 141622 141575 141112 140687 140967 142021 143444 144970 146490 147791 148884 150314 152540 155148 157204 158229
54171A58229O9p63j402j483j100r98j470j821j500r45p32o67m04k33m63p10n56
$$ 158229 158298 157535 156133 154650 153550 152552 151082 149261 147761 146816 146084 145417 145013 144780 144317 143607 143051
54154A43051l60n75q23n45q2j50o14p20k73K70O55R27Q64K35m26k68N77R66K64
$$ 143051 142691 142116 141293 140748 140666 140516 139902 139182 138909 139179 139834 140761 141625 141860 141434 141166 141743 142709 142973
54135A42973q15j182n68N05J452J926J778J139M32N8P3K75N40R32J496K018K144
$$ 142973 142158 140976 140408 140913 142365 144291 146069 147208 147640 147698 147771 148046 148586 149518 151014 153032 155176
54118A55176J885J787K346L280L869L966M162M769N174M689L485K259J221k0j648
$$ 155176 157061 158848 161194 164474 168343 172309 176471 181240 186414 191103 194588 196847 198068 198048 196400
54103A96400l270m351m726m565m153l736l447l238k931k346j534q90q04j041q05
$$ 196400 193130 188779 184053 179488 175335 171599 168152 164914 161983 159637 158103 157213 156409 155368 154563
54088A54563K13J200J173L88N3O73J512J754J386P16j58r68j102l70O68J471K063
$$ 154563 154776 155976 157149 157537 157590 158263 159775 161529 162915 163631 163473 162505 161403 161033 161701 163172 165235
54071A65235K464K339J720J328J496J510P67k6J94J137J424M49r61j719j542q17
$$ 165235 167699 170038 171758 173086 174582 176092 176859 176833 177027 178164 179588 180037 179076 177357 175815 174998
54055A74998o5L13K55J24L12P62J148J366J519J684J947K463L075L293L033L043
$$ 174998 174933 175246 175501 175625 175937 176699 177847 179213 180732 182416 184363 186826 189901 193194 196227 199270
54039A99270L906N033N326M721M277M759N803O629O914O779O379N808N153M481
$$ 199270 203176 208209 213535 218256 222533 227292 233095 239724 246638 253417 259796 265604 270757 275238
54025B75238L856L373K968K373J542R75J138J675J646O76n55j183j266j678k980
$$ 275238 279094 282467 285435 287808 289350 290325 291463 293138 294784 295460 294905 293722 292456 290778 287798
54010B87798m690n800n900n523n308n269n086m862m935n097m669l500k302j779
$$ 287798 283108 277308 271408 265885 260577 255308 250222 245360 240425 235328 230659 227159 224857 223078
53996B23078j905k227k394k204j630j055r64j198j043k90M61Q10J196K079L129
$$ 223078 221173 218946 216552 214348 212718 211663 210699 209501 208458 208168 208629 209439 210635 212714 215843
53981B15843L813M274N065O344P733Q585Q093N780K251j125l629n656p444q270
$$ 215843 219656 223930 228995 235339 243072 251657 259750 265530 267781 266656 263027 257371 249927 241657
53967B41657p593o077m711l638k713k343k715k919k052p34j91l29l3Q54J317R39
$$ 241657 234064 227987 223276 219638 216925 214582 211867 208948 206896 206162 205971 205642 205609 206463 207780 208719
53951B08719N07O51R98J073J019J100J296J717K620L727M296M128L845L922M145
$$ 208719 209226 209877 210875 211948 212967 214067 215363 217080 219700 223427 227723 231851 235696 239618 243763
53936B43763M281M518M846M720L819K679K055K029K140K199K545L558N122O565
$$ 243763 248044 252562 257408 262128 265947 268626 270681 272710 274850 277049 279594 283152 288274 294839
53922B94839P156O720N775M984M709N048N899O779P082O906P127Q166R130Q851
$$ 294839 301995 308715 314490 319474 324183 329231 335130 341909 348991 355897 363024 371190 380320 389171
53908C89171P361N688M520L760L064K122O30j231k598k893k689k881l398l632
$$ 389171 396532 402220 406740 410500 413564 415686 416316 415085 412487 409594 406905 404024 400626 396994
53894C96994l795m680o202p361p680p662p667p446p035p109p924q692q475p229
$$ 396994 393199 388519 382317 374956 367276 359614 351947 344501 337466 330357 322433 313741 305266 298037
53880B98037n708m710m521m596l947k368j031j164k428l553m219n056n900n635
$$ 298037 292329 287619 283098 278502 274555 272187 271156 269992 267564 264011 259792 254736 248836 243201
53866B43201m090k706k579l043k911k191j722j833k266k797l221l087k157q82
$$ 243201 239111 236405 233826 230783 227872 225681 223959 222126 219860 217063 213842 210755 208598 207716
53852B07716J09O66R78J041O78j62j308k353k753k284j428q29m43J77Q65R58L93
$$ 207716 207825 208491 209469 210510 211188 211026 209718 207365 204612 202328 200900 200071 199628 199805 200670 201628 202021
53835B02021j40l18n19q66q41k58K68K60Pj27k72m96m37O8N88Q20J009J341J597
$$ 202021 201881 201563 201044 200178 199337 199079 199347 199607 199614 199487 199215 198719 198282 198350 198938 199758 200767 202108 203705
53816B03705J775K263K979L146K405J420Q91Q28J168K158L546M412M539M967O290
$$ 203705 205480 207743 210722 213868 216273 217693 218584 219412 220580 222738 226284 230696 235235 240202 246492
53801B46492P364O839N201M045L909M102M321M949N777N726M276K274R99R01J492
$$ 246492 253856 260695 265896 269941 273850 277952 282273 287222 292999 298725 303001 305275 306274 307175 308667
53786C08667J992J895J255N32L8m07j055j807k426k949l564m327n242o324p290
$$ 308667 310659 312554 313809 314341 314379 313972 312917 311110 308684 305735 302171 297844 292602 286278 278988
53771B78988p578o933n760m606l669k983k579k239j631r64r03j549k166k303k428
$$ 278988 271410 264477 258717 254111 250442 247459 244880 242641 241010 240046 239143 237594 235428 233125 230697
53756B30697k940l329l044k443k131j950j471r55r16j202j292j149r80o06N7L59
$$ 230697 227757 224428 221384 218941 216810 214860 213389 212434 211518 210316 209024 207875 206895 206289 206346 206705
53740B06705k28j048j040k95J82Q7M5L30M68K68K01N20Q44R23J007J226J288J094
$$ 206705 206477 205429 204389 204094 204276 204363 204408 204738 205206 205474 205675 206195 207039 207962 208969 210195 211483 212577
53722B12577J002J176J263J035P93Q56J114J355J633J975K091J735J186J074J702
$$ 212577 213579 214755 216018 217053 217846 218702 219816 221171 222804 224779 226870 228605 229791 230865 232567
53707B32567K703L387L437L191L097L031K547J817J698K541L616M158M421M962
$$ 232567 235270 238657 242094 245285 248382 251413 253960 255777 257475 260016 263632 267790 272211 277173
53693B77173N417M896L404J942J245J170J280J342J124M78k38m16m9J67k55j056
$$ 277173 282590 287486 290890 292832 294077 295247 296527 297869 298993 299471 299233 298817 298768 298935 298680 297624
53677B97624j720k019j886j292m89r1m92j369j954j731q78m3L18L53N06Q01Q16
$$ 297624 295904 293885 291999 290707 290218 290127 289635 288266 286312 284581 283703 283660 283978 284331 284837 285638 286454
53660B86454L77j53m59o41p21m26J74L90j10o56n30JL47P07J555K448K522J935
$$ 286454 286831 286678 286219 285578 284857 284431 284605 284995 284885 284229 283699 283700 284047 284754 286309 288757 291279 293214
53642B93214J687K017K137J701J423J895K699L155L188L030K703K236J794J353
$$ 293214 294901 296918 299055 300756 302179 304074 306773 309928 313116 316146 318849 321085 322879 324232
53628C24232P13Q5Q4Q21J566J693J430J361J594J885K167K566L102L671M157M403
$$ 324232 324945 325030 325114 325935 327501 329194 330624 331985 333579 335464 337631 340197 343299 346970 351127 355530
53612C55530M304M030L852L741L465L076K882K860K626K124J814J926K065J862
$$ 355530 359834 363864 367716 371457 374922 377998 380880 383740 386366 388490 390304 392230 394295 396157
53598C96157J539J380J129L92n33q93m65P4j0o49j082q03j45J78j18p61j486k290
$$ 396157 397696 399076 400205 400597 400064 399171 398706 398780 398770 398121 397039 396236 396091 396269 396151 395390 393904 391614
53580C91614k993l115k547j991k165k831l126k728k185k098k440k732k528j770
$$ 391614 388621 385506 382959 380968 378803 375972 372846 370118 367933 365835 363395 360663 358135 356365
53566C56365r18n73p26o91m9O95Q74O16M39K93j67o08l13O66J485J684J540J229
$$ 356365 355447 354874 354148 353457 353408 354103 354977 355593 356032 356325 356158 355550 355237 355903 357388 359072 360612 361841
53548C61841N47l40p32l05N06J274K087L017L721L950L960M107M451M908N361
$$ 361841 362388 362048 361316 361011 361517 362791 364878 367895 371616 375566 379526 383633 388084 392992 398353
53533C98353N654N842O394P515Q503Q631Q471R245J0809J1644J1140J0583J1171
$$ 398353 404007 409849 416243 423758 432261 440892 449363 458608 469417 481061 492201 502784 513955
53520E13955J2306J2791J2713J2967J3709J4428J5134J6287J7795J9037J9844
$$ 513955 526261 539052 551765 564732 578441 592869 608003 624290 642085 661122 680966
53509F80966K0559K1233K1619K1884K2572K3702K4586K4727K4288K3582K2638
$$ 680966 701525 722758 744377 766261 788833 812535 837121 861848 886136 909718 932356
53498I32356K1487K0456J9782J9158J8019J6263J4534J3674J3849J4389J4590
$$ 932356 953843 974299 994081 1013239 1031258 1047521 1062055 1075729 1089578 1103967 1118557
53487A118557J4566J4950J5939J6993J7565J7624J7364J6875J6258J5596J4613
$$ 1118557 1133123 1148073 1164012 1181005 1198570 1216194 1233558 1250433 1266691 1282287 1296900
53476A296900J2834J0410Q267P020O129M606K206n26l148n662q095j0183j1648
$$ 1296900 1309734 1320144 1328411 1335431 1341560 1346166 1348372 1347846 1344698 1339036 1330941 1320758 1309110
53463A309110j2514j3117j3769j4403j4586j4135j3621j3860j4918j6103j6956
$$ 1309110 1296596 1283479 1269710 1255307 1240721 1226586 1212965 1199105 1184187 1168084 1151128
53452A151128j7678j8404j8732j8381j7741j7309j6983j6426j5723j5200j4759
$$ 1151128 1133450 1115046 1096314 1077933 1060192 1042883 1025900 1009474 993751 978551 963792
53441I63792j3895j2233r833p122m764l241k402j708j046p38o12K12K137M290
$$ 963792 949897 937664 927831 920709 915945 912704 910302 908594 907548 906810 906198 906410 908547 912837
53427I12837N548N861N964O306O911P900R381J1027J2494J3976J5777J7518J8551
$$ 912837 918385 924246 930210 936516 943427 951327 960708 971735 984229 998205 1013982 1031500 1050051
53414A050051J8985J9620K0919K2677K4622K6620K8322K9279K9617L0078L1291
$$ 1050051 1069036 1088656 1109575 1132252 1156874 1183494 1211816 1241095 1270712 1300790 1332081
53403A332081L3298L5771L8193L9952M0833M1459M2772M4973M7349M9124N0069
$$ 1332081 1365379 1401150 1439343 1479295 1520128 1561587 1604359 1649332 1696681 1745805 1795874
53392A795874N0351N0283N0196N0148M9797M8946M8038M7542M7009M5501M2919
$$ 1795874 1846225 1896508 1946704 1996852 2046649 2095595 2143633 2191175 2238184 2283685 2326604
53381B326604M0168L7811L5376L2294K8778K5262K1553J7174J2226P313K759j601
$$ 2326604 2366772 2404583 2439959 2472253 2501031 2526293 2547846 2565020 2577246 2584559 2587318 2585717
53369B585717o001j0538j5410k0956k7182l3415l8586m2009m3907m5193m6601
$$ 2585717 2579716 2569178 2553768 2532812 2505630 2472215 2433629 2391620 2347713 2302520 2255919
53358B255919m8089m9094m9260m8708m7718m6402m4724m2632m0174l7708l5925
$$ 2255919 2207830 2158736 2109476 2060768 2013050 1966648 1921924 1879292 1839118 1801410 1765485
53347A765485l5327l5617l5914l5632l4937l4254l3600l2616l1061k9089k7042
$$ 1765485 1730158 1694541 1658627 1622995 1588058 1553804 1520204 1487588 1456527 1427438 1400396
53336A400396k5135k3300k1290j8989j6625j4569j2976j1732j0786j0379j0871
$$ 1400396 1375261 1351961 1330671 1311682 1295057 1280488 1267512 1255780 1244994 1234615 1223744
53325A223744j2327j4206j5572j5730j4795j3503j2401j1467j0588r950r674r432
$$ 1223744 1211417 1197211 1181639 1165909 1151114 1137611 1125210 1113743 1103155 1093205 1083531 1074099
53313A074099q852q030p100n633l211m93J177J483J663K929M997O742P803Q759
$$ 1074099 1065247 1057217 1050117 1044484 1041273 1040780 1041957 1043440 1045103 1048032 1053029 1059771 1067574 1076333
53299A076333J0080J1636J3267J5130J7315J9544K1417K2729K3497K4003K4717
$$ 1076333 1086413 1098049 1111316 1126446 1143761 1163305 1184722 1207451 1230948 1254951 1279668
53288A279668K5694K6076K4816K2097J9424J7909J7021J5534J3192J0712Q476
$$ 1279668 1305362 1331438 1356254 1378351 1397775 1415684 1432705 1448239 1461431 1472143 1480619
53277A480619O119L412O64j988m898q132j1003j2897j4129j5536j7477j9678k1675
$$ 1480619 1486738 1490150 1490814 1488826 1483928 1475796 1464793 1451896 1437767 1422231 1404754 1385076 1363401
53264A363401k3086k3674k3654k3661k4054k4516k4650k4633k4794k4980k4862
$$ 1363401 1340315 1316641 1292987 1269326 1245272 1220756 1196106 1171473 1146679 1121699 1096837
53253A096837k4543k4269k3922k3400k3099k3271k3284k2448k1210k0515k0246
$$ 1096837 1072294 1048025 1024103 1000703 977604 954333 931049 908601 887391 866876 846630
53242H46630j9498j8350j7927j8450j8646j7617j6053j4916j4005j2666j1050
$$ 846630 827132 808782 790855 772405 753759 736142 720089 705173 691168 678502 667452
53231F67452r659q393o960n707n219n556o475p860r292r967r874j0260j1978j3989
$$ 667452 657793 649400 642440 636733 631514 625958 619483 611623 602331 592364 582490 572230 560252 546263
53217E46263j4664j4036j3537j3736j3690j2550j0669q929p851p505p554p318
$$ 546263 531599 517563 504026 490290 476600 464050 453381 444452 436601 429096 421542 414224
53205D14224o502n792o025o902p406p360p532q157q509q141p556p215o820o037
$$ 414224 407722 401930 395905 389003 381597 374237 366705 358548 350039 341898 334342 327127 320307 314270
53191C14270n144m457l881l439l530m134m490m108l508l302l231k797k299k358
$$ 314270 309126 304669 300788 297349 293819 289685 285195 281087 277579 274277 271046 268249 265950 263592
53177B63592k781k786k232j791j849k037j944j663j343p82P7O57K54r77k043k187
$$ 263592 260811 258025 255793 254002 252153 250116 248172 246509 245166 244384 244461 245118 245372 244395 242352 240165
53161B40165j671j235j038n21O39J872K244J447Jj335k073k096j639j144q51o09
$$ 240165 238494 237259 236221 235700 236339 238211 240455 241902 241903 240568 238495 236399 234760 233616 232765 232156
53145B32156k58p6l59p68o32O1O00O50P35J221J445N62r75j682q69M53R02M32
$$ 232156 231898 231822 231463 230695 230063 230124 230724 231374 232109 233330 234775 235337 234362 232680 231811 232264 233166 233598
53127B33598J07N05J090J286J333J655J965J758J363J526K142K320J890J843K695
$$ 233598 233705 234210 235300 236586 237919 239574 241539 243297 244660 246186 248328 250648 252538 254381 257076
53112B57076L409K774J228K77M52P87L48p18j737k421k839l071l147l105k912
$$ 257076 260485 263259 264487 264764 265216 266003 266351 265633 263896 261475 258636 255565 252418 249313 246401
53097B46401k530k049j575j048m42l1p0l85o37p80q90p85l93k47q74j753j759
$$ 246401 243871 241822 240247 239199 238757 238726 238656 238271 237634 236854 235964 235179 234786 234539 233665 231912 230153
53080B30153o98L39M57jk10q7j14m22o46n69m18n16q72j245j433j421j216o46
$$ 230153 229455 229794 230251 230250 230040 229953 229839 229417 228771 228202 227784 227268 226396 225151 223718 222297 221081 220435
53062B20435L61J255J096k99j782k010j005R5O03Q95J391J764J555R71N76N74
$$ 220435 220796 222051 223147 222848 221066 219056 218051 218146 218749 219644 221035 222799 224354 225325 225901 226475
53046B26475P40Q46P41K93m49j127j334r80l20L03O47O45L95J12L2K55N49M19
$$ 226475 227215 228061 228802 229095 228646 227519 226185 225205 224885 225188 225835 226480 226875 226987 227019 227274 227823 228242
53028B28242l15j040r45j56K97p2n27k59M30P91P79P53N99J35j15L98J114J088
$$ 228242 227927 226887 225942 225786 226083 226011 225484 225225 225655 226446 227225 227978 228577 228712 228597 228995 230109 231197
53010B31197N09L50O00K81p54j446j163m73N7O14J212J284P10J63j02o35j449
$$ 231197 231706 232056 232656 232937 232183 230737 229574 229101 229158 229772 230984 232268 232978 233141 233039 232404 230955
52993B30955j532m80N68N79J14K04P28J081J484K387L222L168K598K483K712K429
$$ 230955 229423 228943 229511 230090 230204 230408 231136 232217 233701 236088 239310 242478 245076 247559 250271 252700
52977B52700J664J279J308P48p43k183k641k299j709r49P2J022J503J555J462
$$ 252700 254364 255643 256951 257699 256956 254773 252132 249833 248124 247175 247247 248269 249772 251327 252789
52962B52789J375J341J439J569J391O87l28j115j258q61o16j194k399l152k691
$$ 252789 254164 255505 256944 258513 259904 260591 260263 259148 257890 257029 256413 255219 252820 249668 246977
52947B46977j498o62n57o61n25l48m79q61j174j256j197j084q40m04k2j42p54
$$ 246977 245479 244817 244260 243599 243074 242726 242247 241386 240212 238956 237759 236675 235835 235431 235409 235267 234513
52930B34513j111n75L55N71j16p55p11n10o99q07j80Q03J255J108J010J213J393
$$ 234513 233402 232827 233182 233753 233637 232882 232171 231661 230962 230155 229975 230778 232033 233141 234151 235364 236757
52913B36757J339J103O13j58q16r82r35j145j411j168n16j50l36p16j020j227
$$ 236757 238096 239199 239812 239654 238838 237856 236921 235776 234365 233197 232681 232531 232195 231479 230459 229232
52897B29232j105l88N55R67P84O72R56J240J307J523K017K161J444L74l9M81J189
$$ 229232 228127 227739 228294 229261 230045 230717 231673 232913 234220 235743 237760 239921 241365 241739 241700 242181 243370
52880B43370J217N28o6J50Q72J079L94k77M1J037J579J263P44O41R11J343J866
$$ 243370 244587 245115 245049 245199 246071 247150 247544 247267 247308 248345 249924 251187 251931 252572 253483 254826 256692
52863B56692K219J984J236N63K40p7p22j558k290k766k856k605k479k915l558
$$ 256692 258911 260895 262131 262694 262934 262857 262135 260577 258287 255521 252665 250060 247581 244666 241108
52848B41108l590k912k260k032j801j331j105j384j565j139o47q54j479j551p45
$$ 241108 237518 234606 232346 230314 228513 227182 226077 224693 223128 221989 221342 220488 219009 217458 216713
52833B16713L84J254J678J562Q97J26j17K48O47O03K30j48n05r71j415j408o85
$$ 216713 217097 218351 220029 221591 222488 222614 222497 222745 223392 223995 224225 224077 223572 222601 221186 219778 219093
52816B19093M67J344J475J044N84L26R6j24j9N26J036R23K45l38l66r4j52q32
$$ 219093 219560 220904 222379 223423 224007 224333 224429 224305 224286 224812 225848 226771 227016 226678 226312 226218 226066 225234
52798B25234j766k274k028j380j000j239j810k029j369J7J252J496Q51K42K12
$$ 225234 223468 221194 219166 217786 216786 215547 213737 211708 210339 210356 211608 213104 213955 214197 214409
52783B14409K77r8m56j4R04J176N72J50O15J225R74R6m18l02k05n12q31o51JP57
$$ 214409 214686 214588 214132 214118 215022 216198 216770 216920 217535 218760 219734 219830 219412 219110 218905 218393 217562 216911 216912 217669
52763B17669J248J199M81o33j504j560p36M98J418J545J027N27N21Q06Q65O35
$$ 217669 218917 220116 220597 219964 218460 216900 216164 216662 218080 219625 220652 221179 221700 222506 223371 224006
52747B24006N88J033J667J971J842J549J245Q32L62J93N28J026J201J104J214
$$ 224006 224594 225627 227294 229265 231107 232656 233901 234733 235095 235288 235816 236842 238043 239147 240361
52732B40361J614J718J073P1n25n18l23k31j12J30K25j88j107k132k740k639j997
$$ 240361 241975 243693 244766 244837 244312 243794 243471 243240 243128 243258 243483 243295 242188 240056 237316 234677 232680
52715B32680j341j032q46k96O73J497J569R00J46k7L51N70J46m68m73J5L4o35
$$ 232680 231339 230307 229461 229165 229838 231335 232904 233804 233950 233923 234274 234844 234990 234522 234049 234064 234098 233463
52697B33463r10K1J219J202O4p48n54j26j22j41K31N25K43j45R8P87J065N86j69
$$ 233463 232553 232574 233793 234995 235059 234311 233757 233631 233509 233368 233599 234124 234367 234222 234320 235107 236172 236758 236589
52678B36589n81n08k80m06j051j689j508m11P71J260J122Q66O96N71N44N92M86
$$ 236589 236008 235500 235220 234814 233763 232074 230566 230155 230926 232186 233308 234174 234870 235441 235985 236577 237063
52661B37063K18K19O93J113R00L27J78P04J479K131K646K975K902K377J578N86
$$ 237063 237281 237500 238193 239306 240206 240533 240711 241415 242894 245025 247671 250646 253548 255925 257503 258089
52645B58089o26j884k779k975k333r15P78J780J459L54l43k43j46p08j366j110
$$ 258089 257463 255579 252800 249825 247492 246577 247355 249135 250594 250948 250605 250362 250216 249508 248142 247032
52629B47032K5R78J107R94J419K055J810L55j319k112k059j932j979j692q02J60
$$ 247032 247057 248035 249142 250136 251555 253610 255420 255775 254456 252344 250285 248353 246374 244682 243880 244040
52613B44040N35L15Nk7K02M57N26M53N38R19J142O39k96o14O7P41K92r26j521
$$ 244040 244575 244890 244895 244868 245070 245527 246053 246506 247044 247963 249105 249744 249448 248834 248901 249642 249934 249008 247487
52594B47487q67K92J094J609K255K772K400J040l80q48l43K81L69Q8k8J65M09
$$ 247487 246620 246912 248006 249615 251870 254642 257042 258082 257702 256854 256511 256792 257161 257249 257221 257386 257795
52577B57795N48O78Q31R36J066J317J414R02r7q33q45n57o05r73j175j015p24
$$ 257795 258343 259021 259852 260788 261854 263171 264585 265487 265390 264557 263712 263155 262550 261577 260402 259387 258663
52560B58663n20m61n39o03l26K80N71l0j133j710j349o66l56l77k95M8N52J165
$$ 258663 258143 257682 257143 256540 256214 256494 257065 257035 255902 254192 252843 252177 251821 251444 251149 251197 251749 252914
52542B52914J696J609N47r19j600r68K31R09Q75P65R38J054P94M15K76K18n6l03
$$ 252914 254610 256219 256766 255847 254247 253279 253510 254419 255294 256059 256997 258051 258845 259260 259536 259754 259698 259395
52524B59395k0O29Q33J76p09q60r5Q27J046N17O6M90J579K288K098J748K183L136
$$ 259395 259375 260004 260837 261013 260304 259444 259349 260176 261222 261739 261805 262295 263874 266162 268260 270008 272191 275327
52506B75327L595L327L052L014K439Q39j105k465l160l475l264k410j620j751
$$ 275327 278922 282249 285301 288315 290754 291593 290488 288023 284863 281388 278124 275714 274094 272343
52492B72343k552k858k025n58O13R73N64j08l94j35P5k98q41o83K18R66R51N54
$$ 272343 269791 266933 264908 264350 264963 265936 266500 266392 265998 265863 265938 265640 264799 264116 264334 265300 266251 266805
52474B66805M03M83L30k20p85q32j82Q00J535J838K061K519K995L155L147L315
$$ 266805 267208 267691 268021 267801 267016 266184 266002 266802 268337 270175 272236 274755 277750 280905 284052 287367
52458B87367L508L219K373J366L41r30k298l100l008k499k104j781j375j224j685
$$ 287367 290875 294094 296467 297833 298174 297244 294946 291846 288838 286339 284235 282454 281079 279855 278170
52443B78170k487l062l268l178k562j300j70j95j110j386k32J288J757J291J029
$$ 278170 275683 272621 269353 266175 263613 262313 262143 261948 260838 259452 259220 260508 262265 263556 264585
52428B64585J239J119L67k29r0K48J01k51j13M74Q98R10Q06Q33J017J368J755
$$ 264585 265824 266943 267310 267081 266991 267239 267340 267089 266976 267450 268348 269258 270064 270897 271914 273282 275037
52411B75037J873J805K276L670N199N914O219P387R594J1471J1678J0000O817
$$ 275037 276910 278715 280991 284661 289860 295774 301993 309380 318974 330445 342123 352123 358940
52398C58940K619j652m771o365p144p640p563o717n613m642l579k460j981k250
$$ 358940 361559 359907 355136 348771 341627 333987 326424 319707 314094 309452 305873 303413 301432 299182
52384B99182k203j186k12m41j207q78P21K209K723K799L104L516L720L745L640
$$ 299182 296979 295793 295581 295140 293933 293055 293776 295985 298708 301507 304611 308127 311847 315592 319232
52369C19232L355L154L470M178M575M202L218J966P56m7l37n88j157j498q42M03
$$ 319232 322587 325741 329211 333389 337964 342166 345384 347350 348106 348059 347722 347134 345977 344479 343637 344040
52353C44040R55M55n9K33Q48J027J027J618K816L801L878L098K108J703K231L309
$$ 344040 344995 345450 345391 345624 346472 347499 348526 350144 352960 356761 360639 363737 365845 367548 369779 373088
52337C73088M236M825N456O260O847O998P228Q213J0047J2218J4118J5347J5848
$$ 373088 377324 382149 387605 393865 400712 407710 414938 423151 433198 445416 459534 474881 490729
52324D90729J6078J6749J8100J9602K0589K0944K0996K0913K0526J9678J8561
$$ 490729 506807 523556 541656 561258 581847 602791 623787 644700 665226 684904 703465
52313G03465J7604J7100J7013J7195J7665J8390J8830J8231J6622J4980J4059
$$ 703465 721069 738169 755182 772377 790042 808432 827262 845493 862115 877095 891154
52302H91154J3487J2589J1536J0967J0769J0158Q879P416N990M153J602j264l858
$$ 891154 904641 917230 928766 939733 950502 960660 969539 976955 982945 987098 988700 987436 983578
52289I83578n923p424q437r252j0103j0744j0768j0241r474q245o137l571j607
$$ 983578 977655 970231 961794 952542 942439 931695 920927 910686 901212 892967 886830 883259 881652
52276H81652m96O79K608M832O572P808Q999J0347J1715J2814J3262J2948J2498
$$ 881652 881156 881835 884443 889275 895847 903655 912654 923001 934716 947530 960792 973740 986238
52263I86238J2706J3388J3588J3097J2819J3301J3950J4152J4152J4108J3428
$$ 986238 998944 1012332 1025920 1039017 1051836 1065137 1079087 1093239 1107391 1121499 1134927
52252A134927J1882J0430R808R096O923L542M01j951m241o887r298j0926j1929
$$ 1134927 1146809 1157239 1167047 1176143 1183066 1186608 1187009 1185058 1180817 1173930 1164632 1153706 1141777
52239A141777j2570j2859j3005j3461j4207j4639j4436j3921j3419j2857j2236
$$ 1141777 1129207 1116348 1103343 1089882 1075675 1061036 1046600 1032679 1019260 1006403 994167
52228I94167j1873j1835j1605j0709r307p885o595n275l846k517j584j146r39
$$ 994167 982294 970459 958854 948145 938838 930953 924358 919083 915237 912720 911136 909990 909051
52215I09051n11L07J190J788K218K756L271L465L612M359N612O248N442L891L072
$$ 909051 908540 908847 910037 911825 914043 916799 920070 923535 927147 931506 937118 943366 948808 952699 955771
52200I55771L481M141L976L132K614K939L697M325M793N230N426N150M705M545
$$ 955771 959252 963393 967369 970501 973115 976054 979751 984076 988869 994099 999525 1004675 1009380 1013925
52186A013925M456L735K285Q38r3q64k003l387m663n930p428q813r455r308q908
$$ 1013925 1018381 1022116 1024401 1025239 1025146 1024282 1022279 1018892 1014229 1008299 1000871 992058 982603 973295 964387
52171I64387q494p748o461n011l902l146k340j228k3Q18J146J442K358L921N389
$$ 964387 955893 948145 941684 936673 932771 929625 927285 926057 926034 926852 927998 929440 931798 935719 941108
52156I41108O010N709M867L783K620J574P18r9p88q14J61J501K121J743J166J212
$$ 941108 947118 952827 957694 961477 964097 965671 966389 966290 965502 964688 964849 966350 968471 970214 971380 972592
52140I72592J800K252K074J329N00K01P92K122L670M993O023P007Q388J0606J3668
$$ 972592 974392 976644 978718 980047 980547 980748 981540 983662 987332 992325 998348 1005355 1013743 1024349 1038017
52125A038017J6948J9675K1766K3838K6306K8700L0133L0349L0011K9939L0151
$$ 1038017 1054965 1074640 1096406 1120244 1146550 1175250 1205383 1235732 1265743 1295682 1325833
52114A325833K9837K8286K5774K3370K1829K0806J9176J6134J1906P552M134K024
$$ 1325833 1355670 1383956 1409730 1433100 1454929 1475735 1494911 1511045 1522951 1530503 1534637 1536661
52102A536661Q10j79j324k543l505l906l788l725m502o342q594j0473j1971j3681
$$ 1536661 1537471 1537292 1535968 1533425 1529920 1526014 1522226 1518501 1513999 1507657 1499063 1488590 1476619 1462938
52088A462938j5880j8253k0362k1842k2135k0750j8010j5013j2593j0654q679
$$ 1462938 1447058 1428805 1408443 1386601 1364466 1343716 1325706 1310693 1298100 1287446 1278767
52077A278767o363l635o24K140M057N295O749Q861J1043J2642J3814J4954J5901
$$ 1278767 1272404 1268769 1268145 1270285 1274342 1279637 1286386 1295247 1306290 1318932 1332746 1347700 1363601
52064A363601J6312J6331J6168J5498J4064J2486J1661J1480J0946R482P521N802
$$ 1363601 1379913 1396244 1412412 1427910 1441974 1454460 1466121 1477601 1488547 1498029 1505550 1511352
52052A511352M621L744K639Q11j665m150o294q580j1503j4633j7117j8886k0561
$$ 1511352 1515973 1519717 1522356 1523167 1521502 1517352 1511058 1502478 1490975 1476342 1459225 1440339 1419778
52039A419778k2301k3574k4061k4066k3861k3284k2142k0560j8767j6931j5244
$$ 1419778 1397477 1373903 1349842 1325776 1301915 1278631 1256489 1235929 1217162 1200231 1184987
$$ [...]
##END NTUPLES=NMR SPECTRUM
##END=
