##TITLE=AC1569_ROEFFECT0021_8271072_0DjOt5wei0
##JCAMPDX= 6.0         $$ Bruker NMR JCAMP-DX V2.0
##DATA TYPE= NMR SPECTRUM
##DATA CLASS= NTUPLES
##ORIGIN= BRUKER
##OWNER= Administrator
$$ 1.72 TOPSPIN		Version 2.1
$$ 2013-10-18 17:37:54.336 -0700  Administrator@X
$$ Compression mode = diff/dup
##.OBSERVE FREQUENCY= 400.02188249412
##.OBSERVE NUCLEUS= ^1H
##.ACQUISITION MODE= SIMULTANEOUS (DQD)
##.ACQUISITION SCHEME= undefined
##.AVERAGES= 8
##.DIGITISER RES= 22
##SPECTROMETER/DATA SYSTEM= spect
##.PULSE SEQUENCE= zg30
##.SOLVENT NAME= COFFEE_meoh
##.SHIFT REFERENCE= INTERNAL, COFFEE_meoh, 1, 14.98509
##AUDIT TRAIL= $$ (NUMBER, WHEN, WHO, WHERE, PROCESS, VERSION, WHAT)
$$ ##TITLE= Audit trail, TOPSPIN		Version 2.1
$$ ##JCAMPDX= 5.01
$$ ##ORIGIN= Bruker BioSpin GmbH
$$ ##OWNER= Administrator
$$ $$ E:\/data/COFFEE/nmr/AC1569_ROEFFECT0021_8271072_0DjOt5wei0/10/pdata/1/auditp.txt
$$ ##AUDIT TRAIL=  $$ (NUMBER, WHEN, WHO, WHERE, PROCESS, VERSION, WHAT)
(   1,<2013-10-18 17:37:47.367 -0700>,<Administrator>,<X>,<go>,<TOPSPIN 2.1>,
      <created by zg
	started at 2013-10-18 17:36:41.539 -0700,
	POWCHK enabled, PULCHK disabled,
       configuration hash MD5:
       C8 4E 4E 5D D3 5C D8 9E 9F 52 82 E0 59 8A DE 15
       data hash MD5: 64K
       4E 47 97 92 A3 BA 23 C2 E4 FE D3 F8 76 88 8B 6D>)
(   2,<2013-10-18 17:37:50.539 -0700>,<Administrator>,<X>,<proc1d>,<TOPSPIN 2.1>,
      <Start of raw data processing
       efp LB = 0 FT_mod = 6 PKNL = 1 PHC0 = 0 PHC1 = 0 SI = 32K 
       data hash MD5: 32K
       BE EF 36 75 22 71 92 AE 9A 96 64 EE BF 47 62 73>)
(   3,<2013-10-18 17:37:50.898 -0700>,<Administrator>,<X>,<proc1d>,<TOPSPIN 2.1>,
      <pk PHC0 = 95.19104 PHC1 = 0 
       data hash MD5: 32K
       39 A5 D5 C8 8D 8D A7 6B F6 9B A3 7A 8D 77 53 7B>)
(   4,<2013-10-18 17:37:51.008 -0700>,<Administrator>,<X>,<proc1d>,<TOPSPIN 2.1>,
      <abs ABSG = 1 
       data hash MD5: 32K
       E0 FA A3 8A 21 D9 98 A5 C3 AE 2F 73 40 35 38 65>)
(   5,<2013-10-18 17:37:51.102 -0700>,<Administrator>,<X>,<proc1d>,<TOPSPIN 2.1>,
      <abs ABSG = 2 
       data hash MD5: 32K
       0D 65 8A 44 6D A6 78 95 D4 D1 27 E3 C8 2B C5 AE>)
(   6,<2013-10-18 17:37:51.164 -0700>,<Administrator>,<X>,<proc1d>,<TOPSPIN 2.1>,
      <abs ABSG = 3 
       data hash MD5: 32K
       38 99 A9 F4 C5 1B 3A 03 C6 E9 A8 4B 64 8E 21 BD>)
(   7,<2013-10-18 17:37:51.227 -0700>,<Administrator>,<X>,<proc1d>,<TOPSPIN 2.1>,
      <abs ABSG = 4 
       data hash MD5: 32K
       34 86 A3 34 D7 2E CF C8 28 E1 C5 26 AB 23 32 2D>)
(   8,<2013-10-18 17:37:51.289 -0700>,<Administrator>,<X>,<proc1d>,<TOPSPIN 2.1>,
      <abs ABSG = 5 
       data hash MD5: 32K
       4F FA 91 47 9E 64 DC BF 23 20 56 5D DC 7D 42 16>)
$$ ##END=
$$ 
$$ $$ hash MD5
$$ $$ 06 7E 85 A2 40 0D 1F 9E 97 A2 9B F1 5E 3A D1 C1
##$RELAX= 
##$RELAX= 
##$RELAX= 
##$RELAX= 
##$RELAX= 
##$RELAX= 
##$RELAX= 
$$ Bruker specific parameters
$$ --------------------------
##$DU= <E:\>
##$EXPNO= 10
$$ [...]
150 150 150 150 150 150 150 150
##$TP07= 0
##$TPNAME0= <>
##$TPNAME1= <>
##$TPNAME2= <>
##$TPNAME3= <>
##$TPNAME4= <>
##$TPNAME5= <>
##$TPNAME6= <>
##$TPNAME7= <>
##$TPOAL= (0..7)
0.5 0.5 0.5 0.5 0.5 0.5 0.5 0.5
##$TPOFFS= (0..7)
0 0 0 0 0 0 0 0
##$TUNHIN= 0
##$TUNHOUT= 0
##$TUNXOUT= 0
##$USERA1= <user>
##$USERA2= <user>
##$USERA3= <user>
##$USERA4= <user>
##$USERA5= <user>
##$V9= 5
##$VALIST= <valist>
##$VCLIST= <CCCCCCCCCCCCCCC>
##$VD= 0
##$VDLIST= <DDDDDDDDDDDDDDD>
##$VPLIST= <PPPPPPPPPPPPPPP>
##$VTLIST= <TTTTTTTTTTTTTTT>
##$WBST= 1024
##$WBSW= 4
##$XGAIN= (0..3)
0 0 0 0
##$XL= 0
##$YL= 0
##$YMAX_a= 635098
##$YMIN_a= -539539
##$ZGOPTNS= <>
##$ZL1= 120
##$ZL2= 120
##$ZL3= 120
##$ZL4= 120
##$ABSF1= 14.98509
##$ABSF2= -5.573092
##$ABSG= 5
##$ABSL= 3
##$ALPHA= 0
##$AQORDER= 0
##$ASSFAC= 0
##$ASSFACI= 0
##$ASSFACX= 0
##$ASSWID= 0
##$AUNMP= <proc_prof1d_extract_pilot.lims>
##$AXLEFT= 0
##$AXNAME= <>
##$AXNUC= <1H>
##$AXRIGHT= 0
##$AXTYPE= 0
##$AXUNIT= <>
##$AZFE= 0.1
##$AZFW= 0.1
##$BCFW= 0
##$BC_mod= 0
##$BYTORDP= 0
##$COROFFS= 0
##$CY= 15
##$DATMOD= 1
##$DC= 0
##$DFILT= <>
##$DTYPP= 0
##$F1P= 0
##$F2P= 0
##$FCOR= 0.5
##$FTSIZE= 32768
##$FT_mod= 6
##$GAMMA= 0
##$GB= 0
##$INTBC= 1
##$INTSCL= 1
##$ISEN= 128
##$LB= 0
##$LEV0= 0
##$LPBIN= 0
##$MAXI= 10000
##$MC2= 0
##$MEAN= 0
##$ME_mod= 0
##$MI= 0
##$NCOEF= 0
##$NC_proc= -8
##$NLEV= 6
##$NOISF1= 0
##$NOISF2= 0
##$NSP= 0
##$NTH_PI= 0
##$NZP= 0
##$OFFSET= 14.98509
##$PC= 1
##$PHC0= 95.19104
##$PHC1= 0
##$PH_mod= 1
##$PKNL= yes
##$PPARMOD= 0
##$PPDIAG= 0
##$PPIPTYP= 0
##$PPMPNUM= 2147483647
##$PPRESOL= 1
##$PSCAL= 4
##$PSIGN= 0
##$PYNMP= <proc.py>
##$REVERSE= no
##$SF= 400.02
##$SI= 32768
##$SIGF1= 0
##$SIGF2= 0
##$SINO= 400
##$SIOLD= 32768
##$SPECTYP= <>
##$SREGLST= <1H.CDCl3>
##$SSB= 0
##$STSI= 32768
##$STSR= 0
##$SW_p= 8223.68421052631
##$SYMM= 0
##$S_DEV= 0
##$TDeff= 65536
##$TDoff= 0
##$TI= <>
##$TILT= no
##$TM1= 0
##$TM2= 0
##$TOPLEV= 0
##$USERP1= <user>
##$USERP2= <user>
##$USERP3= <user>
##$USERP4= <user>
##$USERP5= <user>
##$WDW= 1
##$XDIM= 32768
##$YMAX_p= 459996601
##$YMIN_p= -697520
##$CURPLOT= <Network HP LaserJet P1505>
##$CURPRIN= <$Network HP LaserJet P1505>
##$DFORMAT= <normdp>
##$LAYOUT= <+/1D_H.xwp>
##$LFORMAT= <normlp>
##$PFORMAT= <normpl>
##$SURQMSG= 1
$$ End of Bruker specific parameters
$$ ---------------------------------
##NTUPLES= NMR SPECTRUM
##VAR_NAME=  FREQUENCY,     SPECTRUM/REAL,   SPECTRUM/IMAG
##SYMBOL=    X,             R,               I
##VAR_TYPE=  INDEPENDENT,   DEPENDENT,       DEPENDENT
##VAR_FORM=  AFFN,          ASDF,            ASDF
##VAR_DIM=   32768,         32768,           32768
##UNITS=     HZ,            ARBITRARY UNITS, ARBITRARY UNITS
##FACTOR=    0.250966925370066, 1,           1
##FIRST=     8223.43324360094, -89752,       -19579
##LAST=      0,             116462,          -223107
##MIN=       0,             -697520,         0
##MAX=       8223.43324360094, 459996601,    0
$$ Real data points
##PAGE= N=1
##DATA TABLE= (X++(R..R)), XYDATA
$$ [...]
19563a74755J7577D8896M8119c9229k71751J38072e3685E2287g9195L3017l9161
$$ -174755 -157178 48896 97015 -39229 -310980 -172908 -53685 52287 -79195 -46178 -85339
19552h5339q0748l7596A93639a51794d9871m21284J91060L3735g7017F5100d9505
$$ -85339 -166087 -203683 193639 -151794 -49871 -471155 -280095 -246360 -77017 65100 -49505
19540F8347K04145j08148m1496b34952c6996A06552i7497I4084A4959a75729J3339
$$ 68347 272492 164344 122848 -234952 -36996 106552 -97497 94084 14959 -175729 -162390
19529a62390j32764r0695a12111N1242A42456i4950A40268K1364i4328r0673j01623
$$ -162390 -295154 -385849 -112111 -60869 142456 -94950 140268 161632 -94328 -185001 -286624
19518b86624a5040A37072c19672a30152A73417a42573F7224b08203Q7336A38500
$$ -286624 -15040 137072 -319672 -130152 173417 -142573 67224 -208203 -120867 138500
19507f3562b118D9921Q7196a24323B88683g4593b611E7769N3460a82446g7653
$$ -63562 -2118 49921 137117 -124323 288683 -74593 -2611 57769 111229 -182446 -77653
19495b2769j4751C7930a26371b2361A24766b21781G4433b9369A31894a52238A1596
$$ -22769 -37520 37930 -126371 -22361 124766 -221781 74433 -29369 131894 -152238 11596
19483g8872E4718a6584G1187g9265k82706h023D02805o9151r0859A16872B7055
$$ -78872 54718 -16584 71187 -79265 -361971 -8023 402805 333654 242795 116872 27055
19471f7739A61572o6632a62754q7732a13748m1533C0664L14223b60931L2410M7211
$$ -67739 161572 94940 -162754 -250486 -113748 -155281 30664 344887 -260931 -228521 -181310
19460a81310f2897a1894j79745m3390B39063b75153A30707d62978K21672i8273
$$ -181310 -62897 -11894 -191639 -235029 239063 -275153 130707 -462978 -241306 -98273
19449e7003D770c7265B8669J9682b01343i515A80478F1487J27692q362c86961
$$ -57003 4770 -37265 28669 48351 -201343 -9515 180478 61487 189179 180817 -386961
19437d1388j8659j17559j25185J20369A07125K41811j08290r4044a13166l58420
$$ -41388 -60047 -177606 -302791 -182422 107125 348936 240646 146602 -113166 -471586
19427d71586I6757f7008N30j34075e4899F6419a60230j91611f2233k37582e969
$$ -471586 96757 -67008 -66478 -200553 -54899 66419 -160230 -351841 -62233 -299815 -5969
19415d3849A22683c25688o8535a12525Q617m4951A02650b26867d5928j9024k57723
$$ -43849 122683 -325688 -394223 -112525 -103908 -148859 102650 -226867 -45928 -64952 -322675
19404c22675b8905j76831I5660a37170B82016h8175n8482M1799k68683I3034a73426
$$ -322675 -28905 -205736 95660 -137170 282016 -88175 -146657 -104858 -373541 93034 -173426
19392A1905a88417a0084G4894J3870c7209k0707m5114c8387r7803C8409c12726
$$ 11905 -188417 -10084 74894 88764 -37209 -57916 -103030 -38387 -136190 38409 -312726
19380a8176p9227q8663d7584k00482C29928j48270b06261A33748e6465p4426J5513
$$ -18176 -97403 -186066 -47584 -248066 329928 181658 -206261 133748 -56465 -130891 -115378
19369a15378m6189c8584l38788A48295a8007g395A5582K53793b25533j54896a36179
$$ -115378 -161567 -38584 -377372 148295 -18007 -7395 15582 269375 -225533 -380429 -136179
19357b29017J13499A143J84948i6911D0855b61333Q8255M359M3948p2341a4949
$$ -229017 -115518 1143 186091 -96911 40855 -261333 -173078 -168719 -124771 -197112 -14949
19345G3599a90674F7224c9503n07121A63852B6630a39986j00040A60252B4029
$$ 73599 -190674 67224 -39503 -546624 163852 26630 -139986 -240026 160252 24029
19334C4438b15865R7743k73379I9617i2410n1094B35024A0600J66484a73430j26374
$$ 34438 -215865 -118122 -391501 99617 -92410 -143504 235024 10600 177084 -173430 -299804
19323b99804k71871b14627A58464p0566a13554k86014J25727B92769I2775a80993
$$ -299804 -571675 -214627 158464 87898 -113554 -399568 -273841 292769 92775 -180993
19312g3482F4535a01593j08493A09187a51783F2236m264h4736K9273a6529A64628
$$ -73482 64535 -101593 -210086 109187 -151783 62236 57972 -84736 -55463 -16529 164628
19300A1534M8756g782r9343d5316j01763N3964J8173L03A98659h6240K2057A06211
$$ 11534 60290 -7782 -107125 -45316 -147079 -93115 -74942 -74639 198659 -86240 -64183 106211
19287G0711a87258k69785b3707l31414J73783G8343A4426i7132l8475n7734g0668
$$ 70711 -187258 -457043 -23707 -355121 -181338 78343 14426 -97132 -135607 -193341 -70668
19275i1352a2738A02267J98017a46666D78088a28521A0581a25750E5107M5728
$$ -91352 -12738 102267 300284 -146666 478088 -128521 10581 -125750 55107 100835
19265A00835a85462A53700c13441b3563l63763J8055A1674O5300b3006B0591b14269
$$ 100835 -185462 153700 -313441 -23563 -387326 -369271 11674 76974 -23006 20591 -214269
19253B18300E2617c89055A11422m4126j4688D369N641f9178j74315O7748I2039
$$ 218300 52617 -389055 111422 67296 52608 4369 10010 -69178 -243493 -175745 92039
19241a66548B23303b15611I0176i5590n246A91609c40812J38534m4935Q4506a2659
$$ -166548 223303 -215611 90176 -95590 -100836 191609 -340812 -202278 -247213 -162707 -12659
19229a08940A35419c13708F6332a25850e3110a4985o4801m803H7919b28012L4929
$$ -108940 135419 -313708 66332 -125850 -53110 -14985 -79786 -84589 87919 -228012 -193083
19218a93083R0295k49783J26061j83471H2345L3617b42252A66280K564a3751B5169
$$ -193083 -102788 -352571 -226510 -409981 82345 115962 -242252 166280 168844 -13751 25169
19206D1861b79214g2296j60963H0413C1825b68567b1709j52269A03163A4301a07348
$$ 41861 -279214 -72296 -233259 80413 31825 -268567 -21709 -173978 103163 14301 -107348
19194b06317A42803B7655g0467B26580F4854h6325j0893k1187n6250D9100p777
$$ -206317 142803 27655 -70467 226580 64854 -86325 -97218 -118405 -174655 49100 41323
19183D1323K37874m1758M5693d20142A70548a02501A536a90171A5398L22758a04833
$$ 41323 279197 237439 283132 -420142 170548 -102501 1536 -190171 15398 338156 -104833
19171I8793a01635g836j546k54428d8516k6865k6320m0833K9915n8830B89130
$$ 98793 -101635 -7836 -9382 -263810 -48516 -75381 -101701 -142534 -112619 -171449 289130
19159c88164C03203o2308b58581i8716j3501q8074P3673j54040H3170i3871D3363
$$ -388164 303203 240895 -258581 -98716 -112217 -200291 -126618 -280658 83170 -93871 43363
19147D9963M4399a03070B5900L8532b0134A09779K76415a1331m0821n2134I142
$$ 49963 94362 -103070 25900 64432 -20134 109779 386194 -11331 -52152 -104286 9142
19135f6997J4393n20849G5030K7355b976l10649m1790e9473j90939a14940n7351
$$ -66997 -52604 -573453 75030 102385 -2976 -313625 -355415 -59473 -250412 -114940 -172291
19124a72291k6087K725N9570e444B21844f524j09914K1054a8151n7146N854B93893
$$ -172291 -198378 -195653 -136083 -5444 221844 -6524 -116438 -95384 -18151 -75297 -69443 293893
19111b66238a7781j23693k6249H526J49793a20179j18790J16993j71176H4772
$$ -266238 -17781 -141474 -167723 8526 158319 -120179 -238969 -121976 -293152 84772
19100b07772E41000c134l09154O9356B14261H1180a92193l1270H8103h5415q7010
$$ -207772 541000 -3134 -312288 -242932 214261 81180 -192193 -223463 88103 -85415 -172425
19089a72425D1863a72207C2548a24585J095l18381h3648B25695a93657F3470a35115
$$ -172425 41863 -172207 32548 -124585 -123490 -441871 -83648 225695 -193657 63470 -135115
19077b97087J20746D1382d8899A91674c14627B6048b61248a5608g742j51793k19086
$$ -297087 -176341 41382 -48899 191674 -314627 26048 -261248 -15608 -7742 -159535 -378621
19066c78621B9276a16329e957A33247i527B7658K39561F9064d6255F2878a48124
$$ -378621 29276 -116329 -5957 133247 -9527 27658 267219 69064 -46255 62878 -148124
19054B40321a07252B3659b1060D9038a72296j26560B56507g4879n0006d2314H0450
$$ 240321 -107252 23659 -21060 49038 -172296 -298856 256507 -74879 -124885 -42314 80450
19042B03176a43518A10650h9308B93667a83271N1117D8674E383g4369q314G9942
$$ 203176 -143518 110650 -89308 293667 -183271 -132154 48674 5383 -74369 -82683 79942
19030D7499f9475i654A66777k2522J53633A22775a14730B21030m5506J89430A19109
$$ 47499 -69475 -9654 166777 144255 297888 122775 -114730 221030 175524 364954 119109
19018A29988e9891E0353a03715A91887c5973A53232e7940k09595A31246B1996
$$ 129988 -59891 50353 -103715 191887 -35973 153232 -57940 -267535 131246 21996
19007b3282E8988Q2618C4827a7982j95323H7601a56744n073G2835b59947J21399
$$ -23282 58988 141606 34827 -17982 -213305 87601 -156744 -161817 72835 -259947 -138548
18996a38548j78242D0311K74846B4815a53028J1404d2976a2555k62617J34344
$$ -138548 -316790 40311 315157 24815 -153028 -141624 -42976 -12555 -275172 -140828
18986a40828O8798j50486D0198J98310a44005O0405D9058J2603a26710r2087B45765
$$ -140828 -72030 -222516 40198 238508 -144005 -83600 49058 61661 -126710 -218797 245765
18974A44335E8063a24716C39d0526k42801n6653N2747A88893a76857C56849A08082
$$ 144335 58063 -124716 339 -40526 -283327 -339980 -287233 188893 -176857 356849 108082
18962a93245a3247k03776G2798l4193a39096b5946j58117j05250Q1284B5466J05917
$$ -193245 -13247 -217023 72798 38605 -139096 -25946 -184063 -289313 -208029 25466 131383
18951A31383J44404a25060K1915k6241I5727N4362c981I4974c1481a3765I9343
$$ 131383 275787 -125060 -103145 -129386 95727 150089 -3981 94974 -31481 -13765 99343
18939a03675o3477F5551M0162j1620N1408c38457J59570j30144C04522J247m084
$$ -103675 -167152 65551 105713 94093 145501 -338457 -178887 -309031 304522 305769 301685
18928C01685a11870M3322C3883J14989a11712h04j20793j36681A84333b4983n1274
$$ 301685 -111870 -68548 33883 148872 -111712 -804 -121597 -258278 184333 -24983 -76257
18917g6257k4246F1206J82572a59065A41874n0843b51631k6495c8597j974C0354
$$ -76257 -100503 61206 243778 -159065 141874 91031 -251631 -278126 -38597 -40571 30354
18905a98986j50204A5204b01998F680O7572a0549C92280F8219b34742O1063B5682
$$ -198986 -349190 15204 -201998 6680 74252 -10549 392280 68219 -234742 -173679 25682
18893a7851p3941p68A62398h7381m5995F6650r735h6660j34459H1566a4746B42254
$$ -17851 -91792 -92560 162398 -87381 -133376 66650 56915 -86660 -221119 81566 -14746 242254
18880a49787K4880A21617a01327j76405I9301A3276a54780b9236k5128A55379
$$ -149787 -124907 121617 -101327 -277732 99301 13276 -154780 -29236 -54364 155379
18869a09728j55437j32966a5258J799k10457C05878c77915J7638B24940c35308
$$ -109728 -265165 -398131 -15258 -13459 -223916 305878 -377915 -360277 224940 -335308
18858B21973j6707e26621J37408a24853C85158H7937J09389r2586J7326a61070
$$ 221973 205266 -526621 -389213 -124853 385158 87937 197326 104740 122066 -161070
18847b66048B3121R763a72540c5050A34876k9164a34630k20497A98914A2290c84712
$$ -266048 23121 32884 -172540 -35050 134876 105712 -134630 -355127 198914 12290 -384712
18835h0039J6310A25493a04649M5568A24377a34635G0393a8713j46630P5480k24411
$$ -80039 -63729 125493 -104649 -59081 124377 -134635 70393 -18713 -165343 -89863 -314274
18824c14274M3699B18401a21785I7519N3132a5961A65381f0385I3565c84127A19870
$$ -314274 -270575 218401 -121785 97519 150651 -15961 165381 -60385 93565 -384127 119870
18812a13027C61659c5790D19113n4951l4741G0772O2565i8611m9289M2724j26422
$$ -113027 361659 -35790 419113 364162 329421 70772 133337 -98611 -147900 -105176 -231598
18801b31598A42008a30562C5338b42169C56074K3394a22694r641c9856C1122O92
$$ -231598 142008 -130562 35338 -242169 356074 379468 -122694 -132335 -39856 31122 31814
18790C1814d9799D9455a06615p4212G0210Q202J15713a65459I6940c7555B01089
$$ 31814 -49799 49455 -106615 -180827 70210 78412 194125 -165459 96940 -37555 201089
18778B99304a67497C32974c37303N5300F3428L0101m3808M945M0332a4333p9624
$$ 299304 -167497 332974 -337303 -282003 63428 93529 49721 54666 94998 -14333 -93957
18767i3957A53172D2563b02457A20807L7916c72900C1506g1881l93921J85845
$$ -93957 153172 42563 -202457 120807 158723 -372900 31506 -71881 -465802 -279957
18757b79957E2670b01747D5560c67406J29587I0712c7125e092k28654A70006b0727
$$ -279957 52670 -201747 45560 -367406 -237819 90712 -37125 -5092 -233746 170006 -20727
18745a49790B74948c60302n57A3443c6984M049B36287b6196j31140K7161d2027
$$ -149790 274948 -360302 -360859 13443 -36984 -32935 236287 -26196 -157336 -130175 -42027
18733f0902K5511B8099b9888A19318P6875q6316R8899c7944m78435B99844a86676
$$ -60902 -35391 28099 -29888 119318 196193 109877 208776 -37944 -516379 299844 -186676
18721c6831j00774B05996A00281b50511j93558G7527a18184k07119g2810a1089
$$ -36831 -137605 205996 100281 -250511 -444069 77527 -118184 -325303 -72810 -11089
18710A403b72481E4269b63384A05728C3388B462a71947A46005j4718f2028c0287
$$ 1403 -272481 54269 -263384 105728 33388 2462 -171947 146005 131287 -62028 -30287
18698d23934a94529L5225A64532F5032e9669k68637A6318a47874B00831a22611
$$ -423934 -194529 -159304 164532 65032 -59669 -328306 16318 -147874 200831 -122611
18687B97829a56007e571k87497g6296k05296O2724f8789A61047a67441A33820
$$ 297829 -156007 -5571 -293068 -76296 -281592 -218868 -68789 161047 -167441 133820
18676h9993j17508b1953p1153L6747a3248I1564a44378M9470j33497A68732a16078
$$ -89993 -207501 -21953 -93106 -56359 -13248 91564 -144378 -94908 -228405 168732 -116078
18664A20975E9092a43474q4671D8951a15888B16793a85418r1135a06937K2309
$$ 120975 59092 -143474 -228145 48951 -115888 216793 -185418 -276553 -106937 -84628
18654h4628q1086k08946h4718D8921a58215J1090M2575B09049q9459a23592H6138
$$ -84628 -165714 -374660 -84718 48921 -158215 -147125 -104550 209049 119590 -123592 86138
18642a94991m9755R2638c388B27540a21647e2516B45411j6885b74437a29502k21518
$$ -194991 -244746 -152108 -3388 227540 -121647 -52516 245411 228526 -274437 -129502 -351020
18631c51020J68217P5914I5348b80556A46309b8807E1596k2497d78808a59839
$$ -351020 -182803 -106889 95348 -280556 146309 -28807 51596 29099 -478808 -159839
18620d31254d3240N778j83468f7902r2701J6494B49732A21842c41115A41770m1456
$$ -431254 -43240 -37462 -220930 -67902 -160603 -144109 249732 121842 -341115 141770 100314
18609A00314h0019B05789f8689A65170i2144p3051g9949A5349b78848D2617N2547
$$ 100314 -80019 205789 -68689 165170 -92144 -165195 -79949 15349 -278848 42617 95164
18598I5164Q54e1982j39123j52117L5445e7382A08214b4896A66195D1964N3956
$$ 95164 96018 -51982 -191105 -343222 -307777 -57382 108214 -24896 166195 41964 95920
18587I5920h1609C36d1121k095A84772a17097j12099E1470f7058A80902b3687
$$ 95920 -81609 336 -41121 -43216 184772 -117097 -229196 51470 -67058 180902 -23687
18575B05643b28366M6885A04677d4572q8259D2797N674b15291f9298B949L9701
$$ 205643 -228366 -181481 104677 -44572 -132831 42797 48471 -215291 -69298 2949 42650
18564D2650a95814A17605a67345C5125c9761m5472E7296b71396D8587K6191R0854
$$ 42650 -195814 117605 -167345 35125 -39761 -85233 57296 -271396 48587 74778 165632
18553A65632l8215L6081a37953A70309m3589N4588j5998c23018O2274b7870F3898
$$ 165632 127417 163498 -137953 170309 126720 181308 165310 -323018 -260744 -27870 63898
18541A40910a10073B53448l2979a98280L1368N6265F2205c24916J11960M4392
$$ 140910 -110073 253448 220469 -198280 -166912 -110647 62205 -324916 -212956 -168564
18531a68564K9413b6665j68111k3172q9534i7850c6965I5253M7585A2145f616
$$ -168564 -139151 -26665 -194776 -217948 -307482 -97850 -36965 95253 142838 12145 -6616
18519i7j15722C73J11627K9246a04679j27088A25899E222a43336e4375H6812c0144
$$ -97 -115819 373 112000 141246 -104679 -231767 125899 5222 -143336 -54375 86812 -30144
18506B1022b4387E8146f5722G5397a21630I7350a21910I5189h4028F8437b23365
$$ 21022 -24387 58146 -65722 75397 -121630 97350 -121910 95189 -84028 68437 -223365
18494D5443b88120O8151d7775c06B19684a62210j53638A3118a69201m5197b1986
$$ 45443 -288120 -219969 -47775 -306 219684 -162210 -315848 13118 -169201 -214398 -21986
18482A63582b64302E7563i0204j0055A69228D7369J4290a00525n3646j93790A36308
$$ 163582 -264302 57563 -90204 -100259 169228 47369 61659 -100525 -154171 -347961 136308
18470B08874b10978f6719l4072l3972D07077E341J37187c0504n9339A47894d3580
$$ 208874 -210978 -66719 -100791 -134763 407077 5341 142528 -30504 -89843 147894 -43580
18458a20523j16899J7484L5901O6685J0664c5573j41064c5399l15866a12576A60431
$$ -120523 -237422 -219938 -184037 -117352 -106688 -35573 -176637 -35399 -351265 -112576 160431
18446A3232b29239m4469a0004A9521a55826C495c16757k566A02319O8524A3853
$$ 13232 -229239 -273708 -10004 19521 -155826 3495 -316757 -319323 102319 170843 13853
18434a445A5667b73889A50289C9437a37966d4573B1665f8215j52582a8776I7684
$$ -1445 15667 -273889 150289 39437 -137966 -44573 21665 -68215 -220797 -18776 97684
18422a58952A72271h7404A88983b36852G1519b65041a12386C5476a4895j19884
$$ -158952 172271 -87404 188983 -236852 71519 -265041 -112386 35476 -14895 -134779
18412a34779M1931C5843e13085b05448L4779F8128e618B37252J78131e8266B40316
$$ -134779 -92848 35843 -513085 -205448 -170669 68128 -5618 237252 415383 -58266 240316
18400b76874A87778i8408E1661M2197p745J39716F6953M5060a20967j22333M3771
$$ -276874 187778 -98408 51661 93858 86113 225829 66953 112013 -120967 -243300 -199529
18389a99529I669Q0905f2893A35061h0603C4680O7271D690e3894A82284a83902
$$ -199529 9669 90574 -62893 135061 -80603 34680 101951 4690 -53894 182284 -183902
18377a32478I2501a47859E81824g8781H6152J56445E3390a87264B48229D9580
$$ -132478 92501 -147859 581824 -78781 86152 242597 53390 -187264 248229 49580
18366B48667A15298J99400b63287e4861C84666b30367J06042b8513a3695A29746
$$ 248667 115298 314698 -263287 -54861 384666 -230367 -124325 -28513 -13695 129746
18355A8507a32118M0881p2499B95481a65079A97562a51264g0264p8030M1103d2379
$$ 18507 -132118 -91237 -163736 295481 -165079 197562 -151264 -70264 -148294 -107191 -42379
18343a1660k10691I9192A0470P7332i5285j68271K5547k27473d90A67748J41954
$$ -11660 -222351 99192 10470 87802 -95285 -263556 -238009 -465482 -490 167748 309702
18332C09702b53439C677J50074C1192J86721b87577a21754c6389A98468h3600
$$ 309702 -253439 3677 153751 31192 217913 -287577 -121754 -36389 198468 -83600
18321b92772B55810f5866A8934d2326l32614J01606D8457J66635h6840C8449a61874
$$ -292772 255810 -65866 18934 -42326 -374940 -273334 48457 215092 -86840 38449 -161874
18309b30056C14562I58i0129B39912e3316n5550B9257b75596J33050C3976g7415
$$ -230056 314562 958 -90129 239912 -53316 -108866 29257 -275596 -142546 33976 -77415
18297B0556b32413c6769A3753a40097d776j9294j14711E0071O7499n4003P1925
$$ 20556 -232413 -36769 13753 -140097 -4776 -24070 -138781 50071 117570 63567 135492
18286A35492c0647l9074j18460p7600e1477l03101C25881i6663a7778r522j99667
$$ 135492 -30647 -69721 -188181 -265781 -51477 -354578 325881 -96663 -17778 -27300 -226967
18275b26967h5901m9609J9659B21555c2822q4179m25466E3657k0848a33838A44589
$$ -226967 -85901 -135510 -115851 221555 -32822 -117001 -542467 53657 32809 -133838 144589
18263b96330a47253A40858b5108D8098D24L48999c0838j83947B53759a67844M4414
$$ -296330 -147253 140858 -25108 48098 424 349423 -30838 -214785 253759 -167844 -123430
18252a23430j5434q215L103C0629b24272a8426B79269a17534o3798I9733d80297
$$ -123430 -138864 -147079 -143976 30629 -224272 -18426 279269 -117534 -181332 99733 -480297
18240A88000e7693q1752d5897j71043d5465e857C1653J64400E1225K7337b56921
$$ 188000 -57693 -139445 -45897 -216940 -45465 -5857 31653 196053 51225 78562 -256921
18228D9233e928B21296C3914a81567P0259o1005i905B01405c7252j80035l45358
$$ 49233 -5928 221296 33914 -181567 -111308 -172313 -9905 201405 -37252 -217287 -562645
18217e62645B35419l0640a74044B51793a42600i784k10829L5103Q0253o2765L5090
$$ -562645 235419 204779 -174044 251793 -142600 -9784 -220613 -185510 -105257 -168022 -132932
18206a32932A87769A0501a70366P3572E36c1461k53679J27694a1630B63981C9873
$$ -132932 187769 10501 -170366 -96794 536 -31461 -285140 -157446 -11630 263981 39873
18194E296a2404A98460q4846a09066j68411H0706R8214b16041A70282a72649d2859
$$ 5296 -12404 198460 113614 -109066 -277477 80706 178920 -216041 170282 -172649 -42859
18182b45959k7322A96554h5032j72798R9811j32916c402k77686j3250e768J664
$$ -245959 -273281 196554 -85032 -257830 -158019 -290935 -3402 -281088 -294338 -5768 -4104
18171d104j6981m518M599j90413J04238A80154h977F9999d6941n2000j41823B52487
$$ -4104 -21085 -25603 -21004 -211417 -107179 180154 -8977 69999 -46941 -98941 -240764 252487
18158E6801A9594K904M4105i4851k83816a79100A87172l4384R4316I6316B8568
$$ 56801 19594 22498 66603 -94851 -378667 -179100 187172 152788 247104 96316 28568
18146c21914J52028E1985a04492k42872g4231B98607J8245c3689H1748C3133P5507
$$ -321914 -169886 51985 -104492 -347364 -74231 298607 316852 -33689 81748 33133 108640
18135A08640b28798E8405c7930j19254k05775E2930a5406A25452C0754L35927
$$ 108640 -228798 58405 -37930 -157184 -362959 52930 -15406 125452 30754 366681
18125C66681i8031C70204i0628j10308l2458H6161P3462a55879k231c623n6060
$$ 366681 -98031 370204 -90628 -200936 -233394 86161 159623 -155879 -158110 -3623 -59683
18114e9683B3637g5756o7689N9899I973i1724j19912n5726B67133C0668c39597
$$ -59683 23637 -75756 -143445 -83546 9973 -91724 -211636 -267362 267133 30668 -339597
18102B66330H766h4884a9325q7202G3368b21415N5788E3176b19348i9634k3644
$$ 266330 8766 -84884 -19325 -106527 73368 -221415 -165627 53176 -219348 -99634 -123278
18091a23278a3009m6546A09714K58356E455Q7578b45195a21639a4464j27638j8107
$$ -123278 -13009 -59555 109714 368070 5455 93033 -245195 -121639 -14464 -142102 -160209
18080a60209q8432J19775k77987A86751B0488K2c9114j12491A12282c58032a15239
$$ -160209 -248641 -128866 -406853 186751 20488 20510 -39114 -151605 112282 -358032 -115239
18068H7615a09156A88985F7469f3489H6581d9879J3489G9429R006f0473G1364
$$ 87615 -109156 188985 67469 -63489 86581 -49879 -36390 79429 88435 -60473 71364
18056a29861B73290r8483D5901a60569j19115F8497J06638c114B7836J20546o2590
$$ -129861 273290 174807 45901 -160569 -279684 68497 175135 -3114 27836 148382 85792
18045H5792O9649c05168h7313l79779b03345a9974m7442I649d2796A08253b06379
$$ 85792 155441 -305168 -87313 -467092 -203345 -19974 -67416 9649 -42796 108253 -206379
18033F9811i409l22514A38561K4374c9638j37229G1260c6778H8483k3415f8949
$$ 69811 -9409 -331923 138561 162935 -39638 -176867 71260 -36778 88483 65068 -68949
18021a34668m2078c5993l8599a4645r4056E8774K43151b75731H3254b866j09855
$$ -134668 -176746 -35993 -74592 -14645 -108701 58774 301925 -275731 83254 -2866 -112721
18010a12721j19906h1794B87021a46197f5514D6906N3461L9150h2797A6576K16177
$$ -112721 -232627 -81794 287021 -146197 -65514 46906 100367 139517 -82797 16576 232753
17999B32753i8621d8463l33k49941B22800e5257C56177g1156A00396h7596j07282
$$ 232753 -98621 -48463 -48796 -298737 222800 -55257 356177 -71156 100396 -87596 -194878
17988a94878E6843b89761B2830J1154d3823J6413j38022P9741L8562C51318a86201
$$ -194878 56843 -289761 22830 33984 -43823 -27410 -165432 -85691 -47129 351318 -186201
17976B79944a12140C1118a24285B33752B6142J64444a39893k44041A0433a0997
$$ 279944 -112140 31118 -124285 233752 26142 190586 -139893 -383934 10433 -10997
17965c40820B71713q6277a12663A36176a67034C8978f026D854K199K02326q8035
$$ -340820 271713 185436 -112663 136176 -167034 38978 -6026 4854 7053 209379 121344
17954A21344g0499k14446B01824a85928Q540Q945h2199j89367O2493A6870M2224
$$ 121344 -70499 -284945 201824 -185928 -177388 -168443 -82199 -271566 -209073 16870 59094
17943E9094b4340A69827b43602B72K5665M0013a57810O5109j55858D9258d160
$$ 59094 -24340 169827 -243602 272 25937 65950 -157810 -92701 -248559 49258 -4160
17931A41248k5724D1905a89559C8237e5683g541H4556a78094M0856l7286G9347
$$ 141248 115524 41905 -189559 38237 -55683 -7541 84556 -178094 -137238 -174524 79347
17919B815b27773G4985J37195A05904J2763c82759i871k06529L2215j07319A40004
$$ 2815 -227773 74985 212180 105904 118667 -382759 -9871 -216400 -184185 -291504 140004
17907a60992j5931C34196a21396j96976h0847j31244A13973a90337A81048a95744
$$ -160992 -176923 334196 -121396 -318372 -80847 -212091 113973 -190337 181048 -195744
17896h9405J6310k09426R3973D22300a17833c3576C87921C8979i577A53170A1784
$$ -89405 -73095 -282521 -188548 422300 -117833 -33576 387921 38979 -9577 153170 11784
17884i5838k31763a32114c4593k46853M5941E8355L7994b28374A5757h9470j3634
$$ -95838 -327601 -132114 -34593 -281446 -235505 58355 96349 -228374 15757 -89470 -103104
17873a03104A3090J24868a40468B35824e3406C2449b572F831J96275c1270m2260
$$ -103104 13090 137958 -140468 235824 -53406 32449 -2572 6831 203106 -31270 -73530
17862g3530A58009a3886A63042n307g9357A05845E2302R8467j345l0744j8131
$$ -73530 158009 -13886 163042 157735 -79357 105845 52302 150769 149424 118680 100549
17851A00549c61660A97901O3001b07554A7951L03187E0107b0325n5669j9142j32390
$$ 100549 -361660 197901 260902 -207554 17951 321138 50107 -20325 -75994 -95136 -227526
17840b27526f4523j17667A34199b41459m9390A07578L8468B4345h3925D9674i8754
$$ -227526 -64523 -182190 134199 -241459 -290849 107578 146046 24345 -83925 49674 -98754
17828A80359a47575B8649c6095j72394J0237F1885K159b69471C12664A1412J86966
$$ 180359 -147575 28649 -36095 -208489 -198252 61885 64044 -269471 312664 11412 198378
17817A98378J9982E8290a25024A92921a89199D8116c16981D94164a57217C94098
$$ 198378 218360 58290 -125024 192921 -189199 48116 -316981 494164 -157217 394098
17806a94600E4639b31882A14064e8676A1732b08415h880A19721d5985A00640d0597
$$ -194600 54639 -231882 114064 -58676 11732 -208415 -8880 119721 -45985 100640 -40597
17794B07514o6229c20206a25814e3746A29510a04075j25047B51921c73666H8040
$$ 207514 141285 -320206 -125814 -53746 129510 -104075 -229122 251921 -373666 88040
17783h5359j58809A60936H0116C6519K6210g9174I0125J35328b64119C9446a09578
$$ -85359 -244168 160936 80116 36519 62729 -79174 90125 225453 -264119 39446 -109578
17771B08559P6162b02327c4347l56194A81803a42830F3689a44310A42285a99089
$$ 208559 284721 -202327 -34347 -390541 181803 -142830 63689 -144310 142285 -199089
17760B73693a28711G5791g5654j26716f5301A57219k2304F3627b17895B01891
$$ 273693 -128711 75791 -75654 -202370 -65301 157219 134915 63627 -217895 201891
17749a70792A50311a10441a2757o0989H6404P5536p9203d331j45820C21140n4973
$$ -170792 150311 -110441 -12757 -73746 86404 161940 82737 -4331 -150151 321140 266167
17738B66167b63662A23634l8803b29081L7728k17461h3603A61772K01235b76179
$$ 266167 -263662 123634 84831 -229081 -191353 -408814 -83603 161772 363007 -276179
17727A57425h0557A1840J03443J46950f7659j44626h3362B65157H114P6923a81670
$$ 157425 -80557 11840 115283 262233 -67659 -212285 -83362 265157 8114 85037 -181670
17715A96113O0922e0703c582j9728i946B36409L5754a10967a1328C6592M1945
$$ 196113 257035 -50703 -3582 -23310 -9946 236409 272163 -110967 -11328 36592 78537
17704G8537J90703A06467R5008H70c18215J35262H3621a55127M1671p7862a190
$$ 78537 269240 106467 201475 870 -318215 -182953 83621 -155127 -113456 -191318 -1190
17692f9301E6277g0719J0688k31474a37338j21813A3186g9801p3988A62749K8770
$$ -69301 56277 -70719 -60031 -291505 -137338 -259151 13186 -79801 -153789 162749 191519
17681A91519o4121J19940a17187A19645J55337D6461a6241A80828a47361C82756
$$ 191519 127398 247338 -117187 119645 274982 46461 -16241 180828 -147361 382756
17670c0854A29661a21551c3146B88171a6304E1428a06642B47613o3671H5577R4081
$$ -30854 129661 -121551 -33146 288171 -16304 51428 -106642 247613 183942 85577 179658
17659A79658a3262n5142A0554L13835c2717A05485J48207H1527C0169L5134d962
$$ 179658 -13262 -68404 10554 324389 -32717 105485 253692 81527 30169 65303 -4962
17647D8098I825d4544B618L43851a61004f5183A9812e31401g7357J472A1090K11597
$$ 48098 9825 -44544 2618 346469 -161004 -65183 19812 -531401 -77357 -75885 11090 222687
17635B22687m07a15385l58360C43417A55474d4759l52950B31785b50845B24871
$$ 222687 222280 -115385 -473745 343417 155474 -44759 -397709 231785 -250845 224871
17624c9454A30728C7240Q4258k4842D550K66468b81997c6304j19392d6083j22053
$$ -39454 130728 37240 121498 96656 4550 271018 -281997 -36304 -155696 -46083 -168136
17613a68136B33637H9213R0784a25314B56448J42818A59035A4025K86720d16078
$$ -168136 233637 89213 179997 -125314 256448 399266 159035 14025 300745 -416078
17602A09095M0164b37476j0184B83273A29156B0093L819L7886K63875a79110D27480
$$ 109095 149259 -237476 -247660 283273 129156 20093 23912 61798 325673 -179110 427480
17590b02767h2804H7749d21567b0150f373A06713a74529h4677C23906E9347a28042
$$ -202767 -82804 87749 -421567 -20150 -6373 106713 -174529 -84677 323906 59347 -128042
17578f2537a2499A95527f0772m061A98552g3284C3200h8499k7196r7898M7699
$$ -62537 -12499 195527 -60772 -64833 198552 -73284 33200 -88499 -115695 -213593 -165894
17567a65894j56441B86238j03611f1239C5031e0739B00985a38055b5070j28513
$$ -165894 -322335 286238 182627 -61239 35031 -50739 200985 -138055 -25070 -153583
17557a53583G9386J07464b916r8609A54745E1874g0088A37994c4547j6957A15463
$$ -153583 79386 186850 -2916 -101525 154745 51874 -70088 137994 -34547 -51504 115463
17545A25273B2755e980D8812J63942j02715a09402G7605K49744a44886I4083A9793
$$ 125273 22755 -5980 48812 212754 110039 -109402 77605 327349 -144886 94083 19793
17533B154M059L11218i3354G8945J21899C4002a12548B83010b15852G4989M8600
$$ 2154 6213 317431 -93354 78945 200844 34002 -112548 283010 -215852 74989 123589
17522A23589B2330J09131B7749J52472g3541p5199B15616H5645c6455C82030c35753
$$ 123589 22330 131461 27749 180221 -73541 -148740 215616 85645 -36455 382030 -335753
17510A90288L10943d6894A00356N0920a48124C50912d6950p4424A16251b8384
$$ 190288 501231 -46894 100356 151276 -148124 350912 -46950 -121374 116251 -28384
17499A55380M6960h8810A24340L7736J6051F8250J54679N3872c11440C43451D6909
$$ 155380 202340 -88810 124340 162076 178127 68250 222929 276801 -311440 343451 46909
17487C74988i0097c3873C06870A03229a54381A48180n5150a60641A07606J95703
$$ 374988 -90097 -33873 306870 103229 -154381 148180 93030 -160641 107606 303309
17477C03309e2446B97496j09292A5708p98f9059A55579O1560q3757e0746C06332
$$ 303309 -52446 297496 188204 15708 14910 -69059 155579 217139 133382 -50746 306332
17465B55750I289K46262r6153B4135a25179N6656C06686J16694B9650J81205p5743
$$ 255750 9289 255551 159398 24135 -125179 -68523 306686 423380 29650 210855 135112
17454A35112a46098F6070J08428P7942M2573J37963B6060K10339f0050b4394D32465
$$ 135112 -146098 66070 174498 252440 295013 432976 26060 236399 -60050 -24394 432465
17442F8059J27550R7803c8600C31967j54528K15163A78058k644L21896A45435
$$ 68059 195609 293412 -38600 331967 177439 392602 178058 175414 497310 145435
17431A64761a51292D90605B11775G4067J76198J4782a83103D16371j92129M3424
$$ 164761 -151292 490605 211775 74067 250265 265047 -183103 416371 224242 267666
17421B67666J15267M7067j20502B317L43807K34139d8620A97782J15860E6906
$$ 267666 382933 430000 309498 2317 346124 580263 -48620 197782 313642 56906
17410d1491A64223J5274J06343j0780K1368q4906A2036L69753j73371j8502a05961
$$ -41491 164223 179497 285840 275060 296428 211522 12036 381789 208418 189916 -105961
17398D41046A97546J4199K2206a52402B51001J15312d476B67691j4577o6462a6085
$$ 441046 197546 211745 233951 -152402 251001 366313 -4476 267691 253114 186652 -16085
17386A49672L36913d4282o313C67483j15727q1021a52240l5846N6989C34181o1204
$$ 149672 486585 -44282 -50595 367483 251756 170735 -152240 -188086 -131097 334181 272977
17375B72977A176P4888P9274K20211A31832J27697r0900k9916K04154o1419m6005
$$ 272977 1176 76064 155338 375549 131832 259529 168629 138713 342867 281448 235443
17364B35443F4570L56648j99531A5370h8852H429a9845B59849d9043j6907k15272
$$ 235443 64570 421218 221687 15370 -88852 8429 -19845 259849 -49043 -65950 -281222
17353b81222A19031M34775a01674J3578B12348B1368K26655c11253A64466L1180
$$ -281222 119031 553806 -101674 -88096 212348 21368 248023 -311253 164466 195646
17343A95646L49096B15621K11459B03630Q6108h1110l7928A233a4530q7463C30008
$$ 195646 544742 215621 427080 203630 289738 -81110 -119038 1233 -14530 -101993 330008
17331C84686g0019B53795j8266j12384b80214C8559J40264a68065q8600B16976
$$ 384686 -70019 253795 235529 123145 -280214 38559 178823 -168065 -256665 216976
17320C35442m0553N5219a34894e6964B89490A02428j2909a73649A60375J024J07038
$$ 335442 294889 350108 -134894 -56964 289490 102428 89519 -173649 160375 161399 268437
17309B68437b8576l2121J4267D14486j77642Q9095A48722D0681Q4334D7278Q4734
$$ 268437 -28576 -60697 -46430 414486 236844 325939 148722 40681 125015 47278 132012
17298A32012O5221K37721j19893o5943D8737N4923N2522p4580N5949J1023O1607
$$ 132012 197233 434954 315061 249118 48737 103660 156182 81602 137551 148574 210181
17287B10181H2113K21295L00691A81252a22340C3483J78337F7673J1565b62714
$$ 210181 82113 303408 604099 181252 -122340 33483 211820 67673 79238 -262714
17276B31237J6973J84239H0965M5321l5979J68810E0464K86660M7069b05809A01936
$$ 231237 248210 432449 80965 126286 90307 259117 50464 337124 384193 -205809 101936
17264I3847i1202C2059J71445H1910J3498K34640j13782m4567Q0189J17006l687
$$ 93847 -91202 32059 203504 81910 95408 330048 216266 171699 251888 368894 365207
17253C65207O9562j55164j32876g2106A6594K19024o9102O7036k4770b23839J04611
$$ 365207 434769 279605 146729 -72106 16594 235618 166516 233552 208782 -223839 -119228
17242a19228b3032F8564J6897J6551J14412p6324J17049J01127A06900K48662
$$ -119228 -23032 68564 85461 102012 216424 140100 257149 358276 106900 355562
17232C55562j33418H3451D29J56335a1003B76142J619J5856A9925i1556G0474
$$ 355562 222144 83451 429 156764 -11003 276142 277761 293617 19925 -91556 70474
17220D73714j47568j05346l0154d2092A94505i4459C44652A09315L86447A08430
$$ 473714 326146 220800 190646 -42092 194505 -94459 344652 109315 495762 108430
17209B86114Q9380D9474i0132A04081G05J22062J69459f4541A35916J33225e4889
$$ 286114 375494 49474 -90132 104081 705 122767 292226 -64541 135916 269141 -54889
17197I2593L6907l6721L14660A84717a86323B4993j816K00473K19849m048A29616
$$ 92593 129500 92779 407439 184717 -186323 24993 23177 223650 443499 439451 129616
17185B09855q5182J67745F4898L44493A02208N8195L91719B47314J12819a5527
$$ 209855 124673 292418 64898 409391 102208 160403 552122 247314 360133 -15527
17174A54265F6382K63535j31842J62141o8665B0424M39714A37945K17157A40324
$$ 154265 66382 329917 198075 360216 291551 20424 460138 137945 355102 140324
17163F6007J22679M54273H4301a0819A12584P1798J81092l174H4796Q7190j645
$$ 66007 188686 642959 84301 -10819 112584 184382 365474 362300 84796 171986 170341
17152A70341J5525D3009K23629J27323A62326R248R4854K5523J53447j58098j40533
$$ 170341 185866 43009 266638 393961 162326 171574 266428 291951 445398 287300 146767
17141A46767J01174A14810l5740K53261j33560r917N5294J30466A50422M8112
$$ 146767 247941 114810 79070 332331 198771 188854 244148 374614 150422 198534
17131A98534J12930l2358K18765R7165C2803K70870J54111b5019E85168A53369
$$ 198534 311464 279106 497871 595036 32803 303673 457784 -25019 585168 153369
17120C64510l7444A55164J12689L95141k83070j84157J8143J83515p1096J49323
$$ 364510 327066 155164 267853 662994 379924 195767 213910 397425 326329 475652
17110D75652k37269M4064R4139J03223j38026l2437O5756k0809J30825B29453
$$ 475652 238383 282447 376586 479809 341783 309346 375102 354293 485118 229453
17099D18685J9125j33382K86422A27437P7150n7930J59560K12291J70542A0172
$$ 418685 437810 304428 590850 127437 204587 146657 306217 518508 689050 10172
17088B76118J36779R7942N38k25238J05898J46216n6700j37278a63572D03479
$$ 276118 412897 510839 511377 286139 392037 538253 481553 344275 -163572 403479
17077D26641j16461J9762k0480K59821k24678R0581J5873q573A98930K18151B05441
$$ 426641 310180 329942 309462 569283 344605 435186 451059 442486 198930 417081 205441
17065D15666J10358k22992j26997G8944L68569o6299j37555O4393J89285M05167
$$ 415666 526024 303032 176035 78944 447513 381214 243659 308052 497337 902504
17055I02504l42364j92549p0783J07470j26172M01178J2448B69036N1976p1015
$$ 902504 560140 367591 296808 404278 278106 679284 691732 269036 321012 249997
17045B49997L30793k5530O4996p7612r0797l4990P212J06766L40804C50170J62355
$$ 249997 580790 555260 620256 542644 451847 416857 424069 530835 871639 350170 512525
17034E12525M35679l38656j40385J52328j69085j39387O43009k81348k34993p8392
$$ 512525 948204 609548 469163 621491 452406 313019 956028 674680 439687 361295
17024C61295J26707n6111G6799N54397j36767q9347R586J13312j39616N9448J62231
$$ 361295 488002 431891 76799 631196 494429 405082 414668 527980 388364 447812 610043
17013F10043J66991j62447K20146k62077J3750J31787j12312M48662k74304J49452
$$ 610043 777034 614587 834733 572656 586406 718193 605881 1054543 780239 929691
17003I29691m13723N5541N3492J84689l3564n2151k44654K42977j32102L08748
$$ 929691 515968 571509 625001 809690 776126 723975 479321 722298 590196 898944
16993H98944L47638B88331N48625l20674L63472J63306j95536p1086L03773D44561
$$ 898944 1246582 288331 836956 516282 879754 1043060 847524 776438 1080211 444561
16982A103728n19333M7590J85743j8611j7181K54530j60175r4362M4391j0272
$$ 1103728 584395 631985 817728 799117 781936 1036466 876291 781929 826320 816048
16972H16048r1159J8967p011r8233L53790J5102j66173l38123L38045K0182k33985
$$ 816048 724889 743856 736845 638612 992402 1007504 841331 503208 841253 861435 627450
16961F27450p9382M7680L82053k1031j64750J64344k4138q5157K83957j71635
$$ 627450 548068 595748 977801 956770 792020 956364 932226 847069 1131026 959391
16951I59391j44419P0388K44318r7867J22918j85570l0312M1176J38545j01939
$$ 959391 814972 885360 1129678 1031811 1154729 969159 938847 980023 1118568 1016629
16941A016629P0851J05720j26457J4631J03971l9490K48961l91067K15427k68098
$$ 1016629 1087480 1193200 1066743 1081374 1185345 1145855 1394816 1003749 1219176 951078
16931I51078K98397l06817Q1814q8770K90412q3052L58162k29229k38272L83588
$$ 951078 1249475 942658 1024472 935702 1226114 1143062 1501224 1271995 1033723 1417311
16921A417311l67491M31797o70334L75627M0588K84775M1144l02980k9891K26740
$$ 1417311 1049820 1481617 811283 1186910 1227498 1512273 1553417 1250437 1220546 1447286
16911A447286K6846l693l47592J1032L5067J34197J75290K6016O0580m01160J18098
$$ 1447286 1474132 1470439 1122847 1133879 1168946 1303143 1478433 1504449 1565029 1163869 1281967
16900A281967L33358J77011r9154n942K70589k79118J4051N9868L9579r0210M6205
$$ 1281967 1615325 1792336 1693182 1687240 1957829 1678711 1692762 1752630 1792209 1701999 1748204
16889A748204j60051K7257L61566J10298j63827K5842k23401N67109n70523J10190
$$ 1748204 1588153 1615410 1976976 2087274 1923447 1949289 1725888 2292997 1722474 1832664
16879A832664L03893N036k56886L93533j47316q3748K1850K30814K88196n25399
$$ 1832664 2136557 2141593 1884707 2278240 2130924 2047176 2069026 2299840 2588036 2062637
16869B062637J33369L8870J14787p7316J57092n007L02577j23922j28839J3035
$$ 2062637 2196006 2234876 2349663 2272347 2429439 2424432 2727009 2603087 2474248 2487283
16859B487283J97769j88188K15623k5347J44698q033K23013k21397J8294n719
$$ 2487283 2685052 2496864 2712487 2687140 2831838 2823805 3046818 2825421 2843715 2837996
16849B837996M38358m72985J48504L13713k41307K91199k17847L18851K83988
$$ 2837996 3276354 2803369 2951873 3265586 3024279 3315478 3097631 3416482 3700470
16840C700470l10035J19091p4587K43264k61732J87349J1080P1048K59694J57566
$$ 3700470 3390435 3509526 3434939 3678203 3416471 3603820 3614900 3685948 3945642 4103208
16830D103208j87536J95526K7689r2319N24804p8448N5889k4892J12305J82144
$$ 4103208 3915672 4111198 4138887 4046568 4571372 4492924 4548813 4523921 4636226 4818370
16820D818370J8747j7534L18333M9901k71609M72914J26019m9480j47046L31653
$$ 4818370 4837117 4819583 5137916 5187817 4916208 5389122 5515141 5465661 5318615 5650268
16810E650268J43206N61044j74706n1025J50271K23676P2028L57236L12705k1359
$$ 5650268 5793474 6354518 6179812 6128787 6279058 6502734 6574762 6931998 7244703 7223344
16800G223344K32729l23879N93414N7967J79649L34318k5985J54152M58599K78073
$$ 7223344 7456073 7132194 7725608 7783575 7963224 8297542 8271557 8425709 8884308 9162381
16790I162381n4317K61540M26231M61574K3431J47089M10879N23034L83572L66666
$$ 9162381 9108064 9369604 9795835 10257409 10280840 10427929 10838808 11361842 11745414 12112080
16780A2112080J94372K48013N57755K76504M54491L15591K72452Q60190L73327
$$ 12112080 12306452 12554465 13112220 13388724 13843215 14158806 14431258 15291448 15664775
16771A5664775M83983J149488j71846Q46204O93298P44853N92261Q84013P89542
$$ 15664775 16148758 17298246 17126400 17972604 18665902 19410755 20003016 20887029 21676571
16762B1676571J414801J76090J116552J378266R83110Q78240J446594R73267J620762
$$ 21676571 23091372 23267462 24384014 25762280 26745390 27623630 29070224 30043491 31664253
16753C1664253J214406J886974J348703J862047K308211J674712K442743K029001
$$ 31664253 32878659 34765633 36114336 37976383 40284594 41959306 44402049 46431050
16745D6431050K840391K611829K987390L200078L068645M094116L947300M171867
$$ 46431050 49271441 51883270 54870660 58070738 61139383 65233499 69180799 73352666
16737G3352666M206022N191280M931462O007249O035182O534363O620898P106212
$$ 73352666 77558688 82749968 87681430 93688679 99723861 106258224 112879122 119985334
16729A19985334P404849Q142436P953458Q005491Q738709P579972P582521P765346
$$ 119985334 127390183 135532619 143486077 151491568 160230277 167810249 175392770 183158116
16721A83158116O297818M892224M162463L043293J058250l26980j224506l326700
$$ 183158116 189455934 194348158 198510621 201553914 202612164 202285184 201060678 197733978
16713A97733978m633436n911326o222346p552264p960152q096249q546519q527803
$$ 197733978 193100542 187189216 180966870 173414606 165454454 157358205 148811686 140283883
16705A40283883q070632q064779p345000p500680o730189o752479n741232n963877
$$ 140283883 132213251 124148472 116803472 109302792 102572603 95820124 90078892 84115015
16697H4115015n149545m661683m774107m089336l795415l585417l308010k923930
$$ 84115015 78965470 74303787 69529680 65440344 61644929 58059512 54751502 51827572
16689E1827572l052345k477613k432947k245602k443061j507822k212023j494661
$$ 51827572 48775227 46297614 43864667 41619065 39176004 37668182 35456159 33961498
16681C3961498j574967j476321j589203j317961r11259j374190r80375j438383
$$ 33961498 32386531 30910210 29321007 28003046 27091787 25717597 24737222 23298839
16673B3298839j019267q73042q30485o37618r69808p79872o65807n76797o22860
$$ 23298839 22279572 21406530 20576045 19938427 18968619 18188747 17522940 16946143 16323283
16664A6323283m82006o81575n63105l93163l28114q44794n1166l86707l82886
$$ 16323283 15841277 15159702 14596597 14203434 13875320 13030526 12979360 12592653 12209767
16655A2209767k91430n00166n56267j6231l87931n80722j73287l03211r7584l77732
$$ 12209767 11918337 11418171 10861904 10845673 10457742 9877020 9703733 9400522 9302938 8925206
16645H925206l00991K07941q40959R8873j87113k45113l33948N7123m72062j83071
$$ 8925206 8624215 8832156 7991197 8090070 7902957 7657844 7323896 7381019 6908957 6725886
16635F725886k80171J46420j10183l45650J94810n62129J87315l84213j76420
$$ 6725886 6445715 6592135 6481952 6136302 6331112 5768983 5956298 5572085 5395665
16626E395665l11391K14067k06524r8888n55303N64200m51438J32688k21372j44234
$$ 5395665 5084274 5298341 5091817 4992929 4437626 5001826 4550388 4683076 4461704 4317470
16616D317470R0627k06375k87632q685J06062j90040k03211M15814m69073J60136
$$ 4317470 4408097 4201722 3914090 3905405 4011467 3821427 3618216 4034030 3564957 3725093
16606C725093l48678K21482l17982L8314j32400j0417j32451K40724k74204J71297
$$ 3725093 3376415 3597897 3279915 3318229 3185829 3175412 3042961 3283685 3009481 3180778
16596C180778j64456p4711Q6046k02266M60920l40930j48930k87021N6971k21151
$$ 3180778 3016322 2941611 3027657 2825391 3286311 2945381 2796451 2509430 2566401 2345250
16586B345250K63706M0399j93489N1897J47642k65694k90669J84493j97973j06980
$$ 2345250 2608956 2649355 2455866 2507763 2655405 2389711 2099042 2283535 2085562 1978582
16576A978582p1562K3866L40788j37928k55216j03449M33992p0231j20420j31828
$$ 1978582 1907020 1930886 2271674 2133746 1878530 1775081 2209073 2138842 2018422 1886594
16566A886594J43231l65364j8364K7922K8376P239o7483L72017k15146k15666
$$ 1886594 2029825 1664461 1646097 1674019 1702395 1709634 1642151 2014168 1799022 1583356
16556A583356J53816j50401J06336j94685r9147Q6253n9531j36486L91211o32588
$$ 1583356 1737172 1586771 1693107 1498422 1399275 1485528 1425997 1289511 1680722 1048134
16546A048134J68201L27823j58530P8890K6298R9539j33072j96920L31857j99764
$$ 1048134 1216335 1544158 1385628 1464518 1490816 1590355 1457283 1260363 1592220 1392456
16536A392456l88454j74463M05350J16865j13328k02947k714J08686J94675k5306
$$ 1392456 1004002 829539 1234889 1351754 1238426 1035479 1032765 1141451 1336126 1310820
16526A310820J22999m80444L4525j43483N27726l94329q9579K40900j63682J7994
$$ 1310820 1433819 953375 987900 844417 1372143 977814 888235 1129135 965453 983447
16516I83447l016P9441M9543j97601m8022J2901q9519J3337j48228K41685o9887
$$ 983447 980431 1059872 1109415 911814 863792 876693 787174 800511 652283 893968 824081
16505H24081j27211J56462K80281l22985j79057K01094j11166K20003D52965L79865
$$ 824081 696870 853332 1133613 810628 631571 832665 721499 941502 452965 832830
16495H32830J62361k25360q0914J08655J09597C49835P72076D83104O55295m94904
$$ 832830 995191 769831 688917 797572 907169 349835 1121911 483104 1138399 643495
16485F43495J54303k92170l5686L61002k42611j91627K05865K2614K27778k87215
$$ 643495 797798 505628 469942 830944 588333 396706 602571 625185 852963 565748
16475E65748L60228j34647J59809l47839j65743M3335K83028j89189J52918k08767
$$ 565748 925976 791329 951138 603299 437556 480891 763919 574730 727648 518881
16465E18881l5293j45192L69001k19750L31389p2926j04756A60863N76008C55137
$$ 518881 483588 338396 707397 487647 819036 746110 641354 160863 736871 355137
16454C67460L76400j05899l6547C00536M02618p5886k88886J52291J77928j70684
$$ 367460 743860 637961 601414 300536 703154 627268 338382 490673 668601 497917
16444D97917q8479O4168p1418j48911K40450A79725P60568D23920j93273K00827
$$ 497917 409438 473606 402188 253277 493727 179725 940293 423920 230647 431474
16434D31474J27904J26169k48431P1403m4298K85843l55366k4991K35584k29962
$$ 431474 559378 685547 437116 508519 464221 750064 394698 369707 605291 375329
16424C75329M3580J4053J91821A70896J82920j45829G2880N25699j32253A9605
$$ 375329 418909 432962 624783 170896 353816 207987 72880 598579 466326 19605
16413C79016K07764A66968K57613A83652K24473K24226j22176J53419B58309J11887
$$ 379016 586780 166968 424581 183652 408125 632351 510175 663594 258309 370196
16403C70196R4597n5813B3988L75500A76601K22087A18245N22459l11191j1152
$$ 370196 464793 408980 23988 399488 176601 398688 118245 640704 329513 318361
16393C18361J05358o2863M4360o3861J10246j90832A20332M60576B72275k418
$$ 318361 423719 360856 405216 341355 451601 260769 120332 580908 272275 269857
16383B69857J27404j66392J05288f5477B66288j5012L88917k10974n81b9423A13196
$$ 269857 397261 230869 336157 -65477 266288 251276 640193 429219 428638 -29423 113196
16371I2786K14691r774n9822q4369Q409F8418J02981M7704D2116M14231A95620
$$ 92786 307477 297703 237881 153512 161921 68418 171399 219103 42116 456347 195620
16359D39483h469M34B23486J90347p6686j18695j4031J28294j22535K8731H4832
$$ 439483 -8469 -8035 223486 413833 337147 218452 204421 332715 210180 238911 84832
16347C50085a01990B24527E8885B0547N06453B38994K57345k4488k05152J30442
$$ 350085 -101990 224527 58885 20547 527000 238994 496339 471851 266699 397141
16337C97141L4036I4282e9414A89834R0049e1124B98139j17281J48698F2708L21541
$$ 397141 431177 94282 -59414 189834 279883 -51124 298139 180858 329556 62708 384249
16326C84249c1478A00411M15587j50970g1045A78034q8700a10126H1086L31692
$$ 384249 -31478 100411 515998 365028 -71045 178034 89334 -110126 81086 412778
16316D12778j53532E9075Q9311A5359P0557D2855J01531N6611J57883I6147J46237
$$ 412778 259246 59075 148386 15359 85916 42855 144386 200997 358880 96147 242384
16305B42384q625J09733F8976a12246B02222d99k89910A13083J47172k0251A18083
$$ 242384 233759 343492 68976 -112246 202222 -499 -290409 113083 260255 240004 118083
16293a11536A20764M13378b71816B08344a48008K6030B36920C3638K76907k0708
$$ -111536 120764 534142 -271816 208344 -148008 -121978 236920 33638 310545 289837
16283B89837O8204o1401g6805C0780K60159E4704K73836l2051a74936h20B07031
$$ 289837 358041 296640 -76805 30780 290939 54704 328540 296489 -174936 -820 207031
16271B9084J00656J41811A08868D606J71047E9768K88034h0180k469B52883A8121
$$ 29084 129740 271551 108868 4606 175653 59768 347802 -80180 -82649 252883 18121
16259e9059q956B45123A07829D1564L52858E0914e1467q9222A20529b23188R1102
$$ -59059 -68015 245123 107829 41564 394422 50914 -51467 -140689 120529 -223188 -132086
16248a32086A12146b7162A01230j6341P2319g5440D3141Q0403L8197p1213R8756
$$ -132086 112146 -27162 101230 84889 157208 -75440 43141 123544 161741 90528 189284
16237A89284J20760Q7849b08431a1773A80087J49248F4386K03309b97849B34573
$$ 189284 310044 397893 -208431 -11773 180087 329335 64386 267695 -297849 234573
16226G9902J10044G4792h1353B4005f1418B20531b19946b5350m106E0181J15821
$$ 79902 189946 74792 -81353 24005 -61418 220531 -219946 -25350 -29456 50181 166002
16215A66002a11765A02539d1032j21602B9153h316B04108a06474D9055a72297
$$ 166002 -111765 102539 -41032 -162634 29153 -8316 204108 -106474 49055 -172297
16204a0324B1987J9978a47490N6252C95370a50859A88535p0753B8865f8437A87494
$$ -10324 21987 41965 -147490 -91238 395370 -150859 188535 117782 28865 -68437 187494
16192D73755c13839B25296B2596K46440D7914f4114L553G9648b89926a40964C15834
$$ 473755 -313839 225296 22596 269036 47914 -64114 -60561 79648 -289926 -140964 315834
16180A88675a01041B39156K5305a2982H7776H321J34487i5820B66165I7799K3532
$$ 188675 -101041 239156 264461 -12982 87776 8321 142808 -95820 266165 97799 121331
16169A21331F729M51877A81621F115K5550J35149b05300A05025g4948j8719D0801
$$ 121331 6729 458606 181621 6115 31665 166814 -205300 105025 -74948 -93667 40801
16157G6227l2599c51962G0234b42121H8869N754J3101b38598B43612I854K21851
$$ 76227 43628 -351962 70234 -242121 88869 94623 107724 -238598 243612 9854 231705
16146B31705f3536j23997B66674A6775a27337E8534L58707i4151j36545B00969
$$ 231705 -63536 -187533 266674 16775 -127337 58534 417241 -94151 -230696 200969
16135d7917C3280a49246c0204A31737a63001E8924J65935c70992I7723a33738
$$ -47917 33280 -149246 -30204 131737 -163001 58924 224859 -370992 97723 -133738
16124G9940a82264D2189A170b33047g9755F0939a43659M5337G1175b07966A31210
$$ 79940 -182264 42189 1170 -233047 -79755 60939 -143659 -98322 71175 -207966 131210
16112b60793A33976a10733j43965f5532k0377A40094A019K32827a91703A57246
$$ -260793 133976 -110733 -254698 -65532 -85909 140094 1019 233846 -191703 157246
16101b38705A59203p8178N4477l6737o969J33905i3527n6297B25987i8903j93682
$$ -238705 159203 81025 135502 98765 91796 225701 -93527 -149824 225987 -98903 -292585
16090b92585R1654A89545q8507a64613B11038p5486a63139A5592K08755l165J93116
$$ -292585 -200931 189545 101038 -164613 211038 135552 -163139 15592 224347 221182 414298
16079D14298j77917M5168a94577A19490i3591A40246D273J53640b5918k9064A86223
$$ 414298 236381 281549 -194577 119490 -93591 140246 4273 157913 -25918 -54982 186223
16067B0911J44453c75459f9157p2347G8045c22398B38380a990B51215I7507l9804
$$ 20911 165364 -375459 -69157 -141504 78045 -322398 238380 -1990 251215 97507 57703
16056E7703O8938a39118e6060B23190f8971F2528F796f1797E4809b40707M5214
$$ 57703 126641 -139118 -56060 223190 -68971 62528 6796 -61797 54809 -240707 -195493
16045a95493o6598f272A15685c213B8293a42093D9051b14001r0790f7307J5831
$$ -195493 -262091 -6272 115685 -3213 28293 -142093 49051 -214001 -304791 -67307 -51476
16034e1476F3316a70441B7062R7421a35225N4295j2956k8056B98154b23034A05176
$$ -51476 63316 -170441 27062 124483 -135225 -80930 -93886 -121942 298154 -223034 105176
16022I3177a06485H1799b10196G5551K16218E9040a94777A56837a15704q772a1610
$$ 93177 -106485 81799 -210196 75551 291769 59040 -194777 156837 -115704 -124476 -11610
16010B76260D2170J21378a9851j67997A53605f7660B74270A06270c7333l5078
$$ 276260 42170 163548 -19851 -187848 153605 -67660 274270 106270 -37333 -72411
16000g2411o6395J451B61760C8860I604K8327i1671G1892a53743a4002B15664
$$ -72411 -138806 -137355 261760 38860 9604 37931 -91671 71892 -153743 -14002 215664
15988a15562K5542r8845e2073i599B21053o7046M8687d081C56563H5652b9029
$$ -115562 -90020 -188865 -52073 -9599 221053 154007 202694 -4081 356563 85652 -29029
15976a48026A36436f3232o7496A32946f1733l8682C1729J53550a74015g6876k4228
$$ -148026 136436 -63232 -130728 132946 -61733 -100415 31729 185279 -174015 -76876 -101104
15965a01104b7226B02199M9430D5633A6785d00152f2464B00142m1105P29b31447
$$ -101104 -27226 202199 251629 45633 16785 -400152 -62464 200142 159037 159766 -231447
15953b34504b3169k05653A7451R0492c32513a56530C1312g5541n1134n215n0181
$$ -234504 -23169 -228822 17451 107943 -332513 -156530 31312 -75541 -126675 -131890 -182071
15942a82071p665N244L3741J2323j32544R7176j84095A8339b12477l5763F4129
$$ -182071 -189736 -184492 -150751 -138428 -270972 -173796 -357891 18339 -212477 -248240 64129
15930a63556M6023C9376b63844k875i6037j66656M689D3922O8767c28034h0544
$$ -163556 -117533 39376 -263844 -266719 -96037 -262693 -258004 43922 112689 -328034 -80544
15918a13688b6669j60429p0257j39653c7160o9624k10319A18177P0455N3835b14063
$$ -113688 -26669 -187098 -257355 -397008 -37160 -106784 -317103 118177 188632 242467 -214063
15906b19627G2124K42207a75847B23274a37276AR3473N9825d37021a06251j19388
$$ -219627 72124 314331 -175847 223274 -137276 1 93474 153299 -437021 -106251 -225639
15895b25639e7056B99027b61917A52127k5218a05202H9071J50916F3151J29028
$$ -225639 -57056 299027 -261917 152127 126909 -105202 89071 239987 63151 192179
15885A92179A0533O4104J6521a23364j06470o6054e2895j20678j72502O2907f7457
$$ 192179 10533 74637 91158 -123364 -229834 -295888 -52895 -173573 -346075 -283168 -67457
15873A22444D5977r730M090c7853m4052L0017k24424I6647a29207J5629H3257
$$ 122444 45977 36247 40337 -37853 -81905 -51888 -276312 96647 -129207 -113578 83257
15861b83276A01649C7662b46087a09835B56590g9k05431C4496a72715j38655B40582
$$ -283276 101649 37662 -246087 -109835 256590 -79 -205510 34496 -172715 -311370 240582
15849a39602F8131f0132A00695a50042r7953B9296J6854i4731b5671k38882B35178
$$ -139602 68131 -60132 100695 -150042 -247995 29296 46150 -94731 -25671 -264553 235178
15837g2606q7131L5995L569A42897M1718F7701J37588b74858C3366K4256R6283
$$ -72606 -159737 -123742 -120173 142897 184615 67701 205289 -274858 33366 57622 153905
15826A53905J3746c3796A12408d06065e0038l15318J79958L223F5080i1933k01823
$$ 153905 167651 -33796 112408 -406065 -50038 -365356 -185398 -182175 65080 -91933 -293756
15815b93756G7881b19272B18467E1666M0543m381J9391b48030C2243e7879B42898
$$ -293756 77881 -219272 218467 51666 92209 87828 107219 -248030 32243 -57879 242898
15803d4907B22343I8144J11582b52221C905J82111f8730j32326j82577b6402A19091
$$ -44907 222343 98144 209726 -252221 3905 186016 -68730 -201056 -383633 -26402 119091
15791b64729c0860r7892e2478A3663J36829b29056A39508a04256b3457j56463
$$ -264729 -30860 -128752 -52478 13663 150492 -229056 139508 -104256 -23457 -179920
15781a79920n2862J2119f3619j37982D5717B0867J43212c23802O3981G4229a51559
$$ -179920 -232782 -220663 -63619 -201601 45717 20867 164079 -323802 -259821 74229 -151559
15769H2676b07421A24470R2697a17648d9491G0833b44078a10533E9301a77106
$$ 82676 -207421 124470 217167 -117648 -49491 70833 -244078 -110533 59301 -177106
15758A10585N6400G9532R0287a18585A94556a62708B09760F3363J29726i2039
$$ 110585 166985 79532 169819 -118585 194556 -162708 209760 63363 193089 -92039
15747A7504a01771B21325a55739I6072b29338J0070i1324B04240D2115a10955
$$ 17504 -101771 221325 -155739 96072 -229338 -219268 -91324 204240 42115 -110955
15736D5626b30245j23853a57416A13875b47068A81740l0707M378b29106k2640
$$ 45626 -230245 -354098 -157416 113875 -247068 181740 151033 155411 -229106 -251746
15726b51746N3893F1174K02899A1964f3806j67450G4365a05121j10439O1015M5065
$$ -251746 -197853 61174 264073 11964 -63806 -231256 74365 -105121 -215560 -154545 -109480
15715a09480N2597I3722a48403j6879F1029K10009a10711r9990N7586e0940K2076
$$ -109480 -56883 93722 -148403 -165282 61029 271038 -110711 -210701 -153115 -50940 -28864
15704b8864A73428q2568e9134B16197g433B16425a06926p8572d0960A23525M3002
$$ -28864 173428 90860 -59134 216197 -7433 216425 -106926 -185498 -40960 123525 166527
15693A66527b4892k68019D4515A3780a75449h6031A46706b42406g1382a8647r7008
$$ 166527 -24892 -292911 44515 13780 -175449 -86031 146706 -242406 -71382 -18647 -115655
15682a15655A83787G2523c21186h5259K7769r636A50937b12982h0404A47151m9735
$$ -115655 183787 72523 -321186 -85259 -57490 -67126 150937 -212982 -80404 147151 97416
15671I7416c18587q6394B8673a35455a1519B09825H5363G793L963e9836I887a94290
$$ 97416 -318587 -404981 28673 -135455 -11519 209825 85363 7793 11756 -59836 9887 -194290
15658g2119B40047q8835a84294j67777a6018k42905Q3467A29775n7038a122F9591
$$ -72119 240047 151212 -184294 -352071 -16018 -258923 -175456 129775 72737 -1122 69591
15646C63489a3788B04162a76976j07899i2831k43577F1006f9257k4122j9387A77308
$$ 363489 -13788 204162 -176976 -284875 -92831 -336408 61006 -69257 -93379 -112766 177308
15634C2800j0700J9523K97700a24326c0424D7451O8923l8464c1503G7562c2734
$$ 32800 22100 41623 339323 -124326 -30424 47451 116374 77910 -31503 77562 -32734
15622F4160f324B63937C7560P4550b1788n4593L3699B59713c50449R4687A03554
$$ 64160 -6324 263937 37560 112110 -21788 -76381 -42682 259713 -350449 -255762 103554
15610f21539A18459D7009h7680A61540c3596D7974b14050A458a43745e6160o7608
$$ -621539 118459 47009 -87680 161540 -33596 47974 -214050 1458 -143745 -56160 -123768
15599a23768B4048c078B08231h3872r8878j38597a24454n6317k04244b2594E7330
$$ -123768 24048 -3078 208231 -83872 -182750 -321347 -124454 -180771 -385015 -22594 57330
15587f2848k22052A1000J0084d6795A99742b66211b2844c438j23950B02738a87784
$$ -62848 -284900 11000 21084 -46795 199742 -266211 -22844 -3438 -127388 202738 -187784
15575b6942k61131A99587I3886j5731b32309b7517F8074K2161a80804G7030R6234
$$ -26942 -288073 199587 93886 78155 -232309 -27517 68074 90235 -180804 77030 173264
15564A73264a09173k49604c1090j06880A54222a23289p5315G424g8842G9535a13801
$$ 173264 -109173 -358777 -31090 -137970 154222 -123289 -198604 7424 -78842 79535 -113801
15552E8556j5882M1839j4820h7565l3716A0431a26972M9931j39278J07105A82573
$$ 58556 42674 84513 69693 -87565 -121281 10431 -126972 -77041 -216319 -109214 182573
15540a38583B13015c12466A24379l4313j4309K3929M923J09664r7890i3712j50140
$$ -138583 213015 -312466 124379 90066 75757 99686 104609 214273 116383 -93712 -243852
15529b43852i0343b400A98781E0139A7877b46803C3997Q8169A714R0858L4070
$$ -243852 -90343 -2400 198781 50139 17877 -246803 33997 122166 1714 92572 126642
15518A26642A2566D836L80730I0620L92678j95519F1048L3112b5021B04929E312
$$ 126642 12566 4836 385566 90620 483298 287779 61048 94160 -25021 204929 5312
15506D2626J03513b15607C53172B9996b08439A25651c32962C44721j7793b18478
$$ 42626 146139 -215607 353172 29996 -208439 125651 -332962 344721 326928 -218478
15495e9172A0849J55371m4099l8420I933h4732C30045H2934f5067q8970l4167
$$ -59172 10849 166220 122121 83701 9933 -84732 330045 82934 -65067 -154037 -188204
15484a88204m9020J7897f1956C7909i7675j35596M5794j87267n14l1165C78728
$$ -188204 -237224 -219327 -61956 37909 -97675 -233271 -187477 -374744 -375258 -406423 378728
15472A13867c05854K3763E7462J78762A5596a51158E9060A0440L2937i818k60541
$$ 113867 -305854 -282091 57462 236224 15596 -151158 59060 10440 43377 -9818 -270359
15461b70359J05301f1482b5605r2021e7312A96806r0186l8378J50584b29969a0024
$$ -270359 -165058 -61482 -25605 -117626 -57312 196806 106620 68242 218826 -229969 -10024
15449a23090B73861b88737A61063a04313c7311A75259a77983E0682L1685J01093
$$ -123090 273861 -288737 161063 -104313 -37311 175259 -177983 50682 82367 183460
15439A83460q658J8261D7894b96098j51263C11780b14932Q8365c9239g048k59494
$$ 183460 174802 193063 47894 -296098 -447361 311780 -214932 -126567 -39239 -7048 -266542
15428b66542B2467c3273j52530b9728B45625C3331f5874b6171B06838m5724j3406
$$ -266542 22467 -33273 -185803 -29728 245625 33331 -65874 -26171 206838 161114 147708
15417A47708b06371P9135n128I7072c36782A28510c31758a39472N5409A87664
$$ 147708 -206371 -127236 -132364 97072 -336782 128510 -331758 -139472 -84063 187664
15406f2244A52274e9645j27265Q3656j91405A48976L2892n2452A8723a58810B26706
$$ -62244 152274 -59645 -186910 -103254 -294659 148976 181868 129416 18723 -158810 226706
15394b19115H6642a84876D9884K22834H3284f3098C8048d8094N960l11484j431
$$ -219115 86642 -184876 49884 272718 83284 -63098 38048 -48094 -42134 -353618 -355049
15383c55049a73476J6911c1569E499d6933k85217i1252b16q0551k42851b5928
$$ -355049 -173476 -156565 -31569 5499 -46933 -332150 -91252 -216 -80767 -323618 -25928
15371a10188E6353b36599h335j38941p4720C01989a05644A12915a44997B63817
$$ -110188 56353 -236599 -8335 -147276 -221996 301989 -105644 112915 -144997 263817
15360b28769i8358k2943A08822q345C3868M6864K6750J70191b1913A03896c35225
$$ -228769 -98358 -121301 108822 100477 33868 80732 107482 277673 -21913 103896 -335225
15348I2516N5112p3568K65589c8440B4588n224f4404m5091A94250a30505m3265
$$ 92516 147628 74060 339649 -38440 24588 19364 -64404 -109495 194250 -130505 -173770
15337a73770F0986K6371a77457p2558q766g2160J1645B1909f9393b9406j74561
$$ -173770 60986 87357 -177457 -250015 -258781 -72160 -60515 21909 -69393 -29406 -203967
15326b03967d7477B99682H4772A4175K4747c2120F5428a31776b6297N089B89375
$$ -203967 -47477 299682 84772 14175 38922 -32120 65428 -131776 -26297 -21208 289375
15314A27700d6707J6362A54176b16996e5880A31272Q4339b23132C08278J12162
$$ 127700 -46707 -30345 154176 -216996 -55880 131272 215611 -223132 308278 420440
15304D20440C7873K04574K9969b9203B37624q6628o8503a39959b7308A85413M9203
$$ 420440 37873 242447 272416 -29203 237624 150996 82493 -139959 -27308 185413 234616
15293B34616k9104J10602j27180e845j98577A57710a0814j1530B94924G9541J43554
$$ 234616 205512 316114 188934 -5845 -204422 157710 -10814 -22344 294924 79541 223095
15282B23095a93986B71679B1436J25395b2011k88490B071c2114A58749l3538A3516
$$ 223095 -193986 271679 21436 146831 -22011 -310501 2071 -32114 158749 125211 13516
15270B27207g1722A48111b6397B44106A11611f7123B16003J30568A11335d3024
$$ 227207 -71722 148111 -26397 244106 111611 -67123 216003 346571 111335 -43024
15259B764N1800J19603g9674B92868p1059a03096B8815d3006A41184R2778K56660
$$ 2764 54564 174167 -79674 292868 221809 -103096 28815 -43006 141184 233962 490622
15248D90622K30469P15292J03886l45499M44894F55165p0759k82830K44124k58554
$$ 490622 721091 1436383 1540269 1194770 1639664 655165 584406 301576 545700 287146
15238B87146c73467A06181i431k77558I3548a8815A66931R5144O3549b9475j66066
$$ 287146 -373467 106181 -9431 -286989 93548 -18815 166931 262075 325624 -29475 -195541
15227a95541B52744f1340A62812i9574A38716J9160b34744I2513a03086D2760
$$ -195541 252744 -61340 162812 -99574 138716 157876 -234744 92513 -103086 42760
15216a79846B8268a48829a6360A155Q7434R9850a93548B59824j13411P8513Q274
$$ -179846 28268 -148829 -16360 1155 88589 188439 -193548 259824 146413 224926 233200
15205B33200i8107b8594B36650H278a00790l9139C0469K84312G1721J95905r5734
$$ 233200 -98107 -28594 236650 8278 -100790 -139929 30469 314781 71721 267626 171892
15194A71892M199k2755O0154e7965D12796A04892K56514A70232M5104N5896c993
$$ 171892 176091 153336 213490 -57965 412796 104892 361406 170232 215336 271232 -3993
15182d4716D0189b83918i5960C9621K07007E481K1559K79896G3625Q3032D9837
$$ -44716 40189 -283918 -95960 39621 246628 5481 27040 306936 73625 156657 49837
15170D1365J2373a73511f8328F1779e9086B06620d95241D5356J62351R8890j46002
$$ 41365 53738 -173511 -68328 61779 -59086 206620 -495241 45356 207707 306597 160595
15159A60595J65921e713A25487J37705j00344a03937A83585D6077J89387l2205
$$ 160595 326516 -5713 125487 263192 162848 -103937 183585 46077 235464 203259
15149B03259h001H7449J90737A03837k9273J13651c0300A56286O0962b54945B58929
$$ 203259 -8001 87449 278186 103837 74564 188215 -30300 156286 217248 -254945 258929
15137H9883G57K77944O6259J567I3452K80177A59532g2425A29657d485D19096
$$ 89883 757 278701 344960 346527 93452 373629 159532 -72425 129657 -4485 419096
15125A12381K99267j64304I21J57769R4385j17019k5236a41368A76072G0041L9965
$$ 112381 411648 247344 921 158690 253075 136056 110820 -141368 176072 70041 110006
15114A10006b51777D1357e7041j67702I3071J19912M110M4891F8874a99644A17106
$$ 110006 -251777 41357 -57041 -224743 93071 212983 217093 261984 68874 -199644 117106
15102a2471A96764K73725E6528N4485h8546r5742E1214J13856O7389C4579J33090
$$ -12471 196764 470489 56528 111013 -88546 -184288 51214 165070 232459 34579 167669
15091A67669O8682b4802I5709a17951a831D66261k2607b6810k2524r0013j9333
$$ 167669 236351 -24802 95709 -117951 -1831 466261 443654 -26810 -49334 -139347 -158680
15080a58680F0788R885J97811a26739B08628B69K00216H7240O8847h1601A02992
$$ -158680 60788 70673 268484 -126739 208628 269 200485 87240 156087 -81601 102992
15068b65536H5296K11735a0425B0004J6722J37161H3227L05514I586J9860K13088
$$ -265536 85296 297031 -10425 20004 36726 173887 83227 388741 9586 29446 242534
15057B42534r3681O4091L5191E3735K06615A25155L06922j36460b9926C28292
$$ 242534 148853 212944 248135 53735 260350 125155 432077 295617 -29926 328292
15046c5181A78695N7359F3320a3718H7307J30601j9961p2041n075D4136a12249
$$ -35181 178695 236054 63320 -13718 87307 217908 197947 125906 120831 44136 -112249
15034I3545K96883e423C69633c2457D11860j59762E9668K21224a3968B90141A22249
$$ 93545 390428 -5423 369633 -32457 411860 252098 59668 280892 -13968 290141 122249
15022A50632a17868A92727N8672b446G1549J53526A6513K07242K08511c7097B44861
$$ 150632 -117868 192727 251399 -2446 71549 225075 16513 223755 432266 -37097 244861
15010A86612f6269A44090n7269k9923M35851k44389d3767C48715L5126I7898L4289
$$ 186612 -66269 144090 86821 56898 492749 248360 -43767 348715 383841 97898 132187
14999A32187J54657a03090B51689A05123K09937D7310K17937a37267F4374K02387
$$ 132187 286844 -103090 251689 105123 315060 47310 265247 -137267 64374 266761
14989B66761M8905A33748K9399K39624j62257A8033L16033A63651J23414J46844
$$ 266761 315666 133748 163147 402771 240514 18033 334066 163651 287065 433909
14979D33909J14382m1195B23024A5542a37560B03826j1290l4232O4412K8244K2908
$$ 433909 548291 507096 223024 15542 -137560 203826 192536 158304 222716 250960 273868
14968B73868J30060j49506J7619J05038l6791J50963o3970A50743M3260q271K75675
$$ 273868 403928 254422 272041 377079 340288 491251 427281 150743 194003 185732 461407
14957D61407j75255J53674j45974F3222R7766J79810j20582k6361C1670Q9692
$$ 461407 286152 439826 293852 63222 160988 340798 220216 193855 31670 121362
14947A21362L01038D3088J23583K9446K1543m9838g9733A96469a2873B95202M5024
$$ 121362 422400 43088 166671 196117 217660 167822 -79733 196469 -12873 295202 340226
14936C40226p7967A18533K17853H5252J53434I6861K96701j86451J16748q8633
$$ 340226 262259 118533 336386 85252 238686 96861 393562 207111 323859 235226
14926B35226A07041J7442Q2092l4380A723h6990C50541M6448J205A11066L73083
$$ 235226 107041 124483 206575 172195 1723 -86990 350541 396989 398194 111066 484149
14915D84149B04580K00070J2849j44507m2595L2074K45318k30127G1905f3312
$$ 484149 204580 404650 417499 272992 230397 262471 507789 277662 71905 -63312
14904F38983G5447L71967j28361N0770A80701a8532E32463B60207j5164F9528
$$ 638983 75447 447414 319053 369823 180701 -18532 532463 260207 245043 69528
14893H63892l63969G1423L29237j20159L89768C05915O4923n651K8664J70660
$$ 863892 499923 71423 400660 280501 670269 305915 370838 365187 393851 564511
14883E64511k16586m0691K45742A34037J49846R599N9453l4359n0635m1L33416
$$ 564511 347925 307234 552976 134037 283883 293482 352935 318576 267941 267900 601316
14872F01316l3173k19719o9812K22816j03193J24240n1893o396J3313L6296J03433
$$ 601316 568143 348424 278612 501428 398235 522475 470582 464186 477499 513795 617228
14861F17228k90668K63773j86906K9917k9242J08412k25053K86474k81534J11844
$$ 617228 326560 590333 403427 433344 404102 512514 287461 573935 292401 404245
14851D04245L9248M9843A86601N281N6015L1930J38711E4650K88325M92985k81428
$$ 404245 443493 493336 186601 191882 247897 279827 418538 54650 342975 835960 554532
14840E54532B27610M24292C07075P5522K10732B12754N4581K07415j96919k8318
$$ 554532 227610 651902 307075 382597 593329 212754 267335 474750 277831 249513
14830B49513j7583k6232L14714J94979j01723B11132J85954J92795k72391P0020
$$ 249513 231930 205698 520412 715391 613668 211132 397086 589881 317490 387510
14820C87510r5751p8221L10963j24182l4969j6620N2049j22426K9704M748J36321
$$ 387510 291759 213538 524501 400319 365350 348730 400779 278353 308057 312805 449126
14809D49126M36183A93997M70266l27810K42391j01519P6879K4673k30392K81206
$$ 449126 885309 193997 664263 336453 578844 477325 554204 578877 348485 629691
14799F29691k40708m4364J8830J10132J49219j63865O1042j77081A48327J42682
$$ 629691 388983 344619 363449 473581 622800 458935 519977 342896 148327 291009
14789B91009K94089p589J75789l71322K93004k40332J95666l7604j23982j47131
$$ 291009 585098 577509 753298 381976 674980 434648 630314 592710 468728 321597
14779C21597O2771O2645k9343N0137Q1767K99699D15762N5730n5512j11333o938
$$ 321597 384368 447013 417670 467807 549574 849273 415762 471492 415980 304647 297709
14768B97709L57281p8498B86052K34555L6354k16420L96133A61174M96076p5474
$$ 297709 654990 576492 286052 520607 556961 340541 736674 161174 657250 581776
14758E81776l0615k30840K5564M23081p2931K59683m74709k971L8497J50657r5934
$$ 581776 551161 320321 345885 768966 696035 955718 481009 478038 516535 667192 571258
14747E71258K78106k11612k2285j29085M29305m10687m3695L10780k51427L5461
$$ 571258 849364 637752 615467 486382 915687 505000 461305 772085 520658 556119
14737E56119N1771j42537L02403C06520N35946j38018l440O8962J4983k64620
$$ 556119 607890 465353 767756 306520 842466 704448 701008 769970 784953 520333
14727E20333L14581j11785J20556l20095n2454M25690J39272k9737J94872E24606
$$ 520333 834914 723129 843685 523590 471136 896826 1036098 1006361 1201233 524606
14716H69587j80751k16613O0754K73735k12855K10477j04865K19541K1592m3801
$$ 869587 688836 472223 532977 806712 593857 804334 699469 919010 940602 896801
14706H96801o1065l3931J89019n7954J34756j50601j66985j55250J0752N74005
$$ 896801 835736 801805 990824 932870 1067626 917025 750040 594790 605542 1179547
14696A179547m0838l80257J47259L44270l49386k49486O614K36869j76904J37846
$$ 1179547 1138709 758452 905711 1249981 900595 651109 657723 894592 717688 855534
14686H55534L08798k28860j70838K51625n3407K03703J42287n11996j03802K06087
$$ 855534 1164332 935472 764634 1016259 962852 1166555 1308842 796846 693044 899131
14676H99131P9933j07354J12232m1613K5630O1275j88486M0513J94996j91604
$$ 899131 979064 871710 983942 942329 967959 1029234 840748 881261 1076257 884653
14666H84653j01180J01086J80495J52102m49558L58056k68406n6540L37153J38863
$$ 884653 783473 884559 1065054 1217156 767598 1125654 857248 800708 1137861 1276724
14656A276724k37072l35304K76518K54684l12241Q7525m4339K5639j44584L68604
$$ 1276724 1039652 704348 980866 1235550 923309 1010834 966495 992134 847550 1216154
14646A216154m2276j71884K14426M5524j24134K59460l79045R5473J11133J42451
$$ 1216154 1173878 1001994 1216420 1261944 1137810 1397270 1018225 1113698 1224831 1367282
14636A367282m4837r3000k42586K6494J74884P1080J2895O5061l1091Q4808m33765
$$ 1367282 1322445 1229445 986859 1013353 1188237 1259317 1272212 1337273 1306182 1390990 957225
14625I57225M82846o8447K16518k06491p3127K14325j71188N8366N266n9749L36108
$$ 957225 1440071 1371624 1588142 1381651 1308524 1522849 1351661 1410027 1415293 1355544 1691652
14614A691652m78846J74072J8466j35154R2567R2427j2414j90065K20062j2620
$$ 1691652 1212806 1386878 1405344 1270190 1362757 1455184 1442770 1252705 1472767 1460147
14604A460147P0507J36502l18281J80002M38422n10651J40784J99894j93720K04849
$$ 1460147 1530654 1667156 1348875 1528877 1967299 1456648 1597432 1797326 1603606 1808455
14594A808455r3171k06637j79111K31203J02380J83789k35794K61213k50898k87573
$$ 1808455 1715284 1508647 1329536 1560739 1663119 1846908 1611114 1872327 1621429 1333856
14584A333856M02088J26406M7138M2271k1206J2931n4560J07144N8984K64730
$$ 1333856 1735944 1862350 1909488 1951759 1930553 1943484 1888924 1996068 2055052 2319782
14574B319782n27480K82736j65781N59157p89169K76400r270J26291M81916k69749
$$ 2319782 1792302 2075038 1909257 2468414 1679245 1955645 1946375 2072666 2554582 2284833
14564B284833K9810L69872j33399n5349j60056K34500L2826J25057L49173L13447
$$ 2284833 2314643 2684515 2551116 2495767 2335711 2570211 2603037 2728094 3077267 3390714
14554C390714j8246M4090Q02356L16134J257406J931482N164318J0741573J5071336
$$ 3390714 3372468 3416558 4218914 4535048 5792454 7723936 12888254 23629827 38701163
14545C8701163L004465B0150732r555278E238593k017147r12116l03755p378l6691
$$ 38701163 41705628 20150732 10595454 5238593 3221446 2309330 2005575 1998197 1961506
14536A961506K27350m63804M00084n18715J67195L83390l31537L95909j20527
$$ 1961506 2188856 1725052 2125136 1606421 1773616 2157006 1825469 2221378 2100851
14527B100851O5350P2351K4611k22653K23959M37368k44704J68250n8856j60681
$$ 2100851 2166201 2238552 2263163 2040510 2264469 2701837 2457133 2625383 2566527 2405846
14517B405846j52892M76651j50116J1967J49738J15654m51929J76549J61951o756
$$ 2405846 2252954 2729605 2579489 2591456 2741194 2856848 2404919 2581468 2743419 2736663
14507B736663P2594L1718m61482O02916J34631k71432L37973k43512J43296j76387
$$ 2736663 2809257 2840975 2379493 2982409 3117040 2845608 3183581 2940069 3083365 2906978
14497B906978K64744J97779k12062k87102K55729J92940L1823k1440k99284M07827
$$ 2906978 3171722 3369501 3157439 2870337 3126066 3319006 3350829 3329389 3030105 3437932
14487C437932P2018K32334l0111K990k09513K97468l08739J73679Q8325q0667
$$ 3437932 3509950 3742284 3712173 3715163 3505650 3803118 3494379 3668058 3756383 3675716
14477C675716Q8669o2618L44703k07447J63684J64928o1511L72142l49315R7299
$$ 3675716 3764385 3701767 4046470 3839023 4002707 4167635 4106124 4478266 4128951 4226250
14467D226250L2793n4970L31237k34924N0554K46549L14555m55164J67746R4177
$$ 4226250 4259043 4204073 4535310 4300386 4350940 4597489 4912044 4456880 4624626 4718803
14457D718803M4689m7260J04690J78967j2267m213K82727L18331l33579L63638
$$ 4718803 4763492 4716232 4820922 4999889 4987622 4983409 5266136 5584467 5250888 5614526
14447E614526m4831j08078L26365j37413K29346j36023K9666L64921j49040K13406
$$ 5614526 5569695 5461617 5787982 5650569 5879915 5743892 5773558 6138479 5989439 6202845
14437F202845k16991K79554K58391j73284J82343l4370K95684j56290M69641k03814
$$ 6202845 5985854 6265408 6523799 6350515 6532858 6498488 6794172 6637882 7107523 6903709
14427F903709J03933j68693J55182M19704l3303L96041l75152M54729O464J07212
$$ 6903709 7007642 6838949 6994131 7413835 7380532 7776573 7401421 7856150 7862614 7969826
14417G969826P000L72345j29435L30743k99785K60050j56208K48055N78901L6525
$$ 7969826 7976826 8349171 8219736 8550479 8250694 8510744 8354536 8602591 9181492 9218017
14407I218017J02184P4029M36609j92882M790J20550K66129J21415M30560J7014
$$ 9218017 9320201 9394230 9830839 9637957 9642747 9763297 10029426 10150841 10581401 10598415
14397A0598415K76739J59329J25745l251J56265N48009K26726m9040K67817K42148
$$ 10598415 10875154 11034483 11160228 11156977 11313242 11861251 12087977 12038937 12306754 12548902
14387A2548902R9734M17865j97086L30285O67807J21857K28703K65389M41349
$$ 12548902 12648636 13066501 12869415 13199700 13867507 13989364 14218067 14483456 14924805
14378A4924805J48698P6801K70317P35338J28138r946J33689P81135J64409K75334
$$ 14924805 15073503 15150304 15420621 16155959 16284097 16274151 16407840 17188975 17353384 17628718
14368A7628718O15257J57359P44211J98118O17091K13414N16204M16796K66125
$$ 17628718 18243975 18401334 19145545 19343663 19960754 20174168 20690372 21107168 21373293
14359B1373293L95271O00905O03876L81271O56333P26304O00427K85815N60165
$$ 21373293 21768564 22369469 22973345 23354616 24010949 24737253 25337680 25623495 26183660
14350B6183660J041360M62691O90643Q10270P34293Q21972O12175Q42524P07631
$$ 26183660 27225020 27687711 28378354 29188624 29922917 30744889 31357064 32199588 32907219
14341C2907219J239602M98454J447748J002883J099654P96099J320550J336379
$$ 32907219 34146821 34645275 36093023 37095906 38195560 38991659 40312209 41648588
14333D1648588Q12359J334017J376872J285929J683783J425184J417577J721178
$$ 41648588 42460947 43794964 45171836 46457765 48141548 49566732 50984309 52705487
14325E2705487J809769K002211K118607J674450K882835J660529K149440K561647
$$ 52705487 54515256 56517467 58636074 60310524 63193359 64853888 67003328 69564975
14317F9564975K864626K707076K992870K811417L249684L651864L627884L591213
$$ 69564975 72429601 75136677 78129547 80940964 84190648 87842512 91470396 95061609
14309I5061609L706811M395286M564970N035396M853019N543815N387954O437574
$$ 95061609 98768420 103163706 107728676 112764072 117617091 123160906 128548860 134986434
14301A34986434O436131O602010P153306P897000P816012Q654441R196189R736749
$$ 134986434 141422565 148024575 155177881 163074881 170890893 179545334 188741523 198478272
14293A98478272J0105826J0729325J1278446J2221706J2496772J3062196J3570609
$$ 198478272 208584098 219313423 230591869 242813575 255310347 268372543 281943152
14286B81943152J3984464J4759396J4498371J5486532J5029748J5070166J4801661
$$ 281943152 295927616 310687012 325185383 340671915 355701663 370771829 385573490
14279C85573490J4049144J3442665J2325392J1284874R834240P776372M939550
$$ 385573490 399622634 413065299 425390691 436675565 446509805 454286177 459225727
14272D59225727P70874l108341k147057M17293l315705l814757o722886r797317
$$ 459225727 459996601 456888260 454741203 455158496 451842791 448028034 441305148 431507831
14264D31507831j1491695j2788947j3737828j5382591j5220968j5946434j5727886
$$ 431507831 420016136 407227189 393489361 378106770 362885802 346939368 331211482
14257C31211482j5442835j5346133j4661660j3746709j3131236j2747696j2595063
$$ 331211482 315768647 300422514 285760854 272014145 258882909 246135213 233540150
14250B33540150j1628482j1143650j0406481r835092r342644q823100p663135
$$ 233540150 221911668 210768018 200361537 190526445 181183801 172360701 164697566
14243A64697566q008327p464175p016824o520589n912579n557111n298059n320753
$$ 164697566 156689239 149225064 142208240 135687651 129775072 124217961 118919902 113599149
14235A13599149m794884m564420m205310m151139l331097l777417l603084l295063
$$ 113599149 108804265 104239845 100034535 95883396 92552299 88774882 85171798 81876735
14227H1876735l429698k581289l031116k502754k604585k239716k349090k075024
$$ 81876735 78447037 75865748 72834632 70331878 67727293 65487577 63138487 61063463
14219F1063463j955640j801137k298162j761579j731659j146424j595685j471664
$$ 61063463 59107823 57306686 55008524 53246945 51515286 50368862 48773177 47301513
14211D7301513j668848j031676j284969j422652l45796j597974j026682j423842
$$ 47301513 45632665 44600989 43316020 41893368 41547572 39949598 38922916 37499074
14203C7499074j463880n19949r72789m25688j187733j034458j023160n24900m27125
$$ 37499074 36035194 35515245 34542456 34116768 32929035 31894577 30871417 30346517 29919392
14194B9919392r55790q73702m70678p31761n28487n91760o32186p82435p57280
$$ 29919392 28963602 28089900 27619222 26887461 26358974 25767214 25135028 24352593 23595313
14185B3595313k75408n46652o88228k47053o40422l23125n58162k51393l67655
$$ 23595313 23319905 22773253 22085025 21837972 21197550 20874425 20316263 20064870 19697215
14176A9697215n70569m74213l48216n0221p96671K9562k64129m40463m27091l58800
$$ 19697215 19126646 18652433 18304217 18253996 17457325 17486887 17222758 16782295 16355204 15996404
14166A5996404L10715p13546m20627l62257n06881j16350k42983n7821k98287
$$ 15996404 16307119 15593573 15172946 14810689 14303808 14187458 13944475 13886654 13588367
14157A3588367r3847j52715l36764k79245o0152l31649k05365k54145k86069J75458
$$ 13588367 13494520 13341805 13005041 12725796 12665644 12333995 12128630 11874485 11588416 11763874
14147A1763874n32980M2162k78458j77969j81217j40667l5760k16656K8983k30507
$$ 11763874 11230894 11273056 10994598 10816629 10635412 10494745 10458985 10242329 10271312 10040805
14137A0040805m1331l54520M3822l63851j75993N67k43097j77140j60099r6886
$$ 10040805 9999474 9644954 9688776 9324925 9148932 9149499 8906402 8729262 8569163 8472277
14127H472277J62721j69807n66003K73798J60848l58873j14958p2157O6962l73243
$$ 8472277 8634998 8465191 7899188 8172986 8333834 7974961 7860003 7787846 7854808 7481565
14117G481565j44299L03569l72336l53299K82875j49337O2522k83976J82449m85411
$$ 7481565 7337266 7640835 7268499 6915200 7198075 7048738 7111260 6827284 7009733 6524322
14107F524322K75428j22133m05456k19391J53880j4822n7409j16844l13761L98370
$$ 6524322 6799750 6677617 6272161 6052770 6206650 6191828 6134419 6017575 5703814 6102184
14097F102184j73075J6200k72835l19693K90796j88606l53223P3327N92057l80185
$$ 6102184 5929109 5945309 5672474 5352781 5643577 5454971 5101748 5175075 5767132 5386947
14087E386947j83733Q1650l17086J04495l36345J75216p9531J16568j99136j68811
$$ 5386947 5203214 5284864 4967778 5072273 4735928 4911144 4831613 4948181 4749045 4580234
14077D580234J11439J35885m58523J08338j38702N87640l71320K78307n11452
$$ 4580234 4691673 4827558 4369035 4477373 4338671 4926311 4554991 4833298 4321846
14068D321846j14369L39608n44686L65899k53791m7975K35882k98503n7881L51937
$$ 4321846 4207477 4547085 4002399 4368298 4114507 4066532 4302414 4003911 3946030 4297967
14058D297967N8633m16190L54407k71591j92502o1417l3569j66916M3407K19889
$$ 4297967 4356600 3940410 4294817 4023226 3830724 3769307 3735738 3568822 3612229 3832118
14048C832118k37215l79879K15996j5743k37917M94545m17535R5376o2948k90995
$$ 3832118 3594903 3215024 3431020 3415277 3177360 3671905 3254370 3349746 3286798 2995803
14038B995803K56622j4797l2298N2025l82635j316M78258l83198j3604P8851k2160
$$ 2995803 3252425 3237628 3205330 3257355 2874720 2873404 3351662 2968464 2954860 3033711 3011551
14027C011551r4884n9890Q6073k90482Q0644j8358P8459J41676j86471j40690
$$ 3011551 2916667 2856777 2942850 2652368 2733012 2714654 2793113 2934789 2748318 2607628
14017B607628o6686K4803L0612M9677l76124Q8546K59873m32939K75565m47758
$$ 2607628 2540942 2565745 2596357 2646034 2269910 2358456 2618329 2185390 2460955 2013197
14007B013197L71498j15536K7779O5765l26470R6988j8498l08579L86093k58852
$$ 2013197 2384695 2269159 2296938 2362703 2036233 2133221 2114723 1806144 2192237 1933385
13997A933385J6363J83720k68609J56726K65211l32557L05306P06828P58847L480707
$$ 1933385 1949748 2133468 1864859 2021585 2286796 1954239 2259545 2966373 3725220 7205927
13987G205927R983304J6514141R727386j8521335A2384303m737465j932129j505763
$$ 7205927 17189231 33703372 43430758 24909423 12384303 7646838 5714709 4208946
13979D208946k40605l53435p4693p89026P4555L01916J84315p13699L98650n44827
$$ 4208946 3968341 3614906 3540213 2751187 2825742 3127658 3311973 2598274 2996924 2452097
13969B452097J9001j08935r1520j78555p6655L41512k43779p3797k5668L07483
$$ 2452097 2471098 2362163 2270643 2092088 2015433 2356945 2113166 2039369 2013701 2321184
13959B321184N4039k05688L75834m68343k72411J96904k34057K4589K11257R4438
$$ 2321184 2375223 2169535 2545369 2077026 1804615 2001519 1767462 1792051 2003308 2097746
13949B097746k32986k32154M58521l4663n58897L01127R9154J88837o7122k32577
$$ 2097746 1864760 1632606 2091127 2056464 1497567 1798694 1897848 2086685 2019563 1786986
13939A786986K0536j86574L08274l78959R3723j2710r2446J9006O4070K3043j73682
$$ 1786986 1807522 1620948 1929222 1550263 1643986 1631276 1538830 1557836 1621906 1644949 1471267
13928A471267M24105k58057K61517m59392J67483J51702k56596L21506p0359m75357
$$ 1471267 1895372 1637315 1898832 1439440 1606923 1758625 1502029 1823535 1753176 1277819
13918A277819K79867j20214J80285M9817m44711J80826P9987n8782L03914m56289
$$ 1277819 1557686 1437472 1617757 1667574 1222863 1403689 1483676 1424894 1728808 1272519
13908A272519l2979r0080K82569j48205p067p9748n9133M77923R2782p08149L90730
$$ 1272519 1239540 1149460 1432029 1283824 1276757 1197009 1137876 1615799 1708581 1000432 1391162
13897A391162m10603M45407k22862J00322j74036J63637p62k7429J44967j89014
$$ 1391162 980559 1425966 1203104 1303426 1129390 1293027 1292265 1264836 1409803 1220789
13887A220789M2010M3490j69351J29360R1820k97733M66724j48304o4773M5875
$$ 1220789 1262799 1306289 1136938 1266298 1358118 1060385 1527109 1378805 1314032 1359907
13877A359907J02549j64688j90883j58620J84159q6883j6994L42966l69135J81302
$$ 1359907 1462456 1297768 1106885 948265 1132424 1045541 1028547 1371513 1002378 1183680
13867A183680l6342j38621O1190J91954q4380l22167L58306j31682l03275M2876
$$ 1183680 1147338 1008717 1069907 1261861 1177481 855314 1213620 1081938 778663 821539
13857H21539J38134K80442J4320k88189K29626j1585J1993l31259K45285k15842
$$ 821539 959673 1240115 1254435 966246 1195872 1184287 1196280 865021 1110306 894464
13847H94464j04304K22676k57785J29415m019K53779p8356J46635j39624k1336
$$ 894464 790160 1012836 755051 884466 880447 1134226 1055870 1202505 1062881 1041545
13837A041545J55335m46297K57576n4102J35551l16586L90860k23145L2610K21253
$$ 1041545 1196880 750583 1008159 954057 1089608 773022 1163882 940737 973347 1194600
13827A194600l42933j053p2240L33857m87232M15736m0949j57845K13343j99992
$$ 1194600 851667 850614 778374 1112231 624999 1040735 999786 841941 1055284 855292
13817H55292j59053q402q0984N00074m0934k77756j93062K02545J4428R7308P111
$$ 855292 696239 687837 606853 1106927 1065993 788237 595175 797720 812148 909456 916567
13806I16567K20665m51164J85819n8677J06345K11918l28197m8329j06353j47585
$$ 916567 1137232 686068 871887 813210 919555 1131473 803276 754947 648594 501009
13796E01009K06095R1028p140L3086P1578k36162K97438k14137j02477o586o3941
$$ 501009 707104 798132 790992 824078 895656 659494 956932 742795 640318 633732 569791
13785E69791N77361k18795D47653L31104k04849k72441L19982j5956K27424p4284
$$ 569791 1147152 928357 447653 778757 573908 301467 621449 605493 832917 758633
13775G58633k38757J90560J32213J01698k90732K00987k83106M3835L70094l64746
$$ 758633 519876 710436 842649 944347 653615 854602 571496 615331 985425 620679
13765F20679j11835L94236j57272J72014j27281k39169J62782j44542J5101K57265
$$ 620679 508844 903080 745808 917822 790541 551372 714154 569612 584713 841978
13755H41978k26747k3068J95790k00725n913N0031K75081k01941n1670B68241
$$ 841978 615231 592163 787953 587228 581315 631346 906427 704486 652816 268241
13744F84132N073k1853p3040L30788l52598N7001j06391J83233K4331j86991n3176
$$ 684132 689205 667352 594312 925100 572502 629503 523112 706345 730676 543685 490509
13733D90509K44879j09379j91816R9621J60934K75197m28662L64665k31757M1381
$$ 490509 735388 626009 434193 533814 694748 969945 541283 905948 674191 715572
13723G15572j90785j85054M51909r392k48871J06076J00046k99082L11788n1803
$$ 715572 524787 339733 791642 782250 533379 639455 739501 440419 752207 700404
13713G00404k78882J60875K87792k9230l08813K7375j56746K41069j66685j87605
$$ 700404 421522 582397 870189 840959 532146 559521 402775 643844 477159 289554
13703B89554L28786O2904j49841j03045R3761j1576N1328k51450K02084N1887
$$ 289554 618340 681244 531403 428358 522119 510543 561871 310421 512505 564392
13693E64392j42575K05973o6172l6267l9996j44656J56189j37677r7164K26222
$$ 564392 421817 627790 561618 525351 485355 340699 496888 359211 262047 488269
13683D88269J32383j56481J57113n3899B38765M75928j33928o2973j18074O43685
$$ 488269 620652 464171 621284 567385 238765 714693 580765 517792 399718 1043403
13673A043403D35839n6075J48946k28665J08620J2060m0717J84320A84169P21499
$$ 1043403 435839 379764 528710 300045 408665 420725 380008 564328 184169 905668
13663I05668D41450m5932J31847P3305j61427j09293K93808p5677j83087A63419
$$ 905668 441450 395518 527365 600670 439243 329950 623758 548081 364994 163419
13652D78612j91691J49348m0356N4550q8945L3190j34800K22352j77313J33984
$$ 478612 286921 436269 395913 450463 361518 394708 259908 482260 304947 438931
13642D38931J20090B33754l110J94126K56721j30807p1450R0917j86096j39572
$$ 438931 559021 233754 230644 424770 681491 550684 479234 570151 384055 244483
13632B44483D4276K51797A05208L82447J09395O5776j93878A31850L22546O8360
$$ 244483 44276 296073 105208 487655 597050 662826 468948 131850 454396 522756
13622E22756B22608O6996J58886J92301C03855l6535j00120K28000j21915K48785
$$ 522756 222608 289604 448490 640791 303855 267320 167200 395200 273285 522070
13612E22070p7047J84680k42125J09866J18080j23664k28932A10904M02129B49464
$$ 522070 445023 629703 387578 497444 615524 491860 262928 110904 513033 249464
13601B36302K00007K03529B78445J49763L1612K9680j41098J59276B44389p3743
$$ 236302 436309 639838 278445 428208 459820 489500 348402 507678 244389 170646
13591A70646J59926J16955I2394J17642M1645N6000Q5091K72574k47839j56572
$$ 170646 330572 447527 92394 210036 251681 307681 392772 665346 417507 260935
13581B60935K25140K55260k86066A84324K37900A94279K98164j82867J66791j79931
$$ 260935 486075 741335 455269 184324 422224 194279 492443 309576 476367 296436
13571B96436N27757l94489M9601o1600o4544M4805O6731j09925p2514L5824J24082
$$ 296436 824193 429704 479305 417705 353161 397966 464697 354772 282258 318082 442164
13560D42164j18685j9819J58541M0725k3204j59969K26713k6100B35851J12996
$$ 442164 323479 303660 462201 502926 479722 319753 546466 520366 235851 348847
13550C48847R4412j56518H2267J13459J58275A46154J36308l7560K25110A29531
$$ 348847 443259 286741 82267 195726 354001 146154 282462 244902 470012 129531
13539D91995B45247J97285A99411N7985q1464D1438K26359q8185J54204O7899
$$ 491995 245247 442532 199411 257396 175932 41438 267797 179612 333816 401715
13529D01715N9254G5151K67932p4014J62026M5014a1874C81946I9786N2874K08632
$$ 401715 460969 75151 343083 269069 431095 476109 -11874 381946 99786 152660 361292
13518C61292b852F51017C4360K03698J88663B06873K66415j47071j49518J54359
$$ 361292 -2852 651017 34360 238058 426721 206873 473288 326217 176699 331058
13508C31058o813O7857R4914k20756P4311j47828A286J76507M11190j47752r30
$$ 331058 324245 392102 487016 266260 340571 192743 1286 177793 588983 441231 440301
13497D40301j74699J80602j70385J03634p1440p722K4664M289N5733A41227L1065
$$ 440301 265602 446204 275819 379453 308013 300291 324955 329244 384977 141227 172292
13486A72292L32109k24621A19591K08919A0659O0848K43617p4963n5934N6042
$$ 172292 504401 279780 119591 328510 10659 71507 315124 240161 184227 240269
13476B40269H1267N84444k73040p3239C35L40319R1865I5638J78241J82719c1312
$$ 240269 81267 665711 392671 319432 335 340654 432519 95638 273879 456598 -31312
13464a3410B74798n946H9978K16472G445L25678j52576D7402R5712K3420J02635
$$ -13410 274798 268852 89978 306450 7445 333123 180547 47402 143114 166534 269169
13453B69169p1808k9758p4485O4779Q6677F2237J19609P1679h4224B81841e2637
$$ 269169 197361 167603 93118 157897 244574 62237 181846 253525 -84224 281841 -52637
13441D12971E7524J54412k1845J67576a23048E5126J63045I7688N9706J88279
$$ 412971 57524 211936 190091 357667 -123048 55126 218171 97688 157394 345673
13431C45673B5760O7488L25516B09226F708L76689A66311J8017K72952a8632B52263
$$ 345673 25760 93248 418764 209226 6708 383397 166311 184328 457280 -18632 252263
13419H0812g2602B36768j01804k9377K11064a5226I8414K44961n7170P3436J003
$$ 80812 -72602 236768 134964 105587 316651 -15226 98414 343375 286205 359641 360644
13408C60644J9373A83059J2663N6455D7259K70038j01953C4079K87009C2986J4129
$$ 360644 380017 183059 195722 252177 47259 317297 215344 34079 321088 32986 47115
13397D7115B0391N9925J67249j8344m6065E4504J11189h6622A58615K49318j1055
$$ 47115 20391 80316 247565 229221 183156 54504 165693 -86622 158615 407933 396878
13386C96878A46172P441M7504D9225M77204A92006a09863A61367B9227J31707
$$ 396878 146172 153613 201117 49225 526429 192006 -109863 161367 29227 160934
13376A60934D7678L25108O4174j82356j10254J91705o4213A07378Q5919Q5064
$$ 160934 47678 372786 436960 254604 144350 336055 271842 107378 193297 278361
13366B78361g0727C2261g8974C42534a5800B65114l835r3766H2882K62886o2639
$$ 278361 -70727 32261 -78974 342534 -15800 265114 261279 167513 82882 345768 283129
13355B83129l757A32147c77286A28267K7258o6108N2220J79476A03627J66611
$$ 283129 279372 132147 -377286 128267 155525 89417 141637 321113 103627 270238
13345B70238b7557D33805j93740a54601C13593D3083K02327c6827B04474Q1850
$$ 270238 -27557 433805 240065 -154601 313593 43083 245410 -36827 204474 286324
13335B86324P353N9075M1583J44452A78095F7812M29760A87768G3318K42342K47044
$$ 286324 293677 352752 394335 538787 178095 67812 497572 187768 73318 315660 562704
13324E62704k18650J72090A52633B5206R2606K03250l4457j17064F8197Q2779
$$ 562704 344054 516144 152633 25206 117812 321062 286605 169541 68197 150976
13314A50976J31484J45388j91752J87729c24844C26202K4868H4833m041C032K86689
$$ 150976 282460 427848 236096 423825 -324844 326202 351070 84833 80792 3032 289721
13303B89721q8550L9194J02819D8309a51174C96251q2128L93951B1012R5134g432
$$ 289721 201171 240365 343184 48309 -151174 396251 314123 708074 21012 116146 -7432
13291A17632O8226p8539B1248a8396A95689O6412a6078j57447b5248A75020J71541
$$ 117632 185858 107319 21248 -18396 195689 262101 -16078 -173525 -25248 175020 346561
13280C46561K1073j18861K56070l4509B02126J19950D7695j7123J31269c3233
$$ 346561 367634 248773 504843 470334 202126 322076 47695 30572 161841 -33233
13269B76114G0358l2726a4299A65347m1472R9929m8382F7544K0015K48588j01260
$$ 276114 70358 37632 -14299 165347 123875 223804 175422 67544 87559 336147 234887
13258B34887J60573A45085Q7881o1180E0030b98241B04180O5019i7431A21489
$$ 234887 395460 145085 232966 171786 50030 -298241 204180 269199 -97431 121489
13247C5747L1547K92825A38075B8909J9560K68564j48643n6631n4614J24718b00113
$$ 35747 67294 360119 138075 28909 48469 317033 168390 111759 57145 181863 -200113
13235f5634B11379d7429B51964a84694O9476I0416m009a33241D0298p60K84663
$$ -65634 211379 -47429 251964 -184694 -115218 90416 86407 -133241 40298 39538 324201
13224C24201H6000N9454m3567M15322d4028B84133H428J20435D3427J6275b393
$$ 324201 86000 145454 101887 517209 -44028 284133 8428 128863 43427 59702 -2393
13212a78275B19069k1958m2636c441k9524C86266A06196i9388A13953p493e2247
$$ -178275 219069 197111 154475 -3441 -32965 386266 106196 -99388 113953 106460 -52247
13200a86686C31940A33067M497H116J40886n2303K78635b1184o898o480D06782
$$ -186686 331940 133067 137564 8116 149002 96699 375334 -21184 -28082 -34562 406782
13188a95874C33628E2656N2581Q0080h0337c8244I561K75224J59806A47508Q3345
$$ -195874 333628 52656 105237 185317 -80337 -38244 9561 284785 444591 147508 230853
13177B30853r1468l2077J1081K23621e869p2930L2895J2697M320l195B25765e5228
$$ 230853 139385 107308 118389 342010 -5869 -78799 -45904 -33207 -28887 -32082 225765 -55228
13164b18690a00278A73991F9566J25111a04385G8742J54580D7319J91081J1955
$$ -218690 -100278 173991 69566 194677 -104385 78742 233322 47319 238400 250355
13154B50355a71384A50648o1674L3197b82932C22964g9688a3890A77486b66423
$$ 250355 -171384 150648 88974 122171 -282932 322964 -79688 -13890 177486 -266423
13143a9099k4550k90733C66308B6136E09J46461M5152H9733J70611P5197a84865
$$ -19099 -43649 -334382 366308 26136 509 146970 192122 89733 260344 335541 -184865
13131A5257a15387q6921B27304K5047e5774p4160A36758d4580D1792b20338O3086
$$ 15257 -115387 -202308 227304 252351 -55774 -129934 136758 -44580 41792 -220338 -157252
13120a57252c4715m2550J9979E8671a39455F7303J20248G250b67866C4850J82933
$$ -157252 -34715 -77265 -57286 58671 -139455 67303 187551 7250 -267866 34850 217783
13109B17783a2800B33350a41736C42294A7602K23708F0493K75081p1625b76255
$$ 217783 -12800 233350 -141736 342294 17602 241310 60493 335574 263949 -276255
13098E6257a5890D56385j29595a6575r6930B56980J4017l5365l9258D7839J26737
$$ 56257 -15890 456385 326790 -16575 -113505 256980 270997 235632 196374 47839 174576
13087A74576p3815a86525A22786D3054a52013A29357J30348C6509J10149h6565
$$ 174576 100761 -186525 122786 43054 -152013 129357 259705 36509 146658 -86565
13076f8318I5618B0279L11200a44151B12825E9326K28654o7094q8057C5334j157
$$ -68318 95618 20279 331479 -144151 212825 59326 287980 220886 132829 35334 34177
13065C4177c7508A8896O4610R5419J88847j07291i4273H9614O8397k5378M04857
$$ 34177 -37508 18896 83506 178925 367772 260481 -94273 89614 158011 132633 537490
13054E37490d907A98871D9558c1103B74013j6139b98750g4370B51863j18692M0693
$$ 537490 -4907 198871 49558 -31103 274013 257874 -298750 -74370 251863 133171 173864
13043A73864B6449c28755C30981b35473F9365K55644g8093A50173a65747A92469
$$ 173864 26449 -328755 330981 -235473 69365 325009 -78093 150173 -165747 192469
13032d623B9493L58876A39152O9578L0578a2946A79680p939J43709j27981c8108
$$ -4623 29493 388369 139152 208730 239308 -12946 179680 171741 315450 187469 -38108
13020A8665J19550h6994B27903b76816B99274h1234F9376K17487K889p1888f7818
$$ 18665 138215 -86994 227903 -276816 299274 -81234 69376 286863 289752 217864 -67818
13008B03874G8184Q8973k626k0380L27561B1248J70736a46879C87L00313a31824
$$ 203874 78184 167157 164531 144151 471712 21248 191984 -146879 387 300700 -131824
12996a74372B15937P8509C7853F399L11695a7803D9560b0796B65232a39831k4960
$$ -174372 215937 294446 37853 6399 318094 -17803 49560 -20796 265232 -139831 -164791
12985a64791J0320C04083D7658g3645a1726D7442j8054K44446f9412B00262b36755
$$ -164791 -154471 304083 47658 -73645 -11726 47442 29388 273834 -69412 200262 -236755
12973a29797B02102J44255m8532j31845J33104R4428j44212m6547c1044A44140
$$ -129797 202102 346357 297825 165980 299084 393512 249300 202753 -31044 144140
12962A77117l2538b5766C0238a10174H947J42509E8866k5683J99593a60492B59398
$$ 177117 144579 -25766 30238 -110174 8947 151456 58866 33183 232776 -160492 259398
12950d9719A28762l8214b57941A17928f3012C50162A1049L50256l0644I3728a19268
$$ -49719 128762 90548 -257941 117928 -63012 350162 11049 361305 330661 93728 -119268
12938c09083J18124N8269B60296b85664A32102C4812A4880J25841a36169m7844
$$ -309083 -190959 -132690 260296 -285664 132102 34812 14880 140721 -136169 -184013
12928a84013B883b43971A01652d44194a0882m7504F4822b21665k3394p391C2922
$$ -184013 2883 -243971 101652 -444194 -10882 -58386 64822 -221665 -245059 -252450 32922
12916F1741c65423a00255H7194J60224A19290M4133h1663l0944j292j50083Q2076
$$ 61741 -365423 -100255 87194 247418 119290 163423 -81663 -112607 -113899 -263982 -181906
12905a81906A07657R3839p1873f6934I5429J11254K5540C4388A2754L27324a44452
$$ -181906 107657 201496 129623 -66934 95429 206683 232223 34388 12754 340078 -144452
12893a165C31827f9580A31300a76484B8778m929L8047k0297c29575B01767L1866
$$ -1165 331827 -69580 131300 -176484 28778 23849 61896 41599 -329575 201767 233633
12882B33633F4137f4415p2522J0236B24563p7686K8419b75096J15486C7761a24775
$$ 233633 64137 -64415 -136937 -126701 224563 146877 175296 -275096 -159610 37761 -124775
12870G2474M5013c13581B58359L6265R8261j74422R732A11973d43566A93940q2306
$$ 72474 117487 -313581 258359 294624 392885 218463 228195 111973 -443566 193940 111634
12859A11634a45830F8968e9491A46308J12916a21939A91476a7564B8026b46820
$$ 111634 -145830 68968 -59491 146308 259224 -121939 191476 -17564 28026 -246820
12848E0538J1180a0586q7380j2474B16936b58845I3888K22274j42674f4834k00030
$$ 50538 61718 -10586 -97966 -110440 216936 -258845 93888 316162 173488 -64834 -264864
12837b64864B63987a57637A11484A112R3256m703J54721e3165C3605i286B58372
$$ -264864 263987 -157637 111484 1112 94368 89665 244386 -53165 33605 -9286 258372
12825a78351Q5862k24857a48201B86162a8799n9060B48765a02237H965a00341
$$ -178351 -92489 -317346 -148201 286162 -18799 -77859 248765 -102237 8965 -100341
12814f5081A05665c6025n4265n4490b2954l2202C13229A3570K74432J19880A70117
$$ -65081 105665 -36025 -90290 -144780 -22954 -55156 313229 13570 288002 407882 170117
12802A6950o00d5178C66542a161A08423h0927A58765K2786p9575k6073P4366J47876
$$ 16950 16350 -45178 366542 -1161 108423 -80927 158765 181551 101976 75903 150269 298145
12790B98145j26598k2207b2643q0985E7203c5742n2690A94674m8318o7018e5829
$$ 298145 171547 149340 -22643 -103628 57203 -35742 -88432 194674 146356 79338 -55829
12778a9761I6880d00667A86282c4616A99022q1956Q0068f3334C11436j31291G8273
$$ -19761 96880 -400667 186282 -34616 199022 117066 197134 -63334 311436 180145 78273
12766A30354c3438E3542k5057f3579A18705a8840A20892C7126K7416b22300a01732
$$ 130354 -33438 53542 28485 -63579 118705 -18840 120892 37126 64542 -222300 -101732
12754B5756J81044a70700i618k59593C3126c18221H4862M1462i2444A20917b27567
$$ 25756 206800 -170700 -9618 -269211 33126 -318221 84862 126324 -92444 120917 -227567
12742C35760j64588o4211b73409a21486C90030B3942Q83q335J9952d6822J9709
$$ 335760 171172 106961 -273409 -121486 390030 23942 24825 16490 36442 -46822 -27113
12731b7113o4770A96491b4271A48731a3120B7207P2524d71605B60369e6216K6572
$$ -27113 -91883 196491 -24271 148731 -13120 27207 99731 -471605 260369 -56216 -29644
12720b9644B5761B10L2880f2207k182A28540D6131J28855F0719Q5758n4120K2072
$$ -29644 25761 210 33090 -62207 -64389 128540 46131 174986 60719 146477 92357 114429
12708A14429B6745L60475b57236b7550B51750m4761b32362A03074J80970b93754
$$ 114429 26745 387220 -257236 -27550 251750 206989 -232362 103074 284044 -293754
12697A10872A7136L58600A14845C7013K60020E5949J99750e2856G4191M0650g4398
$$ 110872 17136 375736 114845 37013 297033 55949 255699 -52856 74191 114841 -74398
12685a41129p5971E4967J51499h4908C84692P1988A33644K48637j01193p7648
$$ -141129 -217100 54967 206466 -84908 384692 456680 133644 382281 281088 203440
12675B03440p4561J57555b8493G2957N4430b60555A55538a930C16880N1921A08226
$$ 203440 128879 286434 -28493 72957 127387 -260555 155538 -1930 316880 368801 108226
12663C20915a05326H4719b46250I937K19613a88901D85114G6217J38809F6294
$$ 320915 -105326 84719 -246250 9937 229550 -188901 485114 76217 215026 66294
12652A07123K43241j46510H5169Q0193F3422O8525j8066b39747C18210b54926
$$ 107123 350364 203854 85169 165362 63422 131947 113881 -239747 318210 -254926
12641b13021D910J8306J44611k3830P2897i615B0987c5650j72942B99088q2259
$$ -213021 4910 23216 167827 143997 216894 -9615 20987 -35650 -208592 299088 216829
12630B16829J74126I7992P9272J55870A30684R0911e3060B29710J11872a7879
$$ 216829 390955 97992 177264 333134 130684 221595 -53060 229710 341582 -17879
12619b6635A9004R3869a39997B86875a60116E8780Q4843o7698c71658C54201A31304
$$ -26635 19004 112873 -139997 286875 -160116 58780 143623 75925 -371658 354201 131304
12607B22001r9576l016d9823o9665A0403b3953D3161d7894B37150H5978e3190
$$ 222001 122425 119409 -49823 -119488 10403 -23953 43161 -47894 237150 85978 -53190
12595f2212C55886F1892B6994a70442j45195e3335B04369a26557A19362a27157
$$ -62212 355886 61892 26994 -170442 -315637 -53335 204369 -126557 119362 -127157
12584A21979k8946R0129b24922L2927C86837a56100A47000D715K4532J5298L45041
$$ 121979 93033 183162 -224922 -191995 386837 -156100 147000 4715 29247 44545 389586
12573C89586a52009A28672g7384C90260j23304D040d0267D7792d615A54131B3627
$$ 389586 -152009 128672 -77384 390260 266956 4040 -40267 47792 -4615 154131 23627
12561B62950f7939D5865c74436b3073B19327k4181q0702a85770E0086a56218A75276
$$ 262950 -67939 45865 -374436 -23073 219327 195146 114444 -185770 50086 -156218 175276
12549a02194A51352J18232a73540F0901K77842D6493K93586a62934d7009C81060
$$ -102194 151352 269584 -173540 60901 338743 46493 340079 -162934 -47009 381060
12538B79816d8371A39353b64124b3307A46737a44428j43715Q1909a0498p0945
$$ 279816 -48371 139353 -264124 -23307 146737 -144428 -288143 -206234 -10498 -81443
12528h1443L4693A59104a09899B1265b06712f9387b0236A17826l944M61643A87611
$$ -81443 -46750 159104 -109899 21265 -206712 -69387 -20236 117826 113882 575525 187611
12516a85492C97294A14264b63167j26717A45348k3670c2029C39795C3521J70485
$$ -185492 397294 114264 -263167 -389884 145348 121678 -32029 339795 33521 204006
12506B04006c06381A33136J65025b89382J31049I3787O4123B5905c75936c3751
$$ 204006 -306381 133136 298161 -289382 -158333 93787 157910 25905 -375936 -33751
12495b59711A45077K90270A8591J75312K08997A59466J13334c03469A58099a6647
$$ -259711 145077 435347 18591 193903 402900 159466 272800 -303469 158099 -16647
12484A9434Q1399c0398A69115b16176H0667l5420b36328A3584O7106L99654a4962
$$ 19434 100833 -30398 169115 -216176 80667 45247 -236328 13584 80690 480344 -14962
12472a43393L2883J4784q9420C74922a2277r4063c7479o5676K7481L6265A64846
$$ -143393 -110510 -95726 -185146 374922 -12277 -106340 -37479 -103155 -75674 -39409 164846
12460B96084e5153A08350D1514J6505N4603b29235d6511j14677d0671j2597A03946
$$ 296084 -55153 108350 41514 58019 112622 -229235 -46511 -161188 -40671 -53268 103946
12448a03584A96787a256j04731k28549a23205J3133A22467B6542a53635C3210
$$ -103584 196787 -1256 -105987 -334536 -123205 -110072 122467 26542 -153635 33210
12437F9932a74340g2731l2056A52875c3634l1394j389A79407C3836i485B16951
$$ 69932 -174340 -72731 -104787 152875 -33634 -65028 -66417 179407 33836 -9485 216951
12425c00342A40147J47893a56246C3809g4515a8187D6789b32065A62453c61904
$$ -300342 140147 288040 -156246 33809 -74515 -18187 46789 -232065 162453 -361904
12414C52707f1228q5292C74450f8650q5792B28126q9541a86057i0600n8642j1697
$$ 352707 -61228 -146520 374450 -68650 -154442 228126 138585 -186057 -90600 -149242 -160939
12403a60939A28100A8726c87996H3364J45323b00533j29340J01435f8930q137
$$ -160939 128100 18726 -387996 83364 228687 -200533 -329873 -228438 -68930 -77067
12393g7067q3002l7394D31729A1356D953J33583J93246A49353L5153i2985m3906
$$ -77067 -160069 -197463 431729 11356 4953 138536 331782 149353 184506 -92985 -136891
12382a36891A10610L35293a47978N9478B03521L0810a10782c2972E7663e1568
$$ -136891 110610 445903 -147978 -88500 203521 234331 -110782 -32972 57663 -51568
12371C85437E457L11560a10313k71320J70325K563l6218A30835n0595P3502p4855
$$ 385437 5457 317017 -110313 -381633 -211308 -208745 -244963 130835 80240 153742 78887
12360G8887b6256j44276A84390c89089B20987c60317C04648a53538A4729e070
$$ 78887 -26256 -170532 184390 -389089 220987 -360317 304648 -153538 14729 -5070
12349F4313i5201m8281A68404e8568o8992C1408L09349a00472G5293K6676b50517
$$ 64313 -95201 -143482 168404 -58568 -127560 31408 340757 -100472 75293 101969 -250517
12337B9887N7851l7409b25279C9595a63273e2718l4109D6861M281a63948c5728
$$ 29887 87738 50329 -225279 39595 -163273 -52718 -86827 46861 51142 -163948 -35728
12325C67548g797m10837g3296j62036G1805a03079O415C4042Q8777a20220B96203
$$ 367548 -7797 -418634 -73296 -235332 71805 -103079 -96664 34042 122819 -120220 296203
12313A37049g9922G6682L327c8598B29314H3085b34060N7915C46815Q1521A43030
$$ 137049 -79922 76682 80009 -38598 229314 83085 -234060 -176145 346815 428336 143030
12301c02521E4449K48067a8531k21506N8068d8235a0518r1649E3914a8311B51126
$$ -302521 54449 302516 -18531 -240037 -181969 -48235 -10518 -102167 53914 -18311 251126
12289b55404a00781E6055J22227L6379a41519j4112e8236D04143j88441A04559
$$ -255404 -100781 56055 178282 214661 -141519 -155631 -58236 404143 215702 104559
12278G1413b8196I1925N1317L4951c2050D78681a16537H6518b43902a02492A29490
$$ 71413 -28196 91925 143242 178193 -32050 478681 -116537 86518 -243902 -102492 129490
12266B27536a83170C87731A4175f7079n4485a4264m1990G6076j9303b08590B73057
$$ 227536 -183170 387731 14175 -67079 -121564 -14264 -56254 76076 56773 -208590 273057
12254i0403A53529p4989J21520J19424a45760A32042J54603G5468J20347K86464
$$ -90403 153529 78540 200060 319484 -145760 132042 286645 75468 195815 482279
12244D82279k00031A34802M36642b7236o8642B84165a20754B96485a06123D40709
$$ 482279 282248 134802 571444 -27236 -95878 284165 -120754 296485 -106123 440709
12233I5710L6738J22797m3292j5948J47106J68503H1184N11794A06957a88D15678
$$ 95710 132448 255245 211953 196005 343111 511614 81184 592978 106957 -188 415678
12221D06313A79830o2420m17l694Q2871L5285C1659K19317j03735o2783J74438
$$ 406313 179830 117410 116993 113299 196170 231455 31659 250976 147241 84458 258896
12210B58896A01868J58702l0161G029k472K12425a10583E63425I3491B4467J99799
$$ 258896 101868 260570 230409 7029 4557 216982 -110583 563425 93491 24467 224266
12199B24266h5496F9873K41927j33716O2039J94937L8940A76112L7533J75158
$$ 224266 -85496 69873 311800 178084 240123 435060 474000 176112 213645 388803
12189C88803q5013a11747A77649J6787J26597A09138k9161j3188a35955G8464
$$ 388803 303790 -111747 177649 194436 321033 109138 79977 66789 -135955 78464
12178A51073k0348b80387A65278J21186j05102K48400A94585d4156A61448O009
$$ 151073 130725 -280387 165278 286464 181362 429762 194585 -44156 161448 167457
12168A67457m031N0943h3338B80429J6614m3962d5459k2084D0115A1344a2647
$$ 167457 163426 214369 -83338 280429 297043 253081 -45459 -67543 40115 11344 -12647
12156b99414D1806Q3029N4346E0651e1356k32088R4947G6603J10538f528A86711
$$ -299414 41806 124835 179181 50651 -51356 -283444 -188497 76603 187141 -6528 186711
12144a4867A6544g6225h78A26289K5018m8576i2591C06000a31050e9976B30369
$$ -14867 16544 -76225 -878 126289 151307 102731 -92591 306000 -131050 -59976 230369
12132A78003a10225C58317a73063f370A9071a13505k07145G8168a51233B68744
$$ 178003 -110225 358317 -173063 -6370 19071 -113505 -320650 78168 -151233 268744
12121A93221a8958j18469r0707c6743r9106J8598C52635a2636B42504d7358B39783
$$ 193221 -18958 -137427 -228134 -36743 -135849 -117251 352635 -12636 242504 -47358 239783
12109A69832a73410d0918J1645m4372K8747H6674a27303A86867F2022J81297b4514
$$ 169832 -173410 -40918 -29273 -73645 -44898 86674 -127303 186867 62022 243319 -24514
12097c8762D0986R4216k5983J40533b427k40806B0051a72473O1970F3051J40165
$$ -38762 40986 135202 109219 249752 -2427 -243233 20051 -172473 -110503 63051 203216
12086B03216b76936B69831b8085A36590C5839J32078a25675A42659a29960j06647
$$ 203216 -276936 269831 -28085 136590 35839 167917 -125675 142659 -129960 -236607
12076b36607F2226A4695d1680J5945B11047k0600b9211j65921q2975B46803A4184
$$ -236607 62226 14695 -41680 -25735 211047 190447 -29211 -195132 -278107 246803 14184
12064E0695O2596A320M27546M36824J051461H18468A89267r4085f2340J9761C7249
$$ 50695 113291 1320 428866 865690 1917151 818468 189267 95182 -62340 -42579 37249
12052H9444a95642B48066o8396b00750k8173Q9545i83A46533K025a77114c850
$$ 89444 -195642 248066 179670 -200750 -228923 -139378 -983 146533 148558 -177114 -3850
12040h3044A41508e21920a24081C23165b0784A35753a44350j32710C3324a50988
$$ -83044 141508 -521920 -124081 323165 -20784 135753 -144350 -277060 33324 -150988
12029g729k17560P3890j65247A11621m4998K29175a592H169b42074B81665b63043
$$ -7729 -225289 -151399 -316646 111621 66623 295798 -1592 8169 -242074 281665 -263043
12017A15302i5320l6771c3878J5343n95B63015F6726K19715a14780B16885h8935
$$ 115302 -95320 -132091 -33878 -18535 -19130 263015 66726 286441 -114780 216885 -88935
12005g8221C0865a08679q3782e6467C31093b31449R2270N3388j03746A73644K5206
$$ -78221 30865 -108679 -192461 -56467 331093 -231449 -139179 -85791 -189537 173644 198850
11994A98850a91354F3237J78215e907b86j39268l6337j23572h0641L367D0620
$$ 198850 -191354 63237 241452 -5907 -286 -139554 -175891 -299463 -80641 -77274 40620
11982A39520c1425p0249p1102B6468c247j63469r6229A92243a62402C8297e987
$$ 139520 -31425 -101674 -172776 26468 -3247 -166716 -262945 192243 -162402 38297 -5987
11970b22387A91853G7954a26024B03605b50411O2218g3382A92120J70401b30865
$$ -222387 191853 77954 -126024 203605 -250411 -188193 -73382 192120 362521 -230865
11959a20431k80257e9057F7435J36245h4295B71047n055a53164I2461K96968d7042
$$ -120431 -400688 -59057 67435 203680 -84295 271047 265992 -153164 92461 389429 -47042
11947h9026B7718J87882k4143M5687F3883c8558I0064h9958a5951E8693Q1847
$$ -89026 27718 215600 191457 237144 63883 -38558 90064 -89958 -15951 58693 140540
11936A40540K7567Q5013b25574H9069b5262C9252g1978B07103i6300I5440b12804
$$ 140540 168107 253120 -225574 89069 -25262 39252 -71978 207103 -96300 95440 -212804
11924F3657e5418F4062k7909J7284O705Q2445j7691K06985a9181A12377j9700
$$ 63657 -55418 64062 36153 53437 60142 142587 124896 331881 -19181 112377 92677
11913I2677L8881b75534A4707b32054L5017d6608n792l1173g779j53924k5708
$$ 92677 131558 -275534 14707 -232054 -197037 -46608 -52400 -83573 -7779 -161703 -187411
11902a87411n2100F9807b12885n3091M4384e5276A58921F5639b55940a10560D6435
$$ -187411 -239511 69807 -212885 -265976 -221592 -55276 158921 65639 -255940 -110560 46435
11890B49734H259a02819n2165A4076d08940d373A57402a4903o3312a0460k28857
$$ 249734 8259 -102819 -154984 14076 -408940 -4373 157402 -14903 -78215 -10460 -239317
11879b39317M8660K8493n1570A59441Q923j1569O7102J71024b5379C8737J8272
$$ -239317 -190657 -162164 -213734 159441 168364 156795 223897 394921 -25379 38737 57009
11868E7009J32296n0637a89826C08283i1444D9055J35292h7539k71119O0899A62710
$$ 57009 189305 138668 -189826 308283 -91444 49055 184347 -87539 -358658 -297759 162710
11856A65926g1195H6138K15993Q2539g52C55113r4854h3005j07868P9829J6751
$$ 165926 -71195 86138 302131 384670 -752 355113 260259 -83005 -190873 -111044 -94293
11845i4293c1759k01895A45500b66814j6837K1818c4706q8653j32948A80202c29431
$$ -94293 -31759 -233654 145500 -266814 -283651 -261833 -34706 -123359 -256307 180202 -329431
11833c49398h7881b705C03113G3231B4820N8883a17770k08853A61596c5524j06729
$$ -349398 -87881 -2705 303113 73231 24820 83703 -117770 -326623 161596 -35524 -142253
11822a42253G5772N200L6250a60232A85074J48960B1487h570E0991a60304L1975
$$ -142253 75772 80972 117222 -160232 185074 334034 21487 -8570 50991 -160304 -128329
11811a28329A44799b32877j57616a34978M2460K0157B6039J8600K7838a3851A28718
$$ -128329 144799 -232877 -390493 -134978 -92518 -72361 26039 44639 72477 -13851 128718
11799a00029A54871a11091K7679j8029B50675c37242g4816C14668j26433a15524
$$ -100029 154871 -111091 -83412 -101441 250675 -337242 -74816 314668 188235 -115524
11788a51254P2831j17444g0668B95370a3451j3456p6525q3668L1017C7847b14826
$$ -151254 -78423 -195867 -70668 295370 -13451 -26907 -103432 -187100 -156083 37847 -214826
11776A8827f6768j82516A26744b52510J03684m2916N0673C15284r2758q1178b43815
$$ 18827 -66768 -249284 126744 -252510 -148826 -191742 -141069 315284 222526 141348 -243815
11764B09940l2184b78056h6768A8531J35278b09009E3654b3243k7002A08647K21676
$$ 209940 177756 -278056 -86768 18531 153809 -209009 53654 -23243 -50245 108647 330323
11753C30323b27578N5830A59089C6607J5103c08398B9140a12157A22172f8278
$$ 330323 -227578 -171748 159089 36607 51710 -308398 29140 -112157 122172 -68278
11742b90894J23989A44333a47713I8278J93083Q3998J8340p0157A09331e4697
$$ -290894 -166905 144333 -147713 98278 291361 375359 393699 323542 109331 -54697
11731a66279A31944c3039j68666c5483q5652k8613D6505O0663J01007c3693H7360
$$ -166279 131944 -33039 -201705 -35483 -121135 -149748 46505 107168 208175 -33693 87360
11719A10436J51101f1955k0657D16315j80214i3978K0113C27791j40490O576Q5549
$$ 110436 261537 -61955 -82612 416315 236101 -93978 -73865 327791 187301 193877 279426
11708B79426G5279J26747a32345H1445r943A9448J8763J22305c6055G2843a36325
$$ 279426 75279 202026 -132345 81445 71502 19448 38211 160516 -36055 72843 -136325
11696a28084C5124K08644m3738c21610G928f5633p5411b6826B54779b8970l2224
$$ -128084 35124 243768 200030 -321610 7928 -65633 -141044 -26826 254779 -28970 -61194
11685f1194B04004l2769K9923A6423J59470n3048E0121a5703F1577K38414G069
$$ -61194 204004 171235 201158 16423 175893 122845 50121 -15703 61577 299991 7069
11673A92991a50787o5095O7756B39614A05403J27524C5405d4998A32306I849K38853
$$ 192991 -150787 -215882 -148126 239614 105403 232927 35405 -44998 132306 9849 248702
11662B48702i637G4381R7536p7747J69457j01757J63321b12906A75199c0309C2992
$$ 248702 -9637 74381 171917 94170 263627 161870 325191 -212906 175199 -30309 32992
11650a73631A70009J52810a40966A6402R296A1557c6694j34474L0084j34509C95297
$$ -173631 170009 322819 -140966 16402 25698 11557 -36694 -171168 -141084 -275593 395297
11638d11322B00724a25677M054B92972e6730L344k2049B84384B0861i2076A38004
$$ -411322 200724 -125677 -121623 292972 -56730 -53386 -75435 284384 20861 -92076 138004
11626C01929c17439B32434N0679a98395f4005I7678g6817A88842O6025a47131
$$ 301929 -317439 232434 283113 -198395 -64005 97678 -76817 188842 254867 -147131
11615I4546a31723C27955B6093l569a22211f0634F9850N1163c34691B48698P1424
$$ 94546 -131723 327955 26093 22524 -122211 -60634 69850 121013 -334691 248698 320122
11604C20122a98729b4985l72325e8649F5700J55552d3494H1668O8291A1206K90822
$$ 320122 -198729 -24985 -397310 -58649 65700 221252 -43494 81668 149959 11206 302028
11593C02028c6110n7074j79350C36047G1708H670P9323J83377J5520H8639g5992
$$ 302028 -36110 -93184 -272534 336047 71708 8670 87993 271370 286890 88639 -75992
11581a26624D8773L1766J14674a46670f9427E1644i5073A82538b44413F3508J99029
$$ -126624 48773 80539 195213 -146670 -69427 51644 -95073 182538 -244413 63508 262537
11570B62537j27345g2886B46894j20838J0307f1355j93020e3738A75935d14384
$$ 262537 135192 -72886 246894 126056 136363 -61355 -254375 -53738 175935 -414384
11559D16K57812H7996C3126d4055A01408f5109C45452A37084d9921A59789h8134
$$ 416 258228 87996 33126 -44055 101408 -65109 345452 137084 -49921 159789 -88134
11547B57213p9372G5270K47335a08618D1796a73714B69397b5048A30343J81361
$$ 257213 177841 75270 322605 -108618 41796 -173714 269397 -25048 130343 311704
11537C11704F3800h1509C147g6917J5579A20318E9083h1920H8405a09699D13429
$$ 311704 63800 -81509 3147 -76917 -61338 120318 59083 -81920 88405 -109699 413429
11525A69072a27380B941L93981a94957A68899J2948i3385B88542j34808e9505
$$ 169072 -127380 2941 396922 -194957 168899 181847 -93385 288542 153734 -59505
11514A53309H831a0568B5409b29728e8479K5547A23377J10813I3286D2769b03513
$$ 153309 8831 -10568 25409 -229728 -58479 -32932 123377 234190 93286 42769 -203513
11502B79403j3732e8142D38441A61440o4164b38878A55725G5649L694L60166i366
$$ 279403 265671 -58142 438441 161440 97276 -238878 155725 75649 79343 439509 -9366
11490A69868f2746A61972b0079B50049q8878K39249A29118J89359C4014K50778
$$ 169868 -62746 161972 -20079 250049 161171 400420 129118 318477 34014 284792
11480B84792A10176M0191G3295B2794L2989L69359B0764K58667P4569b21206C31734
$$ 284792 110176 150367 73295 22794 55783 425142 20764 279431 354000 -221206 331734
11468H7382a12576B22300k5938g4098B62406K04825k08703a06022b1897q7250
$$ 87382 -112576 222300 196362 -74098 262406 467231 258528 -106022 -21897 -109147
11458a09147A48068J14321n4979J62692a20387B32362a00816C04252E8949K77589
$$ -109147 148068 262389 207410 370102 -120387 232362 -100816 304252 58949 336538
11448C36538j54767G285K66468B1945J40433o2699M1525L7741l0732F5131a13383
$$ 336538 181771 7285 273753 21945 162378 99679 141204 178945 148213 65131 -113383
11436I5807J62192M7181A12923J09014q5074A1258a25085B53808j16620a60650
$$ 95807 257999 305180 112923 221937 136863 11258 -125085 253808 137188 -160650
11425B45566M3820p3953a01312p9263C17364D3194c0277k00731D4292c3885j71068
$$ 245566 289386 215433 -101312 -180575 317364 43194 -30277 -231008 44292 -33885 -204953
11414b04953B18259a70283B0893L6681a44906p6150j77252a04274j6852G5607
$$ -204953 218259 -170283 20893 57574 -144906 -221056 -398308 -104274 -121126 75607
11403a28380C78592H8429L30042A96960a92882D9555B1973J98235J65864G868
$$ -128380 378592 88429 418471 196960 -192882 49555 21973 220208 386072 7868
11392A2758J49969d8464b461A83758f9247k65321c698j55926K2320D9855K21984
$$ 12758 162727 -48464 -2461 183758 -69247 -334568 -3698 -159624 -137304 49855 271839
11381B71839j23376A2277e0347f956A7647a48552e037m6927A84489F514N2378
$$ 271839 148463 12277 -50347 -6956 17647 -148552 -5037 -51964 184489 6514 58892
11370E8892a05498J1732K2436j81966a23167G3456b04698B62613E8057g3706E3082
$$ 58892 -105498 -93766 -71330 -253296 -123167 73456 -204698 262613 58057 -73706 53082
11358B471b94781C0293b91890A03335i5515B9885c685A6990c64000c8298a5695
$$ 2471 -294781 30293 -291890 103335 -95515 29885 -3685 16990 -364000 -38298 -15695
11346A64736g7802p26B15785r2063N9320B7314H013d13374B78581a35084e9147
$$ 164736 -77802 -78528 215785 123722 183042 27314 8013 -413374 278581 -135084 -59147
11334A95617a20907D8188J63814j04301j5905e0863m6487C9549J4829N6726c06653
$$ 195617 -120907 48188 212002 107701 91796 -50863 -97350 39549 54378 111104 -306653
11322b10204A03714f8717b8200A11564h9641d1067A36075n0438c03608A49592
$$ -210204 103714 -68717 -28200 111564 -89641 -41067 136075 85637 -303608 149592
11311a42188l05156c1796E630d16434E3887B0016a8506l17114J19790o6679Q4299
$$ -142188 -447344 -31796 5630 -416434 53887 20016 -18506 -335620 -215830 -282509 -198210
11300a98210j2157k6261K0835g5758b8881k13404D8207J14016B2051e6742A10244
$$ -198210 -210367 -236628 -215793 -75758 -28881 -242285 48207 162223 22051 -56742 110244
11288F842c83472J36596R4148n5710P8047A42281J0852e8466j46356C4781a8658
$$ 6842 -383472 -246876 -152728 -208438 -130391 142281 153133 -58466 -204822 34781 -18658
11276A7441O5663R590a01254I7370h2616D3160b35588E7658g969j65556j89882
$$ 17441 83104 92694 -101254 97370 -82616 43160 -235588 57658 -7969 -173525 -363407
11265c63407a05600j9537B42643F3550A9039a05137B80467a52110B380M4796J80197
$$ -363407 -105600 -125137 242643 63550 19039 -105137 280467 -152110 2380 47176 227373
11254B27373a4579j54494g8148k19835D4094J94700G8527b8934B6336e635C42207
$$ 227373 -14579 -169073 -78148 -297983 44094 238794 78527 -28934 26336 -5635 342207
11242b43572P0820C8097j8409b57758G8837d8122B45927E8673b40105A71076A382
$$ -243572 -172752 38097 19688 -257758 78837 -48122 245927 58673 -240105 171076 1382
11230A92854B0778N5344J14437D0004b10521L2805O2045a7502I5676k7407J91726
$$ 192854 20778 76122 190559 40004 -210521 -177716 -115671 -17502 95676 68269 259995
11219B59995A3765J37199a2279j37590q0609E0471K34051b43904a02094A59383
$$ 259995 13765 150964 -12279 -149869 -230478 50471 284522 -243904 -102094 159383
11208b22699f2776b8263J0105f583j72o2996j0996k9907b7826k57397H8669c91457
$$ -222699 -62776 -28263 -18158 -6583 -6755 -69751 -80747 -110654 -27826 -285223 88669 -391457
11195c11618c2378k41042e1798j9900a3421j68632P6002B25253a16016A12091
$$ -311618 -32378 -273420 -51798 -71698 -13421 -182053 -106051 225253 -116016 112091
11184b86692c0779k45288B99662a01104b8997o2360A11779O8409A4793J26388
$$ -286692 -30779 -276067 299662 -101104 -28997 -91357 111779 180188 14793 141181
11174A41181E9212L45322a5133p9144B35918a19219C81517a81755A38761F0295
$$ 141181 59212 404534 -15133 -94277 235918 -119219 381517 -181755 138761 60295
11163b24442j09703D93h1791m14097a20248k0113l375A9922Q7468a61009D918
$$ -224442 -334145 493 -81791 -495888 -120248 -140361 -143736 19922 107390 -161009 4918
11151b05150C15789f725m5587m765p9341Q054A29348D4987a31944K2325o8037
$$ -205150 315789 -6725 -52312 -57077 -136418 -128364 129348 44987 -131944 -109619 -177656
11140a77656I9451K93269b2676B34106a51232C7092J57911J72185E0334J13157
$$ -177656 99451 392720 -22676 234106 -151232 37092 195003 367188 50334 163491
11130A63491C5917Q1466A5271o183K07611b81027Q7459B15862a54167O1224A05106
$$ 163491 35917 117383 15271 9088 216699 -281027 -193568 215862 -154167 -92943 105106
11118f0367D5914a34594N5043L9600j56332a374k0576B07215n0520n639a19830
$$ -60367 45914 -134594 -79551 -39951 -196283 -1374 -21950 207215 156695 151056 -119830
11106g9072D28154F7351J32884A383P5119d78991B91633L4651h1125C32401A00879
$$ -79072 428154 67351 200235 1383 76502 -478991 291633 326284 -81125 332401 100879
11094c3756C1314J82442E0536J2862L19628E545a56833C83293j23503G3640K0474
$$ -33756 31314 213756 50536 63398 383026 5545 -156833 383293 259790 73640 94114
11083I4114q551K02687j16571K93995G1948K08874J55422l8348N1422B09871r2208
$$ 94114 85563 288250 171679 465674 71948 280822 436244 397896 449318 209871 117663
11072A17663M21625A40580R9148L11659m7577A52920J67583q3901O6952K98848
$$ 117663 539288 140580 239728 551387 503810 152920 320503 236602 303554 602402
11062F02402j14347K6417k15210J80110j51859L55906M0872j76522J25433m4047
$$ 602402 488055 514472 299262 479372 327513 683419 724291 547769 673202 629155
11052F29155J28558k39160J60943j0267J44914J3977l7194j77496O4247L0939
$$ 629155 757713 518553 679496 669229 814143 828120 790926 613430 677677 708616
11042G08616K15126o4641J33895j64592j96292o9180K11540J17140k19575j81749
$$ 708616 923742 859101 992996 828404 632112 562932 774472 891612 672037 490288
11032D90288K46438k88870n0865K97895L45227n05437J66997Q1896l12247j18987
$$ 490288 736726 447856 396991 694886 1040113 534676 701673 783569 471322 352335
11022C52335A59537N21522J12425n4576Q4277k41093k89017M28150j88177J86907
$$ 352335 159537 681059 793484 738908 823185 582092 293075 721225 533048 719955
11012G19955O9841k57740K37370Q0521C68923L8426K16222K42594m13669O7202
$$ 719955 789796 532056 769426 849947 368923 407349 623571 866165 452496 519698
11002E19698j28013M82357j45443l30635L49057j28822P9906k85577L15970L33277
$$ 519698 391685 874042 728599 397964 747021 618199 698105 412528 728498 1061775
10992A061775k88900k47101L64336J397o6441J55558j66787L15728K42170l89332
$$ 1061775 772875 525774 890110 891507 825066 980624 813837 1129565 1371735 982403
10982I82403J35007o0672J14939L11040q2390M13058L5002J71671O27676j84478
$$ 982403 1117410 1056738 1171677 1482717 1400327 1813385 1848387 2020058 2647734 2463256
10972B463256K81503L0053M4993k0935J07926n05627k21292k22123o5319q3190
$$ 2463256 2744759 2774812 2819805 2798870 2906796 2401169 2179877 1957754 1892435 1809245
10962A809245N5285o3573j88075L18083K03776j17325j78105j04505M960l14144
$$ 1809245 1864530 1800957 1612882 1930965 2134741 2017416 1839311 1734806 1739766 1425622
10952A425622O7656n18931M5506k85120m4807B84122J03090J92250j41210A60221
$$ 1425622 1493278 974347 1019853 734733 689926 284122 387212 579462 438252 160221
10941G29821H1834L86188f3433C9013h520B00916L9697a28448B94290j26976o4962
$$ 729821 81834 468022 -63433 39013 -8520 200916 240613 -128448 294290 167314 102352
10930A02352q057K02575H2952K9670c6626A68983E894M4787f6167A86384L07787
$$ 102352 94295 296870 82952 112622 -36626 168983 5894 50681 -66167 186384 494171
10919D94171A72066f3164q702J9788j05464P7697j3324k00029a16471F3002e1974
$$ 494171 172066 -63164 -71866 -52078 -157542 -79845 -93169 -293198 -116471 63002 -51974
10907a83448A14198D2516a15908M6687r4875M8007A76277J80867C9175O8326f0893
$$ -183448 114198 42516 -115908 -69221 -164096 -116089 176277 357144 39175 107501 -60893
10895C28309G264c66248B98708j04884G9544b30186C8551a54414b8229j74896
$$ 328309 7264 -366248 298708 193824 79544 -230186 38551 -154414 -28229 -203125
10885b03125J775A11116D3432j8824d5223n3927j10201C226J49747b5176F4529
$$ -203125 -201350 111116 43432 24608 -45223 -99150 -209351 3226 152973 -25176 64529
10873b088A89561o4652J95882e7625C5162K0863g0076p3668j65159J29239M7604
$$ -2088 189561 124909 320791 -57625 35162 56025 -70076 -143744 -308903 -179664 -132060
10862a32060A3274N3946L99264E2037O3532k8592a44836a0429l17598C4031f4448
$$ -132060 13274 67220 466484 52037 115569 86977 -144836 -10429 -328027 34031 -64448
10850a02010q131A5012f6332j25119D03524j63789a94995B09576C1171a98264
$$ -102010 -110141 15012 -66332 -191451 403524 239735 -194995 209576 31171 -198264
10839b66440D2442P7770i9884A47707A6464L2160O4423e0475J2961D3384J52097
$$ -266440 42442 120212 -99884 147707 16464 48624 113047 -50475 -37514 43384 195481
10828A95481q9307i9764j86453B55857b93710a18983K9611D2833b83291D6460
$$ 195481 106174 -99764 -286217 255857 -293710 -118983 -89372 42833 -283291 46460
10817a6329A63616e4608l9244A93123C900J19555b17981E1092A9619f4414q3066
$$ -16329 163616 -54608 -93852 193123 3900 123455 -217981 51092 19619 -64414 -147480
10806a47480I7821L5434J16551I9732a43973B02451j3912M2407D1596a3369A74757
$$ -147480 97821 133255 249806 99732 -143973 202451 188539 230946 41596 -13369 174757
10794b25077F6197e81198A80499R5003A14994C2341b05633a3729C5160J10333
$$ -225077 66197 -581198 180499 275502 114994 32341 -205633 -13729 35160 145493
10784A45493d10791a45248l7586A10615P9866a1863p7386c3159D8826b48884E3748
$$ 145493 -410791 -145248 -182834 110615 190481 -11863 -89249 -33159 48826 -248884 53748
10772e3654A07193g3987A98036c15055Q9843l22c6191m4751G097a62356A13017
$$ -53654 107193 -73987 198036 -315055 -225212 -225534 -36191 -80942 7097 -162356 113017
10760A02211b23093N8897c9893D6930b12220A99032F2016P2795b22263M2665E7801
$$ 102211 -223093 -164196 -39893 46930 -212220 199032 62016 134811 -222263 -179598 57801
10748A55327J33069p2183q2785Q272a45735B4996J46376o8439J19599J44093a79182
$$ 155327 288396 216213 133428 141700 -145735 24996 171372 102933 222532 366625 -179182
10736b7105A02969b01695p6639a0285j44557B65269E0037h3222l09719A27696
$$ -27105 102969 -201695 -278334 -10285 -154842 265269 50037 -83222 -392941 127696
10725c9015j48428F086a00308d1779C1442Q5178c9014j59059H0409i3853k82183
$$ -39015 -187443 6086 -100308 -41779 31442 116620 -39014 -198073 80409 -93853 -376036
10714c76036E563K86235b72587J27034L0718m08851B2037b29840R8523a6030C0458
$$ -376036 5563 291798 -272587 -145553 -114835 -523686 22037 -229840 -131317 -16030 30458
10702c8091B48152i1875k20844d4156k15205c7366j18622c1512H5380b4867k9225
$$ -38091 248152 -91875 -312719 -44156 -259361 -37366 -155988 -31512 85380 -24867 -54092
10691e4092A60964j9857J57833b6701A51456K51859A74065E3006b19328e4215
$$ -54092 160964 141107 298940 -26701 151456 403315 174065 53006 -219328 -54215
10680B6118b86058m0599g4255G08J06426f2614j81965A32660B3621a29327b0947
$$ 26118 -286058 -326657 -74255 708 107134 -62614 -244579 132660 23621 -129327 -20947
10668d21441a11302k1138j38160C33633A45476J47836F4419d1156o752k00184
$$ -421441 -111302 -132440 -270600 333633 145476 293312 64419 -41156 -47908 -248092
10658b48092A02680D1659L320a5531E7457R0570b079p224B8833f1178I1425Q6077
$$ -248092 102680 41659 44979 -15531 57457 148027 -2079 -9303 28833 -61178 91425 177502
10646A77502b28571A64478E6495J39894e98940c582k2350k51330g0002F694P1451
$$ 177502 -228571 164478 56495 196389 -598940 -3582 -25932 -277262 -70002 6694 78145
10635G8145A5440J66248J03323d05130i235k59141R587A36533a00740o6004M4308
$$ 78145 15440 181688 285011 -405130 -9235 -268376 -258789 136533 -100740 -166744 -122436
10624a22436B01040c2934j28993e5639a9259j07397f2748j88268L7340A06319
$$ -122436 201040 -32934 -161927 -55639 -19259 -126656 -62748 -251016 -213676 106319
10613b7513m0912J6121o0380o0258M4893c3354I1015c28187f4716A1913b51424
$$ -27513 -68425 -52304 -112684 -172942 -128049 -33354 91015 -328187 -64716 11913 -251424
10601I6159c08760A11461b87561H5798e25912A791K36790a75430j00113i0938
$$ 96159 -308760 111461 -287561 85798 -525912 1791 238581 -175430 -275543 -90938
10590A46002c02442K3697a28753D77797b4867n7956l9288f785k73769A8090h1233
$$ 146002 -302442 -278745 -128753 477797 -24867 -82823 -122111 -6785 -280554 18090 -81233
10578b13836J4246D7591b2194C3513K60293A0448h8470B4828a62753j20370D550
$$ -213836 -199590 47591 -22194 33513 293806 10448 -88470 24828 -162753 -283123 4550
10566a95124j19958J5764a16703C9845b30464O8901m5922A84488m5886b19692
$$ -195124 -315082 -299318 -116703 39845 -230464 -161563 -207485 184488 138602 -219692
10555B70481D2822J6330d78137b15067E1354b604A45589E2037a04531j10113D5861
$$ 270481 42822 59152 -478137 -215067 51354 -2604 145589 52037 -104531 -214644 45861
10543F9247c54632E9693h8247I5178B2572a38199A54422c2028j16759A15584b21045
$$ 69247 -354632 59693 -88247 95178 22572 -138199 154422 -32028 -148787 115584 -221045
10531b47723Q2143A14738i5583J2002b8555B28356q9061C4808a14053A2368D881
$$ -247723 -165580 114738 -95583 -83581 -28555 228356 139295 34808 -114053 12368 4881
10519A39434b2010D3773b20844b7635C0194L7774a36594C05429a75754a9436g065
$$ 139434 -22010 43773 -220844 -27635 30194 67968 -136594 305429 -175754 -19436 -7065
10507c11005g7072j65501d838m31344a82395j92526J80907A5079A984J29662D3657
$$ -311005 -77072 -242573 -4838 -436182 -182395 -374921 -194014 15079 1984 131646 43657
10495E7729a341j00090d1986A2685J28021E3282b14877A0150d5134C4360L06969
$$ 57729 -1341 -101431 -41986 12685 140706 53282 -214877 10150 -45134 34360 341329
10484C41329j46287k2186N21631j84029J18777A46174K78302j21338n1588p2719
$$ 341329 195042 172856 694487 510458 629235 146174 424476 303138 251550 178831
10474A78831H1315J4299M45497f0617j76280g5086b5144G9875b46823J08989E7285
$$ 178831 81315 95614 541111 -60617 -236897 -75086 -25144 79875 -246823 -137834 57285
10462a95972k16076a5168A48159e05344C47385a66152B70351F7654J61470e9570
$$ -195972 -412048 -15168 148159 -505344 347385 -166152 270351 67654 229124 -59570
10451G7544J8282L7161b08583G2848b11197A33963a23053E74168C8839h6207H8892
$$ 77544 95826 132987 -208583 72848 -211197 133963 -123053 574168 38839 -86207 88892
10439H3625a06963a1475j8195I6318j2408b2820H685K21855e0861E3801b21891
$$ 83625 -106963 -11475 -29670 96318 83910 -22820 8685 230540 -50861 53801 -221891
10427a08064d3630j66924M8651a3277l48517b6043B19257G5292P3573l5349B1462
$$ -108064 -43630 -210554 -161903 -13277 -361794 -26043 219257 75292 148865 113516 21462
10415h4873G4471b97531b8020k11973H8697J98765A01388j3399J25317A03200
$$ -84873 74471 -297531 -28020 -239993 88697 287462 101388 87989 213306 103200
10404B00513b15642R0867A09303J18389o6679n4329I377c2747A55123B2161a9338
$$ 200513 -215642 -124775 109303 227692 161013 106684 9377 -32747 155123 22161 -19338
10392b85031C01018a61481c5960H7831k297a36619A84817a02978G2518J51350
$$ -285031 301018 -161481 -35960 87831 85534 -136619 184817 -102978 72518 223868
10382B23868a49546M3217A82634O9867h1230B5571M41266k00310J46592p3483
$$ 223868 -149546 -106329 182634 252501 -81230 25571 466837 266527 413119 339636
10372C39636M7568J41787j94072J45068j91610J60215J44255k1080A89982K685
$$ 339636 387204 528991 334919 479987 288377 448592 592847 571767 189982 192667
10362A92667J13452q8138J74251n489o8214a57074C60667C4989N5858L2142L29696
$$ 192667 306119 217981 392232 386743 318529 -157074 360667 34989 90847 122989 452685
10351D52685J47549r1508j49819l5229b3810A59217K39539L720j7300r7980o9819
$$ 452685 600234 508726 358907 323678 -23810 159217 398756 402476 385176 287196 217377
10340B17377J92036K5210f2734E22855A24622B2799K4265J07599J887J49715A09836
$$ 217377 409413 434623 -62734 522855 124622 22799 47064 154663 156550 306265 109836
10328E538i6172j03998d6243A73720O885q4891R0290F2142L3812L7753o4076a07524
$$ 5538 -96172 -200170 -46243 173720 180605 95714 186004 62142 95954 133707 69631 -107524
10315B48306b04346g7175D9206a67663B6006J6117b27937F0669j9598b19185A14995
$$ 248306 -204346 -77175 49206 -167663 26006 42123 -227937 60669 41071 -219185 114995
10303C68598f8808r2369g4927C76226q3753B2667K8723a67365B93665a99407k1787
$$ 368598 -68808 -161177 -74927 376226 292473 22667 51390 -167365 293665 -199407 -221194
10292b21194d1778G59K28675b94074J18555j50325a10892E8358N5478a5393j24953
$$ -221194 -41778 759 229434 -294074 -175519 -325844 -110892 58358 113836 -15393 -140346
10281a40346k5297l27n02029a44282G5959L40184b67602B86032I0796B4568Q0168
$$ -140346 -165643 -165970 -667999 -144282 75959 416143 -267602 286032 90796 24568 104736
10270A04736c4951n4314H2256b9143n1183A98644A0653J35221C7619K5907J29468
$$ 104736 -34951 -89265 82256 -29143 -80326 198644 10653 145874 37619 63526 192994
10259A92994J85353A46685M39384A61816K06300A53153p1042J62411b09568A45793
$$ 192994 378347 146685 586069 161816 368116 153153 82111 244522 -209568 145793
10248A14619J5161K7241a51317B81529E1217J39885h7035j64823R3869O7026A53620
$$ 114619 129780 157021 -151317 281529 51217 191102 -87035 -251858 -157989 -90963 153620
10236A8797a34477b2594j23632l1047m7877a5127j53697m5112F5535c2830j55177
$$ 18797 -134477 -22594 -146226 -177273 -225150 -15127 -168824 -213936 65535 -32830 -188007
10225a88007L8424m9458d9654G3706c14317M5083c1813k50814h3468l3907M8766
$$ -188007 -149583 -199041 -49654 73706 -314317 -269234 -31813 -282627 -83468 -117375 -68609
10214f8609B39720c85849A5394b9274B54559E9270c33997c5599j16617G6979a41148
$$ -68609 239720 -385849 15394 -29274 254559 59270 -333997 -35599 -152216 76979 -141148
10202a70676L4102d9888H4511a97091I5321a3126C02916C2707E987a6415o1136
$$ -170676 -136574 -49888 84511 -197091 95321 -13126 302916 32707 5987 -16415 -77551
10191g7551B40384A10855i789j02542b4962p4504I4787J31300d12G9105a7569
$$ -77551 240384 110855 -9789 -112331 -24962 -99466 94787 226087 -412 79105 -17569
10179b60809e8813A72919a34145r9482F5759b56319A16252c51940B7726c27486
$$ -260809 -58813 172919 -134145 -233627 65759 -256319 116252 -351940 27726 -327486
10168i036j82396A92441a32098A0201M2346e83330B9424e8311k14334J20023P578
$$ -9036 -191432 192441 -132098 10201 52547 -583330 29424 -58311 -272645 -152622 -145044
10157a45044I2401J59680b25608e8170h649m2777j22632G9338l2264r4e08778
$$ -145044 92401 252081 -225608 -58170 -8649 -51426 -174058 79338 47074 46980 -508778
10145a07760r0106D7268Q419K57130b59565B00396F2722g9410A75322q4079a54938
$$ -107760 -197866 47268 55687 312817 -259565 200396 62722 -79410 175322 91243 -154938
10133e9645A331O5984P8860m5401j2403D0022a14916N5101a5672j70709m8173
$$ -59645 1331 67315 146175 100774 88371 40022 -114916 -59815 -15672 -186381 -234554
10122b34554n2274D9517h650q340k948f163D9892K4170e101F5144K74783G5466
$$ -234554 -286828 49517 -8650 -16990 -19938 -6163 49892 74062 -5101 65144 339927 75466
10109f8852k98961A3732b34057J10505K6291j1503C59038d3956k9664k92145F7003
$$ -68852 -367813 13732 -234057 -123552 -97261 -108764 359038 -43956 -73620 -365765 67003
10097a44308c4971L376C52137a14887A98095r7646C8361J5698K49398h7823q9392
$$ -144308 -34971 -31595 352137 -114887 198095 100449 38361 54059 303457 -87823 -177215
10086a77215a3725j71516f0948j48621Q6839e5832l1995B0178h059j87077d1672
$$ -177215 -13725 -185241 -60948 -209569 -122730 -55832 -87827 20178 -8059 -195136 -41672
10074g7047I037K05913b83083L1944A78550b5897l7592q5982D2021K7363e9196
$$ -77047 9037 214950 -283083 -251139 178550 -25897 -63489 -149471 42021 69384 -59196
10062b597m9368j88991A58285j441e2017j1273B5584a96771N8711j87953B2211
$$ -2597 -51965 -240956 158285 156844 -52017 -63290 25584 -196771 -138060 -326013 22211
10050e3391j59066F5843P5116a63138D443a7522k45737j4248m4915M2297A41296
$$ -53391 -212457 65843 140959 -163138 4443 -17522 -263259 -277507 -322422 -280125 141296
10038e8650j99996a9297A15861b46415B84997J68965e830F3881c50912I7725b25236
$$ -58650 -258646 -19297 115861 -246415 284997 453962 -5830 63881 -350912 97725 -225236
10026a71756e258l30259C93577b57119l839c5688r6623A16355h8098l6562K1188
$$ -171756 -5258 -335517 393577 -257119 -260958 -35688 -132311 116355 -88098 -124660 -103472
10015a03472J3372j77716c3746B28249i0369d4578e426k87350A03936i994L8j09328
$$ -103472 -90100 -267816 -33746 228249 -90369 -44578 -5426 -292776 103936 -9994 -9956 -119284
10003a19284r119B35638a44062M8629A61006a18835k6348j01936e8810A12336
$$ -119284 -128403 235638 -144062 -95433 161006 -118835 -145183 -247119 -58810 112336
9992d81987a41098j85735A30761m7427k5864J86896c13632e4858A93464c12853
$$ -481987 -141098 -326833 130761 83334 57470 244366 -313632 -54858 193464 -312853
9981d9130A18998a04598F4803c58525i7411k1716b9873A88333b16187B2886R7699
$$ -49130 118998 -104598 64803 -358525 -97411 -119127 -29873 188333 -216187 22886 120585
9970A20585B7065G821c34327C26633A40234b55279a01249r1167n842g3296A2954
$$ 120585 27065 7821 -334327 326633 140234 -255279 -101249 -192416 -198258 -73296 12954
9958h0360H1948b20569B45490b10800F7956c8962m6305j38419D7655j7397a41902
$$ -80360 81948 -220569 245490 -210800 67956 -38962 -85267 -223686 47655 30258 -141902
9946b72786G175a77288o5903E195J61209a07033J056k04725L7323B09144c55657
$$ -272786 7175 -177288 -243191 5195 166404 -107033 -105977 -310702 -273379 209144 -355657
9934A33586h7468k21328Q5885A00891c09862J48251R282E2692b43710d2562A35120
$$ 133586 -87468 -308796 -222911 100891 -309862 -161611 -152329 52692 -243710 -42562 135120
9922D5631j6020R0278c21542a13990C6400j8076K2171O8096g4980j89537J01314
$$ 45631 29611 119889 -321542 -113990 36400 18324 40495 108591 -74980 -264517 -163203
9911a63203j28923B95605b10314A18420c3556q4658D2335g0306E5787A0263g5863
$$ -163203 -292126 295605 -210314 118420 -33556 -118214 42335 -70306 55787 10263 -75863
9899d4223l49982J01424B5536a90776j38162C090K36524b34005l20325a52950
$$ -44223 -394205 -292781 25536 -190776 -328938 3090 239614 -234005 -554330 -152950
9888C17061F8795a5779E5838i591C324M20918b16830k8286E3870R6853a60338
$$ 317061 68795 -15779 55838 -9591 3324 424242 -216830 -245116 53870 150723 -160338
9876a99094C3373R947L094b07413J1895G5338a71063I7732c35059f0615f932F1144
$$ -199094 33373 43320 46414 -207413 -195518 75338 -171063 97732 -335059 -60615 -6932 61144
9863b18749f5065l6429j41459j38795D09508f7762k16623o3685a60927I1295Q2453
$$ -218749 -65065 -101494 -242953 -381748 409508 -67762 -284385 -348070 -160927 91295 173748
9852A73748a799p6292L7283N719A09402b2162k36820h4916D2243J2837P86O6360
$$ 173748 -1799 -78091 -40808 -35089 109402 -22162 -258982 -84916 42243 55080 55866 122226
9840A22226a08130B41348p598m230i438A64313b14644J3431d6550C68333a79398
$$ 122226 -108130 241348 233750 229520 -9438 164313 -214644 -201213 -46550 368333 -179398
9828h9907A04002D2260m88c14326N3035A01341a10285L1705j12555E4949g2384
$$ -89907 104002 42260 41772 -314326 -261291 101341 -110285 -78580 -191135 54949 -72384
9816c62051A66312c00599g5531j00768C5702A273M1396e3706p9815B3096J72216
$$ -362051 166312 -300599 -75531 -176299 35702 1273 42669 -53706 -133521 23096 195312
9805A95312E0956b32554j43935a49749j610q6601b2173A91413g335k12575g2406
$$ 195312 50956 -232554 -376489 -149749 -151359 -237960 -22173 191413 -7335 -219910 -72406
9793D8297a39469K2101A32743a63814G8603b86620b3402j19093N2748o0961g1965
$$ 48297 -139469 -117368 132743 -163814 78603 -286620 -23402 -142495 -89747 -150708 -71965
9781B00852E4118a50086b5100r3932j85297k0405A20805c8261j75068G749c28650
$$ 200852 54118 -150086 -25100 -119032 -304329 -324734 120805 -38261 -213329 7749 -328650
9769a10187j83423A05852f2688p1489m58845c6749I1077c5700j03008l3815M1859
$$ -110187 -293610 105852 -62688 -134177 -593022 -36749 91077 -35700 -138708 -172523 -130664
9758a30664B7243f0158A22451c91091a89919C71710c64437C11048a89060q7262
$$ -130664 27243 -60158 122451 -391091 -189919 371710 -364437 311048 -189060 -276322
9748b76322b363j55284J7237B18187h04q2731C47002d1431j91200c5563j18283
$$ -276322 -2363 -157647 -140410 218187 -804 -83535 347002 -41431 -232631 -35563 -153846
9737a53846J4036K2187d4935q224j26435o2949f0138o7028g411A8044J00414I576
$$ -153846 -139810 -117623 -44935 -53159 -179594 -242543 -60138 -127166 -7411 18044 118458 9576
9724b76160A02762P7342g1642A65702C121g2439n312o1331A14496b62974D2849
$$ -276160 102762 180104 -71642 165702 3121 -72439 -77751 -139082 114496 -262974 42849
9712G3236b3906A97633a42426o1775k28287F6842a35740A68948J15477a08503
$$ 73236 -23906 197633 -142426 -204201 -432488 66842 -135740 168948 284425 -108503
9701d00179c0256A49483b33207b575n6675B69100a2984A4434h0548j86698B20842
$$ -400179 -30256 149483 -233207 -2575 -59250 269100 -12984 14434 -80548 -267246 220842
9689D6192J35113E0375a59589j3897j14625C13464c28534O2120j44955A41041
$$ 46192 181305 50375 -159589 -173486 -288111 313464 -328534 -266414 -411369 141041
9678I4066b00116c155l1917o8060p7975H3081c5690k55448D167g1025J0176j07652
$$ 94066 -200116 -3155 -35072 -103132 -181107 83081 -35690 -291138 4167 -71025 -60849 -168501
9666a68501j78306B09488k8313d8009C66505h1458A41990d24353b1137F3730b03314
$$ -168501 -346807 209488 181175 -48009 366505 -81458 141990 -424353 -21137 63730 -203314
9654b8851j95974H2774a36631A2908i7735r4046b853j11221e1167q5825h453B9173
$$ -28851 -224825 82774 -136631 12908 -97735 -191781 -2853 -114074 -51167 -136992 -8453 29173
9641a29837C2723b55844I030b58821Q0344j65401d0547B2212L9507b06905d2279
$$ -129837 32723 -255844 9030 -258821 -178477 -343878 -40547 22212 61719 -206905 -42279
9629e8590j47156h9405k8652b1596F6129a51916p0408R8085p5196A19818g1724
$$ -58590 -205746 -89405 -118057 -21596 66129 -151916 -222324 -124239 -199435 119818 -71724
9617B09889d372A06961i7877F4852a9812C30532e45065a01383L394P274k4344
$$ 209889 -4372 106961 -97877 64852 -19812 330532 -545065 -101383 -97989 -90715 -115059
9606a15059o1600B03217r0992A8057J74394E3330a44521A38942i168k76255B53126
$$ -115059 -176659 203217 112225 18057 192451 53330 -144521 138942 -9168 -285423 253126
9594b2965F7434c0837j06099A86738B127a14855l2647M7391E433Q0661e622j27754
$$ -22965 67434 -30837 -136936 186738 2127 -114855 -147502 -100111 5433 86094 -5622 -133376
9582a33376l9310N2898a6378j71486I8296j925a09366A87456b77421A9739J09353
$$ -133376 -172686 -119788 -16378 -187864 98296 96371 -109366 187456 -277421 19739 129092
9571A29092C1132J04537a80752k03485e7463j29241F6001c29772J54069f8878
$$ 129092 31132 135669 -180752 -384237 -57463 -186704 66001 -329772 -175703 -68878
9560d2448p3544e6835p6397o0759h9490j12878K5624Q4598c8430k8285j65825
$$ -42448 -115992 -56835 -133232 -193991 -89490 -202368 -176744 -92146 -38430 -66715 -232540
9549b32540O3612O1970b1483k5957J8869j93432A96841a25560E0552k5056c05504
$$ -232540 -168928 -106958 -21483 -47440 -28571 -222003 196841 -125560 50552 25496 -305504
9537a24442k6976D5956a25529N5332k77050J8790p1971A9983g0425k9472A9806
$$ -124442 -151418 45956 -125529 -70197 -347247 -328457 -400428 19983 -70425 -99897 19806
9525e7003A29838O90a10197j14977B96290f3788j33205D04433B9708a59514C5358
$$ -57003 129838 130528 -110197 -225174 296290 -63788 -196993 404433 29708 -159514 35358
9513a16741A50595a14292C8602f1994B15505A04292J8723h3329k7502j33630l5837
$$ -116741 150595 -114292 38602 -61994 215505 104292 123015 -83329 -110831 -244461 -280298
9502b80298i8695A17992n3571B6098g9432N437j45178J03285j01734m962a07628
$$ -280298 -98695 117992 64421 26098 -79432 -73995 -219173 -115888 -217622 -222584 -107628
9490d9911j22121l8169Q8078M0989B0871O6540J14924A8258J65488N85b96048
$$ -49911 -172032 -210201 -122123 -81134 20871 87411 202335 18258 183746 184331 -296048
9478a21032A76526c8654F3837J16533c22157A81904c290C672h9667q4551P0022
$$ -121032 176526 -38654 63837 180370 -322157 181904 -3290 3672 -89667 -174218 -104196
9467a04196k0552A46946l7360a41660H0436b4192j27135a8763l9014j44210Q3736
$$ -104196 -124748 146946 109586 -141660 80436 -24192 -151327 -18763 -57777 -201987 -118251
9456a18251L6274j0759c6477n5257j08135D1868e8957j51126g5946c4002K715
$$ -118251 -81977 -92736 -36477 -91734 -199869 41868 -58957 -210083 -75946 -34002 -31287
9445c1287k14210B5813f3940J8572k00379r3273J38542B7567Q1012c01064c8192
$$ -31287 -245497 25813 -63940 -45368 -245747 -339020 -200478 27567 108579 -301064 -38192
9433g6176I7609i0474E6948J50196b64577g9714k05997B91708c773C3280d66668
$$ -76176 97609 -90474 56948 207144 -264577 -79714 -285711 291708 -3773 33280 -466668
9421a22068j10419o7339A27714c7661j64706q5544E68a57811f4499b8340l6427
$$ -122068 -232487 -299826 127714 -37661 -202367 -287911 568 -157811 -64499 -28340 -64767
9410f4767l88709E2013q643c0797A16028a98621e9914B3374K9969p973J19954
$$ -64767 -453476 52013 43370 -30797 116028 -198621 -59914 23374 53343 45370 165324
9399A65324a95884A22505a18752j10649j01001f4125B1758J97255a02469q8763
$$ 165324 -195884 122505 -118752 -229401 -330402 -64125 21758 219013 -102469 -191232
9389a91232P6089d8526C7286a06681c8507a6538A68302h0857d322E1392K73910
$$ -191232 -115143 -48526 37286 -106681 -38507 -16538 168302 -80857 -4322 51392 325302
9378C25302F96a71366n9535B5260d2880j59256A59375a80430J4278A74194g8466
$$ 325302 696 -171366 -230901 25260 -42880 -202136 159375 -180430 -166152 174194 -78466
9366A86805c4158n5719j75478J11223B16350H170b31303P5364a666l75942a12188
$$ 186805 -34158 -89877 -265355 -154132 216350 8170 -231303 -155939 -1666 -377608 -112188
9354b43107A22578i3619j74120B22056a02471B60922a82645q5325h8787c7235
$$ -243107 122578 -93619 -267739 222056 -102471 260922 -182645 -267970 -88787 -37235
9343a46066l5142c0333j97689J13616k45719a28707a0299j28967A54904a35235
$$ -146066 -181208 -30333 -228022 -114406 -360125 -128707 -10299 -139266 154904 -135235
9332A02824a41147m7591j43510a16305B64694L6290j34638a8776k83474B04K10875
$$ 102824 -141147 -188738 -332248 -116305 264694 300984 166346 -18776 -302250 204 211079
9321B11079m5317d13424P3814r546B2772O7018B3168I624d907k89299A4247a24122
$$ 211079 165762 -413424 -339610 -349156 22772 89790 23168 9624 -4907 -294206 14247 -124122
9308a74667H293L31879a97434f5375j24912N9029H362a99911j53074g3585p3261
$$ -174667 8293 340172 -197434 -65375 -190287 -131258 8362 -199911 -352985 -73585 -146846
9297a46846F8401P6906a3801C344b12243B6706a30950K8701k3999G1037m504a01861
$$ -146846 68401 145307 -13801 3344 -212243 26706 -130950 -102249 -126248 71037 66533 -101861
9284I4525a14677b7283E7868R5292A3222a10331A17873a07979k12588a56248L5282
$$ 94525 -114677 -27283 57868 153160 13222 -110331 117873 -107979 -320567 -156248 -120966
9273a20966c5179k134k02102J9410A94467a45749f7088k50366J21286h6913I3989
$$ -120966 -35179 -37313 -239415 -220005 194467 -145749 -67088 -317454 -196168 -86913 93989
9261c0756j92227H0413a37398k9205b9098l33915c6877a3464A12091c41441M7507
$$ -30756 -222983 80413 -137398 -166603 -29098 -363013 -36877 -13464 112091 -341441 -293934
9250b93934J1133a2503j1126k1556o9070j95478d7741A81737d6923k186k48794
$$ -293934 -282801 -12503 -23629 -45185 -114255 -309733 -47741 181737 -46923 -49109 -297903
9239b97903A7410L8702k867a55678m0228A408L37261e2928A71962P734D6869J78670
$$ -297903 17410 56112 53245 -155678 -195906 1408 338669 -52928 171962 179696 46869 225539
9227B25539J194r4852a16333j82630i0944A62441a8441A43015D3761e215B3165
$$ 225539 226733 131881 -116333 -298963 -90944 162441 -18441 143015 43761 -5215 23165
9215h899B00688b91004I9921e6097k90033B43385C8445e9343k8700q1662j02613
$$ -8899 200688 -291004 99921 -56097 -346130 243385 38445 -59343 -88043 -169705 -272318
9204b72318a15004B62638b04753R4548A22107e2221n3507j47587P8261A20137
$$ -272318 -115004 262638 -204753 -110205 122107 -52221 -105728 -253315 -175054 120137
9193a22161N7585B06760h9574C79308b20644h271j00080L1543k10473A55403e3452
$$ -122161 -64576 206760 -89574 379308 -220644 -8271 -108351 -76808 -287281 155403 -53452
9181f6099l00441h563k11826l8942J29307B0529J17559m4906f9216B52587b38211
$$ -66099 -366540 -8563 -220389 -259331 -130024 20529 138088 93182 -69216 252587 -238211
9169B90412a28226B24546a23167e5172J6818r6537A29454d4037k72065I2043a0395
$$ 290412 -128226 224546 -123167 -55172 -38354 -134891 129454 -44037 -316102 92043 -10395
9157a39842j83814H2409a42033J7306L7837q4285r6166A30646a60940l7997B3720
$$ -139842 -323656 82409 -142033 -124727 -86890 -171175 -267341 130646 -160940 -198937 23720
9145g1814j45202M0880f0380k32357A15506a17309J2127j33875B70235n8405a09826
$$ -71814 -217016 -176136 -60380 -292737 115506 -117309 -105182 -239057 270235 211830 -109826
9133c64774B84462D6283P7046C7549b27526i4365p495b3885m8992D4806L822d9932
$$ -364774 284462 46283 123329 37549 -227526 -94365 -101860 -23885 -72877 44806 48628 -49932
9120h5367q6266H8407K32116b58784B66918c39170J22351C71d7350k26149r6800
$$ -85367 -171633 88407 320523 -258784 266918 -339170 -216819 371 -47350 -273499 -370299
9109c70299J75589E9998a71008J6041L080A85169a59244l0119A43365M3363e6407
$$ -370299 -194710 59998 -171008 -154967 -151887 185169 -159244 -189363 143365 186728 -56407
9097a07563B13216b26587e001B60139d06098B26838b12572M3683j50429a26733
$$ -107563 213216 -226587 -5001 260139 -406098 226838 -212572 -168889 -319318 -126733
9086a05700l07802i365j68947p9470M0925j3616D8379a44720A89864B5250a92458
$$ -105700 -413502 -9365 -178312 -257782 -216857 -230473 48379 -144720 189864 25250 -192458
9074A47318G271a1927l06403g7319m9607D0248a4475k2055I046K05080a30309
$$ 147318 7271 -11927 -318330 -77319 -126926 40248 -14475 -36530 9046 214126 -130309
9062i1294a2780j10228E522J32006c93443J64191a11330a5989j70745Q8075m0447
$$ -91294 -12780 -123008 5522 137528 -393443 -229252 -111330 -15989 -186734 -98659 -139106
9051a39106A8545a43419B00908J412c3843j22265j7215c4907o4702G7095d1164
$$ -139106 18545 -143419 200908 202320 -33843 -156108 -173323 -34907 -99609 77095 -41164
9039i2910q6547M0494B46255b65829K8701A08984c4857l28289d8875j52339I0043
$$ -92910 -179457 -138963 246255 -265829 -237128 108984 -34857 -363146 -48875 -201214 90043
9027B30731D174L44369i2048P911l75968A99086a02814A20954k106e4745m51154
$$ 230731 4174 348543 -92048 -84137 -460105 199086 -102814 120954 118848 -54745 -505899
9016e05899b0263k24929A87744E68c95934G8426C5369J86426q0447b2811o8966
$$ -505899 -20263 -245192 187744 568 -395934 78426 35369 221795 141348 -22811 -91777
9005i1777D4833H838b89323M6856R9506f6401k18862H1228J20562a31406k96500
$$ -91777 44833 8838 -289323 -242467 -142961 -66401 -285263 81228 201790 -131406 -427906
8994d27906K00520G2119J4890a57893E2675b37171A82246a80230C52439g1413
$$ -427906 -227386 72119 87009 -157893 52675 -237171 182246 -180230 352439 -71413
8983A11168b64531A6718e8878C71819A12084a29343d4140l05340G5945b1685p3634
$$ 111168 -264531 16718 -58878 371819 112084 -129343 -44140 -349480 75945 -21685 -95319
8972i5319A23732F50c40163A54439e3374A690b52924A49844j6586a08231A82636
$$ -95319 123732 650 -340163 154439 -53374 1690 -252924 149844 133258 -108231 182636
8960i7985J7862A49370b14040j95366c2702D3119J33186G0629c57527J78068j45856
$$ -97985 -80123 149370 -214040 -409406 -32702 43119 176305 70629 -357527 -179459 -325315
8949c25315K9183A66808b61290B36487H5893O3501K7528b28932E1879a53906p7322
$$ -325315 -296132 166808 -261290 236487 85893 149394 176922 -228932 51879 -153906 -231228
8938b31228G483a33771A90572k6555o3877O1896a0078C10689A8064P6371J32810
$$ -231228 7483 -133771 190572 164017 100140 162036 -10078 310689 18064 94435 227245
8927B27245J52313o0484N00926J173218L859406O784361l012383B511832F89032
$$ 227245 379558 319074 820000 1993218 5852624 12636985 9624602 2511832 689032
8917D02448A76646o8212e555j06910A43292J109b01308A13190Q7178l6158O5085
$$ 402448 176646 108434 -5555 -112465 143292 144401 -201308 113190 200368 164210 229295
8906B29295A9087P4877a32771F3909d5729A5956J38648a57108A10144b22862C03218
$$ 229295 19087 93964 -132771 63909 -45729 15956 154604 -157108 110144 -222862 303218
8894f9679c949j21554b5179q734k0418D1738l192O4657a60996m0920O2961H437
$$ -69679 -3949 -125503 -25179 -33913 -54331 41738 38546 103203 -160996 -201916 -138955 8437
8881b11655c6645H5046L3857d2225A11808i7967o4939B99582d4160j42127L9101
$$ -211655 -36645 85046 118903 -42225 111808 -97967 -162906 299582 -44160 -186287 -147186
8870a47186c7350A24003C2929i5745l28793F0875K02038q1953c47714A96266d4786
$$ -147186 -37350 124003 32929 -95745 -424538 60875 262913 180960 -347714 196266 -44786
$$ [...]
##END NTUPLES=NMR SPECTRUM
##END=
