##TITLE=AC1569_ROEFFECT0021_8271072_0DjOt5wei0
##JCAMPDX= 6.0         $$ Bruker NMR JCAMP-DX V2.0
##DATA TYPE= NMR SPECTRUM
##DATA CLASS= NTUPLES
##ORIGIN= BRUKER
##OWNER= Administrator
$$ 1.72 TOPSPIN		Version 2.1
$$ 2013-10-18 17:50:53.477 -0700  Administrator@X
$$ Compression mode = diff/dup
##.OBSERVE FREQUENCY= 400.02188249412
##.OBSERVE NUCLEUS= ^1H
##.ACQUISITION MODE= SIMULTANEOUS (DQD)
##.ACQUISITION SCHEME= undefined
##.AVERAGES= 64
##.DIGITISER RES= 22
##SPECTROMETER/DATA SYSTEM= spect
##.PULSE SEQUENCE= noesygpps1d.comp
##.SOLVENT NAME= COFFEE_meoh
##.SHIFT REFERENCE= INTERNAL, COFFEE_meoh, 1, 14.96074
##AUDIT TRAIL= $$ (NUMBER, WHEN, WHO, WHERE, PROCESS, VERSION, WHAT)
$$ ##TITLE= Audit trail, TOPSPIN		Version 2.1
$$ ##JCAMPDX= 5.01
$$ ##ORIGIN= Bruker BioSpin GmbH
$$ ##OWNER= Administrator
$$ $$ E:\/data/COFFEE/nmr/AC1569_ROEFFECT0021_8271072_0DjOt5wei0/12/pdata/1/auditp.txt
$$ ##AUDIT TRAIL=  $$ (NUMBER, WHEN, WHO, WHERE, PROCESS, VERSION, WHAT)
(   1,<2013-10-18 17:50:48.289 -0700>,<Administrator>,<X>,<go>,<TOPSPIN 2.1>,
      <created by zg
	started at 2013-10-18 17:39:18.867 -0700,
	POWCHK enabled, PULCHK disabled,
       configuration hash MD5:
       C8 4E 4E 5D D3 5C D8 9E 9F 52 82 E0 59 8A DE 15
       data hash MD5: 64K
       7E F6 9F 62 F5 5D A8 0A 8D 7B 9C E3 43 79 8C 81>)
(   2,<2013-10-18 17:50:51.414 -0700>,<Administrator>,<X>,<proc1d>,<TOPSPIN 2.1>,
      <Start of raw data processing
       efp LB = 0.3 FT_mod = 6 PKNL = 1 PHC0 = 0 PHC1 = 0 SI = 128K 
       data hash MD5: 128K
       B8 71 58 CD C8 3F 7D C4 AD 7A 6D E9 82 DA 28 1E>)
(   3,<2013-10-18 17:50:52.430 -0700>,<Administrator>,<X>,<proc1d>,<TOPSPIN 2.1>,
      <pk PHC0 = -82.65564 PHC1 = 0 
       data hash MD5: 128K
       40 C1 17 B2 B6 70 7D AE 3A 4C 0A 74 40 07 BF 3A>)
(   4,<2013-10-18 17:50:52.883 -0700>,<Administrator>,<X>,<proc1d>,<TOPSPIN 2.1>,
      <abs ABSG = 1 
       data hash MD5: 128K
       DD CB 2B 2F 5F E0 16 DC F7 BC E2 B8 47 93 DA 58>)
(   5,<2013-10-18 17:50:53.008 -0700>,<Administrator>,<X>,<proc1d>,<TOPSPIN 2.1>,
      <abs ABSG = 2 
       data hash MD5: 128K
       82 C7 D1 CB B4 65 D9 DA 64 98 07 C7 A1 00 8A 6B>)
(   6,<2013-10-18 17:50:53.070 -0700>,<Administrator>,<X>,<proc1d>,<TOPSPIN 2.1>,
      <abs ABSG = 3 
       data hash MD5: 128K
       69 9E 1B F3 D8 82 D0 E5 A6 0B B7 2C F5 79 03 D5>)
(   7,<2013-10-18 17:50:53.180 -0700>,<Administrator>,<X>,<proc1d>,<TOPSPIN 2.1>,
      <abs ABSG = 4 
       data hash MD5: 128K
       9F 40 ED 0A 8D 87 7D 23 03 6B 3C 74 6A 2B 3B 8D>)
(   8,<2013-10-18 17:50:53.258 -0700>,<Administrator>,<X>,<proc1d>,<TOPSPIN 2.1>,
      <abs ABSG = 5 
       data hash MD5: 128K
       CC 9A 11 B5 25 10 2E 4A 80 EE C7 7D E6 5C D9 EC>)
$$ ##END=
$$ 
$$ $$ hash MD5
$$ $$ D0 A1 37 F4 C2 BE AB 88 66 4E E2 93 73 88 5A 7C
##$RELAX= 
##$RELAX= 
##$RELAX= 
##$RELAX= 
##$RELAX= 
##$RELAX= 
##$RELAX= 
##$RELAX= 
$$ Bruker specific parameters
$$ --------------------------
##$DU= <E:\>
##$EXPNO= 12
$$ [...]
150 150 150 150 150 150 150 150
##$TP07= 0
##$TPNAME0= <>
##$TPNAME1= <>
##$TPNAME2= <>
##$TPNAME3= <>
##$TPNAME4= <>
##$TPNAME5= <>
##$TPNAME6= <>
##$TPNAME7= <>
##$TPOAL= (0..7)
0.5 0.5 0.5 0.5 0.5 0.5 0.5 0.5
##$TPOFFS= (0..7)
0 0 0 0 0 0 0 0
##$TUNHIN= 0
##$TUNHOUT= 0
##$TUNXOUT= 0
##$USERA1= <user>
##$USERA2= <user>
##$USERA3= <user>
##$USERA4= <user>
##$USERA5= <user>
##$V9= 5
##$VALIST= <valist>
##$VCLIST= <CCCCCCCCCCCCCCC>
##$VD= 0
##$VDLIST= <DDDDDDDDDDDDDDD>
##$VPLIST= <PPPPPPPPPPPPPPP>
##$VTLIST= <TTTTTTTTTTTTTTT>
##$WBST= 1024
##$WBSW= 4
##$XGAIN= (0..3)
0 0 0 0
##$XL= 0
##$YL= 0
##$YMAX_a= 6497967
##$YMIN_a= -13302404
##$ZGOPTNS= <>
##$ZL1= 120
##$ZL2= 120
##$ZL3= 120
##$ZL4= 120
##$ABSF1= 14.96074
##$ABSF2= -5.597442
##$ABSG= 5
##$ABSL= 3
##$ALPHA= 0
##$AQORDER= 0
##$ASSFAC= 0
##$ASSFACI= 0
##$ASSFACX= 0
##$ASSWID= 0
##$AUNMP= <proc_prof1d_extract.lims>
##$AXLEFT= 0
##$AXNAME= <>
##$AXNUC= <1H>
##$AXRIGHT= 0
##$AXTYPE= 0
##$AXUNIT= <>
##$AZFE= 0.1
##$AZFW= 0.1
##$BCFW= 0
##$BC_mod= 0
##$BYTORDP= 0
##$COROFFS= 0
##$CY= 15
##$DATMOD= 1
##$DC= 0
##$DFILT= <>
##$DTYPP= 0
##$F1P= 0
##$F2P= 0
##$FCOR= 0.5
##$FTSIZE= 131072
##$FT_mod= 6
##$GAMMA= 0
##$GB= 0
##$INTBC= 1
##$INTSCL= 1
##$ISEN= 128
##$LB= 0.3
##$LEV0= 0
##$LPBIN= 0
##$MAXI= 10000
##$MC2= 0
##$MEAN= 0
##$ME_mod= 0
##$MI= 0
##$NCOEF= 0
##$NC_proc= -2
##$NLEV= 6
##$NOISF1= 0
##$NOISF2= 0
##$NSP= 0
##$NTH_PI= 0
##$NZP= 0
##$OFFSET= 14.96074
##$PC= 1
##$PHC0= -82.65564
##$PHC1= 0
##$PH_mod= 1
##$PKNL= yes
##$PPARMOD= 0
##$PPDIAG= 0
##$PPIPTYP= 0
##$PPMPNUM= 2147483647
##$PPRESOL= 1
##$PSCAL= 4
##$PSIGN= 0
##$PYNMP= <proc.py>
##$REVERSE= no
##$SF= 400.02000974163
##$SI= 131072
##$SIGF1= 0
##$SIGF2= 0
##$SINO= 400
##$SIOLD= 131072
##$SPECTYP= <>
##$SREGLST= <1H.CDCl3>
##$SSB= 0
##$STSI= 131072
##$STSR= 0
##$SW_p= 8223.68421052631
##$SYMM= 0
##$S_DEV= 0
##$TDeff= 65536
##$TDoff= 0
##$TI= <>
##$TILT= no
##$TM1= 0
##$TM2= 0
##$TOPLEV= 0
##$USERP1= <user>
##$USERP2= <user>
##$USERP3= <user>
##$USERP4= <user>
##$USERP5= <user>
##$WDW= 1
##$XDIM= 131072
##$YMAX_p= 399876020
##$YMIN_p= -11564
##$CURPLOT= <Network HP LaserJet P1505>
##$CURPRIN= <$Network HP LaserJet P1505>
##$DFORMAT= <normdp>
##$LAYOUT= <+/1D_H.xwp>
##$LFORMAT= <normlp>
##$PFORMAT= <normpl>
##$SURQMSG= 1
$$ End of Bruker specific parameters
$$ ---------------------------------
##NTUPLES= NMR SPECTRUM
##VAR_NAME=  FREQUENCY,     SPECTRUM/REAL,   SPECTRUM/IMAG
##SYMBOL=    X,             R,               I
##VAR_TYPE=  INDEPENDENT,   DEPENDENT,       DEPENDENT
##VAR_FORM=  AFFN,          ASDF,            ASDF
##VAR_DIM=   131072,        131072,          131072
##UNITS=     HZ,            ARBITRARY UNITS, ARBITRARY UNITS
##FACTOR=    0.0627417313425164, 1,          1
##FIRST=     8223.62146879497, 258,          -65142
##LAST=      0,             1729,            -66311
##MIN=       0,             -11564,          0
##MAX=       8223.62146879497, 399876020,    0
$$ Real data points
##PAGE= N=1
##DATA TABLE= (X++(R..R)), XYDATA
$$ [...]
65104 327485 315052 302856 291345 280617 270381 260477 251148 242718 235282 228780 223121 218189 213945
65091 213945 210511 207837 205337 202417 199462 197669 197506 197930 197605 196468 195458 195098 195115 195279 195758 196535
65075 196535 197174 197404 197449 197596 197885 198362 199131 199933 200162 199630 198937 198798 199303 200072 200774 201189 201142 200799 200776 201617
65055 201617 203311 205493 207766 209510 209862 208517 206314 204489 203414 202577 201565 200427 199134 197457 195593
65040 195593 194214 193577 193068 192070 190876 190303 190613 191282 191664 191525 190922 189849 188083 185353 181789 178173
65024 178173 175432 173733 172372 170761 169155 168094 167505 166873 166134 165849 166517 168080 170116 172123 173709
65009 173709 174940 176477 178934 182052 185041 187808 191294 196354 202734 209446 215702 221172 225767 229602
64995 229602 232923 235693 237486 238112 238024 237702 237024 235854 234970 235659 238330 242189 246368 250781 255647 260703
64979 260703 265288 268900 271390 272832 273435 273345 272404 270260 266851 262514 257507 251815 245600 239463 233935
64964 233935 228990 224352 220032 216191 212750 209593 206991 205360 204601 204141 203656 203402 203702 204431 205113 205332
64948 205332 204951 204149 203342 202866 202549 201741 199973 197521 195225 193718 192924 192379 191962 192124 193237 194893 196238
64931 196238 197039 198044 199942 202325 204115 204811 204798 204472 203677 202220 200455 199003 198179 197977 198362 199164 199875
64914 199875 199990 199637 199485 199920 200544 200694 200325 200121 200778 202357 204463 206876 209810 213585 218299 223940
64898 223940 230548 238041 245957 253700 261163 268965 277911 288213 299211 309840 319448 328318 337426
64885 337426 347544 358546 369570 379779 388820 396636 403067 407769 410391 410741 408841 404823 398769
64872 398769 390695 380886 370191 359846 350873 343714 338316 334347 331306 328678 326169 323679 320998 317651
64858 317651 313147 307309 300376 292891 285486 278531 271884 265035 257580 249506 241178 233276 226615 221625
64844 221625 217911 214667 211641 209319 208018 207187 205933 203945 201600 199398 197669 196586 196027 195527 194745
64829 194745 193944 193661 194013 194720 195719 197226 199147 200981 202476 203964 205757 207667 209495 211665 214817
64814 214817 218901 223145 227074 231161 236262 242649 249863 257430 265326 273634 281979 289674 296434 302651
64800 302651 308718 314245 318192 319793 319178 317029 313816 309530 304099 297911 291797 286460 281972 277974
64786 277974 274311 271262 269049 267439 266095 265116 264845 265230 265796 266296 267041 268415 270366 272602 275034 277792
64770 277792 281020 284918 289860 296146 303644 311884 320518 329537 339059 349083 359409 369598 379004
64757 379004 387099 393986 400465 407408 415054 422972 430700 438290 446191 454699 463608 472292 479990 486013
64743 486013 489923 491694 491635 489950 486264 479686 469475 455783 439882 423720 409071 396817 386793
64730 386793 378248 370512 363373 357028 351777 347631 344191 340998 338089 336015 335161 335275 335902 337136 339556
64715 339556 343447 348483 354252 360767 368307 376967 386479 396171 404956 411653 415651 417179 416735 414337
64701 414337 409507 401861 391561 379290 365971 352444 339259 326721 315106 304659 295409 287186
64689 287186 279992 274058 269460 265887 263038 260925 259513 258370 257091 255943 255580 256214 257516 259369 262200
64674 262200 266390 271794 278078 285180 293116 301568 310066 318453 326799 334863 341948 347422 351130 353147
64660 353147 353364 351617 348231 344041 339670 334965 329452 323224 317054 311648 307215 303868 301915 301382 301620
64645 301620 301941 302489 303966 306561 309719 313056 316991 322227 328966 336960 346074 356526 368651 382577
64631 382577 398014 414284 430705 446923 462623 476905 488418 496306 500644 501640 498812 491504 480049
64618 480049 465878 450404 434219 417445 400452 383913 368383 354154 341516 330855 322317 315497
64606 315497 309732 304774 300891 298151 295880 293293 290501 288324 286989 285678 283733 281689 280510 280166
64592 280166 279806 279251 279502 281509 285067 289262 293549 297981 302848 308649 316230 326279 338596 352220
64578 352220 366484 381636 398225 416131 434521 452601 470018 486454 501178 513331 522496 528762
64566 528762 532286 533086 531155 526421 518535 507129 492499 475743 458023 439971 422033 404945 389382
64553 389382 375358 362430 350411 339442 329540 320616 312946 307046 302999 300390 298950 298739 299589 300994
64539 300994 302824 305519 309171 312914 315688 317148 317306 315757 312058 306716 301006 295766 290882 285999
64525 285999 281167 276677 272770 269714 267765 266810 266351 265952 265455 264716 263583 262347 261829 262667 264683 267162
64509 267162 269517 271507 273091 274444 275983 278075 280731 283760 287231 291588 297321 304608 313189 322498
64495 322498 331940 341130 349852 357815 364637 370100 374223 377035 378537 379045 379296 379855 380531 380723 380360 380228
64479 380228 381238 383524 386364 388833 390373 390693 389412 386167 381230 375711 370735 366484 362423 358411
64465 358411 355097 353096 352331 352484 353568 355541 357797 359676 361324 363382 365869 367957 368917 368698 367424
64450 367424 364892 360942 356047 351220 347462 345334 344805 345381 346615 348552 351514 355532 360443 366496 374268
64435 374268 383702 393853 404093 415216 428793 445621 465310 487319 512017 540722 575080 616514
64423 616514 665965 724017 791291 868728 957479 1058498 1171994 1296800 1430181 1568653
64413 1568653 1709249 1849619 1986876 2117124 2236738 2343639 2436550 2513438 2571590 2609226
64403 2609226 2626109 2622474 2598205 2553493 2489605 2408470 2311911 2201661 2079754 1948460 1810212
64392 1810212 1668194 1526751 1390581 1263241 1146529 1041081 947109 864469 792424 729726
64382 729726 675107 627725 587120 552783 523852 499419 479006 462554 449979 440889 434621 430167
64370 430167 426113 421201 415146 408613 402165 395597 388433 380602 372268 363377 353853 344049 334591 325888
64356 325888 318175 311880 307478 304970 303807 303396 303464 304072 305547 308319 312486 317509 322589 327260 331343
64341 331343 334455 336028 335877 334414 332151 329225 325465 320688 314864 308280 301608 295627 290708 286730
64327 286730 283505 281118 279825 279742 280701 282223 283705 284871 286057 287851 290411 293357 296359 299548 303233
64312 303233 307448 311883 316095 319678 322360 324059 324764 324292 322289 318463 312769 305467 297163 288741 280976
64297 280976 274166 268281 263345 259367 255947 252350 248103 243401 238938 235550 233796 233446 233442 232924 232390 233268
64281 233268 236136 240000 243673 247274 251817 257739 264538 271640 278956 286520 294098 301366 308146 314337
64267 314337 319793 324310 327624 329530 330197 330221 330087 329673 328637 327231 326385 326880 328722 331317 333873 335461
64251 335461 335093 332148 326769 319649 311420 302394 292946 283901 276212 270140 264974 259835 254674 250189
64237 250189 246840 244390 242500 241211 240536 240024 239247 238487 238452 239470 241349 243813 246560 249004 250574 251341
64221 251341 251882 252504 253118 253820 254905 256060 256281 255047 253084 251411 250038 248203 245615 242755 239989
64206 239989 237082 233807 230529 227870 226075 224989 224457 224483 225080 226146 227512 229115 231184 234247 238758
64191 238758 244606 251144 257844 264792 272434 281062 290807 301915 314580 328401 342357 355433 367005
64178 367005 376447 382849 385529 384669 381054 375286 367558 358111 347486 336331 325296 315064 306056
64165 306056 298072 290626 283647 277400 271747 266108 260363 255072 250493 246105 241662 238086 236477 236664
64151 236664 237528 238506 239951 242129 244746 247540 250656 254321 258752 264340 271144 278120 283730 287583 290706
64136 290706 293830 296165 296439 294552 291595 288627 285999 283527 280787 277459 273786 270543 268286 267008
64122 267008 266716 267723 269911 272382 274630 277555 282351 288665 294914 300406 306144 313312 321880 331108
64108 331108 340629 350355 359753 367909 374257 378899 382342 385138 387672 390037 392254 394741 398414 404060
64094 404060 411639 420253 428743 436284 442615 447816 451861 454396 455071 454012 451688 448309 443663 437545
64080 437545 430007 421093 410741 399269 387630 376804 367068 358126 349813 342353 335959 330536 325823
64067 325823 321650 318079 315487 314468 315272 317296 319410 320973 322344 324204 326639 329177 331529 333882
64053 333882 336402 338865 341022 343104 345730 349427 354389 360537 367539 374960 382645 390821 399527 408137
64039 408137 415927 422980 429910 436685 442447 446717 449990 452598 453670 452022 447766 442295 436856 431814
64025 431814 427139 422848 418935 415584 413432 412890 413196 412981 411939 411035 410785 410316 408685 406197 403542 400339
64009 400339 395644 389568 383306 377621 372222 366668 361065 355736 350982 347341 345268 344254 342988 340880
63995 340880 338812 337879 337908 337904 337515 337271 337578 338327 339594 341966 345799 350627 355632 360390 364807 368706 372010
63978 372010 375217 379170 384196 389781 395244 400483 405867 411627 417629 423677 429761 435982 442465 449465
63964 449465 457362 466398 476510 487557 499645 513076 527987 544263 561894 581308 603175 627939
63952 627939 655747 687013 722953 765345 815674 874554 942047 1018429 1104606 1201900 1311575
63941 1311575 1434457 1570775 1720179 1881890 2054772 2237179 2426859 2621163 2817392
63932 2817392 3012733 3203829 3386534 3556277 3708688 3840019 3947229 4028014 4080902 4105306
63922 4105306 4101309 4069153 4008908 3920968 3807201 3671454 3518490 3352374 3176171 2992990
63912 2992990 2806575 2620501 2437348 2259205 2088584 1928093 1779282 1642476 1517853
63903 1517853 1406069 1307526 1221476 1146380 1081063 1025142 978389 939924 908107 881073 857419
63892 857419 836537 818391 802909 789529 777346 765679 754474 744173 735202 727590 721064 715548
63880 715548 711552 709957 711360 715595 721947 729808 739240 751041 766368 786140 810561 839034 870667
63867 870667 905043 942656 984548 1031369 1082743 1137537 1194655 1253499 1313752 1375012 1436756
63856 1436756 1498408 1559141 1617669 1672480 1722417 1766933 1805757 1838353 1863758 1880964 1889527
63845 1889527 1889825 1882627 1868384 1847069 1818754 1784101 1744066 1699277 1649989 1596507 1539326 1478908
63833 1478908 1415798 1351073 1286263 1222515 1160064 1098757 1038907 981280 926406 874273 824792
63822 824792 778323 735553 696842 661785 629480 599327 571529 546644 524697 504990 486889
63811 486889 470404 455769 442776 430956 420238 410905 402903 395657 388655 381798 375060 368268 361532
63798 361532 355503 350695 346697 342449 337375 331904 326794 322188 317577 312622 307795 303986 301475 299502
63784 299502 297121 294306 291859 290265 289151 288004 286850 285799 284409 282119 279136 276287 274126 272722
63770 272722 272140 272372 272707 272046 270218 268373 267654 267950 268392 268510 268333 267785 266725 265440 264423 263693 262902
63753 262902 262039 261452 261180 260813 260131 259393 258865 258538 258452 258854 259788 260910 261973 263192 264858 266850 268785
63736 268785 270456 271948 273499 275381 277737 280451 283323 286388 289771 293278 296565 299747 303336 307414
63722 307414 311424 315078 318868 323247 327814 331921 335677 339624 343611 346758 348540 349218 349176 348417 346913
63707 346913 344926 342706 340256 337610 335040 332797 330864 329107 327462 325888 324433 323446 323482 324815 327181
63692 327181 330048 332901 335299 337043 338471 340264 342763 345661 348480 351053 353389 355394 357066 358721
63678 358721 360640 362628 364228 365382 366560 368231 370421 372850 375293 377657 379826 381601 382882 383840
63664 383840 384783 385765 386395 386169 384989 383235 381335 379400 377300 374876 372036 368758 365096 361114 356819
63649 356819 352324 348087 344767 342670 341440 340423 339304 338296 337853 338279 339654 342063 345820 351200 357815
63634 357815 364446 369966 374442 378970 384282 389922 395048 399654 404527 410181 416302 422303 428007 433608
63620 433608 439239 444966 451211 458881 468795 480955 494577 508929 524003 540308 558283 578269
63608 578269 600789 626293 654460 684180 714456 744989 775654 805667 833610 858152 878551
63597 878551 894615 906429 914011 917157 915785 910627 903307 895424 887578 879372 870077 859101 846137
63584 846137 831254 814697 796312 775406 751613 725799 699704 674772 651646 630582 611736
63573 611736 594976 580000 566873 556053 547747 541627 537355 534936 534226 534524 535140 536172 538333 542089
63559 542089 547334 553759 561058 568817 576736 585195 595198 607427 621698 637779 656478 679318 707111
63546 707111 739459 775854 816544 861716 910150 959378 1006965 1050977 1089271 1119337 1139328
63535 1139328 1148839 1148581 1140039 1125840 1109528 1093920 1079762 1066486 1053764 1041479 1028621 1013450
63523 1013450 994999 973524 949292 921863 891090 858051 824296 790608 757118 724253 692913
63512 692913 663810 637176 613041 591349 571786 553868 537283 521982 507996 495394 484252
63501 484252 474328 464847 454997 444736 434891 426398 419601 414233 409790 405776 401791 397624 393345 389296
63487 389296 385958 383714 382615 382363 382607 383238 384421 386365 389127 392566 396510 400985 406194 412115 418177
63472 418177 423550 427802 431065 433592 435421 436512 436845 436270 434675 432583 431120 430883 431145 430762 429749
63457 429749 429241 429894 431037 431755 432143 432848 433739 433871 432885 431794 432018 433984 437016 440404 444152 448743
63441 448743 454618 462068 471328 482539 495826 511662 530990 554728 583190 616116 652972 692792
63429 692792 733839 773915 811076 843694 869889 887731 896528 897686 893936 887993 882152 878599 879210
63416 879210 885017 896346 913495 936669 965045 996429 1028240 1058663 1086608 1110907 1130111 1143190
63404 1143190 1150152 1151836 1149273 1143408 1135241 1125850 1115933 1105331 1093122 1078194 1059734 1037420 1011443
63391 1011443 982413 951015 917678 882754 846974 811431 777042 744286 713478 684882 658460
63380 658460 634042 611986 593172 577871 565142 553967 544593 538058 534635 533553 534146 536358 540023
63367 540023 544617 550212 557955 569005 583339 600049 618508 638871 661742 687732 717123 749678
63355 749678 784944 822868 863642 906639 950025 991896 1031369 1068012 1100646 1127594 1148021
63344 1148021 1162264 1170854 1174053 1172575 1167990 1161762 1154201 1144776 1133242 1120017 1105510 1089396 1070666
63331 1070666 1048329 1022102 992525 960515 926944 892739 859158 827538 798755 773213 751407
63320 751407 734099 721744 714005 709973 708583 708514 707894 704505 696409 682439 662462 637537 609752
63307 609752 581538 554811 530572 509033 489979 473099 458208 445183 433780 423765 415256 408624
63295 408624 403807 400014 396431 392955 389882 387105 384165 380998 378008 375295 372374 368931 365347 362117
63281 362117 359109 355827 352152 348376 344687 341153 338196 336605 336787 338269 340097 341659 343024 344619
63267 344619 346678 349009 351259 353329 355439 357766 360190 362503 364679 366805 368982 371535 375114 380160
63253 380160 386333 392803 399110 405354 411606 417664 423586 429956 437266 445336 453715 462408 471819 482096
63239 482096 493009 504550 517328 532209 549612 569163 589946 611107 632395 654186 676987
63228 676987 700915 725619 750572 775398 800107 825050 850496 876214 901663 926698 951806
63217 951806 977516 1003864 1030568 1057319 1083582 1108433 1131031 1151000 1167919 1180668 1187790 1188390
63205 1188390 1182248 1169300 1149721 1124500 1095225 1063174 1029171 994400 960463 928289 897641
63194 897641 868196 840580 815878 794704 777402 764630 756868 753536 753408 755914 761310 769581 779946
63181 779946 791765 805327 821308 839805 860225 881811 903907 925905 947298 967807 987290
63170 987290 1005532 1022294 1037557 1051590 1064663 1076538 1086136 1091908 1092813 1088924 1080869 1068832 1052506
63157 1052506 1032007 1008213 981940 953210 921740 887877 852663 817238 782623 749881 719900
63146 719900 692849 668294 645922 625840 608124 592569 579064 567744 558455 550457 543130 536669
63134 536669 531617 527861 524661 521612 518971 516932 515189 513510 512248 511810 511975 512188 512332 512745 513657 515119
63118 515119 517399 520827 525128 529396 533015 536269 539832 543915 548138 552022 555371 558359 561407 564761
63104 564761 568087 570704 572422 573909 575933 578492 580989 583121 585221 587841 591363 595977 601648 607966
63090 607966 614266 620059 625222 629778 633643 636584 638280 638405 636874 634083 630802 627755 625324 623602
63076 623602 622567 622250 622824 624517 627402 631369 636418 642746 650355 658770 667488 676621 686784 698507
63062 698507 712092 727967 746582 767891 791437 817148 845609 877289 911913 948998 988673
63051 988673 1031552 1078008 1127964 1181247 1237703 1296944 1358328 1421214 1485030 1549177 1613252
63040 1613252 1677344 1741773 1806421 1870656 1934105 1997287 2061243 2126545 2192696 2258258 2321336
63029 2321336 2380020 2432618 2477645 2513575 2538639 2550954 2549065 2532496 2501880 2458522 2403759
63018 2403759 2338735 2264806 2184146 2099811 2014999 1932125 1852585 1777438 1708150 1646444 1593353
63007 1593353 1548669 1511623 1482023 1460492 1447627 1443220 1446325 1455808 1470603 1489716 1512293 1537677
62995 1537677 1565243 1594221 1623862 1653787 1684093 1715076 1746812 1778902 1810551 1841039 1870109
62984 1870109 1897713 1923260 1945332 1962332 1973241 1977524 1974469 1963044 1942462 1912723 1874582 1829200
62972 1829200 1777833 1721649 1661698 1599104 1535241 1471557 1409184 1348885 1291344 1237300 1187300
62961 1187300 1141444 1099493 1061130 1026069 994025 964702 937804 912991 889803 867695 846251
62950 846251 825453 805650 787072 769367 751837 734231 717025 700769 685451 670784 656843
62939 656843 643994 632305 621475 611369 602208 594241 587631 582677 579608 577973 576659 574829 572511
62926 572511 570126 567851 565797 564376 563930 564169 564352 563951 562899 561364 559663 558164 556930 555612 554050
62911 554050 552710 552023 551508 550239 548118 545994 544409 542961 541135 539116 537339 535789 534237 532755 531493
62896 531493 530320 529216 528717 529326 530617 531551 531694 531599 531910 532610 533250 533473 533111 532135 530775 529528 528886
62879 528886 529167 530527 532797 535323 537360 538752 539912 541010 541592 541158 539743 537647 534938 531527 527529
62864 527529 523237 518926 514886 511394 508439 505760 503375 501699 500824 500139 499184 498496 498880 500099 501055 501275
62848 501275 501386 502011 502982 503929 504943 506174 507338 508132 508754 509465 509911 509474 508131 506533 505274 504483 504074
62831 504074 504051 504554 505847 508124 511071 513728 515219 515664 516126 517556 519951 522518 524515 525935 527491
62816 527491 529884 533100 536573 540053 543907 548340 552828 556778 560461 564660 569531 574490 579260 584390
62802 584390 590520 597626 605284 613344 622061 631794 642776 655061 668546 683156 698901 715610 732852
62789 732852 750596 769810 791823 817152 845675 877968 915493 959071 1008101 1062060 1122033
62778 1122033 1189800 1265824 1349101 1438706 1534335 1635250 1739737 1845914 1952178 2056427
62768 2056427 2155614 2246751 2327906 2397694 2454288 2495631 2520387 2528099 2518634 2492247 2450241 2394870
62756 2394870 2328239 2251701 2166521 2074665 1978515 1880098 1781093 1683385 1588981 1499181 1414229
62745 1414229 1334001 1258765 1189025 1124959 1066394 1013136 964874 920873 880369 843418 810852
62734 810852 783046 759104 737641 718058 700601 685430 672209 660619 650718 642612 636116 630887
62722 630887 626639 623140 620273 618168 617020 616761 617292 619048 622823 628778 636126 644199 653465 665018
62708 665018 679385 696346 715713 737608 762085 789169 819344 853381 891448 933057 978162
62697 978162 1027670 1082319 1141614 1204626 1271434 1342772 1418184 1495438 1572122 1647019 1719345
62686 1719345 1787174 1847490 1897707 1936469 1963005 1976413 1975927 1961478 1933680 1893571 1842687 1783121
62674 1783121 1717037 1646109 1571699 1495509 1419671 1345980 1275203 1207266 1142072 1080088 1022250
62663 1022250 969357 921488 877974 838037 801493 768716 739879 714423 691444 670489 651700
62652 651700 635170 620406 606600 593296 580660 569168 559150 550554 542925 535630 528279 521021
62640 521021 514318 508438 503340 499031 495681 493223 491162 489179 487703 487429 488286 489344 489812 489707 489338
62625 489338 488613 487208 485181 483002 481091 479645 478800 478618 478955 479640 480807 482767 485535 488735 492063
62610 492063 495620 499714 504565 510287 517028 524930 533970 543898 554418 565550 577889 592364 609549
62597 609549 629326 651397 676083 704341 736959 773932 814605 858269 904554 953361 1004362
62586 1004362 1056399 1107492 1155668 1199723 1238910 1272057 1297514 1314079 1321526 1320115 1310080 1291967
62574 1291967 1266985 1236450 1200981 1160742 1116515 1070134 1023615 978044 933454 889716 847380
62563 847380 807553 771079 738025 708063 681063 657069 635883 617092 600457 585806 572589
62552 572589 560137 548543 538700 531138 525294 520332 516060 512506 509114 505273 501399 498597 497213 496537
62538 496537 496031 495999 496663 497385 497405 496920 496781 497397 498476 499701 501137 503011 505554 509169 514303 521003 528826
62521 528826 537439 547142 558639 572379 588398 606799 628127 652975 681307 712434 745784 781463
62509 781463 819871 861004 904355 949252 994851 1039888 1082878 1122651 1158304 1188624 1212098
62498 1212098 1227853 1236213 1238029 1233729 1223467 1207949 1188613 1166988 1144328 1121928 1101364 1084004
62486 1084004 1070423 1060554 1054453 1052740 1056142 1064670 1077433 1093353 1111934 1133139 1156591 1181058
62474 1181058 1204731 1225785 1242716 1254493 1260557 1260536 1253907 1240197 1219598 1193000 1161156 1124088
62462 1124088 1081710 1034982 986081 937410 890557 846096 804049 764430 727434 693242 661807
62451 661807 633140 607841 586918 570722 558295 548183 539746 533307 529143 526825 525565 524808 524392
62438 524392 524549 525865 528854 533294 538198 542590 546145 548979 551091 552177 551810 549658 545700 540336 534130
62423 534130 527368 520080 512562 505522 499437 493991 488422 482359 476092 470138 464814 460207 456322 453092
62409 453092 450334 447763 445135 442357 439427 436308 433001 429826 427305 425564 424158 422882 422380 423322 425132
62394 425132 426437 426885 427557 429255 431430 433521 436337 440899 446475 451154 454313 457205 460912 464998 468741
62379 468741 472603 477622 483953 490887 497907 504977 512074 519201 526777 535369 544983 555173 565877 577660
62365 577660 590951 605510 620868 637091 654859 674974 697996 724385 754819 790143 830751
62354 830751 876085 925034 976912 1031617 1088564 1145893 1201214 1252904 1300152 1341934 1376710
62343 1376710 1403287 1421442 1431473 1433616 1428177 1415755 1396953 1372185 1342088 1307832 1270567 1230865
62331 1230865 1189218 1146977 1106150 1068118 1033008 1000441 970396 942913 917338 892512 867815
62320 867815 843646 820676 798938 777806 756654 735252 713716 692423 671990 652893 634943
62309 634943 617439 600053 583381 568395 555580 544814 535780 528124 521407 515439 510632 507495 505671
62296 505671 503983 501722 499499 498505 499185 500936 502844 504411 505727 507277 509489 512197 514688 516541 518233
62281 518233 520535 523455 526282 528684 531221 534480 538102 541102 543071 544681 546952 550267 554329 558933
62267 558933 564465 571508 580177 590171 601444 614482 629844 647812 668754 693564 723339 758647
62255 758647 799307 844781 894524 948136 1005373 1065821 1128125 1189731 1247915 1301173 1349172
62244 1349172 1391361 1426140 1451649 1466960 1472239 1468108 1455157 1433884 1404752 1368394 1325883 1278658
62232 1278658 1228029 1174938 1120359 1065634 1012182 961013 912697 867670 826369 789178 756341
62221 756341 727737 702668 680173 659777 641688 626068 612454 600156 588868 578478 568648 559121
62209 559121 550186 542204 534786 527152 519373 512573 507650 504352 501871 499829 498262 497141 496553 497098 499425
62194 499425 503297 507647 511727 515884 521019 527628 535615 544751 554808 565297 575599 585607 595837
62181 595837 606569 617196 626953 636072 645450 655080 663601 669924 674707 679615 685579 692578 700841 711325
62167 711325 724875 741729 762119 786714 816107 850309 888971 931548 976923 1023357 1069291
62156 1069291 1113819 1156070 1194617 1228053 1255792 1277754 1293591 1302952 1306340 1304981 1299756 1290806
62144 1290806 1278218 1262471 1243998 1222894 1199458 1174718 1150084 1126597 1104719 1084621 1066384
62133 1066384 1049990 1035256 1021894 1009714 998908 990021 983367 978500 974576 971279 969115 968743 970400
62120 970400 974014 979445 986352 994288 1003252 1013795 1026004 1038596 1049567 1057753 1063294 1066533 1067020
62107 1067020 1063909 1057048 1047361 1036296 1025136 1014743 1005615 998035 992147 987901 985015 983197 982489
62094 982489 983313 986068 990713 996784 1003716 1011042 1018450 1025834 1033270 1040809 1048328 1055716 1063138 1070956
62080 1070956 1079388 1088483 1098418 1109499 1121767 1134853 1148481 1162941 1178729 1195804 1213506 1231222
62068 1231222 1248862 1266606 1284445 1302091 1319117 1335121 1350051 1364627 1380236 1398046 1418175
62057 1418175 1439796 1461866 1483471 1503642 1521348 1535940 1547344 1555615 1560396 1560975 1556727 1547294
62045 1547294 1532435 1511920 1485625 1453613 1416118 1373599 1326874 1277141 1225743 1173889 1122494
62034 1122494 1072193 1023463 976818 932877 892170 854792 820431 788842 760235 734965 712842
62023 712842 692976 674448 657044 641150 627029 614381 602634 591464 580916 571055 561648 552291
62011 552291 542868 533851 526038 519946 515465 512118 509561 507785 506971 507292 508831 511562 515438 520485 526638
61996 526638 533363 539646 544660 548322 550939 552441 552420 550905 548551 545838 542477 537926 532170 525648 518645
61981 518645 511201 503544 496274 489995 484943 480898 477349 473895 470648 468162 466786 466271 466151 466299 466784
61966 466784 467446 468045 468763 470100 472200 474554 476504 477794 478631 479441 480599 482121 483567 484412 484582 484512
61950 484512 484764 485750 487737 490791 494782 499660 505713 513269 522205 532068 542659 554185 566861 580702
61936 580702 595661 611592 628087 644754 661643 678907 696037 711983 726211 739104 751054
61925 751054 761681 770220 776290 779946 781377 780881 778780 775023 769321 761999 754290 747276 740911 734711
61911 734711 729154 725744 725755 729421 736328 746078 758390 772855 788723 804868 820119 833757 845501
61898 845501 854891 861086 863580 862694 858924 852207 842456 830485 817621 804477 790781 776436 762089
61885 762089 748646 736754 726769 718493 710840 702501 693329 684506 677090 670858 664843 658409 651437 643991
61871 643991 636389 629309 623310 618378 614232 610897 608661 607668 607829 608960 610784 613013 615728 619539 625133
61856 625133 632847 642813 655229 670163 687386 706726 728436 752817 779654 808340 838488 869976
61844 869976 902375 934640 965529 994187 1020239 1043444 1063279 1078919 1089719 1095741 1097633 1096028
61832 1096028 1091321 1084142 1075705 1067441 1060484 1055673 1053650 1054657 1058461 1064843 1073902 1085481 1098483
61819 1098483 1111264 1122573 1131647 1137446 1138511 1133869 1123679 1108652 1089142 1065152 1037053 1005886
61807 1005886 972913 939120 905256 872115 840510 810963 783669 758840 736902 718055 701781
61796 701781 687101 673385 660642 649008 638373 628652 620020 612545 605896 599779 594409 590099 586523
61783 586523 582902 578990 575465 573141 572040 571404 570479 569079 567434 565695 563814 561924 560567 560180 560430
61768 560430 560433 559736 558693 557753 556792 555474 553864 552330 551144 550528 550820 552110 553946 555823 557768 560016
61752 560016 562408 564705 567297 570862 575235 579241 581802 582834 583081 583606 585426 588990 593693 598309 602107
61737 602107 605249 608089 610695 613199 616010 619269 622502 625162 627214 628932 630453 631871 633457 635453
61723 635453 637753 639982 641709 642565 642595 642584 643538 645547 647596 648811 649415 650072 650805 651117 650768 649728 647591
61706 647591 643805 638523 632600 626601 620306 613409 606265 599681 594180 589733 586060 582916 580076 577232
61692 577232 574087 570633 567215 564094 561063 557773 554445 551854 550405 549564 548434 546619 544284 541691
61678 541691 539043 536529 534162 531707 529053 526497 524318 522251 519786 516828 513747 510859 508255 505985
61664 505985 504024 502006 499421 496154 492656 489503 486971 484962 483218 481698 480794 480914 481689 482042 481375
61649 481375 480329 479939 480442 481475 482990 485122 487367 488861 489603 490561 492369 494629 496729 498567 500087
61634 500087 500779 500190 498492 496128 493297 490165 487156 484587 482343 480300 478617 477250 475620 473402 471268
61619 471268 470161 470006 469771 468757 467195 465588 464091 462697 461486 460355 458826 456412 453042 448973 444442
61604 444442 439514 434135 428229 421863 415419 409521 404684 400955 397835 394605 390918 387172 384094 381837
61590 381837 379683 376917 373750 371021 369048 367245 364945 362230 359717 357786 356314 355052 353967 353069
61576 353069 352064 350409 347853 344842 342212 340409 339159 337927 336489 334927 333328 331792 330582 329901
61562 329901 329519 328922 327918 326830 326003 325361 324597 323663 322939 322927 323807 325231 326637 327886 329454 331735 334284
61545 334284 336152 337043 337688 338846 340325 341444 342183 343248 344980 346733 347636 347673 347696 348517 350269 352556
61529 352556 354887 356854 358109 358399 357673 356105 353996 351590 348928 345947 342777 339877 337714 336314 335322
61514 335322 334541 334177 334391 334852 334974 334524 333731 332851 331895 330839 329803 328934 328264 327784 327427 326884 325678 323690
61496 323690 321492 319890 319122 318709 318132 317443 317067 317171 317436 317520 317520 317780 318350 318851 318945 318673 318200 317515 316690
61477 316690 316246 316831 318530 320801 323136 325407 327542 329262 330370 330936 330968 330264 328978 328025 328364 329918
61461 329918 331617 332585 332918 333186 333539 333598 333071 332226 331700 331950 332904 334142 335387 336754 338501 340547 342294
61444 342294 342973 342279 340812 339835 340373 342396 345011 347490 349888 352596 355564 358298 360446 362118 363595
61429 363595 364973 366125 366890 367278 367603 368343 369781 371813 374088 376234 377953 379158 380186 381670 383976
61414 383976 386900 390041 393200 396181 398533 399920 400591 401060 401414 401343 400771 399909 398672 396579 393396 389515
61398 389515 385503 381634 378052 375073 372943 371504 370379 369428 368863 368911 369478 370136 370489 370583 370858 371565 372407
61381 372407 372955 373243 373603 374123 374744 375721 377309 378996 379766 379436 379061 379584 380687 381495 381921 382627 383955
61364 383955 385652 387537 389746 392225 394529 396292 397581 398764 400385 403133 407410 412819 418494 424095
61350 424095 430074 436867 444276 451984 460223 469476 479667 490138 500354 510251 519811 528688 536485
61337 536485 543256 549467 555457 561035 565664 568980 571043 572130 572346 571540 569609 566786 563572 560366 557210
61322 557210 553938 550593 547627 545557 544493 544069 543878 543793 543828 543914 544051 544603 546213 549411 554393 561100 569282
61305 569282 578511 588431 599097 610814 623470 636225 648204 659371 670308 681073 690609 697582
61293 697582 701502 702687 701330 697182 690302 681562 671982 661911 651314 640706 631190 623433 617021
61280 617021 611024 604972 599126 594073 590224 587497 585318 583176 581344 580858 582534 586147 590730 595462
61266 595462 600064 604635 609477 614944 621059 627259 632865 637850 642973 649204 657228 667254 678812 690745
61252 690745 701964 712433 723003 734032 744525 752954 758576 761567 762216 760590 756975 752062 746466
61239 746466 740422 734101 727948 722412 717574 713221 709141 705111 700834 696325 692298 689754 689054 689756 691493
61224 691493 694615 699595 706061 712899 719328 725510 732061 739290 747065 755088 763046 770614 777548 783748
61210 783748 789209 794026 798473 802854 807095 810685 813312 815446 818030 821593 825935 830709 836051 842500
61196 842500 850427 859817 870584 882965 897470 914496 934021 955607 978547 1002022 1025268 1047764
61184 1047764 1069148 1088893 1106230 1120627 1132261 1141795 1149757 1156386 1161971 1166851 1170997 1173873 1174930
61171 1174930 1173949 1170839 1165439 1157762 1148174 1137070 1124544 1110513 1094899 1077513 1058113 1036834
61159 1036834 1014309 991064 967127 942564 918122 894826 873178 853223 835213 819566 806186
61148 806186 794451 784041 775310 768589 763523 759401 755920 753332 751856 751048 749773 746885 742113 736209
61134 736209 730172 724506 719443 715497 713305 713012 714340 717314 722392 729796 739192 750235 763061 778052
61120 778052 795514 815765 839205 865978 895768 928117 962756 999509 1038120 1078288 1119675
61109 1119675 1161679 1203400 1243969 1282827 1319722 1354648 1387708 1418681 1446696 1470725 1490447
61098 1490447 1506213 1518079 1525356 1527249 1523445 1513839 1498242 1476829 1450481 1420279 1386848 1350581
61086 1350581 1312219 1272787 1233040 1193254 1153448 1113671 1074318 1036305 1000618 967519 936541
61075 936541 907446 880682 856580 834701 814531 796397 781054 768614 758457 749996 742909 736824
61063 736824 731469 727097 724170 722581 721694 721155 721189 722147 724307 728091 733861 741377 749935 759220 769586
61048 769586 781401 794587 808976 824686 841979 861088 882325 905958 931799 959301 988231
61037 988231 1018914 1051600 1085880 1120993 1156501 1192481 1229293 1267337 1306837 1347596 1389073
61026 1389073 1430856 1473052 1516166 1560578 1606025 1651516 1696014 1739425 1782854 1827795 1875448
61015 1875448 1927043 1984237 2048523 2120540 2200757 2290707 2392865 2509590 2643339 2798349
61005 2798349 2981660 3202775 3473514 3808813 4227327 4751388 5406749 6221094 7220052
60996 7220052 8423045 9841652 11476068 13302400 15256455 17233878 19115938 20801126
60988 20801126 22215099 23302226 24030464 24421706 24572422 24621547 24675542 24752020 24786716 24682874
60978 24682874 24348782 23703926 22683556 21267922 19515920 17561294 15563896 13653815
60970 13653815 11907178 10355298 9003007 7840214 6848730 6008666 5301851 4710590 4216210
60961 4216210 3801038 3450969 3154998 2903236 2686611 2497855 2331599 2183829 2051986
60952 2051986 1934958 1831854 1740961 1660497 1589705 1528108 1474067 1425170 1379896 1337708 1297574
60941 1297574 1257736 1217341 1177224 1138480 1101148 1064955 1030431 998243 967876 938068 908590
60930 908590 880717 855716 833451 812729 792547 772670 753432 735399 719152 705013 692891
60919 692891 682496 673580 665849 658764 651764 644759 638256 632930 629187 627141 626678 627321 628245 628869 629468
60904 629468 630906 633617 637044 640249 642845 645101 647271 649118 650164 650150 649131 647211 644297 640187 634899
60889 634899 628862 622623 616341 609710 602501 594955 587415 579787 571752 563519 555965 549783 544776 540217
60875 540217 535757 531713 528493 525963 523490 520593 517546 515293 514627 515471 517078 518894 521012 523830 527710
60860 527710 533040 540112 548495 556914 564399 571412 579235 588245 597428 605671 612866 619409 625291 630338
60846 630338 634942 639823 645123 650221 654463 657574 659408 659806 658882 657005 654339 650684 645916 640268 634039
60831 634039 627354 620453 613890 608154 603236 598862 594915 591402 588145 584863 581499 578182 574969 571924
60817 571924 569386 567776 567041 566586 565914 565144 564746 564948 565560 566355 567458 569334 572314 576081 579760 582751
60801 582751 585470 589081 594400 601234 608879 616994 625738 635180 644894 654253 663066 671917 681948 694201
60787 694201 708925 725382 742457 759582 777032 795322 814446 833875 853228 872696 892727
60776 892727 913503 934814 956328 977799 999142 1020507 1042168 1064020 1085226 1104731 1122260
60765 1122260 1138497 1154105 1168810 1181638 1191819 1199157 1203726 1205586 1204794 1201376 1195299 1186704 1176067
60752 1176067 1163792 1149705 1133289 1114542 1094305 1073608 1052972 1032472 1012182 992236 972553
60741 972553 952709 932183 910804 889042 867780 847547 827990 808370 788566 769290 751307
60730 751307 734787 719510 705266 691848 679047 666958 655960 646078 636707 627355 618432 610870
60718 610870 605165 601087 598055 595285 591831 587191 581930 577174 573421 570242 567112 563931 560628 556914
60704 556914 552735 548511 544531 540484 535898 530784 525511 520284 515033 509635 504000 498156 492427 487292
60690 487292 482799 478423 473766 469197 465473 462894 461081 459357 457067 453865 450116 446858 444969 444512
60676 444512 445135 446720 449061 451232 452175 452009 452009 453041 454584 455630 455989 456271 456928 457827 458592 458977 458957 458697
60658 458697 458423 458223 458105 458301 459280 461290 464073 467194 470493 474121 478354 483421 489224 495110 500293
60643 500293 504615 508564 512372 515643 518171 520472 522848 524453 524212 522521 521062 520810 521020 520515 519234
60628 519234 517979 517185 516578 515790 514641 512892 510255 506847 503326 500359 498050 495943 493490 490476 487088
60613 487088 483733 480809 478524 476764 475087 473024 470509 467939 465675 463619 461474 459251 457237 455614
60599 455614 454449 453943 454173 454614 454465 453631 452866 452674 452632 452193 451625 451557 451936 452158 452054 452076 452512 453147 453762
60580 453762 454344 454698 454517 454084 454272 455422 456803 457711 458640 460664 463992 467911 472077 477048 483376 490949
60564 490949 499622 509836 521977 535420 548810 561129 571989 581006 587554 591262 592236 590602 586329
60551 586329 579830 572366 565399 559713 555433 552542 550948 550272 550207 551118 553762 558308 564129 570739 578459
60536 578459 587727 598153 608685 618530 627455 635279 641583 646051 648719 649680 648826 646180 642382 638553
60522 638553 635550 633376 631381 628930 625821 622157 618164 614315 611409 610086 610195 610913 611661 612630 614287
60507 614287 616613 619115 621473 623882 626850 630870 636327 643555 652951 665118 680834 700799 725398
60494 725398 754664 788228 825199 864349 904604 945087 984520 1020882 1051996 1076191 1092019
60483 1092019 1097779 1092218 1075825 1050785 1019371 982873 942310 899487 856621 815117 775295 737343
60471 737343 702131 670978 644780 623363 605516 589661 574780 560841 548375 537672 528439 520042
60459 520042 511955 504079 496856 490995 486830 483871 481211 478474 476118 474622 473539 471700 468427 464246
60445 464246 460297 457262 455102 453552 452398 451348 450158 449038 448506 448635 448883 448868 448763 448524 447321 444501
60429 444501 440719 437343 434911 433029 431620 431172 431629 432091 432079 432196 433049 434350 435690 437320 439383 441117
60413 441117 441839 442156 443103 444502 445324 445440 445780 446775 447870 448833 450304 452566 454769 456043 456589 457031 457454
60396 457454 457801 458571 460181 462044 463170 463510 463940 465005 466444 467963 469725 471903 474323 476814 479488
60381 479488 482438 485446 488132 490144 491175 491188 490844 491300 493222 496135 498938 501005 502593 504325 506462
60366 506462 508753 510839 512665 514453 516319 518064 519418 520351 521041 521708 522656 524261 526570 529032 531048
60351 531048 532768 534979 538169 542193 547004 553168 561239 570969 581582 592612 603981 615387 626090
60338 626090 635346 642653 647565 649681 649009 646003 641039 634138 625394 615447 605252 595498 586438 578149
60324 578149 570716 564179 558461 553413 548956 545247 542650 541264 540462 539239 537313 535571 535098 535996 537598
60309 537598 539641 542629 547023 552781 559945 569193 581296 596265 613372 631777 650762 669549 687317
60296 687317 703395 717140 727707 734374 737189 736945 734401 729824 723434 715957 708327 700867 693050 684207
60282 684207 674352 664194 654365 644793 634973 624739 614505 604643 594943 585002 575043 565966 558441
60269 558441 552206 546383 540347 534165 528321 523198 518861 515195 512217 510169 509247 509236 509540 509629 509416 509126
60253 509126 508878 508504 507798 506868 506155 506133 507035 508873 511515 514543 517210 518905 519731 520314 520870 520872 519894 518420
60235 518420 517335 516868 516590 516311 516331 516743 517215 517760 519126 521889 525502 528818 531445 534144 537827 542495
60219 542495 547276 551350 554720 558149 562329 567169 572019 576608 581459 587230 593862 600679 607189 613510
60205 613510 620032 626899 633896 640747 647406 654014 660520 666465 671330 675074 678133 680943 683753 686812
60191 686812 690200 693277 694938 694808 693786 692871 691876 689901 686792 683312 679912 676185 671750 667000 662508
60176 662508 658194 653542 648430 643347 638904 635370 632541 629837 626640 622811 618905 615826 614292 614529
60162 614529 616218 618610 620945 622942 624765 626485 627851 628773 629729 631359 633784 636559 639171 641327 642825
60147 642825 643527 643613 643702 644478 646191 648565 651260 654438 658769 664815 672447 681037 690123 699690 709817
60132 709817 720280 730549 739927 747678 753335 757085 759604 761330 762102 761652 760147 758027 755612 753225
60118 753225 751444 750755 751020 751714 752622 753837 755070 755589 755124 754379 754254 754764 755112 754715 753737 752621 751398
60101 751398 749625 746900 743342 739587 736309 733644 731137 728324 725310 722619 720557 718998 717875 717564
60087 717564 718534 720805 724046 728121 733212 739325 746012 752710 759130 765171 770717 775737 780300 784118
60073 784118 786242 785655 782194 776556 769360 760598 750153 738485 726494 714898 703946 693562 683528
60060 683528 673617 663803 654302 645303 636769 628655 621194 614749 609462 605210 601855 599344 597615 596605
60046 596605 596321 596778 597940 599866 602782 606740 611249 615607 619672 624126 629832 636997 644947 652521 658716
60031 658716 663240 666583 669354 671456 672111 670787 667793 663665 658225 650683 640736 629183 617332 606042
60017 606042 595496 585622 576341 567539 559155 551365 544436 538342 532823 527939 524174 521743 520081 518510
60003 518510 517243 517224 518908 521660 524548 527307 530262 533614 537204 540822 544460 548290 552565 557418 562605
59988 562605 567592 572127 576610 581587 586997 592117 596227 599120 601057 602471 603660 604447 604241 602668 600116
59973 600116 597327 594428 590756 585770 579837 573960 568987 565276 562876 561715 561608 562261 563397 564904 566902
59958 566902 569643 573224 577359 581491 585113 587918 589768 590713 591053 591167 591206 591056 590607 589917 589107 588321 587765
59941 587765 587599 587650 587390 586294 584170 581098 577192 572509 567183 561616 556447 552152 548557 545020 541314
59926 541314 538141 536352 535817 535524 534845 534239 534604 536315 539077 542294 545284 547519 549039 550517 552629
59911 552629 555506 559002 563215 568394 574384 580540 586254 591442 596473 601769 607438 613247 618932 624486
59897 624486 629962 635036 639080 641837 643826 645880 648472 651574 654946 658308 661434 664362 667443 670978
59883 670978 674876 678844 682796 686926 691508 696777 702861 709621 716609 723285 729141 733575 735917 735811
59869 735811 733430 729177 723408 716521 708968 700947 692403 683577 675136 667402 659871 652087 644627 638503
59855 638503 633791 629670 625883 623373 623139 625035 628115 631788 636200 641743 648536 656368 664900 673871
59841 673871 683090 692172 700417 707196 712411 716334 719110 720827 722010 723531 725785 728255 730035 730543
59827 730543 729601 727165 723183 717475 709706 699797 688470 677005 666154 655604 644700 633405 622295
59814 622295 611928 602621 594604 587914 582137 576606 571008 565687 561368 558653 557623 557787 558459 559256 560156
59799 560156 561055 561533 561233 560272 559011 557533 555580 552967 549903 546898 544437 542627 541072 539192 536736
59784 536736 533877 530830 527652 524507 521865 520170 519445 519384 519707 520249 520862 521383 521673 521650 521448 521525 522258 523343
59766 523343 524008 524118 524618 526489 529612 533181 536948 541375 546629 552135 557362 562467 567833 573394 578854
59751 578854 584319 590219 596617 603016 609002 614818 621045 627761 634348 640161 645170 649757 654103 658076
59737 658076 661547 664376 666153 666515 665833 665072 664681 664133 662923 661506 660682 660451 660121 659356 658445 657647 656972
59720 656972 656638 657065 658179 659277 659870 660231 660892 661979 663278 664554 665501 665719 665112 664168 663554 663509 663721
59703 663721 663658 662911 661466 659803 658570 658029 657977 658237 658860 659672 660041 659452 658132 656800 655895 655315 654741 653913
59685 653913 652681 651121 649640 648753 648688 649285 650233 651264 652169 652733 652746 652023 650511 648382 645868 642980 639537
59668 639537 635481 630931 625853 620042 613641 607402 602076 597746 594041 590809 588200 586222 584720 583808
59654 583808 583920 585273 587571 590374 593537 597157 601266 605652 609822 613107 615022 615611 615241 614003 611633
59639 611633 608203 604572 601759 599919 598305 596299 594218 592946 592890 593507 593892 593688 593276 593143 593254 593184 592719
59622 592719 592029 591304 590529 589815 589638 590362 591586 592303 591786 590140 587965 585851 584322 583973 585171 587691
59606 587691 590874 594181 597382 600337 602966 605481 608213 610967 612854 613153 612187 610999 610229 609596 608428
59591 608428 606345 603418 600083 597064 595076 594239 593845 592894 590900 588114 585099 582207 579374 576325 572954
59576 572954 569517 566383 563624 561021 558484 556251 554534 553198 552016 551130 551025 552001 553794 555706 557129
59561 557129 557994 558781 559964 561432 562617 563257 563819 564953 566736 568680 570405 571992 573701 575612 577567
59546 577567 579253 580387 581102 582253 585035 590040 596830 604609 613245 623474 636088 651081 667585
59533 667585 684485 700848 715711 727698 735384 738339 737722 735533 733324 731840 731740 734026 739317 747007
59519 747007 755531 763487 770226 775461 778808 779916 778766 775519 770147 762497 752692 741261 728867 716064
59505 716064 703346 691142 679609 668560 657801 647485 637989 629525 622030 615402 609653 604774 600600
59492 600600 596909 593613 590848 588939 588181 588570 589746 591320 593183 595381 597915 600929 605002 610686 617650
59477 617650 624708 631014 636923 643395 650849 658941 667135 674934 681674 686716 690051 692364 694333 696149
59463 696149 697741 699149 700511 701960 703795 706557 710784 716834 725047 735802 749160 764634 781569
59450 781569 799617 818584 837979 857020 875106 891865 906643 918211 925240 927014 923575 915332
59438 915332 902765 886547 867724 847613 827508 808466 791210 776029 762699 750679 739616
59427 739616 729706 721576 715783 712503 711646 713197 717412 724724 735505 749873 767702 788692 812336
59414 812336 837886 864585 892074 920303 948679 975330 997590 1013424 1022237 1024212 1019249 1007061
59402 1007061 988417 965963 943504 924328 909981 900210 893696 888832 884128 878202 869539 856463
59390 856463 837776 813800 786717 759471 734117 711249 690866 673215 658540 646522 636585 628630
59378 628630 622862 618951 615961 613342 611441 610731 610976 611627 612680 614563 617294 620364 623498 626938 630789
59363 630789 634574 637906 641312 645878 652095 659470 667333 675724 685205 696085 708240 721660 736766
59350 736766 753999 773337 794498 817410 842127 868333 895388 922969 951238 980070 1008384
59339 1008384 1034607 1057640 1077064 1092582 1103771 1110406 1112534 1110054 1102595 1090094 1073240 1053074
59327 1053074 1030334 1005474 979055 951761 924121 896654 870269 846056 824514 805349 788247
59316 788247 773470 761306 751217 742053 733200 725104 718561 713777 710309 707649 705682 704713 705273 707726
59302 707726 711839 716864 722319 728628 736732 747145 759650 773832 789365 805517 820756 833254
59290 833254 841678 845294 843585 836400 824617 810252 795520 781781 769421 758568 749695 743523 740473
59277 740473 740301 742302 745971 751473 759400 770002 782773 796878 811955 828342 846453 865933 885419
59264 885419 903140 917774 928815 936248 940017 939883 935691 927578 915958 901545 885416 868807 852570
59251 852570 836918 821812 807459 794206 782100 770907 760580 751390 743549 737085 732314 730064
59239 730064 730982 734682 739870 745367 750861 756814 763948 772738 782932 793294 802092 808154 811444 812563
59225 812563 811849 809096 803906 796038 785575 773101 759681 746338 733382 720478 707398 694516
59213 694516 682439 671432 661432 652407 644413 637384 631152 625650 620865 616651 612926 610069 608685
59200 608685 608782 609531 610190 610954 612512 615030 618084 621567 625941 631347 637031 642079 646448 650855 655867
59185 655867 661500 667517 673606 679285 684110 688125 691830 695609 699487 703448 707676 712384 717730 724000
59171 724000 731469 739907 748578 757057 765761 775394 786162 797876 810537 824227 838475 852225 864511
59158 864511 874808 882742 887944 890352 890245 887690 882317 873933 863105 850682 836932 821640 805101
59145 805101 788569 773435 760213 748521 737784 727666 717949 708518 699589 691676 685070 679530 674649
59132 674649 670378 666879 664007 661272 658433 655900 654387 654274 655345 657046 658964 661198 664266 668490
59118 668490 673577 679070 685207 692819 702183 712413 722360 731740 740889 749674 757427 764028 770343 777150
59104 777150 784015 789730 793744 796743 799808 803288 806640 809106 810331 810437 809758 808615 807178 805401 803150
59089 803150 800543 798061 796135 794661 793176 791475 789771 788188 786329 783431 778682 771430 761616 750256
59075 750256 739005 728814 719313 709892 700914 693252 686871 680757 674317 668096 662874 658601 654635 650611
59061 650611 646677 643069 639819 636819 634034 631624 629835 628637 627560 626150 624525 623142 622095 621054
59047 621054 619835 618547 617174 615626 614334 614098 614975 615913 615948 615270 614672 614467 614542 615021 616092 617433 618616
59030 618616 620026 622688 627165 633241 640710 649712 660094 671166 682540 694718 708369 723304 738524
59017 738524 753038 766215 777536 786505 792899 796857 798660 798557 796770 793487 788904 783484 778177 774162
59003 774162 772271 772710 775332 779968 786383 794098 802533 811417 820858 830903 841113 850817 859809 868614
58989 868614 877926 887765 897306 905463 911517 915134 915964 913578 908048 900449 892404 884945 878010 871264
58975 871264 865212 861154 860089 861974 866074 871744 878864 887854 899343 913482 929471 946095 962835
58962 962835 980090 998158 1016481 1034191 1050917 1066498 1080160 1090556 1096528 1097431 1092912 1082987
58950 1082987 1068413 1050417 1029878 1007141 982700 957625 933033 909419 886748 865018 844625
58939 844625 826394 811321 799959 791831 785655 780334 775612 771746 768897 767049 766184 766083 766053 765233 763238
58924 763238 760361 757181 754125 751359 748851 746497 744344 742730 742063 742370 743176 743899 744349 744855 745949 747926
58908 747926 750718 754172 758448 764055 771416 780495 790954 802639 815768 830680 847500 865987 885519
58895 885519 905260 924663 944038 964394 986543 1010475 1035949 1063487 1094251 1128827 1166522
58884 1166522 1206030 1246287 1286273 1324462 1359153 1389333 1414615 1434273 1446897 1451285 1447303 1435675
58872 1435675 1417266 1392871 1363431 1330163 1294499 1257928 1221623 1186149 1151929 1120055 1092112
58861 1092112 1068781 1048971 1030739 1012859 995245 978327 962569 948240 934947 921559 907294
58850 907294 892812 879590 868238 858132 848692 840143 832655 825570 818072 810109 802013 793673 784755
58837 784755 775498 766488 757679 748366 738382 728717 720557 714019 708273 702759 697781 693842 690817 688114
58823 688114 685535 683588 682921 683775 686171 690254 696026 702828 709607 715874 722094 728890 736037 742516 747498
58808 747498 751083 754086 757221 760499 763337 765141 765730 765203 763576 760786 756969 752491 747601 742303 736624
58793 736624 730782 724952 719084 713190 707640 702949 699317 696596 694695 693799 694164 695898 698969 703232 708300
58778 708300 713528 718359 722731 726933 730983 734285 736103 736277 735208 733129 729749 724881 719157 713691
58764 713691 709048 704897 700712 696468 692512 689156 686752 685888 686986 689655 692835 695778 698653 702041
58750 702041 706106 710520 715017 719655 724548 729720 735283 741340 747560 753263 758263 763349 769477 776655
58736 776655 784126 791490 799027 806805 814169 820528 826228 832232 839152 846897 854993 862903 870211 876877
58722 876877 883269 889760 896433 903324 910591 918167 925579 932534 939496 947268 956149 965877 976138 986583
58708 986583 996428 1004586 1010316 1013362 1013523 1010495 1004143 994488 981433 964902 945329 923600 900484
58695 900484 876450 852023 827813 804141 781157 759489 740218 723940 710235 698310 687761
58684 687761 678403 669785 661425 653379 646149 639995 634616 629570 624819 620766 617797 615847 614538 613755
58670 613755 613880 615299 617973 621841 627453 635602 646307 658583 671353 684161 696835 708874 719406
58657 719406 727550 732714 734908 734906 733745 731855 728952 724904 720285 715779 711423 706812 701856 696904 692228
58642 692228 687752 683311 678947 674879 671393 668845 667686 668330 670828 674697 679304 684437 690244 696393
58628 696393 701731 705230 707093 708403 709781 711011 711923 712967 714674 717102 720199 724330 730160 738229
58614 738229 748819 761905 776917 792748 808189 822396 834964 845738 854471 860453 862751 861167
58602 861167 856765 850941 844147 836107 827057 817889 809030 800108 790958 782111 773933 766140 758724 752720
58588 752720 749376 748968 750969 754990 761057 769259 779551 791669 804953 818513 831871 845131 858364
58575 858364 871209 883169 893841 902792 909973 916493 924194 934006 945444 958106 972761 990263
58563 990263 1010230 1031777 1054988 1080566 1108225 1136311 1163037 1187411 1209079 1227826 1243240
58552 1243240 1254488 1260625 1261488 1258021 1251426 1242399 1231586 1220170 1209238 1198877 1188471 1177574
58540 1177574 1165898 1152778 1137430 1119604 1099562 1077686 1054647 1031597 1009542 988764 969323
58529 969323 951787 936874 924711 915016 907653 902501 899262 898002 899365 903439 908956 914457 919799
58516 919799 925617 931775 937458 942455 947155 951369 954325 955855 956516 956442 955051 952167 948537 944959 941516
58501 941516 937823 933482 928268 922440 916790 911795 906859 901054 894373 887525 880838 874331 868589 864420
58487 864420 861665 859455 857665 857051 857927 859928 863271 868967 877352 887523 898727 911257 925369 940247
58473 940247 954702 968158 980233 990074 996828 1000335 1000848 998482 993426 986342 978155 969725 961868 955211
58459 955211 949775 945202 941594 939657 939888 942193 946486 953006 961687 971773 982284 992315 1000669 1005860
58445 1005860 1006972 1004185 998315 990296 981196 972047 963343 955152 947879 942276 938496 935771 933441 931846
58431 931846 931917 934263 938801 944900 951750 959070 967512 977966 990503 1004489 1019475 1035157 1050524
58418 1050524 1064031 1074828 1083070 1088923 1092069 1092353 1090101 1085657 1079361 1072001 1064311 1055983 1046194 1035218
58404 1035218 1024344 1013946 1003025 991214 979989 971072 964607 959735 956072 953740 952587 952269 952725
58391 952725 953990 955962 958690 962304 966339 969860 972608 975241 978005 980129 981091 981650 982919 985085 987679
58376 987679 990455 993408 996500 999877 1003775 1007855 1011396 1014544 1018472 1023804 1029866 1036159 1043583 1053288
58362 1053288 1065066 1077853 1091296 1105960 1122257 1139822 1157670 1174594 1189763 1203132 1214793
58351 1214793 1223967 1229632 1232293 1233906 1235634 1236820 1236705 1235938 1235643 1236184 1237758 1241096 1246632 1253922 1262787
58336 1262787 1274047 1288123 1303888 1320028 1336696 1354719 1373922 1393355 1412503 1431232 1449122
58325 1449122 1465802 1481386 1495701 1507726 1516616 1522629 1526343 1527885 1527826 1527844 1529356 1532159 1535418 1539245
58311 1539245 1544329 1550828 1558744 1568626 1580810 1594546 1608921 1623979 1640036 1656696 1673580 1691197
58299 1691197 1709974 1729135 1747624 1765513 1783537 1801925 1820580 1839595 1858743 1877395 1895868
58288 1895868 1915689 1937505 1959925 1981648 2003490 2026839 2051226 2075078 2097947 2120390 2142450
58277 2142450 2163862 2185185 2207412 2231079 2256853 2286028 2319204 2355499 2394387 2437117 2484901
58266 2484901 2536926 2591857 2650126 2712926 2779979 2850095 2923066 2999172 3077671 3157416 3238151
58255 3238151 3319696 3400903 3481010 3560925 3641662 3722825 3804249 3887657 3974854 4065817 4160478
58244 4160478 4260663 4368102 4482157 4601844 4728464 4863780 5007343 5158289 5318141
58235 5318141 5489041 5670801 5862590 6065894 6282796 6512988 6755772 7013546 7290014
58226 7290014 7586439 7903034 8242598 8609397 9005893 9433990 9897960 10402646 10950506
58217 10950506 11544048 12189507 12894715 13665760 14509856 15439360 16468948 17611604 18882152
58208 18882152 20302508 21899559 23702032 25745954 28081916 30774224 33899913 37558476
58200 37558476 41884090 47049970 53274829 60841241 70111086 81521369 95564787 112753060
58192 112753060 133540845 158215439 186792888 218910702 253650565 289345258 323623551
58185 323623551 353852680 377717010 393478021 399876020 396148838 382471906 360413509
58178 360413509 332739951 302525561 272238007 243393674 216724808 192447426 170441594
58171 170441594 150431774 132196834 115680146 100929172 87967858 76731207 67077195
58164 67077195 58822939 51776542 45761364 40625067 36233325 32465144 29217509 26407361
58156 26407361 23965099 21830357 19954511 18300231 16835258 15529930 14360516 13309255
58148 13309255 12359695 11496251 10708454 9990573 9336164 8737184 8188587 7688965 7235732
58139 7235732 6823716 6448901 6109264 5801081 5518354 5256855 5015210 4791192 4580398
58130 4580398 4379580 4188354 4006844 3834386 3671108 3518001 3374740 3239743 3112641
58121 3112641 2994260 2884013 2779904 2681291 2589137 2503269 2421953 2344501 2271872 2204300 2140619
58110 2140619 2080368 2024357 1972732 1924342 1878310 1834413 1791896 1749824 1708706 1669868 1633170
58099 1633170 1597133 1561192 1525946 1491324 1456485 1421451 1386942 1352775 1318370 1284512 1252561
58088 1252561 1222188 1192136 1162990 1136708 1113408 1091038 1068435 1046309 1024906 1003111 980512
58077 980512 958244 937074 916560 896631 878120 861064 844238 827022 810211 794525 779840
58066 779840 766201 754000 742828 731744 720949 711588 703685 695974 687962 680314 672983 664882 655811
58053 655811 646814 638188 629011 619182 609940 601818 593975 586208 579647 574644 569939 564863 560516 557644
58039 557644 555140 551828 548128 544681 540880 536093 531059 526660 522431 517537 512111 506451 499925 491948
58025 491948 483219 474817 466809 458700 450552 442758 435455 428901 423526 418856 413535 407334 402018 399049
58011 399049 397468 395319 392297 389542 387493 385452 383018 380630 378752 377508 377048 377409 378104 378571 378873
57996 378873 379340 379771 379637 378875 377886 376962 376255 376060 376543 377330 377865 378069 378330 378985 380068 381339 382437 383303
57978 383303 384466 386390 388522 389708 389729 389640 390283 391302 392016 392450 392925 393378 393778 394673 396648 399616 403102
57961 403102 406848 410769 414832 419222 424021 428500 431546 433164 434587 436336 437173 435833 432872 429773
57947 429773 426911 423603 419696 415917 412836 410511 409084 408779 409296 410055 411151 413392 417309 422644 428896
57932 428896 435812 443255 450977 458627 465712 471588 475773 478258 479325 479163 477836 475444 472116 467975
57918 467975 463217 457972 452078 445405 438505 432386 427373 422704 417580 412141 407118 403079 400387 399252
57904 399252 399228 399109 397953 395904 393491 390573 386668 381968 377258 372935 368734 364396 360030 355803 351769
57889 351769 348088 345044 342704 340677 338253 334836 330513 326224 323024 321012 319369 317522 315691 314059
57875 314059 312104 309284 305872 302523 299397 296312 293372 290786 288344 285701 282971 280407 277686 274281
57861 274281 270588 267946 267278 268179 269630 271262 273566 277043 281528 286534 291996 298290 305416 312613 319159
57846 319159 325186 331139 336693 341037 344202 347172 350477 353506 355549 356684 357182 356905 355922 355085 355206
57831 355206 356157 357365 358672 360057 361051 361256 361081 361209 361674 362122 362599 363251 363537 362667 360766 358841 357601
57814 357601 356948 356540 356158 355551 354502 353064 351190 348249 343541 337242 330256 323208 316204 309439 303267
57799 303267 297591 292006 286691 282413 279375 276816 274251 272496 272769 274932 277221 277881 276872 275875 276683
57784 276683 279559 283188 286130 288133 289964 292353 295466 299199 303486 308177 312929 317421 321604 325617
57770 325617 329419 332489 334059 333882 332708 331605 330750 329274 326384 322154 317044 311172 304379 296625 288078
57755 288078 279275 271408 265727 262139 258961 254700 249612 244997 241599 239406 238402 238457 238746 238348 237356
57740 237356 236601 236416 236513 236854 237545 237868 236607 233699 230650 228864 228315 228236 228325 228728 229442 230384 231694 233391
57722 233391 234975 235805 235797 235459 235282 235250 234815 233357 230852 228031 225609 223489 221146 218696 216944 216287 216187
57705 216187 215957 215463 214724 213426 211347 208919 206867 205475 204600 204177 204249 204586 204747 204597 204552 205166 206592
57688 206592 208428 210059 211105 211560 211606 211511 211827 213408 216853 222032 228576 236841 247991 263073 282452
57673 282452 306320 335343 370466 412367 461317 517071 578182 641321 701732 754565 795732
57662 795732 821700 829328 816846 785280 738690 682778 623154 564452 510025 461623 419387 382793
57650 382793 351670 326027 305111 287472 272188 259365 249110 240683 233241 226912 222340 219451
57638 219451 217304 215123 212883 210915 209421 208477 208077 208057 208153 208167 207974 207529 206957 206399 205650 204333 202621
57621 202621 201231 200363 199227 197188 194787 192906 191433 189676 187800 186770 186915 187471 187637 187237 186278 184767
57605 184767 183180 182244 181901 181218 179706 178040 177001 176303 175078 173132 171158 169804 168950 167926 166223
57590 166223 164007 161877 160071 158136 155675 153178 151525 150783 150097 148855 147373 146281 145788 145740 145855 145656
57574 145656 144644 142843 140896 139388 138315 137288 135950 134153 132109 130346 129122 127934 126091 123747
57560 123747 121782 120651 120022 119642 119849 120954 122759 124936 127312 129532 131084 132010 133015 134509 136019
57545 136019 136929 137217 137060 136258 134612 132463 130354 128439 126636 125065 123974 123468 123559 124180 124909 125103 124624
57528 124624 124079 124018 124315 124614 124972 125624 126507 127409 128263 128950 129127 128714 128271 128531 129724 131527 133372 134704
57510 134704 135350 135904 137227 139329 141260 142353 142945 143526 143929 143932 143953 144351 144579 143873 142409 140892 139276
57493 139276 136805 133313 129734 127188 126086 126084 126455 126481 125932 125086 124040 122347 119844 117507 116718 117791
57477 117791 119811 121801 123347 124126 123676 121982 119806 118128 117432 117471 117396 116194 113475 109897 106536 103918
57461 103918 102023 100927 100773 101178 101399 101296 101517 102477 103683 104383 104478 104376 104257 103891 103138 102293 101846 101974
57443 101974 102377 102670 102854 103200 103661 103819 103618 103703 104628 106049 107213 107989 108790 109684 110304 110669 111346 112591
57425 112591 113909 114793 115359 115899 116280 116235 115946 115823 115804 115342 114146 112588 111242 110267 109490 108944 109001 109826
57407 109826 111011 112024 112882 113952 115208 116147 116543 116707 116834 116640 116062 115713 116086 116711 116814 116481 116448 116942
57389 116942 117542 118205 119591 122119 125386 128766 132051 135177 137811 139614 140646 141164 141289 141145 141130 141708
57373 141708 142954 144383 145257 145115 144133 142942 141902 140716 138992 137010 135538 134952 134948 135120 135349 135586 135730
57356 135730 135852 136116 136386 136382 136379 137207 139220 141668 143504 144491 145111 145711 146245 146768 147621 148901 150037 150175
57338 150175 149037 147363 146390 146767 148030 149214 149869 150243 150621 150924 151004 150921 150710 150187 149236 148077 147051
57321 147051 146345 146146 146830 148673 151485 154771 158190 161607 164791 167341 169027 170059 170953 172150 173768
57306 173768 175708 177949 180621 183706 186766 189236 190953 192216 193311 194319 195427 197029 199229 201546
57292 201546 203464 205163 207377 210644 214987 220242 226231 232514 238407 243521 248130 252820 257943 263592
57278 263592 269874 276851 284299 291894 299729 308273 317651 327207 336075 344049 351585 359016 366094 372360
57264 372360 377746 382601 387254 391647 395475 398650 401535 404573 407784 410986 414601 419771 427268 436560
57250 436560 446343 455751 464507 472298 478875 484822 491335 498954 507136 515294 523490 531778 539726 547236
57236 547236 555179 564534 575372 587383 600818 616022 632369 648648 664493 680660 697877 716121
57224 716121 734961 753881 772233 789540 805929 821741 836766 850619 863783 877382 891728
57213 891728 905992 919671 933500 948328 963781 978834 993203 1007378 1021517 1035075 1047517
57202 1047517 1058699 1068399 1076048 1081354 1084916 1087887 1091073 1094635 1098657 1103672 1110364 1118919 1129048
57189 1129048 1140651 1154021 1169221 1185685 1202811 1220620 1239432 1259208 1279602 1300324 1320801
57178 1320801 1339760 1356012 1369858 1383038 1397109 1412418 1428756 1446341 1465698 1487106 1510656
57167 1510656 1536553 1564902 1595403 1627553 1661043 1695701 1731279 1767521 1804281 1841304 1878009
57156 1878009 1913694 1947932 1980659 2012049 2042416 2072085 2101193 2129733 2157770 2185445 2212696
57145 2212696 2239278 2265175 2290707 2315956 2340286 2362659 2382382 2399494 2414818 2430265 2449237
57134 2449237 2476290 2515693 2569844 2638948 2722134 2818408 2925921 3040355 3154847 3262408
57124 3262408 3358719 3442816 3515634 3578460 3632522 3679313 3720899 3759855 3798752 3839522 3883548
57113 3883548 3932496 3988746 4054817 4132881 4225369 4335662 4467529 4624078 4807882 5022202
57103 5022202 5271886 5563862 5908031 6318286 6812570 7412178 8141317 9026762 10096738
57094 10096738 11379219 12900150 14680828 16734158 19061723 21653315 24487701 27533761
57086 27533761 30754479 34114090 37579846 41107817 44615415 47959688 50941170 53337702
57078 53337702 54955632 55677250 55484600 54450983 52709287 50416927 47730807 44791630
57070 44791630 41713276 38579454 35450832 32377188 29404650 26575013 23922145 21469852
57062 21469852 19231210 17209150 15398934 13791231 12373259 11128534 10038085 9083207
57054 9083207 8246866 7513045 6866481 6293844 5784447 5329469 4921201 4553295 4220832
57045 4220832 3919593 3645644 3395712 3167278 2958000 2765628 2588639 2426253 2277547
57036 2277547 2141155 2016118 1902425 1800297 1709440 1629278 1559475 1500007 1451175 1413831
57026 1413831 1389066 1377245 1377550 1388427 1407919 1433212 1460438 1485310 1503557 1510446 1500769 1470649
57014 1470649 1419957 1352860 1275927 1195683 1117296 1044313 978573 920136 867762 820045 776397
57003 776397 737013 702049 671056 643171 617567 593633 571048 549988 531054 514750 501025
56992 501025 489427 479521 471149 464592 460606 459944 462624 467912 475078 483651 492710 500552 505551 506949
56978 506949 504460 497773 487082 473616 458806 443211 426971 410940 396503 384432 374738 367490
56966 367490 362938 360908 360977 363364 368842 377704 389518 403883 420473 438085 454498 467709 476735
56953 476735 481008 479764 472571 460025 443575 424998 406153 388575 372964 359372 348070 339707
56941 339707 334524 332112 332260 335462 342241 352539 366177 383306 403880 427016 451283 475201 497081
56928 497081 514810 526369 530426 526296 513895 494283 469883 443562 417480 392900 370502 350364
56916 350364 332039 315320 300749 288916 279523 271701 265051 259697 255398 251365 247116 242954 239365
56903 239365 236362 233692 231377 229799 229420 230598 233451 237673 242604 247820 253685 261219 271343 284346
56889 284346 299968 317712 336874 356386 374966 391439 404823 414157 418600 417849 412309 402822 390559
56876 390559 377199 364691 354328 346276 340369 337102 337425 341819 350211 362790 380337 403624 432872
56863 432872 467884 508250 553082 600666 648386 692879 730524 758278 774269 777629 768181 746858
56851 746858 716296 680429 643302 608296 577973 553887 536501 525913 522753 527938 541793 564243
56839 564243 595883 638018 691226 754403 825203 900548 976211 1046721 1106457 1150835 1176418
56828 1176418 1180743 1162939 1124575 1069696 1004005 933738 864346 799499 741276 691180 650427
56817 650427 619311 597219 583925 580395 587847 606445 635296 673211 718787 769858 823232 874774
56805 874774 919630 952960 971127 972268 955939 923053 876588 821530 763133 705211 650216 600198
56793 600198 556764 520450 491025 468502 453283 445394 444151 448684 458462 473304 493071 517108
56781 517108 543585 569588 592189 609267 619136 620030 610773 591851 565291 533539 498803 463060
56769 463060 427874 394100 362264 333229 308007 286928 269411 254588 241823 230778 221433 213984
56757 213984 208296 203566 198970 194519 190738 187654 184687 181520 178348 175247 171988 168704 166051 164302
56743 164302 162780 160671 158078 155849 154627 154400 154792 155371 155765 155802 155580 155217 154581 153474 152077 151010
56727 151010 150881 151843 153568 155530 157286 158689 159938 161423 163354 165545 167617 169309 170470 170864 170396
56712 170396 169608 169480 170375 171493 171825 171388 171042 171294 171880 172431 172866 173068 172875 172555 172650 173146 173438 173381 173638
56693 173638 174600 175645 176072 176130 176453 176884 176649 175476 173872 172438 171497 171333 172133 173639 175191 176218 176476
56676 176476 175967 174869 173435 171769 169883 168066 166788 166083 165506 164992 165172 166405 168085 169488 170740
56661 170740 172257 173748 174665 175289 176413 178088 179559 180460 181246 182417 184050 186089 188347 190158 190850
56646 190850 190753 191061 192409 194154 195259 195373 194905 194573 195126 196967 199759 202708 205386 207938 210473 212738
56630 212738 214477 215632 216077 215692 214796 213981 213351 212470 211254 210300 210003 209894 209293 208211 207154 206362 205703
56613 205703 205115 204660 204198 203452 202433 201563 201226 201338 201453 201269 200844 200229 199082 197035 194470 192426 191464
56596 191464 191006 190179 188880 187526 186220 184917 184122 184516 185839 186991 187389 187487 187783 188032 187827 187332 187029
56579 187029 187203 187994 189447 191140 192236 192427 192528 193652 196009 198861 201459 203675 205902 208752 212768
56564 212768 218077 224326 231159 238708 247369 257113 267233 276841 285502 293345 300542 306763 311252 313528
56550 313528 313925 313324 312446 311492 310306 308691 306593 304144 301490 298550 295186 291673 288620 286153 283611
56535 283611 280458 277149 274486 272413 270141 267363 264586 262217 260003 257565 254865 251933 248629 245041
56521 245041 241725 239253 237728 236868 236218 235197 233310 230621 227825 225673 224465 224109 224382 224991 225575 225754
56505 225754 225156 223661 221815 220788 221368 222992 224148 223806 222206 220363 219160 218859 219071 219173 218980 218926
56489 218926 219378 220062 220552 220937 221427 221630 220953 219601 218438 217888 217660 217505 217549 217807 218099 218526 219470 221015
56471 221015 222961 225289 227973 230434 231998 232872 233838 234976 235614 235630 235843 236845 238299 239640 240632 241011
56455 241011 240513 239586 239163 239382 239425 238971 238798 239411 240130 240220 240071 240509 241661 243182 244891 246423 246958 246110
56437 246110 244599 243419 242840 242769 243358 244514 245480 245693 245530 245456 245102 244098 243177 243326 244198 244449 243533 242193
56419 242193 241309 241137 241688 242992 244849 246889 248990 251160 253106 254419 255135 255642 256087 256332 256400 256497 256691
56402 256691 256878 256968 256809 256213 255358 254849 254936 255027 254410 253206 252171 251863 252455 253974 256172 258452 260433 262355
56384 262355 264514 266722 268805 271140 273974 276566 277889 278058 278324 279601 281604 283523 284962 286096 287223
56369 287223 288310 288909 288669 287960 287654 288097 288774 289201 289647 290606 292068 293712 295301 296524 297051 297237 298070
56352 298070 299856 301575 302237 302230 302578 303522 304626 305716 306741 307295 307329 307852 309801 312584 314920 316811 319406
56335 319406 323009 326618 329580 332475 336028 340165 344519 348958 353225 356805 359616 362187 364859 367312
56321 367312 369156 370428 371283 371665 371531 370919 369676 367564 364824 362235 360431 359458 359093 359233 359913 361163
56305 361163 362937 365047 367272 369641 372343 375266 378105 381119 385078 389953 394369 397083 398497 399899
56291 399899 401796 403884 406166 408994 412270 415698 419710 425092 431725 438600 445059 451190 457139 463064
56277 463064 469642 477587 486572 495605 504563 514371 525568 537681 550249 563517 577767 592796 608431
56264 608431 624944 642713 662026 683331 707084 733278 761721 792788 827382 866297 910300
56253 910300 960524 1017891 1082336 1153548 1232320 1320049 1417046 1522524 1636294 1759045 1890546
56242 1890546 2028762 2171155 2315811 2460693 2602789 2738601 2864823 2978172 3075362 3153741
56232 3153741 3211427 3246712 3258246 3246113 3211903 3157402 3084053 2993935 2890284 2776510 2655456
56221 2655456 2529912 2402926 2277017 2153700 2034096 1919335 1810017 1706143 1607961 1516205
56211 1516205 1431232 1352741 1280603 1215065 1155766 1101537 1051626 1006200 965231 927910 893692
56200 893692 862914 835649 810915 787871 767020 749332 734756 722353 711328 701154 691204 681132
56188 681132 671319 662299 654012 646126 638816 632690 628127 625012 622858 620983 618931 616950 615670 615202
56174 615202 615045 614950 615307 616529 618641 621520 624899 628121 630658 632940 635869 639461 642900 646027 649729
56159 649729 654618 660397 666814 674153 682353 690772 699338 708925 720096 732489 745928 761040 778088
56146 778088 796310 815222 835743 859299 886671 918422 955606 999191 1049382 1106095 1169391
56135 1169391 1238932 1313713 1392742 1475099 1558809 1640696 1718029 1789616 1854918 1913253 1964555
56124 1964555 2009853 2050197 2085912 2117296 2144698 2167028 2181441 2185745 2180414 2167416 2148020 2122562
56112 2122562 2091255 2053901 2009488 1957091 1896783 1829182 1755193 1677031 1598492 1523119 1452783
56101 1452783 1388645 1332220 1284410 1244530 1211522 1185243 1165456 1150576 1138822 1129846 1123936 1120301
56089 1120301 1117521 1115175 1113734 1113257 1113301 1113755 1114742 1116132 1117953 1120801 1125004 1129933 1134895 1140108 1146069
56074 1146069 1152695 1159844 1167929 1177241 1187421 1198217 1209908 1222396 1235015 1247883 1262164 1278184
56062 1278184 1294710 1311020 1328174 1347122 1367076 1387062 1407507 1428723 1449341 1468055 1485654
56051 1485654 1503455 1520861 1536424 1550403 1564359 1578953 1593862 1609146 1624966 1640593 1655315
56040 1655315 1669632 1684205 1698595 1712604 1727805 1745970 1766927 1789773 1815270 1845103 1879439
56029 1879439 1917039 1957143 1999614 2043972 2090017 2138675 2190609 2244789 2299996 2356854 2416720
56018 2416720 2479452 2543898 2609684 2677031 2745857 2816547 2890403 2967827 3047452 3128567 3212756
56007 3212756 3301426 3393705 3488730 3588036 3693372 3804119 3919395 4040744 4169979 4306249
55997 4306249 4448119 4596843 4754722 4921977 5098160 5284842 5483824 5694552 5916414
55988 5916414 6151725 6403371 6671723 6957225 7263773 7595957 7955387 8343440 8764928
55979 8764928 9224897 9724617 10265349 10853451 11497153 12201327 12970784 13815999 14750308
55970 14750308 15784716 16931625 18211149 19648395 21268782 23103683 25198725 27612049
55962 27612049 30411532 33685298 37555913 42183345 47767641 54566659 62914294 73218247
55954 73218247 85943933 101589012 120620571 143364873 169893706 199923821 232666988
55947 232666988 266637359 299625694 329041731 352468495 368010391 374295111 370482857
55940 370482857 356611452 334025851 305309778 273560728 241499998 210991391 183065120
55933 183065120 158160788 136348559 117487579 101338517 87620086 76024780 66239301
55926 66239301 57977429 50993949 45075166 40034626 35720484 32013168 28811178 26026056
55918 26026056 23588847 21448983 19563222 17891779 16403982 15078196 13894128 12831195
55910 12831195 11874225 11013588 10238733 9537213 8899997 8321870 7796269 7315164 6874009
55901 6874009 6471328 6103139 5762821 5446789 5155347 4887497 4639479 4408937 4196106
55892 4196106 4000153 3818237 3648730 3491759 3346195 3209540 3081149 2962319 2853033
55883 2853033 2751692 2657986 2572789 2495255 2423129 2355835 2294045 2236274 2179166 2121208 2063050
55872 2063050 2004250 1943147 1880234 1818410 1759334 1702416 1647653 1596427 1549009 1504177 1461885
55861 1461885 1423474 1388675 1355241 1322328 1291566 1263841 1237523 1210858 1183846 1156695 1128468
55850 1128468 1098460 1067244 1035513 1003359 971317 940609 911728 884162 857853 833435 810738
55839 810738 788656 766897 746539 728560 713053 699847 688437 677478 666009 655106 646608 640219
55827 640219 633679 625745 617060 608065 598184 587437 576785 566363 555204 543245 531850 521802
55815 521802 512479 503453 495190 487630 479866 471894 465056 460069 456230 453227 452140 453774 457443 462241
55801 462241 468215 475459 483247 490891 498483 506196 513759 521000 527798 533222 536006 536257 535316 533575 529867
55786 529867 523624 516100 508647 501110 492788 483750 474259 463945 452520 440446 428182 415655 403199
55773 403199 392103 383406 376916 372037 368763 367161 366602 366172 365322 363707 361061 357565 353605 348950 343049
55758 343049 336390 330474 325971 321899 317090 311480 305434 298868 291730 284491 277494 270523 263489 256789
55744 256789 250591 244644 239178 234957 232038 229500 226942 225087 224325 223816 222909 222297 222747 223634 223892 223647
55728 223647 223727 224050 223632 221907 219144 215785 212086 208227 204178 199753 195240 191597 189491 188574 188175 188231
55712 188231 189066 190732 193133 196343 200291 204463 208409 212134 215624 218441 220196 220947 220746 219326 216610
55697 216610 213000 208773 203842 198453 193394 188991 184611 179852 175527 172679 171162 170033 168977 168576
55683 168576 169450 171827 175747 180940 186611 191875 196377 200084 202715 203843 203504 202337 201117 200268 199619
55668 199619 198557 196741 194705 193388 193001 192909 192717 192808 193605 195022 196954 199599 202807 205805 208139 210385
55652 210385 213385 217169 221088 224540 227152 228797 229879 231102 232404 232581 230507 226398 221396 216336
55638 216336 211338 206176 200506 194042 186980 180019 173649 167760 162184 157156 152952 149593 147210 146101
55624 146101 146063 146259 146110 145713 145066 143702 141630 139781 138767 137920 136449 134866 134246 134482 134307 132937 130820
55607 130820 128795 127207 125861 124336 122331 120061 118150 116914 116056 115282 114713 114329 113637 112442 111362
55592 111362 110982 111017 110927 110836 111099 111449 111329 110738 110009 109181 108310 107958 108486 109217 109199 108558 108237 108639 109409 110382
55572 110382 111798 113622 115519 117528 119954 122620 124995 127140 129715 132903 136007 138246 139365 139294 137882
55557 137882 135244 131965 128652 125501 122378 119207 116289 114374 114110 115238 116647 117537 118056 118508 118577 118012
55541 118012 117450 117671 118389 118680 118387 118225 118641 119414 120372 121632 123137 124624 126040 127330 128019 127757 127135
55524 127135 127049 127329 126899 125334 123315 121493 119835 118311 117219 116455 115298 113374 111174 109257 107594
55509 107594 106047 104865 104247 103926 103608 103372 103255 102931 102174 101288 100729 100590 100683 100833 100834 100442 99642 98721 97991
55490 97991 97696 98109 99248 100516 101110 100934 100638 100700 100919 100854 100271 99101 97570 96465 96634 98000 99569
55473 99569 100535 100824 100537 99611 98283 97091 96092 94780 93133 91953 91697 91711 91307 90917 91430 92860 94443
55456 94443 95667 96460 96637 96018 95040 94581 95122 96483 98198 99625 99934 98705 96622 94981 94374 94287 93996
55439 93996 93354 92590 91878 91394 91381 91843 92420 92775 92930 93070 93235 93403 93647 94002 94326 94562 94957 95748 96669
55420 96669 97137 96979 96662 96673 96945 97117 97127 97220 97494 97806 98141 98677 99365 99787 99630 99076 98528 98137 97764 97274
55400 97274 96714 96360 96691 98040 100061 101775 102349 101735 100460 99102 98103 97695 97700 97670 97449 97260 97055 96375
55382 96375 95307 94939 96111 98132 99566 100019 100231 100616 100765 100469 100163 99985 99329 97902 96528 96236 96963
55365 96963 97728 97846 97474 97183 97373 97974 98462 98322 97714 97443 98065 99190 99910 99754 99013 98304 98038 98194 98459
55346 98459 98608 98762 99165 99778 100315 100613 100710 100617 100367 100284 100738 101558 102070 101901 101400 101105 101089 101044 100753 100211 99484
55325 99484 98596 97542 96366 95331 94885 95247 96129 97098 98038 98940 99504 99475 99208 99320 99786 99972 99568 98911
55307 98911 98359 97985 97940 98417 99107 99395 99291 99436 99922 99873 98668 96885 95540 94988 95106 95928 97398 98940
55289 98940 99945 100430 100691 100666 100211 99628 99324 99170 98789 98266 97998 98028 98125 98315 98763 99225 99257 98958 98915 99349
55269 99349 99788 99699 99068 98274 97766 97899 98767 100066 101346 102438 103453 104416 105167 105557 105558 105201 104644 104234 104248
55250 104248 104565 104802 104758 104620 104757 105392 106315 106931 106799 106218 105937 106136 106106 105248 103982 103175 102974 102785 102324
55231 102324 102099 102740 104202 105770 106630 106446 105616 105044 105430 106734 108333 109584 110115 109836 108965 107992 107364
55214 107364 107214 107412 107760 108025 108034 107836 107564 107085 106158 105064 104553 104873 105330 105311 105242 105954 107378 108577 108928
55195 108928 108629 108103 107533 107060 106852 106828 106723 106498 106306 106091 105663 105245 105368 106106 106856 107141 107206 107549 108207
55176 108207 108795 109037 108971 108769 108580 108485 108384 107973 107013 105675 104599 104558 105983 108630 111688 114270 115896
55159 115896 116606 116752 116701 116640 116592 116675 117202 118332 119694 120702 121220 121525 121596 121005 119739 118524 117956 117818 117759
55140 117759 118132 119419 121147 122163 121964 121083 120136 119169 118056 116949 116054 115364 114838 114593 114727 115144 115593
55123 115593 115811 115698 115527 115765 116430 116954 117003 117068 117706 118581 118998 119115 119678 120604 120847 119954 118833 118514 118874
55104 118874 119116 118894 118411 117881 117517 117716 118679 120069 121422 122646 123728 124342 124230 123712 123267 122862 122268
55087 122268 121832 122230 123429 124538 124894 124804 124927 125380 125778 125884 125852 125923 126243 126914 127930 129002 129647 129609 129089
55068 129089 128461 127849 127114 126193 125281 124667 124516 124814 125371 125848 125951 125780 125864 126655 127995 129192 129653 129386
55050 129386 128951 128917 129321 129630 129331 128515 127679 126963 125945 124404 122926 122395 123026 124227 125338 126179 126839
55033 126839 127263 127205 126566 125682 125183 125363 125769 125712 125218 125019 125473 126005 125984 125599 125340 125049 124172 122703 121190
55014 121190 119952 118969 118439 118677 119472 120197 120701 121391 122324 122929 122918 122851 123415 124541 125597 126149 126282 126436
54996 126436 127065 128194 129325 130073 130743 131759 132679 132638 131804 131443 132163 133023 132969 132331 132135 132525 132764 132418
54978 132418 131737 131036 130423 130017 129868 129743 129534 129662 130538 131760 132491 132526 132408 132545 132844 133228 133842 134584 135020
54959 135020 135058 135265 136212 137821 139594 141154 142374 143260 143960 144663 145218 145071 143915 142358 141622 142417 144169
54942 144169 145490 145426 144219 142857 142038 141790 141926 142431 143211 143859 144057 144016 144190 144654 145172 145755 146804 148593
54924 148593 150958 153590 156412 159587 163371 167998 173494 179580 185926 192441 199038 205115 209686 212261
54910 212261 213329 213662 213362 211844 208663 204067 198718 193162 187661 182322 177185 172263 167617 163424 159894
54895 159894 157090 154906 153194 151798 150523 149245 148172 147801 148390 149545 150573 151247 152005 153347 155267
54880 155267 157404 159619 162292 166041 171228 177593 184330 190606 196063 200831 205141 209100 212759 216034
54866 216034 218416 218951 216841 212152 205948 199725 194474 189995 185086 178772 171513 164935 160245 157195
54852 157195 154755 152420 150411 148772 146857 143870 139768 135469 132250 130854 130993 131670 132052 132043 132035 132297 132791
54835 132791 133407 134088 134749 135255 135578 135810 136009 136139 136188 136260 136491 136917 137436 137881 138139 138245 138299 138313 138226 138087
54815 138087 138100 138356 138576 138272 137254 136009 135518 136457 138451 140232 140758 140174 139483 139379 139684 139881 139782 139527
54797 139527 139314 139363 139890 140868 141936 142821 143635 144569 145415 145657 144993 143617 142072 140942 140583 140927 141578 142161
54779 142161 142543 142792 143155 144053 145778 147997 149882 150964 151674 152835 154912 158007 162239 167639 173806
54764 173806 180148 186488 193146 200388 208061 215733 222843 228655 232421 233811 233065 230597 226599 221157
54750 221157 214663 207893 201561 195876 190641 185804 181709 178633 176246 173917 171529 169628 168627 168190
54736 168190 167639 166722 165684 164786 164018 163282 162626 162270 162463 163277 164621 166591 169632 173966 178938 183480
54720 183480 187364 191461 196473 201916 206804 210850 214468 217884 220786 222728 223351 222348 219621 215419
54706 215419 210059 203701 196705 189881 183933 178885 174455 170687 167657 164929 162048 159375 157662 156869
54692 156869 156237 155566 155515 156351 157238 157266 156522 155655 154873 153965 152921 151983 151216 150535 150040 149894 149908 149600 148748
54673 148748 147670 146862 146491 146281 145874 145270 144884 145143 146161 147853 150098 152508 154251 154628 153853 152863 152280
54656 152280 151896 151260 150333 149378 148641 148391 148931 150190 151515 152196 152114 151695 151370 151288 151405 151621 151840 152061 152318
54637 152318 152489 152316 151825 151547 152029 153082 153785 153415 152355 151880 152859 154756 156154 156321 155939 156054 156717
54620 156717 157126 156899 156549 156611 156928 157099 157191 157546 158100 158265 157502 155862 154010 152853 152987 154291 156040 157419
54602 157419 157965 157615 156586 155260 153997 152971 152240 151897 151952 152110 151980 151523 151079 150901 150908 150939 150952 150929 150817
54583 150817 150655 150536 150402 150123 149821 149812 150116 150361 150268 149954 149635 149317 148916 148434 147852 147145 146497 146216 146277 146304
54563 146304 146154 146159 146531 146920 146967 147032 147879 149679 151686 152940 153097 152576 152039 151763 151462 150837 150210 150324 151374
54544 151374 152612 153195 153172 153248 153779 154484 155159 156137 157715 159395 160199 159861 159374 160022 161967 164137 165492
54527 165492 165977 166054 165905 165583 165506 166023 166667 166563 165618 164597 163980 163516 163099 163139 163617 163581 162337 160603 159714
54508 159714 160044 160938 161901 162983 164058 164579 164277 163557 162925 162416 161772 160922 160088 159588 159565 159790 159733 159084 158143
54489 158143 157491 157308 157259 157066 156884 157064 157784 158967 160356 161553 162193 162291 162348 162932 164081 165201 165681 165598
54471 165598 165596 166000 166325 165983 165251 165087 165996 167488 168738 169303 169182 168654 168274 168528 169240 169751 169867 170080 170576
54452 170576 170660 169706 168145 166892 166135 165338 164188 162913 161841 161233 161334 162043 162668 162608 162144 161984 162209 162343
54434 162343 162317 162633 163483 164445 165159 165682 166054 166145 166062 166098 166101 165545 164503 163817 163947 164291 164209 164103 164778 166118
54414 166118 167214 167677 168062 168855 169709 169984 169638 169218 169198 169647 170442 171385 172070 172005 171161 170280 170245 171191 172459
54395 172459 173480 174326 175311 176452 177627 178917 180401 181827 182830 183373 183629 183607 183239 182706 182293 181990 181554
54378 181554 180898 180096 179176 178287 177868 178161 178725 178929 178843 179070 179764 180435 180743 180820 180711 180211 179517 179387 180228
54359 180228 181508 182493 183166 184027 185303 186728 187845 188247 187793 186894 186307 186319 186380 185819 184716 183752 183430 183704
54341 183704 184165 184328 183909 183102 182450 182295 182528 182996 183789 184902 185975 186728 187471 188756 190659 192755 194750
54324 194750 196932 199967 204342 209856 215572 220536 224670 228695 233079 237378 240753 242732 243185 242038
54310 242038 239404 235724 231418 226688 221927 217796 214395 210804 206198 201097 196843 194045 192312 191303
54296 191303 191063 191224 190896 189758 188502 187715 186979 185692 184249 183584 183783 183908 183297 182455 182385 183342 184544
54279 184544 185037 184638 183958 183609 183572 183486 183350 183598 184435 185469 186181 186483 186609 186711 186863 187265 187989 188592 188439
54260 188439 187523 186622 186443 186839 187119 186908 186395 185852 185339 184964 185101 186035 187523 188934 189773 189931 189533 188817
54242 188817 188126 187734 187582 187369 187047 186989 187534 188490 189206 189068 187882 186039 184426 183925 184636 185726 186305 186321
54224 186321 186347 186617 186790 186643 186523 186850 187530 188143 188468 188556 188487 188398 188573 189165 189848 190106 189856 189459 189071 188411
54204 188411 187351 186336 185844 185626 184997 183845 182966 183230 184730 186856 188893 190370 191092 191209 191165 191275 191349
54187 191349 190963 190063 189079 188446 188225 188196 188130 187940 187743 187799 188155 188328 187674 186211 184857 184635 185766 187717
54169 187717 189909 192085 194059 195465 195912 195286 193775 191707 189466 187466 186072 185405 185260 185302 185376 185539
54153 185539 185753 185729 185224 184353 183428 182643 182215 182647 184332 186752 188570 188795 187638 186077 184914 184500 184879
54136 184879 185711 186260 186050 185485 185437 186245 187527 188922 190507 192352 194163 195601 196576 196982 196493 195041 193264
54119 193264 192057 191686 191686 191653 191799 192533 193738 194730 195021 194953 195384 196753 198599 200072 200786 201002 201135 201397
54101 201397 201845 202388 202632 202131 201075 200346 200495 200921 200575 199340 198104 197443 196940 196113 195362 195393 196101 196700
54083 196700 196869 197075 197721 198590 199344 200001 200620 200960 200891 200808 201188 201930 202540 202781 202752 202511 202143 202092 202787 203862
54063 203862 204335 203833 203128 203162 203972 204943 205758 206534 207238 207624 207751 208069 208786 209561 210086 210684 212030 214419
54045 214419 217541 220890 224166 227281 230275 233300 236494 239824 243205 246898 251500 257316 263863 270315
54031 270315 276351 282257 288237 294091 299636 304963 309998 314292 317616 320380 323016 325309 326876 328027
54017 328027 329370 330659 330863 329547 327544 326020 325483 325965 327474 329727 331950 333646 335426 338637 344295
54002 344295 352638 363376 375798 388719 400787 411002 418801 423740 425290 422815 415711 403920 388574
53989 388574 371764 355312 340012 326194 314389 304823 296754 289221 282187 276149 270797 265143 259111
53976 259111 253971 250701 248706 246749 244521 242617 241410 240614 239756 238512 236715 234539 232650 231746 231933
53961 231933 232789 233893 235018 235988 236789 237717 238995 240323 241211 241713 242358 243323 244269 245176 246756 249549 252965
53944 252965 255802 257625 259162 261348 264430 268176 272524 277648 283537 289828 296124 302230 308003 313095
53930 313095 317006 319516 321111 322906 325889 330038 334228 337224 338855 340142 342288 345676 349845 354236
53916 354236 358728 363484 368483 373445 378279 383437 389542 396599 403751 409984 414932 418822 421858 423986
53902 423986 425141 425311 424347 422185 419358 416823 414993 413235 410626 406949 402682 398267 393765 389054 383977
53887 383977 378387 372330 366151 360107 353937 347136 339667 332224 325776 321046 318182 316590 315069 312514
53873 312514 308717 304404 300507 297481 295230 293437 291893 290566 289319 287602 284745 280747 276504 273018
53859 273018 270644 269304 268960 269312 269486 268811 267779 267406 267629 267254 265742 264223 264249 266084 268676 270867
53843 270867 272215 273142 274830 278625 285029 293423 303128 314407 328058 344444 363476 385184 409475
53830 409475 435258 460373 482519 499931 511251 515389 511856 501183 484982 465651 445786 427426
53818 427426 411777 399581 391276 386446 383613 381341 379370 378070 377028 375131 372032 368530 365162 361331
53804 361331 356464 351226 346853 343711 341270 339134 337326 335814 334537 333855 334196 335225 336031 336223 336254 336543
53788 336543 336992 337591 338743 340499 342052 342643 342558 342600 342775 342204 340264 337171 333341 328816 323621 318264
53772 318264 313432 309379 305847 302480 299058 295452 291668 287985 284857 282538 280886 279522 278099 276354
53758 276354 274081 271277 268349 265926 264255 262863 261047 258651 256101 253709 251389 249238 247947 248200
53744 248200 249835 252025 254151 256116 257902 259352 260426 261251 261805 261940 261837 261991 262532 262927 262593 261545
53728 261545 260233 259086 258420 258496 259271 260364 261553 263122 265445 268442 271726 275010 278018 280289 281512
53713 281512 281969 282215 282453 282604 282881 283755 285262 286781 287688 288006 288395 289717 292623 297211 302953 309082
53697 309082 315082 320661 325422 328883 330849 331558 331516 331422 332026 333595 335481 336662 336860 336785 337194 338070 338840
53680 338840 339036 338507 337299 335662 334014 332635 331378 329837 327794 325501 323576 322575 322528 322886 323057 322957
53664 322957 322936 323198 323506 323412 322675 321564 320822 321067 321987 322393 321416 319471 317655 316498 315840 315628 315987 316561
53646 316561 316669 316408 316809 318479 320719 322396 323174 323428 323503 323661 324389 326040 328281 330385 332019 333386
53630 333386 334745 336207 337879 339808 341822 343795 346035 349073 352987 357182 360867 363620 365570 367245
53616 367245 369225 371839 375143 379141 383808 388875 393813 398184 401869 404938 407589 410275 413470 417144
53602 417144 420772 424043 427191 430415 433372 435598 437085 438068 438569 438534 438118 437448 436344 434740 433162 432289
53586 432289 432113 431930 431113 429583 427674 425849 424418 423253 421913 420207 418398 416603 414496 412008 409829
53571 409829 408582 407822 406597 404792 403169 402184 401546 401035 400988 401746 403164 404846 406470 407802 408848 410036
53555 410036 411767 413799 415643 417544 420372 424452 429196 434111 439389 445199 451190 457224 463967 472037
53541 472037 480997 489798 497943 505626 512939 519523 524943 529008 531837 533964 536146 538647 540913 542500
53527 542500 544229 547804 554173 562682 572013 581549 591618 602731 614985 628208 642416 657898 674816
53514 674816 692865 711555 730842 751198 772962 795938 819847 844861 871264 898674 926027
53503 926027 952418 977682 1002163 1026225 1050060 1073668 1096852 1119365 1141242 1162875 1184596
53492 1184596 1206284 1227473 1247797 1267228 1285957 1304211 1322230 1340293 1358615 1377155 1395564
53481 1395564 1413416 1430560 1447236 1463755 1480044 1495542 1509554 1521645 1531666 1539485 1544906 1547868
53469 1547868 1548562 1547123 1543297 1536704 1527536 1516774 1505496 1494017 1481866 1468496 1453824 1438152
53457 1438152 1421857 1405234 1388423 1371268 1353360 1334358 1314298 1293492 1272209 1250560 1228680
53446 1228680 1206886 1185597 1165195 1146078 1128717 1113486 1100433 1089393 1080413 1073784 1069445 1066524
53434 1066524 1063806 1060670 1057337 1054340 1052154 1051331 1052446 1055560 1060068 1065427 1071818 1079797 1089515 1100656
53420 1100656 1113024 1126753 1141909 1158255 1175501 1193632 1212943 1233855 1256690 1281504 1308159
53409 1308159 1336571 1366767 1398666 1432057 1466921 1503497 1541934 1582180 1624407 1669086 1716247
53398 1716247 1765104 1814918 1865937 1918910 1973908 2030206 2087147 2144420 2201604 2258189 2314149
53387 2314149 2369854 2425303 2480012 2533635 2586013 2636476 2683899 2727719 2768190 2805340 2838407
53376 2838407 2866781 2890822 2911161 2927772 2940311 2948809 2953183 2952386 2944909 2930194 2908955 2882154
53364 2882154 2850168 2812972 2770626 2723509 2672431 2618600 2563145 2506701 2449679 2392822 2337085
53353 2337085 2283004 2230615 2180007 2131507 2085156 2040414 1996673 1953855 1912209 1871615 1831376
53342 1831376 1790891 1750448 1711223 1674350 1640080 1607925 1577505 1548913 1522336 1497744 1475180
53331 1475180 1454944 1437091 1420956 1405565 1390388 1375406 1360563 1345550 1330131 1314389 1298594
53320 1298594 1283084 1268320 1254802 1242821 1232299 1222871 1214146 1206088 1199290 1194688 1192678 1192606 1193282
53307 1193282 1194009 1194969 1196808 1200124 1205227 1212032 1220136 1229314 1240009 1253142 1269316 1288291 1309283
53294 1309283 1331637 1355175 1379992 1405964 1432503 1458918 1485005 1511072 1537226 1562876 1587218
53283 1587218 1610011 1631456 1651299 1668548 1682331 1692797 1700853 1707058 1711062 1712160 1710086 1705006
53271 1705006 1696984 1685961 1672364 1657172 1640914 1622957 1602335 1579128 1554425 1529052 1503044
53260 1503044 1476389 1449430 1422243 1394407 1365920 1337622 1310043 1282471 1254008 1225094 1197026
53249 1197026 1170167 1143606 1116660 1089756 1063572 1038062 1012805 987782 963378 939888 917342
53238 917342 895634 874636 854381 835272 817859 802303 788295 775538 764037 753839 744748 736404
53226 736404 728348 719940 710582 700217 689375 678505 667400 655412 642123 627762 613130 599114
53214 599114 586018 573350 560441 547318 534725 523343 513287 504320 496150 488411 480830 473643
53202 473643 467453 462276 457014 450333 442020 433153 424899 417461 410326 403271 396694 390886 385422 379718
53188 379718 374055 369433 366279 363884 361459 359096 357092 354916 351859 348476 346193 345316 344458 342392 339606
53173 339606 337405 336192 335467 335026 335204 335994 336703 336694 336092 335578 335744 336627 337669 338063 337374 335911 334456 333702
53155 333702 333898 334798 335838 336533 336805 336774 336303 335144 333571 332363 331878 331551 330593 328871 326806 324813 323240
53138 323240 322472 322567 323016 323298 323431 323600 323541 322868 321770 320787 320062 319427 319025 319113 319338 319068 318559 318905 320486
53119 320486 322226 322934 322798 322945 323899 325171 326137 326664 326808 326407 325288 323699 322323 321779 321984 322096 321277
53102 321277 319588 317832 316483 315139 313296 311209 309527 308321 307032 305345 303560 302032 300741 299620
53088 299620 298905 298748 298783 298429 297564 296549 295633 294669 293495 292360 291770 292002 292875 293893 294546 294610 294331 294273
53070 294273 294791 295619 296112 295928 295334 294787 294363 293772 292888 292086 291924 292567 293583 294401 294971 295861 297609 300047
53052 300047 302494 304587 306620 308873 310922 311930 311638 310763 310365 310984 312401 314011 315331 316219 316674 316458
53036 316458 315067 312360 309058 306243 304212 302196 299413 296147 293463 292058 291735 291916 292270 292729 293233
53021 293233 293663 293916 293935 293765 293642 293901 294655 295610 296293 296463 296234 295901 295718 295792 296035 296164 295875 295117 294223
53002 294223 293671 293643 293874 294003 294019 294214 294714 295303 295774 296227 296797 297293 297480 297631 298367 299837 301390 302299 302514
52983 302514 302462 302382 302241 302177 302666 304085 306314 308788 310904 312445 313789 315604 318113 320741 322710 323924
52967 323924 325007 326466 328154 329612 330633 331374 332138 333140 334248 334888 334476 333159 331846 331251 331070 330341
52951 330341 328521 325994 323566 321670 320090 318365 316427 314738 313643 312750 311339 309435 307953 307523 307664
52936 307664 307508 306933 306389 305930 305108 303764 302240 300739 299086 297362 296151 295780 295721 295191 294116 293198 293184
52919 293184 294342 296392 298636 300249 300823 300678 300472 300615 301156 301948 302620 302602 301723 300763 300880 302242 303679
52902 303679 304048 303598 303545 304453 305684 306514 307122 308017 308913 308875 307567 305769 304441 303726 303147 302452 301840 301555
52884 301555 301650 302076 302644 302875 302239 300670 298697 296962 295726 294846 294119 293570 293439 293876 294649 295315 295774 296416
52866 296416 297534 298803 299633 299910 300074 300599 301717 303560 306155 309292 312680 316243 319912 323120 325000
52851 325000 325141 323827 321496 318430 315054 311953 309270 306495 303172 299496 295974 292859 290247 288321
52837 288321 287056 286000 284817 283870 283725 284201 284421 283830 282757 281891 281535 281498 281421 281074 280476 279846 279351 278931
52819 278931 278452 277944 277523 277175 276797 276428 276238 276310 276540 276777 277052 277758 279539 282702 286657 290290 293084
52802 293084 295437 297600 298767 297883 295102 291767 288958 286686 284558 282537 280785 279287 277949 276673
52788 276673 275098 272746 269809 267394 266500 266963 267814 268428 268931 269635 270623 271818 273020 273845 274082 274133 274627
52771 274627 275494 275934 275532 274978 275222 276304 277494 278402 279387 280819 282451 283706 284243 284060 283352 282548 282257
52754 282257 282878 284300 286157 288220 290315 292030 292913 292971 292672 292369 291972 291365 290913 291338 293047 295671 298276
52737 298276 300130 301321 302646 304762 307521 310180 312132 313254 313693 313688 313610 313849 314428 314928 314935 314433 313657 312759
52719 312759 311754 310712 309848 309343 309054 308396 306757 304178 301455 299265 297370 295123 292661 290978 290660
52704 290660 291135 291480 291509 291700 292430 293731 295434 297068 297871 297504 296601 296103 296121 295967 295254 294409 294031 294326
52686 294326 295352 297254 299835 302275 303798 304533 305349 306788 308457 309579 309935 310051 310503 311272 311909 312181
52670 312181 312290 312466 312644 312693 312746 313064 313691 314419 315014 315331 315315 315081 314888 314870 314946 315158 315930 317631 319949 322013
52650 322013 323250 323908 324640 325689 326579 326580 325482 323924 322836 322507 322365 321762 320731 319773 319170 318833 318711
52633 318711 318911 319458 320274 321487 323481 326500 330358 334577 338687 342407 345707 348710 351403 353418 354175
52618 354175 353226 350478 346338 341749 337771 334773 332190 329376 326543 324497 323534 323041 322134 320393 318064
52603 318064 315928 314917 315373 316563 317301 317103 316427 315836 315460 315376 315922 317271 319060 320767 322213 323422
52587 323422 324293 324744 324954 325112 325063 324551 323769 323338 323711 324796 326207 327698 329231 330734 331967 332709 333058
52570 333058 333396 333978 334660 335162 335410 335459 335164 334276 332839 331213 329737 328609 328019 327949 327789 326651 324411
52553 324411 322124 321089 321599 322878 324020 324703 325094 325445 325886 326372 326694 326644 326223 325663 325169 324739 324299 323946
52535 323946 323880 324045 324041 323602 323030 322860 323135 323349 323187 322963 323150 323818 324726 325596 326005 325464 324082 322840 322736
52516 322736 323850 325704 328135 331219 334640 337957 341338 345233 349336 352742 355212 357405 359650 361338
52502 361338 361871 361432 360354 358494 355726 352432 348958 345245 341504 338589 336945 335769 334094 332257 331357
52487 331357 331490 331545 330757 329521 328503 327788 327254 327160 327868 329342 331275 333449 335703 337770 339476 340929
52471 340929 342288 343428 344049 344129 344104 344564 345844 347947 350808 354445 358736 363116 366782 369263 370665 371263
52455 371263 371028 369628 366789 362612 357690 352962 349230 346708 345031 343641 342009 339737 336870 334069
52441 334069 332016 330613 329259 327950 327475 328230 329436 329941 329417 328411 327640 327618 328501 329820 330651 330495 329761
52424 329761 329091 328652 328464 328850 329896 330892 331094 330852 331262 332869 335323 338149 341132 344066 346866 350015
52408 350015 354267 359797 366207 373344 381542 391005 401601 413256 425812 438234 448620 455399 458164
52395 458164 457213 452877 445646 436427 426272 416068 406631 398685 392371 387156 382538 378630 375785 374010
52381 374010 373051 372810 373350 374607 376386 378535 380945 383518 386274 389370 392906 396885 401422 406731 412688
52366 412688 418550 423293 426208 427261 427053 426442 425923 425269 423944 421921 419811 418161 416945 415890 415043
52351 415043 414757 415303 416638 418505 420597 422770 425106 427685 430343 432800 434970 436958 438887 441020 443969
52336 443969 448298 453874 460031 466489 473756 482453 492597 503755 515594 528065 541313 555625 571252
52323 571252 588087 605690 623693 642019 660634 679387 698130 716729 734891 752352 769394
52312 769394 786833 805292 824755 844923 865644 886801 908100 929205 949868 969869 989151
52301 989151 1008077 1027089 1045912 1063585 1079518 1094069 1107692 1119983 1129992 1137102 1141177 1142222
52289 1142222 1140448 1136455 1130915 1124218 1116748 1109115 1101592 1093665 1084858 1075860 1068126 1062293 1057605 1053041
52275 1053041 1048519 1044758 1042452 1041857 1042931 1045582 1049810 1055705 1063311 1072580 1083572 1096488 1111207
52262 1111207 1126959 1142839 1158600 1174538 1190701 1206656 1222122 1237324 1252554 1267741 1282729
52251 1282729 1297633 1312576 1327201 1340685 1352218 1361323 1367836 1371734 1373044 1371855 1368414 1363100 1356235
52238 1356235 1347960 1338471 1328280 1318039 1308114 1298501 1289111 1279790 1270036 1259121 1246799 1233753 1221095
52225 1221095 1209519 1199047 1189478 1180814 1173239 1166847 1161493 1156840 1152524 1148342 1144453 1141433 1140015
52212 1140015 1140487 1142297 1144431 1146345 1148389 1151202 1154936 1159360 1164481 1170561 1177444 1184368 1190635 1196217
52198 1196217 1201424 1206258 1210412 1213822 1217004 1220813 1225967 1232599 1240075 1247299 1253458 1258551 1263156 1267676
52184 1267676 1271887 1275080 1276514 1275792 1273030 1268673 1263034 1256040 1247536 1237772 1227373 1216923 1206822
52171 1206822 1197530 1189571 1183042 1177408 1172092 1167195 1163440 1161506 1161624 1163626 1167043 1171169 1175458 1179942
52157 1179942 1184979 1190487 1195731 1200055 1203451 1206159 1207988 1208495 1207711 1206275 1204880 1203954 1203823 1204748 1206616
52142 1206616 1208959 1211486 1214311 1217377 1219980 1221273 1221200 1220469 1219590 1218431 1217021 1216384 1217947 1222031 1227524
52127 1227524 1233432 1240450 1250459 1264533 1281988 1301545 1322907 1346803 1373792 1403502 1434890 1466861
52115 1466861 1498625 1529847 1560494 1590395 1618956 1645542 1670051 1692841 1714146 1733853 1751848
52104 1751848 1768272 1783432 1797721 1811617 1825425 1838941 1851613 1863084 1873342 1882373 1889959 1895841
52092 1895841 1899713 1900982 1898966 1893403 1884468 1872197 1856398 1837388 1816402 1794902 1773735 1753279
52080 1753279 1734119 1717147 1703028 1691869 1683405 1677323 1673422 1671621 1671840 1673849 1677370 1682363 1689063
52067 1689063 1697653 1708051 1720049 1733429 1747836 1762745 1777667 1792308 1806532 1820371 1834035
52056 1834035 1847625 1860803 1873105 1884575 1895662 1906393 1916041 1923719 1928862 1931044 1929971 1925968
52044 1925968 1919942 1912363 1902700 1890283 1875387 1859016 1842008 1824799 1807755 1791108 1774762 1758598
52032 1758598 1742837 1727726 1713074 1698462 1683619 1668271 1652067 1635203 1618725 1603458 1588889
52021 1588889 1573749 1557516 1540600 1523337 1505746 1488320 1472098 1457609 1444405 1431899 1420107
52010 1420107 1409272 1399271 1389658 1379892 1369389 1357880 1345827 1333879 1321711 1307989 1291858 1273813
51998 1273813 1254692 1234442 1212634 1189814 1167497 1146821 1127841 1110254 1094226 1080112 1067587
51987 1067587 1055478 1042606 1028687 1014347 1000357 987032 974322 962076 949960 937385 923938
51976 923938 909770 895237 880315 864802 848981 833580 819141 805934 794502 785630 779612 776091
51964 776091 774848 776111 779763 784914 790812 797706 806119 815480 824182 830953 835592 838244 838468 835431
51950 835431 828821 819359 808378 797100 786367 776853 769129 763298 758908 755696 754379 756199 761549
51937 761549 769399 778228 787119 795800 804062 811551 817867 822491 824686 823758 819377 811623 800918 788044
51923 788044 773905 759011 743390 727125 710688 694531 678664 662980 647829 633940 621880
51912 621880 611776 603456 596616 591009 586629 583609 581909 581459 582729 586675 593739 603198 613947 625645
51898 625645 638588 652638 666798 679841 690925 699498 704953 706498 703305 695003 682343 667225
51886 667225 651702 636967 623502 611864 602764 596459 592745 591698 593910 599749 608806 620348 634044
51873 634044 650018 668463 689459 712912 738279 764333 789404 811907 830578 844419 852687 855016
51861 855016 851503 842607 829034 811673 791600 770048 748320 727657 709174 693798 682076 673864
51849 673864 668343 664549 661906 660144 658753 656750 653114 647409 639922 631343 622413 613812 606083 599422
51835 599422 593536 587936 582559 578027 575168 574344 575367 577881 581535 585802 589956 593317 595344 595580 593852
51820 593852 590557 586383 581664 576374 570835 565965 562535 560610 559952 560551 562408 565183 568494 572196 575914
51805 575914 578708 579787 579235 577444 574203 569189 563083 557236 552158 547292 542481 538626 536396 535081
51791 535081 533448 531186 528847 526803 525041 523689 522991 522753 522440 521886 521403 521181 521086 521086 521342 521607 521080 519262
51773 519262 516717 514605 513585 513539 514328 516402 520525 527062 535685 545620 556073 566615 577365 588693
51759 588693 600400 611138 618976 622808 623013 620533 615482 607082 594947 580038 564209 549152 535923
51746 535923 525076 516757 510668 506292 503258 501394 500564 500759 502379 506003 511685 518683 526190 534155
51732 534155 543030 552714 562155 570157 576261 580619 583322 584315 583843 582482 580541 577786 573986 569486 564982
51717 564982 560870 557033 553164 549065 544774 540661 537355 535358 534673 534966 536049 537965 540682 544011 548010
51702 548010 553223 560294 569300 579552 589999 599778 608439 615771 621530 625446 627595 628650 629586 630987
51688 630987 632634 633812 633989 633126 631293 628087 622694 614660 604510 593422 582429 572212 563507 557121
51674 557121 553267 551259 550235 549978 550707 552270 553985 555222 555715 555277 553665 550990 547967 545474 543843
51659 543843 542713 541567 540342 539452 539204 539307 539153 538735 539074 541637 547351 556174 567249 579211 590603
51644 590603 600386 608014 612833 613681 609552 600681 588602 575111 561380 547939 535025 522814 511603
51631 511603 501938 494333 488813 484930 482196 480274 478812 477496 476304 475425 474830 474197 473261 471984 470395
51616 470395 468694 467484 467409 468401 469651 470514 471017 471366 471409 470903 469949 468890 468044 467777 468481 470219 472624
51599 472624 475463 479041 483862 490205 498235 508139 519807 532655 546053 559626 572794 584412 593323
51586 593323 599096 601923 602098 599972 596170 591391 586219 581525 578751 579322 583936 592749 605838 622964
51572 622964 643275 666034 691456 720145 751841 785600 821079 858763 898843 940817 984415
51561 984415 1030048 1077954 1127765 1179442 1233903 1291948 1352962 1415079 1475984 1532798 1581690
51550 1581690 1618695 1641178 1648120 1639205 1614347 1574294 1521217 1458410 1389392 1317002 1243007 1168591
51538 1168591 1095416 1025970 962509 905865 855703 811710 773959 742222 715625 693175 674133
51527 674133 657720 643006 629501 617489 607429 599172 592036 585495 579552 574495 570461 567196 564141
51514 564141 560788 557065 553335 550076 547615 545963 544582 542411 538572 533166 527100 521074 515129 509293
51500 509293 504057 499837 496369 493187 490466 488882 488715 489588 491088 493158 495746 498489 500980 503143 505199
51485 505199 507367 509610 511512 512381 511742 509746 506945 503687 500071 496408 493250 490748 488325 485339 481862
51470 481862 478562 475996 474263 473200 472625 472496 473040 474617 477206 480149 482679 484616 486238 487561 488211
51455 488211 488079 487666 487484 487390 486838 485658 484329 483538 483776 485379 488699 494048 501568 511292 523253 537383
51439 537383 553292 570279 587588 604539 620327 633821 643858 649867 652157 651598 649108 645411 641020
51426 641020 636073 630119 622223 611568 598174 583229 568725 556559 547668 541771 537825 534786 532128
51413 532128 529888 528304 527427 527062 527104 527765 529302 531601 534229 536875 539508 542104 544531 546795 549086
51398 549086 551456 553731 555900 558329 561366 565058 569497 575159 582538 591710 602639 615738 631701
51385 631701 651039 674288 702581 737334 779301 828424 884685 948553 1020372 1099734 1185535
51374 1185535 1276070 1368759 1460216 1546997 1625993 1693955 1747229 1782675 1798760 1795509 1773705
51363 1773705 1734639 1680434 1613980 1538356 1456539 1371498 1286091 1202617 1122644 1047269 977395
51352 977395 913763 856849 806749 763107 725287 692765 665197 641952 621869 603853 587585
51341 587585 573310 560991 550039 539840 530181 521117 512728 505172 498763 493861 490658 488952 487997
51328 487997 486836 485114 483430 482534 482282 481850 480897 479985 479671 479707 479459 478743 477968 477605 477775 478214 478552 478802
51310 478802 479586 481531 484345 486992 488968 490935 493656 496744 499017 499886 499795 499379 498740 497603 495667 492648
51294 492648 488376 483080 477375 471883 467012 463069 460189 458085 456211 454389 453028 452666 453545 455735 459275
51279 459275 463916 469029 474105 479202 484649 490447 496233 501664 506549 510769 514393 517851 521665 526011
51265 526011 530699 535399 539621 542655 544039 544078 543415 542086 539505 535507 530818 526068 520887 514555 507277
51250 507277 500213 494250 489320 484969 481071 477747 474957 472527 470436 468828 467721 466889 466009 464879 463528
51235 463528 462142 460893 459815 458881 458166 457852 458055 458665 459344 459706 459642 459485 459708 460397 461245 462145 463469 465441
51217 465441 467532 468932 469517 469908 470606 471540 472558 473860 475714 478106 480910 484112 487643 491240 494752
51202 494752 498312 502009 505596 508814 511763 514662 517363 519363 520279 520145 519342 518347 517373 516153 514293
51187 514293 511952 509886 508635 508024 507717 507874 508790 510232 511632 512812 513980 515064 515601 515296 514324 513132
51171 513132 512305 512474 513725 515139 515516 514731 513802 513441 513122 511831 509280 506036 502897 500529 499283 498926
51155 498926 498722 498087 496946 495316 493032 490221 487543 485385 483173 480153 476643 473822 472359 471919 472031
51140 472031 472633 473529 474047 473766 473248 473528 475006 477161 479175 480548 481207 481398 481565 482150 483386 485242 487440
51123 487440 489529 491117 492198 493195 494576 496546 499101 502155 505458 508665 511830 515641 520753 526837
51109 526837 532625 537004 539807 541486 542385 542627 542445 542134 541632 540455 538199 535028 531624 528783 527003
51094 527003 526223 525857 525244 524262 523388 523067 523144 523076 522606 521995 521613 521578 521837 522371 523118 523837 524291 524585 525162 526415
51074 526415 528344 530660 533155 535859 538787 541611 543790 545156 546240 547796 549935 551980 553370 554635
51060 554635 557237 562425 570246 579613 589070 597514 604464 610112 615241 620885 627755 635841 644675 653991
51046 653991 664024 675068 686919 698997 710949 722840 734645 745867 755867 764409 771580 777253
51034 777253 780908 781999 780300 775861 768811 759279 747354 733033 716401 697946 678698 659937 642812
51021 642812 628130 616287 607317 601119 597695 596945 598310 600976 604626 609606 616055 623214 630127 636861
51007 636861 644401 653326 663141 673046 682837 692758 702983 713630 724859 736425 747466 757303 766377
50994 766377 775869 786499 798147 810592 824004 838594 854343 871284 889540 908859 928546 948208
50982 948208 968182 988941 1010498 1032714 1055622 1078837 1101051 1120968 1138659 1155239 1171211
50971 1171211 1185997 1199374 1212581 1227508 1245323 1266553 1292020 1322893 1359870 1402940 1452004
50960 1452004 1507161 1568172 1634055 1703423 1774896 1846996 1918031 1986498 2051467 2112277 2167927
50949 2167927 2217108 2258900 2293234 2320676 2341943 2357679 2368494 2375068 2378207 2378761 2377321 2373932
50937 2373932 2368232 2359915 2348972 2335373 2318767 2298760 2275504 2249795 2222489 2193835 2163297 2129888
50925 2129888 2092694 2051364 2006326 1958457 1908372 1855982 1800854 1743045 1683503 1623675 1564814
50914 1564814 1507748 1453109 1401467 1353146 1308050 1265873 1226466 1189974 1156719 1127054 1101134
50903 1101134 1078591 1058487 1039954 1022945 1008069 995619 985090 975786 967484 960216 953745 947723
50891 947723 942228 937683 934323 932063 930763 930151 929624 928715 927868 928177 930146 933149 936317 939553 943439
50876 943439 948555 955216 963476 972946 982922 993056 1003737 1015537 1028586 1042859 1058690 1076368
50864 1076368 1095440 1115137 1135635 1158339 1184664 1214933 1248782 1286318 1328499 1376353 1430124
50853 1430124 1489429 1554283 1625803 1705755 1795472 1895472 2005911 2126793 2257556 2397110
50843 2397110 2544801 2700818 2864959 3035264 3208517 3381836 3552873 3718510 3874395
50834 3874395 4016285 4141316 4247615 4333313 4396614 4436701 4454233 4451128 4430132 4394433 4347405
50823 4347405 4292745 4234700 4177599 4124723 4077734 4037260 4003485 3975860 3952705 3931735 3910731
50812 3910731 3887234 3857862 3818816 3767405 3702713 3624738 3533550 3429662 3314781 3191476 3062071
50801 3062071 2928321 2792235 2656680 2524806 2399003 2280744 2171191 2071446 1982084 1902913
50791 1902913 1833528 1773823 1723712 1682575 1649289 1622676 1601649 1585108 1572117 1562096 1554568
50780 1554568 1548790 1543965 1539640 1535472 1530817 1525113 1518580 1511852 1504757 1496133 1485089 1471894 1457280
50767 1457280 1441434 1424088 1405173 1384905 1363543 1341503 1319431 1297675 1275978 1254107 1232647
50756 1232647 1212641 1194614 1178444 1164125 1152115 1142864 1136400 1132534 1131221 1132608 1136915 1144325 1154891
50743 1154891 1168560 1185428 1205871 1230246 1258510 1290369 1325767 1365145 1409281 1458935 1514492
50732 1514492 1575765 1642288 1713865 1790529 1871876 1956844 2044550 2135018 2228559 2324610 2421545
50721 2421545 2517406 2610210 2697693 2777505 2847872 2907531 2954876 2987727 3004371 3004534 2989131 2959551
50709 2959551 2917744 2866825 2810975 2754384 2700250 2650642 2606960 2570280 2541234 2519698 2504658
50698 2504658 2494413 2486899 2479915 2471258 2458851 2440818 2415570 2381957 2339365 2287619 2227026 2158915
50686 2158915 2086065 2011983 1939316 1869259 1802572 1740554 1684528 1634947 1591858 1555967 1528394
50675 1528394 1509399 1498205 1494175 1497330 1507422 1523375 1544151 1569521 1599293 1632162 1665986 1698954
50663 1698954 1729965 1758192 1783077 1804822 1824272 1842043 1858150 1872552 1885581 1897574 1908484
50652 1908484 1918222 1927195 1936118 1945399 1955051 1965214 1976470 1989571 2005128 2023728 2046028 2072465
50640 2072465 2103044 2137637 2176303 2218927 2264751 2312904 2363481 2417469 2475267 2535768 2597357
50629 2597357 2659324 2721672 2783813 2844200 2901002 2952229 2994970 3025371 3039985 3036888 3015485
50618 3015485 2976207 2921392 2856176 2787395 2720979 2660456 2607758 2564577 2532246 2510504 2497195
50607 2497195 2489531 2485431 2483388 2481441 2476922 2467393 2451407 2428189 2396968 2357054 2308395 2251709
50595 2251709 2188178 2119346 2047207 1973886 1901032 1829609 1760280 1693823 1631177 1573273 1520763
50584 1520763 1473705 1431628 1394028 1360752 1331737 1306730 1285589 1268590 1255947 1247215 1241732 1239472
50572 1239472 1240832 1245571 1252679 1261378 1271481 1282548 1293409 1303029 1311315 1318674 1325306 1331528 1338430
50559 1338430 1347530 1359831 1375516 1394305 1415784 1439654 1466087 1495627 1528342 1563242 1598915
50548 1598915 1634527 1669814 1704364 1737457 1768550 1797430 1823967 1848248 1871082 1893997 1918616
50537 1918616 1946158 1977391 2012670 2052111 2096150 2145961 2202890 2267406 2338961 2417058 2502085
50526 2502085 2594900 2695851 2804445 2919784 3040947 3166843 3295739 3425114 3552167 3674604
50516 3674604 3790763 3898862 3996290 4079943 4147224 4196558 4227048 4237960 4228674 4199057 4149954
50505 4149954 4083507 4002963 3911938 3813801 3711727 3609109 3509614 3416885 3334319 3264923 3210946
50494 3210946 3173559 3153007 3148933 3160156 3184190 3217339 3255412 3294093 3328692 3354067 3365271
50483 3365271 3358389 3330909 3281814 3211751 3123176 3019986 2906644 2787228 2664956 2542461
50473 2542461 2422364 2307254 2198889 2097607 2002852 1914220 1831775 1755648 1685801 1622294
50463 1622294 1565312 1514769 1470117 1430615 1395559 1364255 1336182 1311312 1290042 1272711 1259429
50452 1259429 1250331 1245468 1244256 1245426 1247830 1251054 1255103 1259958 1265747 1272942 1281902 1292377 1303764
50439 1303764 1315626 1327519 1338634 1348215 1356322 1363688 1370768 1377372 1383312 1388899 1394569 1400361 1406075
50426 1406075 1411726 1417626 1424274 1432441 1443140 1457037 1473818 1492444 1512283 1533905 1558642 1587455
50414 1587455 1620395 1657117 1697640 1742392 1791607 1845029 1902258 1963134 2027611 2095373 2165765
50403 2165765 2237876 2310435 2381676 2449578 2512309 2568262 2615809 2653417 2680113 2695558 2699489
50392 2699489 2691328 2670531 2637114 2591687 2535257 2469363 2396310 2318914 2240023 2162397 2088802
50381 2088802 2021685 1962713 1912939 1873462 1845358 1828723 1822242 1824082 1832915 1847514 1865563 1883559
50369 1883559 1898075 1906831 1908480 1901950 1886395 1861534 1827678 1785595 1736699 1683191 1627473 1571236
50357 1571236 1515297 1460397 1407758 1358533 1312880 1269939 1228907 1189973 1154198 1122579 1095290
50346 1095290 1071638 1050539 1031061 1012794 995895 980801 967853 957173 948784 942624 938332 935239
50334 935239 932823 931150 930664 931450 932820 933719 933576 932848 932772 934483 938181 943154 948669 954655 961339 968441
50318 968441 975208 981336 987370 993865 1000427 1006027 1010216 1013668 1017366 1021509 1025522 1029128 1033121 1038822
50304 1038822 1046847 1056746 1067898 1080375 1094606 1110588 1127967 1146718 1167060 1188525 1209703 1229166
50292 1229166 1246167 1260153 1270137 1275289 1275983 1273783 1270486 1267493 1265904 1266472 1269177 1273114 1277018 1279719
50278 1279719 1280072 1276755 1268514 1254811 1236343 1214982 1193032 1172288 1153700 1137765 1124870 1115053
50266 1115053 1107687 1101815 1096826 1092626 1089290 1086750 1084763 1082933 1080909 1078763 1077054 1076297 1076474 1077300 1078699
50251 1078699 1080635 1082663 1084222 1085366 1086759 1088838 1091370 1093920 1096311 1098477 1100218 1101385 1102148 1102936
50237 1102936 1104198 1106118 1108334 1109996 1110455 1109890 1108904 1107574 1105343 1101926 1097840 1093795 1089978 1086102 1081847
50222 1081847 1077062 1071960 1067235 1063598 1061004 1058798 1056880 1056253 1058061 1062623 1069859 1080135 1093966 1111074
50208 1111074 1130501 1151650 1174652 1199691 1226410 1254102 1282078 1309848 1337346 1365069 1393647
50197 1393647 1423140 1453019 1482746 1511850 1539222 1562752 1580000 1589161 1589328 1580215 1561986 1535209
50185 1535209 1500811 1460213 1415720 1370434 1327258 1287733 1252068 1220352 1193486 1172689 1158128
50174 1158128 1148227 1140356 1132157 1122330 1110491 1096546 1080263 1061358 1040020 1017323 994879 973904
50162 973904 954698 937195 921776 909156 899583 892599 887735 884947 884173 884884 886485 888939 892541 897141
50148 897141 901964 906227 909656 912268 913796 913485 910555 904904 897318 888835 879990 870932 862213 854893
50134 854893 849619 846054 843591 842289 842631 844616 847645 851189 855038 858928 862443 865441 868210 871093
50120 871093 874239 877721 881590 885736 890009 894526 899613 905465 912135 919771 928484 938012 948018 958730
50106 958730 970779 984263 998527 1013017 1027859 1043344 1059486 1076624 1095930 1118677 1145194
50095 1145194 1175089 1208303 1245317 1286396 1331326 1380103 1433213 1490818 1551981 1615219 1679779
50084 1679779 1746043 1814563 1884974 1956067 2026861 2097192 2167037 2235344 2299757 2357418 2405659
50073 2405659 2441949 2463748 2469079 2457426 2429959 2388894 2336550 2274825 2205301 2129849 2051012
50062 2051012 1971516 1893340 1817564 1745221 1677749 1616183 1560315 1509257 1462688 1420954 1383978
50051 1383978 1350796 1320379 1292432 1267106 1244390 1224196 1206735 1192271 1180570 1171017 1163329 1157835
50039 1157835 1154933 1154520 1156154 1159620 1165011 1172172 1180324 1188540 1196568 1204847 1213643 1222465 1230563 1237720
50025 1237720 1244185 1249963 1254620 1257767 1259336 1259275 1257375 1253533 1247916 1240676 1231827 1221563 1210415 1198812
50011 1198812 1186622 1173283 1158269 1141376 1122916 1103930 1085929 1069961 1055930 1043131 1031427
50000 1031427 1021681 1015082 1012365 1013730 1019195 1028750 1042179 1058858 1077805 1097983 1118482 1138369
49988 1138369 1156558 1172195 1185210 1196177 1205495 1213009 1218595 1222657 1225684 1227658 1228416 1228420 1228712 1230261
49974 1230261 1233852 1240469 1251118 1266087 1284848 1306759 1331471 1358574 1387467 1417765 1449391 1481971
49962 1481971 1514702 1547239 1580322 1614959 1651101 1687531 1722807 1755755 1785009 1808603 1824421
49951 1824421 1831069 1828349 1817057 1798360 1773321 1742953 1708565 1671774 1634006 1596127 1558599 1521805
49939 1521805 1486067 1451535 1418261 1386183 1354852 1323316 1290555 1256047 1219845 1182259 1143643
49928 1143643 1104401 1065061 1026448 989812 956509 927281 901924 879825 860678 844572 831631
49917 831631 821765 814623 809630 806282 804541 804614 806137 808023 809468 810804 812950 816443 821528 828844 839161
49902 839161 852456 867941 885129 904264 925551 948489 972169 995723 1018228 1038589 1055902
49891 1055902 1069728 1079888 1086229 1088687 1087265 1081800 1072096 1058429 1041653 1022616 1001733 979232
49879 979232 955566 931364 907219 883603 860826 839042 818526 799805 783175 768209 754332
49868 754332 741856 731736 724166 718237 713387 710438 710444 713006 716600 720443 725318 732505 742453 754713
49854 754713 768805 784814 803144 823760 845811 868174 890245 911798 932076 949704 963797
49843 963797 974592 982542 987294 988276 985915 981430 975406 967130 955461 939968 921347 901234 881594
49830 881594 863763 847890 833525 820652 809823 801494 795765 792722 792395 794360 797967 803233 811031
49817 811031 822149 836488 853355 872182 892701 914698 937750 961010 983174 1003037 1020206
49806 1020206 1035026 1047736 1058106 1065988 1071645 1075102 1075610 1072273 1065128 1055191 1043482 1030309 1015461
49793 1015461 998824 980749 961951 943119 924595 906506 889157 873056 858476 845266 833303
49782 833303 822890 814428 807776 802235 797098 792046 787109 782518 778652 775911 774587 774998 777690 783290
49768 783290 791986 803241 816073 829571 843058 855966 867784 878240 887415 895583 902946 909498
49756 909498 914982 918885 920606 919834 916614 910826 901731 888564 871679 852685 833216 813955 795154
49743 795154 777627 762526 750293 740416 732261 725658 720616 717019 714750 713662 713216 712633 711740 711325
49729 711325 712265 714482 717082 719330 721242 723407 726567 731359 738095 746709 757052 769241 783529 799793
49715 799793 817232 834658 851083 866016 879214 890261 898522 903605 905666 905082 901976 896324 888401
49702 888401 878752 867728 855448 842287 828987 816106 803720 791841 780798 770895 762034 753979
49690 753979 746781 740691 735888 732630 731406 732499 735514 739717 744811 751136 759173 769134 780873 793837
49676 793837 807266 820917 835588 852404 871440 891376 910635 928403 944403 958162 969014
49665 969014 976721 981745 984959 987281 989438 991747 994051 995954 997023 996578 993451 986319 974428 957899
49651 957899 937393 913779 888187 862041 836708 813173 792119 774044 759023 746501 735770
49640 735770 726665 719512 714369 710724 708095 706515 706085 706396 706788 707031 707247 707207 706184 703625 699650 694719
49624 694719 689130 683026 676637 670256 664065 658129 652524 647426 643136 639962 637911 636507 635175 633818
49610 633818 632736 632015 631401 630887 630957 631936 633477 635085 636775 638716 640466 641230 640920 640454 640774 641929 643267
49593 643267 644185 644475 644230 643721 643318 643310 643766 644597 645677 646884 648117 649375 650702 652023 653185 654234 655503
49576 655503 657285 659598 662409 665964 670619 676451 683358 691555 701581 713638 727243 741840 757430
49563 757430 774062 790784 805798 817913 827340 834641 839405 840633 838185 833099 826375 818248 808918
49550 808918 799338 790671 783355 777254 772535 769745 768964 769442 770276 771119 772082 773205 774288 775077 775441 775491
49534 775491 775683 776650 778699 781548 784806 788735 794310 802385 812981 825590 839925 856063 873884
49521 873884 892823 912286 931867 950844 967903 981937 993019 1002067 1009658 1015787 1020932 1026633
49509 1026633 1034485 1044773 1056420 1068005 1078494 1087175 1093312 1095963 1094087 1087042 1075114 1059333
49497 1059333 1040627 1019536 997012 974965 955288 938426 923497 909820 897726 887684 879253
49486 879253 871417 863696 856561 850791 846694 843913 841756 839680 837572 835739 834666 834768 836150 838465
49472 838465 841038 843333 845353 847528 850268 853764 858144 863619 870379 878362 887136 895935 903965 910878
49458 910878 916894 922324 926955 930080 931111 929935 926748 921830 915589 908493 900679 891782 881431 869993
49444 869993 858646 848621 840340 833315 826838 820774 815627 811901 809504 807896 806803 806602 807981 811344
49430 811344 816686 823903 833007 844039 857085 872543 891130 913281 938661 966745 997738 1032108
49418 1032108 1068675 1103801 1133343 1155320 1169878 1176815 1174387 1161333 1139573 1114160 1090613 1072388
49406 1072388 1060281 1053473 1051099 1053215 1060348 1072187 1087176 1103679 1121115 1139532 1158549 1177422
49394 1177422 1195890 1214096 1231673 1247553 1260784 1270982 1277922 1281266 1280907 1277119 1270188 1260230 1247502
49381 1247502 1232546 1216034 1198867 1182395 1167896 1155684 1145248 1136466 1130120 1126930 1126630 1128345
49369 1128345 1131386 1135266 1139429 1143536 1147722 1151995 1155479 1156760 1154955 1150137 1142861 1133670 1123003 1111217
49355 1111217 1098637 1085739 1073142 1061132 1049330 1037198 1024907 1013446 1003895 996762 991891 988657
49343 988657 986229 983996 981905 980233 978971 977612 975629 972988 970061 967125 964096 960814 957469 954572
49329 954572 952424 950794 949328 948203 948035 949097 951026 953497 956807 961376 966910 972525 977685 982629
49315 982629 987775 993090 998313 1003508 1009042 1014949 1020622 1025284 1028670 1031037 1032613 1033405 1033723 1034513 1036682
49300 1036682 1040160 1044020 1047496 1050533 1053387 1056246 1059403 1063291 1068033 1073374 1079285 1086117 1093710 1100832
49286 1100832 1106174 1109717 1112536 1115416 1118273 1120839 1123255 1125856 1128936 1132880 1138131 1144868 1153059 1162803
49272 1162803 1174154 1186575 1199143 1211473 1223883 1236475 1248685 1260125 1271202 1282276 1292687
49261 1292687 1301420 1308522 1315146 1322204 1329660 1337195 1344923 1353198 1362241 1372244 1383483 1396080 1409865
49248 1409865 1424540 1439506 1453268 1463545 1468478 1467538 1460967 1448779 1431001 1408768 1384397 1360126
49236 1360126 1337153 1315980 1297140 1281215 1268543 1259334 1253913 1252479 1254676 1259616 1266216 1273307 1279611
49223 1279611 1284077 1286431 1287336 1288012 1289653 1292922 1297704 1303393 1309580 1316437 1324342 1333430 1343762 1355623
49209 1355623 1369172 1383908 1398979 1414026 1429194 1444317 1458681 1471820 1483977 1495465 1506066
49198 1506066 1515521 1524225 1532877 1541651 1550245 1558526 1566517 1573766 1579431 1583217 1585716 1587538 1588524 1588269
49184 1588269 1587176 1586511 1587410 1590184 1594663 1600973 1609764 1621851 1637881 1658430 1684262 1716258 1755003
49171 1755003 1800443 1851967 1908651 1969116 2031046 2090996 2145011 2189662 2222663 2242819 2249900
49160 2249900 2244956 2230724 2211313 2191044 2173223 2159613 2150598 2145667 2143995 2144879 2147738 2151774 2155982
49147 2155982 2159800 2163585 2168079 2173445 2179213 2185143 2191732 2199711 2209394 2220683 2233299 2246737 2260318
49134 2260318 2273711 2287244 2301356 2315885 2330297 2344526 2359096 2374355 2390000 2405546 2420882
49123 2420882 2436135 2451238 2466030 2480633 2495408 2510497 2525727 2541082 2557117 2574811 2595136
49112 2595136 2618867 2646695 2679404 2718070 2764204 2819562 2885402 2961682 3046963 3139156 3236423
49101 3236423 3337449 3440821 3543843 3641776 3728754 3800281 3854881 3892551 3911352 3906534 3874204
49090 3874204 3815926 3739126 3652881 3563363 3472552 3380104 3286190 3193436 3106700 3030631 2967134
49079 2967134 2915271 2873343 2840264 2814890 2795192 2778965 2764946 2752618 2741355 2730440 2719654
49068 2719654 2709158 2698803 2688073 2676653 2664711 2652716 2641334 2631305 2622941 2615763 2608953 2602040
49056 2602040 2594890 2587433 2579914 2573125 2567630 2562849 2557590 2551495 2545275 2539487 2533903 2528279 2523008 2518555
49042 2518555 2514868 2511903 2510325 2511117 2514764 2521345 2531232 2545176 2563664 2586523 2613039 2642088 2672163
49029 2672163 2701662 2729218 2753468 2772648 2784959 2789703 2787872 2781363 2771755 2759967 2746764 2733023
49017 2733023 2719438 2706375 2694330 2684204 2676692 2671444 2667287 2663400 2659983 2657631 2656406 2655816 2655549
49004 2655549 2655827 2657049 2659303 2662268 2665434 2668329 2670624 2672099 2672614 2672222 2671239 2669921 2668038 2665026 2660642
48989 2660642 2655114 2648501 2640423 2630812 2620593 2611082 2602785 2595214 2587703 2579989 2572202 2564835 2558678 2554174
48975 2554174 2550795 2547560 2544257 2541558 2539777 2538151 2535753 2532690 2529866 2527810 2526179 2524401 2522498 2521230
48961 2521230 2521521 2523754 2527608 2532658 2539018 2547163 2557185 2568589 2580955 2594482 2609769 2627277 2647059
48948 2647059 2668660 2691191 2713875 2736811 2760904 2786823 2814300 2842634 2871569 2901300 2931932
48937 2931932 2963379 2995767 3029618 3065558 3104010 3145084 3188602 3234306 3282149 3332241 3384428
48926 3384428 3438182 3493135 3549561 3608087 3669013 3732148 3797164 3863733 3931307 3999075 4066276
48915 4066276 4132415 4197100 4259716 4319367 4375203 4426905 4474876 4519923 4562725 4603629 4642800
48904 4642800 4680254 4715729 4748767 4779065 4806621 4831554 4854067 4874577 4893456 4910539 4925256
48893 4925256 4937418 4947392 4955245 4960257 4961849 4960593 4957629 4953297 4947030 4938501 4928110 4916109 4901993
48880 4901993 4885151 4865731 4844340 4821087 4795315 4766170 4733127 4696022 4654929 4610083 4561647
48869 4561647 4509351 4452571 4391113 4326050 4259542 4193557 4128830 4065231 4003036 3943347 3887178
48858 3887178 3834629 3785338 3739351 3696999 3658103 3621973 3588341 3557810 3531069 3507947 3487480
48847 3487480 3468804 3451848 3437347 3426243 3418934 3414988 3413704 3414885 3418766 3425221 3433511 3443085 3454196
48834 3454196 3467233 3481794 3497091 3513189 3531119 3551368 3572792 3593587 3613149 3632427 3652496
48823 3652496 3673386 3694589 3716186 3738838 3762742 3787222 3811521 3835605 3859895 3884526 3909235
48812 3909235 3933821 3958246 3982301 4005650 4028442 4051513 4075669 4100930 4126775 4153016 4180120
48801 4180120 4208656 4238784 4270406 4303549 4338340 4374655 4411933 4449270 4485617 4520061 4552140
48790 4552140 4581864 4609274 4634000 4655388 4672997 4686729 4696512 4702165 4703609 4700896 4693831 4681832
48778 4681832 4664359 4641296 4612697 4578497 4538848 4494632 4447202 4397638 4346508 4294224 4241090
48767 4241090 4186961 4131400 4074399 4016657 3958912 3901384 3844195 3787983 3733673 3681736 3632043
48756 3632043 3584390 3538829 3495562 3454903 3417446 3383908 3354560 3328959 3306401 3286502 3269127
48745 3269127 3253894 3240120 3227475 3216530 3208366 3203586 3201911 3202768 3205979 3211598 3219262 3228084 3237195
48732 3237195 3246033 3254017 3260364 3264558 3266824 3267851 3268062 3267343 3265450 3262476 3258844 3254967 3251011 3246994
48718 3246994 3243043 3239419 3236171 3232951 3229413 3225788 3222801 3220941 3220030 3219581 3219286 3219071 3218991 3219371 3220784 3223548
48702 3223548 3227288 3231290 3235253 3239452 3244222 3249626 3255762 3263115 3272328 3283639 3296664 3310744 3325355
48689 3325355 3339998 3353785 3365490 3374383 3380942 3386447 3391812 3396951 3401242 3404195 3405622 3405600 3404603 3403331
48675 3403331 3401893 3399236 3393758 3384581 3372048 3356959 3339609 3319704 3297066 3272153 3245809 3218612
48663 3218612 3190626 3161872 3132699 3103452 3073923 3043572 3012346 2980828 2949437 2917881 2885656
48652 2885656 2852729 2819444 2786057 2752816 2720352 2689635 2661565 2636731 2615286 2596745 2580062
48641 2580062 2564192 2548441 2532056 2513899 2493120 2470111 2446310 2422949 2400314 2378159 2356342
48630 2356342 2334913 2313867 2293002 2271933 2250264 2227921 2205203 2182311 2159021 2135222 2111673
48619 2111673 2089754 2070446 2053924 2040085 2028985 2020689 2015257 2013055 2014586 2019621 2026891 2034951 2043056
48606 2043056 2050910 2057978 2063550 2067291 2069238 2069423 2068025 2065905 2064357 2064078 2064706 2065573 2066554 2067760 2068565
48591 2068565 2067411 2062727 2053851 2041014 2024680 2005150 1982747 1958235 1932937 1908343 1885425 1864293
48579 1864293 1844665 1826611 1810571 1796615 1784171 1772905 1763483 1756858 1753008 1751107 1750967 1753491 1759367
48566 1759367 1768057 1778551 1790580 1804385 1819639 1835288 1850248 1863630 1874351 1881239 1883714 1882025
48554 1882025 1876854 1869127 1860103 1851023 1842392 1834012 1825737 1817716 1809727 1800832 1790088 1777263 1762590
48541 1762590 1746118 1727723 1707555 1686098 1663889 1641540 1619973 1600268 1583111 1568520 1556223
48530 1556223 1546186 1538750 1534320 1533046 1534777 1539249 1546278 1555738 1567369 1580518 1594039 1606533 1616760
48517 1616760 1623740 1626470 1623860 1615452 1602229 1586375 1570099 1554945 1542217 1533395 1529611 1530907 1536495
48504 1536495 1545782 1558883 1576140 1597260 1620890 1645056 1668182 1689643 1709078 1725346 1736824
48493 1736824 1742806 1743772 1739953 1730519 1714966 1694729 1672396 1649636 1626646 1603253 1579466 1555037
48481 1555037 1529642 1503927 1479641 1458300 1440064 1423990 1408985 1394541 1381123 1369866 1361355
48470 1361355 1354785 1348903 1343602 1339767 1337651 1336579 1336504 1338710 1344304 1352875 1363378 1375686 1390422 1407625
48456 1407625 1426342 1445369 1463792 1480911 1496148 1509093 1519410 1526833 1531409 1533607 1534042 1533291 1531984
48443 1531984 1530644 1529249 1527259 1524170 1519684 1513301 1504386 1492915 1479683 1465517 1450756 1435720 1421043
48430 1421043 1407141 1393881 1381233 1369777 1360063 1351822 1344256 1336744 1328819 1319924 1309802 1298941
48418 1298941 1288076 1277398 1266563 1255302 1243645 1231745 1219799 1207974 1196186 1184279 1172635
48407 1172635 1162227 1153697 1146769 1140909 1136152 1132790 1130535 1128493 1125845 1122259 1117938 1113517 1109577 1105918
48393 1105918 1101587 1095929 1089248 1082198 1074926 1067256 1059268 1051299 1043729 1037019 1031564 1027200 1023356 1019953
48379 1019953 1017502 1015993 1014465 1012213 1009623 1007143 1004306 1000674 997004 994331 992412 990226 987654 985449
48365 985449 983731 981687 978763 975185 971353 967730 965314 965116 966812 968701 969240 968089 965678 962539 959174
48350 959174 955861 952346 948230 943672 939174 934815 930342 926005 922574 920559 919980 920739 922477 924271 925371
48335 925371 926291 928285 931692 935626 939347 943032 946990 950983 954653 957957 960992 963956 967406 971947
48321 971947 977593 984030 991281 999422 1007805 1015531 1022602 1029519 1035783 1040017 1041779 1042119 1041988 1041304 1039999
48306 1039999 1038835 1038515 1038906 1039820 1041770 1045393 1050869 1058494 1069137 1083481 1101326 1122030 1144972
48293 1144972 1169214 1193375 1216395 1237942 1257856 1275858 1292071 1307128 1321497 1335495 1350193
48282 1350193 1367349 1388030 1412001 1438761 1468350 1500855 1536091 1574123 1615344 1659866 1707794
48271 1707794 1760151 1818338 1882536 1951992 2027096 2109759 2201512 2302986 2415803 2543340 2689180
48260 2689180 2856764 3051530 3281996 3558569 3893813 4305264 4816619 5456113 6255619
48251 6255619 7250077 8472009 9942918 11668877 13635783 15790777 18017829 20141656
48243 20141656 21973059 23356357 24174925 24332726 23769544 22518012 20737217 18668432
48235 18668432 16543051 14518596 12675466 11044794 9630556 8420309 7393683 6529005
48227 6529005 5804655 5198569 4690120 4262155 3900268 3591570 3325327 3093648 2890542
48218 2890542 2711057 2551652 2409959 2283453 2169253 2065488 1971534 1886394 1808181 1735683
48208 1735683 1669081 1608283 1551836 1498494 1448843 1404193 1364503 1328351 1294502 1262608 1232726
48197 1232726 1205082 1180219 1158682 1140499 1125308 1112812 1102717 1094387 1086925 1079514 1071396 1061672
48185 1061672 1049483 1034453 1016856 997468 977330 957524 938918 922093 907372 894773 883999
48174 883999 874695 866738 860089 854429 849239 844282 839774 836069 833398 831839 831196 830854 830041 828394 826124
48159 826124 823691 821550 820161 819850 820529 821679 822702 823195 822996 822179 820977 819530 817815 815957 814422
48144 814422 813671 813779 814634 816302 818810 821757 824545 826882 828731 829991 830704 831389 832604 834212 835623
48129 835623 836784 838386 841069 844918 849758 855434 861654 867991 874144 879900 884945 889221 893295 897803
48115 897803 902542 906811 910566 914417 918450 922057 925271 929287 935085 942309 950082 958265 967269 977249
48101 977249 988242 1000567 1014323 1028907 1043687 1058821 1074746 1091307 1108186 1125756 1144535
48090 1144535 1164011 1183015 1201235 1219462 1238257 1257235 1275798 1293721 1310756 1326507 1341152
48079 1341152 1355632 1370633 1385792 1400246 1413524 1425564 1436389 1446250 1455778 1465487 1475292 1484893
48067 1484893 1494439 1504482 1515389 1527152 1539573 1552314 1564795 1576333 1586450 1594911 1601619 1606593
48055 1606593 1609909 1611426 1610716 1607518 1602202 1595486 1587685 1578412 1567111 1553741 1538856 1523067 1506536
48042 1506536 1489071 1470652 1451677 1432569 1413249 1393168 1371819 1349082 1325227 1300853 1276797
48031 1276797 1253793 1232101 1211587 1191982 1172812 1153296 1132871 1111898 1091314 1071502 1052002
48020 1052002 1032533 1013664 996051 979541 963570 948104 933584 920125 907287 894607 881996
48009 881996 869783 858750 849881 843506 838697 833968 828573 822806 817197 812051 807774 804945 803706 803478
47995 803478 803548 803713 804174 805084 806398 808021 809927 812205 814885 817552 819308 819521 818561 817376 816380 815253
47979 815253 813864 812732 812327 812436 812534 812294 811446 809657 807007 804165 801616 799044 795897 792249 788555 784890
47963 784890 781060 777253 773905 770983 768040 765082 762787 761671 761499 761673 761849 762036 762489 763748 766440
47948 766440 770803 776526 783079 789987 796792 803169 809280 815714 822937 831008 839874 849568 859952 870711
47934 870711 881789 893458 905613 917389 927922 937277 946089 954449 961697 967294 971311 973843 974507
47921 974507 972926 969485 965131 960512 955656 950406 944718 938361 930842 922053 912832 904321 896699 888964
47907 888964 880178 870557 861101 852476 844739 837925 832293 827952 824697 822393 821117 820771 820925 821394 822662
47892 822662 825347 829385 834043 838701 843359 848409 854230 861009 868707 877047 885726 894818 904865 916286
47878 916286 928516 939935 949088 956152 962934 971048 980254 988885 995624 1000243 1002778 1003012 1001224 998603
47864 998603 996068 993035 988225 981500 974094 966996 959949 952246 943765 934778 925328 915373 905270 895614
47850 895614 886742 878697 871428 864740 858258 851941 846482 842716 840710 839872 839918 841123 843465 846166 848596
47835 848596 851201 854912 859773 864797 869292 873698 878746 884302 889612 894428 899169 903973 908349 912102
47821 912102 915929 920549 925682 930701 936135 943661 954409 967937 983209 1000003 1018859 1040141 1063840
47808 1063840 1090117 1119361 1151602 1186323 1222923 1260902 1299463 1337289 1373007 1405654 1434545
47797 1434545 1458950 1478098 1491308 1497927 1497478 1490172 1477118 1459657 1438593 1414389 1387955 1360657
47785 1360657 1333412 1306288 1279318 1253320 1229476 1208298 1189559 1173156 1159442 1148473 1139358
47774 1139358 1130737 1121766 1112435 1103193 1094561 1086911 1080165 1073687 1066773 1059267 1051453 1043439 1035092 1026597
47760 1026597 1018583 1011339 1004273 996468 987627 978276 969287 961493 955479 951298 948455 946510 945560 945831
47746 945831 947033 948641 950718 953854 958274 963656 969935 977568 986637 996331 1005915 1015750 1026728 1039021
47732 1039021 1052112 1065860 1080723 1096807 1113344 1129383 1144515 1158769 1172209 1184897 1196793
47721 1196793 1207429 1216016 1222187 1226294 1228635 1228748 1225972 1220476 1213219 1204872 1195228 1183692 1169974
47708 1169974 1154271 1137216 1119791 1102923 1086959 1071745 1057388 1044541 1033631 1024075 1014803 1005519
47696 1005519 997031 990239 985189 981379 978689 977569 978367 980897 984795 990068 997056 1006002 1016908 1029732
47682 1029732 1044413 1060613 1077740 1095402 1113710 1132896 1152704 1172434 1191603 1210252 1228470
47671 1228470 1245791 1261334 1274570 1285742 1295494 1304212 1311796 1317950 1322473 1325205 1325813 1323826 1318964
47658 1318964 1311427 1301810 1290751 1278628 1265578 1251752 1237560 1223596 1210290 1197613 1185285 1173397
47646 1173397 1162718 1154119 1147655 1142474 1137807 1133905 1131723 1131782 1133702 1136921 1141433 1147481 1154852 1163059
47632 1163059 1172291 1183708 1198496 1216899 1238503 1263314 1292086 1325474 1363233 1404515 1448801
47621 1448801 1496212 1546758 1599480 1652485 1703786 1751940 1795830 1834089 1865063 1887347 1900182
47610 1900182 1903268 1896413 1879568 1853047 1817492 1773635 1722303 1664725 1602748 1538637 1474502 1411698
47598 1411698 1350668 1291525 1234880 1181892 1133424 1089410 1049327 1012984 980358 950889 923615
47587 923615 898214 875420 856117 840298 827110 815550 804908 794912 785829 778222 772304 767620
47575 767620 763614 760198 757519 755443 753691 752241 751146 750096 748670 746919 745202 743460 741244 738519
47561 738519 735847 733521 731052 727892 724310 721161 718990 717680 716796 715921 714851 713811 713399 713978 715177
47546 715177 716281 717064 717902 719036 720114 720648 720766 721283 723030 726203 730310 734670 738884 742837 746385
47531 746385 749321 751750 754264 757444 761162 764627 767115 768540 769276 769614 769514 768768 767286 765189 762598
47516 762598 759392 755304 750356 745014 739695 734261 728369 722313 717117 713555 711401 709846 708375 706897
47502 706897 705357 703756 702479 702027 702287 702495 702092 701187 700016 698446 696461 694666 693633 692888 691276 688447
47486 688447 685414 683425 682773 682991 683737 684964 686465 687810 688804 689679 690757 692172 693949 696148 698748
47471 698748 701492 703961 705869 707331 708828 710828 713476 716708 720506 724787 729098 732842 735909 738646
47457 738646 741011 742223 741672 739813 737703 735928 734600 734167 735493 738990 744254 750749 758426 767466 777906
47442 777906 789757 803183 818317 835207 854118 875624 900190 927916 958749 992497 1028393
47431 1028393 1065028 1101036 1135528 1167629 1196144 1220245 1240100 1256192 1268091 1274533 1274733 1269192
47419 1269192 1259221 1246111 1230780 1213674 1194760 1173927 1151587 1128664 1105961 1083800 1062362
47408 1062362 1041970 1022787 1004548 986873 969741 953414 938025 923420 909345 895657 882463
47397 882463 870164 859286 850098 842426 835948 830613 826679 824423 823871 824755 826608 828982 831678 834763
47383 834763 838334 842390 847014 852498 859098 866685 874826 883183 891658 900138 908288 915637 921690 925924
47369 925924 927935 927816 926188 923594 919949 914840 908311 900961 893131 884341 873782 861262 847455 833340
47355 833340 819611 806526 794018 781925 770258 759179 748620 738094 727285 716739 707520 700068
47343 700068 693805 688051 682927 678962 676113 673631 670872 667854 665024 662763 661200 660231 659590 659070 658817
47328 658817 659271 660745 663092 665867 668764 671815 675171 678735 682111 684907 687046 688725 690193 691738
47314 691738 693753 696432 699279 701197 701355 699870 697525 694988 692563 690548 689377 689252 689805 690398 690791
47299 690791 691444 693010 695538 698424 701338 704908 709992 716359 722750 728464 734221 741065 749004 757413
47285 757413 766300 776177 786812 797076 806312 815104 824291 833793 842917 851447 859945 869115 879118
47272 879118 889302 898408 905351 910166 913992 917872 921755 924904 926916 927954 928219 927766 926699 925008
47258 925008 922128 917271 910465 902877 895724 889106 882247 874759 867235 860503 854688 849271 843887 838699
47244 838699 834003 829834 826138 823051 820699 818934 817574 816819 816993 817927 819093 820422 822475 825534 829050
47229 829050 832510 836436 841856 848920 856776 864870 873665 883781 895010 906746 919088 932877 948646
47216 948646 965936 983769 1001422 1018520 1034572 1048699 1059827 1066974 1069367 1066452 1058100 1044987
47204 1044987 1028703 1011282 994356 978632 964068 950437 937672 925886 915345 906442 899483 894358
47192 894358 890596 887851 886276 886216 887709 890487 894406 899572 905958 913254 921311 930517 941389 953909
47178 953909 967600 982307 998544 1016922 1037447 1059528 1082494 1105828 1129029 1151594 1173213
47167 1173213 1193779 1213072 1230563 1245695 1258283 1268486 1276395 1281831 1284654 1285120 1283740 1280761 1275991
47154 1275991 1269242 1260787 1251196 1240804 1229625 1217824 1206033 1195001 1185069 1176135 1168046 1160761 1154229
47141 1154229 1148402 1143502 1140022 1138245 1137924 1138604 1140190 1142998 1147348 1153353 1161029 1170243 1180413 1190558
47127 1190558 1199861 1208018 1214872 1219935 1222591 1222663 1220513 1216611 1211231 1204479 1196317 1186572 1175175 1162421
47113 1162421 1148766 1134423 1119466 1104285 1089544 1075553 1062076 1048943 1036485 1025113 1014771
47102 1014771 1005060 995670 986435 977220 968047 959140 950601 942246 934025 926377 919869 914670 910709 908056
47088 908056 906735 906393 906649 907667 909868 913190 917149 921609 926887 932969 939159 944793 949959 955255 961045
47073 961045 967056 972471 976437 978826 980485 982366 984385 985559 985291 983915 981878 979083 975380 971135
47059 971135 966868 962755 958963 956039 954427 953950 954347 956061 959831 965616 972481 979519 986438 993340 1000539
47044 1000539 1008682 1018440 1029763 1041730 1053314 1064101 1074257 1084063 1093651 1102962 1111881 1120541 1129416
47031 1129416 1138812 1148300 1157060 1164943 1172840 1181767 1191822 1202200 1212037 1220980 1229083 1236419 1242809
47018 1242809 1247878 1251414 1253677 1255140 1255817 1255085 1252358 1247827 1242347 1236640 1230816 1224634 1217992 1211053
47004 1211053 1204008 1196864 1189497 1181922 1174469 1167641 1161801 1157050 1153439 1151170 1150430 1151102 1152778 1155090
46990 1155090 1157867 1160984 1164254 1167705 1171854 1177423 1184709 1193307 1202520 1211907 1221479 1231580 1242760
46977 1242760 1255576 1270248 1286497 1303764 1321477 1339042 1355923 1372114 1388353 1405405 1423063
46966 1423063 1440198 1455858 1469938 1482713 1494174 1504107 1512441 1519164 1524059 1526875 1527692 1526931 1525131
46953 1525131 1522846 1520548 1518411 1516416 1514841 1514370 1515375 1517374 1519610 1522048 1525328 1529860 1535429 1541780
46939 1541780 1549078 1557516 1566781 1576169 1585158 1593757 1602355 1611359 1620954 1631192 1642202 1654121 1666659
46926 1666659 1679008 1690381 1700514 1709361 1716597 1721784 1724876 1725979 1724658 1720111 1712251 1702082 1690684
46913 1690684 1678230 1664364 1649148 1633120 1616665 1599928 1583354 1567739 1553546 1540570 1528585
46902 1528585 1518050 1509880 1504651 1502379 1503034 1506810 1513770 1523555 1535862 1550925 1569087 1589903 1612197
46889 1612197 1635175 1659009 1684024 1709716 1735056 1759594 1783748 1808022 1832286 1855789 1877509
46878 1877509 1896466 1912142 1924730 1934783 1942607 1948288 1952272 1955474 1958574 1961528 1963963 1965818 1967515
46865 1967515 1969765 1973404 1979084 1986833 1996045 2006130 2017087 2029302 2042969 2057890 2073623 2089619
46853 2089619 2105363 2120593 2135322 2149550 2163055 2175510 2186516 2195436 2201612 2205095 2206832 2207611
46841 2207611 2206978 2203712 2197390 2188978 2179782 2170287 2160264 2149625 2138844 2128744 2120177 2113787 2109786
46828 2109786 2108021 2108408 2111169 2116396 2123574 2132006 2141722 2153521 2167882 2184166 2201214 2218448 2235966
46815 2235966 2253652 2270750 2286416 2300275 2312124 2321422 2327511 2330282 2330265 2328027 2323735 2317371 2309167
46802 2309167 2299642 2289269 2278155 2266098 2253023 2239418 2226129 2213540 2201012 2187428 2172329
46791 2172329 2156340 2140537 2125676 2112142 2100232 2090121 2081654 2074512 2068677 2064437 2061829 2060219
46779 2060219 2058688 2056790 2054715 2052727 2050684 2048262 2045449 2042480 2039433 2036257 2033215 2030890 2029606 2029227
46765 2029227 2029745 2031655 2035355 2040425 2046009 2051818 2058348 2066127 2075177 2085233 2096091 2107616 2119755
46752 2119755 2132655 2146481 2160981 2175478 2189475 2203099 2216830 2230898 2244967 2258296 2270214
46741 2270214 2280602 2289897 2298468 2306146 2312569 2317834 2322418 2326592 2330360 2333890 2337457 2340909 2343840 2346496
46727 2346496 2349975 2355121 2361582 2368307 2374707 2381012 2387797 2395457 2403895 2412469 2420414 2427497 2434006 2439926
46713 2439926 2444590 2447309 2447913 2446245 2441709 2433939 2423595 2411773 2398708 2383710 2366320 2346873 2325738
46700 2325738 2302590 2276837 2248571 2218856 2189101 2160188 2132080 2104226 2076375 2048941 2022543
46689 2022543 1997423 1973487 1950667 1929030 1908769 1890323 1874201 1860281 1847499 1834732 1821858
46678 1821858 1809541 1798136 1787423 1777371 1768391 1760511 1752818 1744258 1734881 1726010 1719210 1715156 1713377
46665 1713377 1712893 1713115 1714211 1716786 1721435 1728636 1738636 1751097 1765084 1779761 1794917 1810481 1825843
46652 1825843 1840247 1853712 1866848 1879696 1891368 1901060 1908826 1915131 1920104 1923559 1925434 1925909 1925426
46639 1925426 1924822 1925127 1927007 1930667 1936386 1944700 1955849 1969543 1985598 2004366 2026093 2050176 2075537
46626 2075537 2101471 2127652 2153566 2178463 2201739 2222875 2241070 2255393 2265375 2271123 2272830 2270508
46614 2270508 2264176 2253989 2240133 2222857 2202650 2180106 2155615 2129347 2101542 2072625 2043133
46603 2043133 2013780 1985440 1958705 1933522 1909604 1887169 1866844 1848818 1832499 1817172 1802610
46592 1802610 1788890 1776009 1763941 1752773 1742474 1732681 1722922 1712903 1702465 1691509 1680178 1668875
46580 1668875 1657875 1647114 1636598 1626711 1617676 1608951 1599721 1589975 1580630 1572483 1565520 1559409 1554147
46567 1554147 1549836 1546210 1542953 1540300 1538784 1538376 1538321 1537985 1537521 1537495 1538156 1539304 1540668 1542111 1543607 1545324
46551 1545324 1547652 1550913 1555002 1559588 1564589 1570200 1576456 1583134 1590185 1597920 1606527 1615723 1625237 1635391
46537 1635391 1646751 1659300 1672467 1686124 1701055 1718151 1737389 1757931 1779060 1800693 1823102
$$ [...]
##END NTUPLES=NMR SPECTRUM
##END=
