##TITLE=AC1569_ROEFFECT0021_8271072_0DjOt5wei0
##JCAMPDX= 6.0         $$ Bruker NMR JCAMP-DX V2.0
##DATA TYPE= NMR SPECTRUM
##DATA CLASS= NTUPLES
##ORIGIN= BRUKER
##OWNER= Administrator
$$ 1.72 TOPSPIN		Version 2.1
$$ 2014-08-04 15:01:16.875 -0700  Administrator@X
$$ Compression mode = diff/dup
##.OBSERVE FREQUENCY= 400.02188249412
##.OBSERVE NUCLEUS= ^1H
##.ACQUISITION MODE= SIMULTANEOUS (DQD)
##.ACQUISITION SCHEME= undefined
##.AVERAGES= 8
##.DIGITISER RES= 22
##SPECTROMETER/DATA SYSTEM= spect
##.PULSE SEQUENCE= zg30
##.SOLVENT NAME= COFFEE_meoh
##.SHIFT REFERENCE= INTERNAL, COFFEE_meoh, 1, 14.98509
##AUDIT TRAIL= $$ (NUMBER, WHEN, WHO, WHERE, PROCESS, VERSION, WHAT)
$$ ##TITLE= Audit trail, TOPSPIN		Version 2.1
$$ ##JCAMPDX= 5.01
$$ ##ORIGIN= Bruker BioSpin GmbH
$$ ##OWNER= Administrator
$$ $$ E:\/data/COFFEE/nmr/AC1569_ROEFFECT0021_8271072_0DjOt5wei0/20/pdata/1/auditp.txt
$$ ##AUDIT TRAIL=  $$ (NUMBER, WHEN, WHO, WHERE, PROCESS, VERSION, WHAT)
(   1,<2014-08-04 15:01:10.386 -0700>,<Administrator>,<X>,<go>,<TOPSPIN 2.1>,
      <created by zg
	started at 2014-08-04 15:00:02.953 -0700,
	POWCHK enabled, PULCHK disabled,
       configuration hash MD5:
       16 EA D6 F4 BB 67 03 14 9B FF E7 A0 43 5B 48 2E
       data hash MD5: 64K
       55 16 D6 30 F2 B6 24 41 19 73 0E 35 5C 65 E9 9D>)
(   2,<2014-08-04 15:01:13.141 -0700>,<Administrator>,<X>,<proc1d>,<TOPSPIN 2.1>,
      <Start of raw data processing
       efp LB = 0 FT_mod = 6 PKNL = 1 PHC0 = 0 PHC1 = 0 SI = 32K 
       data hash MD5: 32K
       89 B6 D3 38 27 8E 9E C1 A9 0B 90 42 71 42 FE B5>)
(   3,<2014-08-04 15:01:13.417 -0700>,<Administrator>,<X>,<proc1d>,<TOPSPIN 2.1>,
      <pk PHC0 = 87.8302 PHC1 = 0 
       data hash MD5: 32K
       36 1E 68 74 F9 CC 06 4C EE 8E 12 B3 4C 2C E2 97>)
(   4,<2014-08-04 15:01:13.569 -0700>,<Administrator>,<X>,<proc1d>,<TOPSPIN 2.1>,
      <abs ABSG = 1 
       data hash MD5: 32K
       5A 05 A2 E3 04 66 14 80 51 41 A4 1A E4 65 C0 5C>)
(   5,<2014-08-04 15:01:13.679 -0700>,<Administrator>,<X>,<proc1d>,<TOPSPIN 2.1>,
      <abs ABSG = 2 
       data hash MD5: 32K
       A7 06 D9 91 1B 14 B8 C4 53 B8 90 0A 2B 09 38 E8>)
(   6,<2014-08-04 15:01:13.775 -0700>,<Administrator>,<X>,<proc1d>,<TOPSPIN 2.1>,
      <abs ABSG = 3 
       data hash MD5: 32K
       2E 21 4E F4 AF 9F 78 AC 2B 49 9D AC 70 C6 18 93>)
(   7,<2014-08-04 15:01:13.830 -0700>,<Administrator>,<X>,<proc1d>,<TOPSPIN 2.1>,
      <abs ABSG = 4 
       data hash MD5: 32K
       81 95 CD 2E 91 60 5F 75 F3 8D B9 56 01 8F 9F E0>)
(   8,<2014-08-04 15:01:13.905 -0700>,<Administrator>,<X>,<proc1d>,<TOPSPIN 2.1>,
      <abs ABSG = 5 
       data hash MD5: 32K
       12 A6 23 D9 5E FB 23 1D 71 06 12 0E 84 4B CD E2>)
$$ ##END=
$$ 
$$ $$ hash MD5
$$ $$ 33 6E 15 D0 BE D2 AD 6E D5 7D 93 4B 51 CE 7C D9
##$RELAX= 
##$RELAX= 
##$RELAX= 
##$RELAX= 
##$RELAX= 
##$RELAX= 
##$RELAX= 
$$ Bruker specific parameters
$$ --------------------------
##$DU= <E:\>
##$EXPNO= 20
##$NAME= <AC1569_ROEFFECT0021_8271072_0DjOt5wei0>
$$ [...]
##$TP= (0..7)
150 150 150 150 150 150 150 150
##$TP07= 0
##$TPNAME0= <>
##$TPNAME1= <>
##$TPNAME2= <>
##$TPNAME3= <>
##$TPNAME4= <>
##$TPNAME5= <>
##$TPNAME6= <>
##$TPNAME7= <>
##$TPOAL= (0..7)
0.5 0.5 0.5 0.5 0.5 0.5 0.5 0.5
##$TPOFFS= (0..7)
0 0 0 0 0 0 0 0
##$TUNHIN= 0
##$TUNHOUT= 0
##$TUNXOUT= 0
##$USERA1= <user>
##$USERA2= <user>
##$USERA3= <user>
##$USERA4= <user>
##$USERA5= <user>
##$V9= 5
##$VALIST= <valist>
##$VCLIST= <CCCCCCCCCCCCCCC>
##$VD= 0
##$VDLIST= <DDDDDDDDDDDDDDD>
##$VPLIST= <PPPPPPPPPPPPPPP>
##$VTLIST= <TTTTTTTTTTTTTTT>
##$WBST= 1024
##$WBSW= 4
##$XGAIN= (0..3)
0 0 0 0
##$XL= 0
##$YL= 0
##$YMAX_a= 626736
##$YMIN_a= -545120
##$ZGOPTNS= <>
##$ZL1= 120
##$ZL2= 120
##$ZL3= 120
##$ZL4= 120
##$ABSF1= 14.98509
##$ABSF2= -5.573092
##$ABSG= 5
##$ABSL= 3
##$ALPHA= 0
##$AQORDER= 0
##$ASSFAC= 0
##$ASSFACI= 0
##$ASSFACX= 0
##$ASSWID= 0
##$AUNMP= <proc_prof1d_extract_pilot.lims>
##$AXLEFT= 0
##$AXNAME= <>
##$AXNUC= <1H>
##$AXRIGHT= 0
##$AXTYPE= 0
##$AXUNIT= <>
##$AZFE= 0.1
##$AZFW= 0.1
##$BCFW= 0
##$BC_mod= 0
##$BYTORDP= 0
##$COROFFS= 0
##$CY= 15
##$DATMOD= 1
##$DC= 0
##$DFILT= <>
##$DTYPP= 0
##$F1P= 0
##$F2P= 0
##$FCOR= 0.5
##$FTSIZE= 32768
##$FT_mod= 6
##$GAMMA= 0
##$GB= 0
##$INTBC= 1
##$INTSCL= 1
##$ISEN= 128
##$LB= 0
##$LEV0= 0
##$LPBIN= 0
##$MAXI= 10000
##$MC2= 0
##$MEAN= 0
##$ME_mod= 0
##$MI= 0
##$NCOEF= 0
##$NC_proc= -8
##$NLEV= 6
##$NOISF1= 0
##$NOISF2= 0
##$NSP= 0
##$NTH_PI= 0
##$NZP= 0
##$OFFSET= 14.98509
##$PC= 1
##$PHC0= 87.8302
##$PHC1= 0
##$PH_mod= 1
##$PKNL= yes
##$PPARMOD= 0
##$PPDIAG= 0
##$PPIPTYP= 0
##$PPMPNUM= 2147483647
##$PPRESOL= 1
##$PSCAL= 4
##$PSIGN= 0
##$PYNMP= <proc.py>
##$REVERSE= no
##$SF= 400.02
##$SI= 32768
##$SIGF1= 0
##$SIGF2= 0
##$SINO= 400
##$SIOLD= 32768
##$SPECTYP= <>
##$SREGLST= <1H.CDCl3>
##$SSB= 0
##$STSI= 32768
##$STSR= 0
##$SW_p= 8223.68421052631
##$SYMM= 0
##$S_DEV= 0
##$TDeff= 65536
##$TDoff= 0
##$TI= <>
##$TILT= no
##$TM1= 0
##$TM2= 0
##$TOPLEV= 0
##$USERP1= <user>
##$USERP2= <user>
##$USERP3= <user>
##$USERP4= <user>
##$USERP5= <user>
##$WDW= 1
##$XDIM= 32768
##$YMAX_p= 466870895
##$YMIN_p= -669939
##$CURPLOT= <Network HP LaserJet P1505>
##$CURPRIN= <$Network HP LaserJet P1505>
##$DFORMAT= <normdp>
##$LAYOUT= <+/1D_H.xwp>
##$LFORMAT= <normlp>
##$PFORMAT= <normpl>
##$SURQMSG= 1
$$ End of Bruker specific parameters
$$ ---------------------------------
##NTUPLES= NMR SPECTRUM
##VAR_NAME=  FREQUENCY,     SPECTRUM/REAL,   SPECTRUM/IMAG
##SYMBOL=    X,             R,               I
##VAR_TYPE=  INDEPENDENT,   DEPENDENT,       DEPENDENT
##VAR_FORM=  AFFN,          ASDF,            ASDF
##VAR_DIM=   32768,         32768,           32768
##UNITS=     HZ,            ARBITRARY UNITS, ARBITRARY UNITS
##FACTOR=    0.250966925370066, 1,           1
##FIRST=     8223.43324360094, 7042,         -118125
##LAST=      0,             -22466,          -30876
##MIN=       0,             -669939,         0
##MAX=       8223.43324360094, 466870895,    0
$$ Real data points
##PAGE= N=1
##DATA TABLE= (X++(R..R)), XYDATA
$$ [...]
19516B075b06988B50155D1655b58111A71696a27878j34928j7955d1351A6260L43055
$$ 2075 -206988 250155 41655 -258111 171696 -127878 -262806 -280761 -41351 16260 359315
19505C59315b09435c0003B43637b79944c1130j63727b7101o0217J6496I3912d03522
$$ 359315 -209435 -30003 243637 -279944 -31130 -194857 -27101 -87318 -70822 93912 -403522
19493A30121a9996A46915d81749g2007l543k58969J25334l800A47448c6208m0014
$$ 130121 -19996 146915 -481749 -72007 -75550 -334519 -209185 -212985 147448 -36208 -76222
19482g6222A51398f9589D4404a27378A37115d4259I8344c0210k10695A22370E8228
$$ -76222 151398 -69589 44404 -127378 137115 -44259 98344 -30210 -240905 122370 58228
19470c47327A27213J03990c57948A82749P3182f6861D4945J20115a08627B3766
$$ -347327 127213 231203 -357948 182749 255931 -66861 44945 165060 -108627 23766
19459d11535f2573q3601K4416D1115J2299A1963J49489B8070b01391B24589B1528
$$ -411535 -62573 -146174 -121758 41115 53414 11963 161452 28070 -201391 224589 21528
19447b22734j30830H8720b82390B3164d01435a65421k7629o5329a10437B9404
$$ -222734 -353564 88720 -282390 23164 -401435 -165421 -193050 -258379 -110437 29404
19436A25802c9598B86686j20648b50582J20689B57397h6778N987B76772b03804
$$ 125802 -39598 286686 166038 -250582 -129893 257397 -86778 -80791 276772 -203804
19425a64780E3149M7604J11680f7300B5287K2534J32839E92a40359p8607A36592
$$ -164780 53149 100753 212433 -67300 25287 47821 180660 592 -140359 -218966 136592
19413A0823c15069N4394p6443b7927Q000r2009A4590b34914q6467e8220b7715
$$ 10823 -315069 -260675 -337118 -27927 -19927 -111936 14590 -234914 -321381 -58220 -27715
19401d3477I8091c7179A16300b31392C31748d3570k76141A71613p672D5907a54206
$$ -43477 98091 -37179 116300 -231392 331748 -43570 -319711 171613 163941 45907 -154206
19389A00314a16808j8825M7865n0766F2468e1362j58481r69G8179c19712J52940
$$ 100314 -116808 -135633 -87768 -138534 62468 -51362 -209843 -210812 78179 -319712 -166772
19378a66772d0263m0474j1850I9280b95614A47005J20143d62637A11232a04361
$$ -166772 -40263 -80737 -92587 99280 -295614 147005 267148 -462637 111232 -104361
19367A12192a47606N8143j61227k58733C70270d42200K11776b720k06346F2267
$$ 112192 -147606 -89463 -250690 -509423 370270 -442200 -230424 -2720 -209066 62267
19356b16069O3547C049a26985K2369J572d0140n9684B1171a91808i870A27262
$$ -216069 -152522 3049 -126985 -104616 -103044 -40140 -99824 21171 -191808 -9870 127262
19344f231k4418D128f7023H0424k4657p174b1079n6788n8433j59650h8755N861
$$ -6231 -30649 4128 -67023 80424 55767 48593 -21079 -77867 -136300 -295950 -88755 -82894
19332h2894k12171a2796A60882G7860c35685A76375a32015J7707D9850d5946Q481
$$ -82894 -295065 -12796 160882 77860 -335685 176375 -132015 -114308 49850 -45946 -37465
19321c7465k20022j32113C8024a75575A60937A5042a77173G3716J08235c7444
$$ -37465 -257487 -389600 38024 -175575 160937 15042 -177173 73716 181951 -37444
19310B7681c05m7378n4460n9094d7143P397e080j08941A32449c419l6943m65175
$$ 27681 -305 -47683 -102143 -161237 -47143 -39746 -5080 -114021 132449 -3419 -40362 -505537
19298e05537a40094j19359A09898a5510A1020g3445H964c5582l52472A0999f2244
$$ -505537 -140094 -259453 109898 -15510 11020 -73445 8964 -35582 -388054 10999 -62244
19286b2174q8443h700o8077m5084l5778j26224C5131K3186i3980F2663e5870j55726
$$ -22174 -110617 -8700 -76777 -121861 -157639 -283863 35131 58317 -93980 62663 -55870 -211596
19274b11596h0916l1977K4771k5634b8127C0914J07410n6842a83947J8210C08846
$$ -211596 -80916 -112893 -88122 -113756 -28127 30914 138324 81482 -183947 -165737 308846
19262e4536j19669o9210A33220R2006a47515C08166i3922I6658l3168K9279B9900
$$ -54536 -174205 -243415 133220 225226 -147515 308166 -93922 96658 63490 92769 29900
19250b64171i9061C7079i8530A47616c0418a969j62730A30415f550j28787L1383
$$ -264171 -99061 37079 -98530 147616 -30418 -1969 -164699 130415 -6550 -135337 -103954
19239a03954b8037f598C7013a21277k02409a28109K3199k41266B0166i8272D8991
$$ -103954 -28037 -6598 37013 -121277 -323686 -128109 -104910 -346176 20166 -98272 48991
19227H663a52071C1687O9334N3696o9504a31438A66499l9743L9930b9167n4023
$$ 8663 -152071 31687 101021 154717 85213 -131438 166499 126756 166686 -29167 -83190
19216h3190k61966i9108m6069f8109j7302C93729b54333q9881m9473B82323c41745
$$ -83190 -345156 -99108 -145177 -68109 -85411 393729 -254333 -344214 -393687 282323 -341745
19204c7210C7607Q8311g1490I4228J04301b8862J185J0834j3702k00031l51701
$$ -37210 37607 125918 -71490 94228 198529 -28862 -27677 -16843 -30545 -230576 -582277
19193e82277d0865j63466k427B87288b3643j42851A84390o0015c21660a60776
$$ -582277 -40865 -204331 -206758 287288 -23643 -166494 184390 124375 -321660 -160776
19182c37705I2286J09170b63496N8982B44791j12279d0014j74878A29762g3467
$$ -337705 92286 201456 -263496 -204514 244791 132512 -40014 -214892 129762 -73467
19171a97638j9270i4959b5306j6812F7509a03666D5118a1592A27809b08087e5275
$$ -197638 -216908 -94959 -25306 -42118 67509 -103666 45118 -11592 127809 -208087 -55275
19159b91062J26426f9139A01864f4418C94535h3840j5613M1582j42594M015A53228
$$ -291062 -164636 -69139 101864 -64418 394535 -83840 -99453 -57871 -200465 -196450 153228
19147G8110d4938B39034b73841B45950A944a22807r6109f0059A3263K5680E064
$$ 78110 -44938 239034 -273841 245950 1944 -122807 -218916 -60059 13263 38943 5064
19135B9324L42060e2811F2046a18627d4527j20626A4894b12766e0671D8323d1684
$$ 29324 371384 -52811 62046 -118627 -44527 -165153 14894 -212766 -50671 48323 -41684
19123b69826P1016j4622B12506c515A65824o3259j5613C9501L61827A75077a34924
$$ -269826 -198810 -213432 212506 -3515 165824 102565 86952 39501 401328 175077 -134924
19111D6604d5960j10751A4859M9759b70034j17492h8180j21938e8104B161J11794
$$ 46604 -45960 -156711 14859 64618 -270034 -387526 -88180 -210118 -58104 2161 113955
19100A13955a25468b6109k61203R9820N9038B1105a9848j27176E6124g1749B3618
$$ 113955 -125468 -26109 -287312 -187492 -128454 21105 -19848 -147024 56124 -71749 23618
19088a9099G1458i5725G9874pB95b03173B25084h7513q4045I6915a63352A13638
$$ -19099 71458 -95725 79874 79867 295 -203173 225084 -87513 -171558 96915 -163352 113638
19075B8694a52841j17971d7126j14288C276K83547b84417i8404M557B39812a02425
$$ 28694 -152841 -270812 -47126 -161414 3276 286823 -284417 -98404 -93847 239812 -102425
19063A13319k170a32568N4373A03389J31443l1798b47863d7919j18691I723a08172
$$ 113319 111149 -132568 -78195 103389 234832 203034 -247863 -47919 -166610 9723 -108172
19051a60297b4451l07325L4551B755K45656l440b1597A33835a3239B69910H5633
$$ -160297 -24451 -331776 -297225 2755 248411 244971 -21597 133835 -13239 269910 85633
19039c61089g3151a5213j85529a0115r8149b1075A99401I3645k3259a03214b2102
$$ -361089 -73151 -15213 -200742 -10115 -108264 -21075 199401 93645 70386 -103214 -22102
19027b7523D0619b5913l6921r2136m0550F7365g8004o8653q3621J06259P885j6065
$$ -27523 40619 -25913 -62834 -154970 -195520 67365 -78004 -146657 -230278 -124019 -116134 -132199
19015a32199k05883A01656B0547c7627I4179f3068o4582e3167F5619a36398C41569
$$ -132199 -338082 101656 20547 -37627 94179 -63068 -127650 -53167 65619 -136398 341569
19003a94622e3830B32105J6730C6042a87804I9830K1720J74387H5053g722l64089
$$ -194622 -53830 232105 248835 36042 -187804 99830 121550 295937 85053 -7722 -371811
18992c71811G4374a12336j5677N7567a3195j00420q4419i5284k93524J71914H0599
$$ -371811 74374 -112336 -128013 -70446 -13195 -113615 -198034 -95284 -388808 -216894 80599
18980h9869l5985C4756f1697C07220h4285o2983c0110D0888b43614N0312H4604
$$ -89869 -125854 34756 -61697 307220 -84285 -147268 -30110 40888 -243614 -193302 84604
18968A49567A6632J9842a17782j03821g154A2046K6598j4717a48962B1925l021
$$ 149567 16632 36474 -117782 -221603 -7154 12046 38644 23927 -148962 21925 18904
18957A8904K9946d09223g1919k42610f3194A03657O8389f4218F4963a92760d0388
$$ 18904 48850 -409223 -71919 -314529 -63194 103657 172046 -64218 64963 -192760 -40388
18945g6231j13301o6788J25707a8828A55527a22190K7226b1799A88426p7285c9569
$$ -76231 -189532 -256320 -130613 -18828 155527 -122190 -94964 -21799 188426 111141 -39569
18933I9599p756O6168a76268C825h9866o1326c681n5302k58768A46486o1637a82586
$$ 99599 91843 158011 -176268 3825 -89866 -151192 -3681 -58983 -317751 146486 84849 -182586
18920a04462G0435a8182o5332a7623H1401K2044p139e7301D4241h9865a5271l707
$$ -104462 70435 -18182 -83514 -17623 81401 103445 96306 -57301 44241 -89865 -15271 -18978
18908a8978A82125o0854c25421B9721a49502A51012a29302E4227R5278h5743r7917
$$ -18978 182125 121271 -325421 29721 -149502 151012 -129302 54227 149505 -85743 -183660
18897a83660e7229I8121a377j22273C4488c86270d3986B66947a04504b8990C39555
$$ -183660 -57229 98121 -1377 -123650 34488 -386270 -43986 266947 -104504 -28990 339555
18885F7780R2865e5296k96920N6831A71414a30067d4058m0877j9635d3853A73074
$$ 67780 160645 -55296 -352216 -295385 171414 -130067 -44058 -84935 -104570 -43853 173074
18873G2912g8577A87103B7451P7104l6349a43570a4680l1234A6307J04428K87329
$$ 72912 -78577 187103 27451 104555 68206 -143570 -14680 -45914 16307 120735 408064
18862D08064i5779A21787d6176A64106a7874j80563A5697a05003J2307a9669A91543
$$ 408064 -95779 121787 -46176 164106 -17874 -198437 15697 -105003 -92696 -19669 191543
18850e5238b2413p2938j2045q2828I9370d409I2385J1974L0427m3962b76856A58014
$$ -55238 -22413 -95351 -107396 -190224 99370 -4409 92385 104359 134786 90824 -276856 158014
18837B63012j25357m9047a83171R400j10040a23243B94742D9291g6504o8346M8443
$$ 263012 137655 88608 -183171 -173771 -283811 -123243 294742 49291 -76504 -144850 -96407
18826i6407m3987L0652j74826D0059M22474c44369F156b4121C8961L46668b34990
$$ -96407 -140394 -109742 -284568 40059 462533 -344369 6156 -24121 38961 385629 -234990
18814c84460d6312k14786e0967j21421C2419a66209n721L5814M9824j2771j09167
$$ -384460 -46312 -261098 -50967 -172388 32419 -166209 -171930 -136116 -86292 -99063 -208230
18803b08230b045j71061B58038E9878B2529n059d2513j4207F1277M04818A90912
$$ -208230 -2045 -173106 258038 59878 22529 17470 -42513 -56720 61277 466095 190912
18791A50949p3309a9248A14698C0848M13260G5476J13623o6372g9737A41441A7826
$$ 150949 77640 -19248 114698 30848 444108 75476 189099 122727 -79737 141441 17826
18779b51432Q8778b5272A85679l2338b61567C54050b86563a04349o7723e6790
$$ -251432 -162654 -25272 185679 153341 -261567 354050 -286563 -104349 -172072 -56790
18768A04628N9781o7653H435a01078r5077F0793g3619k57051h6743j03404F8831
$$ 104628 164409 96756 8435 -101078 -196155 60793 -73619 -330670 -86743 -190147 68831
18756a90990c4281o6544j75443B43133a94339l2866K0238B27427b92443A76507
$$ -190990 -34281 -100825 -276268 243133 -194339 -227205 -206967 227427 -292443 176507
18745A27399d9245k2135j48110F8284a2691o9244j22218r3581B13653a33886d9392
$$ 127399 -49245 -71380 -219490 68284 -12691 -81935 -204153 -297734 213653 -133886 -49392
18733d14089H2846R5795c2177j97564h5342j09104A59294e10243A69321d80340
$$ -414089 82846 178641 -32177 -229741 -85342 -194446 159294 -510243 169321 -480340
18722b62867A13430f2762k27705A14465K27284a79198j8578a9129j23636B73392
$$ -262867 113430 -62762 -290467 114465 341749 -179198 -197776 -19129 -142765 273392
18711H1304k3259a47840j04921A31535c21144b5777k11387A55885a04208d9657
$$ 81304 58045 -147840 -252761 131535 -321144 -25777 -237164 155885 -104208 -49657
18700B4399N7870a26145K5203A31015b12665A43781a48893a5996j48326H9802
$$ 24399 82269 -126145 -100942 131015 -212665 143781 -148893 -15996 -164322 89802
18689B62962D9767a91621A85232c36644a0565I4126e0573j54270L8467f2758p0886
$$ 262962 49767 -191621 185232 -336644 -10565 94126 -50573 -204843 -166376 -62758 -133644
18678a33644j1755k32152B85528d41660J0026f9378C28339f2969k81231C08151
$$ -133644 -145399 -377551 285528 -441660 -431634 -69378 328339 -62969 -344200 308151
18667c24343B49842A3011c56253M8728e1104B7291J66509a04867j78316L5012
$$ -324343 249842 13011 -356253 -307525 -51104 27291 193800 -104867 -283183 -248171
18657b48171i1370j34207k6479o302m8678A55741b5419r0404C64079H3683c57124
$$ -248171 -91370 -225577 -252056 -258358 -307036 155741 -25419 -115823 364079 83683 -357124
18645c0017a4083D19662d03805A86578d26930B10220a67455K8113K2558B10412
$$ -30017 -14083 419662 -403805 186578 -426930 210220 -167455 -139342 -116784 210412
18634a67327c6398k84340Q2876a08036D7834h2789A13211c49855A82522c60042
$$ -167327 -36398 -320738 -237862 -108036 47834 -82789 113211 -349855 182522 -360042
18623b4106j12439B880J1920b15408A52717L6718B28K03371b76753B09575b9052
$$ -24106 -136545 2880 14800 -215408 152717 189435 228 203599 -276753 209575 -29052
18611c6863j76960c3853N302A21673B1249O9646d6978j03112F0949c75996B2267
$$ -36863 -213823 -33853 -28551 121673 21249 90895 -46978 -150090 60949 -375996 22267
18599f6993B33701o8535b38093I4190a85070a7487j69437h7608k12450B10260
$$ -66993 233701 165166 -238093 94190 -185070 -17487 -186924 -87608 -300058 210260
18588a31580q9608q8639a18674j90041a1094A64143a77013A5978h5173l31156
$$ -131580 -221188 -309827 -118674 -308715 -11094 164143 -177013 15978 -85173 -416329
18578d16329B72608H4924A1253h6013A55354p7327h1430p2396O9079j10987g0581
$$ -416329 272608 84924 11253 -86013 155354 78027 -81430 -153826 -84747 -195734 -70581
18566a80736j8414e4212C3879c5053I8988D5573g7797n7480l2286n2772C4149
$$ -180736 -199150 -54212 33879 -35053 98988 45573 -77797 -135277 -167563 -220335 34149
18554c2467j73858r3157d0462D4510M1681b01914H799b08201B60496H1273L1909
$$ -32467 -206325 -299482 -40462 44510 86191 -201914 8799 -208201 260496 81273 113182
18543A13182g4756A55691i9125F8995d6409q643e033A13997n3588c21780b5399
$$ 113182 -74756 155691 -99125 68995 -46409 -55052 -5033 113997 60409 -321780 -25399
18531F3640J28876q3270A3632f964n17810b06416k67582K31864d2471A17080d02674
$$ 63640 192516 109246 13632 -6964 -524774 -206416 -473998 -242134 -42471 117080 -402674
18519a0506D0073J2786M9857b51109I023b70484A85932g6118A19758a04971j45542
$$ -10506 40073 52859 102716 -251109 9023 -270484 185932 -76118 119758 -104971 -250513
18508b50513F5408B6540b58537o759A94997a60852E4304b28083k92261a68j62355
$$ -250513 65408 26540 -258537 -265296 194997 -160852 54304 -228083 -520344 -168 -162523
18497a62523e355j21665a6400C2261e9252B1066h2696j37365J00239I8674c24534
$$ -162523 -5355 -127020 -16400 32261 -59252 21066 -82696 -220061 -119822 98674 -324534
18485c29288A0825a09078k9458O1058B2687a42399A60616a88927f4989B20206
$$ -329288 10825 -109078 -138536 -77478 22687 -142399 160616 -188927 -64989 220206
18474f0180a5235k34711J15022B59231a64008f6388j2525F7416M9425h0105j75785
$$ -60180 -15235 -249946 -134924 259231 -164008 -66388 -78913 67416 116841 -80105 -255890
18463b55890C319A93b6634q8074j02839Q2862A05077a66095A1907a8986l54471
$$ -255890 3319 193 -26634 -114708 -217547 -134685 105077 -166095 11907 -18986 -373457
18452c73457a31890L6942o0271k32204N2566J00103A73333a55820N0524B87310
$$ -373457 -131890 -94948 -155219 -387423 -334857 -234754 173333 -155820 -105296 287310
18441a61833k29178J55629R8746I5606l2308b60617A8158R4589E0009K04154a36646
$$ -161833 -391011 -235382 -136636 95606 63298 -260617 18158 112747 50009 254163 -136646
18429c03817J30011A56189b21871o2448A21893b73380A36930a91134k56538a49335
$$ -303817 -173806 156189 -221871 -284319 121893 -273380 136930 -191134 -447672 -149335
18418c8639C301a36917a2153A95854C1734b58098d7256j06537l9460n7511a06485
$$ -38639 3301 -136917 -12153 195854 31734 -258098 -47256 -153793 -193253 -250764 -106485
18406A62690B1560J1670O5066J73691G7927e5413A80192f5088C72205j58522a05918
$$ 162690 21560 33230 98296 271987 77927 -55413 180192 -65088 372205 213683 -105918
18394c3576A38036b26210c8470E0985g4006k13419c5466j3526q5025B65727a81438
$$ -33576 138036 -226210 -38470 50985 -74006 -287425 -35466 -48992 -134017 265727 -181438
18382a53666O666A80752a1735A51117L2160D3833A8787a9015A38836O3832a60322
$$ -153666 -147000 180752 -11735 151117 183277 43833 18787 -19015 138836 202668 -160322
18370I1492a43871A20335h2618m2289c0285j49221H601L70961a30770r7420J13162
$$ 91492 -143871 120335 -82618 -124907 -30285 -179506 8601 379562 -130770 -228190 -115028
18359a15028J1736B9839M5459J05705g3830A44056n0880N776P4775b16959A47553
$$ -115028 -103292 29839 75298 181003 -73830 144056 93176 98952 173727 -216959 147553
18347a6859j67801j39846A34537J56201g1263b652D216d43954A62871F2319h1955
$$ -16859 -184660 -324506 134537 290738 -71263 -2652 4216 -443954 162871 62319 -81955
18335I2144K61064F7823Q5591a06461j3689M5500c6555I3294j1711a92059B13332
$$ 92144 353208 67823 153414 -106461 -120150 -74650 -36555 93294 81583 -192059 213332
18323C12905b35713c4780k34885c5701A54720b14571H7747C7470N3587J9356a51788
$$ 312905 -235713 -34780 -269665 -35701 154720 -214571 87747 37470 91057 110413 -151788
18311C6563N6039k6422b18733L5332A43200O5032D194c25785M0172B83931D6422
$$ 36563 92602 66180 -218733 -183401 143200 208232 4194 -325785 -285613 283931 46422
18299a26452A26985B4364P3847f7691m07591J74596B58379h2128G2760e1381m8994
$$ -126452 126985 24364 98211 -67691 -475282 -300686 258379 -82128 72760 -51381 -100375
18288a00375E6450J56300d62941A31849c00848A46743K1676f4008A6371J4365
$$ -100375 56450 212750 -462941 131849 -300848 146743 168419 -64008 16371 30736
18278C0736b4974n6245l14580E2938a78420E7844B6105K06508C7047a92773A053
$$ 30736 -24974 -81219 -395799 52938 -178420 57844 26105 232613 37047 -192773 1053
18266D10989B01139g1873K3838C4289d1121k2832F1707M1633b34594f1772l02446
$$ 410989 201139 -71873 -48035 34289 -41121 -63953 61707 103340 -234594 -61772 -364218
18255c64218A154a09133j01354D2841L19141j42878a52140c2341B27928c66934
$$ -364218 1154 -109133 -210487 42841 361982 219104 -152140 -32341 227928 -366934
18244b47793a0688A5413d43034J58764O6416E0638B4521b70287C40007j52902
$$ -247793 -10688 15413 -443034 -284270 -217854 50638 24521 -270287 340007 187105
18234A87105b74315A32359a56208A8889c46373h8086G2284e3072a4993m93888
$$ 187105 -274315 132359 -156208 18889 -346373 -88086 72284 -53072 -14993 -508881
18224e08881a61440A32669g4753r1632A6834i3874E0140h5348l8797H1813a01561
$$ -508881 -161440 132669 -74753 -166385 16834 -93874 50140 -85348 -124145 81813 -101561
18212a47491H50P7952b91240a09838k85876H6726K63116a07793A20930P4169a36161
$$ -147491 850 78802 -291240 -109838 -395714 86726 349842 -107793 120930 195099 -136161
18200G1896g5876D8020i9102j40615o05P4637B06229a543p7004d983m4743A09227
$$ 71896 -75876 48020 -99102 -239717 -240322 -165685 206229 -1543 -78547 -4983 -49726 109227
18187A7381a33145A50559a22731M7340o8063F2546J80446c4850N266A37369a72275
$$ 17381 -133145 150559 -122731 -75391 -143454 62546 242992 -34850 -29584 137369 -172275
18175B02440b0064q7464A66629a00672o673C6751a78590Q1132n6600j43915H4836
$$ 202440 -20064 -107528 166629 -100672 -107345 36751 -178590 -97458 -154058 -297973 84836
18163d6165m46494g1107I489d7745m8699j18487E4000g506k29824R8287k2210
$$ -46165 -492659 -71107 9489 -47745 -96444 -214931 54000 -7506 -237330 -139043 -161253
18152a61253N6128A92629g6522a0647A67754B2845f3881k81166a26622A52141
$$ -161253 -105125 192629 -76522 -10647 167754 22845 -63881 -345047 -126622 152141
18141c0590j36140O0155j44996H5873B4982a11576m4072O4408A45603J32176A37217
$$ -30590 -166730 -106575 -251571 85873 24982 -111576 -155648 -91240 145603 277779 137217
18129d45317a21353j40916A45723a46652A50663o7874b5573p8120j73821e6487
$$ -445317 -121353 -262269 145723 -146652 150663 82789 -25573 -103693 -277514 -56487
18118a45876j77637a09191B17615g7246q4655J7005e7183j74201j799B6235P7287
$$ -145876 -323513 -109191 217615 -77246 -161901 -144896 -57183 -231384 -233183 26235 103522
18107A03522d33681i6833k02308B8300b11784c7522a4061j46043A52196D8407
$$ 103522 -433681 -96833 -299141 28300 -211784 -37522 -14061 -160104 152196 48407
18096e2706H7316c47848a26310e2783E0199a66810j0898f4285I5285a04169q3751
$$ -52706 87316 -347848 -126310 -52783 50199 -166810 -177708 -64285 95285 -104169 -187920
18085a87920N4549j97721f5047m8050A56800h8143l937k88530A44113c8495q2096
$$ -187920 -133371 -331092 -65047 -113097 156800 -88143 -92080 -380610 144113 -38495 -120591
18074a20591B40567A16391a51695K8226b6928k25447H2282B3671a61064j81727
$$ -120591 240567 116391 -151695 -123469 -26928 -252375 82282 23671 -161064 -342791
18064c42791A98329b09616L4487e6636l4670C00846f376j7648B28780p6474k3782
$$ -342791 198329 -209616 -175129 -56636 -91306 300846 -6376 -24024 228780 152306 128524
18053A28524J84319a41624D3948J9457L09643a56302N0364a9837b442j56498O9264
$$ 128524 312843 -141624 43948 63405 373048 -156302 -105938 -19837 -2442 -158940 -89676
18042h9676A06403R404L1839M2637B2470b26481j77355a07746A93609c0965A60789
$$ -89676 106403 115807 147646 190283 22470 -226481 -403836 -107746 193609 -30965 160789
18030d5781B01815l8459A555b60938M850B8922c61638f8580r3933E4707M4523
$$ -45781 201815 163356 1555 -260938 -256088 28922 -361638 -68580 -162513 54707 99230
18019I9230d4324D775b30496I7714M7350a03888o9449A08968P5962b7679F2026
$$ 99230 -44324 4775 -230496 97714 145064 -103888 -173337 108968 184930 -27679 62026
18007E5354f108B24472H6763a0655j36695O0835j55507Q6423A94797b45830A12743
$$ 55354 -6108 224472 86763 -10655 -147350 -86515 -242022 -155599 194797 -245830 112743
17995E6250b9672m6530j59046R4053A10924A5899b49747a993n4637B1729O2129
$$ 56250 -29672 -76202 -235248 -141195 110924 15899 -249747 -1993 -56630 21729 83858
17984H3858l3756O3971b48361A50859f2765A33969F5396L5631h3899I0920c4019
$$ 83858 50102 114073 -248361 150859 -62765 133969 65396 101027 -83899 90920 -34019
17972C36241c74696I3846a2763j57393j3575B30643a24767d4988C09144c1517
$$ 336241 -374696 93846 -12763 -170156 -183731 230643 -124767 -44988 309144 -31517
17961B6512O077L6120A3726a87470m6408G3240f6801k6895A93237a32302a0312
$$ 26512 32589 68709 13726 -187470 -233878 73240 -66801 -93696 193237 -132302 -10312
17949e0005A2629J98222C6912b2372L196k59585D7077i2544c2937j33333f1152
$$ -50005 12629 210851 36912 -22372 -19176 -278761 47077 -92544 -32937 -166270 -61152
17937A92110i1100m9261e8013K2098d183C59067A62782J53881c27062Q915l1346
$$ 192110 -91100 -140361 -58013 -35915 -4183 359067 162782 316663 -327062 -318147 -349493
17926c49493g0297A91500e0581A95539G4514J76047H690a2531A5904g8090J5122
$$ -349493 -70297 191500 -50581 195539 74514 250561 8690 -12531 15904 -78090 -62968
17915f2968A6405i6477m067m2007j943p9514A43390J6633F8151a34733m9586A06440
$$ -62968 16405 -96477 -100544 -142551 -144494 -224008 143390 160023 68151 -134733 -184319 106440
17902G3339A985b9110j70701E9093J00023a85346C70352G8659K1444a26311C8835
$$ 73339 1985 -29110 -199811 59093 159116 -185346 370352 78659 100103 -126311 38835
17890B71638c3032r5120j70001c2903A82071l275j4450a53356j6008N0172M7478
$$ 271638 -33032 -128152 -298153 -32903 182071 178796 164346 -153356 -169364 -119192 -71714
17879g1714B74027H7192a46997C3006c7225B50618j25044e26008C4284a46825
$$ -71714 274027 87192 -146997 33006 -37225 250618 125574 -526008 34284 -146825
17868i2470c0193l01869d919l5620A2426L5222J16570D0532A414L01800E5475
$$ -92470 -30193 -332062 -4919 -40539 12426 47648 164218 40532 1414 303214 55475
17856a37731I3541M0374C386h1305D84940a43803M1210L5419B65938b46096B1639
$$ -137731 93541 133915 3386 -81305 484940 -143803 -102593 -67174 265938 -246096 21639
17844a93505A42114l6773e2976r371A3147a11387A5625a98435A69163n6900a09784
$$ -193505 142114 105341 -52976 -62347 13147 -111387 15625 -198435 169163 112263 -109784
17832a16868B68442B6494J6006K19442a80385j08583m1669M340J00153f1969j82303
$$ -116868 268442 26494 42500 261942 -180385 -288968 -330637 -326297 -226144 -61969 -244272
17821b44272d5759p2412A49238c6661G601L13958q4654H5460J35663C2786a28150
$$ -244272 -45759 -118171 149238 -36661 7601 321559 236905 85460 221123 32786 -128150
17809b19072B50036j23384A1495d5485p8467D7324a28382L7630k22647N2656B7048
$$ -219072 250036 126652 11495 -45485 -123952 47324 -128382 -90752 -313399 -260743 27048
17797a09106k9375D1027i2735K3749i863j81336E0153f7980j01930A22199a47503
$$ -109106 -138481 41027 -92735 -68986 -9863 -191199 50153 -67980 -169910 122199 -147503
17785i026q818B00780d4316A87212M1773J355e5333l68l9707B2214Q1338K78511
$$ -9026 -17844 200780 -44316 187212 228985 230340 -55333 -55701 -95408 22214 103552 382063
17773C82063I4605l359b90586a31956G6484A4687N1182b91243a45399j32379N179
$$ 382063 94605 91246 -290586 -131956 76484 14687 65869 -291243 -145399 -277778 -272599
17762b72599B62177b7840F2885Q807Q755A7202c18688a28444J1620M3854A65205
$$ -272599 262177 -27840 62885 71692 80447 17202 -318688 -128444 -116824 -72970 165205
17750A06901d0001B11916D603a53840O555A53955j0166a09711J5568C40708j39486
$$ 106901 -40001 211916 4603 -153840 -147285 153955 143789 -109711 -94143 340708 201222
17739B01222D1331h6017K2450G2546K6761D4524K26121q6623H6209l2185b6662
$$ 201222 41331 -86017 -63567 72546 99307 44524 270645 184022 86209 54024 -26662
17727B4895a13604A08882C8928c92646a69802b3662A57727j2942I882L31425j68119
$$ 24895 -113604 108882 38928 -392646 -169802 -23662 157727 144785 9882 341307 173188
17716A73188a50553B02371N4528a75530A54294J2475G0835J4a40108l14516e0816
$$ 173188 -150553 202371 256899 -175530 154294 166769 70835 70849 -140108 -454624 -50816
17704a31795j76262E983J88844D242a34727B6811b26430A50172d1221B21379P1879
$$ -131795 -308057 5983 194827 4242 -134727 26811 -226430 150172 -41221 221379 293258
17693B93258b08266h9788j64944B77696A4316o082i634l81514H7042K40893A50967
$$ 293258 -208266 -89788 -254732 277696 14316 8234 -9634 -391148 87042 327935 150967
17681B44683F3623O6674a6684j43650A45943a48276A34189G951P7171e8165C3108
$$ 244683 63623 130297 -16684 -160334 145943 -148276 134189 7951 85122 -58165 33108
17669h7851p6428b247C8063a77853F9347J52224O8893h7682A39304B7871J00342
$$ -87851 -164279 -2247 38063 -177853 69347 221571 290464 -87682 139304 27871 128213
17658A28213e4693H1830a98462O7703B7449e0811D3274a22924j37706C15170J6354
$$ 128213 -54693 81830 -198462 -130759 27449 -50811 43274 -122924 -260630 315170 331524
17647C31524R8151b06619I4766f7042c687a372C14672C9887a09512k5955A63092
$$ 331524 429675 -206619 94766 -67042 -3687 -1372 314672 39887 -109512 -135467 163092
17635A50580d0346A75827m4236P832j8224P5502C5328C611g7587A14031J73255
$$ 150580 -40346 175827 131591 139423 121199 196701 35328 3611 -77587 114031 287286
17624B87286B9154K03453c9848l44353B64857p676j1190q2120J12483A13424m5143
$$ 287286 29154 232607 -39848 -384201 264857 257181 245991 163871 276354 113424 68281
17613F8281a03422b9340C1339g3212D5518a36027A58289K55407A03239L72980
$$ 68281 -103422 -29340 31339 -73212 45518 -136027 158289 413696 103239 476219
17603D76219A46959n3931J7988m6204J1496K26513d1546D2678K6161M643i7452
$$ 476219 146959 93028 111016 64812 76308 302821 -41546 42678 68839 73482 -97452
17591a21735j0076F0014B1343a93020A1326L0846a52389B32882I7679a89948A90623
$$ -121735 -131811 60014 21343 -193020 11326 42172 -152389 232882 97679 -189948 190623
17579h328I3388P7624K7774Q9724A05633n145J09985a49459k0484B20008K3241
$$ -8328 93388 171012 198786 288510 105633 100488 210473 -149459 -169943 220008 243249
17568B43249a72339A8136J57793f2068A91951a2052F3703h2277n5341d2218I1648
$$ 243249 -172339 18136 175929 -62068 191951 -12052 63703 -82277 -137618 -42218 91648
17556a29859K0410B3884J9670A9452K83626a07045B44337P8951f4346A13804J5486
$$ -129859 -109449 23884 43554 19452 303078 -107045 244337 323288 -64346 113804 129290
17545A29290M4573f7891j32063K1720d0491b283j5978B80426F0402h2323B76510
$$ 129290 173863 -67891 -199954 -178234 -40491 -2283 -18261 280426 60402 -82323 276510
17533c018k6592c023F212Q4308J3514J61253D8302b44987B85443A9643J74359
$$ -3018 -29610 -3023 6212 90520 104034 265287 48302 -244987 285443 19643 194002
17522A94002B8358g4513B00064I8322k1053a68958j0138A31386K59008A88360
$$ 194002 28358 -74513 200064 98322 77269 -168958 -179096 131386 390394 188360
17511D1923b35679e4763E7853c9321C6328A2510c07857C76556c0624D1185J05864
$$ 41923 -235679 -54763 57853 -39321 36328 12510 -307857 376556 -30624 41185 147049
17500A47049g9928D30920C755a63874A31799K43820a10483B17076I6585a614F12011
$$ 147049 -79928 430920 3755 -163874 131799 375619 -110483 217076 96585 -1614 612011
17488C06442c2576j98180F1480j6413J31075e3448j01844C61261i9507A22947
$$ 306442 -32576 -230756 61480 45067 176142 -53448 -155292 361261 -99507 122947
17477g7164B88446a43041B87747j30012M019R0907p9710E4131h5010a7040D56831
$$ -77164 288446 -143041 287747 157735 161754 252661 172951 54131 -85010 -17040 456831
17465g8802D06005A65574J70023a68389A59564Q8167J07994A24704c11C16315
$$ -78802 406005 165574 335597 -168389 159564 247731 355725 124704 -311 316315
17454C41661A24122a34229C9306n576O0156L15619A8463a3580C14870A40725J41541
$$ 341661 124122 -134229 39306 33730 93886 409505 18463 -13580 314870 140725 282266
17443B82266Q0807C2516K37640d180C13513D3276M39965G3693Q2842g8845r472
$$ 282266 363073 32516 270156 -4180 313513 43276 483241 73693 156535 -78845 -88317
17432h8317A42081J63064D350e5975a7432A06737K615J29861l3335R7292F6228
$$ -88317 142081 305145 4350 -55975 -17432 106737 109352 239213 205878 303170 66228
17420E26112A38227K21680L6389A54448M56611A30964J4341K24182q6982J0183
$$ 526112 138227 359907 396296 154448 611059 130964 145305 369487 282505 292688
17410B92688A00552J63901J1435j06981o370J76895H106M64888I5253e9924B69247
$$ 292688 100552 264453 275888 168907 162537 339432 8106 472994 95253 -59924 269247
17398e3488F2068K76971a29701d4112E81167B18723K48380f4786I2424J26600
$$ -53488 62068 339039 -129701 -44112 581167 218723 467103 -64786 92424 219024
17388B19024J19543Q8330p6531n3503j0685D4613L42691Q9161k16057j11656k2883
$$ 219024 338567 426897 350366 296863 286178 44613 387304 476465 260408 148752 125869
17377A25869J67787a37835B22921N7443j3374b85941C0068J6171L67129A29616
$$ 125869 293656 -137835 222921 280364 266990 -285941 30068 46239 413368 129616
17366A66778l7480Q1363p9271K08434b44988C45827j26529J13513F9698b22697
$$ 166778 129298 210661 131390 339824 -244988 345827 219298 332811 69698 -222697
17355B33318J0657A16791F005L39683c3512C58768B8219K45049m6795n6605J93787
$$ 233318 243975 116791 6005 345688 -33512 358768 28219 273268 226473 169868 363655
17344C63655b00313e0956A10913R700a1225A69095d1208J3396A38535k3764J76540
$$ 363655 -200313 -50956 110913 120613 -11225 169095 -41208 -27812 138535 114771 291311
17333B91311P2418r9389c00893C8015K51409J23621J22590B41813q3283J40233
$$ 291311 363729 264340 -300893 38015 289424 413045 535635 241813 158530 298763
17323B98763j18035F4883L40936B0169N48553A34558M1209K9793K03828A77237
$$ 298763 180728 64883 405819 20169 568722 134558 175767 205560 409388 177237
17312A80611H2952J03553b40224I0697i8635B94855q1977J24985j35521P4044
$$ 180611 82952 186505 -240224 90697 -98635 294855 212878 337863 202342 276386
17302B76386N334m2020L22515A70531a63375A57258l6632D4095O6593D9782J21408
$$ 276386 281720 239700 562215 170531 -163375 157258 120626 44095 110688 49782 171190
17291A71190a69070B5643L41018R3849G8050L34598D1411N0171J35322C3352K94198
$$ 171190 -169070 25643 366661 460510 78050 412648 41411 91582 226904 33352 327550
17280C27550A44881J49227j24359h1735B28016L338A1316g7898B38792O3347j40369
$$ 327550 144881 294108 169749 -81735 228016 231354 11316 -77898 238792 302139 161770
17269A61770F6818K24492a1066I0813a4369I2499L76076a56918D16042M7211A0756
$$ 161770 66818 291310 -11066 90813 -14369 92499 468575 -156918 416042 463253 10756
17257A52860J19716j09846a55846C16531n3602O8234c0145D15356j67866b15067
$$ 152860 272576 162730 -155846 316531 262929 331163 -30145 415356 247490 -215067
17246B45999O1088A00606L750K14856a18862j2036j3818N5394C07586o4396J68245
$$ 245999 307087 100606 104356 319212 -118862 -130898 -144716 -89322 307586 243190 411435
17235D11435d8062D02356A51846n1210M88738j79777Q8824G9431L72916j48177
$$ 411435 -48062 402356 151846 100636 589374 409597 498421 79431 452347 304170
17225C04170a70281A27181J89706o9072L0829l1204K34204r1722j29629J96820
$$ 304170 -170281 127181 316887 247815 278644 247440 481644 389922 260293 457113
17215D57113k25923C0640M06708A14140K41210I9750L0222M5944L78356A21622
$$ 457113 231190 30640 437348 114140 355350 99750 129972 175916 554272 121622
17204B70800b3166B96536C7294O3451J68742P9943F8104J73399g9091D20523R9394
$$ 270800 -23166 296536 37294 100745 269487 349430 68104 241503 -79091 420523 519917
17193E19917B28222M1329K64954j26423J19000j13976K4193r9074j04823J51150
$$ 519917 228222 269551 534505 408082 527082 413106 437299 338225 233402 384552
17183C84552j83095J86578k2300O0280j2815L1370j13123r6230K2749Q3207C5273
$$ 384552 201457 388035 365735 426015 413200 444570 331447 235217 257966 341173 35273
17171C13688j53149e3271C71672q306K19062q2176j59394K84492k09881j27986
$$ 313688 160539 -53271 371672 363366 582428 500252 340858 625350 415469 287483
17161B87483J4878J02537N1630j41711Q4727o2883o1562B3984K07596J40451N2860
$$ 287483 302361 404898 456528 314817 399544 336661 275099 23984 231580 372031 424891
17150D24891j79157R9752Q0229k11109J41278J07069A11016J31385K5506j26655
$$ 424891 245734 345486 425715 214606 355884 462953 111016 242401 267907 141252
17140A41252K10154P8484j43912H6056J8812K56618L07031j19509k22271m5758
$$ 141252 351406 429890 285978 86056 104868 361486 668517 549008 326737 280979
17130B80979L99010A82364K75615A27118P40876C00788P0519O427H5131M00858
$$ 280979 679989 182364 457979 127118 867994 300788 371307 377734 85131 485989
17120D85989P2628j37284K46406k78762J34905R5169k25779K19807A63638l399
$$ 485989 558617 421333 667739 388977 523882 619051 393272 613079 163638 160239
17110A60239J59533E0928M10901q946K50628P897j48795I1359L61570p0902K27077
$$ 160239 319772 50928 461829 452883 703511 711408 562613 91359 452929 382027 609104
17099F09104k62851k8491L19023J35847B41343l0372K97724J32025j60335k9800
$$ 609104 346253 317762 636785 772632 241343 210971 508695 640720 480385 450585
17089D50585J87104k00441J44050k21998K18484j11560J60671j05805j54734N2081
$$ 450585 637689 437248 581298 359300 577784 466224 626895 521090 366356 418437
17079D18437R5528J52080n7756m8798k21639O0049K6020J39018m0936A53937M08160
$$ 418437 513965 666045 608289 559491 337852 397901 423921 562939 522003 153937 562097
17068E62097A08018L23568J17621p7585K59607C21161K88069k29067J03630L00670
$$ 562097 108018 431586 549207 471622 731229 321161 609230 380163 483793 784463
17058G84463l04972j99375N3043N60178j27495l60806J42664k3267p4699j8150
$$ 784463 479491 280116 333159 893337 765842 405036 547700 524433 449734 431584
17048D31584j95034O64756k45636J75627k11797M84453D40370J76289j1693R1598
$$ 431584 236550 901306 655670 831297 619500 1103953 440370 616659 604966 696564
17038F96564j90554K16665k55341M18382j30943n5643k38084j78331L45713J05639
$$ 696564 506010 722675 467334 885716 754773 699130 461046 282715 628428 734067
17028G34067A93006K50623L03329m6772r1050J5752p5041m2649k15535L00017
$$ 734067 193006 443629 746958 700186 609136 624888 549847 507198 291663 591680
17018E91680m982M5075K42910J20016r4182k19327j46058J85369j87032P52249
$$ 591680 586698 631773 874683 994699 900517 681190 535132 720501 533469 1285718
17008A285718k86030k76296J1187R674K40550D87231M13072M4537j51766M4482
$$ 1285718 999688 723392 734579 744253 984803 487231 900303 944840 793074 837556
16998H37556j55516k5584J13204L8978k17337M29885m0496r0945k71645L08832
$$ 837556 682040 656456 769660 808638 591301 1021186 980690 889745 618100 926932
16988I26932J41910P8623l44791J95109L29700l68727k51081K84807l61119O62888
$$ 926932 1068842 1147465 802674 997783 1327483 958756 707675 992482 631363 1294251
16978A294251l84504J71652j28177j10772J92803J6552J59078k76627n4060J07127
$$ 1294251 909747 1081399 953222 842450 1035253 1051805 1210883 934256 880196 987323
16968I87323j01575J18905p6510j63659J24880K85976o8605j69842P5289r5309
$$ 987323 885748 1004653 928143 764484 889364 1175340 1106735 936893 1012182 916873
16958I16873J04394J05654k28095j68561L72141j40731M6294K02413k48523J06023
$$ 916873 1021267 1126921 898826 730265 1102406 961675 1007969 1210382 961859 1067882
16948A067882J8451J58310R9506l01864p6192J53929q535L38706k30155J40809
$$ 1067882 1086333 1244643 1344149 1042285 966093 1120022 1111487 1450193 1220038 1360847
16938A360847J55973J28925n86080P7969J25593J47413j21049K46066j75179j58050
$$ 1360847 1516820 1645745 1059665 1137634 1263227 1410640 1289591 1535657 1360478 1202428
16928A202428m9407k39317N75325l37478R8199L83174j11313j45294J05130Q0676
$$ 1202428 1153021 913704 1489029 1151551 1249750 1632924 1521611 1376317 1481447 1562123
16918A562123J96619k96833J99171r2019k00616j29652J97712K46341M00548n80632
$$ 1562123 1758742 1461909 1661080 1569061 1368445 1238793 1436505 1682846 2083394 1502762
16908A502762j73130M42439j03600J19161K1851j27132M9791P1691P7534K56444
$$ 1502762 1329632 1772071 1668471 1787632 1809483 1682351 1732142 1803833 1881367 2137811
16898B137811k98696j4252l1776m3941o8823L43773j55733k13245L10520M6687
$$ 2137811 1839115 1824863 1793087 1749146 1680323 2024096 1868363 1655118 1965638 2012325
16888B012325J53025m18185M92736m266l14960P9895Q0508N4598L03888p3394
$$ 2012325 2165350 1747165 2239901 2235635 1920675 2000570 2081078 2135676 2439564 2366170
16878B366170r1363o9222m7762K55530j79390J56149L3690k21903O9857k69952
$$ 2366170 2274807 2205585 2157823 2413353 2233963 2390112 2423802 2201899 2271756 2001804
16868B001804M23475M49283j16181k67591j25213K35205j93908q733O9428K00683
$$ 2001804 2425279 2874562 2758381 2490790 2365577 2600782 2406874 2398141 2467569 2668252
16858B668252J44501l54914K62804J64281j20499J8860L50648l7837N6629Q2151
$$ 2668252 2812753 2457839 2720643 2884924 2764425 2783285 3133933 3096096 3152725 3234876
16848C234876m56376N48218k58174K13914l42334L76803J55185O3471n46198N52084
$$ 3234876 2778500 3326718 3068544 3282458 2940124 3316927 3472112 3535583 2989385 3541469
16838C541469M6050k19197K86153j40467L55413K68404k81934j27661R6489j26613
$$ 3541469 3587519 3368322 3654475 3514008 3869421 4137825 3855891 3728230 3824719 3698106
16828C698106K92416P384Q2121J25569n8384K20772j59258J06337M19051k49976
$$ 3698106 3990522 3997906 4080027 4205596 4147212 4367984 4208726 4315063 4734114 4484138
16818D484138J73392q3587L03313j44329J29602K995L88788k62675N9754J11052
$$ 4484138 4657530 4573943 4877256 4732927 4862529 4865524 5254312 4991637 5051391 5162443
16808E162443K97207J90550n7776j55735O1379K75335K0911j6436P7659K78372
$$ 5162443 5459650 5650200 5592424 5436689 5498068 5773403 5794314 5777878 5855537 6133909
16798F133909O04593n15609O0L28110n1922K14023M08843j74931N8230R4636K60602
$$ 6133909 6738502 6222893 6222953 6551063 6499141 6713164 7122007 6947076 7005306 7099942 7360544
16787G360544K85948K89967j94747M72918j17156M30983K37863K04688K9010L87210
$$ 7360544 7646492 7936459 7741712 8214630 8097474 8528457 8766320 8971008 9000018 9387228
16777I387228n5087n0211J78405M32901K83713K20951N18416J95890L968j5000
$$ 9387228 9332141 9281930 9460335 9893236 10176949 10397900 10916316 11112206 11116174 11101174
16767A1101174M04692J84847M54021M04601K91605J62851M96715O89650L3724
$$ 11101174 11505866 11690713 12144734 12549335 12840940 13003791 13500506 14190156 14223880
16758A4223880J60625M09968N17508M26193R78010j90634O55624N39800N74689
$$ 14223880 14384505 14794473 15311981 15738174 16716184 16525550 17181174 17720974 18295663
16749A8295663K67686Q44807Q09670J71336J026872M89317M53519J115903N92642
$$ 18295663 18563349 19408156 20217826 20389162 21416034 21905351 22358870 23474773 24067415
16740B4067415O32714J278780P81184O07109J115355J295262J038797P86402J526397
$$ 24067415 24700129 25978909 26760093 27367202 28482557 29777819 30816616 31603018 33129415
16731C3129415J367683J287016J302167J650455J230331J772960J689816J582142
$$ 33129415 34497098 35784114 37086281 38736736 39967067 41740027 43429843 45011985
16723D5011985J930255K025800K172616K235777K434590K552584K420617K613364
$$ 45011985 46942240 48968040 51140656 53376433 55811023 58363607 60784224 63397588
16715F3397588L096834K866684L157169L637231L750900L622081L627892L872190
$$ 63397588 66494422 69361106 72518275 76155506 79906406 83528487 87156379 91028569
16707I1028569M540117M093710M654703M366686M540324N108135M350220M866530
$$ 91028569 95568686 99662396 104317099 108683785 113224109 118332244 122682464 127548994
16699A27548994M524488M408291M231160L845880L808467K970681K446272K390455
$$ 127548994 132073482 136481773 140712933 144558813 148367280 151337961 153784233 156174688
16691A56174688J464599P35653K16013m99470j127218k210828k209450l162495
$$ 156174688 157639287 158374940 158590953 158091483 156964265 154753437 152543987 149381492
16683A49381492l561097l743255l960282m550645m732410n103344m605166m856455
$$ 149381492 145820395 142077140 138116858 133566213 128833803 123730459 119125293 114268838
16675A14268838m545541m818665m801028m689292l790106m824728l751821l733077
$$ 114268838 109723297 104904632 100103604 95414312 91624206 86799478 83047657 79314580
16667G9314580m093482l296045l194642l540009k981973k960909k745383k623206
$$ 79314580 75221098 71925053 68730411 65190402 62208429 59247520 56502137 53878931
16659E3878931k184637k332431j958912k175665j804384j920345j905994j216913
$$ 53878931 51694294 49361863 47402951 45227286 43422902 41502557 39596563 38379650
16651C8379650j767499j354075j493712j162533j540438j013711j057509j056637
$$ 38379650 36612151 35258076 33764364 32601831 31061393 30047682 28990173 27933536
16643B7933536j048848r13137j159076r42884o34169q59763m47108j085323m96669
$$ 27933536 26884688 25971551 24812475 23869591 23235422 22375659 21928551 20843228 20346559
16634B0346559q36420n90012n06064p74531j34378m81174n80018l90677r17999
$$ 20346559 19510139 18920127 18414063 17639532 17505154 17023980 16443962 16053285 15135286
16625A5135286k40932k87653p10121k00927j46017l96976o08916k28547n48987
$$ 15135286 14894354 14606701 13896580 13695653 13549636 13152660 12543744 12315197 11766210
16616A1766210k6870j78682p56809P476m66537J9785l80305j84074n046o83704
$$ 11766210 11739340 11560658 10803849 10811325 10344788 10364573 9984268 9800194 9795148 9111444
16606I111444j54825l93497O5047j39478m34916j09155J0839j71229l71300L25851
$$ 9111444 8956619 8563122 8628169 8488691 8053775 7944620 7955459 7784230 7412930 7738781
16596G738781o13170k69542L0712k95924j05287m7351J928l49693J68707l96832
$$ 7738781 7125611 6856069 6886781 6590857 6485570 6438219 6440147 6090454 6259161 5862329
16586E862329j73459j3582j67787O290j83472O5220k37243J87936k59639q9257
$$ 5862329 5688870 5675288 5507501 5513791 5330319 5395539 5158296 5346232 5086593 4997336
16576D997336l41678J31412j96104m4418j4863j96046K51162j39681O8725o25953
$$ 4997336 4655658 4787070 4590966 4546548 4531685 4335639 4586801 4447120 4515845 3889892
16566C889892N8481k77582K77273J8982k96593r8736J45999m08132Q5425M04991
$$ 3889892 3948373 3670791 3948064 3967046 3670453 3571717 3717716 3309584 3395009 3800000
16556C800000j07302m11020o9541j97023J05943K50354j13233p8568l45083K18646
$$ 3800000 3692698 3281678 3212137 3015114 3121057 3371411 3258178 3179610 2834527 3053173
16546C053173k26296J98889j60024r0859K01315K42338m88474l33720M1610L78925
$$ 3053173 2826877 3025766 2865742 2774883 2976198 3218536 2730062 2396342 2437952 2816877
16536B816877n53738Q0816N08058k96717m0254o2827L7587k45186l2701r221N3311
$$ 2816877 2263139 2343955 2852013 2555296 2515042 2452215 2489802 2244616 2211915 2202694 2256005
16525B256005r8852J7186P282p1310l74034L86731o1503k90145j74831J47872
$$ 2256005 2157153 2174339 2181621 2110311 1736277 2123008 2061505 1771360 1596529 1744401
16515A744401L19043l33086j07777l7371N29838l44575N3459k17219M95890m18389
$$ 1744401 2063444 1730358 1622581 1585210 2115048 1770473 1823932 1606713 2102603 1684214
16505A684214l54m79577L83382L72561m34061r924J08892m7639J85258m51998
$$ 1684214 1683860 1204283 1587665 1960226 1526165 1516241 1625133 1577494 1762752 1310754
16495A310754R7715o1298J97989P3961m34650L32191k25332K65426J05991k16456
$$ 1310754 1408469 1347171 1545160 1619121 1184471 1516662 1291330 1556756 1662747 1446291
16485A446291k3212k56824L21880j16325l63608J22774J46546K08455p3945K6126
$$ 1446291 1423079 1166255 1488135 1371810 1008202 1130976 1277522 1485977 1412032 1438158
16475A438158l75359J51559N7663p6474O0323l47011J68203M905k57381L90844
$$ 1438158 1062799 1214358 1272021 1195547 1255870 908859 1077062 1081967 824586 1215430
16465A215430J205J01138j78884K1228J32810k55050O7402K91473o84894M21242
$$ 1215430 1216635 1317773 1138889 1160117 1292927 1037877 1105279 1396752 711858 1133100
16455A133100q6583j3894j02069r825L3086j15570R9086L27953n32357J92891
$$ 1133100 1046517 1032623 930554 920729 953815 838245 937331 1265284 732927 925818
16445I25818j03880j89858j42732J39330J21686L82314n28644K93427j03112k4344
$$ 925818 821938 632080 489348 628678 750364 1132678 604034 897461 794349 770005
16435G70005k32685L2922N04576l45803M8254K85230l00853J85729C32522N40581
$$ 770005 537320 570242 1074818 729015 777269 1062499 761646 947375 332522 873103
16425H73103K16000m66543J84808j13296N8909Q5631l26233l9022J65968K19688
$$ 873103 1089103 622560 807368 694072 752981 838612 512379 473357 639325 859013
16415H59013l27892L69730j34002j42051n0444K40064j68673J64080J9536C43660
$$ 859013 531121 900851 766849 624798 574354 814418 645745 809825 829361 343660
16404F12478J71866j85657j36900J94928j14167L06053C61941M76984J19230l44816
$$ 612478 784344 598687 461787 656715 542548 848601 361941 838925 958155 613339
16394F13339j27494N77302l77512j33380j03244K52547k7339J2017j35133k5619
$$ 613339 485845 1063147 685635 552255 449011 701558 674219 686236 551103 525484
16384E25484p152k54321J86307J60583n912k49958R6978A77398J73362K19143
$$ 525484 518332 264011 450318 610901 604989 355031 452009 177398 350760 569903
16374E69903B48037K52888n5296L64390k85485K65699B88840n3819M0823K90803
$$ 569903 248037 500925 445629 810019 524534 790233 288840 235021 275844 566647
16364E66647L461B19159L37610n9509k6657Q8426r0480q0975J06130r3196J27397
$$ 566647 570108 219159 556769 497260 470603 559029 468549 387574 493704 400508 527905
16353E27905j17306J34843B17723q4215J57809J84986o8464J23897B11979J35264
$$ 527905 410599 545442 217723 133508 291317 476303 407839 531736 211979 347243
16343C47243J4833o7264J18794j17354k3125K04674l2732J40557A69245J89932
$$ 347243 362076 294812 413606 296252 273127 477801 445069 585626 169245 359177
16333C59177A65655L26637j32961F076L96615j49753N098E5138K46392A30734
$$ 359177 165655 492292 359331 6076 402691 252938 258036 55138 301530 130734
16322E5137L123N29859k78977H1379M3081Q2605O523N7780j31594K47268A11155
$$ 55137 58260 588119 309142 81379 124460 207065 213588 271368 139774 387042 111155
16310C34979M5217J30532A23351k450N96764A59534L71923B56261J64081l8587
$$ 334979 380196 510728 123351 120901 717665 159534 531457 256261 420342 381755
16300C81755i0759B98711J7973P4409j20475P3060G9165J78689F2933J11875q5646
$$ 381755 -90759 298711 316684 391093 270618 343678 79165 257854 62933 174808 89162
16289H9162L7857L2436k8891n8964M38038k17319C6564N56518H2663K02622E7713
$$ 89162 127019 159455 130564 71600 509638 292319 36564 593082 82663 285285 57713
16277B29234o3443J26774l3288L54799A42598Q1313E6997k2927L23725G9765j7746
$$ 229234 165791 292565 259277 614076 142598 223911 56997 34070 357795 79765 62019
16266F2019b22383C90646j17994B5319J32551a18141C10521o1676K00537A61818
$$ 62019 -222383 390646 272652 25319 157870 -118141 310521 248845 449382 161818
16255g6388A7875L49998E3119N7740J45338O9349j8177a9841B76383R856J59570
$$ -76388 17875 367873 53119 110859 256197 325546 307369 -19841 276383 286239 445809
16244D45809A50244J30417b4905A86561a20423M4007L6779E6874P5897L52318
$$ 445809 150244 280661 -24905 186561 -120423 -76416 -39637 56874 132771 485089
16234D85089e9235i781C51639A12177L02091J0205n1503A0162J15960A9870L08455
$$ 485089 -59235 -9781 351639 112177 414268 424473 372970 10162 126122 19870 328325
16223C28325a03607A31511J3515J21855H382c31674A39113J72337D8150J85720
$$ 328325 -103607 131511 145026 266881 8382 -331674 139113 311450 48150 233870
16213B33870P7162a96196P7161C62414b24106A03349N1449a3402D64321a63441
$$ 233870 311032 -196196 -119035 362414 -224106 103349 154798 -13402 464321 -163441
16202e428B5775b021r0477B41256j10009J08228p1099l3871l2499l1413l1225
$$ -5428 25775 -2021 -92498 241256 131247 239475 168376 134505 102006 70593 39368
16191C9368a1294k0755o8438B75926e7536B00221a16600C8153b5323A57462E9809
$$ 39368 -11294 -32049 -100487 275926 -57536 200221 -116600 38153 -25323 157462 59809
16179D5168R1733R1724J06196I1313K88341f9244A09250f3139j61417A76275b0990
$$ 45168 136901 228625 334821 91313 379654 -69244 109250 -63139 -224556 176275 -20990
16167A24832P6063e3635m8915C3667L01292A42731c738A23715o355O8587a39772
$$ 124832 200895 -53635 -102550 33667 334959 142731 -3738 123715 117360 185947 -139772
16155d6153J7875B08775a83224h3697B67364o3157p8686a11913B92351o9594G6665
$$ -46153 -28278 208775 -183224 -83697 267364 204207 125521 -111913 292351 222757 76665
16143A49328J2669j1996i5471B48239j23759C1966O9818e22574G3854d0738A59175
$$ 149328 161997 150001 -95471 248239 124480 31966 101784 -522574 73854 -40738 159175
16131a99615A71566Q728H3489B9257a20698n9383A79522m5315J05139J29325j71048
$$ -199615 171566 180294 83489 29257 -120698 -180081 179522 134207 239346 368671 197623
16120A97623h4931c5675G766K13729R3091c34986C8632K2384a53216A7190K8010
$$ 197623 -84931 -35675 7766 221495 314586 -334986 38632 61016 -153216 17190 45200
16109D5200R7236g1527A25135D0308J7962i7665L2428a6370l5831A81287c1168
$$ 45200 142436 -71527 125135 40308 58270 -97665 -65237 -16370 -52201 181287 -31168
16097a23540A61287R9337c08889I1460j5862b0946C3767J50644q2721f3711j45207
$$ -123540 161287 260624 -308889 91460 75598 -20946 33767 184411 101690 -63711 -208918
16086b08918B4639R2295l578o135N2155j8088n2421P9029b7323A69687J65940
$$ -208918 24639 116934 113356 107221 159376 141288 88867 167896 -27323 169687 335627
16075C35627a22411E6009d7811B0852J42782a65984A89382c1370B17545c0927
$$ 335627 -122411 56009 -47811 20852 163634 -165984 189382 -31370 217545 -30927
16064B54907P1657L0054A62542a5132G6820M701J28467h4413n0986A52635K8125
$$ 254907 326564 356618 162542 -15132 76820 81521 209988 -84413 -135399 152635 180760
16053A80760J82810A17876K8947n2064P8177a8491A60501o8960b17456h6605j7774
$$ 180760 363570 117876 146823 94759 172936 -18491 160501 91541 -217456 -86605 -104379
16042a04379A5289A908Q310a23556c8535I1009a82082O0040C24126H4465d07624
$$ -104379 15289 1908 10218 -123556 -38535 91009 -182082 -122042 324126 84465 -407624
16030a66768A9786j019c83412e0093j4026A42672E6650J95489C5256K71432a53430
$$ -166768 19786 18767 -383412 -50093 -64119 142672 56650 252139 35256 306688 -153430
16018d5857j05970j67304B62935b89965J15147f1376r50j53690n1192C2080N0991
$$ -45857 -151827 -319131 262935 -289965 -174818 -61376 -62326 -216016 -267208 32080 83071
16007H3071A4011g8159H7724A0944J30242F0854B2433a20118N7096K8039a1611
$$ 83071 14011 -78159 87724 10944 141186 60854 22433 -120118 -63022 -34983 -11611
15995b45890A157K06996B078O3033B9042a69166A24906a29716J0718I8664J81425
$$ -245890 1157 208153 2078 65111 29042 -169166 124906 -129716 -118998 98664 280089
15984B80089D1406c3243D6098M8352k081i4726c8377j2092j34772k1236C08857
$$ 280089 41406 -33243 46098 94450 92369 -94726 -38377 -50469 -185241 -206477 308857
15972a08153A97699o8588m0035b16054a5191B77752a51996B72850I921J66951
$$ -108153 197699 129111 89076 -216054 -15191 277752 -151996 272850 9921 176872
15962A76872o0450b59873a26556b6072C82854j70783F6374K23391J60457J42002
$$ 176872 116422 -259873 -126556 -26072 382854 212071 66374 289765 450222 592224
15952E92224b66687d9325A25689j6280b5472k5019j50593B9723a00664A48014
$$ 592224 -266687 -49325 125689 109409 -25472 -50491 -201084 29723 -100664 148014
15941F5165G481J85350h1645E8798j2327O9933D4456h753C97201D6221f2312C16975
$$ 65165 7481 192831 -81645 58798 46471 116404 44456 -8753 397201 46221 -62312 316975
15928a94187G9908a30314F7895J45601a07393G5802J6893g0018l75202i5798G0912
$$ -194187 79908 -130314 67895 213496 -107393 75802 92695 -70018 -445220 -95798 70912
15916a87091P2696j08750n1870B8513d155C4695K68736a21816N7003l1068j8057
$$ -187091 -114395 -223145 -275015 28513 -4155 34695 303431 -121816 -64813 -95881 -113938
15905a13938A16687d1880E1652J46447p9012d91292A42773c43687c9017j69873
$$ -113938 116687 -41880 51652 198099 119087 -491292 142773 -343687 -39017 -208890
15895b08890A08972l2377a60481q0728g4201A04489Q3115K08504g561A07576i7458
$$ -208890 108972 76595 -160481 -241209 -74201 104489 187604 396108 -7561 107576 -97458
15883A46313G0710A5568b36726G4141a19837C07960o3924j12613a25144B52344
$$ 146313 70710 15568 -236726 74141 -119837 307960 244036 131423 -125144 252344
15872B1717b79988N7021A25695C5973O140c99321B98785a80343H643J23286c11678
$$ 21717 -279988 -222967 125695 35973 42113 -399321 298785 -180343 8643 131929 -311678
15860F2082d67809D6062K69269j15582b31614K1365n8816B13225c42696B1030
$$ 62082 -467809 46062 315331 199749 -231614 -210249 -269065 213225 -342696 21030
15849c05037A1818e5696B14670C0685e8976k14490a04632M6934m9371l6724m6986
$$ -305037 11818 -55696 214670 30685 -58976 -273466 -104632 -57698 -107069 -143793 -190779
15838a90779I8881l4347i2753A39193D6409a50358O9433a8125p6716b0257b396
$$ -190779 98881 64534 -92753 139193 46409 -150358 -80925 -18125 -94841 -20257 -2396
15826a42083I9708b50857j4679j28195G5284K11127F3238j4660a33128o1498b0163
$$ -142083 99708 -250857 -265536 -393731 75284 286411 63238 48578 -133128 -194626 -20163
15814c34770a26123C5010a53159I0961a21465j66831B64440A06569d0001A14550
$$ -334770 -126123 35010 -153159 90961 -121465 -288296 264440 106569 -40001 114550
15803c56030a22234k8676C60232b57219e9254A0074a0171l32868a21517C3228
$$ -356030 -122234 -150910 360232 -257219 -59254 10074 -10171 -343039 -121517 33228
15792H8309L8324q971a78941j68365a11894d3371A89597J92640c11251g7735A17846
$$ 88309 126633 117662 -178941 -347306 -111894 -43371 189597 382237 -311251 -77735 117846
15780B0119b63616o9463D38448A93585c8369l17490J33351F892G74Q2444a28893
$$ 20119 -263616 -333079 438448 193585 -38369 -355859 -222508 6892 774 83218 -128893
15768d2758m9566h456l33828C54121d15374C01655j41509a33804C84460j71292
$$ -42758 -92324 -8456 -342284 354121 -415374 301655 160146 -133804 384460 213168
15758B13168I5026d8175l6075B40371I9566J28775B5581K9463c6648j26712P5650
$$ 213168 95026 -48175 -84250 240371 99566 228341 25581 55044 -36648 -163360 -87710
15747h7710A7448a55693m3797o9604A29146b3539A35165a67942C05953A41674
$$ -87710 17448 -155693 -199490 -269094 129146 -23539 135165 -167942 305953 141674
15736d5921H0901b07585J989A24545A1523M34667A88257c2829A71474O4543b36838
$$ -45921 80901 -207585 -205596 124545 11523 446190 188257 -32829 171474 236017 -236838
15724b61661h9030B26809d00389A0758e8506n0637c8220A51691e0797j37591E8476
$$ -261661 -89030 226809 -400389 10758 -58506 -109143 -38220 151691 -50797 -188388 58476
15712A39482D2737a81591A67421n1446d8418I2553Q0177J77481c9206m86146a51745
$$ 139482 42737 -181591 167421 115975 -48418 92553 172730 350211 -39206 -525352 -151745
15700B81423a00512j03700h253A16618b29316b6845F0443c63954a63329g4145
$$ 281423 -100512 -204212 -8253 116618 -229316 -26845 60443 -363954 -163329 -74145
15689c19008b021A6894J98858F7991J06285J69384a41182A04322Q0088j2849a8518
$$ -319008 -2021 16894 215752 67991 174276 343660 -141182 104322 184410 171561 -18518
15677A61352l4648L6080E5364H15a20j30784j47389A18582a76321m580a903A79422
$$ 161352 126704 162784 55364 815 -120 -130904 -278293 118582 -176321 -180901 -1903 179422
15664H7604a82781P9675I6225C1319K02873M413a25089e4877j253B47669R6191
$$ 87604 -182781 -103106 96225 31319 234192 238605 -125089 -54877 -56130 247669 343860
15653C43860D771a7779i54D2552K42319c2519j89299i8881j27127A46946l9482
$$ 343860 4771 -17779 -954 42552 284871 -32519 -221818 -98881 -226008 146946 107464
15642A07464f9795L0330m7311A1026b25747L3363g388I2926P4897a264H3571c222
$$ 107464 -69795 -39465 -86776 11026 -225747 -192384 -7388 92926 167823 -1264 83571 -3222
15629h8970c7125A14646b24500g0888B74507P474c00997k7588N6569C03664b94279
$$ -88970 -37125 114646 -224500 -70888 274507 281981 -300997 -328585 -272016 303664 -294279
15617d9036E3959h271E0370J5037c3672F1989i1130k5437k59334i7503j36026
$$ -49036 53959 -8271 50370 65407 -33672 61989 -91130 -116567 -375901 -97503 -233529
15606b33529D3763a3565p5863A58553A4663R7076B2685f5038D5552c6081F8795
$$ -233529 43763 -13565 -89428 158553 14663 111739 22685 -65038 45552 -36081 68795
15594G3206e39761H6513J1032d0929k06469b8637B4704a63831j52186c299o5562
$$ 73206 -539761 86513 97545 -40929 -247398 -28637 24704 -163831 -316017 -3299 -68861
15583f8861p9473k17469R1669a1705A29733b43825C49935c00041f889j68225H8046
$$ -68861 -148334 -365803 -274134 -11705 129733 -243825 349935 -300041 -6889 -175114 88046
15571b37038A28009k5372g681A28737l3253e31025J25842a15416A18745R2166
$$ -237038 128009 102637 -7681 128737 95484 -531025 -405183 -115416 118745 210911
15561B10911a99816H6421L5087b53711h9460b9399A30271D3855c7690C2804b28601
$$ 210911 -199816 86421 121508 -253711 -89460 -29399 130271 43855 -37690 32804 -228601
15549a26823c1027B08768a86483A00844g0800I4622J75360a1006A68723o6738
$$ -126823 -31027 208768 -186483 100844 -70800 94622 269982 -11006 168723 101985
15539A01985J76919b28233P0902A54815B8600a01455J3007A8609L02378A24737
$$ 101985 278904 -228233 -157331 154815 28600 -101455 -88448 18609 320987 124737
15528h9896j15146A00922i2541J8344j13540q6356J23095F6248B8446d0385J454
$$ -89896 -205042 100922 -92541 -74197 -187737 -274093 -150998 66248 28446 -40385 -38931
15517c8931F0650g7920j8742B23398c63022f8967G7660g4259o606A7298a20147
$$ -38931 60650 -77920 -96662 223398 -363022 -68967 77660 -74259 -80865 17298 -120147
15505b37815E6228a2618A14187b79844b8964A88838a51272A32583E6052n300f5442
$$ -237815 56228 -12618 114187 -279844 -28964 188838 -151272 132583 56052 50752 -65442
15493a49541J8511B13318A8624Q6067L29247A87369a62328n2432R2480l3082D8082
$$ -149541 -131030 213318 18624 104691 433938 187369 -162328 -214760 -122280 -155362 48082
15481A15396A7135e7071A85321H1097e1160j67148n1324j00782a65906B46599
$$ 115396 17135 -57071 185321 81097 -51160 -218308 -269632 -370414 -165906 246599
15470f3711r1418C14552i6665m8254B12701a29994b5565B33037a63631q4880e6254
$$ -63711 -155129 314552 -96665 -144919 212701 -129994 -25565 233037 -163631 -248511 -56254
15458a14546m663A94903f2754j02239A46926c05542J34901e9399A63178K53984
$$ -114546 -119209 194903 -62754 -164993 146926 -305542 -170641 -59399 163178 417162
15448D17162H0171a17305E7597d7644A8070o116e2771r0417j11633P167f7210
$$ 417162 80171 -117305 57597 -47644 18070 11954 -52771 -143188 -254821 -247654 -67210
15436C17748a89036A49130C152b07942A62594J1194e6714A41947b78406F151L16360
$$ 317748 -189036 149130 3152 -207942 162594 173788 -56714 141947 -278406 6151 322511
15425C22511g8412C22822a27324B29580a24113J8440A55956a50556C11576E7278
$$ 322511 -78412 322822 -127324 229580 -124113 -105673 155956 -150556 311576 57278
15414B32545I3622K25175a41152J8525G7663L39426c45937A09479J6245a14241
$$ 232545 93622 318797 -141152 -122627 77663 417089 -345937 109479 125724 -114241
15403b28069A00167m7821a85877O9980A93235E779J75443G1937a86767n8547L1397
$$ -228069 100167 52346 -185877 -115897 193235 5779 181222 71937 -186767 -245314 -213917
15392b13917A22431c57343P646A61951a2902D3390a86264A65028D3545a61273
$$ -213917 122431 -357343 -349697 161951 -12902 43390 -186264 165028 43545 -161273
15381B12708a4965k15500a13656k3819c5993n7946r5679B00158J7613a60303o5784
$$ 212708 -14965 -230465 -113656 -137475 -35993 -93939 -189618 200158 217771 -160303 -226087
15370b26087H2354a32374C62857A74146j2598d6637A14683k2315K66309A48029
$$ -226087 82354 -132374 362857 174146 161548 -46637 114683 92368 358677 148029
15359A14774H735K34879K27049b552H879a57004M4245n2357A51764e5771k64403
$$ 114774 8735 243614 470663 -2552 8879 -157004 -112759 -165116 151764 -55771 -320174
15348c20174e4320m3323K4733A82356K18260A861Q803a13683B138K3757f8173
$$ -320174 -54320 -97643 -72910 182356 400616 1861 10664 -113683 2138 25895 -68173
15336g2059c1537k6274j39700I3569d8222a5802E1213J6002k7134P9199J079a90327
$$ -72059 -31537 -57811 -197511 93569 -48222 -15802 51213 67215 40081 119280 120359 -190327
15323C96585j61110k3353f8250j21281B6069J15470J926d6925J8471A33131d43327
$$ 396585 235475 212122 -68250 -189531 26069 141539 143465 -46925 -28454 133131 -443327
15311a16501k0890A28443c50665c7258C6007a11169k03102M8685B8681a88449
$$ -116501 -137391 128443 -350665 -37258 36007 -111169 -314271 -265586 28681 -188449
15300E14910f0282A43961K92692B4978L5753O9272k4452h6725q9743A68583F4697
$$ 514910 -60282 143961 436653 24978 60731 130003 105551 -86725 -176468 168583 64697
15288F2102k3921A8823P0266d1110n2988E4602B6968O4660a93766B215b5705o6241
$$ 62102 38181 18823 89089 -41110 -94098 54602 26968 91628 -193766 2215 -25705 -91946
15276i1946G560O1655L6274N3779M1517b27405A18554a01287C2665D122P1074
$$ -91946 7560 69215 105489 159268 200785 -227405 118554 -101287 32665 4122 75196
15265G5196c6300q2298A4894a74226o2699A77868K047c6855B70198P5960B6345
$$ 75196 -36300 -118598 14894 -174226 -236925 177868 179915 -36855 270198 346158 26345
15253A03936L2120k6595K3430J20602L561b0860A45657E7756K9003J06871a09755
$$ 103936 136056 109461 132891 253493 257054 -20860 145657 57756 86759 193630 -109755
15241C32480B4676P5066L2417a22869G9077O5582h3015r5428A61065a68540N8740
$$ 332480 24676 99742 132159 -122869 79077 144659 -83015 -178443 161065 -168540 -109800
15230a09800E07080B7476M1249R5035G7915L56624A7946N01651K90417M98165
$$ -109800 507080 27476 68725 163760 77915 434539 17946 519597 810014 1308179
15220A308179L96014k68945K97849F44762k66443E0520L39890a4349J490k4122
$$ 1308179 1704193 1435248 1733097 644762 378319 50520 390410 -14349 -12859 -36981
15210c6981B58798c9888j59465g4707A12678c59373H0656L69296A2798K48418
$$ -36981 258798 -39888 -199353 -74707 112678 -359373 80656 449952 12798 261216
15200B61216A11318J43538d6803n7535c8291n7642A72793b56206A79544c333l57339
$$ 261216 111318 254856 -46803 -104338 -38291 -95933 172793 -256206 179544 -3333 -360672
15189c60672B69886p6999E973L20355a11837D48872j57378j40650c4484H5739
$$ -360672 269886 192887 5973 326328 -111837 448872 291494 150844 -34484 85739
15178b52114C34023d5541B84870n0818c8820F5331A8911a60579E4892c4503A50636
$$ -252114 334023 -45541 284870 234052 -38820 65331 18911 -160579 54892 -34503 150636
15166B63533j8882b8163B90934A15964a17675l855A32803J16416d9622m9700D61791
$$ 263533 244651 -28163 290934 115964 -117675 -121530 132803 249219 -49622 -99322 461791
15154b22695A64878C8150a06248F8911J64023k7339c2328l29770A33444O6806
$$ -222695 164878 38150 -106248 68911 232934 205595 -32328 -362098 133444 200250
15144B00250G2656M7411n8257j4252b4739n1409n9500B23284J38638K90042F9887
$$ 200250 72656 120067 61810 47558 -24739 -76148 -135648 223284 361922 651964 69887
15132A58647K9971c2093C32761a8861j04536C20748j20022q6877J06740H5348
$$ 158647 188618 -32093 332761 -18861 -123397 320748 200726 113849 220589 85348
15121A38748C9873K17536G6329f577A52166D3939O2195M5867a65016A77954J0574
$$ 138748 39873 257409 76329 -6577 152166 43939 106134 152001 -165016 177954 188528
15110A88528P7652n5938D1017J5067R1125j3162J62257p1916j00643a78486J0007
$$ 188528 266180 210242 41017 56084 147209 134047 296304 224388 123745 -178486 -168479
15099a68479A60937N6114a13241E2500l659N09620A87682Q631M7034f8002B39040
$$ -168479 160937 217051 -113241 52500 48841 558461 187682 196313 243347 -68002 239040
15087D033L0196o005F812L48965F3731a20130E7818j6916J28648K21456A01496
$$ 4033 34229 28224 6812 355777 63731 -120130 57818 40902 169550 391006 101496
15075d9498m4662E71843d529A09277l367a50843A08558J4513b9179B2075L60158
$$ -49498 -94160 571843 -4529 109277 105910 -150843 108558 123071 -29179 22075 382233
15064C82233j42762b8524G1488J11617a04407A39785J50451j07053e3591B57613
$$ 382233 239471 -28524 71488 183105 -104407 139785 290236 183183 -53591 257613
15053B96861a45531A74173A941J14953K03740I3104L0884h083A68611L7892R1599
$$ 296861 -145531 174173 1941 116894 320634 93104 123988 -8083 168611 206503 298102
15042B98102a9900j65498B01109a4888A59987K97357k13905r1007n6799L1728
$$ 298102 -19900 -185398 201109 -14888 159987 457344 243439 152432 95633 127361
15032A27361J3247d0485B33174J00868a92169H7288J10573h7113B31901o854i9748
$$ 127361 140608 -40485 233174 334042 -192169 87288 197861 -87113 231901 225047 -99748
15020C05157C3776K54633A34299D668O9441R106J63273R7523j13133L0347A27993
$$ 305157 33776 288409 134299 4668 74109 83215 246488 344011 230878 261225 127993
15008B81843A32318P7406E0119h9141B84158p6963K73135A16458J15412a39316
$$ 281843 132318 209724 50119 -89141 284158 207195 480330 116458 231870 -139316
14997I8466k2734g3990I0254J23978C6717L57720K1715j46840A02584J01473b1297
$$ 98466 75732 -73990 90254 214232 36717 394437 416152 269312 102584 204057 -21297
14985E7975J41396K68853A99776H9206K29495a81851B16819o0634n0401m2086
$$ 57975 199371 468224 199776 89206 318701 -181851 216819 156185 105784 63698
14975F3698L13571c82581A97522J22974M2227L2287j00794A30467N8767M5868
$$ 63698 377269 -382581 197522 320496 362723 395010 294216 130467 189234 235102
14965B35102J47378j04635K11332f3155B12882e9969E01198j10900l6242j6976
$$ 235102 382480 277845 489177 -63155 212882 -59969 501198 390298 354056 337080
14955C37080E4818K82066A48818J8186J55581M2145D5991K49425o6938J11979
$$ 337080 54818 336884 148818 167004 322585 364730 45991 295416 228478 340457
14945C40457j45599m7904K0429a4853D48719j37526j4442J00404G8965M01114
$$ 340457 194858 146954 167383 -14853 448719 311193 296751 397155 78965 480079
14935D80079j84259L5569j00237N9060D5081M58580A36758O5551r5179J46878
$$ 480079 295820 331389 231152 290212 45081 503661 136758 202309 107130 254008
14925B54008Q0997A07036O878d3678A58536L52115d9548F5310J20850q3672L76400
$$ 254008 335005 107036 113914 -43678 158536 510651 -49548 65310 186160 102488 478888
14914D78888p2355A54953J53434J5705o2436K94709A72066P1628J67226j50440
$$ 478888 406533 154953 308387 324092 261656 556365 172066 243694 410920 260480
14904B60480E5530P7613K3549M66136B67716J60638j27738j50276J41329J33431
$$ 260480 55530 133143 156692 622828 267716 428354 300616 150340 291669 425100
14894D25100j57199m150r1982L9992M06802p0091A43110J89552L3925m7958J29852
$$ 425100 267901 263751 171769 211761 618563 548472 143110 332662 366587 318629 448481
14883D48481A14167J15697J18334K10275A92018K68887J54800j20453A65814K27888
$$ 448481 114167 229864 348198 558473 192018 460905 615705 495252 165814 393702
14873C93702A03510K68008L41096k50899P4673I1436L46673B08992I1996b32202
$$ 393702 103510 371518 712614 461715 536388 91436 438109 208992 91996 -232202
14862B27044J16529J20488A64180N94093l15455l9027j43719N38489C89720q2378
$$ 227044 343573 464061 164180 758273 442818 403791 260072 798561 389720 307342
14852C07342j28045L30314J32681k77896A72166L86895B76368K59895j69735j56115
$$ 307342 179297 509611 642292 364396 172166 559061 276368 536263 366528 210413
14842B10413M55496B76455L09624j7769k40714J05518N8504r9228r3624K0950
$$ 210413 665909 276455 586079 568310 327596 433114 491618 392390 298766 319716
14832C19716P6611j14720R1854J04299j34273l3949J54840j85759J49275Q0727
$$ 319716 396327 281607 373461 477760 343487 309538 464378 278619 427894 508621
14822E08621I6757O77253k53852l3582J48550j43243J48723J47356j83260k74788
$$ 508621 96757 774010 520158 486576 635126 491883 640606 787962 604702 329914
14812C29914A53719K27935L52246k67171j02998J23947A46924K65638k1467j81695
$$ 329914 153719 381654 733900 466729 363731 487678 146924 412562 391095 209400
14802B09400L8191I8817M77274j56075A75208J99645p7121P2697L75890l71049
$$ 209400 247591 98817 576091 420016 175208 374853 297732 370429 746319 375270
14792C75270A69939K30884A38886K50468K0058q7893K86818k33841L2890L87949
$$ 375270 169939 400823 138886 389354 409412 321519 608337 374496 407386 795335
14782G95335l59623J70873r230o3576j6005J20468m1949J44448p2702B94692J74899
$$ 795335 435712 606585 597355 533779 517774 638242 596293 740741 668039 294692 469591
14771D69591k6632k93Q2740k18384K57406J1897O6339l15667J10910j17364L73867
$$ 469591 442959 442666 525406 307022 564428 576325 642664 326997 437907 320543 694410
14760F94410J16196r2126j27461j65947A24629L11254A44444D1149N66199q5356
$$ 694410 810606 718480 591019 425072 124629 435883 144444 41149 607348 521992
14750E21992J47765J98231B68701J62615J93828j71980P5523j67007Q9610J10357
$$ 521992 669757 867988 268701 431316 625144 453164 528687 361680 451290 561647
14740E61647K03929k05614J03326J58982J13348K7994l72679M46540l75489Q953
$$ 561647 765576 559962 663288 822270 935618 963612 590933 1037473 661984 670937
14730F70937j52953l4853K1796L23525l8372k95268J31912K51469q818k81888
$$ 670937 517984 483131 504927 828452 790080 494812 626724 878193 869375 587487
14720E87487J00899Q2252P2528l26878K87855k50026j02814K05127K01428j32563
$$ 587487 688386 770638 843166 516288 804143 554117 451303 656430 857858 725295
14710G25295N8894P718j49085M379B87262K09546K92401j06689K96499j73300
$$ 725295 784189 791907 642822 647201 287262 496808 789209 682520 979019 805719
14700H05719N6246J80298k10617r6122K4665k2948J99707o1024k09943j85076
$$ 805719 861965 1042263 831646 735524 760189 737241 936948 875924 665981 480905
14690D80905M20873j20186j24569J40242J16507l8849j50308m4804P5467j45124
$$ 480905 901778 781592 657023 797265 913772 874923 724615 679811 755278 610154
14680F10154k7634L33553j16211o7043J59523k05882J18271j9150R4251J16005
$$ 610154 582520 916073 799862 732819 892342 686460 804731 785581 879832 995837
14670I95837J16128k63079J90014K9202k00658O4836J02401J01300l07184K44916
$$ 995837 1111965 848886 1038900 1068102 867444 932280 1034681 1135981 828797 1073713
14660A073713l06602J14037n874J22828J6287k14682K14481n9885k80669J48884
$$ 1073713 767111 881148 875274 998102 1014389 799707 1014188 954303 673634 822518
14650H22518Q6426J40881l01542N72813j76315m83358L43932k50507J53025P7459
$$ 822518 908944 1049825 748283 1321096 1144781 661423 1005355 754848 907873 985332
14640I85332L7430K22595j82155J24300k39252J30458K96066J52897m74880q846
$$ 985332 1022762 1245357 1063202 1187502 948250 1078708 1374774 1527671 1052791 1043945
14630A043945J63635N8104r2672P8176n08781L59417k43072K7530K27909L98548
$$ 1043945 1207580 1265684 1173012 1251188 742407 1101824 858752 886282 1114191 1512739
14620A512739m95297j5263L23289j86949K83518k57853M43455l58181J31361m39051
$$ 1512739 1017442 1002179 1325468 1138519 1422037 1164184 1607639 1249458 1380819 941768
14610I41768J94101M93345j77175m7987l54057N73725o05195K68624q6531L56356
$$ 941768 1135869 1629214 1452039 1404052 1049995 1623720 1018525 1287149 1200618 1556974
14600A556974k99136J12864l44414L75534R7545k64823J75572J20559K10357k02800
$$ 1556974 1257838 1370702 1026288 1401822 1499367 1234544 1410116 1530675 1741032 1538232
14590A538232m7512J53708j89356l06961K07473J51791m4849q8185k32490N19290
$$ 1538232 1490720 1644428 1455072 1148111 1355584 1507375 1462526 1374341 1141851 1661141
14580A661141l6125k02423J28652J25639k43956J12436J66615j28870p4684r7557
$$ 1661141 1625016 1422593 1551245 1676884 1432928 1545364 1711979 1583109 1508425 1410868
14570A410868L59471J01699R759l40171Q4050P1361r4719j0059L21154L31433
$$ 1410868 1770339 1872038 1881797 1541626 1625676 1697037 1602318 1592259 1913413 2244846
14560B244846m26597p7628J45284k4459m9536L12360j88548k1212K036L3547K94837
$$ 2244846 1818249 1740621 1885905 1861446 1811910 2124270 1935722 1914510 1916546 1950093 2244930
14549B244930k39422k44920M69781j4034R908k46143L32421N3368j47785K44110
$$ 2244930 2005508 1760588 2230369 2216335 2226243 1980100 2312521 2365889 2218104 2462214
14539B462214l01259L50698j80055K57694R2741J66238l50991l2547N40772k59637
$$ 2462214 2160955 2511653 2331598 2589292 2682033 2848271 2497280 2464733 3005505 2745868
14529B745868O00281J12333J47087K37090O29836J093567K701727N171522J3020087
$$ 2745868 3346149 3458482 3605569 3842659 4472495 5566062 8267789 13439311 26459398
14520B6459398K2802182q272128A4075465n842068C939063j547290l95377j79618
$$ 26459398 49261580 40989452 14075465 8233397 3939063 2391773 1996396 1816778
14512A816778m3889K18111k76399K75935q0893J07197j33355K70819j3440Q8694
$$ 1816778 1772889 1991000 1714601 1990536 1909643 2016840 1883485 2154304 2140864 2229558
14502B229558r2945M03109k07880k1061J9668j45337J75815k4477q8446K22700
$$ 2229558 2136613 2539722 2331842 2310781 2330449 2185112 2360927 2336450 2248004 2470704
14492B470704J46298r3499M62608L5100j59219J09630k86110j16690J95804J98564
$$ 2470704 2617002 2523503 2986111 3021211 2861992 2971622 2685512 2568822 2764626 2963190
14482B963190P2762l65013L8992K75758j46601K855M36603k48061J01477L04573
$$ 2963190 3035952 2670939 2709931 2985689 2839088 2841943 3278546 3030485 3131962 3436535
14472C436535k87322k02549M8638L93191J99588j73753L3299q6210K50118K64072
$$ 3436535 3149213 2946664 2995302 3388493 3588081 3414328 3447627 3361417 3611535 3875607
14462C875607j56734k44629K03900k3677J82325p0175q5972J59093K01267o0898
$$ 3875607 3718873 3474244 3678144 3654467 3836792 3766617 3680645 3839738 4041005 3980107
14452C980107N5369j0458p2173N7319P0386m2176p2582M80303k48396J48322k4996
$$ 3980107 4035476 4025018 3952845 4010164 4080550 4038374 3965792 4446095 4197699 4346021 4321025
14441D321025r3401K63700K35421m38207J42167J01861n6519K74536P6235j19829
$$ 4321025 4227624 4491324 4726745 4288538 4430705 4532566 4476047 4750583 4826818 4706989
14431D706989Q1966K93348L2839J48145j20046r910J47594J82404j30155K91319
$$ 4706989 4788955 5082303 5115142 5263287 5143241 5133331 5280925 5463329 5333174 5624493
14421E624493k39769J63905J51355K67205o4609m5119J69940J87601k79669J79771
$$ 5624493 5384724 5548629 5699984 5967189 5902580 5857461 6027401 6215002 5935333 6115104
14411F115104J31978J44117k29159L19799J5672J54867L67874R7007n06869O80485
$$ 6115104 6247082 6391199 6162040 6481839 6497511 6652378 7020252 7117259 6610390 7290875
14401G290875N9760j87072k2821L55885J91467M5708K33760J20230R4283q614
$$ 7290875 7350635 7163563 7140742 7496627 7688094 7733802 7967562 8087792 8182075 8173461
14391H173461L19078j66509q7586k7294P06324l08593K58309K35696M77301j2794
$$ 8173461 8492539 8326030 8238444 8211150 8917474 8608881 8867190 9102886 9580187 9567393
14381I567393O9013K08815k57519K01232K2566P05056k27066Q97086n95405M22232
$$ 9567393 9636406 9845221 9587702 9788934 9811500 10516556 10289490 11186576 10591171 11013403
14371A1013403r676L92629J94363Q9734m4806L98497L95752P3632r4348M17949
$$ 11013403 11003727 11396356 11590719 11680453 11635647 12034144 12429896 12503528 12409180 12827129
14361A2827129O20276k13658L95107J30745M14258K04499J38908M49976P9586
$$ 12827129 13447405 13233747 13628854 13759599 14173857 14378356 14517264 14967240 15046826
14352A5046826M11274K29752L45715N28975R4626L62395J40077M12898L26770
$$ 15046826 15458100 15687852 16033567 16562542 16657168 17019563 17159640 17572538 17899308
14343A7899308M54416K33646L94943M33334M93423M84222L83107M59092L65481
$$ 17899308 18353724 18587370 18982313 19415647 19909070 20393292 20776399 21235491 21600972
14334B1600972N83219M89361M12974M83940L60824J040429M06266L94268P09235
$$ 21600972 22184191 22673552 23086526 23570466 23931290 24971719 25377985 25772253 26481488
14325B6481488Q77069Q03671J25079J229616J86629J027951J139791Q35423N61729
$$ 26481488 27358557 28162228 28287307 29516923 29703552 30731503 31871294 32706717 33268446
14316C3268446Q41528J200038Q11425J078025J211863J036051J285775J076347
$$ 33268446 34109974 35310012 36121437 37199462 38411325 39447376 40733151 41809498
14308D1809498J453248J188365J275092J663072J483131J506634J442085J781007
$$ 41809498 43262746 44451111 45726203 47389275 48872406 50379040 51821125 53602132
14300E3602132J885335J869791J716309K559932K115380K419239K198608K593098
$$ 53602132 55487467 57357258 59073567 61633499 63748879 66168118 68366726 70959824
14292G0959824L055289K688811L052847K998753L315926L608702L837447M094187
$$ 70959824 74015113 76703924 79756771 82755524 86071450 89680152 93517599 97611786
14284I7611786M360091M242918M938389N083428N238340N514385N522958N929082
$$ 97611786 101971877 106214795 111153184 116236612 121474952 126989337 132512295 138441377
14276A38441377O946250O344635P416960P698930Q174178R007843R044102R715735
$$ 138441377 145387627 151732262 159149222 166848152 175022330 184030173 193074275 202790010
14268B02790010J0521052J1088828J0941319J2331493J2830199J3257525J3907425
$$ 202790010 213311062 224399890 235341209 247672702 260502901 273760426 287667851
14261B87667851J3943452J4868044J4712405J5193200J4962426J5533543J5360847
$$ 287667851 301611303 316479347 331191752 346384952 361347378 376880921 392241768
14254C92241768J4381841J4083847J2623013J1263150R714138P666015M692638
$$ 392241768 406623609 420707456 433330469 444593619 454307757 461973772 466666410
14247D66666410K04485j990377k537336k315355l879834o040484p066830j0148570
$$ 466666410 466870895 464880518 462343182 460027827 456147993 450107509 443040679 432892109
14239D32892109j2158678j3951309j4059619j5474137j6183688j5857553j6011911
$$ 432892109 420733431 406782122 392722503 377248366 361064678 345207125 329195214
14232C29195214j5648606j5261199j4720810j4521885j3052932j2097157j2610613
$$ 329195214 313546608 298285409 283564599 269042714 255989782 243892625 231282012
14225B31282012j1650857j1180462j0458521r947188r261220q656219p955759
$$ 231282012 219631155 208450693 197992172 188044984 178783764 170127545 162171786
14218A62171786p458525p486374p059138o466390n765904o363378m261994n051085
$$ 162171786 154713261 147226887 140167749 133701359 127935455 121572077 117310083 112258998
14210A12258998n045517m737593l888843m462981l354684k988644l640692l645998
$$ 112258998 107213481 102475888 98587045 94124064 90769380 87780736 84140044 80494046
14202H0494046k810231k944895k666595k605812k730661k357916k546112j664378
$$ 80494046 77683815 74738920 72072325 69466513 66735852 64377936 61831824 60167446
14194F0167446j881962j863765k175029j353797k120811j295809j393853j430146
$$ 60167446 58285484 56421719 54246690 52892893 50772082 49476273 48082420 46652274
14186D6652274j338009j451156j302743j289927q24680q19101j374280j117436
$$ 46652274 45314265 43863109 42560366 41270439 40445759 39626658 38252378 37134942
14178C7134942j241007j067715q05478n27667m03674j383695q86259j038534k98899
$$ 37134942 35893935 34826220 34020742 33493075 33089401 31705706 30819447 29780913 29482014
14169B9482014p68129m13078q26573p08348o64180p24622p82788j65751r21508
$$ 29482014 28713885 28300807 27474234 26765886 26101706 25377084 24594296 24428545 23507037
14160B3507037n71114n2530n24346p51600n44914l22366n76244l1993l69117m71304
$$ 23507037 22935923 22883393 22359047 21607447 21062533 20740167 20163923 20131930 19762813 19291509
14150A9291509m84297m15650l94898l55348k24092o38545k04091m30014p4582
$$ 19291509 18807212 18391562 17996664 17641316 17417224 16778679 16574588 16144574 16069992
14141A6069992o6227q45866j04198N6655l72350k19797l99738k25330q8571n56443
$$ 16069992 16003765 15157899 15053701 15110356 14738006 14518209 14118471 13893141 13804570 13248127
14131A3248127k70821J37112l90262k48747j39505m46440j61264R9094l68294
$$ 13248127 12977306 13114418 12724156 12475409 12335904 11889464 11728200 11827294 11459000
14122A1459000k39759k54110l21710L57756p17282k19720K7445L65604m59804
$$ 11459000 11219241 10965131 10643421 11001177 10283895 10064175 10091620 10457224 9997420
14113I997420m16000J49019j92190l20491K88647j06731n80061J05374j17817
$$ 9997420 9581420 9730439 9538249 9217758 9506405 9399674 8819613 8924987 8807170
14104H807170k52789J05662k9693m67443q6864k67321L33990m93363K29443k82624
$$ 8807170 8554381 8660043 8630350 8162907 8076043 7808722 8142712 7649349 7878792 7596168
14094G596168j56684J17546j94031j38014j52060L8152j05412k33636O5147k6493
$$ 7596168 7439484 7557030 7362999 7224985 7072925 7111077 7005665 6772029 6837176 6810683
14084F810683L6855m73669J66602p6562R8559l49785j18477k17328K44893k33082
$$ 6810683 6847538 6373869 6540471 6463909 6562468 6212683 6094206 5876878 6121771 5888689
14074E888689p0561O4138j15418l85880O46715n37025J77334l28468O590J35985
$$ 5888689 5818128 5882266 5766848 5380968 6027683 5490658 5667992 5339524 5346114 5482099
14064E482099l49414K71235k37374o8366j24829l25203N42078n29139J33877r7718
$$ 5482099 5132685 5403920 5166546 5098180 4973351 4648148 5190226 4661087 4794964 4697246
14054D697246j37535K19313j62979J15974m16970P3621k85339P0777L80371k13096
$$ 4697246 4559711 4779024 4616045 4732019 4315049 4388670 4103331 4174108 4554479 4341383
14044D341383j20029M66965p00375j84415M53692l50680K11135K5044l66571L8128
$$ 4341383 4221354 4688319 3987944 3803529 4257221 3906541 4117676 4142720 3776149 3814277
14034C814277R3232K02165R5054l75497k57134K06644J4909j16166j08760k39726
$$ 3814277 3907509 4109674 4204728 3829231 3572097 3778741 3793650 3677484 3568724 3328998
14024C328998m5297M66910k28389l14663J65716j93704N27671l81561R3126J17036
$$ 3328998 3283701 3750611 3522222 3207559 3373275 3179571 3707242 3325681 3418807 3535843
14014C535843m16596J50849j77552K2925l17502K54827l26703J95803J26726j14385
$$ 3535843 3119247 3270096 3092544 3115469 2797967 3052794 2726091 2921894 3048620 2934235
14004B934235J62053j39500j78911M83763l62191l01735n6884K0367L45477m55836
$$ 2934235 3096288 2956788 2777877 3261640 2899449 2597714 2540830 2561197 2906674 2450838
13994B450838O1906K93068l06821M30463o65624J322P31577n23638K96175n74892
$$ 2450838 2512744 2805812 2498991 2929454 2263830 2265152 2996729 2473091 2769266 2194374
13984B194374K02831l7347J67852q3631l20905r1170J71076l23862K71713K38
$$ 2194374 2397205 2359858 2527710 2444079 2123174 2032004 2203080 1879218 2150931 2151169
13974B151169j85138Q2126N786J60786l53672Q4388j0771J12126q6770l3025P14083
$$ 2151169 1966031 2048157 2053943 2214729 1861057 1945445 1934674 2046800 1960030 1927005 2641088
13963B641088Q41941L234063R538281K3038226J2082541B0570813A0186947l781087
$$ 2641088 3483029 6717092 16255373 39293599 51376140 20570813 10186947 6405860
13955F405860j470322n28960n50130n94646l87477L06922l77803r827j80606L24688
$$ 6405860 4935538 4406578 3856448 3261802 2874325 3181247 2803444 2793617 2613011 2937699
13945B937699p59440M97292j72734j14211K96352K4843j53817k49711q2979J5803
$$ 2937699 2178259 2675551 2502817 2388606 2684958 2709801 2555984 2306273 2223294 2239097
13935B239097k45616P082R5931J94308k89638j32489L2777J47570J16529p6033
$$ 2239097 1993481 2000563 2096494 2290802 2001164 1868675 1901452 2049022 2165551 2089518
13925B089518j21500K9863l47397J93738L2631O5352k52769J95149r2935K6566
$$ 2089518 1968018 1997881 1650484 1844222 1876853 1942205 1689436 1884585 1791650 1818216
13915A818216j23123j17723J5669J41292L11535j30425m79733L88291k45693L65101
$$ 1818216 1695093 1577370 1593039 1734331 2045866 1915441 1435708 1823999 1578306 1943407
13905A943407l34555J8712q3911J02159k76452j921M53531k97934J86962k3648
$$ 1943407 1608852 1627564 1543653 1645812 1369360 1367439 1820970 1523036 1709998 1686350
13895A686350j26389J79273l29824j06638O560L33257Q445o38402N10140n2016
$$ 1686350 1559961 1739234 1409410 1302772 1309332 1642589 1651034 1012632 1522772 1470756
13885A470756n6160J60478j58503k32505P2299j47901N3959L5614J21539j6547
$$ 1470756 1414596 1575074 1416571 1184066 1256365 1108464 1162423 1198037 1319576 1303029
13875A303029M96571l1396k83584j28308j2265P7397k15050L18021l25417j42251
$$ 1303029 1799600 1768204 1484620 1356312 1344047 1421444 1206394 1524415 1198998 1056747
13865A056747j134L38362q0945j50430J75914j07338k9581k38813J76876P7301
$$ 1056747 1055613 1393975 1313030 1162600 1338514 1231176 1201595 962782 1139658 1216959
13855A216959j8328L0878r8407J0085n0078m9541K82189k73866K98527l32335
$$ 1216959 1198631 1229509 1131102 1141187 1091109 1041568 1323757 1049891 1348418 1016083
13845A016083N87348n49085J04196o9475o6840k21158j2802L43102J19794j8424
$$ 1016083 1603431 1054346 1158542 1089067 1022227 801069 788267 1131369 1251163 1232739
13835A232739p3320l10934M42251k49871q4349J29970J31373k45318m4942J27967
$$ 1232739 1159419 848485 1290736 1040865 956516 1086486 1217859 972541 927599 1055566
13825A055566O6959j62499j9453P3936R6342l02608K26339k1587J46785n22204
$$ 1055566 1122525 960026 940573 1014509 1110851 808243 1034582 1012995 1159780 637576
13815F37576l1074K74279J82814k06642P6866l8116j07948K55831l99767K16573
$$ 637576 606502 880781 1063595 856953 933819 895703 787755 1043586 643819 860392
13805H60392N0483j83062L73222k59828K78134k80341L69214l25620m36782K68344
$$ 860392 910875 727813 1101035 841207 1119341 839000 1208214 882594 445812 714156
13795G14156L8869o5980R005j5561J44497P3565k36459M64989k59812K07090l27919
$$ 714156 753025 687045 696050 680489 824986 898551 662092 1127081 867269 1074359 746440
13784G46440J86203k02650L45060E14951K43821J91157k72275r8070O89926m36435
$$ 746440 932643 729993 1075053 514951 758772 949929 677654 579584 1269510 833075
13774H33075K8981j25105J76508D28707L39064p7605J50919J52544l88195J38195
$$ 833075 862056 736951 913459 428707 767771 690166 841085 993629 605434 743629
13764G43629Q2309B67289P18602k46951R1978k26046r7826J49901P0067o2854
$$ 743629 825938 267289 985891 738940 830918 604872 507046 656947 727014 664160
13754F64160N2684K35037O241k64106j43205K53248J45164D18333M21990p7438
$$ 664160 716844 951881 958122 694016 550811 804059 949223 418333 840323 762885
13744G62885K198C70921M91237j78601j02974P2122l01003M51042j732j17748
$$ 762885 765083 370921 862158 683557 580583 652705 351702 802744 801012 683264
13734F83264j43856L07541k41403N7437L39707D72715L37267R4116l79104J66175
$$ 683264 539408 846949 605546 662983 1002690 472715 809982 904098 524994 691169
13724F91169l0942k90330K46754M2175k03126L99396o8331l93258J42772O894
$$ 691169 660227 369897 616651 658826 455700 855096 786765 393507 536279 543173
13714E43173J69223O7636J31979j66424k36102L5506J92385Q7940J35589j15067
$$ 543173 712396 780032 912011 745587 509485 544991 737376 825316 960905 845838
13704H45838k01070r7167L23145m16950n859L04487k99064r4732L18365K16854
$$ 845838 644768 547601 870746 453796 447937 752424 453360 358628 676993 893847
13694H93847m09680K51011K46299k37432C68342M67947A13039O66654k30251q8186
$$ 893847 484167 735178 981477 744045 368342 836289 113039 779693 549442 461256
13684D61256K7700L9372J31248l16779J0610Q5310q9256K82529j95072J5476j57009
$$ 461256 488956 528328 659576 342797 353407 438717 349461 631990 436918 452394 295385
13673B95385J63971J32270k265k9941j7829j4086p2210J76154B25255M86335B51644
$$ 295385 459356 591626 589361 559420 541591 527505 455295 631449 225255 711590 251644
13661D38995J35976Q4125J84508k17614B74566J60590M16928C28393K58379j28536
$$ 438995 574971 659096 843604 625990 274566 435156 852084 328393 586772 458236
13651D58236p5352N6714R8223B11504K91582j58461J77972K5924j91706J46790
$$ 458236 382884 439598 537821 211504 503086 344625 522597 548521 356815 503605
13641E03605B47651L41953n3193j02741N4571m6555q8346j70849K80146J17308
$$ 503605 247651 589604 536411 433670 488241 441686 353340 182491 462637 579945
13631E79945J39036C24948J68714L189q0716K78241n3942k08250P8498A00074
$$ 579945 718981 324948 493662 496851 416135 694376 640434 432184 510682 100074
13620B52438j03621L18914J0715n4670Q1274j18403q3879J87880B40800J5712
$$ 252438 148817 467731 478446 423776 505050 386647 302768 490648 240800 256512
13610B56512L6207o3993K21374l2786j75498L38401k58326J94861A27100M38878
$$ 256512 292719 228726 450100 417314 241816 580217 321891 516752 127100 565978
13600E65978A67197M7538J59083j09704O142Q2136J48775B50218k7321K38734
$$ 565978 167197 214735 373818 264114 270256 352392 501167 250218 222897 461631
13590D61631o7556J4019b8285C53100q0737K18361j19373j59322K81110R2575
$$ 461631 394075 408094 -28285 353100 272363 490724 371351 212029 493139 585714
13580E85714r5639p9469Q4882k11175K1845k9476j22279J70077M6989j03547m9442
$$ 585714 490075 410606 495488 284313 306158 276682 154403 324480 371469 267922 218480
13569B18480p5649J61869j45723K23562K14809k24000J01489j66740R5197J39749
$$ 218480 142831 304700 158977 382539 597348 373348 474837 308097 403294 543043
13559E43043A29287P328b6386B88163k9536D7562L33596k9275E7878L09785R5299
$$ 543043 129287 136615 -26386 288163 258627 47562 381158 351883 57878 367663 462962
13548D62962j56236J95665j59213K53038J9068P0990l14831A24820K87374q0906
$$ 462962 306726 502391 343178 596216 615284 686274 371443 124820 412194 331288
13538C31288k5619j30264K19872K6019J54442B22938a43897D22266A53589L20614
$$ 331288 305669 175405 395277 421296 575738 222938 -143897 422266 153589 474203
13528D74203k17797H4877p180N62998l01664j39920J57670J73601k34467q4246
$$ 474203 256406 84877 77697 640695 339031 199111 356781 530382 295915 211669
13518B11669L30334k41645N6261A26642N76830A97957K0453K09279j45164J17630
$$ 211669 542003 300358 356619 126642 703472 197957 218410 427689 282525 400155
13508D00155j92326H8209D2581K69111A41503J56068k4018J86701E0290O12236
$$ 400155 207829 88209 42581 311692 141503 297571 273553 460254 50290 662526
13498F62526B60747f5081D49195J93263k73902K67709c51597A63306F4716r792
$$ 662526 260747 -65081 449195 642458 368556 636265 -351597 163306 64716 54924
13488E4924J73657K86302A42943J06906K05253J2058K3282H5618B0767L5026J14147
$$ 54924 228581 514883 142943 249849 455102 467160 490442 85618 20767 55793 169940
13477A69940k7638J60198J62636q0156A71496J17707j3414D4687J19860M57391
$$ 169940 142302 302500 465136 384980 171496 289203 275789 44687 164547 621938
13467F21938B85338K9120p5048j07323L8288K78322K15279B89976K8110K06535
$$ 621938 285338 314458 239410 132087 170375 448697 663976 289976 318086 524621
13457E24621j2962r015k33519L20578A84086b4663A04531M36013B00113h7527
$$ 524621 511659 502644 269125 589703 184086 -24663 104531 540544 200113 -87527
13446B26292j00732k1742K10311L1219q0003P2103A34123L39000j84930r7012
$$ 226292 125560 103818 314129 345348 265345 337448 134123 473123 288193 191181
13436A91181J04299E6613M44323F4671i3769D37628j35554o4860R135J97161h9224
$$ 191181 295480 56613 500936 64671 -93769 437628 302074 237214 246349 443510 -89224
13424C16163A43803E5074k1457K97883c64517D15403b5424A79663a23212C57029
$$ 316163 143803 55074 33617 331500 -364517 415403 -25424 179663 -123212 357029
13413D32123G7360g0738B02208c9610C00583k4483Q5115A38026b37772B20248
$$ 432123 77360 -70738 202208 -39610 300583 276100 361215 138026 -237772 220248
13402F7016J22823K0889J67134j71908k1155M8848b37567A54513J98856F359J49397
$$ 67016 189839 210728 377862 205954 184799 233647 -237567 154513 353369 6359 155756
13391A55756m8571R5035m386J38866H0524h2541F1521J47031J7978q6502F6860
$$ 155756 107185 202220 197834 336700 80524 -82541 61521 208552 226530 140028 66860
13379B70903j05455L97414D9025L04052r4011r290q570O9341j21976M1335k8347
$$ 270903 165448 562862 49025 353077 259066 249776 241206 310547 188571 229906 201559
13368B01559K85549j47292m5047a45670i528B8239K66956J03813R546c9907C64658
$$ 201559 487108 339816 294769 -145670 -9528 28239 295195 399008 408554 -39907 364658
13356h6257B49005J75474a4528j17293I7143a66657B21376D5036J28633R9953
$$ -86257 249005 424479 -14528 -131821 97143 -166657 221376 45036 173669 273622
13346B73622q0340P2065J02757j34938L8192A28380c9680F22900D0723K41969
$$ 273622 193282 265347 368104 233166 271358 128380 -39680 622900 40723 282692
13336B82692g738B49250l7770J69534n8545A07258J50505K2575j38305J0996l5235
$$ 282692 -7738 249250 211480 381014 322469 107258 257763 280338 142033 153029 117794
13325A17794J64974A40435J86641K17213B26104d4027E85302G6276L19470j38508
$$ 117794 282768 140435 327076 544289 226104 -44027 585302 76276 395746 257238
13315B57238L07900G5984J38678J84614I3750L4862K7593K43721A22381P2322
$$ 257238 565138 75984 214662 399276 93750 128612 156205 399926 122381 194703
13305A94703J57490B7746L47149j03106N227a1203l2225A12438A6089L19369D6040
$$ 194703 352193 27746 374895 271789 277016 -11203 -43428 112438 16089 335458 46040
13293D38808p5857A73881J21203B7846L01847n8323G5988J71612J65819j45779
$$ 438808 362951 173881 295084 27846 329693 271370 75988 247600 413419 267640
13283B67640n9017J05313b42520B03874C897J66067p0583J44126R8497a3455B11575
$$ 267640 208623 313936 -242520 203874 3897 169964 99381 243507 342004 -13455 211575
13271E47050A56462a08620a3128B09988J37419A51523F1233a01183I2387j6980
$$ 547050 156462 -108620 -13128 209988 347407 151523 61233 -101183 92387 75407
13261G5407J75839P2753e5466B34107a02668C36637I1818c8784B13849E681K79577
$$ 75407 251246 323999 -55466 234107 -102668 336637 91818 -38784 213849 5681 285258
13250B85258a9370B81538j15704K57833A07280a97910f6763K1611A67612O3869
$$ 285258 -19370 281538 165834 423667 107280 -197910 -66763 -45152 167612 231481
13240B31481a23534A11867R0142C5170J86561b4415n2798B7524N5344Q1287e6540
$$ 231481 -123534 111867 202009 35170 221731 -24415 -77213 27524 82868 164155 -56540
13228C30935J84361j64811b3475C29616A13910a13108C60452p5994L269j05107
$$ 330935 515296 350485 -23475 329616 113910 -113108 360452 284458 287727 182620
13218A82620l7649D4205b3730A45075O0110j0449D471b40514F9210a46660A35732
$$ 182620 144971 44205 -23730 145075 205185 194736 4471 -240514 69210 -146660 135732
13206A57703F5539A121Q7226M15311c2923M76A81982J01242k015J21956B8517
$$ 157703 65539 1121 88347 503658 -32923 -32447 181982 283224 281209 403165 28517
13194a2611A00295L15735i704A43446P0337b01976G4351O10687d2331n9877C3525
$$ -12611 100295 416030 -9704 143446 213783 -201976 74351 685038 -42331 -102208 33525
13182D6410J69507I2568K75088d9423a6089A61244p9533c9246C8233K39545M784
$$ 46410 215917 92568 367656 -49423 -16089 161244 81711 -39246 38233 277778 282562
13171B82562b737q8414B16637e2670q5573A2975a05964B43287B2498Q0907E9K01047
$$ 282562 -2737 -91151 216637 -52670 -138243 12975 -105964 243287 22498 103405 59 201106
13159B01106R2632B1637L48088a09538C25800i6115A98172H2197M4421K32823
$$ 201106 293738 21637 369725 -109538 325800 -96115 198172 82197 126618 359441
13149C59441a4466B66863j22226D3365b9034A20638J12259J35782A61972c5006
$$ 359441 -14466 266863 144637 43365 -29034 120638 232897 368679 161972 -35006
13138D73856j95959A14073c43891a63564D3140j9812M7796K66476G3004h5243
$$ 473856 277897 114073 -343891 -163564 43140 23328 71124 337600 73004 -85243
13127G7093K10327J580A24626C8855a467E9421J21986M1135b86150A15612K75402
$$ 77093 287420 289000 124626 38855 -1467 59421 181407 222542 -286150 115612 391014
13116C91014A38308d9184j88852B27245J37998a93007B91480j31653a52868e5782
$$ 391014 138308 -49184 -238036 227245 365243 -193007 291480 159827 -152868 -55782
13105D51609A37465J39975a76795B25112e8816M674E0547H330K85228I3478J42627
$$ 451609 137465 277440 -176795 225112 -58816 -54142 50547 8330 293558 93478 236105
13094B36105F6737K2979E703N1686N3552b9326q2380A41578N649e2549E1227a35594
$$ 236105 66737 89716 5703 57389 110941 -29326 -111706 141578 147227 -52549 51227 -135594
13081a33135l5375B49678a66735A70079H0945j9458J85560b42024A11284D4397
$$ -133135 -168510 249678 -166735 170079 80945 61487 247047 -242024 111284 44397
13070a83282I5065a8895A44732a15958B44908a55263e787D3129M6472J94137e3220
$$ -183282 95065 -18895 144732 -115958 244908 -155263 -5787 43129 89601 283738 -53220
13058D3486a60628B06157g8301A978J26092L81958k22722l6657J58051a28897
$$ 43486 -160628 206157 -78301 1978 128070 510028 287306 250649 408700 -128897
13047H2696e1623C68761j53963M4738j07941j4795R2601L6010i2216B576f9644
$$ 82696 -51623 368761 214798 259536 151595 136800 229401 265411 -92216 2576 -69644
13035H3432k8432J81830a37006g897A87192L5139G8631f9209H6836b1366A15757
$$ 83432 55000 236830 -137006 -7897 187192 222331 78631 -69209 86836 -21366 115757
13023H1420d4813C99264A80627K07796A447K41527d3941j02598J0999C77782F7579
$$ 81420 -44813 399264 180627 388423 1447 242974 -43941 -146539 -135540 377782 67579
13011E4702c35551i3426b0589A01949a53200A89530p2269N0854K19257A68428
$$ 54702 -335551 -93426 -20589 101949 -153200 189530 117261 168115 387372 168428
13000a00837K0748C13700C8169j2238i2475A16433c1309A29954b23291E1244K4799
$$ -100837 -80089 313700 38169 25931 -92475 116433 -31309 129954 -223291 51244 76043
12989G6043A3567J71755L2945J03207a34775E8908I391a55034b1194B60658h7097
$$ 76043 13567 185322 218267 321474 -134775 58908 9391 -155034 -21194 260658 -87097
12977C04999j34053p6065J04021b21514Q7558D23536i199A49283g7927G1434P4611
$$ 304999 170946 94881 198902 -221514 -133956 423536 -9199 149283 -77927 71434 146045
12966A46045j6686a75466P7175J9769j839J3847k8589d4108k1269C4844O6887
$$ 146045 129359 -175466 -98291 -78522 -80361 -66514 -95103 -44108 -65377 34844 101731
12955A01731a8606B29023m9571b67902B804J66478K37878M8483a01929E8917J58415
$$ 101731 -18606 229023 179452 -267902 2804 169282 407160 455643 -101929 58917 217332
12944B17332c7809j02732C70994a9787p5886H7934J3710J92755A24226k3652c28772
$$ 217332 -37809 -140541 370994 -19787 -95673 87934 101644 294399 124226 100574 -328772
12932a62930C16004a2140B50803A09305P1809a38633a8694j13199C2685P2358
$$ -162930 316004 -12140 250803 109305 181114 -138633 -18694 -131893 32685 105043
12922A05043i6927B227J69251b51249b053k66752G8281b09461B51557A271J98945
$$ 105043 -96927 2227 171478 -251249 -2053 -268805 78281 -209461 251557 1271 200216
12911B00216A8373q598L69118F7128A1671h8141A63275p8286D1146L0403O7327
$$ 200216 18373 9775 378893 67128 11671 -88141 163275 84989 41146 71549 138876
12900A38876n4197b4039D2497L04066A4020J3320J14268f5251m6588A01745C6610
$$ 138876 84679 -24039 42497 346563 14020 27340 141608 -65251 -111839 101745 36610
12888a86899b52p6839A86676a6177B09192r2980A0443b6858B10511b0030j54826
$$ -186899 -252 -77091 186676 -16177 209192 116212 10443 -26858 210511 -20030 -174856
12877a74856P468A04955a25819A78736b2537d072C62830A237a75088c6996E9459
$$ -174856 -167388 104955 -125819 178736 -22537 -4072 362830 1237 -175088 -36996 59459
12865G7929N5192O8658a84783e3435B30630C4169R4296R1758j954a59827P2781
$$ 77929 133121 201779 -184783 -53435 230630 34169 128465 220223 218269 -159827 -87046
12854h7046B31946r145K9752j2978a59993C2925J89244p2490D8001K46315N6901
$$ -87046 231946 222801 252553 239575 -159993 32925 222169 149679 48001 294316 351217
12843C51217h696o4907G4600J1542a1661q4723I3999c3385A81278M8351C7713
$$ 351217 -8696 -73603 74600 86142 -11661 -96384 93999 -33385 181278 229629 37713
12831f015r5329F490O1003j5729Q5566a97538I9821a12747B36603B4146b14959
$$ -6015 -101344 6490 67493 51764 137330 -197538 99821 -112747 236603 24146 -214959
12819A66231G22K37347R5393G6093C4869b72674A22232h0330A07111a21182H9925
$$ 166231 722 238069 333462 76093 34869 -272674 122232 -80330 107111 -121182 89925
12807H7709O2492o6519c07480D4374M88838B23723G2561a279F5918L7854a84633
$$ 87709 150201 83682 -307480 44374 533212 223723 72561 -1279 65918 103772 -184633
12795g9419j07933n9494k47087A63992o7323K10453a39524B58187G815h1187D22789
$$ -79419 -187352 -246846 -493933 163992 96669 307122 -139524 258187 7815 -81187 422789
12783h9335c1934j64843A74604N5669a96304h5428A4724K32353a0902j75319A08185
$$ -89335 -31934 -196777 174604 230273 -196304 -85428 14724 247077 -10902 -186221 108185
12771d9750j64735k78770B90134a93504D9492j8359Q3282m0082J54939j04273
$$ -49750 -214485 -493255 290134 -193504 49492 31133 114415 74333 229272 124999
12761A24999J46512e3016j5204r8584A02499q270L6848e7397E0252c46474B86452
$$ 124999 271511 -53016 -68220 -166804 102499 94229 131077 -57397 50252 -346474 286452
12749I9900O2374F9837b51365r1482b2299k79136e9274A31881N2247D5302j9775
$$ 99900 162274 69837 -251365 -342847 -22299 -301435 -59274 131881 184128 45302 25527
12738B5527J76093o4379i5485B8438c43284i6581D5719Q014b20347k8910b5317
$$ 25527 201620 137241 -95485 28438 -343284 -96581 45719 53733 -220347 -249257 -25317
12726e0282l6260r5729B08885C2007m248a25105i062j38385c1542A68887h9302
$$ -50282 -86542 -182271 208885 32007 27759 -125105 -9062 -147447 -31542 168887 -89302
12714C87820I3576A1985J26849L44525A88871l2989g847k69247C15893a5302A70454
$$ 387820 93576 11985 138834 483359 188871 155882 -7847 -277094 315893 -15302 170454
12702a3839C05599H8405k1968J53612I6276a16096j1041G551J36817a23551j94341
$$ -13839 305599 88405 66437 220049 96276 -116096 -127137 7551 144368 -123551 -317892
12691c17892c0809l6086k38102H429b12851D8418j1496M6666L86401a15537B67152
$$ -317892 -30809 -66895 -304997 8429 -212851 48418 36922 83588 469989 -115537 267152
12679A25663N7555j2810K35342c2331B61982a3271I0603b8972B40695l4068a11790
$$ 125663 183218 170408 405750 -32331 261982 -13271 90603 -28972 240695 206627 -111790
12667A94094J07502o930j27116J7507a13136K2650C22051I8400B2663J31118F3569
$$ 194094 301596 294666 167550 185057 -113136 -90486 322051 98400 22663 153781 63569
12655A41905P9736j03904J74516D3440J85451n3722J46167r0184j09818a71289
$$ 141905 221641 117737 292253 43440 228891 175169 321336 231152 121334 -171289
12644B24421a06461C31653d064A01334a53123C54526C0772K33049j12852i2497
$$ 224421 -106461 331653 -4064 101334 -153123 354526 30772 263821 150969 -92497
12633H6558L77084c4955j62597A29092g8328p2936F8745f1227j12048A98273K59366
$$ 86558 463642 -34955 -197552 129092 -78328 -151264 68745 -61227 -173275 198273 457639
12622D57639A20291M6143a99044B00481J8708k0811C5421a41651F6712a62980
$$ 457639 120291 166434 -199044 200481 219189 198378 35421 -141651 66712 -162980
12611D6636a04561C52533f0953C17571a21305A47962a71565c1575A69053b4780
$$ 46636 -104561 352533 -60953 317571 -121305 147962 -171565 -31575 169053 -24780
12600A65738N3815K5296D356c0328B77380E8421h1307j12113C61905a10024j77846
$$ 165738 219553 244849 4356 -30328 277380 58421 -81307 -193420 361905 -110024 -287870
12589b87870B45755n9321c4034A01145c15947B12530k8693j6650f6585B3357K78701
$$ -287870 245755 186434 -34034 101145 -315947 212530 183837 167187 -66585 23357 302058
12578C02058F7792R9669p9538K48230A39838M7731H110M6644b42113b8646B48584
$$ 302058 67792 167461 87923 336153 139838 187569 8110 54754 -242113 -28646 248584
12566A11283a5718k2374A45837K4855E0838i7005F5080h9830A7234K10375a22213
$$ 111283 -15718 -38092 145837 170692 50838 -97005 65080 -89830 17234 227609 -122213
12554D22100g1607D9197a51167e0335A11215J68324p1131f18B6526a42730b9858
$$ 422100 -71607 49197 -151167 -50335 111215 279539 208408 -618 26526 -142730 -29858
12542a89195B13169d39841F7593K42308j3795n4782A19303K66740j46264E0513
$$ -189195 213169 -439841 67593 309901 296106 241324 119303 386043 239779 50513
12531i8504L8765m4566j01994f7472j29259H7718a14640k42806b3242G8403Q7250
$$ -98504 -59739 -104305 -206299 -67472 -196731 87718 -114640 -357446 -23242 78403 165653
12520A65653J47162n9331H4444k475J97916b84655B01804G035J3480d6109D73587
$$ 165653 312815 253484 84444 81969 279885 -284655 201804 7035 20515 -46109 473587
12508B2248r617a27452c9666G4344J06319p8354K283M62218f9092D4427J61118
$$ 22248 12631 -127452 -39666 74344 180663 102309 104592 566810 -69092 44427 205545
12497B05545b02841o6412f3013k67216a2954I8425K68674i4619C0384A1804c3328
$$ 205545 -202841 -269253 -63013 -330229 -12954 98425 367099 -94619 30384 11804 -33328
12485g300A36J05197f0713A77157a9411D6769b13615F7302B0569J85888D9643
$$ -7300 136 105333 -60713 177157 -19411 46769 -213615 67302 20569 206457 49643
12473B24704B0224a01492A49891f0283C20035a9092j33487C19725F3978Q8383
$$ 224704 20224 -101492 149891 -60283 320035 -19092 -152579 319725 63978 152361
12463A52361i3825E0526M3807a7696B2649M8179a38732C19066B9719O0719h9051
$$ 152361 -93825 50526 94333 -17696 22649 70828 -138732 319066 29719 90438 -89051
12451G0424a79498K4629A77957a92673E2513J96130l1796c35232g4579F2135a68785
$$ 70424 -179498 -154869 177957 -192673 52513 248643 216847 -335232 -74579 62135 -168785
12439H3008k5429a00545B9343M0915O7863a53456J8219N3961q5284C7984c0930
$$ 83008 57579 -100545 29343 70258 138121 -153456 -135237 -81276 -166560 37984 -30930
12427E8738b48971H7328J72478l2201a50091A37568b35551G3989a0092B52227
$$ 58738 -248971 87328 259806 227605 -150091 137568 -235551 73989 -10092 252227
12416h9088A07915a40022N1553l00700e994C9692J86308N1791R9541a75780A48734
$$ -89088 107915 -140022 -88469 -389169 -5994 39692 226000 277791 377332 -175780 148734
12404b31053F673a68541M5763B5123a65004G4739j0249Q5405J04054q0199e6365
$$ -231053 6673 -168541 -122778 25123 -165004 74739 64490 149895 253949 173750 -56365
12392d0095j1902A31650f1961K1760A45459c01208a8902B21759e8643n3973I3041
$$ -40095 -51997 131650 -61961 -40201 145459 -301208 -18902 221759 -58643 -112616 93041
12380B30707I5028D5605j3977g8801k4632j04937n2423D8185a1018I5768b82436
$$ 230707 95028 45605 31628 -78801 -103433 -208370 -260793 48185 -11018 95768 -282436
12368a42642A46268c46733C4162P0628a1632A07307j9914K13464A42458a8017
$$ -142642 146268 -346733 34162 104790 -11632 107307 87393 300857 142458 -18017
12357a1291C35165b28115j09167H3297c47589I6364e120A58625C8269J02462c5734
$$ -11291 335165 -228115 -337282 83297 -347589 96364 -5120 158625 38269 140731 -35734
12345C5119h01k15701B09114K21354A3076c19718F7380c22801a17367L1824A36703
$$ 35119 -801 -216502 209114 430468 13076 -319718 67380 -322801 -117367 -85543 136703
12333a68079A14226e1656o12837f3800A62175O0789b77108J36766o1471j28257
$$ -168079 114226 -51656 -664493 -63800 162175 222964 -277108 -140342 -201813 -330070
12323c30070k66335H1066K46097k0242E1648f1552I261a44352M8484O804B16923
$$ -330070 -596405 81066 327163 306921 51648 -61552 9261 -144352 -95868 -89064 216923
12311a56132D36740a50531f801A33484I420a12551B00892j8627C1363i1865I345
$$ -156132 436740 -150531 -6801 133484 9420 -112551 200892 182265 31363 -91865 9345
12299a15401J0775L4609A44361b37770I4725i2857p2844G9173h4489l2798L3321
$$ -115401 -104626 -70017 144361 -237770 94725 -92857 -165701 79173 -84489 -117287 -83966
12288h3966J5720l4562g424k69671d5751n9553F7386E77J24452a63895B07935
$$ -83966 -68246 -102808 -7424 -277095 -45751 -105304 67386 577 125029 -163895 207935
12276A25433D6108a89198o0731e3263F5334g7820A2731J34411M3867q6576h4178
$$ 125433 46108 -189198 -249929 -53263 65334 -77820 12731 147142 191009 104433 -84178
12264B7421b39085C2710e3591b3651D562N2289M70573e9038I0922b3916A59679
$$ 27421 -239085 32710 -53591 -23651 4562 56851 527424 -59038 90922 -23916 159679
12252B08751J38021F7770H469c85543a7786k07202A1063K56258a53590A62461
$$ 208751 346772 67770 8469 -385543 -17786 -224988 11063 267321 -153590 162461
12241G908N9553f4112B66385a41450N9027G0904j1144G047O996M03938a45325
$$ 7908 67461 -64112 266385 -141450 -82423 70904 59760 7047 14043 417981 -145325
12229b3792n0027j28254F356P5835Q7377K20300D2813l250Q1444O1562F125J24767
$$ -23792 -73819 -202073 6356 82191 169568 389868 42813 39563 121007 182569 6125 130892
12217A30892n9260b60181A70685A6377J54246N113F9572N0333a55297K9972M9154
$$ 130892 71632 -260181 170685 16377 170623 175736 69572 119905 -155297 -125325 -76171
12206g6171G8897k9771A4417N6837C1863n522J67625L1597D4556e1301A15999
$$ -76171 78897 49126 14417 71254 31863 26341 193966 225563 44556 -51301 115999
12194C99583c06600A78525J64526G1748Q6588a11027b4388p4097C24676a4570
$$ 399583 -306600 178525 343051 71748 158336 -111027 -24388 -98485 324676 -14570
12183c32837c5393e526j21168j23523B73433N2695b5247C11417A2313J31279k483
$$ -332837 -35393 -5526 -126694 -250217 273433 326128 -25247 311417 12313 143592 141109
12172A41109J86795A32074a1254A50982J64788E4937N64291A47087J4258M7071
$$ 141109 327904 132074 -11254 150982 315770 54937 619228 147087 161345 208416
12162B08416k1415a25580L5803q251H6338k7484L1691B8664J59861n1695L44401
$$ 208416 187001 -125580 -89777 -98028 86338 58854 90545 28664 188525 136830 481231
12151D81231A90768N2222r4486P8879a57209B07159b29139B11419p3851J82694
$$ 481231 190768 242990 148504 227383 -157209 207159 -229139 211419 137568 320262
12141C20262p5918J1789a85281C65238l2461A16102L0884J94771E2799J16457
$$ 320262 244344 256133 -185281 365238 332777 116102 146986 341757 52799 169256
12131A69256m7301J11772n8303b3537B09166p4042h636B9765a22647C24719A23460
$$ 169256 121955 233727 175424 -23537 209166 135124 -8636 29765 -122647 324719 123460
12119d0647p4165A10166b595B75152A2878a14651B99292a35612A21016e0998B26878
$$ -40647 -114812 110166 -2595 275152 12878 -114651 299292 -135612 121016 -50998 226878
12107H9489B9378Q2236J97366A36006k346b87349C13190E741J26828L4904c53161
$$ 89489 29378 111614 308980 136006 133660 -287349 313190 5741 132569 167473 -353161
12095e9082A19966B0941e531A0535J07614G097h6716L4523K1761C33367j49691
$$ -59082 119966 20941 -5531 10535 118149 7097 -86716 -52193 -30432 333367 183676
12084A83676L6133B640J62643K9167B8534Q2567a9490n6545o8725g449D7869a91699
$$ 183676 219809 2640 165283 194450 28534 111101 -19490 -76035 -144760 -7449 47869 -191699
12071a09892E0796a2120I6427a12483m7167A07573J09052F6390B7803a62510k6117
$$ -109892 50796 -12120 96427 -112483 -159650 107573 216625 66390 27803 -162510 -188627
12060a88627j5765A39378a27185B2050N7133g5289D20754G3523L76931P83419
$$ -188627 -204392 139378 -127185 22050 79183 -75289 420754 73523 450454 1233873
12050A233873P39590E78593B6266J98229E3422L849K8766b39369N9141b3088O75
$$ 1233873 1973463 578593 26266 224495 53422 57271 86037 -239369 -180228 -23088 -22413
12039b2413p4367a9332n0438G1989o150b88114J41129C3160O4648J24697B2921
$$ -22413 -96780 -19332 -69770 71989 65839 -288114 -146985 33160 97808 222505 22921
12027B47780a7077l34509C08295a47040C37745a76230L1308B029a85176G1095
$$ 247780 -17077 -351586 308295 -147040 337745 -176230 -144922 2029 -185176 71095
12016A05340L14177a41364q0368e0053B17011a91780I1531j6231a32226B65440
$$ 105340 419517 -141364 -221732 -50053 217011 -191780 91531 75300 -132226 265440
12005B8412a26794d6233A22388b11392B47728A23321M9390a94045K0080O972O2362
$$ 28412 -126794 -46233 122388 -211392 247728 123321 172711 -194045 -173965 -166993 -104631
11994a04631B92443f9132G5483k6308I522K45086f5054D53972A06844B2586J8662
$$ -104631 292443 -69132 75483 49175 9522 254608 -65054 453972 106844 22586 41248
11983D1248a14687b8730o7161Q431k08117A83467R1166A32001O179J7273e26047
$$ 41248 -114687 -28730 -95891 -87460 -295577 183467 274633 132001 138180 155453 -526047
11971a64755b6798a1725A34268i6303E4836N999b94112a29537a9663n3558a9052
$$ -164755 -26798 -11725 134268 -96303 54836 60835 -294112 -129537 -19663 -73221 -19052
11959d00367I3269K13356A50761m5270a37913N6841A2628c8305k50835q3846B6589
$$ -400367 93269 306625 150761 105491 -137913 -81072 12628 -38305 -289140 -372986 26589
11947I561b85043e1079b925j20564j22699b4248G7716b19049e4520j98175f4046
$$ 9561 -285043 -51079 -2925 -123489 -246188 -24248 77716 -219049 -54520 -252695 -64046
11935C23457o5307b53934G2202a78961j02220A62242K6190A6993J07146c62742
$$ 323457 258150 -253934 72202 -178961 -281181 162242 188432 16993 124139 -362742
11924B40944a0031B85605b6108E5734K8303e5358o295B35612a0916k51304A00092
$$ 240944 -10031 285605 -26108 55734 84037 -55358 -61653 235612 -10916 -262220 100092
11912B92552j00675G5863J55846a25319M9511A13425J5710c2314r9866o46a320
$$ 292552 191877 75863 231709 -125319 -75808 113425 129135 -32314 -132180 -132826 -1320
11900a42979I570a09115M0125E7199B1410J17441a24192J6463I3390J49948a22178
$$ -142979 9570 -109115 -68990 57199 21410 138851 -124192 -107729 93390 243338 -122178
11888G0183e1676o5155A34215D6671J22056b28325B631O3895A6793a14278E3344
$$ 70183 -51676 -116831 134215 46671 168727 -228325 2631 66526 16793 -114278 53344
11876a28241j4223l59051h136C4698e7038D2513K42843A37609P6056a65211F47
$$ -128241 -142464 -501515 -8136 34698 -57038 42513 285356 137609 213665 -165211 647
11864A86772q151N1074a9770G9362b37194J08321O2157q3212I8183g1894r0852
$$ 186772 178621 229695 -19770 79362 -237194 -128873 -66716 -149928 98183 -71894 -162746
11853a62746H5933f8293B45932h8421n7100b9914j53794k35860A31382b42650
$$ -162746 85933 -68293 245932 -88421 -145521 -29914 -183708 -419568 131382 -242650
11842b36315A88845f3269K13g557j24601a1556j57263A60668C2565b24205P7030
$$ -236315 188845 -63269 -63056 -7557 -132158 -11556 -168819 160668 32565 -224205 -147175
11831a47175A15351h3698k86893A17108E7686J48814h1047I5135j1733b6319G821
$$ -147175 115351 -83698 -370591 117108 57686 206500 -81047 95135 83402 -26319 7821
11819a68002F437b24685O5877G679J90167H69R279J27054a06403l8859h137j89253
$$ -168002 6437 -224685 -158808 7679 197846 869 10148 137202 -106403 -145262 -8137 -197390
11807a97390a0473j82233K8992B36073D3227J41169H7432J40899Q2894G3997b08590
$$ -197390 -10473 -192706 -163714 236073 43227 184396 87432 228331 311225 73997 -208590
11795d1352I650M244L7166a34982o1589b6024A12095h2070c977I0314B735b01213
$$ -41352 9650 13894 51060 -134982 -196571 -26024 112095 -82070 -3977 90314 2735 -201213
11782B2026Q4665e68454A7114K65317a68297D1252e1853a6307k82144J4291N535
$$ 22026 106691 -568454 17114 282431 -168297 41252 -51853 -16307 -298451 -284160 -278625
11771b78625E9246a16165A70597a43406A21755a44820G8384h8379n236I0195b35603
$$ -278625 59246 -116165 170597 -143406 121755 -144820 78384 -88379 -93615 90195 -235603
11759D19592n4668b68837K7011A78521J28504A52704a72394j0807F482N2761L65383
$$ 419592 364924 -268837 -241826 178521 307025 152704 -172394 -183201 6482 59243 424626
11748D24626f7184o2153m1208n8417C4040b052j16473A25734a10441A71696d00118
$$ 424626 -67184 -129337 -170545 -228962 34040 -2052 -118525 125734 -110441 171696 -400118
11736D9630b3557C20663A04464a38185a0317A14192b98988a24634J3410k3724
$$ 49630 -23557 320663 104464 -138185 -10317 114192 -298988 -124634 -111224 -134948
11726a34948B6977b67433R6200A45127G2124M7840c14041e1627q6830B3893i9019
$$ -134948 26977 -267433 -171233 145127 72124 119964 -314041 -51627 -138457 23893 -99019
11714b11484C9838e9958A08205k8612l2152j4490J31890b59512A12132J25498
$$ -211484 39838 -59958 108205 79593 47441 32951 164841 -259512 112132 237630
11704B37630b25189R5504e9484A28588b23014G8737Q1056k7144a1037q5791j10351
$$ 237630 -225189 -129685 -59484 128588 -223014 78737 159793 132649 -11037 -96828 -207179
11693b07179E2457K2703b62354R3735B1497K6397K39888o0415h26I3246a44034
$$ -207179 52457 75160 -262354 -168619 21497 47894 287782 227367 -826 93246 -144034
11681h2960l8572A0976b19107A30424a63598p419P5575b8184k9451A23076J69665
$$ -82960 -121532 10976 -219107 130424 -163598 -171017 -95442 -28184 -57635 123076 292741
11670B92741b66254A07305i9100I7981R7771b13438j20193I2513a88648j09716
$$ 292741 -266254 107305 -99100 97981 195752 -213438 -333631 92513 -188648 -298364
11660b98364b1272F9973l0643M37226f0654I32M25922h0666B6489a01100k38883
$$ -298364 -21272 69973 39330 476556 -60654 932 426854 -80666 26489 -101100 -339983
11649c39983f3515A3733i2226D2184K24773k334d1496C7345J4432D449K42342
$$ -339983 -63515 13733 -92226 42184 266957 264623 -41496 37345 51777 4449 246791
11638B46791e5597B33843n1686N2250I5663P5685a21653B18092a44217j87620
$$ 246791 -55597 233843 182157 234407 95663 171348 -121653 218092 -144217 -331837
11628c31837d6263j11156A6094a28102A16834B6701N7123J53665A1726a42181
$$ -331837 -46263 -157419 16094 -128102 116834 26701 83824 237489 11726 -142181
11617b77086E643i7504A42457a8434f370H9919J73575a6540C64483B3844L98360
$$ -277086 5643 -97504 142457 -18434 -6370 89919 263494 -16540 364483 23844 422204
11606D22204G5528j7399b65278B59459p2395p8706b41748A4992J40453K50105
$$ 422204 75528 58129 -265278 259459 187064 108358 -241748 14992 155445 405550
11596D05550a33910B15821i2464A50971l5045a17643H9487g3601F3906J1336K56046
$$ 405550 -133910 215821 -92464 150971 115926 -117643 89487 -73601 63906 75242 331288
11585C31288F730L06396A00321h8400D8943n410a04918k4415H7669k6533M1738
$$ 331288 6730 313126 100321 -88400 48943 43533 -104918 -129333 87669 61136 102874
11574A02874d636D85a88423b0486C16656e5867A47159L2481M4841j8739j933a0633
$$ 102874 -4636 485 -188423 -20486 316656 -55867 147159 179640 224481 205742 203809 -10633
11561c84888d2493j13068b2920j75745A67426a98404B38463K0462e0244A75372
$$ -384888 -42493 -155561 -22920 -198665 167426 -198404 238463 258925 -50244 175372
11550F7334d21662F2784L52312B6424K55035c2107B28116E8576a39222B89377
$$ 67334 -421662 62784 415096 26424 281459 -32107 228116 58576 -139222 289377
11539d9466q2112B16284H9213e6309A44657a43890D7235L09990j51104K02255
$$ -49466 -131578 216284 89213 -56309 144657 -143890 47235 357225 206121 408376
11529D08376j58104H4857l1845L05538g9346A2115J01995L1754L92177A66757
$$ 408376 250272 84857 53012 358550 -79346 12115 114110 145864 538041 166757
11518A4330J58653K82850c62785A02422J61354b23774J09169N064E9751Q1681
$$ 14330 172983 455833 -362785 102422 263776 -223774 -114605 -109541 59751 141432
11508A41432A1499O1001N5562R2603i7921D8234J11803a23811A76603a63334A66441
$$ 141432 11499 72500 128062 220665 -97921 48234 160037 -123811 176603 -163334 166441
11496a30194A13274K82126j52644F1195b26663A42354n4933D605g4683B79484
$$ -130194 113274 395400 242756 61195 -226663 142354 87421 4605 -74683 279484
11485A97956a04391E7909K67291A26101b27029E09428f0498A58936K03660j07274
$$ 197956 -104391 57909 325200 126101 -227029 509428 -60498 158936 362596 255322
11475B55322E3255a1899o1009B77028j36101l3189L59797B0287J50742b5860j54578
$$ 255322 53255 -11899 -72908 277028 140927 107738 467535 20287 171029 -25860 -180438
11464a80438A46585a30606H0314C2254r468F46J35088m1718b4614o234q2834c6269
$$ -180438 146585 -130606 80314 32254 22786 646 135734 94016 -24614 -30848 -113682 -36269
11451C72621p932G5196h2383B30937A7281J22775L2734F5426M0580J32361Q62
$$ 372621 364689 75196 -82383 230937 17281 140056 172790 65426 106006 238367 239229
11440B39229K04637E0695R9680Q3874c6311C37134c9984o9596A96780E4920R4820
$$ 239229 443866 50695 150375 234249 -36311 337134 -39984 -109580 196780 54920 149740
11429A49740A981b03956P5784H7490L0602N705C6628J24515K39407A23411l18
$$ 149740 1981 -203956 -128172 87490 118092 123797 36628 161143 400550 123411 123093
11418A23093E3300Q6240D6174a3930j52043I5028i3487B23410c646A13264n0503
$$ 123093 53300 139540 46174 -13930 -165973 95028 -93487 223410 -3646 113264 62761
11407F2761n941J84521K4921p3215d96179b14560d5969A78225b59895g6345n5885
$$ 62761 56820 241341 266262 193047 -496179 -214560 -45969 178225 -259895 -76345 -132230
11396a32230L4123d8483k9540A67409J0356l5903R1085j00745a12484E7809L19132
$$ -132230 -98107 -48483 -78023 167409 177765 141862 232947 132202 -112484 57809 376941
11385C76941j34808A06492D1406a9521j4327l87634d6657a3322j10941j8469A95236
$$ 376941 242133 106492 41406 -19521 -33848 -421482 -46657 -13322 -124263 -142732 195236
11373i608D91585a55857M607C17451G8856i9097L1305q6729R839C28428a6941
$$ -9608 491585 -155857 -151250 317451 78856 -99097 -67792 -154521 -144682 328428 -16941
11361a09861C16600D9306N6908a89684E5254a00747A94222J3610n115o4621b84659
$$ -109861 316600 49306 106214 -189684 55254 -100747 194222 207832 202717 138096 -284659
11349a00520l1086N0908k43288a40836k1122C74599c4153C6581k950a8716o7136
$$ -100520 -131606 -80698 -323986 -140836 -161958 374599 -34153 36581 33631 -18716 -85852
11338h5852l44555a43316j2722D921J62571n2185h7811e121A6715e12962D9664
$$ -85852 -430407 -143316 -156038 4921 167492 115307 -87811 -5121 16715 -512962 49664
11326g1379n8869N0959o355n9520A6969c75215C71107f6464G9351a58925D7864
$$ -71379 -130248 -79289 -85644 -145164 16969 -375215 371107 -66464 79351 -158925 47864
11314A75684b30546P1780c9572B2680a79371a6322A3316M2839m338j9101f2634
$$ 175684 -230546 -158766 -39572 22680 -179371 -16322 13316 56155 51817 32716 -62634
11302a78113I3617A7883f9747j26891G6457a01669J3324D6425K0439e9662B89860
$$ -178113 93617 17883 -69747 -196638 76457 -101669 -88345 46425 66864 -59662 289860
11290A71758F6608J45026c20579A2948R6172d68217f6811l7761C24125j53191
$$ 171758 66608 211634 -320579 12948 109120 -468217 -66811 -104572 324125 170934
11280A70934f7352F0102c96411G8066L6960a84633Q8736j8747n2016f2974o7838
$$ 170934 -67352 60102 -396411 78066 115026 -184633 -95897 -114644 -166660 -62974 -130812
11269a30812a368A02982k2013g5349l8710G4514a98806A9963e6296j68320L3894
$$ -130812 -1368 102982 80969 -75349 -114059 74514 -198806 19963 -56296 -224616 -190722
11258a90722I0414A2835b96562F439f6219R764n2938C4232C481J75965b79693
$$ -190722 90414 12835 -296562 6439 -66219 -56455 -109393 34232 3481 179446 -279693
11246A73430O9502a95027b4830j06176j33599a25164j11176B5839J20969h2072
$$ 173430 242932 -195027 -24830 -131006 -264605 -125164 -236340 25839 146808 -82072
11235A74454E7232P279g9601q0381P7883L2900j97898A12607B8231N4699Q0404
$$ 174454 57232 64511 -79601 -159982 -82099 -49199 -247097 112607 28231 82930 163334
11224A63334p5306a61887a3586q6338A29716E9596b4811A27545E2261K4485M4075
$$ 163334 88028 -161887 -13586 -99924 129716 59596 -24811 127545 52261 76746 120821
11213A20821K89921b87359D0737K83003c23358a30209e1191A06737D5196J7620
$$ 120821 410742 -287359 40737 323740 -323358 -130209 -51191 106737 45196 62816
11203F2816b92757F5344a39932m5580A33085a00667B25084c00080h7360j01558
$$ 62816 -292757 65344 -139932 -185512 133085 -100667 225084 -300080 -87360 -188918
11193a88918j1615L5571B9865i1645G2896b41351F5074f4730j8796A25729B6974
$$ -188918 -200533 -164962 29865 -91645 72896 -241351 65074 -64730 -83526 125729 26974
11181c06237J13020B31954b86941f257K065B95013a8756k90382a11857q9136I7143
$$ -306237 -193217 231954 -286941 -6257 -4192 295013 -18756 -309138 -111857 -200993 97143
11169b22390B22507H2402a32801A72733a76093A11062a57316A6085Q0122a68136
$$ -222390 222507 82402 -132801 172733 -176093 111062 -157316 16085 96207 -168136
11158c17260B3159a12205A97398B1034e1772A65550C8526b53622C8360K8506P2828
$$ -317260 23159 -112205 197398 21034 -51772 165550 38526 -253622 38360 66866 139694
11147A39694p65d6380k762D6645b11275C3140K34815a09702I2308B1275d02441
$$ 139694 138929 -46380 -49142 46645 -211275 33140 267955 -109702 92308 21275 -402441
11135h0628r756o5887G9331a33232A15604a70507L4501f640B15692c17832A82702
$$ -80628 -90384 -156271 79331 -133232 115604 -170507 -136006 -6640 215692 -317832 182702
11123A79937b28761B0948b16175h770A3255b5485A05301P3087b46141d2435k49978
$$ 179937 -228761 20948 -216175 -8770 13255 -25485 105301 178388 -246141 -42435 -292413
11112b92413b7871j17866N6631A68025a73518f9053B87937f4915F7021K03727
$$ -292413 -27871 -145737 -89106 168025 -173518 -69053 287937 -64915 67021 270748
11102B70748A34658C606M27379a3097r4706K5128q0112A91087K9974c03488A95186
$$ 270748 134658 3606 430985 -13097 -107803 -82675 -162787 191087 221061 -303488 195186
11090A64960e4262C15878c34572a2477j42007j189Q19A43437A8586J64258c18688
$$ 164960 -54262 315878 -334572 -12477 -154484 -155673 -154854 143437 18586 182844 -318688
11078g8833A06925P1182J67369A62190J49840d0132A45919J33239M976e065A43181
$$ -78833 106925 178107 345476 162190 312030 -40132 145919 279158 284134 -5065 143181
11066D57850A12798m0638K26795j31319J44092j33969J25473O5658j51072H6666
$$ 457850 112798 72160 298955 167636 311728 177759 303232 368890 217818 86666
11055C99237j63376b2471C3544J1602K89709j52005L44036A43218F8374K78277
$$ 399237 235861 -22471 33544 45146 334855 182850 526886 143218 68374 346651
11045C46651k5976j35189J2488J65294q0906P379f350B45658F4520M11399B20910
$$ 346651 320675 185486 197974 363268 282362 289741 -6350 245658 64520 475919 220910
11033D26277J32489o802j10683J5802m7671q9459L72009j25086B51257L86274
$$ 426277 558766 551964 441281 457083 409412 319953 691962 566876 251257 637531
11023F37531k9162k9524J32573O8881J40868m14200L37913o8258B48016M28877
$$ 637531 608369 578845 711418 780299 921167 506967 844880 776622 248016 676893
11013F76893j92624L92090D01182L18882l32385m0027K14371K20116C64522M11559
$$ 676893 484269 876359 401182 720064 387679 347652 562023 782139 364522 776081
11003G76081C87238J1086L34526o2138C19658K20081J55829L26919m30301j60936
$$ 776081 387238 398324 732850 670712 319658 539739 695568 1022487 592186 431250
10993D31250L30322P0285D09788O7076J91071j91828o1610L0757Q3226l9506j71040
$$ 431250 761572 831857 409788 476864 667935 476107 414497 445254 528480 488974 317934
10982C17934K17398P8400k57709Q8744L9052n8507J79219J74446C42960J13405
$$ 317934 535332 613732 356023 444767 483819 425312 604531 778977 342960 456365
10972D56365R8914P763k33970J6519L14434C28556K40540j22802O3898M56641
$$ 456365 555279 563042 329072 345591 660025 328556 569096 446294 510192 966833
10962I66833l01486J23544L8536N0867j92003L0793j026L153L12870k04402K04504
$$ 966833 665347 788891 827427 878294 686291 717084 716058 719211 1032081 827679 1032183
10951A032183P51742l21606N0106o5584L95292K94681P2015K03887J26265m3577
$$ 1032183 1783925 1462319 1512425 1446841 1842133 2136814 2208829 2412716 2538981 2495404
10941B495404r9563P9348k45059J4946j72897l07214l9584l14139J8952O1872
$$ 2495404 2395841 2475189 2230130 2245076 2072179 1764965 1725381 1411242 1430194 1492066
10931A492066m1405R3903Q8450L57885l42771k61239O4929k27703k12094l03405
$$ 1492066 1450661 1544564 1633014 1990899 1648128 1386889 1451818 1224115 1012021 708616
10921G08616K78323m35190m1907q4954K11604J21491E5390J87384R1355A31652
$$ 708616 986939 551749 509842 424888 636492 757983 55390 242774 334129 131652
10910A76406l5021l5163l1862Q076O8690L3383e3780b5867A44799C4618L31399
$$ 176406 141385 106222 74360 82436 151126 184509 -53780 -25867 144799 34618 366017
10899C66017A57181p1564P9766A4181J46884a4711r2655A12684b98750d1922I216
$$ 366017 157181 85617 165383 14181 161065 -14711 -107366 112684 -298750 -41922 9216
10887A3529a07397A24880K1363b91993f5071c0630l0095A63438a9740m4116A70578
$$ 13529 -107397 124880 146243 -291993 -65071 -30630 -60725 163438 -19740 -63856 170578
10875B33050b78356a19385J0904C219Q1677I060a60352F2516M0052b97157d6016
$$ 233050 -278356 -119385 -108481 3219 84896 9060 -160352 62516 102568 -297157 -46016
10863a87210A65239F4969b31712R4755M0979d2480p0437N0379p2487A9102b27438
$$ -187210 165239 64969 -231712 -136957 -95978 -42480 -112917 -62538 -135025 19102 -227438
10851I1053h5142A27250a49343k57568C4594e7738j96369O1239C08975j48724
$$ 91053 -85142 127250 -149343 -406911 34594 -57738 -254107 -192868 308975 160251
10841A60251a00319A51552a26438q6859j85902B52076H8066a81836g7594A12427
$$ 160251 -100319 151552 -126438 -213297 -399199 252076 88066 -181836 -77594 112427
10830B18923h0850A63378b18200a06001A96214j2976D7946b70425A89969a98323
$$ 218923 -80850 163378 -218200 -106001 196214 183238 47946 -270425 189969 -198323
10819a16913j9661A11925E1338K0494J79526a71444L0920j08404B44085p6556
$$ -116913 -136574 111925 51338 71832 251358 -171444 -140524 -248928 244085 167529
10809A67529c2011K367B1343K8797b1379B00936a15778k935e5727A37389l8969
$$ 167529 -32011 -29644 21343 50140 -21379 200936 -115778 -118713 -55727 137389 98420
10798I8420J61497K5606e228B4468h2922A79161G5476c6481A89385B6484a69451
$$ 98420 259917 285523 -5228 24468 -82922 179161 75476 -36481 189385 26484 -169451
10786A77249a55618A6506c23912B19766G4808K2112N084B2820f4871C420a0925
$$ 177249 -155618 16506 -323912 219766 74808 96920 102004 22820 -64871 3420 -10925
10774G9445r22a86608P1152B37068b36306A4474e676j0605q7646A93157a72306
$$ 79445 78523 -186608 -115456 237068 -236306 14474 -5676 -16281 -103927 193157 -172306
10762a14580b5452a2486j7872k52918b0790B23107c6086k65586J3115J40074g629
$$ -114580 -25452 -12486 -30358 -283276 -20790 223107 -36086 -301672 -288557 -148483 -7629
10750g4253j03403I689M3976C455h483k76449A89380b46553J3027E1280J15748
$$ -74253 -177656 9689 53665 3455 -8483 -284932 189380 -246553 -233526 51280 167028
10739A67028C7179I0a78820A21710a08934A3717J9359c78589f0911p9889A97218
$$ 167028 37179 90 -178820 121710 -108934 13717 33076 -378589 -60911 -140800 197218
10727b36085a04105j57172B91814b52473d3383k0925D90255B00758m3733a38645
$$ -236085 -104105 -261277 291814 -252473 -43383 -64308 490255 200758 157025 -138645
10716b8495q2966k53845J22816D4905a4661o6153B16658c49338J74180L0324k05006
$$ -28495 -111461 -365306 -242490 44905 -14661 -80814 216658 -349338 -175158 -144834 -349840
10705c49840e5770A96909E1071K1486e2069I6156J73119D5072i4082o5162N0108
$$ -349840 -55770 196909 51071 72557 -52069 96156 269275 45072 -94082 -159244 -109136
10694a09136a4780A55916a86721P1126c2504p6767c2908l56086a90467j0544g0520
$$ -109136 -14780 155916 -186721 -115595 -32504 -109271 -32908 -388994 -190467 -201011 -70520
10682b90646R5357a5024k35666G7569J19430D861d34855B20776j08624h9719C09537
$$ -290646 -195289 -15024 -250690 77569 196999 4861 -434855 220776 112152 -89719 309537
10670c8883k81879E2272a49998b288l35475i2786m7814M1364k24762j3976e3420
$$ -38883 -320762 52272 -149998 -2288 -337763 -92786 -140600 -99236 -323998 -337974 -53420
10658B481a98220A66777i788C2716A0845a2394l88289J05691a25056A69187i3406
$$ 2481 -198220 166777 -9788 32716 10845 -12394 -400683 -294992 -125056 169187 -93406
10646e6356A96340l7918p3935a96193o4211P6293A03273m8353a58204B24803q2999
$$ -56356 196340 158422 84487 -196193 -260404 -184111 103273 54920 -158204 224803 141804
10635A41804b8968j19546A21993g2817F5734a70999o0641m2330J5876j67865a04229
$$ 141804 -28968 -148514 121993 -72817 65734 -170999 -231640 -273970 -258094 -425959 -104229
10623C06343b45801J16669C30505b02645m830B80423A21472e30227d801j39745
$$ 306343 -245801 -129132 330505 -202645 -207475 280423 121472 -530227 -4801 -144546
10613a44546O2969B04881F6478a14033k05063E7450c5921j17871h718l16672f1673
$$ -144546 -81577 204881 66478 -114033 -319096 57450 -35921 -153792 -8718 -325390 -61673
10601a11121k0639j39851p8986A46383E7536N7848a26641j34896R7191H4882C0839
$$ -111121 -131760 -271611 -350597 146383 57536 115384 -126641 -261537 -164346 84882 30839
10589c66863A87436C7706Q2946a45810D47801A95443p3389B0258J15035A6874
$$ -366863 187436 37706 120652 -145810 447801 195443 122054 20258 135293 16874
10578B48624c8386j46183l625f4511j00063j32C6693d45418J76442K5653I2235
$$ 248624 -38386 -184569 -188194 -64511 -164574 -164706 36693 -445418 -268976 -243323 92235
10566C6348J71283D3056J02912f5928I2332R1375p5882g854B82317D6480K0878
$$ 36348 207631 43056 145968 -65928 92332 183707 107825 -7854 282317 46480 67358
10555F7358a440j35590K5684A09396d90557g7154b7036B8325g752A03301C7130
$$ 67358 -1440 -137030 -111346 109396 -490557 -77154 -27036 28325 -7752 103301 37130
10543i5081j1272j15346k27946J26090A81733G168J397b4490n4496n9990f6470
$$ -95081 -106353 -221699 -449645 -323555 181733 7168 8565 -24490 -78986 -138976 -66470
10531b12657P8861c622p6650n2469A56242a79597f1965G3160J42793f4956I9989
$$ -212657 -133796 -3622 -80272 -132741 156242 -179597 -61965 73160 215953 -64956 99989
10519c1842j50695K7341G5126h9018j99187Q7805j862C7386J21619l4605a32702
$$ -31842 -182537 -155196 75126 -89018 -288205 -200400 -202262 37386 159005 124400 -132702
10507A8401N0670c12284D32210A4374e6154C7726J7449P9009i8531j079c6622
$$ 18401 69071 -312284 432210 14374 -56154 37726 55175 134184 -98531 -99610 -36622
10495a17006m3890A45367N467A897d07262a79607D02275b0467j62820G310e2724
$$ -117006 -160896 145367 150834 1897 -407262 -179607 402275 -20467 -183287 7310 -52724
10483h9735d6n9087A68542F1025c086A38861d14120a14754d9740A01083a52352
$$ -89735 -46 -59133 168542 61025 -3086 138861 -414120 -114754 -49740 101083 -152352
10471a43649M8010J3375D02881a30385k81445c3506k55895A36762A4487a11479
$$ -143649 -95639 -82264 402881 -130385 -411830 -33506 -289401 136762 14487 -111479
10460H6452a79265B14557i2205B8754h7518E20039A43554D2297J65167Q0495K88747
$$ 86452 -179265 214557 -92205 28754 -87518 520039 143554 42297 207464 287959 576706
10449E76706A96859K83440a03704A22861J1304J27918j20375l0555R657a6424
$$ 576706 196859 480299 -103704 122861 134165 262083 141708 111153 120810 -16424
10438h0711q106j07226A16684e0754A08187J46798g5871k85329c1330j76648c7184
$$ -80711 -88817 -196043 116684 -50754 108187 254985 -75871 -361200 -31330 -207978 -37184
10426a11096E7262K33191b4123F5924J2579J3715B7110N5992k2658K83124d8028
$$ -111096 57262 290453 -24123 65924 78503 92218 27110 83102 60444 343568 -48028
10414a07618C0109c12636a00695A66793i7986H2280h9075A36275J19708a16643
$$ -107618 30109 -312636 -100695 166793 -97986 82280 -89075 136275 255983 -116643
10403a98185n1135J20446B2840a99562A21369a51032K7538I7833l5156J06445
$$ -198185 -249320 -128874 22840 -199562 121369 -151032 -123494 97833 62677 169122
10393A69122g631p4463A3322K78598f3820j55519H5394f8686m5954q6705R5501
$$ 169122 -7631 -82094 13322 291920 -63820 -219339 85394 -68686 -114640 -201345 -105844
10382a05844h042n4158R410l17837a05218B34128m0107g4751a3120n625A1157
$$ -105844 -8042 -62200 -52790 -370627 -105218 234128 194021 -74751 -13120 -18745 11157
10370g7819L1530R476D66506A41408E0381J33277K6907n0589k3250J04575a21723
$$ -77819 -46289 -36813 466506 141408 50381 183658 210565 159976 136726 241301 -121723
10358A6606R7346D6K2933J06329n8935E271K88571A24728J24505N5762B2527L83910
$$ 16606 113952 46 22979 129308 70373 5271 293842 124728 249233 304995 22527 406437
10346D06437A53941Q5890R1304P8919A8667L62856k0145r4916q2780J28062J65985
$$ 406437 153941 239831 331135 410054 18667 381523 361378 266462 183682 311744 477729
10335D77729A38045K4643J25718K0856o8627J79322A11107d1892C33374A33668
$$ 477729 138045 162688 288406 309262 240635 419957 111107 -41892 333374 133668
10324C20048J07743j91432K59722m3368j45382m9504L5357l2749K81632k1034
$$ 320048 427791 236359 496081 452713 307331 257827 293184 260435 542067 521033
10314E21033A53828b1430A45302K55083a9783B7869L69370I6473J88286q2149
$$ 521033 153828 -21430 145302 400385 -19783 27869 397239 96473 284759 202610
10304B02610B6890a51375a4403A34576d7296B50456r8503a49730C9621J45934
$$ 202610 26890 -151375 -14403 134576 -47296 250456 151953 -149730 39621 185555
10294A85555L51937c7005G8988K5379g741o6638C9671J88079c01252B06410C8549
$$ 185555 537492 -37005 78988 104367 -7741 -74379 39671 227750 -301252 206410 38549
10282a11857I511b23005A59337m7225C7302a44236A92552b63346O240A10042l4891
$$ -111857 9511 -223005 159337 112112 37302 -144236 192552 -263346 -257106 110042 75151
10271G5151B6373a28188O2192M389C0642N2229k1355M3048P69a76006M484G4543
$$ 75151 26373 -128188 -65996 -61607 30642 82871 61516 104564 105333 -176006 -171522 74543
10258B42756g9023B3513b11313A81074o9695a04713p1694j1033D4083N9658K3248
$$ 242756 -79023 23513 -211313 181074 111379 -104713 -176407 -187440 44083 103741 126989
10247A26989e3938A3354O5454J29325h5463A36343b81472a5933B3616e46A97304
$$ 126989 -53938 13354 78808 208133 -85463 136343 -281472 -15933 23616 -546 197304
10235a3211A06903a59840B48923C6679J85971J8186J28164e2442C59192q8776
$$ -13211 106903 -159840 248923 36679 222650 240836 369000 -52442 359192 270416
10225B70416j07462j7767k7261a66802M8077A64961I825b88142d6505p876A3570
$$ 270416 162954 145187 117926 -166802 -118725 164961 9825 -288142 -46505 -54381 13570
10213a96681I7089a19939A7365J50760E5162a60569b5217n3847a4535A73151C8181
$$ -196681 97089 -119939 17365 168125 55162 -160569 -25217 -79064 -14535 173151 38181
10201h7374a0027k04853a9712j98823k3307e3065A37230h3607k398o3882C6982
$$ -87374 -10027 -214880 -19712 -218535 -241842 -53065 137230 -83607 -86005 -149887 36982
10189E900g4152D00785d8882E950K0891R2358K36234D1368Q899h1066j05979e2659
$$ 5900 -74152 400785 -48882 5950 26841 119199 355433 41368 50267 -81066 -187045 -52659
10176a0282m7283m951q0534d8530F7862j9961f6183J8867G5758N8317g4644j14654
$$ -10282 -57565 -62516 -143050 -48530 67862 47901 -66183 -47316 75758 134075 -74644 -189298
10164a89298B71601c5559l96677a33719A07164J24045h4542c5901B874M6607c85046
$$ -189298 271601 -35559 -432236 -133719 107164 231209 -84542 -35901 2874 49481 -385046
10152b17318D8632J5985b07198f9293e440C01882j50190M2304C4226b77014G6558
$$ -217318 48632 64617 -207198 -69293 -5440 301882 151692 193996 34226 -277014 76558
10140A06156k3176a87736N7367E4514b05256a5553b557D2233a40395c9171A48625
$$ 106156 82980 -187736 -130369 54514 -205256 -15553 -2557 42233 -140395 -39171 148625
10128b27098k17293f1131j04596O3423a2540o0611k71755a6882A9812b5976n552
$$ -227098 -444391 -61131 -165727 -102304 -12540 -73151 -344906 -16882 19812 -25976 -31528
10117c1528j41266A08665a54498b5867n1771m6524c1763n8991L8127k73099C61240
$$ -31528 -172794 108665 -154498 -25867 -77638 -124162 -31763 -90754 -52627 -325726 361240
10105h4639o5046j3994G299a6118A28998a20898J4506P589r4101m3560d5921j70351
$$ -84639 -149685 -163679 7299 -16118 128998 -120898 -106392 -98803 -192904 -236464 -45921 -216272
10093b16272B63920a56126c2760A78134b46124I3859b64122L0175P8882j15083
$$ -216272 263920 -156126 -32760 178134 -246124 93859 -264122 -233947 -155065 -270148
10083b70148E7875d01344c9266l7424I5487g9477A69825b08910O1388K3520j24967
$$ -270148 57875 -401344 -39266 -76690 95487 -79477 169825 -208910 -147522 -124002 -248969
10072b48969C8241b98983B9562J37112g2144q7002d3240H9674a34929k6158A99685
$$ -248969 38241 -298983 29562 166674 -72144 -159146 -43240 89674 -134929 -161087 199685
10060b7500h080j44522a6590H685g6226b8683A66216a07672C2387a74834L5385
$$ -27500 -8080 -152602 -16590 8685 -76226 -28683 166216 -107672 32387 -174834 -139449
10049a39449E1634b59758A41587c14944Q5721g0974k19131N3189B27139a27230
$$ -139449 51634 -259758 141587 -314944 -229223 -70974 -290105 -236916 227139 -127230
10038b42173M9378A08286K1919N5076a42944j66501I7177Q2815b90260B13711
$$ -242173 -192795 108286 130205 185281 -142944 -309445 97177 179992 -290260 213711
10027b24769c0550k23520c5552j16698F5609J35778C9635a17317j52162A16041
$$ -224769 -30550 -254070 -35552 -152250 65609 201387 39635 -117317 -269479 116041
10016e4781p7355r6289i4424A21487B7616e20177f8869G8305d04895H7032c1339
$$ -54781 -132136 -228425 -94424 121487 27616 -520177 -68869 78305 -404895 87032 -31339
10004B16354g3409k7317C0757a88335j297l9022M5554j29692g3504A28965k6935
$$ 216354 -73409 -100726 30757 -188335 -189632 -228654 -183100 -312792 -73504 128965 102030
9993A02030k8084A8121a05509k37870i4475j59326A09015J2205j0723l0848Q8969
$$ 102030 73946 18121 -105509 -343379 -94475 -253801 109015 121220 110497 79649 168618
9982A68618L2458b63818J9881I0931l3972M9272J3028A6524d3182H3006l5638
$$ 168618 201076 -263818 -243937 90931 56959 106231 119259 16524 -43182 83006 47368
9971D7368J44208i6427L658q1278p2216C4792L06615a41531j1068A0829a2109
$$ 47368 191576 -96427 -92769 -174047 -246263 34792 341407 -141531 -152599 10829 -12109
9959B45103i6037A99836o4531m6924b22479j12478n4045A26150b35266A64227
$$ 245103 -96037 199836 135305 88381 -222479 -334957 -389002 126150 -235266 164227
9948a99007F9185a78418P669k4924n0076c2835E1882r525b35951J5007C08216
$$ -199007 69185 -178418 -170749 -195673 -245749 -32835 51882 42357 -235951 -220944 308216
9936E7077L1517b71034D380J31776b99141G5628b06526C3778a10913D0659J74765
$$ 57077 88594 -271034 4380 136156 -299141 75628 -206526 33778 -110913 40659 215424
9925B15424a60732J7860H5299O3756a13707A04507G599P4978Q5217f9076B2697
$$ 215424 -160732 -142872 85299 149055 -113707 104507 7599 82577 167794 -69076 22697
9913H3135j5144a69836d5673k50102B2291Q5968C1985b5895k04998e623j55716
$$ 83135 67991 -169836 -45673 -295775 22291 108259 31985 -25895 -230893 -5623 -161339
9902a61339C574e7859K167C0068b21201A10058a10573k2908E4254b1053k5120
$$ -161339 3574 -57859 -55692 30068 -221201 110058 -110573 -133481 54254 -21053 -46173
9891d6173j75695A39343e3519j77204C2479d33601J15697P5917A51698a43182
$$ -46173 -221868 139343 -53519 -230723 32479 -433601 -317904 -241987 151698 -143182
9880b15371H8235b41166R3934j24198A46454P7259e15009A45284A740b39816A28604
$$ -215371 88235 -241166 -147232 -271430 146454 223713 -515009 145284 1740 -239816 128604
9868b12333B5136b53221j14611e5811A39316m6698b58333k39743B49005b1106
$$ -212333 25136 -253221 -367832 -55811 139316 92618 -258333 -498076 249005 -21106
9857A57053E5365c87547n045C9053b39302a09249B1765e09612a5454l5990G7228
$$ 157053 55365 -387547 -392592 39053 -239302 -109249 21765 -509612 -15454 -51444 77228
9845F2346J25453n7660a08046j26488a08984j62628b1499j9783m5036A26574e8680
$$ 62346 187799 130139 -108046 -234534 -108984 -271612 -21499 -41282 -86318 126574 -58680
9833a52454L5707B08349E0162a06300j43497f755C43310d1893b0563A35306c12344
$$ -152454 -116747 208349 50162 -106300 -249797 -6755 343310 -41893 -20563 135306 -312344
9821d73809g5568j07075E19381a89597A6954a80798G4204m20g6744l1977o8067
$$ -473809 -75568 -182643 519381 -189597 16954 -180798 74204 73784 -76744 -108721 -176788
9810a76788C5993c82224a45728b5559E720b19447a05480C144L4622b00749A82984
$$ -176788 35993 -382224 -145728 -25559 5720 -219447 -105480 3144 37766 -200749 182984
9798A59875f2662n9377B01756a75660B41805c77694B33646j09954P1575d10069
$$ 159875 -62662 -122039 201756 -175660 241805 -377694 233646 123692 195267 -410069
9787b48372e1536H2257c09733a45450a8545k07521A75804N0547H8046a90054d3853
$$ -248372 -51536 82257 -309733 -145450 -18545 -226066 175804 226351 88046 -190054 -43853
9775B19884q6526E1507c56390A23714b3870l4636A9473c12923J39689f0673D0424
$$ 219884 133358 51507 -356390 123714 -23870 -58506 19473 -312923 -173234 -60673 40424
9763B76936f5245k59671c7196B4328J13499b86092M0645H2548f5259j17947A51456
$$ 276936 -65245 -324916 -37196 24328 137827 -286092 -245447 82548 -65259 -183206 151456
9751a33784e4851A18102A52g0432G6017k7559c38905M4053c840m438G5526b8389
$$ -133784 -54851 118102 152 -70432 76017 48458 -338905 -294852 -3840 -8278 75526 -28389
9738B731b88611Q3247R767D9455b16519A17961i0642a3524j41268d9821A78953
$$ 2731 -288611 -205364 -195597 49455 -216519 117961 -90642 -13524 -154792 -49821 178953
9726D34342a34316L0024C8492J73533a19521H4463K5281f59j38674j05637K1724
$$ 434342 -134316 -104292 38492 212025 -119521 84463 109744 -659 -139333 -244970 -223246
9715b23246F7637b32527d0280b0009p5736c1772j08243r2836j46208a13872M8541
$$ -223246 67637 -232527 -40280 -20009 -95745 -31772 -140015 -232851 -379059 -113872 -65331
9704f5331B7019a34939N7977j5262F0514c4457k2028B17628E3807d2691G7194
$$ -65331 27019 -134939 -76962 -92224 60514 -34457 -56485 217628 53807 -42691 77194
9692a74333q3434M7266A08097c85045a28299I2662b58981m8009b208k14899O1847
$$ -174333 -257767 -210501 108097 -385045 -128299 92662 -258981 -306990 -2208 -217107 -155260
9681a55260B35294A03914k7259C6417c82550a90521p6923a09326j92771F6320
$$ -155260 235294 103914 76655 36417 -382550 -190521 -267444 -109326 -302097 66320
9670c66340a08272K6801A19985L3579a07347l0364j88007B5086O9049f9765n2553
$$ -366340 -108272 -81471 119985 153564 -107347 -137711 -325718 25086 94135 -69765 -122318
9659a22318k50562C00666f0251I0957a8870k68060a36582l8293L6546m0755j11353
$$ -122318 -372880 300666 -60251 90957 -18870 -286930 -136582 -174875 -138329 -179084 -290437
9648b90437q3355d4790J1625A24826C00J52165B2579a12331c9577k0537m1970
$$ -290437 -373792 -44790 -33165 124826 300 152465 22579 -112331 -39577 -60114 -102084
9637a02084D1620a07561A60244a23768A77482d8245j22792p9619J6555j680R4025
$$ -102084 41620 -107561 160244 -123768 177482 -48245 -171037 -250656 -234101 -235781 -141756
9626a41756q2669M6071A39276b06833D8490d1873F4845a54468m4230E9104K35361
$$ -141756 -224425 -178354 139276 -206833 48490 -41873 64845 -154468 -198698 59104 294465
9615B94465f3108a8862B05857b3343l8813j21697B0727a64067f8375A86383B2717
$$ 294465 -63108 -18862 205857 -23343 -62156 -183853 20727 -164067 -68375 186383 22717
9603H9858a49785B51928a39986p0426b2191k85247g0360l36881J48113j02862
$$ 89858 -149785 251928 -139986 -210412 -22191 -307438 -70360 -407241 -259128 -361990
9593c61990C22728b45451J4099E1923K33051B2032R1598J15265a53636L5003e7119
$$ -361990 322728 -245451 -231352 51923 284974 22032 113630 228895 -153636 -118633 -57119
9581a33997k78644C169a29495q8925F4118K7320J5712a19181k7844a3831p9150
$$ -133997 -412641 3169 -129495 -218420 64118 91438 107150 -119181 -147025 -13831 -92981
9570i2981k17443a02683m7501l8622A31331b1606p7331k2874A95144a81220L0128
$$ -92981 -310424 -102683 -150184 -188806 131331 -21606 -98937 -121811 195144 -181220 -151092
9559a51092H1120c32039B11958F7861a34793b60A84532b02817g4608k2575c1312
$$ -151092 81120 -332039 211958 67861 -134793 -260 184532 -202817 -74608 -97183 -31312
9547d1450A81861g7201J6413j60855A15713A7262c66118i5138o4870I182L7711
$$ -41450 181861 -77201 -60788 -221643 115713 17262 -366118 -95138 -160008 9182 46893
9536D6893f5150r5946e8398A47532C5617M6956j9339b90493a11827a2551B30338
$$ 46893 -65150 -161096 -58398 147532 35617 82573 63234 -290493 -111827 -12551 230338
9524b32022i7238l1165B2749a62675M6479J9917A83203q8470c6313A29181b6579
$$ -232022 -97238 -128403 22749 -162675 -116196 -96279 183203 94733 -36313 129181 -26579
9512a46757A11827a56784f0307D9918J26508a59911j7669p0468b9823n6524K9847
$$ -146757 111827 -156784 -60307 49918 176426 -159911 -177580 -248048 -29823 -86347 -56500
9501e6500k75282J13272E3762Q2590a21351A45227c9994A17232Q5964b05128G7376
$$ -56500 -331782 -218510 53762 136352 -121351 145227 -39994 117232 203196 -205128 77376
9489b20905d2025o6531D1226P2128b75523J13704f8324g349m1561B12213b4805
$$ -220905 -42025 -108556 41226 113354 -275523 -161819 -68324 -7349 -48910 212213 -24805
9477A49421b52050D3009a20118j1783j03876K0605i0728l78335R3655B62075d69292
$$ 149421 -252050 43009 -120118 -131901 -235777 -215172 -90728 -469063 -375408 262075 -469292
9465a96169l4452M3517g8261n1854c9000n5229j24081j49110a42540d875B66880
$$ -196169 -230621 -187104 -78261 -130115 -39000 -94229 -218310 -367420 -142540 -4875 266880
9453b1749B24959q3615d5993J688F7228a17721E1360c6455C5377a20037A68943
$$ -21749 224959 141344 -45993 -44305 67228 -117721 51360 -36455 35377 -120037 168943
9441g8258A10016f5351j63806c9146o2903k85015i8615F8809b5733d208A27140
$$ -78258 110016 -65351 -229157 -39146 -102049 -387064 -98615 68809 -25733 -4208 127140
9429a09220p8252L8123e6218j26065I5177b33750a05723P876R655j78009g6552
$$ -109220 -187472 -149349 -56218 -182283 95177 -233750 -105723 -97847 -88192 -266201 -76552
9417a05787C3469i6515k5919K9552A96276G4437K3979c95031i0317m1711j38713
$$ -105787 33469 -96515 -122434 -92882 196276 74437 98416 -395031 -90317 -132028 -270741
9406b70741E2925J95712c53837g0180A61681B5719b57854a10857n2503l02297
$$ -270741 52925 248637 -353837 -70180 161681 25719 -257854 -110857 -163360 -465657
9396d65657i7032C4227b41793L3545J01786j2075A75434i9087j04921C7021L28050
$$ -465657 -97032 34227 -241793 -208248 -106462 -118537 175434 -99087 -204008 37021 365071
9385C65071A8722Q8920J26804A10787g3906j64554B8086f0807H1682B7330a20429
$$ 365071 18722 107642 234446 110787 -73906 -238460 28086 -60807 81682 27330 -120429
9373F9630J44804j7011B4141a30272j50312f6462j46051A22935c24734J49219
$$ 69630 214434 197423 24141 -130272 -280584 -66462 -212513 122935 -324734 -175515
9363a75515B26131b28412J00492B58735a85164f8401k28938B4531b34418A51033
$$ -175515 226131 -228412 -127920 258735 -185164 -68401 -297339 24531 -234418 151033
9352C21401a24465a7390A77123B3071f2167j37242J7960d8465k47716d7061J2910
$$ 321401 -124465 -17390 177123 23071 -62167 -199409 -181449 -48465 -296181 -47061 -34151
9341c4151G0267P0912J05771b46437A42112f7969G8929e6680r380A585J56154
$$ -34151 70267 141179 246950 -246437 142112 -67969 78929 -56680 -66060 1585 157739
9330A57739b45542j8358h0241j79620p0079C0107a26399A09381D9911M2169i5335
$$ 157739 -245542 -263900 -80241 -259861 -329940 30107 -126399 109381 49911 92080 -95335
9318c60403g8960a521A16562b00505A22628L8039i4479j54954h3505m25212a91742
$$ -360403 -78960 -1521 116562 -200505 122628 160667 -94479 -249433 -83505 -508717 -191742
9306A00913c31939G6206a55675k01555J40532B21847a25090A15165a24658m2745
$$ 100913 -331939 76206 -155675 -357230 -216698 221847 -125090 115165 -124658 -167403
9296a67403A7048a88761b9818j3486j28881A33200e5963C22788a48600C4720b29851
$$ -167403 17048 -188761 -29818 -43304 -172185 133200 -55963 322788 -148600 34720 -229851
9284d52436a89190A5636h5684G0809a58513l4375A44976B522J10414a50277A60654
$$ -452436 -189190 15636 -85684 70809 -158513 -192888 144976 2522 112936 -150277 160654
9272b56036A5301d2884G7894a72048e5073A57686a59308d4401D3006L31697A80232
$$ -256036 15301 -42884 77894 -172048 -55073 157686 -159308 -44401 43006 374703 180232
9260f9823r3882Q1273A8303e5170j0647k00001I0883a59131B8126b51427A47284
$$ -69823 -163705 -82432 18303 -55170 -65817 -265818 90883 -159131 28126 -251427 147284
9248a25362f570j44442f8746b3955A8269b4461o5682j35138a3901H473a95006
$$ -125362 -6570 -151012 -68746 -23955 18269 -24461 -90143 -225281 -13901 8473 -195006
9236A57000a3344j35468A67779H2224A4718h6150m6817d6369j2608A9656b79524
$$ 157000 -13344 -148812 167779 82224 14718 -86150 -132967 -46369 -58977 19656 -279524
9224a5133k41113N628J08276E5145b7085J0447k1919r8658o337m765f5196A5869
$$ -15133 -256246 -250618 -142342 55145 -27085 -16638 -38557 -137215 -143552 -148317 -65196 15869
9211a90257m3574c8356p3898B46458a1480C0979h5879r3711a9391r8032C38222
$$ -190257 -233831 -38356 -112254 246458 -11480 30979 -85879 -179590 -19391 -117423 338222
9199b49636O3259B22805b4823n0225I2255J49887b24075g4440C30717i0117j91366
$$ -249636 -186377 222805 -24823 -75048 92255 242142 -224075 -74440 330717 -90117 -281483
9188b81483R708i3241j28624h5811J1322k9012A29253a83011E6814P437K18720
$$ -281483 -271775 -93241 -221865 -85811 -74489 -103501 129253 -183011 56814 64251 282971
9177B82971e122o5259q5477J2010P1018a3189l30438A86773r1579b97572A6732
$$ 282971 -5122 -70381 -155858 -143848 -72830 -13189 -343627 186773 95194 -297572 16732
9165D2026b88907q9947b4345l26926A38211d07864A03555a01972e156l13289A33177
$$ 42026 -288907 -378854 -24345 -351271 138211 -407864 103555 -101972 -5156 -318445 133177
9153a39534C06751G9704b21245j47891J64149m1461f0170A59324a38513E8161
$$ -139534 306751 79704 -221245 -369136 -204987 -246448 -60170 159324 -138513 58161
9142H6372J35480C1081K842M7945a30918d3064A54320b481j33529k09426a59368
$$ 86372 221852 31081 33923 81868 -130918 -43064 154320 -2481 -136010 -345436 -159368
9130b10304a03922q1694I4068L173R5147p5932b8216n1417i958m3355k01299N5186
$$ -210304 -103922 -185616 94068 97241 192388 116456 -28216 -79633 -9958 -53313 -254612 -199426
9118a99426a4207C494g5392J1123k93782C88270D1197c20644a53758C6917a71168
$$ -199426 -14207 3494 -75392 -64269 -358051 388270 41197 -320644 -153758 36917 -171168
9106c15407Q0273N618d4530I6917o371f2373k40997A48177b50987J757k0089B32109
$$ -315407 -235134 -229516 -44530 96917 90546 -62373 -303370 148177 -250987 -249230 -269319 232109
9093A89637a87516O5024E4313b15783G1821a35963K5767j31508B9107j2102a20656
$$ 189637 -187516 -122492 54313 -215783 71821 -135963 -110196 -241704 29107 17005 -120656
9081c47333A21158d25167A06a27551p5893R4932c8725Q782j40351N9737j30558
$$ -347333 121158 -425167 106 -127551 -203444 -108512 -38725 -29943 -170294 -110557 -241115
9070b41115o9577a51652j23907B28927b8673j94006E2036a59963B10040a2939
$$ -241115 -310692 -151652 -275559 228927 -28673 -222679 52036 -159963 210040 -12939
9059b1223E5902d7237B11588N2564I2014a65565O6011j33962B44540P3002a32123
$$ -21223 55902 -47237 211588 264152 92014 -165565 -99554 -233516 244540 317542 -132123
9047a41745p2195E4898b71480B7240b06405j38981h8044K0708B94041k1063A09558
$$ -141745 -213940 54898 -271480 27240 -206405 -345386 -88044 -67336 294041 272978 109558
9035a82774j00495J35851O9526r2868A45255f4716r8555N3053d5907a5930j62137
$$ -182774 -283269 -147418 -77892 -170760 145255 -64716 -163271 -110218 -45907 -15930 -178067
9024a78067M2453k5586j84268D3725R4613b14280Q6845A9585a20081B05724q3800
$$ -178067 -135614 -161200 -345468 43725 138338 -214280 -127435 19585 -120081 205724 121924
9013A21924d7749a6751B13964j06731a48406e2020j36724a5265k68996A56211
$$ 121924 -47749 -16751 213964 107233 -148406 -52020 -188744 -15265 -284261 156211
9002A40534d16780B17475b20116J6760B8057a34195B69725a48427j6060A9404
$$ 140534 -416780 217475 -220116 -203356 28057 -134195 269725 -148427 -164487 19404
8991b66247h5178m1448D32377A97610I187M6489l627c36680h4179C4429b41954
$$ -266247 -85178 -126626 432377 197610 9187 55676 52049 -336680 -84179 34429 -241954
8979A8644a29637c737F4422L09117b9557j18823D9183J5239c4414k57330h2857
$$ 18644 -129637 -3737 64422 373539 -29557 -148380 49183 64422 -34414 -291744 -82857
8967a31531A61729b6605B90651a20593I2059l0886h1273A2529d43700A5544a10556
$$ -131531 161729 -26605 290651 -120593 92059 61173 -81273 12529 -443700 15544 -110556
8955B8802J31161b3656G0995c56693J54596e2835m2883A3336d7607p328m4781
$$ 28802 159963 -23656 70995 -356693 -202097 -52835 -95718 13336 -47607 -54935 -99716
8944i9716C21841a62565J0021R965b6636o3260K7451p7424F4965a12375A08067
$$ -99716 321841 -162565 -152544 -142579 -26636 -89896 -62445 -139869 64965 -112375 108067
8932a19298B75045j32943d52860J83489D2301c80018e3485A75122R3581a9522
$$ -119298 275045 142102 -452860 -269371 42301 -380018 -53485 175122 268703 -19522
8921C0474L38150f4557a5474A33803L4380f716H506c59361a18568a478A02085
$$ 30474 368624 -64557 -15474 133803 168183 -6716 8506 -359361 -118568 -1478 102085
8909b62711c6546F0834h6072J7837K6484r3345j05812I4064J17568B2966A0120
$$ -262711 -36546 60834 -86072 -68235 -41751 -135096 -240908 94064 211632 22966 10120
8897d10975a14259A73403l214Q1049a15731A33918b82532J10754D5320J46112
$$ -410975 -114259 173403 170189 251238 -115731 133918 -282532 -171778 45320 191432
8887A91432k8206A3620R9395c25431B02387a60627R875f9849j5961p7329c6947
$$ 191432 163226 13620 113015 -325431 202387 -160627 -150752 -69849 -85810 -163139 -36947
8875d1062m009j13532d7346A18153A4657c16959J36571a282l26797a10874l21451
$$ -41062 -45071 -158603 -47346 118153 14657 -316959 -180388 -1282 -328079 -110874 -432325
8864d32325G7842Q6860K2590q0698a30906k68362J70418N7586A1653J18642R4956
$$ -432325 77842 164702 187292 106594 -130906 -399268 -228850 -171264 11653 130295 225251
8853B25251a18466o3476B3196a66945c4459E6777K57738A28547C3J96266R078
$$ 225251 -118466 -181942 23196 -166945 -34459 56777 314515 128547 33 196299 205377
8842B05377a45736r4016a15020L6222k06572a40058B22599G7294d34159d9355
$$ 205377 -145736 -239752 -115020 -78798 -285370 -140058 222599 77294 -434159 -49355
$$ [...]
##END NTUPLES=NMR SPECTRUM
##END=
