##TITLE=AC1569_ROEFFECT0021_8271072_0DjOt5wei0
##JCAMPDX= 6.0         $$ Bruker NMR JCAMP-DX V2.0
##DATA TYPE= NMR SPECTRUM
##DATA CLASS= NTUPLES
##ORIGIN= BRUKER
##OWNER= Administrator
$$ 1.72 TOPSPIN		Version 2.1
$$ 2014-08-04 15:14:26.203 -0700  Administrator@X
$$ Compression mode = diff/dup
##.OBSERVE FREQUENCY= 400.02188249412
##.OBSERVE NUCLEUS= ^1H
##.ACQUISITION MODE= SIMULTANEOUS (DQD)
##.ACQUISITION SCHEME= undefined
##.AVERAGES= 64
##.DIGITISER RES= 22
##SPECTROMETER/DATA SYSTEM= spect
##.PULSE SEQUENCE= noesygpps1d.comp
##.SOLVENT NAME= COFFEE_meoh
##.SHIFT REFERENCE= INTERNAL, COFFEE_meoh, 1, 14.97804
##AUDIT TRAIL= $$ (NUMBER, WHEN, WHO, WHERE, PROCESS, VERSION, WHAT)
$$ ##TITLE= Audit trail, TOPSPIN		Version 2.1
$$ ##JCAMPDX= 5.01
$$ ##ORIGIN= Bruker BioSpin GmbH
$$ ##OWNER= Administrator
$$ $$ E:\/data/COFFEE/nmr/AC1569_ROEFFECT0021_8271072_0DjOt5wei0/22/pdata/1/auditp.txt
$$ ##AUDIT TRAIL=  $$ (NUMBER, WHEN, WHO, WHERE, PROCESS, VERSION, WHAT)
(   1,<2014-08-04 15:14:20.036 -0700>,<Administrator>,<X>,<go>,<TOPSPIN 2.1>,
      <created by zg
	started at 2014-08-04 15:02:47.589 -0700,
	POWCHK enabled, PULCHK disabled,
       configuration hash MD5:
       16 EA D6 F4 BB 67 03 14 9B FF E7 A0 43 5B 48 2E
       data hash MD5: 64K
       D2 81 85 86 EF EB 1A C8 82 A9 A6 C5 EB 83 88 21>)
(   2,<2014-08-04 15:14:23.832 -0700>,<Administrator>,<X>,<proc1d>,<TOPSPIN 2.1>,
      <Start of raw data processing
       efp LB = 0.3 FT_mod = 6 PKNL = 1 PHC0 = 0 PHC1 = 0 SI = 128K 
       data hash MD5: 128K
       A2 45 5C 2B 03 15 7B DA D6 62 1B 00 14 38 BB 52>)
(   3,<2014-08-04 15:14:24.999 -0700>,<Administrator>,<X>,<proc1d>,<TOPSPIN 2.1>,
      <pk PHC0 = -87.66541 PHC1 = 0 
       data hash MD5: 128K
       70 7C 91 0E 11 B8 5A 92 CA FB 3C CC 4C 9C D5 91>)
(   4,<2014-08-04 15:14:25.518 -0700>,<Administrator>,<X>,<proc1d>,<TOPSPIN 2.1>,
      <abs ABSG = 1 
       data hash MD5: 128K
       5D 91 42 85 BA 61 64 17 89 4C E1 B9 97 DB 67 66>)
(   5,<2014-08-04 15:14:25.629 -0700>,<Administrator>,<X>,<proc1d>,<TOPSPIN 2.1>,
      <abs ABSG = 2 
       data hash MD5: 128K
       CA 91 E3 48 55 6D 7E BA 5F 1B 42 87 38 7B 78 08>)
(   6,<2014-08-04 15:14:25.740 -0700>,<Administrator>,<X>,<proc1d>,<TOPSPIN 2.1>,
      <abs ABSG = 3 
       data hash MD5: 128K
       6C 75 9B 37 CC 40 74 73 05 16 B2 BA DC FD F2 10>)
(   7,<2014-08-04 15:14:25.851 -0700>,<Administrator>,<X>,<proc1d>,<TOPSPIN 2.1>,
      <abs ABSG = 4 
       data hash MD5: 128K
       BA 71 0A B1 45 72 88 DE 8F E5 0C FD E5 30 6B F8>)
(   8,<2014-08-04 15:14:25.963 -0700>,<Administrator>,<X>,<proc1d>,<TOPSPIN 2.1>,
      <abs ABSG = 5 
       data hash MD5: 128K
       C9 8E AE 1C 2C 7A AB 57 6E 50 5F 4F 97 A4 DF 8D>)
$$ ##END=
$$ 
$$ $$ hash MD5
$$ $$ 6F 4F FC 78 27 C2 44 FE 22 6A E9 70 85 4A 1A 5C
##$RELAX= 
##$RELAX= 
##$RELAX= 
##$RELAX= 
##$RELAX= 
##$RELAX= 
##$RELAX= 
##$RELAX= 
$$ Bruker specific parameters
$$ --------------------------
##$DU= <E:\>
##$EXPNO= 22
$$ [...]
##$TP07= 0
##$TPNAME0= <>
##$TPNAME1= <>
##$TPNAME2= <>
##$TPNAME3= <>
##$TPNAME4= <>
##$TPNAME5= <>
##$TPNAME6= <>
##$TPNAME7= <>
##$TPOAL= (0..7)
0.5 0.5 0.5 0.5 0.5 0.5 0.5 0.5
##$TPOFFS= (0..7)
0 0 0 0 0 0 0 0
##$TUNHIN= 0
##$TUNHOUT= 0
##$TUNXOUT= 0
##$USERA1= <user>
##$USERA2= <user>
##$USERA3= <user>
##$USERA4= <user>
##$USERA5= <user>
##$V9= 5
##$VALIST= <valist>
##$VCLIST= <CCCCCCCCCCCCCCC>
##$VD= 0
##$VDLIST= <DDDDDDDDDDDDDDD>
##$VPLIST= <PPPPPPPPPPPPPPP>
##$VTLIST= <TTTTTTTTTTTTTTT>
##$WBST= 1024
##$WBSW= 4
##$XGAIN= (0..3)
0 0 0 0
##$XL= 0
##$YL= 0
##$YMAX_a= 13631769
##$YMIN_a= -14784599
##$ZGOPTNS= <>
##$ZL1= 120
##$ZL2= 120
##$ZL3= 120
##$ZL4= 120
##$ABSF1= 14.97804
##$ABSF2= -5.580142
##$ABSG= 5
##$ABSL= 3
##$ALPHA= 0
##$AQORDER= 0
##$ASSFAC= 0
##$ASSFACI= 0
##$ASSFACX= 0
##$ASSWID= 0
##$AUNMP= <proc_prof1d_extract.lims>
##$AXLEFT= 0
##$AXNAME= <>
##$AXNUC= <1H>
##$AXRIGHT= 0
##$AXTYPE= 0
##$AXUNIT= <>
##$AZFE= 0.1
##$AZFW= 0.1
##$BCFW= 0
##$BC_mod= 0
##$BYTORDP= 0
##$COROFFS= 0
##$CY= 15
##$DATMOD= 1
##$DC= 0
##$DFILT= <>
##$DTYPP= 0
##$F1P= 0
##$F2P= 0
##$FCOR= 0.5
##$FTSIZE= 131072
##$FT_mod= 6
##$GAMMA= 0
##$GB= 0
##$INTBC= 1
##$INTSCL= 1
##$ISEN= 128
##$LB= 0.3
##$LEV0= 0
##$LPBIN= 0
##$MAXI= 10000
##$MC2= 0
##$MEAN= 0
##$ME_mod= 0
##$MI= 0
##$NCOEF= 0
##$NC_proc= 0
##$NLEV= 6
##$NOISF1= 0
##$NOISF2= 0
##$NSP= 0
##$NTH_PI= 0
##$NZP= 0
##$OFFSET= 14.97804
##$PC= 1
##$PHC0= -87.66541
##$PHC1= 0
##$PH_mod= 1
##$PKNL= yes
##$PPARMOD= 0
##$PPDIAG= 0
##$PPIPTYP= 0
##$PPMPNUM= 2147483647
##$PPRESOL= 1
##$PSCAL= 4
##$PSIGN= 0
##$PYNMP= <proc.py>
##$REVERSE= no
##$SF= 400.020002820923
##$SI= 131072
##$SIGF1= 0
##$SIGF2= 0
##$SINO= 400
##$SIOLD= 131072
##$SPECTYP= <>
##$SREGLST= <1H.CDCl3>
##$SSB= 0
##$STSI= 131072
##$STSR= 0
##$SW_p= 8223.68421052631
##$SYMM= 0
##$S_DEV= 0
##$TDeff= 65536
##$TDoff= 0
##$TI= <>
##$TILT= no
##$TM1= 0
##$TM2= 0
##$TOPLEV= 0
##$USERP1= <user>
##$USERP2= <user>
##$USERP3= <user>
##$USERP4= <user>
##$USERP5= <user>
##$WDW= 1
##$XDIM= 131072
##$YMAX_p= 88854693
##$YMIN_p= -357488912
##$CURPLOT= <Network HP LaserJet P1505>
##$CURPRIN= <$Network HP LaserJet P1505>
##$DFORMAT= <normdp>
##$LAYOUT= <+/1D_H.xwp>
##$LFORMAT= <normlp>
##$PFORMAT= <normpl>
##$SURQMSG= 1
$$ End of Bruker specific parameters
$$ ---------------------------------
##NTUPLES= NMR SPECTRUM
##VAR_NAME=  FREQUENCY,     SPECTRUM/REAL,   SPECTRUM/IMAG
##SYMBOL=    X,             R,               I
##VAR_TYPE=  INDEPENDENT,   DEPENDENT,       DEPENDENT
##VAR_FORM=  AFFN,          ASDF,            ASDF
##VAR_DIM=   131072,        131072,          131072
##UNITS=     HZ,            ARBITRARY UNITS, ARBITRARY UNITS
##FACTOR=    0.0627417313425164, 1,          1
##FIRST=     8223.62146879497, 442,          -6461
##LAST=      0,             605,             -6344
##MIN=       0,             -357488912,      0
##MAX=       8223.62146879497, 88854693,     0
$$ Real data points
##PAGE= N=1
##DATA TABLE= (X++(R..R)), XYDATA
$$ [...]
$$ plain form
63225 134977 134528 134345 134106 133347 131595 128695 124992 121022 117096 113309 109844 106977 104793 103112 101715
63210 101715 100479 99326 98242 97383 96933 96810 96675 96279 95653 94959 94312 93798 93479 93311 93196 93123 93168 93306
63192 93306 93374 93251 92954 92559 92150 91841 91701 91644 91559 91475 91485 91488 91261 90797 90364 90161 90084 89913 89599 89270 89085 89137
63170 89137 89394 89685 89831 89843 89907 90137 90459 90766 91063 91417 91862 92387 92920 93314 93470 93508 93719 94273 95040 95730
63150 95730 96140 96305 96458 96868 97643 98712 99999 101523 103247 104983 106621 108354 110486 113067 115894 118834
63134 118834 121932 125209 128612 132208 136242 140906 146173 151867 157783 163742 169671 175678 181880 188167
63120 188167 194262 200013 205492 210828 216093 221345 226628 231930 237277 242831 248724 254819 260807 266495
63106 266495 271772 276355 279815 281896 282564 281728 279203 275003 269425 262756 255152 246872 238393 230110 222140
$$ packed form
63225A34977m49j83k39p59j752k900l703l970l926l787l465k867k184j681j397
63210A01715j236j153j084q59m50j23j35l96o26o94o47n14l19j68j15p3M5J38
63192I3306O8j23k97l95m09l09j40n7q5q4J0Lk27m64m33k03p7j71l14l29j85N2
63170H9137K57K91J46J2O4K30L22L07K97L54M45N25N33L94J56L8K11N54P67O90
63150I5730M10J65J53M10P75J069J287J524J724J736J638J733K132K581K827K940
63134A18834L098L277L403L596M034M664N267N694N916N959N929O007O202O287
63120A88167O095N751N479N336N265N252N283N302N347N554N893O095N988N688
63106B66495N277M583L460K081O68q36k525m200n578o669p604q280q479q283p970
$$ plain form
63091 222140 214529 207472 201170 195644 190861 186901 183870 181743 180425 179869 180039 180874 182323 184339 186788
63076 186788 189502 192491 195924 199856 204116 208535 213106 217809 222499 227086 231662 236307 240886 245181
63062 245181 249120 252755 256080 258984 261299 262808 263308 262721 261078 258378 254596 249850 244374 238274 231483
63047 231483 224067 216366 208742 201352 194321 187907 182310 177432 173046 169109 165761 163082 161010 159428
63033 159428 158207 157186 156261 155460 154839 154359 153899 153365 152714 151962 151248 150769 150590 150572 150564 150563 150634 150781 150984 151234
63013 151234 151445 151449 151173 150758 150418 150234 150162 150136 150079 149905 149603 149229 148800 148264 147655 147114 146704 146333 145940 145628
62993 145628 145533 145658 145913 146205 146417 146443 146345 146341 146534 146796 147030 147374 148020 148944 149940 150835 151540 152053 152541 153302
62973 153302 154474 155865 157206 158469 159836 161426 163254 165301 167527 169862 172331 175111 178322 181882
$$ packed form
63091B22140p611p057o302n526m783l960l031k127j318n56J70Q35J449K016K449
63076A86788K714K989L433L932M260M419M571M703M690M587M576M645M579M295
63062B45181L939L635L325K904K315J509N00n87j643k700l782m746n476o100o791
63047B31483p416p701p624p390p031o414n597m878m386l937l348k679k072j582
63033A59428j221j021r25q01o21m80m60n34o51p52p14m79j79j8qjP1J47K03K50
63013A51234K11Mk76m15l40j84p2k6n7j74l02l74m29n36o09n41m10l71l93l12
62993A45628r5J25K55K92K12K6r8mJ93K62K34L44O46R24R96Q95P05N13M88P61
62973A53302J172J391J341J263J367J590J828K047K226K335K469K780L211L560
$$ plain form
62959 181882 185685 189794 194308 199128 204103 209342 215153 221699 228875 236546 244747 253638 263347 273870
62945 273870 285059 296715 308774 321317 334354 347709 361186 374751 388381 401856 414884
62934 414884 427406 439638 451855 464237 476864 489664 502402 514840 526860 538306 548763
62923 548763 557657 564562 569238 571438 570877 567430 561177 552189 540461 526156 509801 492101 473623
62910 473623 454722 435774 417335 400048 384380 370485 358309 347824 339101 332213 327121 323698
62898 323698 321775 321179 321801 323689 326967 331608 337342 343807 350747 358061 365772 373982 382732 391812 400797
62883 400797 409368 417538 425514 433429 441217 448647 455356 460927 465036 467512 468234 467041 463785 458377
62869 458377 450788 441126 429722 417030 403335 388718 373324 357536 341815 326514 311931 298325
$$ packed form
62959A81882L803M109M514M820M975N239N811O546P176P671Q201Q891R709J0523
62945B73870J1189J1656J2059J2543J3037J3355J3477J3565J3630J3475J3028
62934D14884J2522J2232J2217J2382J2627J2800J2738J2438J2020J1446J0457
62923E48763Q894O905M676K200n61l447o253q988j1728j4305j6355j7700j8478
62910D73623j8901j8948j8439j7287j5668j3895j2176j0485q723o888n092l423
62898C23698j923n96O22J888L278M641N734O465O940P314P711Q210Q750R080Q985
62883D00797Q571Q170P976P915P788P430O709N571M109K476P22j193l256n408
62869D58377p589r662j1404j2692j3695j4617j5394j5788j5721j5301j4583j3606
$$ plain form
62857 298325 285784 274197 263504 253806 245120 237182 229675 222537 215881 209729 203988 198629 193709
62844 193709 189250 185205 181508 178059 174752 171617 168838 166531 164583 162801 161118 159567 158182 157028
62830 157028 156228 155823 155712 155783 155968 156135 156132 156053 156203 156638 156956 156761 156123 155358 154555 153635 152691 151941 151391 150864
62810 150864 150289 149717 149115 148426 147770 147307 146918 146328 145519 144720 143987 143112 141987 140782 139690 138736 137914 137298
62792 137298 136918 136712 136706 137010 137557 138022 138137 137986 137853 137894 138031 138133 138166 138192 138247 138256 138117 137880 137742 137809 137967 138070
62770 138070 138153 138319 138548 138731 138834 138870 138815 138710 138747 139038 139411 139637 139772 140050 140493 140918 141242 141547 141821 141966
62750 141966 142076 142415 143016 143584 143895 144084 144373 144712 144857 144700 144386 144146 144108 144213 144276 144159 143893 143607 143362
62731 143362 143170 143100 143240 143576 144016 144527 145101 145657 146101 146473 146852 147195 147429 147651 148045 148618 149208 149744 150289
$$ packed form
62857B98325j2541j1587j0693r698q686p938p507p138o656o152n741n359m920
62844A93709m459m045l697l449l307l135k779k307j948j782j683j551j385j154
62830A57028q00m05j11P1J85J67lp9J50M35L18j95o38p65q03r20r44p50n50n27
62810A50864n75n72o02o89o56m63l89n90q09p99p33q75j125j205j092r54q22o16
62792A37298l80k06oL04N47M65J15j51j33M1J37J02L3K6N5Rj39k37j38O7J58J03
62770A38070Q3J66K29J83J03L6n5j05L7K91L73K26J35K78M43M25L24L05K74J45
62750A41966J10L39O01N68L11J89K89L39J45j57l14k40l8J05O3j17k66k86k45
62731A43362j92p0J40L36M40N11N74N56M44L72L79L43K34K22L94N73N90N36N45
$$ plain form
62712 150289 150849 151373 151939 152719 153713 154729 155691 156741 157979 159300 160567 161770 162951 164123 165381 166938
62696 166938 168939 171370 174196 177474 181266 185532 190189 195164 200386 205814 211543 217751 224527 231857
62682 231857 239763 248357 257751 268053 279410 291954 305708 320712 337188 355383 375245 396412
62670 396412 418526 441311 464333 486902 508304 527970 545378 559966 571251 578917 582747 582619
62658 582619 578582 570825 559558 545085 527986 509046 488944 468140 447011 425884 404957 384399
62646 384399 364556 345833 328352 311973 296684 282716 270194 258929 248668 239352 230984 223459
62634 223459 216642 210479 204958 200075 195907 192531 189822 187506 185460 183747 182320 180946 179531 178251
62620 178251 177278 176579 176084 175841 175864 176065 176457 177235 178499 180117 181975 184143 186675 189457 192433 195775
$$ packed form
62712A50289N60N24N66P80R94J016R62J050J238J321J267J203J181J172J258J557
62696A66938K001K431K826L278L792M266M657M975N222N428N729O208O776P330
62682B31857P906Q594R394J0302J1357J2544J3754J5004J6476J8195J9862K1167
62670C96412K2114K2785K3022K2569K1402J9666J7408J4588J1285P666L830j28
62658E82619m037p757j1267j4473j7099j8940k0102k0804k1129k1127k0927k0558
62646C84399j9843j8723j7481j6379j5289j3968j2522j1265j0261r316q368p525
62634B23459o817o163n521m883m168l376k709k316k046j713j427j374j415j280
62620A78251r73o99m95k43K3K01L92P78J264J618J858K168K532K782K976L342
$$ plain form
62604 195775 199634 203957 208749 214307 220951 228658 237195 246481 256652 267861 280221 293804 308535
62591 308535 324147 340410 357252 374501 391666 408157 423580 437625 449765 459342 465908 469306
62579 469306 469498 466536 460631 452083 441139 428065 413309 397437 380914 364079 347280 330902
62567 330902 315257 300543 286858 274162 262309 251209 240913 231488 222891 215077 208093 201950
62555 201950 196494 191513 186910 182673 178778 175226 172077 169366 167054 165135 163622 162389 161190 159950
62541 159950 158859 158028 157224 156145 154776 153301 151830 150436 149313 148615 148223 147900 147588 147359 147145 146775
62525 146775 146265 145802 145490 145272 145086 144895 144591 144082 143467 142947 142558 142187 141828 141639 141714 141978 142336 142786 143367
62506 143367 144131 145181 146618 148407 150411 152586 155033 157876 161165 164880 168957 173329 178059 183364
$$ packed form
62604A95775L859M323M792N558O644P707Q537R286J0171J1209J2360J3583J4731
62591C08535J5612J6263J6842J7249J7165J6491J5423J4045J2140R577O566L398
62579D69306J92k962n905q548j0944j3074j4756j5872j6523j6835j6799j6378
62567C30902j5645j4714j3685j2696j1853j1100j0296r425q597p814o984o143
62555B01950n456m981m603m237l895l552l149k711k312j919j513j233j199j240
62541A59950j091q31q04j079j369j475j471j394j123o98l92l23l12k29k14l70
62525A46775n10m63l12k18j86j91l04n09o15n20l89l71l59j89P5K64L58M50N81
62506A43367P64J050J437J789K004K175K447K843L289L715M077M372M730N305
$$ plain form
62492 183364 189449 196345 204028 212567 222019 232248 243040 254283 265827 277207 287756 297034 304918
62479 304918 311254 315673 317869 317865 315872 312056 306568 299701 291824 283184 273872 263986 253757 243525
62465 243525 233629 224304 215636 207588 200070 193005 186397 180353 174990 170275 165999 161989 158301 155105
62451 155105 152414 150036 147811 145771 144005 142445 140906 139347 137974 137015 136410 135847 135070 134082 132989
62436 132989 131807 130581 129548 128989 128925 129138 129473 129930 130497 131120 131871 132892 134121 135292 136322 137463
62420 137463 138963 140834 143095 145981 149646 153868 158355 163190 168722 175095 182148 189756 197949 206688
62406 206688 215758 224969 234273 243620 252816 261544 269439 276127 281271 284651 286153 285760 283583 279874
62392 279874 274924 269004 262386 255308 247821 239856 231535 223303 215590 208463 201718 195185 188785 182427
$$ packed form
62492A83364O085O896P683Q539R452J0229J0792J1243J1544J1380J0549R278P884
62479C04918O336M419K196mj993l816n488o867p877q640r312r886j0229j0232
62465B43525r896r325q668q048p518p065o608o044n363m715m276m010l688l196
62451A55105k691k378k225k040j766j560j539j559j373r59o05n63p77r88j093
62436A32989j182j226j033n59o4K13L35M57N67O23P51J021J229J171J030J141
62420A37463J500J871K261K886L665M222M487M835N532O373P053P608Q193Q739
62406B06688R070R211R304R347R196Q728P895O688N144L380J502l93k177l709
62392B79874m950n920o618p078p487p965q321q232p713p127o745o533o400o358
$$ plain form
62378 182427 176124 170135 164789 160184 156198 152734 149767 147214 144946 142922 141163 139606 138147 136792
62364 136792 135634 134689 133867 133083 132283 131436 130599 129941 129546 129290 129039 128865 128935 129265 129806 130602 131673 132813
62346 132813 133788 134686 135809 137215 138621 139794 140805 141839 142932 143968 144791 145288 145466 145425 145139 144349
62330 144349 142843 140817 138718 136762 134826 132810 130819 128959 127189 125492 123965 122669 121529 120493
62316 120493 119609 118876 118167 117430 116784 116363 116165 116146 116328 116718 117232 117795 118426 119134 119813 120353 120810 121376 122206
62297 122206 123288 124496 125714 126913 128120 129340 130582 131929 133507 135311 137161 138895 140514 142064
62283 142064 143483 144700 145787 146853 147881 148784 149542 150153 150561 150805 151174 151980 153247 154809 156648 158911
62267 158911 161638 164740 168251 172389 177315 183010 189417 196545 204396 212988 222420 232711 243538 254351
$$ packed form
62378A82427o303n989n346m605l986l464k967k553k268k024j759j557j459j355
62364A36792j158r45q22p84q00q47q37o58l95k56k51j74P0L30N41P96J071J140
62346A32813R75Q98J123J406J406J173J011J034J093J036Q23M97J78m1k86p90
62330A44349j506k026k099j956j936k016j991j860j770j697j527j296j140j036
62316A20493q84p33p09p37o46m21j98j9J82L90N14N63O31P08O79N40M57N66Q30
62297A22206J082J208J218J199J207J220J242J347J578J804J850J734J619J550
62283A42064J419J217J087J066J028R03P58O11M08K44L69Q06J267J562J839K263
62267A58911K727L102L511M138M926N695O407P128P851Q592R432J0291J0827J0813
$$ plain form
62253 254351 264769 274689 283964 292208 299002 304164 307751 309979 311190 311724 311686 310893 309086 306096 301842
62238 301842 296318 289660 282148 274097 265846 257755 250063 242757 235750 229151 223159 217733 212579 207482
62224 207482 202419 197368 192268 187233 182560 178390 174576 170976 167699 164911 162599 160614 158861 157328
62210 157328 156091 155347 155342 156115 157412 158923 160550 162405 164665 167427 170632 174128 177867 182005 186645
62195 186645 191548 196295 200729 204984 209100 212842 215988 218525 220469 221710 222167 221931 221121 219747 217806
62180 217806 215376 212518 209246 205676 202059 198576 195249 192111 189319 187004 185187 183916 183318 183435 184171
62165 184171 185545 187800 191136 195456 200544 206380 213129 220910 229703 239365 249599 259960 270041
62152 270041 279633 288607 296706 303513 308624 311834 313216 313058 311643 309075 305349 300553 294835 288214
$$ packed form
62253B54351J0418R920R275Q244O794N162L587K228J211N34l8p93j807k990m254
62238C01842n524o658p512q051q251q091p692p306p007o599n992n426n154n097
62224B07482n063n051n100n035m673m170l814l600l277k788k312j985j753j533
62210A57328j237p44nP73J297J511J627J855K260K762L205L496L739M138M640
62195A86645M903M747M434M255M116L742L146K537J944J241M57k36q10j374j941
62180B17806k430k858l272l570l617l483l327l138k792k315j817j271n98J17P36
62165A84171J374K255L336M320N088N836O749P781Q793R662J0234J0361J0081
62152B70041R592Q974Q099O807N111L210J382j58j415k568l726m796n718o621
$$ plain form
62138 288214 280569 271893 262417 252460 242299 232240 222657 213889 206136 199462 193790 188879 184486 180562
62124 180562 177188 174332 171827 169577 167601 165871 164282 162791 161396 159970 158375 156725 155318 154260
62110 154260 153404 152709 152369 152479 152811 153072 153193 153273 153444 153867 154644 155637 156573 157420 158426 159708 161072 162366
62092 162366 163722 165285 166981 168711 170530 172467 174384 176216 178110 180099 181894 183217 184141 184881 185449
62077 185449 185762 185926 186143 186533 187265 188670 190951 193920 197333 201326 206265 212228 218942 226114 233553
62062 233553 240979 248015 254362 259793 264028 266818 268177 268370 267694 266406 264736 262745 260202 256811 252544
62047 252544 247630 242285 236649 230899 225252 219857 214865 210523 207037 204357 202267 200659 199574 199000
62033 199000 198758 198610 198400 198112 197900 197986 198439 199134 200007 201202 202877 204973 207366 210137 213526 217685 222578
$$ packed form
62138B88214p645q676r476r957j0161j0059r583q768p753o674n672m911m393l924
62124A80562l374k856k505k250j976j730j589j491j395j426j595j650j407j058
62110A54260q56o95l40J10L32K61J21Q0J71M23P77R93R36Q47J006J282J364J294
62092A62366J356J563J696J730J819J937J917J832J894J989J795J323R24P40N68
62077A85449L13J64K17L90P32J405K281K969L413L993M939N963O714P172P439
62062B33553P426P036O347N431M235K790J359J93o76j288j670j991k543l391m267
62047B52544m914n345n636n750n647n395m992m342l486k680k090j608j085n74
62033A99000k42j48k10k88k12Q6M53O95Q73J195J675K096K393K771L389M159M893
$$ plain form
62016 222578 228013 233641 239023 243868 248164 252016 255464 258531 261227 263361 264503 264360 263030 260774
62002 260774 257740 254140 250510 247456 245235 243785 243059 243006 243336 243655 243848 244131 244739 245762 247273 249336
61986 249336 251851 254569 257279 259895 262376 264740 267083 269436 271667 273711 275813 278339 281443 285111
61972 285111 289396 294361 299812 305380 310862 316301 321724 327023 332065 336682 340560 343370 345016 345539
61958 345539 344816 342625 339056 334615 329865 325129 320555 316270 312353 308808 305627 302765 300088 297473
61944 297473 294975 292706 290544 288181 285445 282422 279173 275535 271268 266281 260647 254516 248056 241415
61930 241415 234698 228027 221579 215474 209645 203943 198339 192934 187813 183007 178550 174419 170506 166761
61916 166761 163327 160387 157939 155860 154120 152761 151724 150889 150266 149932 149860 149985 150399 151287 152662 154354
$$ packed form
62016B22578N435N628N382M845M296L852L448L067K696K134J142j43j330k256
62002B60774l034l600l630l054k221j450p26n3L30L19J93K83O08J023J511K063
61986B49336K515K718K710K616K481K364K343K353K231K044K102K526L104L668
61972B85111M285M965N451N568N482N439N423N299N042M617L878K810J646N23
61958C45539p23k191l569m441m750m736m574m285l917l545l181k862k677k615
61944B97473k498k269k162k363k736l023l249l638m267m987n634o131o460o641
61930B41415o717o671o448o105n829n702n604n405n121m806m457m131l913l745
61916A66761l434k940k448k079j740j359j037q35o23l34p2J25M14Q88J375J692
$$ plain form
61900 154354 156203 158107 159915 161489 162863 164131 165223 165962 166346 166522 166519 166212 165587 164801 163931 162880 161575
61883 161575 160090 158549 157048 155723 154693 153892 153091 152128 151004 149798 148617 147609 146848 146195 145461 144628
61867 144628 143787 142908 141933 141052 140614 140691 140968 141139 141221 141435 141927 142671 143463 144017 144207 144266 144597 145377 146516
61848 146516 147939 149691 151739 153941 156271 158890 161929 165381 169235 173540 178248 183188 188216 193276
61834 193276 198268 203045 207581 211966 216222 220259 223996 227355 230151 232194 233486 234137 234104 233261 231727
61819 231727 229868 227957 226090 224459 223423 223215 223829 225284 227720 231138 235293 239950 245035 250423 255784
61804 255784 260773 265158 268687 271069 272210 272278 271402 269528 266679 263150 259270 255181 250936 246652 242375
61789 242375 238020 233627 229478 225772 222345 218880 215284 211662 208084 204578 201260 198273 195642 193350
$$ packed form
61900A54354J849J904J808J574J374J268J092P39L84J76ll07o25p86q70j051j305
61883A61575j485j541j501j325j030q01q01r63j124j206j181j008p61o53p34q33
61867A44628q41q79r75q81m38P7K77J71Q2K14M92P44P92N54J90N9L31P80J139
61848A46516J423J752K048K202K330K619L039L452L854M305M708M940N028N060
61834A93276M992M777M536M385M256M037L737L359K796K043J292O51l3q43j534
61819B31727j859j911j867j631j036k08O14J455K436L418M155M657N085N388N361
61804B55784M989M385L529K382J141O8q76j874k849l529l880m089m245m284m277
61789B42375m355m393m149l706l427l465l596l622l578l506l318k987k631k292
$$ plain form
61775 193350 191460 190014 188907 187982 187247 186831 186787 187081 187726 188798 190301 192092 193967 195808 197679 199801
61759 199801 202378 205493 209173 213516 218607 224366 230669 237574 245249 253649 262455 271375 280298 289110
61745 289110 297562 305430 312612 319012 324437 328727 331786 333465 333602 332293 329972 327133 324149 321393
61731 321393 319339 318351 318526 319807 322101 325163 328571 331966 335173 338012 340129 341179 340993 339436 336279
61716 336279 331405 325049 317689 309753 301518 293144 284700 276213 267835 259839 252415 245558 239250 233597
61702 233597 228695 224483 220850 217736 215060 212687 210562 208763 207283 205927 204508 203011 201464 199813
61688 199813 198061 196389 194951 193679 192439 191259 190282 189546 188950 188354 187638 186759 185856 185168 184776 184494 184140
61671 184140 183760 183484 183306 183150 183017 182926 182791 182520 182170 181891 181774 181821 182002 182266 182569 182917 183297 183533 183387
$$ packed form
61775A93350j890j446j107r25p35m16m4K94O45J072J503J791J875J841J871K122
61759A99801K577L115L680M343N091N759O303O905P675Q400Q806Q920Q923Q812
61745B89110Q452P868P182O400N425M290L059J679J37j309k321k839k984k756
61731C21393k054r88J75J281K294L062L408L395L207K839K117J050j86j557l157
61716C36279m874o356p360p936q235q374q444q487q378p996p424o857o308n653
61702B33597m902m212l633l114k676k373k125j799j480j356j419j497j547j651
61688A99813j752j672j438j272j240j180r77p36n96n96p16q79r03o88l92k82l54
61671A84140l80k76j78j56j33r1j35k71l50k79j17M7J81K64L03L48L80K36j46
$$ plain form
61652 183387 182833 182106 181404 180721 180014 179332 178681 177973 177216 176581 176147 175762 175283 174800 174467 174302 174267 174350 174439 174285
61632 174285 173790 173182 172756 172575 172544 172590 172604 172425 172078 171854 171927 172068 171959 171635 171354 171167 170870 170332 169628 168885
61612 168885 168152 167394 166473 165225 163700 162193 160887 159585 157995 156119 154182 152287 150408 148607 147008
61597 147008 145601 144293 143131 142237 141576 140953 140245 139451 138564 137588 136636 135856 135235 134625 133920 133124 132290 131507
61579 131507 130878 130379 129835 129150 128468 127956 127539 127028 126403 125759 125071 124222 123252 122330 121524 120763 120014 119322 118680
61560 118680 118028 117422 117015 116868 116875 116903 116918 116956 117092 117423 118011 118830 119774 120697 121415 121803 121929 121987 122061 122066 121970 121876
61538 121876 121800 121545 120952 120118 119229 118323 117378 116470 115675 114915 114098 113267 112509 111831 111277 110992 110993 111026 110861 110576
61518 110576 110357 110193 110007 109936 110193 110725 111251 111558 111535 111048 110024 108667 107314 106111 104980 103864 102764
$$ packed form
61652A83387n54p27p02o83p07o82o51p08p57o35m34l85m79m83l33j65l5Q3Q9j54
61632A74285m95o08m26j81l1M6J4j79l47k24P3J41j09l24k81j87k97n38p04p43
61612A68885p33p58r21j248j525j507j306j302j590j876j937j895j879j801j599
61597A47008j407j308j162q94o61o23p08p94q87r76r52p80o21o10p05p96q34p83
61579A31507o29m99n44o85o82n12m17n11o25o44o88q49r70r22q06p61p49o92o42
61560A18680o52o06m07j47PK8J5L8J36L31N88Q19R44R23P18L88J26N8P4Nr6r4
61538A21876p6k55n93q34q89r06r45r08p95p60q17q31p58o78n54k85JL3j65k85
61518A10576k19j64j86p1K57N32N26L07k3m87j024j357j353j203j131j116j100
$$ plain form
61501 102764 101659 100545 99536 98752 98167 97718 97435 97277 97009 96471 95870 95567 95654 95953 96302 96586 96624 96339
61483 96339 95965 95787 95756 95621 95393 95314 95435 95537 95501 95447 95480 95568 95729 96062 96531 96952 97232 97440 97621 97730 97749
61462 97749 97718 97643 97569 97647 97945 98282 98486 98736 99328 100160 100772 100931 100839 100740 100649 100543 100546 100745 101049 101361 101703 102109
61440 102109 102525 102930 103383 103945 104654 105577 106727 107951 109063 110056 110989 111732 112049 111933 111622 111278 110866 110365
61422 110365 109878 109486 109167 108899 108674 108440 108185 108019 107985 107890 107551 107129 106948 107004 106972 106687 106301 105966 105654 105356
61402 105356 105165 105097 105065 105083 105258 105537 105717 105726 105697 105718 105747 105802 105957 106159 106293 106424 106723 107137 107431 107548 107642 107710
61380 107710 107592 107349 107301 107559 107866 108011 108089 108214 108317 108361 108463 108622 108629 108418 108225 108198 108156 107943 107767 107914 108331
61359 108331 108728 108939 109000 109008 109080 109326 109695 110002 110195 110455 110925 111501 112020 112469 112891 113303 113789 114493 115376 116206
$$ packed form
61501A02764j105j114j009p84n85m49k83j58k68n38o01l03Q7K99L49K84L8k85
61483I6339l74j78l1j35k28p9J21J02l6n4L3Q8J61L33M69M21K80K08J81J09J9
61462I7749l1p5p4P8K98L37K04K50N92Q32O12J59r2r9r1j06LJ99L04L12L42M06
61440A02109M16M05M53N62P09R23J150J224J112R93R33P43L17j16l11l44m12n01
61422A10365m87l92l19k68k25k34k55j66l4r5l39m22j81N6l2k85l86l35l12k98
61402A05356j91o8l2J8J75K79J80Rk9K1K9N5J55K02J34J31K99M14K94J17R4O8
61380A07710j18k43m8K58L07J45P8J25J03M4J02J59Pk11j93k7m2k13j76J47M17
61359A08331L97K11O1QP2K46L69L07J93K60M70N76N19M49M22M12M86P04Q83Q30
$$ plain form
61339 116206 116902 117689 118756 119972 121104 122135 123160 124145 124991 125710 126336 126783 126938 126825 126569 126309 126199
61322 126199 126351 126651 126792 126583 126125 125605 125079 124535 124004 123494 122994 122580 122387 122380 122373 122298 122256 122217 121953 121388 120752
61301 120752 120217 119662 118964 118279 117821 117557 117301 116979 116576 116035 115401 114915 114763 114836 114908 114921 114954 115025 115134 115354
61281 115354 115713 116073 116277 116325 116335 116415 116659 117110 117654 118103 118479 119022 119820 120665 121385 122097 122961 123909 124810 125731
61261 125731 126808 128033 129347 130809 132493 134366 136425 138828 141678 144813 147981 151140 154416 157851
61247 157851 161336 164645 167438 169386 170427 170794 170715 170252 169492 168629 167704 166504 164922 163183 161513 159810
61231 159810 157915 155988 154330 152993 151839 150862 150141 149560 148871 148031 147270 146835 146816 147177 147790 148459 149101
61214 149101 149863 150964 152451 154223 156205 158419 160969 164013 167626 171611 175586 179336 182901 186245
$$ packed form
61339A16206O96P87J067J216J132J031J025R85Q46P19O26M47J55j13k56k60j10
61322A26199J52L00J41k09m58n20n26n44n31n10n00m14j93ppp5m2l9k64n65o36
61301A20752n35n55o98o85m58k64k56l22m03n41o34m86j52P3P2J3L3P1J09K20
61281A15354L59L60K04M8J0Q0K44M51N44M49L76N43P98Q45P20P12Q64R48R01R21
61261A25731J077J225J314J462J684J873K059K403K850L135L168L159L276L435
61247A57851L485L309K793J948J041L67p9m63p60q63r25j200j582j739j670j703
61231A59810j895j927j658j337j154r77p21n81o89q40p61m35j9L61O13O69O42
61214A49101P62J101J487J772J982K214K550L044L613L985L975L750L565L344
$$ plain form
61200 186245 189059 191065 192299 192949 193102 192801 192159 191245 190027 188592 187248 186192 185275 184234 182984 181528
61184 181528 179828 177988 176347 175133 174197 173304 172504 171998 171839 172013 172595 173559 174636 175631 176713 178139
61168 178139 179851 181644 183523 185621 187914 190379 193248 196780 200858 205095 209203 212936 215847 217480
61154 217480 217748 216803 214669 211346 207233 203023 199175 195742 192685 190021 187695 185606 183810 182431 181425
61139 181425 180661 180197 180165 180428 180683 180848 181104 181563 182174 182935 183928 185136 186480 187972 189572 191003 192019
61122 192019 192787 193684 194765 195749 196517 197297 198375 199925 202119 205020 208366 211736 215012 218353 221786
61107 221786 225140 228436 231949 235822 239938 244233 248802 253632 258538 263466 268554 273803 279046 284282
61093 284282 289690 295171 300183 304232 307220 309160 309891 309312 307667 305338 302499 299171 295424 291341 286900
$$ packed form
61200A86245K814K006J234O50J53l01o42r14j218j435j344j056r17j041j250j456
61184A81528j700j840j641j214r36q93q00n06j59J74N82R64J077R95J082J426
61168A78139J712J793J879K098K293K465K869L532M078M237M108L733K911J633
61154B17480K68r45k134l323m113m210l848l433l057k664k326k089j796j379j006
61139A81425p64m64l2K63K55J65K56M59O11P61R93J208J344J492J600J431J016
61122A92019P68Q97J081R84P68P80J078J550K194K901L346L370L276L341L433
61107B21786L354L296L513L873M116M295M569M830M906M928N088N249N243N236
61093B84282N408N481N012M049K988J940P31n79j645k329k839l328l747m083m441
$$ plain form
61078 286900 282056 276828 271212 265156 258740 252191 245647 239050 232400 225908 219758 213887 208174 202733
61064 202733 197841 193676 190214 187330 184866 182689 180772 179205 178086 177496 177535 178278 179632 181372 183336
61049 183336 185479 187739 189970 192049 193899 195376 196289 196613 196546 196390 196434 196947 198117 199970 202470 205667
61033 205667 209642 214345 219687 225692 232352 239368 246326 253135 260029 267093 274077 280746 287113 293186
61019 293186 298781 303727 308089 312004 315451 318275 320347 321595 322040 321857 321225 320079 318188 315525 312364
61004 312364 308946 305249 301153 296585 291430 285508 278826 271662 264295 256847 249477 242520 236224 230566
60990 230566 225425 220794 216664 212894 209365 206125 203224 200573 198153 196145 194708 193748 193108 192831 193004
60975 193004 193486 194028 194581 195273 196135 197102 198219 199660 201521 203767 206359 209293 212524 216040 219975 224521
$$ packed form
61078B86900m844n228n616o056o416o549o544o597o650o492o150n871n713n441
61064B02733m892m165l462k884k464k177j917j567j119n90L9P43J354J740J964
61049A83336K143K260K231K079J850J477R13L24o7j56M4N13J170J853K500L197
61033B05667L975M703N342O005O660P016O958O809O894P064O984O669O367O073
61019B93186N595M946M362L915L447K824K072J248M45j83o32j146j891k663l161
61004C12364l418l697m096m568n155n922o682p164p367p448p370o957o296n658
60990B30566n141m631m130l770l529l240k901k651k420k008j437r60o40k77J73
60975A93004M82N42N53O92Q62R67J117J441J861K246K592K934L231L516L935M546
$$ plain form
60959 224521 229671 235233 241097 247362 254155 261444 269116 277118 285443 293983 302454 310551 318178 325513
60945 325513 332796 340043 347039 353606 359775 365630 371131 376193 380851 385207 389291 393112 396797 400501
60931 400501 404229 407891 411561 415502 419943 425004 430897 437937 446220 455514 465680 477039 490064
60918 490064 504796 520866 538011 556238 575511 595686 616911 639781 664905 692585 723041
60907 723041 756583 793332 833100 875899 922398 973751 1031410 1097463 1174661 1265632 1372632
60896 1372632 1498744 1649019 1829974 2048938 2314753 2637476 3024509 3476721 3989538
60887 3989538 4554284 5149071 5722825 6196048 6494459 6595207 6543423 6422632 6308633 6246641
60877 6246641 6255744 6332786 6440897 6503566 6430311 6164816 5716150 5147410 4536562 3944014
$$ packed form
60959B24521N150N562N864O265O793P289P672Q002Q325Q540Q471Q097P627P335
60945C25513P283P247O996O567O169N855N501N062M658M356M084L821L685L704
60931D00501L728L662L670L941M441N061N893P040Q283R294J0166J1359J3025
60918D90064J4732J6070J7145J8227J9273K0175K1225K2870K5124K7680L0456
60907G23041L3542L6749L9768M2799M6499N1353N7659O6053P7198R0971J07000
60896A372632J26112J50275J80955K18964K65815L22723L87033M52212N12817
60887C989538N64746N94787N73754M73223K98411J00748n1784j20791j13999o1992
60877F246641R103P7042J08111O2669p3255k65495m48666n68740o10848n92548
$$ plain form
60867 3944014 3404229 2932357 2531297 2195745 1916521 1684856 1493589 1335995 1205562
60858 1205562 1097115 1006925 931498 867202 811162 761618 717183 676480 638693 603731 571547
60847 571547 541850 514581 490026 468149 448385 430298 413899 399022 384951 371015 357165
60836 357165 343674 330663 318234 306717 296416 287386 279618 273134 267737 262980 258631 254856 251784
60823 251784 249235 247072 245454 244502 244025 243803 243836 244103 244382 244520 244619 244747 244768 244632 244504 244402 244028 243184 242030
60804 242030 240710 239042 236841 234291 231695 229115 226482 223819 221130 218304 215357 212531 209940 207381
60790 207381 204688 201994 199449 196966 194457 192047 189831 187685 185517 183433 181447 179375 177238 175410
60776 175410 174092 172980 171799 170762 170142 169684 168910 167777 166610 165578 164632 163826 163275 162893 162499 162126
$$ packed form
60867C944014n39785m71872m01060l35552k79224k31665j91267j57594j30433
60858A205562j08447r0190p5427o4296n6040m9544m4435m0703l7787l4962l2184
60847E71547k9697k7269k4555k1877j9764j8087j6399j4877j4071j3936j3850
60836C57165j3491j3011j2429j1517j0301r030p768o484n397m757m349l775l072
60823B51784k549k163j618r52m77k22L3K67K79J38R9J28K1j36j28j02l74q44j154
60804B42030j320j668k201k550k596k580k633k663k689k826k947k826k591k559
60790B07381k693k694k545k483k509k410k216k146k168k084j986k072k137j828
60776A75410j318j112j181j037o20m58p74j133j167j032r46q06n51l82l94l73
$$ plain form
60760 162126 161938 161979 162230 162800 163735 164817 165846 166973 168465 170250 171994 173519 174834 175911 176742 177543
60744 177543 178604 179963 181443 182898 184184 184995 185024 184291 183091 181661 180074 178383 176693 175133 173849
60729 173849 172911 172169 171378 170535 169853 169309 168559 167494 166487 165842 165297 164435 163288 162165 161114 159947 158631
60712 158631 157248 155706 153869 151868 149976 148248 146593 145068 143768 142530 141100 139540 138149 137057
60698 137057 136139 135244 134264 133104 131836 130786 130184 129863 129551 129269 129164 129134 128994 128854 128963 129261 129482 129616
60680 129616 129932 130537 131290 132095 132993 133938 134803 135599 136447 137339 138180 138974 139768 140468 140983 141447 142059 142738 143228
60661 143228 143428 143410 143190 142741 142160 141541 140808 139878 138882 137982 137122 136239 135525 135172 135023 134814 134593 134550 134573 134353
60641 134353 133818 133066 131994 130424 128522 126671 124979 123309 121751 120602 119905 119394 118939 118636 118478 118301
$$ packed form
60760A62126j88M1K51N70R35J082J029J127J492J785J744J525J315J077Q31Q01
60744A77543J061J359J480J455J286Q11K9p33j200j430j587j691j690j560j284
60729A73849r38p42p91q43o82n44p50j065j007o45n45q62j147j123j051j167j316
60712A58631j383j542j837k001j892j728j655j525j300j238j430j560j391j092
60698A37057r18q95r80j160j268j050o02l21l12k82j05l0j40j40J09K98K21J34
60680A29616L16O05P53Q05Q98R45Q65P96Q48Q92Q41P94P94P00N15M64O12O79M90
60661A43228K00j8k20m49n81o19p33r30r96r00q60q83p14l53j49k09k21m3K3k20
60641A34353n35p52j072j570j902j851j692j670j558j149o97n11m55l03j58j77
$$ plain form
60625 118301 118099 118006 117924 117574 116984 116545 116508 116710 116888 116953 116930 116921 117162 117791 118558 119059 119289 119650 120378 121297 122170
60604 122170 122981 123790 124623 125558 126677 127880 129007 130112 131339 132552 133431 133946 134384 134903 135401 135817 136224
60587 136224 136582 136742 136753 136802 136831 136581 136079 135677 135521 135360 134981 134475 133947 133336 132687 132262 132171 132192 132093 131897 131650
60566 131650 131230 130527 129607 128561 127397 126185 125058 123982 122776 121476 120412 119806 119526 119389 119424 119718
60550 119718 120187 120697 121229 121806 122379 122874 123225 123329 123126 122728 122289 121792 121145 120449 119924 119609 119378 119224 119239
60531 119239 119348 119377 119373 119554 119919 120264 120559 120944 121332 121423 121217 121111 121341 121667 121759 121597 121335 121033 120690 120292
60511 120292 119748 119026 118365 118050 117968 117732 117297 117018 116995 116827 116210 115402 114836 114601 114551 114652 114930 115302 115684 116125
60491 116125 116657 117183 117642 118109 118626 119130 119626 120221 120910 121578 122239 123000 123728 124120 124161 124180 124360 124559 124738
$$ packed form
60625A18301k02r3q2l50n90m39l7K02J78O5k3rK41O29P67N01K30L61P28R19Q73
60604A22170Q11Q09Q33R35J119J203J127J105J227J213Q79N15M38N19M98M16M07
60587A36224L58J60J1M9K9k50n02m02j56j61l79n06n28o11o49m25r1K1r9j96k47
60566A31650m20p03r20j046j164j212j127j076j206j300j064o06k80j37L5K94
60550A19718M69N10N32N77N73M95L51J04k03l98m39m97o47o96n25l15k31j54J5
60531A19239J09K9mJ81L65L45K95L85L88R1k06j06K30L26R2j62k62l02l43l98
60511A20292n44p22o61l15q2k36m35k79k3j68o17q08n66k35n0J01K78L72L82M41
60491A16125N32N26M59M67N17N04M96N95O89O68O61P61P28L92M1J9J80J99J79
$$ plain form
60472 124738 125137 125836 126524 126963 127345 127934 128676 129432 130336 131602 133224 135091 137217 139596 142052 144427
60456 144427 146756 149061 151187 152988 154460 155529 155951 155640 154892 154064 153220 152248 151127 149917 148712 147740
60440 147740 147308 147490 148074 148933 150216 152039 154281 156834 159805 163275 167120 171254 175787 180743 185817
60425 185817 190584 194728 197984 200137 201236 201519 200991 199427 196939 194165 191646 189354 187100 185030 183395
60410 183395 182124 181012 180110 179598 179454 179562 179983 180824 181989 183322 184840 186620 188631 190892 193638 197126
60394 197126 201449 206713 213132 220779 229467 239077 249717 261313 273331 285176 296559 307177 316289
60381 316289 322999 326807 327583 325209 319674 311394 301112 289522 277170 264558 252062 239864 228142
60368 228142 217192 207177 197992 189568 182079 175616 169922 164732 160132 156270 152955 149908 147226 145200
$$ packed form
60472A24738L99O99O88M39L82N89P42P56R04J266J622J867K126K379K456K375
60456A44427K329K305K126J801J472J069M22l11p48q28q44r72j121j210j205r72
60440A47740m32J82N84Q59J283J823K242K553K971L470L845M134M533M956N074
60425A85817M767M144L256K153J099K83n28j564k488k774k519k292k254k070j635
60410A83395j271j112r02n12j44J08M21Q41J165J333J518J780K011K261K746L488
60394A97126M323N264O419P647Q688R610J0640J1596J2018J1845J1383J0618R112
60381C16289O710L808P76k374n535q280j0282j1590j2352j2612j2496j2198j1722
60368B28142j0950j0015r185q424p489o463n694n190m600l862l315l047k682k026
$$ plain form
60354 145200 143783 142605 141421 140243 139106 137995 136943 135981 135019 133977 132921 131905 130843 129717 128726
60339 128726 128005 127394 126721 126112 125758 125572 125355 125119 124945 124731 124374 124033 123932 124027 124157 124354 124736 125227 125693
60320 125693 126138 126547 126723 126584 126449 126692 127269 127875 128365 128720 128807 128545 128160 127918 127789 127666 127730 128190 128845
60301 128845 129290 129476 129646 129855 129953 129973 130141 130520 131001 131585 132341 133149 133814 134398 135126 136019 136935 137873 138932
60282 138932 140041 141045 141977 142947 143864 144590 145248 146021 146775 147249 147540 147997 148675 149290 149680 149949 150169 150309
60264 150309 150450 150727 151079 151337 151553 151936 152509 153156 153945 155055 156445 157943 159630 161764 164360 167208
60248 167208 170290 173783 177625 181458 184996 188114 190582 192082 192558 192208 191089 189094 186360 183327 180287
60233 180287 177207 174072 171119 168577 166450 164633 163054 161631 160316 159206 158423 157870 157311 156677 156076
$$ packed form
60354A45200j417j178j184j178j137j111j052r62r62j042j056j016j062j126r91
60339A28726p21o11o73o09l54j86k17k36j74k14l57l41j01R5J30J97L82M91M66
60320A25693M45M09J76j39j35K43N77O06M90L55Q7k62l85k42j29j23O4M60O55
60301A28845M45J86J70K09R8K0J68L79M81N84P56Q08O65N84P28Q93R16R38J059
60282A38932J109J004R32R70R17P26O58P73P54M74K91M57O78O15L90K69K20J40
60264A50309J41K77L52K58K16L83N73O47P89J110J390J498J687K134K596K848
60248A67208L082L493L842L833L538L118K468J500M76l50j119j995k734l033l040
60233A80287l080l135k953k542k127j817j579j423j315j110p83n53n59o34o01
$$ plain form
60218 156076 155555 155099 154829 154919 155353 155975 156764 157793 159001 160320 161943 164165 166975 170098 173378 176775
60202 176775 180068 182897 185098 186648 187379 187112 186070 184724 183207 181283 178907 176399 173990 171591 169107
60187 169107 166620 164168 161697 159350 157440 156015 154775 153505 152308 151299 150371 149419 148506 147699 146969
60172 146969 146350 145937 145690 145450 145211 145113 145155 145180 145160 145219 145332 145319 145192 145168 145304 145409 145410 145467 145653 145802 145764 145572
60150 145572 145260 144818 144368 144098 143961 143727 143400 143260 143419 143643 143734 143788 143973 144320 144850 145614 146510 147309 147955
60131 147955 148617 149383 150193 151096 152260 153670 155094 156438 157844 159361 160845 162273 163851 165655 167476
60116 167476 169115 170581 171896 172992 173899 174775 175632 176326 176875 177491 178188 178683 178789 178642 178376 177906 177165
60099 177165 176305 175486 174682 173806 172834 171702 170357 168971 167849 167032 166280 165494 164865 164519 164338 164229 164248 164370
$$ packed form
60218A56076n21m56k70R0M34O22P89J029J208J319J623K222K810L123L280L397
60202A76775L293K829K201J550P31k67j042j346j517j924k376k508k409k399k484
60187A69107k487k452k471k347j910j425j240j270j197j009r28r52r13q07p30
60172A46969o19m13k47k40k39r8M2K5k0N9J13j3j27k4J36J05JN7J86J49l8j92
60150A45572l12m42m50k70j37k34l27j40J59K24R1N4J85L47N30P64Q96P99O46
60131A47955O62P66Q10R03J164J410J424J344J406J517J484J428J578J804J821
60116A67476J639J466J315J096R07Q76Q57O94N49O16O97M95J06j47k66m70p41
60099A77165q60q19q04q76r72j132j345j386j122q17p52p86o29l46j81j09J9J22
$$ plain form
60081 164370 164459 164572 164988 165764 166637 167468 168410 169504 170459 171085 171600 172264 172986 173572 174084 174686 175340 175894 176321
60062 176321 176648 176806 176732 176514 176284 176112 176096 176343 176800 177298 177842 178644 179771 181002 182160 183323 184575 185810
60044 185810 186883 187779 188512 189081 189617 190300 191112 191878 192628 193596 194793 195928 196868 197818 198894 199829 200324
60027 200324 200420 200341 200192 199984 199703 199229 198423 197412 196506 195756 194913 193922 193091 192613 192258 191734 191030 190188 189081
60008 189081 187666 186200 184939 183861 182869 182050 181507 181181 180996 180976 181066 181109 181124 181362 181920 182602 183272 184060 185058
59989 185058 186143 187263 188590 190207 191977 193833 195876 197985 199747 200945 201763 202298 202240 201326 199699
59974 199699 197541 194740 191238 187413 183728 180300 177108 174325 172081 170173 168364 166758 165576 164799
59960 164799 164306 164135 164256 164381 164319 164306 164643 165230 165804 166360 167026 167693 168162 168460 168681 168667 168181 167258 166076
$$ packed form
60081A64370Q9J13M16P76Q73Q31R42J094R55O26N15O64P22N86N12O02O54N54M27
60062A76321L27J58p4k18k30j72j6K47M57M98N44Q02J127J231J158J163J252J235
60044A85810J073Q96P33N69N36O83Q12P66P50R68J197J135R40R50J076R35M95
60027B00324R6p9j49k08k81m74q06j011r06p50q43r91q31m78l55n24p04q42j107
60008A89081j415j466j261j078r92q19n43l26j85k0R0M3J5K38N58O82O70P88R98
59989A85058J085J120J327J617J770J856K043K109J762J198Q18N35n8r14j627
59974A99699k158k801l502l825l685l428l192k783k244j908j809j606j182p77
59960A64799m93j71J21J25o2j3L37N87N74N56O66O67M69K98K21j4m86r23j182
$$ plain form
59941 166076 164656 162942 161049 159133 157187 155251 153624 152545 151812 151020 150025 148940 147822 146658 145522
59926 145522 144476 143447 142410 141521 140844 140157 139293 138457 137905 137532 137053 136405 135670 134809 133796 132879 132340
59909 132340 132120 131944 131727 131570 131505 131502 131643 132039 132646 133342 134092 134869 135577 136227 136995 137949 138907 139707 140404 141018
59889 141018 141362 141310 140964 140380 139433 138163 136961 136102 135425 134715 134083 133672 133300 132791 132341 132221 132352 132513
59871 132513 132710 132980 133144 133107 133200 133813 134947 136429 138300 140571 142918 145055 147133 149353 151380 152652
59855 152652 153043 152794 151996 150643 149020 147502 146063 144447 142702 141118 139726 138322 136915 135720 134783
59840 134783 134000 133455 133324 133487 133624 133655 133741 133949 134224 134587 135042 135435 135703 136105 136903 137981 139135 140490
59822 140490 142261 144313 146372 148470 150740 153006 155005 156821 158639 160283 161522 162631 164083 165823
$$ packed form
59941A66076j420j714j893j916j946j936j627j079p33p92r95j085j118j164j136
59926A45522j046j029j037q89o77o87q64q36n52l73m79o48p35q61j013r17n39
59909A32340k20j76k17j57o5lJ41L96O07O96P50P77P08O50P68R54R58Q00O97O14
59889A41018L44n2l46n84r47j270j202q59o77p10o32m11l72n09m50j20J31J61
59871A32513J97K70J64l7R3O13J134J482J871K271K347K137K078K220K027J272
59855A52652L91k49p98j353j623j518j439j616j745j584j392j404j407j195r37
59840A34783p83n45j31J63J37L1Q6K08K75L63M55L93K68M02P98J078J154J355
59822A40490J771K052K059K098K270K266J999J816J818J644J239J109J452J740
$$ plain form
59808 165823 167407 168738 170090 171488 172641 173468 174148 174660 174801 174674 174639 174759 174757 174546 174310 174094 173781 173487
59790 173487 173508 173860 174316 174874 175727 176782 177750 178735 180202 182286 184576 186665 188439 189771 190451 190532 190318
59773 190318 189904 189120 188027 187017 186336 185859 185422 184994 184441 183552 182365 181132 179920 178596 177223 176066
59757 176066 175155 174256 173321 172588 172204 172117 172360 173031 173971 174886 175811 177021 178462 179741 180727 181731 183014
59740 183014 184569 186445 188843 191729 194767 197707 200484 202914 204709 205882 206738 207375 207610 207417 206956
59725 206956 206094 204372 201601 198078 194153 189977 185791 181981 178707 175831 173314 171274 169611 168037
59711 168037 166588 165618 165160 164784 164250 163829 163772 163923 164075 164281 164568 164714 164549 164159 163620 162840 161824 160772
59693 160772 159756 158656 157521 156631 156061 155554 154945 154339 153739 152944 151980 151223 150897 150831 150892 151212 151781 152214
$$ packed form
59808A65823J584J331J352J398J153Q27O80N12J41j27l5J20kk11k36k16l13k94
59790A73487K1L52M56N58Q53J055R68R85J467K084K290K089J774J332O80Q1k14
59773A90318m14p84j093j010o81m77m37m28n53q89j187j233j212j324j373j157
59757A76066r11q99r35p33l84q7K43O71R40R15R25J210J441J279R86J004J283
59740A83014J555J876K398K886L038K940K777K430J795J173Q56O37K35j93m61
59725B06956q62j722k771l523l925m176m186l810l274k876k517k040j663j574
59711A68037j449r70m58l76n34m21n7J51J52K06K87J46j65l90n39p80j016j052
59693A60772j016j100j135q90n70n07o09o06o00p95r64p57l26o6O1L20N69M33
$$ plain form
59675 152214 152193 151873 151604 151534 151671 152034 152590 153254 154089 155220 156495 157587 158507 159626 161137 162869 164727
59658 164727 166850 169199 171452 173495 175599 177930 180302 182632 185203 188215 191411 194414 197126 199588
59644 199588 201758 203606 205149 206258 206722 206598 206138 205323 203902 201964 200009 198317 196707 195079 193666
59629 193666 192545 191431 190186 189053 188138 187139 185912 184788 184031 183415 182706 182106 181846 181744 181531 181278 181131
59612 181131 180958 180654 180470 180669 181119 181540 181901 182293 182666 182953 183227 183478 183539 183422 183408 183582 183643 183403 183097 182940
59592 182940 182764 182402 182053 181946 181983 182046 182303 182864 183471 183839 184026 184143 183999 183376 182358 181096 179520 177603
59574 177603 175599 173717 171849 169892 168032 166423 164914 163417 162225 161588 161292 160965 160567 160237 159960 159739
59558 159739 159800 160283 160965 161549 162001 162346 162449 162326 162322 162652 163030 163108 162955 162780 162508 162000 161433 161058 160830 160619
$$ packed form
59675A52214k1l20k69p0J37L63N56O64Q35J131J275J092R20J119J511J732J858
59658A64727K123K349K253K043K104K331K372K330K571L012L196L003K712K462
59644A99588K170J848J543J109M64j24m60q15j421j938j955j692j610j628j413
59629A93666j121j114j245j133r15r99j227j124p57o16p09o00k60j02k13k53j47
59612A81131j73l04j84J99M50M21L61L92L73K87K74K51O1j17j4J74O1k40l06j57
59592A82940j76l62l49j07L7O3K57N61O07L68J87J17j44o23j018j262j576j917
59574A77603k004j882j868j957j860j609j509j497j192o37k96l27l98l30k77k21
59558A59739O1M83O82N84M52L45J03j23mL30L78P8j53j75k72n08n67l75k28k11
$$ plain form
59538 160619 160530 160694 160981 161264 161694 162390 163096 163488 163549 163301 162512 161005 159067 157140 155379 153775 152460
59521 152460 151536 150857 150299 149992 149953 149805 149244 148488 147893 147432 146947 146609 146678 147062 147525 148125 149026 150065 150909
59502 150909 151499 151979 152375 152663 152958 153320 153604 153798 154207 154966 155690 155974 155954 155964 155939 155639 155168 154813 154549 154150
59482 154150 153593 152995 152321 151564 150962 150680 150492 150149 149815 149720 149679 149414 149092 149062 149285 149477 149650 150007 150508 150979
59462 150979 151514 152295 153179 153881 154401 154858 155089 154877 154449 154263 154414 154654 154896 155270 155794 156400 157209 158391
59444 158391 159870 161499 163440 166038 169432 173630 178783 185033 192100 199246 205527 209998 212107 212199 211344
59429 211344 210358 209279 207975 206705 205640 204368 202462 200169 197942 195641 192838 189611 186420 183405
59415 183405 180421 177531 174895 172362 169767 167425 165752 164595 163519 162526 161900 161551 161166 160828 160826 161013
$$ packed form
59538A60619q9J64K87K83M30O96P06L92O1k48p89j507j938j927j761j604j315
59521A52460r24o79n58l07l9j48n61p56n95m61m85l38O9L84M63O00R01J039Q44
59502A50909N90M80L96K88K95L62K84J94M09P59P24K84k0J0k5l00m71l55k64l99
59482A54150n57n98o74p57o02k82j88l43l34r5m1k65l22l0K23J92J73L57N01M71
59462A50979N35P81Q84P02N20M57K31k12m28j86J51K40K42L74N24O06Q09J182
59444A58391J479J629J941K598L394M198N153O250P067P146O281M471K109R2q55
59429B11344r86j079j304j270j065j272j906k293k227k301k803l227l191l015
59415A83405k984k890k636k533k595k342j673j157j076r93o26l49l85l38kJ87
$$ plain form
59399 161013 160979 160736 160597 160504 160124 159550 159189 159035 158675 158016 157389 156967 156657 156559 156888 157450 157770 157774 157846 158218 158838
59378 158838 159755 161077 162573 163880 165089 166593 168399 170139 171705 173323 175010 176556 178018 179677
59364 179677 181530 183365 185272 187507 189916 192084 194018 196040 198048 199533 200363 200897 201281 201270 200816 200181
59348 200181 199407 198240 196690 195072 193446 191574 189501 187573 185838 184034 182264 181044 180575 180553 180803
59333 180803 181488 182587 183796 185122 187001 189653 192877 196590 200993 205988 211043 215827 220490 225107
59319 225107 229402 233232 236891 240643 244386 247966 251425 254733 257559 259387 259606 257624 253410 247947
59305 247947 242640 238255 234792 232249 230854 230587 231108 232136 233257 233403 231363 227052 221618 216156 210942
59290 210942 206023 201746 198315 195474 192983 190932 189356 188028 186867 186029 185427 184682 183749 183050 182809 182790
$$ packed form
59399A61013l4k43j39r3l80n74l61j54l60o59o27m22l10r8L29N62L20MP2L72O20
59378A58838R17J322J496J307J209J504J806J740J566J618J687J546J462J659
59364A79677J853J835J907K235K409K168J934K022K008J485Q30N34L84j1m54o35
59348B00181p74j167j550j618j626j872k073j928j735j804j770j220m69k2K50
59333A80803O85J099J209J326J879K652L224L713M403M995N055M784M663M617
59319B25107M295L830L659L752L743L580L459L308K826J828K19j982m214n463
59305B47947n307m385l463k543j395k67N21J028J121J46k040m311n434n462n214
59290B10942m919m277l431k841k491k051j576j328j161q38o02p45r33o99k41j9
$$ plain form
59274 182790 182827 183051 183414 183626 183751 184249 185225 186257 187214 188588 190709 193258 195896 198819 202319 206333
59258 206333 210780 215846 221584 227685 233925 240417 247106 253511 259249 264381 268980 272848 275850 278072
59244 278072 279362 279257 277608 274799 271121 266438 260761 254553 248185 241609 234860 228393 222568 217294
59230 217294 212446 208153 204382 200786 197251 194114 191535 189192 186867 184808 183202 181804 180434 179283
59216 179283 178376 177311 175902 174598 173837 173462 173128 172795 172487 172044 171508 171249 171353 171383 171104 170873 170965 171094
59198 171094 171068 171349 172454 174280 176531 179336 182916 187117 191767 197025 202765 207974 211401 212631 212112
59183 212112 210491 208378 206452 205232 204852 205347 206859 209299 212149 214952 217670 220281 222475 224095 225459
59168 225459 226807 227852 228253 228171 227922 227497 226842 226238 225910 225609 225006 224173 223300 222274 220976 219657 218586
$$ packed form
59274A82790L7K24L63K12J25M98R76J032R57J374K121K549K638K923L500M014
59258B06333M447N066N738O101O240O492O689O405N738N132M599L868L002K222
59244B78072J290j05j649k809l678m683n677o208o368o576o749o467n825n274
59230B17294m848m293l771l596l535l137k579k343k325k059j606j398j370j151
59216A79283r07j065j409j304p61l75l34l33l08m43n36k59J04L0k79k31R2J29
59198A71094k6K81J105J826K251K805L580M201M650N258N740N209L427J230n19
59183B12112j621k113j926j220l80M95J512K440K850K803K718K611K194J620J364
59168B25459J348J045M01q2k49m25o55o04l28l01o03q33q73j026j298j319j071
$$ plain form
59151 218586 217658 216677 215749 215013 214395 213940 214001 214697 215572 216199 216721 217390 217998 218204 218055 217701 216963 215585 213621
59132 213621 211178 208121 204451 200587 196896 193284 189623 186163 183148 180431 177849 175548 173564 171571
59118 171571 169502 167878 167024 166453 165591 164623 164033 163768 163475 163200 163166 163171 162854 162319 161926 161677 161349 160977 160722
59099 160722 160501 160206 160013 160028 159958 159595 159281 159378 159668 159771 159813 160115 160590 161015 161563 162468 163484 164279 165095 166402
59079 166402 168181 170073 172014 174152 176371 178497 180745 183433 186445 189434 192316 195061 197296 198638
59065 198638 199202 199302 198917 197896 196363 194473 192112 189312 186574 184225 181879 179076 176074 173391 170979
59050 170979 168526 166201 164351 162797 161117 159386 157924 156584 155005 153348 152080 151211 150410 149678 149256
59035 149256 149009 148603 148112 147875 147904 148018 148355 149114 150056 150844 151668 152888 154301 155478 156590 158198 160397
$$ packed form
59151B18586r28r81r28p36o18m55O1O96Q75O27N22O69O08K06j49l54p38j378j964
59132B13621k443l057l670l864l691l612l661l460l015k717k582k301j984j993
59118A71571k069j624q54n71q62r68n90k65k93k75l4Nl17n35l93k49l28l72k55
59099A60722k21k95j93J5p0l63l14R7K90J03M2L02M75M25N48R05J016P95Q16J307
59079A66402J779J892J941K138K219K126K248K688L012K989K882K745K235J342
59065A98638N64J00l85j021j533j890k361k800k738k349k346k803l002k683k412
59050A70979k453k325j850j554j680j731j462j340j579j657j268q69q01p32m22
59035A49256k47m06m91k37K9J14L37P59R42P88Q24J220J413J177J112J608K199
$$ plain form
59018 160397 162846 165490 168542 171930 175422 179187 183569 188418 193283 198127 203196 208340 213102 217354
59004 217354 221187 224356 226475 227612 228044 227624 226059 223647 221027 218377 215557 212851 210782 209292 207887
58989 207887 206495 205431 204605 203563 202263 201041 199806 198065 195781 193495 191508 189613 187705 186010
58975 186010 184644 183510 182662 182221 181930 181324 180340 179256 178148 176914 175715 174768 173843 172552 170993 169517
58959 169517 168067 166406 164807 163805 163378 163073 162802 162826 163081 163269 163501 164102 164906 165449 165746 166106 166319 165892
58941 165892 165009 164429 164422 164585 164699 165004 165613 166443 167741 169895 172727 175665 178611 181894 185433 188742 191725
58924 191725 194648 197364 199372 200629 201481 201839 201305 200067 198791 197577 195979 194033 192342 191032 189608
58909 189608 188038 187031 187010 187678 188788 190492 192710 194997 197323 200109 203311 206280 208767 211255 214013
$$ packed form
59018A60397K449K644L052L388L492L765M382M849M865M844N069N144M762M252
59004B17354L833L169K119J137M32m20j565k412k620k650k820k706k069j490j405
58989B07887j392j064q26j042j300j222j235j741k284k286j987j895j908j695
58975A86010j366j134q48m41k91o06r84j084j108j234j199r47r25j291j559j476
58959A69517j450j661j599j002m27l05k71K4K55J88K32O01Q04N43K97L60K13m27
58941A65892q83n80pJ63J14L05O09Q30J298K154K832K938K946L283L539L309K983
58924A91725K923K716K008J257Q52L58n34j238j276j214j598j946j691j310j424
58909A89608j570j007k1O68J110J704K218K287K326K786L202K969K487K488K758
$$ plain form
58894 214013 216651 218850 220764 222355 223151 222963 222175 221026 219316 217084 214890 213158 211868 211099 211146 211940
58878 211940 213041 214415 216492 219277 222216 225098 228319 231991 235599 238837 242032 245467 248992 252570
58864 252570 256471 260613 264429 267638 270461 272852 274279 274484 273748 272154 269357 265341 260645 255563 249877
58849 249877 243641 237437 231557 225728 219936 214756 210530 206966 203857 201443 199737 198278 196905 196034
58835 196034 195817 195741 195396 194927 194414 193544 192254 190967 189880 188681 187287 186089 185206 184238 183071 182155 181670
58818 181670 181221 180656 180404 180649 180966 181116 181402 181984 182635 183480 185080 187469 190029 192676 196186 200907 206160
58801 206160 211419 217112 223662 230670 237694 245005 252912 261135 269491 278442 288322 298716 309164 319742
58787 319742 330321 340014 347964 354038 358241 360136 359472 356678 352148 345734 337433 327908 317807 307312
$$ packed form
58894B14013K638K199J914J591P96j88p88j149j710k232k194j732j290p69M7P94
58878B11940J101J374K077K785K939K882L221L672L608L238L195L435L525L578
58864B52570L901M142L816L209K823K391J427K05p36j594k797m016m696n082n686
58849B49877o236o204n880n829n792n180m226l564l109k414j706j459j373q71
58835A96034k17p6l45m69n13q70j290j287j087j199j394j198q83r68j167r16m85
58818A81670m49n65k52K45L17J50K86N82O51Q45J600K389K560K647L510M721N253
58801B06160N259N693O550P008P024P311P907Q223Q356Q951R880J0394J0448J0578
58787C19742J0579R693P950O074M203J895o64k794m530o414q301r525j0101j0495
$$ plain form
58773 307312 296840 287361 279413 272566 266417 261322 257552 254567 251809 249429 247574 245744 243571 241455
58759 241455 239705 237808 235285 232525 230006 227418 224310 220918 217568 213944 209728 205338 201241 197153
58745 197153 192700 188261 184384 180944 177635 174718 172483 170570 168558 166701 165364 164320 163319 162746
58731 162746 162947 163534 164066 164853 166251 167804 168873 169596 170400 171113 171400 171574 172124 172869 173353 173638 174002 174309
58713 174309 174397 174600 175185 175733 175771 175525 175412 175282 174855 174339 173948 173361 172362 171425 170947 170501 169545 168298 167180
58694 167180 166042 164715 163679 163384 163493 163554 163860 164818 166100 167233 168426 169973 171484 172531 173511 175016
58678 175016 176978 179271 182475 187103 192649 198276 203802 209028 212777 213773 212047 208568 204003 198815
58664 198815 193957 190307 187701 185454 183462 181945 180624 179116 177691 176677 175631 174041 172328 171181
$$ packed form
58773C07312j0472r479p948o847o149n095l770k985k758k380j855j830k173k116
58759B41455j750j897k523k760k519k588l108l392l350l624m216m390m097m088
58745A97153m453m439l877l440l309k917k235j913k012j857j337j044j001n73
58731A62746K01N87N32P87J398J553J069P23Q04P13K87J74N50P45M84K85L64L07
58713A74309Q8K03N85N48L8k46j13j30m27n16l91n87r99r37m78m46r56j247j118
58694A67180j138j327j036k95J09O1L06R58J282J133J193J547J511J047R80J505
58678A75016J962K293L204M628N546N627N526N226L749R96j726l479m565n188
58664A98815m858l650k606k247j992j517j321j508j425j014j046j590j713j147
$$ plain form
58650 171181 170381 169319 168181 167587 167486 167470 167761 168869 170632 172569 174812 177727 181048 184328 187811 191917
58634 191917 196328 200510 204646 209041 213166 216344 218855 221291 223356 224458 224936 225514 225989 225708 224929
58619 224929 224477 224431 224350 224414 225102 226056 226488 226408 226326 226057 225025 223375 221563 219202 215567 210912 206027 200824
58601 200824 194679 187906 181531 175825 170338 165175 160908 157397 153991 150784 148399 146698 144950 143169
58587 143169 142001 141377 140595 139633 139162 139297 139549 139946 141010 142703 144553 146727 149808 153634 157544 161615
58571 161615 166489 172121 177937 184052 191046 198672 206056 213020 219880 226103 230577 233159 234564 234691
58557 234691 232519 227745 221248 213844 205853 197944 191051 185271 180015 175327 171873 169635 167840 166218
58543 166218 165155 164579 163959 163390 163454 163992 164253 164228 164583 165284 165612 165514 165631 166024 166186 166313 167190 168760 170185
$$ packed form
58650A71181q00j062j138n94j01j6K91J108J763J937K243K915L321L280L483M106
58634A91917M411M182M136M395M125L178K511K436K065J102M78N78M75k81p79
58619B24929m52m6q1O4O88R54M32q0q2k69j032j650j812k361l635m655m885n203
58601B00824o145o773o375n706n487n163m267l511l406l207k385j701j748j781
58587A43169j168o24p82r62m71J35K52L97J064J693J850K174L081L826L910M071
58571A61615M874N632N816O115O994P626P384O964O860O223M474K582J405J27
58557B34691k172m774o497p404p991p909o893n780n256m688l454k238j795j622
58543A66218j063n76o20n69O4N38K61k5L55P01L28r8J17L93J62J27Q77J570J425
$$ plain form
58524 170185 171322 172790 174541 175826 176633 177755 179318 180635 181596 182766 183999 184408 183878 183182 182455 181005
58508 181005 178801 176713 175063 173355 171556 170225 169217 167739 165877 164586 164012 163326 162387 162036 162507
58493 162507 163118 163800 165335 167787 170276 172594 175523 179192 182722 185822 189162 192762 195654 197552 199287
58478 199287 201158 202461 203142 204279 206367 208715 211072 214323 218945 224299 230012 236601 244130 251709
58464 251709 258880 266046 273012 278578 282132 284214 285061 284157 281720 279019 276659 274063 271214 269197 268404
58449 268404 267846 266920 266216 265854 264672 261918 258211 254104 249243 243735 238735 234829 231303 227800 225152
58434 225152 223778 222828 221799 221450 222274 223551 224778 226538 229089 231604 233696 236181 239388 242244 243951
58419 243951 245088 246113 246258 244908 242675 240136 236928 232995 229283 226248 223080 219323 215794 213004
$$ packed form
58524A70185J137J468J751J285Q07J122J563J317R61J170J233M09n30o96p27j450
58508A81005k204k088j650j708j799j331j008j478j862j291n74o86r39l51M71
58493A62507O11O82J535K452K489K318K929L669L530L100L340L600K892J898J735
58478A99287J871J303O81J137K088K348K357L251M622N354N713O589P529P579
58464B51709P171P166O966N566L554K082Q47r04k437k701k360k596k849k017p93
58449B68404n58r26p04l62j182k754l707m107m861n508n000l906l526l503k648
58434B25152j374r50j029l49Q24J277J227J760K551K515K092K485L207K856J707
58419B43951J137J025J45j350k233k539l208l933l712l035l168l757l529k790
$$ plain form
58405 213004 210166 206773 203659 201502 199691 197700 196109 195292 194527 193352 192426 192116 191725 191021 190949 191901
58389 191901 192858 193240 193982 195761 197794 199467 201487 204298 206970 208807 210418 212074 212647 211443 209400
58374 209400 207292 204411 200325 196219 193112 190366 187310 184747 183436 182681 181820 181574 182534 183874 184964
58359 184964 186676 189646 192853 195336 197722 200582 202896 203708 203723 203731 203027 200987 198634 197046 195726 194117
58343 194117 193101 193372 193921 193815 193921 195190 196796 197735 198701 200588 202676 204069 205475 207773 210248 212033
58327 212033 213770 216102 217983 218330 217854 217485 216539 214276 211717 209985 208339 205751 202895 200658 198239
58312 198239 194691 190845 187747 184722 181009 177704 175989 174983 173441 172058 171937 172342 172187 172230 173532
58297 173532 175216 175982 176427 177605 178767 178828 178618 179344 180241 180089 179652 180203 181062 180963 180482 180743 181124 180675
$$ packed form
58405B13004k838l393l114k157j811j991j591q17p65j175r26l10l91p04p2R52
58389A91901R57L82P42J779K033J673K020K811K672J837J611J656N73j204k043
58374B09400k108k881m086m106l107k746l056k563j311p55q61k46R60J340J090
58359A84964J712K970L207K483K386K860K314Q12J5Qp04k040k353j588j320j609
58343A94117j016K71N49j06J06J269J606R39R66J887K088J393J406K298K475J785
58327B12033J737K332J881L47m76l69r46k263k559j732j646k588k856k237k419
58312A98239l548l846l098l025l713l305j715j006j542j383j21M05j55M3J302
58297A73532J684P66M45J178J162O1k10P26Q97j52m37N51Q59r9m81K61L81m49
$$ plain form
58279 180675 180358 181410 182894 183326 183346 184305 185680 186387 187202 189322 191947 193855 195886 199259 202935 205321
58263 205321 207060 209399 211390 211528 210659 210356 209946 208081 205772 204814 204657 203847 203122 203990 205706 206804
58247 206804 208171 211399 215519 218664 221525 225843 230829 234536 237417 241087 244877 247092 248420 250574
58233 250574 252804 253314 252876 253460 254511 254187 253038 252818 252918 251681 249998 249807 250334 249637 248566 249231 250885
58216 250885 251392 251480 253383 256442 258323 259449 261931 265250 267346 268893 272048 276035 278433 279798 282458
58201 282458 285825 287521 288131 290118 293019 294530 295325 297932 301796 304406 306344 310165 315219 318787 321451
58186 321451 326058 332231 337261 341576 347839 355441 361479 366410 373059 380806 386613 391049 397280 404769
58172 404769 410079 413338 417639 422651 425238 425984 428624 433358 437218 440572 446585 454620 461056 466241
$$ packed form
58279A80675l17J052J484M32K0R59J375P07Q15K120K625J908K031L373L676K386
58263B05321J739K339J991J38q69l03m10j865k309r58j57q10p25Q68J716J098
58247B06804J367L228M120L145K861M318M986L707K881L670L790K215J328K154
58233B50574K230N10m38N84J051l24j149k20J00j237j683j91N27o97j071O65J654
58216B50885N07Q8J903L059J881J126K482L319K096J547L155L987K398J365K660
58201B82458L367J696O10J987K901J511P95K607L864K610J938L821N054L568K664
58186C21451M607O173N030M315O263P602O038M931O649P747N807M436O231P489
58172D04769N310L259M301N012K587P46K640M734L860L354O013Q035O436N185
$$ plain form
58158 466241 473697 482905 490102 495806 504074 514649 523537 531081 541551 554895 567008 578089 592345
58145 592345 609458 624908 638842 655865 675962 694627 712100 733121 757359 779782 800748
58134 800748 825762 854881 882757 909517 940829 976699 1011462 1045463 1085066 1130401 1175293
58123 1175293 1220099 1271828 1330624 1389565 1448980 1516928 1594235 1673851 1756453 1851097 1958704
58112 1958704 2071433 2190333 2326151 2480583 2645481 2823148 3027452 3262197 3520116
58103 3520116 3806699 4141918 4534922 4982908 5499774 6118329 6859280 7728938 8753422
58094 8753422 9981077 11446184 13173734 15233366 17748160 20845111 24652912 29351122
58086 29351122 35129228 42053941 50048820 58994763 68608438 77984732 85378807 88854693
$$ packed form
58158D66241P456R208P197N704Q268J0575Q888P544J0470J3344J2113J1081J4256
58145E92345J7113J5450J3934J7023K0097J8665J7473K1021K4238K2423K0966
58134H00748K5014K9119K7876K6760L1312L5870L4763L4001L9603M5335M4892
58123A175293M4806N1729N8796N8941N9415O7948P7307P9616Q2602R4644J07607
58112A958704J12729J18900J35818J54432J64898J77667K04304K34745K57919
58103C520116K86583L35219L93004M47986N16866O18555P40951Q69658J024484
58094H753422J227655J465107J727550K059632K514794L096951L807801M698210
58086B9351122N778106O924713P994879Q945943R613675R376294P394075L475886
$$ plain form
58078 88854693 87465436 81855964 73726253 64789672 56180078 48490410 41969420 36583481
58070 36583481 32077114 28148126 24603925 21375960 18460062 15878632 13654381 11776116
58062 11776116 10195972 8865949 7756265 6835226 6060049 5398501 4837854 4364381 3954399
58053 3954399 3592571 3279161 3011552 2775963 2563518 2377167 2216227 2069876 1931985
58044 1931985 1807377 1697584 1594595 1494341 1402821 1323258 1249805 1179188 1116418 1063634
58034 1063634 1014782 966493 923422 887892 854579 820189 788467 761087 733164 702370 673375
58023 673375 648864 624910 599381 576342 557934 540141 520723 503383 490088 477013 462061
58012 462061 448892 439499 430126 418460 407782 400102 392079 381714 372405 366405 360574 352575 345155
$$ packed form
58078H8854693j389257n609472q129711q936581q609594p689668o520990n385939
58070C6583481m506367l928988l544201l227965k915898k581430k224251j878265
58062A1776116j580144j330023j109684r21039p75177o61548n60647m73473m09982
58053C954399l61828l13410k67609k35589k12445j86351j60940j46351j37891
58044A931985j24608j09793j02989j00254r1520p9563p3453p0617o2770n2784
58034A063634m8852m8289m3071l5530l3313l4390l1722k7380k7923l0794k8995
58023F73375k4511k3954k5529k3039j8408j7793j9418j7340j3295j3075j4952
58012D62061j3169r393r373j1666j0678p680q023j0365r309o000n831p999p420
$$ plain form
57999 345155 340423 335785 329404 323954 321122 317758 311178 303135 295159 285224 272547 260598 251785 243933
57985 243933 235301 228189 224189 220634 215259 209922 206399 202888 197970 193691 191418 188817 184154 179558
57971 179558 176891 174368 170407 166832 165128 163356 159963 156902 155898 155228 153237 151495 151411 151232 149438
57956 149438 147739 147668 147548 145808 144043 143766 143323 141080 138582 137556 136691 134394 131885 130631 129436 126948
57940 126948 124406 123123 121848 119339 116976 116141 115582 114017 112771 113180 113882 113358 112699 113231 113782 112958
57924 112958 111771 111458 111022 109493 108272 108676 109387 108935 108422 109221 110219 109983 109483 110017 110518 109620 108398
57907 108398 108399 108854 108440 107950 108625 109606 109607 109423 110269 111309 111281 110942 111457 112021 111474 110662 110801 111053 110087 108506
57887 108506 107426 106184 103793 101191 99712 98779 97333 96060 95923 95971 94915 93473 92902 92620 91545 90358
$$ packed form
57999C45155m732m638o381n450k832l364o580q043p976r935j2677j1949q813p852
57985B43933q632p112m000l555n375n337l523l511m918m279k273k601m663m596
57971A79558k667k523l961l575j704j772l393l061j004o70j991j742q4j79j794
57956A49438j699p1j20j740j765k77m43k243k498j026q65k297k509j254j195k488
57940A26948k542j283j275k509k363q35n59j565j246M09P02n24o59N32N51q24
57924A12958j187l13m36j529j221M04P11m52n13P99R98k36n00N34N01q98j222
57907A08398JM55m14m90O75R81Jj84Q46J040k8l39N15N64n47q12J39K52r66j581
57887A08506j080j242k391k602j479r33j446j273j37M8j056j442n71k82j075j187
$$ plain form
57871 90358 90130 90086 89064 87822 87585 87623 86625 85210 84700 84577 83537 81992 81178 80809 79879 78819 78650 78944
57853 78944 78734 78507 79183 80121 80226 80050 80710 81735 82057 82144 83029 84234 84764 85162 86459 88050 88803 89304
57835 89304 90817 92904 94279 95183 96674 98376 99147 99281 99855 100566 100343 99441 98822 98131 96456 94428 93420
57818 93420 93228 92662 91831 91742 92169 92094 91779 92281 93335 93833 93997 94956 96545 97613 98243 99578 101649 103398
57800 103398 104673 106220 107865 108623 108527 108515 108624 108069 106965 106215 105809 104944 103672 102721 101866 100206 97908
57783 97908 95997 94581 92947 91232 90258 89827 88899 87392 86189 85417 84371 83068 82275 82006 81535 80845
57767 80845 80589 80723 80636 80515 81084 82158 82927 83518 84740 86457 87798 88828 90405 92479 94140 95324
57751 95324 96875 98907 100616 101766 102902 104019 104470 104208 103800 103208 101901 100070 98387 96688 94309
$$ packed form
57871I0358k28m4j022j242k37L8r98j415n10j23j040j545q14l69r30j060j69K94
57853G8944k10k27O76R38J05j76O60J025L22Q7Q85J205N30L98J297J591P53N01
57835H9304J513K087J375R04J491J702P71J34N74P11k23r02o19o91j675k028j008
57818I3420j92n66q31q9M27p5l15N02J054M98J64R59J589J068O30J335K071J749
57800A03398J275J547J645P58r6j2J09n55j104p50m06q65j272r51q55j660k298
57783I7908j911j416j634j715r74m31r28j507j203p72j046j303p93k69m71o90
57767H0845k56J34q7j21N69J074P69N91J222J717J341J030J577K074J661J184
57751I5324J551K032J709J150J136J117M51k62m08n92j307j831j683j699k379
$$ plain form
57736 94309 91566 89446 87944 86187 84090 82398 81125 79529 77617 76169 75241 74121 72798 71987 71657
57721 71657 71016 70023 69430 69240 68607 67363 66207 65296 64093 62711 61948 61825 61517 60882 60619 60789 60590 59792
57703 59792 58979 58192 56776 54772 53073 51939 50732 49312 48342 47951 47480 46823 46682 47194 47630 47773 48271
57686 48271 49369 50523 51585 53073 55019 56794 58353 60373 62917 65243 67228 69638 72667 75485
57672 75485 77624 79546 81484 82954 83811 84553 85210 85123 84190 83158 82271 80872 78713 76477 74572 72575
57656 72575 70279 68155 66365 64437 62323 60662 59593 58424 56875 55500 54536 53467 52173 51343 51262
57641 51262 51313 51137 51189 51695 52156 52362 52812 53659 54303 54512 54909 55863 56922 57786 58808 60064 60984 61393 61912
57622 61912 62846 63678 64114 64591 65275 65616 65383 65087 64907 64235 62836 61368 60222 58879 56984 55007 53243
$$ packed form
57736I4309k743k120j502j757k097j692j273j596j912j448r28j120j323q11l30
57721G1657o41r93n93j90o33j244j156r11j203j382p63j23l08o35k63J70j99p98
57703E9792q13p87j416k004j699j134j207j420r70l91m71o57j41N12M36J43M98
57686D8271J098J154J062J488J946J775J559K020K544K326J985K410L029K818
57672G5485K139J922J938J470Q57P42O57q7r33j032q87j399k159k236j905j997
57656G2575k296k124j790j928k114j661j069j169j549j375r64j069j294q30q1
57641E1262N1j76N2N06M61K06M50Q47O44K09L97R54J059Q64J022J256R20M09N19
57622F1912R34Q32M36M77O84L41k33k96j80o72j399j468j146j343j895j977j764
$$ plain form
57605 53243 51215 48710 46396 44713 43132 41163 39234 37843 36736 35550 34475 33633 32640 31345 30199
57590 30199 29364 28302 26793 25470 24759 24217 23498 23051 23224 23595 23846 24409 25576 26859 27970 29536 32107
57573 32107 35283 38603 42546 47849 54553 62528 72246 84229 98258 113848 130850 148720 165587
57560 165587 178689 185523 184496 175405 159987 141428 122570 104828 88855 75267 64181 54918
57548 54918 46878 40153 34815 30368 26451 23306 20983 18861 16540 14477 13069 11878 10437 9084
57534 9084 8275 7743 7060 6413 6135 6027 5790 5578 5529 5351 4926 4686 4837 4872 4433 3976 3930 3945 3590 3133 2892
57513 2892 2540 1740 867 352 -87 -839 -1634 -2074 -2362 -2826 -3254 -3387 -3488 -3748 -3732 -3088 -2246 -1766 -1547 -1341
57493 -1341 -1393 -1871 -2322 -2418 -2693 -3729 -5209 -6517 -7703 -9075 -10395 -11323 -12156 -13310 -14519 -15319 -15876
$$ packed form
57605E3243k028k505k314j683j581j969j929j391j107j186j075q42r93j295j146
57590C0199q35j062j509j323p11n42p19m47J73L71K51N63J167J283J111J566K571
57573C2107L176L320L943N303O704P975R718J1983J4029J5590J7002J7870J6867
57560A65587J3102O834j027r091j5418j8559j8858j7742j5973j3588j1086r263
57548E4918q040o725n338m447l917l145k323k122k321k063j408j191j441j353
57534I084q09n32o83o47k78j08k37k12m9j78m25k40J51L5m39m57m6J5l55m57k41
57513B892l52q00H67C52h7p52p95m40k88m64m28j33j01k60J6O44Q42M80K19K06
57493a341n2m78m51r6k75j036j480j308j186j372j320r28q33j154j209q00n57
$$ plain form
57476 -15876 -16584 -17324 -17845 -18414 -19296 -20099 -20387 -20479 -20883 -21406 -21633 -21795 -22312 -22937 -23185 -23237 -23579 -24087 -24324 -24399
57456 -24399 -24702 -25102 -25224 -25221 -25472 -25793 -25734 -25403 -25255 -25283 -25185 -25052 -25202 -25511 -25629 -25612 -25704 -25775 -25605 -25435 -25600 -25892
57434 -25892 -25958 -25999 -26434 -27165 -27839 -28490 -29246 -29783 -29771 -29578 -29761 -30200 -30423 -30518 -30945 -31672 -32268 -32620 -32911 -33072
57414 -33072 -32944 -32751 -32772 -32784 -32441 -31951 -31729 -31691 -31533 -31411 -31650 -32056 -32224 -32257 -32505 -32879 -33112 -33436 -34253 -35405
57394 -35405 -36457 -37493 -38897 -40572 -42074 -43328 -44549 -45680 -46552 -47348 -48270 -49028 -49340 -49589 -50295 -51250
57378 -51250 -51918 -52358 -52984 -53714 -54206 -54651 -55476 -56454 -57005 -57189 -57562 -58189 -58616 -58722 -58805 -58903 -58841 -58828 -59260 -60007
57358 -60007 -60618 -61129 -61910 -62875 -63610 -64189 -65062 -66215 -67215 -68020 -69011 -70240 -71399 -72452 -73602 -74690 -75383
57341 -75383 -75863 -76606 -77537 -78163 -78464 -78901 -79559 -80056 -80336 -80816 -81695 -82749 -83847 -85022 -86078 -86768 -87303 -88067
$$ packed form
57476a5876p08p40n21n69q82q03k88r2m04n23k27j62n17o25k48n2l42n08k37p5
57456b4399l03m00j22Lk51l21N9L31J48k8R8J33j50l09j18J7r2p1J70J70j65k92
57434b5892o6m1m35p31o74o51p56n37J2J93j83m39k23r5m27p27n96l52k91j61
57414c3072J28J93k1j2L43M90K22L8J58J22k39m06j68l3k48l74k33l24q17j152
57394c5405j052j036j404j675j502j254j221j131q72p96r22p58l12k49p06r55
57378e1250o68m40o26p30m92m45q25r78n51j84l73o27m27j06q3r8O2J3m32p47
57358f0007o11n11p81r65p35n79q73j153j000q05r91j229j159j053j150j088o93
57341g5383m80p43r31o26l01m37o58m97k80m80q79j054j098j175j056o90n35p64
$$ plain form
57323 -88067 -88921 -89435 -89676 -90069 -90593 -90876 -91010 -91490 -92375 -93261 -94044 -94987 -96017 -96718 -97067 -97475 -98077 -98632 -99142
57304 -99142 -99852 -100670 -101263 -101713 -102405 -103269 -103867 -104218 -104796 -105698 -106522 -107102 -107681 -108299 -108709 -108949 -109356 -109966 -110527
57285 -110527 -111086 -111867 -112677 -113144 -113497 -114338 -115651 -116837 -117732 -118776 -120110 -121335 -122318 -123412 -124739 -125958
57269 -125958 -126948 -127995 -129158 -130131 -130894 -131837 -133097 -134395 -135645 -137068 -138571 -139708 -140403 -141109 -142095 -143187
57253 -143187 -144298 -145548 -146762 -147502 -147758 -148001 -148430 -148787 -149003 -149392 -150091 -150914 -151862 -153164 -154756 -156277 -157679
57236 -157679 -159244 -160989 -162674 -164378 -166405 -168632 -170648 -172517 -174679 -177065 -179137 -180836 -182699 -184900
57222 -184900 -187003 -188804 -190643 -192687 -194677 -196575 -198739 -201247 -203726 -206023 -208339 -210596 -212383 -213714
57208 -213714 -215113 -216791 -218470 -220132 -222148 -224464 -226488 -228007 -229462 -231079 -232547 -233813 -235385 -237491
$$ packed form
57323h8067q54n14k41l93n24k83j34m80q85q86p83r43j030p01l49m08o02n55n10
57304i9142p10q18n93m50o92q64n98l51n78r02q24n80n79o18m10k40m07o10n61
57285a10527n59p81q10m67l53q41j313j186q95j044j334j225r83j094j327j219
57269a25958r90j047j163r73p63r43j260j298j250j423j503j137o95p06r86j092
57253a43187j111j250j214p40k56k43m29l57k16l89o99q23r48j302j592j521j402
57236a57679j565j745j685j704k027k227k016j869k162k386k072j699j863k201
57222a84900k103j801j839k044j990j898k164k508k479k297k316k257j787j331
57208b13714j399j678j679j662k016k316k024j519j455j617j468j266j572k106
$$ plain form
57194 -237491 -239664 -241555 -243429 -245538 -247642 -249565 -251582 -253907 -256332 -258711 -261253 -264058 -266878 -269610
57180 -269610 -272472 -275495 -278400 -281186 -284250 -287734 -291323 -294889 -298692 -302716 -306422 -309405 -311741 -313525
57166 -313525 -314671 -315340 -315994 -316815 -317608 -318409 -319560 -321115 -322796 -324620 -326883 -329433 -331700 -333618 -335768
57151 -335768 -338424 -341203 -343818 -346460 -349206 -351817 -354341 -357178 -360357 -363439 -366367 -369604 -373228 -376659
57137 -376659 -379570 -382328 -385218 -387987 -390407 -392588 -394398 -395270 -394877 -393407 -391047 -387890 -384572 -382184 -381259
57122 -381259 -381467 -382442 -384113 -386044 -387304 -387331 -386195 -383791 -379646 -373795 -367109 -360440 -354201 -348977 -345696
57107 -345696 -344829 -346102 -349313 -354662 -362034 -370778 -380500 -391350 -403249 -415585 -427968 -440553 -453393
57094 -453393 -466188 -478890 -491780 -504793 -517526 -530049 -542842 -555807 -568250 -580015 -591681
$$ packed form
57194b37491k173j891j874k109k104j923k017k325k425k379k542k805k820k732
57180b69610k862l023k905k786l064l484l589l566l803m024l706k983k336j784
57166c13525j146o69o54q21p93q01j151j555j681j824k263k550k267j918k150
57151c35768k656k779k615k642k746k611k524k837l179l082k928l237l624l431
57137c76659k911k758k890k769k420k181j810q72L93J470K360L157L318K388R25
57122c81259k08r75j671j931j260k7J136K404M145N851O686O669O239N224L281
57107c45696Q67j273l211n349p372q744r722j0850j1899j2336j2383j2585j2840
57094d53393j2795j2702j2890j3013j2733j2523j2793j2965j2443j1765j1666
$$ plain form
57083 -591681 -603507 -615112 -626416 -637880 -649562 -660937 -671916 -683080 -694625 -706022 -716990
57072 -716990 -727912 -739086 -750492 -762461 -775551 -789587 -803837 -818298 -833726 -850372 -867931
57061 -867931 -886884 -908578 -933683 -961813 -992945 -1027873 -1066876 -1109193 -1154248 -1202202 -1252975
57050 -1252975 -1305931 -1360903 -1418354 -1478259 -1539997 -1603547 -1669550 -1738007 -1808285 -1880582 -1956026
57039 -1956026 -2035047 -2117016 -2201683 -2289607 -2381136 -2476385 -2576275 -2682040 -2793805 -2911276 -3035686
57028 -3035686 -3169181 -3312414 -3464806 -3627074 -3801233 -3988147 -4187497 -4400291 -4628938
57019 -4628938 -4874703 -5137750 -5419963 -5725077 -6055732 -6413202 -6800417 -7222379 -7683286
57010 -7683286 -8186390 -8737361 -9344939 -10018160 -10766563 -11603942 -12549013 -13622861 -14850617
$$ packed form
57083e91681j1826j1605j1304j1464j1682j1375j0979j1164j1545j1397j0968
57072g16990j0922j1174j1406j1969j3090j4036j4250j4461j5428j6646j7559
57061h67931j8953k1694k5105k8130l1132l4928l9003m2317m5055m7954n0773
57050a252975n2956n4972n7451n9905o1738o3550o6003o8457p0278p2297p5444
57039a956026p9021q1969q4667q7924r1529r5249r9890j05765j11765j17471j24410
57028c035686j33495j43233j52392j62268j74159j86914j99350k12794k28647
57019d628938k45765k63047k82213l05114l30655l57470l87215m21962m60907
57010g683286n03104n50971o07578o73221p48403q37379r45071j073848j227756
$$ plain form
57001 -14850617 -16267579 -17921734 -19872532 -22194628 -24986320 -28372577 -32502095 -37547776
56993 -37547776 -43708236 -51196516 -60217055 -70948370 -83534760 -98072045 -114585766
56986 -114585766 -133017445 -153215540 -174909537 -197678570 -220963497 -244135682 -266569652
56979 -266569652 -287676772 -306920896 -323831362 -337962150 -348772476 -355543276 -357488912
56972 -357488912 -354050467 -345157913 -331275499 -313251003 -292116244 -268934700 -244700873
56965 -244700873 -220279968 -196388970 -173602117 -152351596 -132922011 -115459749 -99999566
56958 -99999566 -86489863 -74811141 -64798634 -56268780 -49036183 -42919579 -37748487 -33372301
56950 -33372301 -29662350 -26507033 -23810243 -21493987 -19496390 -17764998 -16254425 -14928942
$$ packed form
57001a4850617j416962j654155j950798k322096k791692l386257m129518n045681
56993c7547776o160460p488280r020539j0731315j2586390j4537285j6513721
56986a14585766j8431679k0198095k1693997k2769033k3284927k3172185k2433970
56979b66569652k1107120j9244124j6910466j4130788j0810326o770800j945636
56972c57488912L438445Q892554J3882414J8024496K1134759K3181544K4233827
56965b44700873K4420905K3890998K2786853K1250521J9429585J7462262J5460183
56958i9999566J3509703J1678722J0012507Q529854P232597O116604N171092M376186
56950c3372301L709951L155317K696790K316256J997597J731392J510573J325483
$$ plain form
56942 -14928942 -13761531 -12728734 -11809121 -10986107 -10247773 -9583039 -8981006 -8433830 -7936536
56933 -7936536 -7483495 -7068095 -6685881 -6334787 -6011988 -5713482 -5436829 -5181337 -4945284
56924 -4945284 -4725770 -4521422 -4332519 -4158256 -3996469 -3846103 -3707284 -3578921 -3458788
56915 -3458788 -3345838 -3239638 -3137533 -3035454 -2932116 -2829906 -2731301 -2636935 -2547423 -2464146
56905 -2464146 -2387246 -2315103 -2246613 -2182086 -2121406 -2063397 -2007553 -1954401 -1903655 -1853910 -1804672
56894 -1804672 -1756781 -1710322 -1663974 -1616922 -1569598 -1521996 -1473085 -1422524 -1371361 -1320463 -1269768
56883 -1269768 -1219574 -1171018 -1124790 -1080782 -1039355 -1001481 -967280 -935839 -906815 -880777 -857734
56872 -857734 -836785 -817553 -800428 -785109 -770383 -755750 -741802 -728678 -715561 -702077 -688796
$$ packed form
56942a4928942J167411J032797R19613Q23014P38334O64734O02033N47176M97294
56933g936536M53041M15400L82214L51094L22799K98506K76653K55492K36053
56924d945284K19514K04348J88903J74263J61787J50366J38819J28363J20133
56915c458788J12950J06200J02105J02079J03338J02210R8605R4366Q9512Q3277
56905b464146P6900P2143O8490O4527O0680N8009N5844N3152N0746M9745M9238
56894a804672M7891M6459M6348M7052M7324M7602M8911N0561N1163N0898N0695
56883a269768N0194M8556M6228M4008M1427L7874L4201L1441K9024K6038K3043
56872h57734K0949J9232J7125J5319J4726J4633J3948J3124J3117J3484J3281
$$ plain form
56861 -688796 -675938 -662977 -649853 -637205 -625047 -612561 -599562 -586828 -574656 -562450 -550161
56850 -550161 -538787 -529012 -520514 -512970 -506491 -500694 -494628 -488032 -481569 -475487 -469222 -462539 -455871 -449246
56836 -449246 -442098 -434406 -426813 -419342 -411257 -402403 -393429 -384380 -374405 -363246 -351795 -340922 -331008
56823 -331008 -322868 -317677 -315435 -314717 -314364 -314272 -314252 -313506 -311736 -309573 -307347 -304608 -301251 -297944 -294979 -291846
56807 -291846 -288379 -285120 -282169 -278831 -274895 -271029 -267475 -263596 -259202 -255091 -251672 -248272 -244417 -240634
56793 -240634 -237348 -234074 -230395 -226695 -223237 -219535 -215241 -210740 -206268 -201373 -195829 -190123 -184547 -178837
56779 -178837 -173218 -168759 -166046 -164454 -163253 -162469 -162058 -161305 -159743 -157768 -155726 -153258 -150115 -146692 -143186
56764 -143186 -139122 -134269 -129106 -123824 -117827 -110808 -103339 -95769 -87527 -78284 -68992 -61126 -55676 -53334
$$ packed form
56861f88796J2858J2961J3124J2648J2158J2486J2999J2734J2172J2206J2289
56850e50161J1374R775Q498P544O479N797O066O596O463O082O265O683O668O625
56836d49246P148P692P593P471Q085Q854Q974R049R975J1159J1451J0873R914
56823c31008Q140N191K242P18L53R2K0P46J770K163K226K739L357L307K965L133
56807b91846L467L259K951L338L936L866L554L879M394M111L419L400L855L783
56793b40634L286L274L679L700L458L702M294M501M472M895N544N706N576N710
56779a78837N619M459K713J592J201P84M11P53J562J975K042K468L143L423L506
56764a43186M064M853N163N282N997P019P469P570Q242R243R292P866N450K342
$$ plain form
56750 -53334 -54586 -58834 -64289 -69496 -74261 -78650 -82091 -84187 -85413 -86175 -85992 -84366 -81684 -78444 -74339
56735 -74339 -68813 -61849 -53526 -43552 -31868 -19063 -5618 8255 21344 30877 34375 31573 24006 13520
56721 13520 1871 -9166 -18542 -26415 -33291 -39025 -43274 -46238 -48233 -49065 -48509 -46867 -44430 -40886 -35848
56706 -35848 -29441 -21868 -12993 -2948 7350 16712 24032 27940 27078 21529 13240 4385 -4095 -11964 -18711
56691 -18711 -24004 -28231 -31760 -34251 -35407 -35703 -35623 -34858 -33026 -30461 -27543 -23917 -19198 -13826 -8428
56676 -8428 -3022 2296 6508 8355 7541 4546 -151 -5936 -11734 -16700 -20860 -24492 -27440 -29644 -31608
56661 -31608 -33630 -35207 -35968 -36492 -37390 -38265 -38480 -38312 -38372 -38499 -38199 -37710 -37612 -37800 -37752 -37482 -37340 -37235 -36869
56642 -36869 -36428 -36241 -36095 -35627 -35029 -34656 -34343 -33807 -33299 -33113 -32904 -32250 -31435 -30927 -30542 -29872 -29115 -28675 -28352
$$ packed form
56750e3334j252m248n455n207m765m389l441k096j226p62J83J626K682L240M105
56735g4339N526O964Q323R974J1684J2805e618H255J3089R533L498k802p567j0486
56721A3520A871i166r376p873o876n734m249k964j995q32N56J642K437L544N038
56706c5848O407P573Q875b948G350R362P320L908q62n549q289D385d095p869o747
56691a8711n293m227l529k491j156k96Q0P65J832K565K918L626M719N372N398
56676h428c022B296M212J847q14k995a51n785n798m966m160l632k948k204j964
56661c1608k022j577p61n24q98q75k15J68o0j27L00M89R8j88M8K70J42J05L66
56642c6869M41J87J46M68N98L73L13N36N08J86K09O54Q15N08L85O70P57M40L23
$$ plain form
56623 -28352 -27723 -26935 -26363 -25898 -25287 -24760 -24571 -24375 -23808 -23196 -22957 -22786 -22235 -21603 -21375 -21299 -20882 -20335 -20112
56604 -20112 -19971 -19429 -18746 -18494 -18506 -18213 -17710 -17523 -17607 -17468 -17110 -16942 -16943 -16741 -16337 -16000 -15664 -15111 -14533 -14220
56584 -14220 -13993 -13602 -13294 -13283 -13120 -12353 -11374 -10810 -10522 -10041 -9552 -9540 -9840 -9945 -9884 -9922 -9794 -9153 -8424 -8257
56564 -8257 -8445 -8327 -7908 -7682 -7629 -7379 -7056 -7031 -7099 -6825 -6398 -6234 -6064 -5389 -4486 -3975 -3704 -3079 -2220 -1752
56544 -1752 -1658 -1414 -1050 -1029 -1240 -1138 -749 -550 -544 -385 -276 -702 -1457 -1923 -2161 -2698 -3436 -3787 -3782 -3986 -4437
56523 -4437 -4681 -4734 -4988 -5291 -5152 -4764 -4759 -5054 -4990 -4538 -4290 -4313 -4118 -3695 -3515 -3487 -3034 -2199 -1621 -1361 -842
56502 -842 -24 427 278 46 61 121 208 605 1199 1552 1701 2045 2457 2433 2082 2013 2287 2432 2447 2767 3284 3430
56480 3430 3227 3227 3411 3238 2808 2844 3449 3945 4049 4176 4466 4584 4575 4857 5273 5215 4819 4909 5650 6331 6629 6977
$$ packed form
56623b8352O29P88N72M65O11N27J89J96N67O12K39J71N51O32K28P6M17N47K23
56604b0112J41N42O83K52j2K93N03J87q4J39L58J68jK02M04L37L36N53N78L13
56584a4220K27L91L08J1J63P67R79N64K88M81M89J2l00j05O1l8J28O41P29J67
56564h257j88J18M19K26N3K50L23K5o8K74M27J64J70O75R03N11K71O25Q59M68
56544a752R4K44L64K1k11J02L89J99OJ59J09m26p55m66k38n37p38l51Nk04m51
56523d437k44n3k54l03J39L88Nk95O4M52K48k3J95M23J80K8M53Q35N78K60N19
56502h42b4D27j49D6J5O0Q7L97N94L53J49L44M12k4l51o9K74J45J5L20N17J46
56480C430k03%J84j73m30L6O05M96J04J27K90J18rK82M16n8l96R0P41O81K98L48
$$ plain form
56458 6977 7530 7907 8156 8882 10151 11348 12317 13578 15208 16622 17697 18993 20601 21879 22634 23428
56442 23428 24421 24992 24916 24805 25024 25199 25141 25232 25509 25388 24700 24029 23659 23175 22454 22034 22079 21996 21497 21094 21122
56421 21122 21210 21123 21188 21479 21518 21175 20969 21090 21043 20611 20261 20236 20168 19925 19889 20058 19827 19045 18329 18015 17747 17411
56399 17411 17444 17846 17922 17441 17033 17054 17048 16764 16640 16827 16778 16314 16112 16609 17320 17713 17889 17975 17802 17584 17926
56378 17926 18750 19212 19063 19030 19455 19685 19315 18925 19022 19297 19481 19922 20712 21260 21304 21392 21836 22162 22081 22012 22111
56357 22111 21884 21241 20883 21071 21110 20610 20184 20276 20428 20325 20448 21024 21425 21323 21353 21919 22436 22450 22424 22711 22843
56336 22843 22572 22512 22980 23277 22943 22618 22842 23098 22904 22802 23334 24023 24278 24368 24623 24640 24171 23858 24199 24688
56316 24688 24812 24952 25460 25843 25701 25529 25732 25842 25542 25425 25851 26150 25867 25732 26366 27091 27117 26890 27179
$$ packed form
56458F977N53L77K49P26J269J197R69J261J630J414J075J296J608J278P55P94
56442B3428R93N71p6j11K19J75n8R1K77j21o88o71l70m84p21m20M5q3m99m03K8
56421B1122Q8q7O5K91L9l43k06J21m7m32l50k5o8k43l6J69k31p82p16l14k68l36
56399A7411L3M02P6m81m08K1ok84j24J87m9m64k02M97P11L93J76Q6j73k18L42
56378A7926Q24M62j49l3M25K30l70l90R7K75J84M41P90N48M4Q8M44L26q1o9R9
56357B2111k27o43l58J88L9n00m26R2J52j03J23N76M01j02L0N66N17J4k6K87J32
56336B2843k71o0M68K97l34l25K24K56j94j02N32O89K55R0K55J7m69l13L41M89
56316B4688J24J40N08L83j42j72K03J10l00j17M26K99k83j35O34P25K6k27K89
$$ plain form
56297 27179 27747 28072 28460 29331 30222 30609 30905 31611 32287 32394 32337 32666 33042 33020 33006 33446 33893 33869 33784 34063 34252
56276 34252 33979 33880 34493 35191 35261 35133 35458 35878 35861 35828 36276 36700 36516 36205 36403 36716 36628 36630 37289 38054 38211
56255 38211 38139 38449 38764 38577 38412 38853 39332 39151 38835 39166 39746 39832 39724 39995 40238 39936 39682 40152 40751 40698
56235 40698 40572 41279 42351 42773 42746 43047 43439 43276 42990 43393 44114 44285 44138 44447 45039 45343 45734 46789 47894
56216 47894 48115 47857 48099 48658 48755 48675 49235 50190 50779 51243 52257 53398 53824 53917 54655 55869 56730 57414 58674
56197 58674 60258 61363 62170 63347 64614 65358 66102 67737 69828 71347 72514 74233 76269 77744 78900
56182 78900 80596 82574 83949 84990 86618 88599 90016 91074 92673 94645 96196 97667 100040 103105
56168 103105 105940 108791 112636 117296 121875 126648 132651 139717 146862 154256 162939 172902 183395 194825
$$ packed form
56297B7179N68L25L88Q71Q91L87K96P06O76J07n7L29L76k2j4M40M47k4q5K79J89
56276C4252k73r9O13O98P0j28L25M20j7l3M48M24j84l11J98L13q8KO59P65J57
56255C8211p2L10L15j87j65M41M79j81l16L31N80Q6j08K71K43l02k54M70N99n3
56235D0698j26P07J072M22k7L01L92j63k86M03P21J71j47L09N92L04L91J055J105
56216D7894K21k58K42N59R7q0N60R55N89M64J014J141M26R3P38J214Q61O84J260
56197E8674J584J105Q07J177J267P44P44J635K091J519J167J719K036J475J156
56182G8900J696J978J375J041J628J981J417J058J599J972J551J471K373L065
56168A03105K835K851L845M660M579M773O003P066P145P394Q683R963J0493J1430
$$ plain form
56154 194825 208378 224079 241102 259699 280869 304424 329374 355948 385194 416838 449551
56143 449551 483064 517961 553610 588341 621488 653170 682260 706701 725733 739760 748273 750051
56131 750051 745306 735463 720953 701368 677616 651642 624063 594299 562976 531884 501579 471297
56119 471297 441329 413142 387060 362103 338257 316649 297274 278869 261223 245403 231473
56108 231473 218262 205590 194516 185133 176319 167878 160731 154812 148980 143223 138684 135343 131933
56095 131933 128296 125518 123545 121052 117915 115425 113810 111921 109622 108049 107218 105840 103837 102587
56081 102587 102320 101724 100508 99862 100013 99833 99214 99320 100139 100318 99794 99964 100888 101045 100293 100290 101459 102321 102411
56062 102411 103026 104467 105372 105510 106418 108484 110188 111022 112381 114761 116886 118458 120909 124560 127862
$$ packed form
56154A94825J3553J5701J7023J8597K1170K3555K4950K6574K9246L1644L2713
56143D49551L3513L4897L5649L4731L3147L1682K9090K4441J9032J4027Q513J778
56131G50051m745r843j4510j9585k3752k5974k7579k9764l1323l1092l0305l0282
56119D71297k9968k8187k6082k4957k3846k1608j9375j8405j7646j5820j3930
56108B31473j3211j2672j1074r383q814q441p147n919n832n757m539l341l410
56095A31933l637k778j973k493l137k490j615j889k299j573q31j378k003j250
56081A02587k67n96j216o46J51j80o19J06Q19J79n24J70R24J57p52lJ169Q62R0
56062A02411O15J441R05J38R08K066J704Q34J359K380K125J572K451L651L302
$$ plain form
56047 127862 130377 133675 138349 143004 147185 152432 159424 166951 174743 184438 196635 209889 223780
56034 223780 240076 259707 281392 304346 329335 355802 380903 402714 421714 438107 450759
56023 450759 459996 468361 477183 485191 491542 497048 501286 501905 498320 492993 487642 481309 473445 465377
56009 465377 457094 445953 430363 411706 391130 367882 342458 317919 296170 276161 257422 241895
55997 241895 230409 220870 211915 204938 200607 196938 192870 190214 189906 189880 188810 188365 189583 190612 190341
55982 190341 190623 192554 194190 194359 195023 197401 199478 199899 200583 202855 204756 204852 204920 206152 206561 204945 203534
55965 203534 203858 203929 202432 201671 203271 205018 205148 205708 208370 211051 212074 213566 217232 220863 222627 224655
55949 224655 228753 232755 234844 237271 241913 246479 249052 252043 257535 263054 266199 269109 274073 279047
$$ packed form
56047A27862K515L298M674M655M181N247O992P527P792R695J2197J3254J3891
56034B23780J6296J9631K1685K2954K4989K6467K5101K1811J9000J6393J2652
56023D50759R237Q365Q822Q008O351N506M238O19l585n327n351o333p864q068
56009D65377q283j1141j5590j8657k0576k3248k5424k4539k1749k0009j8739j5527
55997B41895j1486r539q955o977m331l669m068k656l08k6j070m45J218J029k71
55982A90341K82J931J636J69O64K378K077M21O84K272J901R6O8J232M09j616j411
55965B03534L24P1j497p61J600J747J30N60K662K681J023J492L666L631J764K028
55949B24655M098M002K089K427M642M566K573K991N492N519L145K910M964M974
$$ plain form
55935 279047 281910 284696 289151 292622 292943 292831 294802 296444 295544 295092 298144 302527 305766 310320 318574
55920 318574 327663 334748 342446 353390 364635 373280 382335 394930 408069 418420 428859 442725
55908 442725 457161 468918 481142 497342 514333 528445 542930 561693 581584 598714 616356
55897 616356 638507 661811 682231 703406 729681 757375 782045 807676 839187 872777 903640
55886 903640 936113 975723 1018524 1059265 1102538 1154325 1210342 1264897 1323205 1392117 1467153
55875 1467153 1542237 1623473 1718876 1823620 1930847 2047497 2183158 2333432 2491983 2668464
55865 2668464 2875585 3109841 3365719 3657143 4002693 4402785 4856573 5388085 6028791
55856 6028791 6789598 7680813 8743655 10028324 11561381 13378918 15577448 18290895
$$ packed form
55935B79047K863K786M455L471L21j12J971J642r00m52L052M383L239M554Q254
55920C18574R089P085P698J0944J1245Q645R055J2595J3139J0351J0439J3866
55908D42725J4436J1757J2224J6200J6991J4112J4485J8763J9891J7130J7642
55897F16356K2151K3304K0420K1175K6275K7694K4670K5631L1511L3590L0863
55886I03640L2473L9610M2801M0741M3273N1787N6017N4555N8308O8912P5036
55875A467153P5084Q1236R5403J04744J07227J16650J35661J50274J58551J76481
55865B668464K07121K34256K55878K91424L45550M00092M53788N31512O40706
55856F028791P60807Q91215J062842J284669J533057J817537K198530K713447
$$ plain form
55848 18290895 21642520 25768261 30838837 36959761 44064143 51989160 60571797 69398503
55840 69398503 77347822 82641872 83735720 80327696 73495444 64902889 55940321 47448192
55832 47448192 39864764 33368484 27932890 23423391 19709839 16683772 14220206 12192378
55824 12192378 10516386 9140832 8006157 7050237 6239991 5562077 4990938 4494271 4059550
55815 4059550 3687192 3365167 3074558 2812315 2585226 2387703 2206350 2040116 1895957
55806 1895957 1770034 1651761 1541372 1445961 1362723 1282580 1206086 1140127 1082810 1026448 971808
55795 971808 925180 884741 843377 801888 766453 735945 704198 672085 645348 622941 599066
55784 599066 574432 554428 538276 520697 502292 487972 476982 464485 451241 442039 436201 428962
$$ packed form
55848A8290895L351625M125741N070576O120924P104382P925017Q582637Q826706
55840F9398503P949319N294050J093848l408024o832252q592555q962568q492129
55832D7448192p583428o496280n435594m509499l713552l026067k463566k027828
55824A2192378j675992j375554j134675r55920q10246o77914n71139m96667m34721
55815D059550l72358l22025k90609k62243k27089j97523j81353j66234j44159
55806A895957j25923j18273j10389r5411q3238q0143p6494o5959n7317n6362n4640
55795I71808m6628m0439m1364m1489l5435l0508l1747l2113k6737k2407k3875
55784E99066k4634k0004j6152j7579j8405j4320j0990j2497j3244r202n838p239
$$ plain form
55772 428962 420572 414885 410472 402217 390401 379590 369830 357490 343591 332783 324969 316052 306108
55759 306108 298887 294032 287610 279743 274135 270493 264683 256000 247317 238590 227176 214217 203850
55746 203850 196357 188510 180251 174555 171086 166473 160656 156729 154713 151631 147551 145418 145008 143072
55732 143072 139472 137311 136900 135408 132572 131130 131376 130782 129269 129457 131476 132769 133258 135473 139318
55717 139318 141871 142718 144417 147354 149117 149353 150321 152179 152531 151127 150290 150202 148432 144655 141242 138647
55701 138647 134771 129463 125177 122505 119425 115627 113239 112549 111267 108755 106915 106181 104753 102508 101627
55686 101627 102543 103221 103168 104227 106595 107958 107442 106681 106196 104467 101418 99089 97933 96023 92800 90049
55670 90049 88377 86231 83256 81077 79907 77905 74763 72487 71716 70701 68826 67708 67849 67608 66511
$$ packed form
55772D28962q390n687m413q255j1816j0811r760j2340j3899j0808p814q917r944
55759C06108p221m855o422p867n608l642n810q683q683q727j1414j2959j0367
55746B03850p493p847q259n696l469m613n817l927k016l082m080k133m10j936
55732A43072l600k161m11j492k836j442K46n94j513J88K019J293M89K215L845
55717A39318K553Q47J699K937J763K36R68J858L52j404q37q8j770l777l413k595
55701A38647l876n308m286k672l080l798k388o90j282k512j840p34j428k245q81
55686A01627R16O78n3J059K368J363n16p61m85j729l049k329j156j910l223k751
55670I0049j672k146k975k179j170k002l142k276p71j015j875j118J41k41j097
$$ plain form
55655 66511 66236 67248 67765 67090 66765 67310 67044 65302 63707 63062 62037 60092 58710 58533 58156 56903 55954
55638 55954 55669 54671 52708 51537 51841 52069 51403 51061 51553 51545 50627 50392 51480 52314 51987 51724 52208 52161 50929
55619 50929 49851 49700 49306 48014 47062 47156 47113 46209 45514 45653 45589 44897 44855 46000 46934 46806 46684 47285 47675
55600 47675 47480 47979 49683 51104 51290 51285 51841 51960 51099 50510 50962 51326 50858 50683 51583 52462 52493 52683 53797
55581 53797 54815 54934 55134 56230 57295 57567 57990 59369 60843 61637 62544 64179 65602 66113 66664 68031
55565 68031 69341 69830 70279 71269 71780 71003 69819 69040 67875 65634 63253 61649 60171 58131 56251 55118
55549 55118 53840 51724 49710 48691 47946 46721 45748 45684 45608 44637 43562 43317 43288 42650 41980 42012 42153 41712
55531 41712 41277 41416 41371 40505 39663 39636 39654 38881 38033 37989 38156 37726 37283 37572 37941 37563 37008 37065 37177 36596 35899
$$ packed form
55655F6511k75J012N17o75l25N45k66j742j595o45j025j945j382j77l77j253r49
55638E5954k85r98j963j171L04K28o66l42M92qr18k35J088Q34l27k63M84m7j232
55619E0929j078j51l94j292r52R4m3r04o95J39o4o92m2J145R34j28j22O01L90
55600D7675j95M99J704J421J86nN56J19q61n89M52L64m68j75R00Q79L1J90J114
55581E3797J018J19K00J096J065K72M23J379J474P94R07J635J423N11N51J367
55565F8031J310M89M49R90N11p77j184p79j165k241k381j604j478k040j880j133
55549E5118j278k116k014j019p45j225r73o4p6r71j075k45k9o38o70L2J41m41
55531D1712m35J39m5q66q42k7J8p73q48m4J67m30m43K89L69l78n55N7J12n81o97
$$ plain form
55510 35899 35863 35934 35353 34684 34720 34936 34519 33878 33689 33507 32780 32172 32383 32723 32296 31601 31521 31728 31544 31356
55490 31356 31736 32142 31939 31712 32139 32586 32282 31848 32179 32776 32750 32501 32876 33561 33820 33998 34716 35430 35347 34962
55470 34962 35220 35880 36218 36554 37598 38967 39831 40371 41204 42046 42312 42366 42781 43103 42677 41969 41742 41661 41080
55451 41080 40400 40293 40339 39870 39381 39659 40260 40320 40140 40454 40858 40514 39781 39578 39698 39289 38468 37969 37651 36846
55431 36846 35744 35044 34637 33982 33289 33047 32913 32368 31902 32210 32799 32785 32469 32682 33145 32959 32225 31702 31325
55412 31325 30537 29657 29427 29616 29480 29194 29430 29938 30012 29920 30405 31152 31253 30856 30829 31095 30842 30122 29768 29879
55392 29879 29837 29649 29858 30289 30258 29884 29862 30115 29955 29451 29285 29438 29301 28930 28897 29072 28841 28355 28293 28552 28462
55371 28462 28114 28170 28527 28462 27992 27779 27836 27605 27205 27263 27646 27637 27290 27307 27652 27606 27175 27118 27566 27870 27856 27984
$$ packed form
55510C5899l6P1n81o69L6K16m17o41j89j82p27o08K11L40m27o95q0K07j84j88
55490C1356L80M06k03k27M27M47l04m34L31N97k6k49L75O85K59J78P18P14q3l85
55470C4962K58O60L38L36J044J369Q64N40Q33Q42K66N4M15L22m26p08k27q1n81
55451D1080o80j07M6m69m89K78O01O0j80L14M04l44p33k03J20m09q21m99l18q05
55431C6846j102p00m07o55o93k42j34n45m66L08N89j4l16K13M63j86p34n23l77
55412C1325p88q80k30J89j36k86K36N08P4r2M85P47J01l97k7K66k53p20l54J11
55392B9879m2j88K09M31l1l74k2K53j60n04j66J53j37l71l3J75k31m86o2K59r0
55371B8462l48N6L57o5m70k13N7k31m00N8L83rl47J7L45m6m31n7M48L04j4J28
$$ plain form
55349 27984 28256 28181 27847 27859 28188 28228 27980 28049 28481 28749 28827 29174 29648 29632 29198 29009 29140 29080 28857 28948 29198 29021
55327 29021 28609 28733 29359 29716 29674 29834 30233 30267 29931 29890 30210 30248 29901 29766 29962 29984 29790 29891 30239 30243 29927
55306 29927 29888 30026 29607 28676 28168 28395 28657 28538 28391 28324 27955 27406 27359 27833 28051 27777 27623 27817 27817 27451 27271
55285 27271 27438 27394 26987 26817 27105 27289 27144 27208 27711 28105 28073 28014 28133 28020 27555 27298 27542 27856 27925 28031 28331
55264 28331 28491 28391 28404 28657 28810 28804 29025 29519 29835 29844 29918 30111 30044 29743 29691 29892 29788 29288 28904 28735 28283 27516
55242 27516 27101 27315 27654 27817 28079 28462 28467 27972 27489 27247 26935 26572 26676 27286 27763 27874 28116 28685 29103 29139
55222 29139 29181 29354 29213 28671 28288 28304 28287 28047 27968 28115 28000 27568 27448 27833 28098 27913 27793 28136 28596 28860
55202 28860 29125 29405 29296 28822 28617 28872 28990 28683 28432 28486 28369 27868 27563 27839 28286 28566 28971 29623 30001
$$ packed form
55349B7984K72p5l34J2L29M0k48O9M32K68P8L47M74j6m34j89J31o0k23R1K50j77
55327B9021m12J24O26L57m2J60L99L4l36m1L20L8l47j35J96K2j94J01L48Ml16
55306B9927l9J38m19r31n08K27K62j19j47o7l69n49m7M74K18k74j54J94%l66j80
55285B7271J67m4m07j70K88J84j45O4N03L94l2n9J19j13m65k57K44L14O9J06L00
55264B8331J60j00J3K53J53oK21M94L16RP4J93o7l01n2K01j04n00l84j69m52p67
55242B7516m15K14L39J63K62L83Nm95m83k42l12l63J04O10M77J11K42N69M18L6
55222B9139M2J73j41n42l83J6j7k40p9J47j15m32j20L85K65j85j20L43M60K64
55202B8860K65K80j09m74k05K55J18l07k51N4j17n01l05K76M47K80M05O52L78
$$ plain form
55183 30001 29809 29459 29211 28712 27879 27330 27386 27532 27393 27361 27695 27889 27571 27192 27192 27267 27097 27022 27350 27710 27726
55162 27726 27638 27713 27727 27542 27515 27819 28052 28004 28083 28489 28781 28707 28700 29009 29176 28915 28710 28935 29204 29182 29238 29665 30041
55139 30041 30004 29895 30026 30058 29762 29613 29915 30093 29609 28865 28466 28247 27812 27367 27272 27339 27295 27402 27921 28484 28680
55118 28680 28727 28950 29171 29198 29333 29765 30070 29923 29699 29755 29782 29497 29308 29575 29874 29733 29488 29637 29925 29869 29640
55097 29640 29634 29646 29281 28723 28409 28313 28218 28274 28600 28797 28510 28061 27903 27899 27746 27624 27791 28013 28025 28094 28502 28967
55075 28967 29171 29341 29720 29995 29886 29732 29849 29895 29560 29307 29640 30179 30259 29969 29824 29859 29813 29817 30100 30408 30423
55054 30423 30386 30606 30796 30583 30279 30385 30739 30892 30900 31051 31170 30966 30705 30809 31116 31206 31103 31028 30834 30391 30084
55033 30084 30269 30609 30633 30515 30651 30896 30948 31015 31393 31787 31834 31839 32234 32725 32776 32507 32347 32186 31762 31430 31703
$$ packed form
55183C0001j92l50k48m99q33n49N6J46j39l2L34J94l18l79%P5j70p5L28L60J6
55162B7726q8P5J4j85k7L04K33m8P9M06K92p4pL09J67k61k05K25K69k2N6M27L76
55139C0041l7j09J31L2k96j49L02J78m84p44l99k19m35m45r5O7m4J07N19N63J96
55118B8680M7K23K21K7J35M32L05j47k24N6K7k85j89K67K99j41k45J49K88n6k29
55097B9640oJ2l65n58l14r6r5N6L26J97k87m49j58mj53j22J67K22J2O9M08M65
55075B8967K04J70L79K75j09j54J17M6l35k53L33N39Q0k90j45L5m6MK83L08J5
55054C0423l7K20J90k13l04J06L54J53QJ51J19k04k61J04L07R0j03p5j94m43l07
55033C0084J85L40K4j18J36K45N2O7L78L94M7NL95M91N1k69j60j61m24l32K73
$$ plain form
55012 31703 32326 32658 32647 32646 32607 32303 31988 32029 32163 31973 31761 32102 32842 33371 33609 33839 33904 33505 33002 32999 33312 33255
54990 33255 32764 32366 32195 31952 31702 31818 32231 32543 32765 33169 33583 33608 33388 33349 33379 33102 32760 32909 33419 33675
54970 33675 33663 33921 34477 34776 34645 34460 34340 34000 33453 33062 32858 32554 32215 32191 32407 32454 32316 32302 32322 32022 31567
54949 31567 31486 31791 32026 32126 32437 32906 33090 32991 33061 33346 33401 33123 32904 32893 32831 32663 32627 32703 32646 32562 32731 32970
54927 32970 32880 32651 32803 33218 33305 33076 33142 33592 33808 33546 33270 33251 33181 32926 32853 33117 33319 33184 32929 32756 32561
54906 32561 32335 32262 32306 32292 32396 32951 33707 34011 33776 33546 33569 33534 33360 33416 33775 34031 34037 34114 34333 34324 34014 33836 33955
54883 33955 34001 33812 33759 34074 34486 34807 35240 35843 36281 36397 36476 36699 36892 37016 37341 37887 38254 38226 38049 37923
54863 37923 37757 37568 37598 37841 38000 38028 38196 38517 38680 38672 38840 39214 39427 39416 39564 39976 40268 40304 40463 40929 41397
$$ packed form
55012C1703O23L32j1jl9l04l15M1J34j90k12L41P40N29K38K30O5l99n03lL13n7
54990C3255m91l98j71k43k50J16M13L12K22M04M14K5k20l9L0k77l42J49N10K56
54970C3675j2K58N56K99j31j85j20l40n47l91k04l04l39k4K16M7j38j4K0l00m55
54949C1567q1L05K35J00L11M69J84r9P0K85N5k78k19j1o2j68l6P6n7q4J69K39
54927C2970r0k29J52M15Q7k29O6M50K16k62k76j9p0k55p3K64K02j35k55j73j95
54906C2561k26p3M4j4J04N55P56L04k35k30K3l5j74N6L59K56OP7K19rl10j78J19
54883C3955M6j89n3L15M12L21M33O03M38J16P9K23J93J24L25N46L67k8j77j26
54863C7923j66j89L0K43J59K8J68L21J63qJ68L74K13j1J48M12K92L6J59M66M68
$$ plain form
54842 41397 41728 42288 43325 44582 45822 47212 48902 50752 52730 55029 57578 59926 61838 63486 64844
54827 64844 65463 65073 63897 62191 59997 57523 55208 53173 51138 49049 47253 45911 44792 43829 43253
54812 43253 43031 42765 42369 42210 42373 42425 42138 41802 41599 41289 40826 40594 40782 41110 41485 42282 43642 45135 46466
54793 46466 47924 49798 51909 54066 56402 58873 61027 62600 63800 64684 64813 63913 62329 60458 58298
54778 58298 55877 53584 51680 49979 48358 47034 45996 44786 43228 41827 40976 40358 39588 38881 38604 38623
54762 38623 38592 38467 38306 37954 37368 36847 36568 36302 35945 35804 36005 36112 35793 35361 35212 35192 34992 34749 34716 34731
54742 34731 34536 34297 34335 34611 34889 35130 35324 35268 34866 34386 34094 33940 33863 34033 34490 34921 35105 35201 35320 35273 35037
54721 35037 35004 35403 35907 36165 36285 36424 36378 36022 35705 35759 35991 36068 36033 36061 36108 36191 36588 37355 38047 38301 38342 38515
$$ packed form
54842D1397L31N60J037J257J240J390J690J850J978K299K549K348J912J648J358
54827F4844O19l90j176j706k194k474k315k035k035k089j796j342j119r63n76
54812D3253k22k66l96j59J63N2k87l36k03l10m63k32J88L28L75P97J360J493J331
54793D6466J458J874K111K157K336K471K154J573J200Q84J29r00j584j871k160
54778E8298k421k293j904j701j621j324j038j210j558j401q51o18p70p07k77J9
54762C8623l1j25j61l52n86n21k79k66l57j41K01J07l19m32j49k0k00k43l3J5
54742C4731j95k39L8K76K78K41J94n6m02m80k92j54p7J70M57M31J84R6J19m7k36
54721C5037l3L99N04K58J20J39m6l56l17N4K32P7l5K8M7Q3L97P67O92K54M1J73
$$ plain form
54699 38515 38741 38833 38937 39227 39546 39745 40020 40510 40974 41245 41595 42240 42951 43517 44191 45215 46399 47596
54681 47596 49151 51343 53854 56287 58765 61477 64045 65942 67184 68057 68520 68464 68226 68247 68479 68642 68825
54664 68825 69291 69924 70367 70494 70319 69720 68726 67783 67279 67018 66557 65714 64398 62367 59677 56985 54884
54647 54884 53237 51665 50318 49592 49447 49583 49998 50809 51803 52762 53953 55729 57901 60027 62031 63978
54631 63978 65539 66325 66452 66186 65309 63507 61136 58924 57037 55116 53066 51166 49498 47903 46461
54616 46461 45413 44646 43812 42892 42160 41644 41151 40722 40574 40644 40666 40593 40529 40366 39946 39456 39184 39056 38860 38761
54596 38761 39049 39551 39838 39880 39961 40067 39946 39664 39560 39685 39812 39930 40224 40600 40746 40662 40639 40736 40713 40486 40216
54575 40216 39979 39733 39542 39495 39454 39246 38985 38850 38717 38396 38032 37862 37792 37638 37567 37802 38109 38121 37947 37955 38129
$$ packed form
54699C8515K26R2J04K90L19J99K75M90M64K71L50O45P11N66O74J024J184J197
54681D7596J555K192K511K433K478K712K568J897J242Q73M63n6k38K1K32J63J83
54664F8825M66O33M43J27j75n99r94r43n04k61m61q43j316k031k690k692k101
54647E4884j647j572j347p26j45J36M15Q11R94R59J191J776K172K126K004J947
54631F3978J561P86J27k66q77j802k371k212j887j921k050j900j668j595j442
54616D6461j048p67q34r20p32n16m93m29j48P0K2p3o4j63m20m90k72j28j96r9
54596C8761K88N02K87M2Q1J06j21k82j04J25J27J18K94L76J46q4k3R7k3k27k70
54575D0216k37k46j91m7m1k08k61j35j33l21l64j70p0j54p1K35L07J2j74QJ74
$$ plain form
54554 38129 38196 38221 38467 38801 38853 38664 38605 38716 38714 38573 38538 38615 38624 38682 39069 39632 39902 39799 39704 39790 39841 39734 39578 39355
54530 39355 38932 38423 38115 38009 37882 37743 37755 37803 37653 37471 37638 38077 38313 38192 37999 37913 37842 37813 37976 38217 38292
54509 38292 38321 38651 39234 39704 40011 40405 40810 40815 40356 39808 39350 38828 38308 38180 38531 38977 39274 39575 39982 40309
54489 40309 40460 40578 40710 40715 40584 40440 40197 39680 39071 38749 38678 38493 38185 38137 38413 38604 38501 38367 38390 38393 38267
54468 38267 38183 38217 38234 38268 38536 38973 39222 39215 39230 39316 39210 38944 38972 39456 39975 40183 40230 40306 40285 40116 40103 40450 40905
54445 40905 41133 41132 41034 40846 40610 40512 40626 40829 41061 41395 41720 41786 41634 41603 41766 41783 41457 41035 40796 40723 40734 40857
54423 40857 41002 40961 40781 40759 40918 40892 40533 40198 40234 40538 40830 41015 41076 40934 40631 40383 40284 40214 40135 40164 40282 40313
54401 40313 40277 40396 40698 40929 40975 40949 40843 40520 40116 40020 40294 40583 40684 40784 40997 41142 41181 41391 41891 42385 42586
$$ packed form
54554C8129O7K5K46L34N2j89n9J11kj41l5P7RN8L87N63K70j03r5Q6N1j07j56k23
54530C9355m23n09l08j06j27j39J2M8j50j82J67M39K36j21j93q6p1k9J63K41P5
54509C8292K9L30N83M70L07L94M05Nm59n48m58n22n20j28L51M46K97L01M07L27
54489D0309J51J18J32Nj31j44k43n17o09l22p1j85l08m8K76J91j03j34K3Lj26
54468C8267q4L4J7L4K68M37K49pJ5Q6j06k66K8M84N19K08M7P6k1j69j3L47M55
54445D0905K28jr8j88k36r8J14K03K32L34L25O6j52l1J63J7l26m22k39p3J1J23
54423D0857J45m1j80k2J59k6l59l35L6L04K92J85O1j42l03k48r9p0p9K9J18L1
54401D0313l6J19L02K31M6k6j06l23m04r6K74K89J01J00K13J45L9K10N00M94K01
$$ plain form
54380 42586 42555 42462 42369 42401 42708 43119 43213 42906 42584 42527 42614 42710 42891 43144 43279 43296 43418 43625 43609 43322 43116 43145 43139
54357 43139 42950 42808 42827 42739 42381 41978 41711 41469 41275 41450 42079 42748 43113 43293 43455 43465 43256 43081 43069 42979 42670
54336 42670 42423 42478 42657 42738 42789 42834 42658 42245 41997 42177 42549 42870 43290 43909 44408 44545 44604 44913 45296 45432 45435
54315 45435 45615 45947 46193 46303 46349 46291 46141 46093 46212 46253 46068 45884 45898 45943 45830 45696 45695 45698 45595 45570 45773 46042 46224
54292 46224 46417 46630 46613 46316 46102 46148 46097 45713 45412 45671 46282 46708 46841 46923 47008 47030 47129 47432 47709 47696 47555 47621
54270 47621 47901 48203 48531 48940 49281 49474 49781 50424 51177 51757 52345 53289 54530 55773 57002 58395 59908
54253 59908 61372 62785 64089 64885 64797 63973 62830 61532 60079 58670 57526 56524 55429 54331 53452 52763
54237 52763 52170 51831 51864 51936 51640 51077 50626 50314 49909 49462 49243 49234 49175 49023 48961 49003 49010 49016 49142 49276 49213 49017 48883
$$ packed form
54380D2586l1r3r3L2L07M11R4l07l22n7Q7R6J81K53J35J7J22K07j6k87k06K9o
54357D3139j89j42J9q8l58m03k67k42j94J75O29O69L65J80J62J0k09j75j2r0l09
54336D2670k47N5J79Q1N1M5j76m13k48J80L72L21M20O19M99J37N9L09L83J36L
54315D5435J80L32K46J10M6n8j50m8J19M1j85j84J4M5j13j34jLj03k5K03K69J82
54292D6224J93K13j7k97k14M6n1l84l01K59O11M26J33Q2Q5K2R9L03K77j3j41O6
54270D7621K80L02L28M09L41J93L07O43P53N80N88R44J241J243J229J393J513
54253E9908J464J413J304P96q8q24j143j298j453j409j144j002j095j098q79o89
54237E2763n93l39L3P2k96n63m51l12m05m47k19rn9j52o2M2POJ26J34o3j96j34
$$ plain form
54214 48883 48774 48547 48295 48191 48136 47955 47765 47770 47839 47726 47534 47516 47574 47428 47182 47211 47540 47817 47870 47866 47917 47931 47896
54191 47896 47949 48118 48311 48545 48891 49277 49581 49865 50210 50477 50522 50484 50525 50476 50124 49676 49501 49563 49550 49439 49487 49726
54169 49726 49942 50092 50322 50593 50726 50758 50877 51033 51025 50942 51084 51455 51718 51664 51377 50960 50472 50094 50013 50110 50099 49964
54147 49964 49938 50098 50327 50579 50856 50991 50828 50547 50434 50415 50222 49932 49900 50180 50464 50609 50790 51092 51353 51479
54127 51479 51576 51669 51631 51462 51345 51397 51589 51896 52275 52554 52613 52595 52658 52644 52322 51811 51411 51140 50825 50525 50411 50358
54105 50358 50097 49744 49670 49906 50139 50278 50552 51006 51416 51742 52182 52695 52926 52746 52439 52247 52112 51958 51852
54086 51852 51759 51500 51090 50782 50683 50618 50471 50306 50122 49805 49387 49063 48879 48712 48583 48660 48916 49138 49311 49622
54066 49622 50032 50225 50079 49811 49592 49347 49057 48904 48981 49129 49197 49191 49139 49046 49040 49268 49632 49881 49965 50020 50043 49934 49806
$$ packed form
54214D8883j09k27k52j04n5j81j90NO9j13j92j8N8j46k46K9L29K77N3mN1J4l5
54191D7896N3J69J93K34L46L86L04K84L45K67M5l8M1m9l52m48j75O2j3j11M8K39
54169D9726K16J50K30K71J33L2J19J56qq3J42L71K63n4k87m17m88l78q1R7j1j35
54147D9964k6J60K29K52K77J35j63k81j13j9j93k90l2K80K84J45J81L02K61J26
54127E1479R7R3l8j69j17N2J92L07L79K79N9j8O3j4l22n11m00k71l15l00j14n3
54105E0358k61l53p4K36K33J39K74M54M10L26M40N13K31j80l07j92j35j54j06
54086E1852r3k59m10l08r9o5j47j65j84l17m18l24j84j67j29P7K56K22J73L11
54066D9622M10J93j46k68k19k45k90j53P7J48O8on2r3oK28L64K49Q4N5K3j09j28
$$ plain form
54043 49806 49905 50197 50415 50514 50703 51008 51214 51291 51452 51707 51796 51649 51544 51689 52001 52379 52835 53246 53403 53406 53660
54022 53660 54303 55009 55474 55779 56142 56610 57148 57741 58262 58554 58715 59050 59626 60212 60688 61188 61788 62432 63266
54003 63266 64659 66763 69355 72274 75633 79497 83731 88289 93303 98609 103477 106996 108565 107954 105293
53988 105293 101156 96417 91797 87678 84310 81899 80397 79559 79260 79480 79989 80404 80622 80771 80668 79793
53972 79793 77967 75630 73304 71132 69117 67372 65890 64423 62862 61427 60324 59467 58740 58204 57869
53957 57869 57577 57276 57126 57155 57129 56956 56873 57051 57322 57502 57695 58062 58591 59238 60028 60830 61377 61667 62031 62645
53937 62645 63288 63782 64296 64996 65748 66415 67155 68122 69171 70108 70993 71972 73051 74223 75586 77069 78323
53920 78323 79074 79419 79583 79638 79613 79620 79693 79721 79704 79803 79979 79936 79521 78898 78163 77165 75895 74684 73765 72986 72189
$$ packed form
54043D9806R9K92K18R9J89L05K06P7J61K55Q9j47j05J45L12L78M56M11J57LK54
54022E3660O43P06M65L05L63M68N38N93N21K92J61L35N76N86M76N00O00O44Q34
54003F3266J393K104K592K919L359L864M234M558N014N306M868L519J569o11k661
53988A05293m137m739m620m119l368k411j502q38k99K20N09M15K18J49j03q75
53972G9793j826k337k326k172k015j745j482j467j561j435j103q57p27n36l35
53957E7869k92l01j50K9k6j73q3J78K71J80J93L67N29O47P90Q02N47K90L64O14
53937F2645O43M94N14P00P52O67P40R67J049R37Q85R79J079J172J363J483J254
53920G8323P51L45J64N5k5PP3K8j7R9J76m3m15o23p35r98j270j211r19p79p97
$$ plain form
53899 72189 71495 70943 70264 69317 68440 67964 67692 67221 66533 65874 65280 64602 63892 63384 63159 63084 63011 62853 62587 62334
53879 62334 62255 62272 62096 61677 61329 61273 61341 61351 61416 61619 61719 61492 61113 60903 60902 61004 61251 61701 62217 62668 63169 63843
53857 63843 64574 65248 66012 66996 68059 69083 70317 72077 74321 76864 79873 83747 88663 94524 101281
53842 101281 108972 117376 125810 133136 137986 139300 137028 132248 126411 120581 115368 111134 107938 105515
53828 105515 103678 102554 102218 102337 102523 102823 103536 104727 106175 107620 108762 109232 108931 108267 107802 107772 108193
53811 108193 109204 110966 113310 115787 117949 119426 119918 119426 118338 117053 115662 114162 112748 111591 110553
53796 110553 109411 108191 107007 105798 104485 103196 102061 100965 99777 98593 97463 96155 94505 92758
53782 92758 91194 89658 87860 85933 84284 83029 81984 81067 80305 79562 78681 77813 77209 76766 76128 75178 74079
$$ packed form
53899G2189o94n52o79r47q77m76k72m71o88o59n94o78p10n08k25p5p3j58k66k53
53879F2334p9J7j76m19l48n6O8J0O5K03J00k27l79k10jJ02K47M50N16M51N01O74
53857F3843P31O74P64R84J063J024J234J760K244K543L009L874M916N861O757
53842A01281P691Q404Q434P326M850J314k272m780n837n830n213m234l196k423
53828A05515j837j124l36J19J86L00P13J191J448J445J142M70l01o64m65l0M21
53811A08193J011J762K344K477K162J477M92m92j088j285j391j500j414j157j038
53796A10553j142j220j184j209j313j289j135j096j188j184j130j308j650j747
53782I2758j564j536j798j927j649j255j045r17p62p43q81q68o04m43o38r50j099
$$ plain form
53765 74079 72934 71734 70599 69696 68976 68251 67503 66848 66296 65787 65370 65074 64748 64309 63981 63975 64104 64056 63889
53746 63889 63866 63958 63900 63670 63484 63376 63168 62859 62687 62764 62954 63091 63097 62903 62525 62156 61965 61901 61874 61994 62350 62742
53724 62742 62923 62934 62904 62739 62374 62128 62381 62994 63499 63729 63857 63943 63910 63913 64250 64863 65357 65538 65598 65787 66222
53703 66222 67024 68250 69702 71129 72606 74366 76322 78109 79535 80646 81375 81581 81431 81320 81392 81492
53687 81492 81594 81892 82398 82863 83162 83437 83753 83992 84098 84141 84049 83637 82915 82094 81251 80306 79331 78506 77734 76698
53667 76698 75382 74171 73327 72662 71893 71008 70147 69368 68678 68103 67613 67124 66613 66097 65532 64901 64354 64056
53649 64056 63917 63717 63408 63058 62638 62131 61755 61753 62025 62294 62517 62808 63052 63027 62837 62796 62904 62889 62741 62743 62926
53628 62926 62950 62651 62277 62089 62096 62276 62668 63160 63533 63810 64211 64701 64979 64990 65043 65305 65580 65741 65979 66420 66897
$$ packed form
53765G4079j145j200j135r03p20p25p48o55n52n09m17k96l26m39l28oJ29m8j67
53746F3889k3R2n8k30j86j08k08l09j72P7J90J37Oj94l78l69j91o4k7J20L56L92
53724F2742J81J1l0j65l65k46K53O13N05K30J28Q6l3LL37O13M94J81O0J89M35
53703F6222Q02J226J452J427J477J760J956J787J426J111P29K06j50j11P2J00
53687H1492J02K98N06M65K99K75L16K39J06M3r2m12p22q21q43r45r75q25p72j036
53667G6698j316j211q44o65p69q85q61p79o90n75m90m89n11n16n65o31n47k98
53649F4056j39k00l09l50m20n07l76kK72K69K23K91K44k5j90m1J08j5j48KJ83
53628F2926K4k99l74j88PJ80L92M92L73K77M01M90K78J1N3K62K75J61K38M41M77
$$ plain form
53607 66897 67272 67696 68332 69126 69991 70929 71805 72326 72445 72485 72706 72985 73132 73215 73408 73732 74136 74641 75235 75794
53587 75794 76258 76694 77117 77409 77511 77497 77431 77355 77430 77836 78458 78963 79208 79340 79471 79529 79481 79412 79322 79154 79025 79144
53565 79144 79428 79550 79407 79222 79120 78998 78848 78850 78985 78964 78670 78341 78176 78085 78003 78072 78337 78588 78690 78767 78928
53544 78928 79075 79140 79214 79327 79405 79535 79936 80517 80878 80888 80890 81120 81329 81227 80942 80761 80757 80917 81328 81946 82497 82857
53522 82857 83274 83916 84543 84894 85124 85525 86070 86565 87058 87741 88613 89527 90444 91395 92321 93192 94139 95253 96412
53503 96412 97510 98710 100253 102158 104279 106543 108931 111426 114074 116955 119901 122455 124273 125364
53489 125364 125830 125637 124811 123625 122310 120847 119205 117584 116178 114907 113615 112381 111380 110611 109964
53474 109964 109396 108898 108395 107872 107430 107082 106687 106193 105744 105402 105018 104526 104084 103775 103408 102882 102424 102247 102223
$$ packed form
53607F6897L75M24O36P94Q65R38Q76N21J19M0K21K79J47Q3J93L24M04N05N94N59
53587G5794M64M36M23K92J02j4o6p6P5M06O22N05K45J32J31N8m8o9r0j68j29J19
53565G9144K84J22j43j85j02j22j50KJ35k1k94l29j65r1q2O9K65K51J02P7J61
53544G8928J47O5P4J13P8J30M01N81L61J0KK30K09j02k85j81mJ60M11O18N51L60
53522H2857M17O42O27L51K30M01N45M95M93O83Q72R14R17R51R26Q71R47J114J159
53503I6412J098J200J543J905K121K264K388K495K648K881K946K554J818J091
53489A25364M66j93q26j186j315j463j642j621j406j271j292j234j001p69o47
53474A09964n68m98n03n23m42l48l95m94m49l42l84m92m42l09l67n26m58j77k4
$$ plain form
53455 102223 102159 102146 102330 102556 102559 102356 102170 102104 102139 102300 102577 102782 102750 102542 102282 101947 101519 101186 101136 101293 101465
53434 101465 101614 101826 102155 102665 103471 104528 105583 106492 107408 108470 109551 110533 111598 113003 114765 116774
53418 116774 119012 121443 123864 126152 128430 130752 132858 134540 136041 137782 139847 142033 144245 146551
53404 146551 148949 151396 153982 156830 159891 163066 166436 170157 174253 178669 183379 188266 193087 197763
53390 197763 202528 207557 212666 217597 222386 227183 231922 236473 240932 245448 249924 254195 258363 262655
53376 262655 267058 271374 275498 279409 283050 286489 290036 293920 297962 301848 305549 309207 312779 316114
53362 316114 319222 322155 324768 326924 328759 330420 331668 332126 331783 330920 329621 327724 325215 322327 319289
53347 319289 316255 313418 310902 308553 306094 303381 300343 296816 292754 288468 284345 280460 276699 273084
$$ packed form
53455A02223o4j3J84K26Lk03j86o6L5J61K77K05l2k08k60l35m28l33n0J57J72
53434A01465J49K12L29N10Q06J057J055R09R16J062J081R82J065J405J762K009
53418A16774K238K431K421K288K278K322K106J682J501J741K065K186K212K306
53404A46551K398K447K586K848L061L175L370L721M096M416M710M887M821M676
53390A97763M765N029N109M931M789M797M739M551M459M516M476M271M168M292
53376B62655M403M316M124L911L641L439L547L884M042L886L701L658L572L335
53362C16114L108K933K613K156J835J661J248M58l43q63j299j897k509k888l038
53347C19289l034k837k516k349k459k713l038l527m062m286m123l885l761l615
$$ plain form
53333 273084 269637 266119 262302 258374 254689 251273 247991 245034 242779 241216 240013 239080 238584 238436 238270
53318 238270 238007 237962 238290 238763 239209 239751 240488 241324 242274 243588 245369 247418 249622 252224 255458 259190 263127
53301 263127 267182 271467 276056 280923 286001 291202 296483 301988 307975 314589 321801 329542 337738 346243
53287 346243 354946 363983 373620 383869 394458 405178 416102 427367 438940 450667 462436 474192
53275 474192 485898 497524 508983 520085 530635 540588 550019 559024 567719 576179 584270 591659 598152
53262 598152 603886 608998 613291 616488 618699 620272 621253 621247 619807 616702 611857 605335 597415 588469 578749
53247 578749 568427 557781 547091 536416 525662 514853 504149 493660 483460 473711 464539 455858
53235 455858 447493 439363 431366 423236 414789 406184 397689 389371 381262 373644 366772 360468 354390 348563
$$ packed form
53333B73084l447l518l817l928l685l416l282k957k255j563j203r33m96j48j66
53318B38270k63m5L28M73M46N42P37Q36R50J314J781K049K204K602L234L732L937
53301B63127M055M285M589M867N078N201N281N505N987O614P212P741Q196Q505
53287C46243Q703R037R637J0249J0589J0720J0924J1265J1573J1727J1769J1756
53275D74192J1706J1626J1459J1102J0550R953R431R005Q695Q460Q091P389O493
53262E98152N734N112M293L197K211J573R81oj440l105m845o522p920q946r720
53247E78749j0322j0646j0690j0675j0754j0809j0704j0489j0200r749r172q681
53235D55858q365q130p997q130q447q605q495q318q109p618o872o304o078n827
$$ plain form
53221 348563 343253 338436 333874 329638 326050 323116 320478 317984 315807 313899 311798 309136 306007 302685
53207 302685 299328 296081 293110 290391 287729 285110 282764 280809 279135 277713 276685 276031 275512 275063 274946
53192 274946 275369 276212 277262 278469 279837 281327 282990 284986 287388 290181 293478 297427 301857 306340 310707
53177 310707 315224 320108 325204 330251 335182 339985 344549 348806 352830 356655 360201 363464 366555 369413
53163 369413 371724 373227 373929 373930 373268 372004 370197 367770 364585 360723 356438 351790 346613 340895 334896
53148 334896 328813 322623 316349 310166 304133 298100 291990 285930 280008 274212 268653 263541 258829 254231
53134 254231 249667 245337 241176 236679 231488 225849 220262 214977 210045 205559 201521 197754 194158 190868
53120 190868 187958 185240 182582 180129 178024 176144 174377 172874 171742 170702 169369 167680 165791 163721
$$ packed form
53221C48563n310m817m562m236l588k934k638k494k177j908k101k662l129l322
53207C02685l357l247k971k719k662k619k346j955j674j422j028o54n19m49j17
53192B74946M23Q43J050J207J368J490J663J996K402K793L297L949M430M483M367
53177C10707M517M884N096N047M931M803M564M257M024L825L546L263L091K858
53163C69413K311J503P02Jo62j264j807k427l185l862m285m648n177n718n999
53148C34896o083o190o274o183o033o033o110o060n922n796n559n112m712m598
53134B54231m564m330m161m497n191n639n587n285m932m486m038l767l596l290
53120A90868k910k718k658k453k105j880j767j503j132j040j333j689j889k070
$$ plain form
53106 163721 161378 158823 156189 153416 150355 147076 143894 141072 138647 136482 134391 132263 130161 128232
53092 128232 126505 124880 123334 121930 120588 119068 117272 115346 113419 111457 109430 107409 105381 103242
53078 103242 101068 99131 97527 96075 94681 93522 92663 91846 90859 89871 89132 88599 88098 87638 87310 87054 86763
53061 86763 86458 86165 85777 85230 84644 84090 83450 82648 81833 81124 80419 79650 79022 78725 78640 78538 78385 78210 77897
53042 77897 77395 76931 76761 76823 76903 76950 77008 76985 76757 76386 76025 75723 75527 75581 75918 76330 76689 77172 77925 78714 79211
53021 79211 79463 79763 80188 80607 81032 81604 82290 82903 83389 83819 84144 84218 84053 83802 83531 83183 82763 82320 81807
53002 81807 81149 80421 79768 79206 78651 78111 77653 77289 77028 76982 77256 77766 78328 78851 79324 79733 80114 80542 80938
52983 80938 81029 80697 80206 79900 79815 79776 79720 79669 79552 79291 78994 78811 78702 78517 78234 77906 77495 76955 76372 75830 75273
$$ packed form
53106A63721k343k555k634k773l061l279l182k822k425k165k091k128k102j929
53092A28232j727j625j546j404j342j520j796j926j927j962k027k021k028k139
53078A03242k174j937j604j452j394j159q59q17r87r88p39n33n01m60l28k56k91
53061H6763l05k93l88n47n86n54o40q02q15p09p05p69o28k97q5j02j53j75l13
53042G7897n02m64j70O2Q0M7N8k3k28l71l61l02j96N4L37M12L59M83P53P89M97
53021G9211K52L00M25M19M25N72O86O13M86M30L25P4j65k51k71l48m20m43n13
53002H1807o58p28o53n62n55n40m58l64k61m6K74N10N62N23M73M09L81M28L96
52983H0938R1l32m91l06q5l9n6n1j17k61k97j83j09j85k83l28m11n40n83n42n57
$$ plain form
52962 75273 74688 74247 74024 73790 73356 72947 72927 73270 73651 73945 74303 74775 75205 75521 75825 76163 76472 76739 77007
52943 77007 77229 77337 77388 77456 77438 77249 77102 77291 77740 78061 78074 77970 77942 77956 77968 78041 78172 78198 78031 77797 77653 77596
52921 77596 77571 77615 77810 78143 78489 78698 78740 78776 79032 79521 79986 80187 80147 79995 79731 79326 78904 78622 78448 78266 78125
52900 78125 78172 78386 78579 78641 78610 78536 78458 78451 78555 78688 78746 78726 78644 78451 78182 78041 78157 78386 78501 78481 78437 78434 78561 78985
52876 78985 79682 80283 80481 80439 80519 80744 80864 80840 80862 80977 81077 81206 81506 81845 81869 81499 81060 80844 80816 80820 80815 80819 80853
52853 80853 80987 81232 81392 81238 80844 80497 80281 80013 79625 79312 79237 79328 79447 79552 79613 79590 79548 79613 79760 79829 79794 79803
52831 79803 79926 80049 80093 80123 80179 80191 80120 80053 80062 80106 80101 80007 79848 79748 79883 80259 80615 80691 80535 80347 80172 79958 79789
52808 79789 79752 79688 79380 78966 78805 78928 78989 78806 78591 78565 78673 78798 78958 79155 79286 79359 79581 80047 80554 80878 81041
$$ packed form
52962G5273n85m41k23k34m34m09k0L43L81K94L58M72M30L16L04L38L09K67K68
52943G7007K22J08N1O8j8j89j47J89M49L21J3j04k8J4J2P3J31K6j67k34j44n7
52921G7596k5M4J95L33L46K09M2L6K56M89M65K01m0j52k64m05m22k82j74j82j41
52900G8125M7K14J93O2l1p4p8pJ04J33N8k0q2j93k69j41J16K29J15k0m4lJ27M24
52876G8985O97O01J98m2Q0K25J20k4K2J15J00J29L00L39K4l70m39k16k8MnML4
52853H0853J34K45J60j54l94l47k16k68l88l13p5R1J19J05O1k3m2O5J47O9l5R
52831G9803J23J23M4L0N6J2p1o7RM4nr4j59j00J35L76L56P6j56j88j75k14j69
52808G9789l7o4l08m14j61J23O1j83k15k6J08J25J60J97J31P3K22M66N07L24J63
$$ plain form
52787 81041 81197 81379 81523 81608 81671 81762 81922 82133 82282 82285 82236 82283 82389 82383 82244 82127 82108 82107 82078 82073 82102 82115 82138 82248 82416
52762 82416 82548 82642 82714 82650 82388 82194 82418 82991 83477 83637 83622 83578 83415 83063 82629 82157 81538 80801 80175 79715 79142
52741 79142 78254 77243 76406 75784 75275 74897 74715 74663 74625 74582 74538 74448 74327 74297 74409 74564 74721 74999 75489 76130 76882
52720 76882 77863 79165 80690 82272 83783 85008 85630 85490 84719 83536 82055 80431 78973 77907 77150 76472
52704 76472 75789 75189 74753 74473 74256 73958 73513 73066 72842 72825 72752 72489 72217 72148 72251 72376 72491 72644 72855 73127
52684 73127 73475 73826 74033 74090 74163 74351 74544 74638 74723 74957 75352 75788 76115 76194 75972 75619 75409 75422 75476 75402 75224 75025
52662 75025 74820 74633 74494 74313 73971 73614 73611 74104 74818 75409 75800 76062 76226 76369 76671 77149 77553 77691 77698 77786 77929
52641 77929 78002 78074 78329 78762 79179 79446 79590 79716 79938 80333 80865 81389 81795 82069 82190 82123 81934 81737 81468 80928
$$ packed form
52787H1041J56J82J44Q5O3R1J60K11J49Lm9M7J06oj39j17j9jk9nK9J3K3J10J68
52762H2416J32R4P2o4k62j94K24N73M86J60j5m4j63l52m34m72o19p37o26m60n73
52741G9142q88j011q37o22n09l78j82n2l8m3m4r0j21l0J12J55J57K78M90O41P52
52720G6882R81J302J525J582J511J225O22j40p71j183j481j624j458j066p57o78
52704G6472o83o00m36k80k17k98m45m47k24j7p3k63k72o9J03J25J15J53K11K72
52684G3127L48L51K07N7P3J88J93R4Q5K34L95M36L27P9k22l53k10J3N4p4j78j99
52662G5025k05j87j39j81l42l57lM93P14N91L91K62J64J43L02M78M04J38PQ8J43
52641G7929P3P2K55M33M17K67J44J26K22L95N32N24M06K74J21o7j89j97k69n40
$$ plain form
52621 80928 80116 79312 78725 78265 77806 77432 77256 77195 77126 77089 77154 77251 77318 77460 77761 78087 78300 78510 78926 79553 80205
52600 80205 80728 81040 81094 81007 81085 81508 82049 82316 82211 81980 81876 81949 82120 82299 82417 82445 82371 82125 81647 81086 80753
52579 80753 80785 80978 81070 81047 81024 81025 81024 81090 81274 81497 81693 81963 82385 82792 82973 83007 83163 83525 83900 84126 84268 84484
52557 84484 84814 85130 85247 85097 84824 84656 84682 84802 84908 84979 84985 84874 84704 84634 84702 84790 84877 85138 85667 86283 86743 87020
52535 87020 87237 87508 87950 88683 89665 90646 91402 91879 91987 91490 90311 88781 87387 86348 85559 84856 84195 83665
52517 83665 83430 83555 83814 83873 83746 83816 84275 84801 84995 84879 84729 84615 84416 84116 83792 83448 83090 82881 82954 83199
52497 83199 83459 83806 84366 85003 85445 85643 85746 85812 85806 85804 85924 86109 86227 86343 86638 87086 87434 87534 87469 87373 87292 87229
52475 87229 87157 87009 86800 86707 86896 87313 87781 88230 88647 88937 88976 88752 88315 87681 86960 86405 86165 86088 85994 85984 86221
$$ packed form
52621H0928q12q04n87m60m59l74j76o1o9l7O5R7O7J42L01L26K13K10M16O27O52
52600H0205N23L12N4q7P8M23N41K67j05k31j04P3J71J79J18K8p4k46m78n61l33
52579H0753L2J93R2k3k3JjO6J84K23J96K70M22M07J81L4J56L62L75K26J42K16
52557H4484L30L16J17j50k73j68K6J20J06P1Oj11j70p0O8Q8Q7K61N29O16M60K77
52535H7020K17K71M42P33R82R81P56M77J08m97j179j530j394j039p89p03o61n30
52517H3665k35J25K59N9j27P0M59N26J94j16j50j14j99l00l24l44l58k09P3K45
52497H3199K60L47N60O37M42J98J03O6okJ20J85J18J16K95M48L48J00o5r6q1o3
52475H7229p2j48k09r3J89M17M68M49M17K90L9k24m37o34p21n55k40p7r4j0K37
$$ plain form
52454 86221 86591 86835 86947 87130 87436 87719 87899 87995 87912 87521 86948 86515 86369 86365 86338 86260 86125 85906 85656 85492 85442
52433 85442 85466 85600 85904 86309 86703 87135 87737 88467 89148 89727 90304 90915 91511 92103 92725 93244 93463 93414 93365 93504
52413 93504 93799 94177 94627 95086 95427 95598 95646 95535 95130 94378 93392 92335 91328 90475 89838 89378 89016 88761 88703
52394 88703 88867 89188 89541 89756 89696 89415 89155 89046 88969 88809 88679 88691 88693 88476 88142 87980 88069 88240 88403 88630 88933
52373 88933 89210 89411 89600 89849 90223 90837 91718 92681 93484 94064 94461 94657 94639 94516 94333 93917 93129 92159 91293
52354 91293 90523 89677 88800 88109 87644 87268 86946 86729 86533 86261 86036 85992 85911 85449 84681 84002 83542 83075 82549 82239
52334 82239 82326 82665 83094 83582 84012 84168 84059 83951 83954 83912 83775 83753 83944 84143 84194 84235 84420 84668 84867 85061 85291
52313 85291 85492 85710 86161 86933 87837 88761 89900 91472 93415 95591 98057 100914 103998 106902 109214 110630
$$ packed form
52454H6221L70K44J12J83L06K83J80R6q3l91n73m33j46mk7p8j35k19k50j64n0
52433H5442K4J34L04M05L94M32O02P30O81N79N77O11N96N92O22N19K19m9m9J39
52413I3504K95L78M50M59L41J71M8j11m05p52r86j057j007q53o37m60l62k55n8
52394H8703J64L21L53K15o0k81k60j09p7j60j30J2Kk17l34j62Q9J71J63K27L03
52373H8933K77K01J89K49L74O14Q81R63Q03N80L97J96j8j23j83m16p88r70q66
52354I1293p70q46q77o91m65l76l22k17j96k72k25m4q1m62p68o79m60m67n26l10
52334H2239Q7L39M29M88M30J56j09j08Lm2j37k2J91J99N1M1J85K48J99J94K30
52313H5291K01K18M51P72R04R24J139J572J943K176K466K857L084K904K312J416
$$ plain form
52297 110630 110990 110362 109007 107182 105068 102921 101060 99625 98498 97541 96748 96128 95646 95318 95161 95007
52281 95007 94615 94034 93580 93399 93317 93225 93297 93656 94099 94412 94693 95150 95725 96164 96309 96140 95676 95035 94486 94229
52261 94229 94202 94232 94271 94380 94554 94753 94977 95218 95410 95530 95651 95842 96086 96378 96757 97195 97573 97844 98084 98334
52241 98334 98537 98717 99021 99528 100165 100872 101713 102705 103747 104777 105838 106930 107956 108942 110093 111522 113093
52224 113093 114630 116111 117551 118887 120083 121209 122310 123325 124265 125285 126489 127828 129270 130905
52210 130905 132796 134884 137122 139551 142161 144868 147704 150842 154353 158122 162071 166223 170473 174540
52196 174540 178295 181891 185478 189005 192466 196052 199891 203854 207784 211704 215627 219414 223022 226686
52182 226686 230597 234621 238529 242302 245991 249485 252692 255793 258969 262001 264455 266217 267591 268870
$$ packed form
52297A10630L60o28j355j825k114k147j861j435j127r57p93o20m82l28j57j54
52281I5007l92n81m54j81q2r2P2L59M43L13K81M57N75M39J45j69m64o41n49k57
52261I4229k7L0L9J09J74J99K24K41J92J20J21J91K44K92L79M38L78K71K40K50
52241I8334K03J80L04N07O37P07Q41R92J042J030J061J092J026R86J151J429J571
52224A13093J537J481J440J336J196J126J101J015R40J020J204J339J442J635
52210A30905J891K088K238K429K610K707K836L138L511L769L949M152M250M067
52196A74540L755L596L587L527L461L586L839L963L930L920L923L787L608L664
52182B26686L911M024L908L773L689L494L207L101L176L032K454J762J374J279
$$ plain form
52168 268870 270016 270767 270898 270401 269529 268627 267844 267064 266174 265252 264431 263690 262982 262376 261971 261739 261623 261658 261866
52149 261866 262141 262396 262715 263243 264026 265062 266370 267932 269671 271606 273875 276515 279419 282547 285973
52134 285973 289595 293074 296255 299403 302833 306483 310044 313304 316152 318467 320268 321793 323206 324343
52120 324343 325019 325362 325566 325524 325011 324119 323157 322217 321160 319982 318876 317887 316812 315446 313744 311712 309390
52103 309390 306960 304682 302679 300903 299324 297977 296826 295716 294504 293163 291774 290460 289310 288304
52089 288304 287392 286684 286437 286768 287504 288371 289207 289922 290467 290925 291461 292047 292438 292535 292554 292670 292749 292615 292362 292116
52069 292116 291741 291053 290171 289361 288666 287958 287230 286569 285940 285295 284754 284432 284168 283732 283199 282835 282718 282782 283129
52050 283129 283945 285127 286304 287251 288002 288526 288608 288110 287173 286075 285062 284319 283954 283963 284318 285014 285971 287027
$$ packed form
52168B68870J146P51J31m97q72r02p83p80q90r22q21p41p08o06m05k32j16L5K08
52149B61866K75K55L19N28P83J036J308J562J739J935K269K640K904L128L426
52134B85973L622L479L181L148L430L650L561L260K848K315J801J525J413J137
52120C24343O76L43K04m2n13q92r62r40j057j178j106r89j075j366j702k032k322
52103C09390k430k278k003j776j579j347j151j110j212j341j389j314j150j006
52089B88304r12p08k47L31P36Q67Q36P15N45M58N36N86L91R7J9J16P9j34k53k46
52069B92116l75o88q82q10o95p08p28o61o29o45n41l22k64m36n33l64j17O4L47
52050B83129Q16J182J177R47P51N24Q2m98r37j098j013p43l65RL55O96R57J056
$$ plain form
52032 287027 288168 289631 291572 293773 295874 297767 299513 301025 302154 302983 303734 304425 304916 305251 305659 306244
52016 306244 306948 307785 308822 309966 311015 311937 312831 313649 314230 314581 314834 314974 314876 314662 314689 315179 316120 317566
51998 317566 319739 322763 326540 330951 335966 341489 347356 353506 359972 366648 373312 379861 386300 392462
51984 392462 398020 402840 407094 410920 414171 416605 418144 418880 418970 418616 418013 417256 416386 415481 414566 413507
51968 413507 412163 410634 409105 407521 405622 403310 400750 398155 395675 393494 391750 390323 388946 387552
51954 387552 386314 385372 384753 384571 385021 386136 387745 389722 392020 394482 396902 399317 401971 404906 407850
51939 407850 410573 413117 415594 418028 420453 422929 425308 427212 428359 428776 428630 428066 427241 426332 425401 424421
51923 424421 423487 422811 422470 422332 422244 422041 421361 419761 417120 413759 410066 406228 402360 398637 395142 391784
$$ packed form
52032B87027J141J463J941K201K101J893J746J512J129Q29P51O91M91L35M08N85
52016C06244P04Q37J037J144J049R22Q94Q18N81L51K53J40r8k14K7M90R41J446
51998C17566K173L024L777M411N015N523N867O150O466O676O664O549O439O162
51984C92462N558M820M254L826L251K434J539P36R0l54o03p57q70r05r15j059
51968D13507j344j529j529j584j899k312k560k595k480k181j744j427j377j394
51954C87552j238r42o19j82M50J115J609J977K298K462K420K415K654K935K944
51939D07850K723K544K477K434K425K476K379J904J147M17j46n64q25r09r31r80
51923D24421r34o76l41j38q8k03o80j600k641l361l693l838l868l723l495l358
$$ plain form
51907 391784 388460 385140 381745 378156 374426 370808 367468 364373 361446 358627 355727 352498 348898 345084
51893 345084 341056 336591 331592 326186 320390 313950 306700 298814 290580 282196 273947 266325 259701 254028
51879 254028 249072 244747 241066 237948 235278 233016 231070 229163 226997 224451 221500 218093 214252 210156
51865 210156 206005 201893 197922 194295 191187 188630 186584 184984 183676 182497 181503 180935 180893 181217 181812 182854
51849 182854 184511 186661 189034 191473 193898 196181 198241 200125 201855 203332 204509 205539 206570 207579
51835 207579 208523 209519 210707 212053 213484 215111 217153 219736 222932 226935 232032 238435 246229 255393 265726
51820 265726 276706 287388 296393 302148 303481 300203 293111 283413 272216 260426 248696 237304 226273
51807 226273 215746 206087 197532 189946 183116 177063 171915 167632 164016 160870 158035 155405 153021 151067
$$ packed form
51907C91784l324l320l395l589l730l618l340l095k927k819k900l229l600l814
51893C45084m028m465m999n406n796o440p250p886q234q384q249p622o624n673
51879B54028m956m325l681l118k670k262j946j907k166k546k951l407l841m096
51865B10156m151m112l971l627l108k557k046j600j308j179r94n68m2L24N95J042
51849A82854J657K150K373K439K425K283K060J884J730J477J177J030J031J009
51835B07579R44R96J188J346J431J627K042K583L196M003N097O403P794R164J0333
51820B65726J0980J0682R005N755J333l278p092r698j1197j1790j1730j1392j1031
51807B26273j0527r659q555p586o830o053n148m283l616l146k835k630k384j954
$$ plain form
51793 151067 149680 148893 148785 149436 150708 152314 154190 156546 159453 162636 165795 168820 171504 173395 174241
51778 174241 174301 173952 173190 171831 169971 167943 165942 164030 162373 161154 160299 159575 158914 158414 158095 157884 157799
51761 157799 157911 158136 158260 158122 157638 156688 155177 153150 150715 147936 144933 141979 139326 137021 135028 133413
51745 133413 132239 131429 130871 130588 130614 130840 131166 131638 132279 132929 133509 134248 135404 136831 138145 139208 140185
51728 140185 141171 142060 142772 143355 143814 144056 143970 143434 142319 140657 138754 136907 135119 133263 131460 130004
51712 130004 128985 128250 127721 127463 127456 127555 127730 128094 128636 129167 129606 130122 130920 132031 133401 134987 136678 138200
51694 138200 139216 139502 139078 138231 137378 136771 136343 135926 135566 135504 135958 137030 138748 140995 143459 145825 147994
51677 147994 149971 151598 152612 152929 152676 151943 150729 149146 147483 146018 144845 143942 143233 142602 141941 141248
$$ packed form
51793A51067j387p87j08O51J272J606J876K356K907L183L159L025K684J891Q46
51778A74241O0l49p62j359j860k028k001j912j657j219q55p24o61n00l19k11q5
51761A57799J12K25J24j38m84r50j511k027k435k779l003k954k653k305j993j615
51745A33413j174q10n58k83K6K26L26M72O41O50N80P39J156J427J314J063R77
51728A40185R86Q89P12N83M59K42q6n36j115j662j903j847j788j856j803j456
51712A30004j019p35n29k58pR9J75L64N42N31M39N16P98J111J370J586J691J522
51694A38200J016K86m24q47q53o07m28m17l60o2M54J072J718K247K464K366K169
51677A47994J977J627J014L17k53p33j214j583j663j465j173r03p09o31o61o93
$$ plain form
51661 141248 140572 139874 139071 138174 137286 136456 135647 134848 134106 133497 133099 132967 133027 133054 132870 132478 131930 131182 130239
51642 130239 129317 128657 128235 127841 127393 126956 126511 125917 125121 124228 123346 122526 121853 121425 121220 121108 121031 121059 121267
51623 121267 121677 122286 123042 123810 124470 125005 125427 125688 125805 125993 126496 127337 128377 129554 130893 132326 133686
51606 133686 134826 135611 135902 135749 135512 135583 136019 136658 137503 138730 140324 142001 143492 144678 145432 145586 145147
51589 145147 144339 143349 142159 140677 138852 136661 134128 131399 128678 126088 123741 121879 120716 120133 119746
51574 119746 119364 119150 119325 119863 120571 121299 122026 122873 124060 125704 127686 129817 132094 134602 137224 139701
51558 139701 141956 144073 145953 147301 148034 148424 148737 148989 149184 149525 150218 151284 152685 154397 156108 157070
51542 157070 156560 154483 151343 147725 143960 140228 136739 133721 131341 129669 128690 128321 128455 128979 129774 130768
$$ packed form
51661A41248o76o98q03q97q88q30q09p99p42o09l98j32O0K7j84l92n48p48r43
51642A30239r22o60m22l94m48m37m45n94p96q93q82q20o73m28k05j12p7K8K08
51623A21267M10O09P56P68O60N35M22K61J17J88N03Q41J040J177J339J433J360
51606A33686J140P85K91j53k37P1M36O39Q45J227J594J677J491J186P54J54m39
51589A45147q08r90j190j482j825k191k533k729k721k590k347j862j163n83l87
51574A19746l82k14J75N38P08P28P27Q47J187J644J982K131K277K508K622K477
51558A39701K255K117J880J348P33L90L13K52J95L41O93J066J401J712J711R62
51542A57070n10k077l140l618l765l732l489l018k380j672r79l69J34N24P95R94
$$ plain form
51526 130768 131946 133214 134253 134660 134314 133456 132399 131261 130074 129004 128280 127964 127854 127674 127270 126655
51510 126655 125909 125076 124203 123398 122774 122324 121965 121756 121934 122665 123894 125567 127827 130784 134276 138074 142192
51493 142192 146609 150748 153551 154262 152945 150225 146818 143381 140492 138511 137462 137192 137564 138503 139984
51478 139984 142020 144516 147185 149769 152367 155272 158453 161467 164001 166283 168837 172074 176276 181725
51464 181725 188631 197027 206948 218533 231733 245980 260387 274236 287156 298875 309004 317088
51452 317088 322740 325701 325884 323356 318220 310531 300420 288290 274787 260599 246322 232481 219579
51439 219579 208003 197934 189365 182255 176606 172394 169418 167322 165781 164616 163685 162792 161783 160677
51425 160677 159560 158402 157087 155585 153966 152318 150757 149479 148631 148156 147866 147631 147350 146818 145839 144476
$$ packed form
51526A30768J178J268J039M07l46q58j057j138j187j070p24l16j10j80m04o15
51510A26655p46q33q73q05o24m50l59k09J78P31J229J673K260K957L492L798M118
51493A42192M417M139K803P11j317k720l407l437k889j981j049k70L72R39J481
51478A39984K036K496K669K584K598K905L181L014K534K282K554L237M202N449
51464A81725O906Q396R921J1585J3200J4247J4407J3849J2920J1719J0129Q084
51452C17088N652K961J83k528n136p689j0111j2130j3503j4188j4277j3841j2902
51439B19579j1576j0069q569p110n649m212k976k096j541j165r31q93j009j106
51425A60677j117j158j315j502j619j648j561j278q48m75k90k35k81n32r79j363
$$ plain form
51409 144476 142999 141561 140103 138568 137026 135559 134186 132919 131759 130640 129535 128613 128072 127811 127509
51394 127509 127050 126651 126522 126608 126778 126997 127202 127197 126854 126271 125624 124974 124344 123847 123605 123599 123727 123901 124041 124072 124019
51373 124019 124020 124170 124432 124739 125099 125540 126029 126511 126952 127315 127584 127767 127836 127682 127253 126659 126030 125337 124537 123798
51353 123798 123360 123221 123232 123442 124067 125105 126360 127841 129759 131977 133837 134786 134904 134645 134309 134030 133981
51336 133981 134294 134826 135263 135413 135271 134940 134622 134539 134715 134950 135108 135243 135345 135195 134674 134020 133556 133315 133154
51317 133154 133057 133062 133014 132681 132094 131522 131101 130686 130117 129437 128813 128320 127886 127428 127007 126844 127108 127728 128500 129360
51297 129360 130418 131736 133284 135097 137283 139794 142494 145506 149234 153899 159299 165189 171683 179112
51283 179112 187695 197604 209106 222346 237099 252961 269679 287103 304901 322520 339296 354402
$$ packed form
51409A44476j477j438j458j535j542j467j373j267j160j119j105r22n41k61l02
51394A27509m59l99j29Q6J70K19K05nl43n83o47o50o30m97k42oJ28J74J40L1n3
51373A24019JJ50K62L07L60M41M89M82M41L63K69J83O9j54m29n94o29o93q00p39
51353A23798m38j39J1K10O25J038J255J481J918K218J860R49J18k59l36k79m9
51336A33981L13N32M37J50j42l31l18q3J76K35J58J35J02j50n21o54m64k41j61
51317A33154r7Nm8l33n87n72m21m15n69o80o24m93m34m58m21j63K64O20P72Q60
51297A29360J058J318J548J813K186K511K700L012L728M665N400N890O494P429
51283A79112Q583R909J1502J3240J4753J5862J6718J7424J7798J7619J6776J5106
$$ plain form
51271 354402 366874 375934 381283 382915 380801 374961 365707 353588 339174 323078 306069 288890 271978
51258 271978 255560 239935 225445 212243 200316 189690 180409 172352 165292 159112 153783 149171 145079
51245 145079 141458 138373 135781 133523 131538 129931 128784 128042 127557 127162 126735 126314 126088 126200 126615 127245
51229 127245 128094 129144 130236 131238 132245 133424 134746 136069 137354 138630 139769 140535 140807 140635 140109
51214 140109 139347 138518 137730 136947 136150 135445 134846 134098 132935 131425 129825 128214 126509 124780 123232 121932
51198 121932 120782 119769 118996 118472 118091 117818 117693 117675 117695 117838 118238 118804 119313 119771 120464 121607 123190 125125
51180 125125 127311 129481 131252 132433 133103 133366 133206 132674 131976 131307 130734 130317 130154 130241 130464 130814 131456 132490
51162 132490 133755 134990 136038 136849 137376 137584 137464 136978 136075 134817 133405 131996 130573 129066 127560 126306
$$ packed form
51271C54402J2472R060N349J632k114n840r254j2119j4414j6096j7009j7179j6912
51258B71978j6418j5625j4490j3202j1927j0626r281q057p060o180n329m612m092
51245A45079l621l085k592k258j985j607j147p42m85l95m27m21k26J12M15O30
51229A27245Q49J050J092J002J007J179J322J323J285J276J139P66K72j72n26
51214A40109p62q29p88p83p97p05n99p48j163j510j600j611j705j729j548j300
51198A21932j150j013p73n24l81k73j25j8K0J43M00N66N09M58O93J143J583J935
51180A25125K186K170J771J181O70K63j60n32o98o69n73m17j63Q7K23L50O42J034
51162A32490J265J235J048Q11N27K08j20m86r03j258j412j409j423j507j506j254
$$ plain form
51146 126306 125529 125224 125158 125075 124931 124878 125005 125189 125275 125272 125275 125312 125397 125621 126030 126477 126801 127082 127549 128273 129134 130066
51124 130066 131137 132392 133786 135270 136777 138117 139027 139400 139318 138914 138319 137690 137139 136623 136052 135471 135012
51107 135012 134705 134504 134454 134658 135059 135474 135826 136158 136443 136553 136470 136346 136313 136397 136600 136935 137352 137797 138333 139093
51087 139093 140090 141218 142417 143693 144988 146194 147274 148225 148941 149278 149209 148786 147984 146759 145242 143692
51071 143692 142296 141156 140385 139987 139735 139410 139137 139204 139610 140039 140281 140361 140252 139796 138955 137880 136646 135192
51053 135192 133577 132026 130635 129310 128066 127088 126384 125691 124892 124241 123987 124007 124036 124024 124069 124170 124276 124471
51035 124471 124879 125478 126129 126748 127334 127943 128714 129802 131217 132807 134474 136238 138040 139660 140914 141787
51019 141787 142279 142331 141992 141502 141062 140679 140331 140111 140073 140090 140023 139903 139810 139674 139352 138771 137929 136879 135794 134936
$$ packed form
51146A26306p77l05o6q3j44n3J27J84Q6lLL7Q5K24M09M47L24K81M67P24Q61R32
51124A30066J071J255J394J484J507J340R10L73q2m04n95o29n51n16n71n81m59
51107A35012l07k01n0K04M01M15L52L32K85J10q3j24l3Q4K03L35M17M45N36P60
51087A39093R97J128J199J276J295J206J080R51P16L37o9m23q02j225j517j550
51071A43692j396j140p71l98k52l25k73O7M06M29K42Q0j09m56q41j075j234j454
51053A35192j615j551j391j325j244r78p04o93p99o51k54K0K9j2M5J01J06J95
51035A24471M08N99O51O19N86O09P71J088J415J590J667J764J802J620J254Q73
51019A41787M92N2l39m90m40l83l48k20l8J7o7j20r3j36l22n81q42j050j085q58
$$ plain form
50999 134936 134399 134054 133803 133716 133808 133875 133735 133473 133275 133164 133076 133060 133192 133378 133463 133477 133580 133810 134057 134278 134553
50978 134553 134947 135440 135988 136560 137096 137535 137905 138318 138881 139644 140614 141771 143091 144548 146096 147669 149286
50961 149286 151107 153280 155781 158517 161546 164995 168787 172669 176509 180331 183986 187060 189213 190444
50947 190444 190898 190632 189717 188339 186600 184387 181613 178467 175254 172153 169295 166936 165320 164455 164204
50932 164204 164542 165517 167050 168909 170859 172728 174357 175660 176645 177314 177626 177661 177730 178172 179105 180474 182273
50915 182273 184596 187536 191178 195589 200705 206287 212099 218036 223994 229741 235049 239887 244321 248309
50901 248309 251672 254222 255776 256192 255503 253961 251796 249009 245550 241574 237399 233294 229466 226160 223595
50886 223595 221823 220849 220802 221853 223976 226981 230755 235311 240579 246336 252326 258372 264352 270233 276176
$$ packed form
50999A34936n37l45k51q7R2O7j40k62j98j11q8j6J32J86Q5J4J03K30K47K21K75
50978A34553L94M93N48N72N36M39L70M13N63P63R70J157J320J457J548J573J617
50961A49286J821K173K501K736L029L449L792L882L840L822L655L074K153J231
50947A90444M54k66r15j378j739k213k774l146l213l101k858k359j616q65k51
50932A64204L38R75J533J859J950J869J629J303R85O69L12L5O9M42R33J369J799
50915A82273K323K940L642M411N116N582N812N937N958N747N308M838M434L988
50901B48309L363K550J554M16o89j542k165k787l459l976m175m105l828l306k565
50886B23595j772r74m7J051K123L005L774M556N268N757N990O046N980N881N943
$$ plain form
50871 276176 282526 289641 297755 306996 317449 329172 342150 356241 371167 386679 402667 419061
50859 419061 435571 451682 466959 481198 494243 505805 515619 523646 530004 534789 538067 539960 540627
50846 540627 540240 539102 537687 536432 535552 535093 534981 534864 534057 531922 528329 523658 518366 512670 506525 499765
50830 499765 492250 483968 474964 465190 454525 443013 430887 418286 405132 391461 377677 364266
50818 364266 351399 339036 327292 316441 306613 297747 289825 282887 276822 271362 266329 261744 257647
50805 257647 253988 250704 247779 245183 242872 240846 239111 237614 236302 235218 234417 233841 233405 233161 233240 233642
50789 233642 234227 234890 235655 236580 237706 239052 240555 242045 243399 244706 246136 247735 249468 251443 253866
50774 253866 256773 259946 263160 266404 269835 273628 277909 282747 288133 293998 300295 307075 314555 323074
$$ packed form
50871B76176O350P115Q114R241J0453J1723J2978J4091J4926J5512J5988J6394
50859D19061J6510J6111J5277J4239J3045J1562R814Q027O358M785L278J893O67
50846E40627l87j138j415j255q80m59j12j17q07k135l593m671n292n696o145o760
50830D99765p515q282r004r774j0665j1512j2126j2601j3154j3671j3784j3411
50818C64266j2867j2363j1744j0851r828q866p922o938o065n460n033m585m097
50805B57647l659l284k925k596k311k026j735j497j312j084q01n76m36k44P9M02
50789B33642N85O63P65R25J126J346J503J490J354J307J430J599J733J975K423
50774B53866K907L173L214L244L431L793M281M838N386N865O297O780P480Q519
$$ plain form
50760 323074 332919 344143 356642 370425 385689 402606 421225 441662 464215 489124 516341 545679
50748 545679 577062 610430 645531 681992 719489 757650 795834 833237 869118 902764 933252
50737 933252 959540 980807 996626 1006855 1011589 1011230 1006423 997884 986402 972932 958482 943909
50725 943909 929959 917450 907161 899484 894285 891116 889381 888274 886770 883832 878616 870494 859039
50712 859039 844066 825664 804105 779747 752958 724129 693746 662466 631049 600181 570438
50701 570438 542376 516491 493017 471941 453265 437100 423427 411986 402555 395144 389740 386066
50689 386066 383780 382708 382679 383315 384283 385548 387104 388599 389543 389783 389467 388654 387322 385635 383818 381804
50673 381804 379380 376638 373899 371170 368074 364368 360156 355532 350408 344852 339241 333893 328805 323923
$$ packed form
50760C23074R845J1224J2499J3783J5264J6917J8619K0437K2553K4909K7217K9338
50748E45679L1383L3368L5101L6461L7497L8161L8184L7403L5881L3646L0488
50737I33252K6288K1267J5819J0229M734l59m807q539j1482j3470j4450j4573
50725I43909j3950j2509j0289p677n199l169j735j107j504k938n216q122j1455
50712H59039j4973j8402k1559k4358k6789k8829l0383l1280l1417l0868k9743
50701E70438k8062k5885k3474k1076j8676j6165j3673j1441r431p411n404l674
50689C86066k286j072k9O36R68J265J556J495R44K40l16q13j332j687j817k014
50673C81804k424k742k739k729l096l706m212m624n124n556n611n348n088m882
$$ plain form
50659 323923 319386 315348 311784 308685 306241 304659 303962 304086 305013 306650 308763 311155 313860 317063 321006
50644 321006 325988 332257 339803 348436 358151 369257 382033 396435 412262 429400 447763 467166
50632 467166 487409 508355 529757 551174 572168 592512 612108 630792 648333 664498 678999
50621 678999 691432 701351 708322 711896 711672 707506 699614 688504 674939 659959 644713 630132 616839
50608 616839 605331 596030 589099 584358 581468 580035 579536 579338 578918 577877 575693 571669 565267 556361 545075
50593 545075 531598 516235 499489 481923 464081 446590 430127 415115 401613 389615 379273
50582 379273 370719 363835 358442 354576 352417 352016 353266 356064 360354 366064 373118 381436 390814 400900
50568 400900 411361 421982 432494 442449 451412 459212 465868 471352 475615 478783 481204 483221 484937
$$ packed form
50659C23923m537m038l564l099k444j582o97J24R27J637K113K392K705L203L943
50644C21006M982O269P546Q633R715J1106J2776J4402J5827J7138J8363J9403
50632D67166K0243K0946K1402K1417K0994K0344J9596J8684J7541J6165J4501
50621F78999J2433R919O971L574k24m166p892j1110j3565j4980j5246j4581j3293
50608F16839j1508r301o931m741k890j433m99j98m20j041k184m024o402q906j1286
50593E45075j3477j5363j6746j7566j7842j7491j6463j5012j3502j1998j0342
50582C79273q554o884n393l866k159m01J250K798M290N710P054Q318R378J0086
50568D00900J0461J0621J0512R955Q963P800O656N484M263L168K421K017J716
$$ plain form
50555 484937 486208 486810 486672 485924 484722 483085 481008 478673 476406 474494 473180 472779 473548 475440 478214
50540 478214 481825 486447 492099 498502 505406 512738 520309 527688 534605 541272 548102 555326 563070 571593
50526 571593 581145 591744 603314 615803 628642 639991 646929 646880 639161 625377 608454 591153 575170
50513 575170 561255 549778 540916 534453 529831 526575 524510 523478 523144 523218 523622 524182 524313 523267 520555
50498 520555 515999 509534 501220 491342 480282 468332 455819 443255 431183 419883 409392 399663
50486 399663 390512 381563 372508 363382 354372 345475 336584 327848 319663 312293 305744 300024 295275 291602
50472 291602 288982 287393 286896 287490 289028 291356 294449 298368 303122 308598 314563 320733 326941 333203 339617
50457 339617 346213 352941 359767 366720 373936 381658 390085 399098 408306 417428 426494 435545 444295 452322
$$ packed form
50555D84937J271O02j38p48j202j637k077k335k267j912j314m01P69J892K774
50540D78214L611M622N652O403O904P332P571P379O917O667O830P224P744Q523
50526E71593R552J0599J1570J2489J2839J1349O938m9p719j3784j6923j7301j5983
50513E75170j3915j1477q862o463m622l256k065j032l34P4M04N60J31j046k712
50498E20555m556o465q314r878j1060j1950j2513j2564j2072j1300j0491r729
50486C99663r151q949r055r126r010q897q891q736q185p370o549n720m749l673
50472B91602k620j589m97N94J538K328L093L919M754N476N965O170O208O262O414
50457C39617O596O728O826O953P216P722Q427R013R208R122R066R051Q750Q027
$$ plain form
50443 452322 459504 466064 472236 478143 483959 489963 496347 503082 510044 517159 524417 531805 539275 546798
50429 546798 554510 562828 572324 583374 596005 610100 625590 642350 660036 678205 696497 714553
50417 714553 731835 747702 761607 773076 781591 786723 788352 786626 781695 773646 762641 748971 732991
50404 732991 715131 695957 676127 656296 637198 619677 604474 591954 582155 575027 570552 568686
50392 568686 569389 572662 578426 586401 596184 607364 619358 631224 641790 649912 654484 654428 648994 638142
50378 638142 622455 602727 579836 554937 529369 504207 480064 457343 436450 417647 400879
50367 400879 385906 372536 360620 349946 340237 331266 322929 315289 308542 302874 298335 294850 292335
50354 292335 290710 289890 289826 290559 292090 294278 296951 300104 303815 308026 312566 317395 322650 328396 334450
$$ packed form
50443D52322P182O560O172N907N816O004O384O735O962P115P258P388P470P523
50429E46798P712Q318R496J1050J2631J4095J5490J6760J7686J8169J8292J8056
50417G14553J7282J5867J3905J1469Q515N132J629j726m931q049j1005j3670j5980
50404G32991j7860j9174j9830j9831j9098j7521j5203j2520r799p128m475j866
50392E68686P03L273N764P975R783J1180J1994J1866J0566Q122M572n6n434j0852
50378F38142j5687j9728k2891k4899k5568k5162k4143k2721k0893j8803j6768
50367D00879j4973j3370j1916j0674r709q971q337p640o747n668m539l485k515
50354B92335j625q20o4P33J531K188K673L153L711M211M540M829N255N746O054
$$ plain form
50339 334450 340536 346497 352286 357778 362653 366487 368980 370116 370089 369097 367328 365113 362866 360774 358717
50324 358717 356641 354837 353668 353161 353123 353538 354613 356461 359029 362343 366588 371914 378329 385792 394233
50309 394233 403474 413315 423731 434795 446362 458000 469238 479776 489437 498083 505613 511857 516486
50296 516486 519141 519687 518185 514658 509032 501339 491781 480581 467945 454274 440217 426433 413374
50283 413374 401319 390490 381044 373071 366624 361695 358163 355901 354927 355318 356981 359637 363010 366884
50269 366884 370964 374841 378131 380522 381665 381184 378842 374611 368610 361077 352412 343074 333420 323722
50255 323722 314297 305422 297153 289430 282344 276103 270726 266004 261846 258444 255983 254322 253032 251596
50241 251596 249539 246557 242661 238146 233392 228757 224596 221178 218542 216577 215280 214771 215034 215844 216981
$$ packed form
50339C34450O086N961N789N492M875L834K493J136k7r92j769k215k247k092k057
50324C58717k076j804j169n07l8M15J075J848K568L314M245N326O415P463Q441
50309C94233R241R841J0416J1064J1567J1638J1238J0538R661Q646P530O244M629
50296E16486K655N46j502l527n626p693r558j1200j2636j3671j4057j3784j3059
50283D13374j2055j0829r446p973o447m929l532k262r74L91J663K656L373L874
50269C66884M080L877L290K391J143m81k342m231o001p533q665r338r654r698
50255C23722r425q875q269p723p086o241n377m722m158l402k461j661j290j436
50241B51596k057k982l896m515m754m635m161l418k636j965j297n09K63Q10J137
$$ plain form
50226 216981 218346 219850 221408 223113 225168 227564 230009 232303 234573 237019 239602 242118 244450 246584
50212 246584 248497 250150 251516 252543 253183 253546 253902 254434 255089 255749 256417 257132 257858 258525 259100 259522 259717
$$ packed form
50226B16981J365J504J558J705K055K396K445K294K270K446K583K516K332K134
50212B46584J913J653J366J027O40L63L56N32O55O60O68P15P26O67N75M22J95
$$ [...]
##END NTUPLES=NMR SPECTRUM
##END=
