##TITLE=AC1570_ROEFFECT0021_8271160_rmaLZ5i7eE
##JCAMPDX= 6.0         $$ Bruker NMR JCAMP-DX V2.0
##DATA TYPE= NMR SPECTRUM
##DATA CLASS= NTUPLES
##ORIGIN= BRUKER
##OWNER= Administrator
$$ 1.72 TOPSPIN		Version 2.1
$$ 2013-10-18 18:11:54.168 -0700  Administrator@X
$$ Compression mode = diff/dup
##.OBSERVE FREQUENCY= 400.02188249412
##.OBSERVE NUCLEUS= ^1H
##.ACQUISITION MODE= SIMULTANEOUS (DQD)
##.ACQUISITION SCHEME= undefined
##.AVERAGES= 8
##.DIGITISER RES= 22
##SPECTROMETER/DATA SYSTEM= spect
##.PULSE SEQUENCE= zg30
##.SOLVENT NAME= COFFEE_meoh
##.SHIFT REFERENCE= INTERNAL, COFFEE_meoh, 1, 14.98509
##AUDIT TRAIL= $$ (NUMBER, WHEN, WHO, WHERE, PROCESS, VERSION, WHAT)
$$ ##TITLE= Audit trail, TOPSPIN		Version 2.1
$$ ##JCAMPDX= 5.01
$$ ##ORIGIN= Bruker BioSpin GmbH
$$ ##OWNER= Administrator
$$ $$ E:\/data/COFFEE/nmr/AC1570_ROEFFECT0021_8271160_rmaLZ5i7eE/10/pdata/1/auditp.txt
$$ ##AUDIT TRAIL=  $$ (NUMBER, WHEN, WHO, WHERE, PROCESS, VERSION, WHAT)
(   1,<2013-10-18 18:11:47.199 -0700>,<Administrator>,<X>,<go>,<TOPSPIN 2.1>,
      <created by zg
	started at 2013-10-18 18:10:41.418 -0700,
	POWCHK enabled, PULCHK disabled,
       configuration hash MD5:
       C8 4E 4E 5D D3 5C D8 9E 9F 52 82 E0 59 8A DE 15
       data hash MD5: 64K
       1F FF 27 05 B4 00 62 EC 3B 31 67 6B E0 99 5F DA>)
(   2,<2013-10-18 18:11:50.214 -0700>,<Administrator>,<X>,<proc1d>,<TOPSPIN 2.1>,
      <Start of raw data processing
       efp LB = 0 FT_mod = 6 PKNL = 1 PHC0 = 0 PHC1 = 0 SI = 32K 
       data hash MD5: 32K
       D6 99 EC 34 D3 90 38 11 A4 11 AB 04 B5 23 8C 8F>)
(   3,<2013-10-18 18:11:50.621 -0700>,<Administrator>,<X>,<proc1d>,<TOPSPIN 2.1>,
      <pk PHC0 = 95.10864 PHC1 = 0 
       data hash MD5: 32K
       43 BF 6B 16 F8 53 6E E8 38 52 74 2E CB F8 2C A8>)
(   4,<2013-10-18 18:11:50.777 -0700>,<Administrator>,<X>,<proc1d>,<TOPSPIN 2.1>,
      <abs ABSG = 1 
       data hash MD5: 32K
       55 EE AB 3F B4 1F B6 AC C2 58 FB B1 F0 C5 08 6F>)
(   5,<2013-10-18 18:11:50.918 -0700>,<Administrator>,<X>,<proc1d>,<TOPSPIN 2.1>,
      <abs ABSG = 2 
       data hash MD5: 32K
       F6 E6 A9 EC 5B 46 EC E5 E7 EB 73 4C B5 09 99 5C>)
(   6,<2013-10-18 18:11:51.027 -0700>,<Administrator>,<X>,<proc1d>,<TOPSPIN 2.1>,
      <abs ABSG = 3 
       data hash MD5: 32K
       86 CA D6 26 52 90 36 88 94 81 B6 47 E0 4A 64 4F>)
(   7,<2013-10-18 18:11:51.058 -0700>,<Administrator>,<X>,<proc1d>,<TOPSPIN 2.1>,
      <abs ABSG = 4 
       data hash MD5: 32K
       54 C2 30 93 9D 8B 95 60 6D D0 88 1D 8D 4A D6 D5>)
(   8,<2013-10-18 18:11:51.121 -0700>,<Administrator>,<X>,<proc1d>,<TOPSPIN 2.1>,
      <abs ABSG = 5 
       data hash MD5: 32K
       2C E4 E1 BD 13 31 AB 20 28 B6 4D 04 37 77 FB DF>)
$$ ##END=
$$ 
$$ $$ hash MD5
$$ $$ 1A 17 3B B1 04 D6 8E 8E 74 52 B6 8E F5 60 E7 63
##$RELAX= 
##$RELAX= 
##$RELAX= 
##$RELAX= 
##$RELAX= 
##$RELAX= 
##$RELAX= 
$$ Bruker specific parameters
$$ --------------------------
##$DU= <E:\>
##$EXPNO= 10
$$ [...]
##$TP= (0..7)
150 150 150 150 150 150 150 150
##$TP07= 0
##$TPNAME0= <>
##$TPNAME1= <>
##$TPNAME2= <>
##$TPNAME3= <>
##$TPNAME4= <>
##$TPNAME5= <>
##$TPNAME6= <>
##$TPNAME7= <>
##$TPOAL= (0..7)
0.5 0.5 0.5 0.5 0.5 0.5 0.5 0.5
##$TPOFFS= (0..7)
0 0 0 0 0 0 0 0
##$TUNHIN= 0
##$TUNHOUT= 0
##$TUNXOUT= 0
##$USERA1= <user>
##$USERA2= <user>
##$USERA3= <user>
##$USERA4= <user>
##$USERA5= <user>
##$V9= 5
##$VALIST= <valist>
##$VCLIST= <CCCCCCCCCCCCCCC>
##$VD= 0
##$VDLIST= <DDDDDDDDDDDDDDD>
##$VPLIST= <PPPPPPPPPPPPPPP>
##$VTLIST= <TTTTTTTTTTTTTTT>
##$WBST= 1024
##$WBSW= 4
##$XGAIN= (0..3)
0 0 0 0
##$XL= 0
##$YL= 0
##$YMAX_a= 642326
##$YMIN_a= -545788
##$ZGOPTNS= <>
##$ZL1= 120
##$ZL2= 120
##$ZL3= 120
##$ZL4= 120
##$ABSF1= 14.98509
##$ABSF2= -5.573092
##$ABSG= 5
##$ABSL= 3
##$ALPHA= 0
##$AQORDER= 0
##$ASSFAC= 0
##$ASSFACI= 0
##$ASSFACX= 0
##$ASSWID= 0
##$AUNMP= <proc_prof1d_extract_pilot.lims>
##$AXLEFT= 0
##$AXNAME= <>
##$AXNUC= <1H>
##$AXRIGHT= 0
##$AXTYPE= 0
##$AXUNIT= <>
##$AZFE= 0.1
##$AZFW= 0.1
##$BCFW= 0
##$BC_mod= 0
##$BYTORDP= 0
##$COROFFS= 0
##$CY= 15
##$DATMOD= 1
##$DC= 0
##$DFILT= <>
##$DTYPP= 0
##$F1P= 0
##$F2P= 0
##$FCOR= 0.5
##$FTSIZE= 32768
##$FT_mod= 6
##$GAMMA= 0
##$GB= 0
##$INTBC= 1
##$INTSCL= 1
##$ISEN= 128
##$LB= 0
##$LEV0= 0
##$LPBIN= 0
##$MAXI= 10000
##$MC2= 0
##$MEAN= 0
##$ME_mod= 0
##$MI= 0
##$NCOEF= 0
##$NC_proc= -8
##$NLEV= 6
##$NOISF1= 0
##$NOISF2= 0
##$NSP= 0
##$NTH_PI= 0
##$NZP= 0
##$OFFSET= 14.98509
##$PC= 1
##$PHC0= 95.10864
##$PHC1= 0
##$PH_mod= 1
##$PKNL= yes
##$PPARMOD= 0
##$PPDIAG= 0
##$PPIPTYP= 0
##$PPMPNUM= 2147483647
##$PPRESOL= 1
##$PSCAL= 4
##$PSIGN= 0
##$PYNMP= <proc.py>
##$REVERSE= no
##$SF= 400.02
##$SI= 32768
##$SIGF1= 0
##$SIGF2= 0
##$SINO= 400
##$SIOLD= 32768
##$SPECTYP= <>
##$SREGLST= <1H.CDCl3>
##$SSB= 0
##$STSI= 32768
##$STSR= 0
##$SW_p= 8223.68421052631
##$SYMM= 0
##$S_DEV= 0
##$TDeff= 65536
##$TDoff= 0
##$TI= <>
##$TILT= no
##$TM1= 0
##$TM2= 0
##$TOPLEV= 0
##$USERP1= <user>
##$USERP2= <user>
##$USERP3= <user>
##$USERP4= <user>
##$USERP5= <user>
##$WDW= 1
##$XDIM= 32768
##$YMAX_p= 461348149
##$YMIN_p= -716839
##$CURPLOT= <Network HP LaserJet P1505>
##$CURPRIN= <$Network HP LaserJet P1505>
##$DFORMAT= <normdp>
##$LAYOUT= <+/1D_H.xwp>
##$LFORMAT= <normlp>
##$PFORMAT= <normpl>
##$SURQMSG= 1
$$ End of Bruker specific parameters
$$ ---------------------------------
##NTUPLES= NMR SPECTRUM
##VAR_NAME=  FREQUENCY,     SPECTRUM/REAL,   SPECTRUM/IMAG
##SYMBOL=    X,             R,               I
##VAR_TYPE=  INDEPENDENT,   DEPENDENT,       DEPENDENT
##VAR_FORM=  AFFN,          ASDF,            ASDF
##VAR_DIM=   32768,         32768,           32768
##UNITS=     HZ,            ARBITRARY UNITS, ARBITRARY UNITS
##FACTOR=    0.250966925370066, 1,           1
##FIRST=     8223.43324360094, -152593,      2751
##LAST=      0,             -97622,          -172316
##MIN=       0,             -716839,         0
##MAX=       8223.43324360094, 461348149,    0
$$ Real data points
##PAGE= N=1
##DATA TABLE= (X++(R..R)), XYDATA
$$ [...]
23886 77892 -50493 -59055 -78108 29120 -286456 157029 3116 -108743 -155658 -50080 344692
23874 170697 -303049 -437682 -134382 -227522 108687 -15230 255409 169065 -175461 32540
23863 -81543 151468 -330600 87450 -114329 -121622 -155208 -322796 -259999 68934 -112428 137234
23851 308586 -106493 90811 168472 -137076 129903 -257329 -298230 -4770 57654 -31123 10781
23839 95645 -257682 165709 -163273 114852 160097 -161018 119513 95823 94615 -43724 40268
23827 -179965 163338 -22236 162356 -276406 66728 -309487 -35813 -199898 71345 -235973
23816 6913 -319368 206525 -340693 249540 -109158 -140091 -120074 405606 159721 68213
23805 -179346 175424 -56617 -229731 -200334 -248661 -330234 -326847 -131297 162809 -21930 624194
23793 -15450 374831 -43408 183704 129851 -269804 -116642 -175368 -164233 71199 68399 -48682
23781 -18389 -290168 -147019 -49122 -40750 -199076 33189 -204722 91031 -19880 278715 295256
23770 295256 216362 86330 -99064 -108900 -152008 -81139 -46410 93703 -268281 219182 92997
23758 163966 75127 -11788 96471 169897 21214 -148434 -41540 -254764 -202346 -212412 81191
23746 15344 -96906 -155659 -69476 45609 121358 -213082 -96541 100140 -105477 16223 155177
23735 155177 -343741 -178215 -55162 92141 124820 110421 393939 98057 172047 -186168 -86348
23723 -239531 -4647 82593 -131769 -156342 -15038 11083 139965 -128774 -24568 -407375 1613
23711 -188311 -65513 168550 -94859 -16686 528880 -36086 -35346 272990 -119968 -197019 95858
23699 22293 -208296 -167714 49575 65350 -16096 -8405 29243 -19497 60831 -21103 139235
23687 -116389 172696 -177606 -183856 -242180 18431 27338 -153124 5531 137261 -56824 -26752
23675 48595 -227922 -130556 -199265 9617 56622 290563 207664 69894 134729 -287635 -316555
23664 -316555 -170590 -18647 249328 -27515 -123586 -133334 176330 83572 95352 -106036 -227396
23653 -227396 -611577 73097 -146820 -186599 49250 -93784 99391 -2768 25460 203936 -77325
23641 21825 186735 150066 -331490 -254167 -18469 -169382 135048 -184251 190299 147299
23631 147299 171117 -137997 194627 -64621 15500 187795 -105258 38848 111984 -397926
23620 249764 97337 -4882 -10758 45478 -79905 220600 -248354 -72758 -14830 -194247 -141159
23609 -141159 -316700 261511 159715 75760 382785 -243539 127188 -57289 190980 21895
23598 312767 220183 176580 -294337 204095 -74103 79425 -154851 14463 215130 -165232
23587 135764 -66506 220330 83903 189344 -91604 40865 -31860 41175 159633 -65399 303325
23575 -41414 -227408 78710 -205948 -90235 -117578 61018 -48939 35279 -221023 -96588 242331
23563 -210504 236074 -118466 289599 -28976 227412 774 -200740 -60266 -9043 -71181 -48841
23552 -48841 382642 -64790 -47435 -152210 74354 -188376 137339 -137991 163232 -68400
23541 34210 -272218 34629 -1582 -138948 237279 -295504 -46981 128840 -172494 -355396
23531 -355396 149053 -50278 -175420 151123 -158538 -315214 111697 -203569 -430646 367381
23520 -310817 138389 -129394 -19252 57026 102426 -37278 30497 2684 61629 -201402 -121841
23509 -121841 -176841 100016 -120075 -187079 186685 220471 261191 188266 303366 113813
23498 82564 75028 -166660 56940 402891 -80894 24418 -156045 30949 -223246 -211881 250873
23486 -313045 -99404 -196467 -31432 -50282 -111490 -165429 -178422 -236390 43284 -200336 -220826
23475 -220826 245495 -252630 202814 -294677 -239325 230119 -242220 -39014 282345 91179
23464 -180626 212893 -320257 233743 -31208 -253658 -130198 -37260 128450 -91073 -494589
23454 -494589 145749 20125 251821 18718 -215171 141963 16487 169967 -148192 223716
23443 -51123 13075 -3349 11931 70000 12819 -90309 100156 -148056 -9543 -61271 197105
23431 41596 -27173 27352 -3975 183217 -62851 -137067 -209156 -43918 -286567 30776 -72884
23419 67919 -202034 166580 262014 -108177 80862 -155337 -96497 12850 -113627 -68787 -12081
23407 -353646 167246 -101501 -38840 -56028 -300722 253885 105156 -122439 170525 193628
23397 193628 -151767 220090 25505 49564 -118757 172155 -320315 -27875 188912 -21106
23386 271732 -250022 236891 -92838 -112243 -337244 -167869 86804 -43958 -322226 -83438
23375 140746 -63051 -196703 204135 -105102 -284344 -24451 -41456 281954 68640 92145
23365 92145 15687 -106300 -251895 -90566 -210336 65414 -144384 76178 183512 -48885 56643
23353 13451 -70425 100721 -182082 36392 354367 353771 164440 -151454 264211 137359 -136169
23341 213849 -336194 3777 -69808 -102270 -250968 -236739 -202642 -238034 24162 -185328 -194299
23330 -194299 -174649 -148057 -244888 -239849 333323 -117221 -26875 -309096 161864 -54805 28359
23318 -178751 19946 -54078 -136476 -120539 -19736 -8240 -87689 -146148 375507 261704 -68042
23306 241445 11821 88142 -160230 -154684 33839 -78000 -195978 66780 -36290 -226710 -115449
23295 -115449 -378540 17764 -67870 -128455 -158902 -1038 58481 -109749 -249536 -88709 60010
23283 23747 -45710 -6963 -15147 42037 -65290 -86642 185158 98217 7165 -257201 -154956 256355
23270 -15639 -102966 -52436 -230736 -95591 59409 243846 186255 -89049 -47270 101020 168303
23259 168303 -141832 -9327 -416478 14867 310101 26687 249753 98215 315958 -285498
23248 57817 25672 -357050 -22055 -72128 172724 130479 -68994 66751 24679 88071 45491
23237 45491 -16715 -70216 120233 -122497 -61925 -93791 206831 171510 153145 72937 -144125
23225 -39911 -253003 -342604 -99521 75997 104921 75573 -144478 288580 16793 -81709 131542
23213 160422 -331078 -75524 81455 170832 164718 -85797 123350 -365832 206191 45388 -129816
23201 -79154 -205541 -174641 -121344 33808 280194 -120440 -212796 -118204 459104 -175524 -219868
23190 -219868 -136992 183390 38300 55848 327471 -173330 -20800 392373 -109226 109379
23179 63165 203901 271810 65464 -187899 -71944 12314 188468 -213769 -271109 115985 -322872
23167 -45653 25158 -353187 -92368 109547 -107736 202253 -104148 -54868 116288 461065
23157 461065 -4375 -135242 -209524 -83026 -79293 -125906 -192129 123023 -43764 38572 302106
23146 302106 -29839 -191850 -39943 -101999 -220647 4880 -33702 48857 262325 68076 -144826
23134 -198555 22392 257608 1514 -130706 159023 -161940 -3977 -72209 14918 -30597 -41358
23123 -41358 4124 -59935 -171186 -111149 110493 145753 -226991 54830 22852 -217775 219053
23111 -170559 278282 -285658 -14541 411190 -198514 203045 -109091 -112492 153690 -126981
23100 -96951 -163537 86025 271395 174578 2340 37381 -138890 -113413 -216113 163205 -13233
23088 101376 -129031 373332 -21088 61918 200545 -106865 28003 10611 -282697 -228059
23078 -228059 -97247 -38369 -57010 -292272 -93400 20119 139368 77222 99093 -384340 -260209
23067 -260209 177137 63797 37661 -101994 -135859 197666 -32171 308892 320916 -183088
23056 -450139 52433 -164201 -99290 142220 86458 47972 46114 202542 -234455 237425 128887
23045 128887 -318406 -4272 -25323 80251 -232064 -199123 -240454 -149417 367137 -234739 -155290
23034 -155290 -365095 40242 -121071 302423 406855 368184 -221541 -52797 -263270 49405
23023 99781 107605 98742 179967 48689 -191761 -22339 242735 -46266 3985 125613 -100081
23011 61365 -19138 151150 62827 100948 -241486 39185 272823 -19963 125862 -130153 -118719
23000 -118719 -268092 112367 -29817 -183178 -339609 52485 223609 -110101 196548 31675
22989 319238 147582 -299869 38973 93560 295586 -333265 -31760 -166446 -6274 -319326
22979 -319326 84570 -50792 104816 49621 114954 41631 35304 20421 30528 67227 23819
22967 -28032 -59412 -2874 -466742 65983 447554 89427 -2600 -61590 42344 197335 216993
22956 216993 113364 144625 111684 -54056 -6137 -187728 -354131 101429 78024 134158 59622
22944 -53193 289374 -216755 250184 -81291 29089 37804 -153035 986 -94654 -58305 -102980
22933 -102980 -125158 -203687 -23118 -27648 -43904 -128553 8831 -86681 75210 -201246 -124075 90641
22920 14010 10133 145070 260532 -49479 -10488 34460 -58585 14582 -367409 -87931 -190754
22909 -190754 -25552 -121819 -300601 94361 -298260 169302 -124070 -302887 97504 -299763
22898 -146087 -102345 -34966 -61910 133301 -118219 -202043 -189433 92197 -207642 105063 -61898
22886 109349 -63433 95401 -135429 -45246 63648 194209 -86563 49222 -110928 -168990 234093
22874 139512 -228690 -98617 -29781 128645 -3472 -59693 270355 -138053 -49446 34559 -30244
22862 225748 118152 -84879 44394 -199489 -157474 -203228 -386852 -168832 69998 -31023 -265824
22851 -265824 40332 -201780 -174898 -269864 -43114 12740 62593 310792 -210327 -209476 -72241
22839 -70132 28362 -252712 100253 -341723 189035 168982 143394 -44320 97947 -11368 -139463
22828 -139463 61194 143 -325121 -100479 256033 251293 -379 -178666 -13268 104425 101033 217987
22816 217987 -189990 -148300 370229 348476 55544 220068 41913 -59737 -156118 -38709 -166367
22805 -166367 -138250 -23980 -49345 23637 -70838 -95811 29670 102363 154098 -160799 -138021
22794 -138021 180663 -153700 -67848 -266363 -3512 -36306 161346 -197336 -102148 119969
22783 -26655 135621 52024 -27627 -87685 -196398 -149036 -117895 -43242 19182 74370 159085
22772 159085 -9938 -100718 -426947 -143331 -172082 141775 -47815 236879 -275461 62556 62087
22761 62087 -350061 -75467 -91589 10202 58326 95607 23460 178469 197561 353492 -98672
22749 -116779 30687 -240674 -350630 -256097 -149278 75954 266264 29665 145870 -165246
22738 146748 -80266 -99971 -168974 -106749 -90553 23791 133946 -5359 -124963 5911 -46948
22726 108421 -72262 -189208 -236594 78764 132755 -84351 -115913 -243951 142961 -235094 285297
22714 -245877 -53195 300420 -353029 242082 -174975 -242967 95511 206379 -234959 -161870
22704 -161870 5535 56842 -244212 128441 13216 275160 -51707 -179787 -64862 -103847 -94434
22693 -94434 -261899 -10421 43789 -160083 136781 4708 -71332 -65620 -68959 68311 105238 159110
22681 159110 -19905 110569 30521 106181 59986 -22126 -270552 -188429 -159658 -35126 12228
22669 134702 -60721 187758 -171397 -205644 28465 237099 38561 5207 -106990 -191505 17259
22657 61494 -83014 157525 174604 -177580 -109189 240114 12967 -327897 229598 -54869 17855
22645 -348035 -180113 -180733 -299412 -59443 -190016 15569 -41033 104955 89528 -60062 91690
22633 -174687 -159891 74579 43855 -424214 -83098 61061 -375109 75770 72700 41820 -210791
22621 -165887 86870 -52986 15721 -323697 -159708 -143423 171404 -379793 -1112 215533 25060
22609 -267914 188633 -161383 -131783 -176666 113902 -370228 -111187 262164 112038 -202350
22598 -161146 294824 145004 49622 -361940 -156489 -98389 51765 -93479 -101877 -56744 -4628
22586 -27173 29711 -134238 271642 158787 123221 -120597 -226790 277404 -127664 86706
22575 -176818 -32484 122988 -170759 22472 -64017 -27403 -7197 206269 10464 -110288 143951
22563 -103464 -50839 257597 -275552 -37385 27566 -178633 63781 10505 -152749 -42824 -273957
22552 -273957 52836 -91262 83704 -152930 165531 -214826 -290278 11069 97137 -67938 54238
22540 305166 5020 16909 -42257 42943 93349 211618 -61754 121682 149973 -96242 -145295
22529 -145295 -66502 -14940 111001 -529396 -171305 -153928 -136666 276356 -225405 68705
22518 -122020 230878 -43390 212837 -107679 981 95788 84056 -145161 -60518 -111774 -247812
22507 -247812 20650 216009 -26221 -205969 -188742 -97313 -35226 -171068 129474 -124415
22496 -275526 447972 -223003 -275532 21901 -6168 174984 -31295 130771 -347318 -41478 212039
22484 -21915 5516 -314629 127872 -74422 -164174 62762 -199277 -26979 27292 14040 27954
22473 27954 52269 -146929 -91294 -139510 129353 -43357 445 267774 -313151 -423322 -54520
22461 38158 324571 -198069 -151884 -274220 -58188 -7096 -96208 -43179 -356226 -419742 235341
22449 184415 -143220 3325 81025 -365840 183955 149160 -19885 -89782 -4043 42868 -398711
22437 -136968 -171408 2622 55974 -79870 -97697 -7819 -69108 -98068 -44604 -284583 -18654 69493
22424 28867 23638 413372 -263397 -40831 242330 -6042 48576 -64501 79419 192888 -160560
22412 -63572 42686 74749 -186889 -33800 204869 -291995 166841 17560 -21020 300404 -40048
22400 24201 233547 -145647 23172 22841 -25723 214529 -295571 197718 85515 -260220 -62031
22388 -67397 -59344 -88800 303318 -6633 53176 -53387 59311 146979 100518 885 298994 69635
22375 -123160 85337 149569 4428 -144099 -211719 9505 -586655 -26737 13 217316 -202540 -67727
22362 -35124 -42957 -319469 -149880 49809 252028 -44572 90126 -94741 89389 71717 -382810
22350 -240536 -184457 -396883 -296031 286572 196537 -361302 -98264 416134 -1450 96664 -39902
22338 48527 -47855 -406479 -146219 -17719 34864 31429 -137584 156713 -152841 -257861 -292351
22327 -292351 -162250 -16551 379717 -185477 -11038 -65126 -42522 24688 -154407 451355
22316 93544 -47488 -92420 -32853 -47365 -122788 -42563 -25594 -245801 -87114 -70074 134543
22304 -64624 -1506 -199019 8313 -56339 43069 -133705 -176622 -294547 139220 -143382 108118
22292 -42869 -321060 280130 -17854 354048 -351977 -366687 99542 -112640 19761 -205871
22281 -186712 115586 -230592 80102 -124041 121522 49986 -124653 18106 -16201 -205033
22271 -205033 111170 31188 -217788 -559980 -169103 -2630 260342 -118897 96290 84262
22261 84262 -78887 18254 -74503 -246847 -143783 -4636 -515009 -146660 -312840 20973 75042
22250 75042 -180848 3259 -94233 -383192 -328220 -284591 308319 -413300 98568 -6411 39810
22238 169191 35494 -20375 182120 7781 11439 -136647 -201863 -159217 -94910 -25588 -138712
22227 -138712 78243 -302310 -117354 -22365 136826 34867 35067 -9715 -73582 -16828 -315571
22216 -315571 -248896 -39008 232986 -54861 110602 -226567 155163 -15029 -175983 -378770
22206 -378770 -191460 202452 33354 -80152 2878 395337 -158596 -15887 -140911 48498 -65051
22194 263151 -168394 -236859 -233916 -101028 -104363 -114588 -133989 148450 8600 -133243 122989
22182 -363870 -14456 -139315 -69350 51703 23863 -8520 5525 52095 328263 -26975 11095
22170 33128 -252750 103592 7166 6793 -228555 155737 -107650 -103921 -35553 -87002 70825
22158 -58909 7512 -274040 -47278 -60272 103062 -24423 -216294 46785 345169 -346969 253487
22146 96057 115891 -279482 92423 47844 69709 232739 71701 -104455 201906 -177706 -316025
22135 -316025 -22213 56720 182307 282053 101335 -127969 -285702 64754 29325 39203 26568
22124 26568 20268 -145561 -75806 -107995 218400 -171116 -161988 192159 -156207 -197321 -61672
22112 167274 43646 -85767 6933 -88175 63000 99021 -168014 -255990 -235824 -265447 109736
22100 74050 -25319 73621 69445 45764 98604 52010 -104667 92547 153876 180534 -43369 98288
22087 -49770 -149611 -109020 -258487 -81334 -347091 -190092 129072 41141 -198448 -181242 -13421
22075 -271732 -17642 -17447 59679 -145119 -316755 -228701 11636 50834 -171554 -40811 -147568
22064 -147568 10644 -60312 63284 52438 -201320 -130449 -40026 -175902 8033 13230 -100477
22052 -148428 -176163 160767 -427395 75037 -54011 128222 22249 -473730 -82697 -140053 97223
22040 343190 53142 4580 -309172 184800 -131977 -261687 122696 -103973 -106519 385401
22029 -241391 -66858 87558 251592 -73772 -61263 117082 270268 37887 76080 -114043 -20902
22017 -77444 -7000 167175 -171387 -59526 -66921 -346020 -492857 -26684 144837 -62900 12157
22005 -185407 208396 257050 407576 7632 -102666 -199964 -33692 -207188 -437935 130675
21994 127613 -187321 -77322 156329 -95564 44279 -50552 -141546 -178266 -221048 87454 57721
21983 57721 -31354 -93149 -144577 -116794 72058 -254723 -221128 4838 9449 186493 -382846
21971 -100198 -109386 -115877 156236 -256593 29595 -90932 209918 -112403 -257718 399703 -44651
21959 -148581 31663 -87309 315287 -336245 -141604 44535 -223948 -130417 275736 -31359
21948 287377 -48064 -362617 -4297 226093 119842 -22403 -196993 -180896 -86751 -129388 93137
21936 161620 90920 -373751 219508 -96072 23375 -145917 -1834 179445 -22321 43664 312638
21925 312638 177736 -359922 -62433 -99410 183871 -124853 44545 51546 -84636 106050 116222
21914 116222 124884 -158188 128658 -54046 -48941 -346735 101921 54795 67218 25762 -68612
21902 146797 789 161263 162354 183101 133484 -221160 33023 26676 -415668 -81620 188710
21890 -52296 -129997 -134268 21700 27284 -155204 -321315 -36056 85708 -177348 -147632 104750
21878 -79765 652 -512507 -118657 -100711 -14837 110743 -38089 -159939 -165995 -63059 -310142
21867 -310142 -75511 -86590 -203720 -301149 -211868 158073 -84585 -106882 133280 -89293 -50218
21856 -50218 17127 225877 -295013 202037 43277 -126775 -21105 -163648 12872 112669 -25386
21844 -7259 -44169 -117753 22635 -280678 368209 91438 -149205 -183621 -205102 -258902 -390135
21833 -390135 -117459 -252206 -72278 -382281 -116523 601 -247086 327426 40349 20572 -61124
21821 71875 14465 -234984 -343585 -197309 -233775 290798 -79377 41618 -219420 -263615 -231524
21810 -231524 -59502 -434423 190130 -79534 -49219 178678 16490 -253198 269502 231985
21800 231985 -114445 278021 60097 -95931 215900 40286 -241620 171702 -198705 -62591
21789 -58311 -39991 83618 -71609 -49526 73347 -133518 -222416 115070 -304900 -161065 -173375
21778 -173375 141046 79287 85731 -238420 -216167 87219 -290153 -169403 7496 -301217 130368
21766 69661 99814 36581 53158 -170159 179273 -123344 15417 -168477 -148594 -93732 -10529
21754 -211272 -41899 -235803 -367190 -73941 -111228 -80291 -200467 -85035 -334534 -50280 161358
21742 155690 -53857 187756 507092 -137740 39288 -260880 -19307 -143618 -71691 77592
21731 -119147 4532 -179210 82098 91899 12355 -133932 49098 -11174 236036 -223754 -115009
21720 -115009 49550 108859 -98213 303895 -97579 88321 -46999 -145310 -142245 -63978 -33919
21709 -33919 22038 -4747 161164 233975 134076 -229932 -138579 34258 -290135 -309559 -272675
21698 -272675 -40602 123556 -12503 41451 64291 -416614 -161250 -85923 241944 -204047
21687 174932 -118440 288120 -23026 250117 -109374 -189936 39928 -48042 -79616 117700
21676 -43073 -20563 118864 37376 -89553 170112 -581851 46558 122776 -132244 -196462 33233
21664 71897 -37519 185214 -168103 -264620 75195 -271734 -43051 -68628 -88328 140173 -55250
21652 -116205 30315 -77 141617 -224089 -258034 101690 -377504 361777 74662 -106957 -161446
21641 -161446 158585 31434 56879 -54148 -2668 -226476 66234 -61535 5489 -156593 -6616
21629 -53735 69235 -408518 -21486 -332230 -238095 -251110 -60489 19590 -67577 -248664 -78956
21617 24071 -71512 83401 -12227 -262512 38890 102881 117794 120531 3750 -273914 142156
21605 -268900 -22490 -266610 -107359 -38140 -43652 -306537 -43220 150430 -6206 -167119 -172333
21594 -172333 516 85533 85741 74474 -216302 106396 -109825 76086 37956 211867 -78657
21582 172216 95384 -47413 113657 271643 242378 105092 -364978 -32554 -42920 -175756
21572 -175756 -23137 150800 351921 15988 -116965 -457120 112715 -55391 -145949 -35426
21561 -48160 79404 93795 138311 238098 -31279 -102418 95142 118098 -77267 -65403 -84335 37123
21548 185039 -335449 -320016 121779 -111642 -137803 -134065 -116355 325093 -279815 -232836 136781
21536 36263 -15983 -43753 -139119 -273878 177860 34937 47212 161296 -149551 -126721 -47188
21524 -48590 -129393 201967 -13855 -296083 329230 87084 -84058 702 -117762 -373302 -92090
21512 -371909 103499 -54501 -115879 -184864 -297899 125503 274716 2732 -83285 210561 72900
21500 243615 -80468 -10571 -121416 -379506 33520 -4389 -311618 53649 -256872 -84083 -254775
21489 -254775 67936 256912 135798 -44694 -151676 347241 149136 35414 -81034 220306
21478 -225881 -121479 -92804 -147845 -107610 -230403 15017 69398 -304681 320563 -235315
21467 8896 8507 -68070 114222 36524 63582 135933 -171412 -180273 -235878 -121475 138062 -222357
21454 415820 -32956 -41471 86658 23212 -246336 -299699 138959 6274 336106 -202953 -155840
21443 -155840 309031 124182 -36670 83786 -1769 165919 203425 349769 362100 143993 410286
21432 410286 198316 -71270 89992 279794 -296802 -373541 -127366 -135382 -258224 -319578 -164490
21421 -164490 -102779 -29839 -240939 -135925 168611 92273 235408 -362427 450786 -53934
21410 14502 -204101 -92854 36257 -3038 -219844 171857 152281 298391 1028 -374795 259349
21398 93702 -22033 -12902 243490 -97653 -66143 183741 -23175 -539114 -382015 254506 -244383
21386 18527 172817 -251776 103208 -234736 43768 74183 -103520 47507 -87640 -9885 221606
21374 -46551 -133443 -244912 -55842 -84298 -79669 160008 210245 -260835 -239648 20162 77346
21363 77346 -99991 42153 -246972 -69531 28115 -81644 -157843 -247769 -198958 -170807 -226015
21352 -226015 -87469 65407 260051 -117898 -41345 -214512 -187236 -86962 63366 -26442 -43205
21341 -43205 -130964 85739 -378701 225272 112714 -447752 181154 -404832 40027 -66526
21330 -96612 198869 -205436 -52316 -3416 -114831 -236182 858 -239080 -288498 80242 55940
21319 55940 -266596 -189488 -52901 -52716 -304827 -94533 -115293 -67649 -52215 -130497 19224 -19893
21306 11406 12451 -208970 -215938 236607 -202899 -18396 -289699 -348716 40736 -38594 -156621
21295 -156621 62663 52489 -185504 216619 -222889 294168 30972 -15092 255020 -169947
21284 137408 -198476 157764 -78190 -234662 -36742 73258 147722 -18069 -268860 143642
21273 37937 -22656 -116544 -337683 -161362 139522 -58314 -330028 74637 183635 -156134
21262 -198739 -133857 -138716 128941 52728 -153481 -288385 296480 -199336 -11654 132602
21251 88025 204494 -115732 275224 256073 -245679 248919 -315269 -381909 -305290 40582
21240 -8844 118751 25719 -14617 -138212 -158516 -41325 -284964 133567 -119599 -70288 164880
21228 -85498 37026 -87566 -313587 25573 -174818 -146372 159969 -106074 195216 20643 81713
21217 81713 -5474 -62853 -64999 -121576 -144974 -219212 275195 93046 70818 196088 58630 9173
21204 62367 -193891 -207638 -82123 38113 131715 -64676 406635 100783 50560 57409 50009
21193 50009 -81867 129519 -125487 -40246 -316413 -265000 265612 -183713 290637 -68331
21182 10561 -58700 -160777 -215739 -51714 -146642 56269 -142874 -30715 -155739 132534 36851
21170 29013 -358817 -152261 4035 -167003 65195 -20042 -402199 -142600 -22289 63627 -127452
21158 12766 -134542 -40440 -189660 45872 -213371 -75636 -77444 -102249 -36747 -417800 -71016
21146 -47402 29056 -201383 -83103 28078 -94318 -248227 -112732 188327 -70110 -143077 213155
21134 78227 -183540 119313 -170450 -245078 -49615 19783 428139 120830 42565 19908 195363
21123 195363 -108650 -383434 -49481 -228070 -22281 121587 91790 -52803 -240813 -167783
21113 -167783 -14554 -107548 4175 -181456 -265405 154514 141331 101960 -209701 -408373 -189224
21101 -429766 -76287 193849 -74988 -221699 -193733 172618 44808 33549 -29600 203359 -64220
21089 -141639 -78762 88754 -83513 -63570 -115021 -330753 -211626 -193614 -6679 66599 -298552
21077 -3998 5059 17743 188596 242653 279080 -65349 54265 -29725 -7675 -2040 -82226 -91415
21065 -91415 -165295 45869 -90073 -257546 -57083 47114 236922 27900 101830 38526 180634
21054 180634 -215173 31289 107038 456237 -55874 56749 -105701 125421 -128064 -14140
21043 -83205 -290210 -158511 -287930 -166722 210234 144690 79692 -151594 -186823 -52503
21032 154418 -80487 -5555 170651 39229 -225013 -231657 -223227 13867 -57226 -69839 -25578 51750
21019 -129136 -157148 122865 -330938 -243602 -496630 129670 204206 -21075 19227 -326573
21008 -220436 60923 -14250 -20299 239044 -25960 -140281 -20675 133856 -3987 -20419 -338155
20997 -338155 -9635 82329 159826 7157 -185367 -113386 -309164 -45936 -233389 -177190 1077
20985 165923 272901 -31418 138334 28232 258390 -82025 -26010 -84363 308112 -118639
20974 78471 -134062 141601 7150 -92902 300136 -57065 -56781 -24729 8871 -287464 -52370 -183540
20962 -183540 8128 -142695 -58022 -43955 -139043 159842 -161744 -3141 34744 347537 -147787
20950 1183 -106264 -231205 -309924 32079 -36310 -139775 -371074 -914 167997 -105112 57967
20938 -59499 10238 263894 -275328 -12737 -24919 -62693 59364 -4662 58318 -302226 -201292
20927 -201292 163355 -46632 92286 159942 -219026 -25103 -268868 -129081 -30131 11254 -84049
20915 42137 -342688 -47903 121567 -116362 72797 -15090 -358550 -183129 -144801 -201657 -130278
20904 -130278 -238243 -205799 -243022 -324318 -38158 -186006 122001 -127253 77437 464919
20894 464919 22020 -108499 -14030 215002 -84644 -183430 72887 37769 -176087 14400 -162100
20882 36427 -180520 -147249 147618 72168 306795 62132 -449511 -24114 175130 142623 -165812
20870 -56986 136667 219981 -268055 -102627 -39049 41474 110514 96477 287790 -223383 233843
20858 -24826 -133468 194246 -305391 -53528 -515279 20651 -10625 182697 -142802 2740 -66472
20846 -2948 219799 -12959 23365 -80957 -307173 104492 -186505 -109347 -70890 -121690 -287692
20835 -287692 11719 16470 107801 -54827 -69760 157204 117983 -119192 -110913 -27324 -163339
20824 -163339 -42495 -174344 133381 28558 -11775 -34166 -42898 -224188 -103787 381312 -86357
20812 155502 -148242 -111921 171379 -340005 -27758 -156368 -124363 3591 -124210 -160008 -6850
20800 75470 -76558 -278620 -382875 42005 -42021 -36839 -13807 -5326 -9302 -25448 -347172 -325295
20788 -325295 -364944 62242 -6933 92601 -195823 21522 186992 115188 -41117 372734 91494
20776 129899 -192846 166014 7829 12338 9342 -71353 -3112 -15117 143733 -236644 -332295
20765 -332295 -97122 54306 98475 47724 -177041 -238562 -5600 -72436 16529 81530 -286998
20753 89407 189240 -183672 -325804 -59564 -216990 195626 -98926 24317 -45755 71880 -37300
20741 -196394 126554 -309972 -227641 59541 55351 486 -188978 138060 -6295 -248829 188497
20729 -94337 -90831 112795 21642 -322971 -212380 -213892 -10634 44111 51579 -27511 -169017
20718 -169017 48125 -356746 -506143 -136731 47778 126315 35070 479634 61162 -188205
20707 -21954 -98154 -29780 69108 -269432 -280131 136242 -267668 210391 44358 -263192 -178732
20696 -178732 51615 -6193 -60937 -15480 -361822 -64770 -93279 -222707 -87958 -49509 -165394
20685 -165394 -77450 52776 175298 52507 -205372 -48163 55991 54149 -69313 -232579 16830
20673 -203640 -164472 125016 -40368 107275 -255038 -188630 379205 131474 -54905 -311541
20663 -311541 -53549 -68425 90948 -86610 -115716 19432 -175619 -191645 -60260 123344 -98656
20651 -39960 -75015 -49884 -96096 8185 -367991 -58388 -91835 -59914 176763 -499538 96061
20639 -27321 -30445 61539 -56161 148877 -61678 270179 -167400 -418082 -275925 -152565 224524
20627 -498 -67324 -68530 -222652 -137504 -135810 -264357 99605 76292 -373167 -165467 -110473 211626
20614 -245891 -152182 208989 203041 447502 -87788 -316157 160988 -130140 1612 47755 -187399
20602 118863 148870 -84268 124197 -23139 -45447 134031 -33423 -473848 77072 14399 -147926
20590 -74518 239724 154956 -317039 -33594 1595 -138872 -101654 -54931 -58908 -95292 -67365
20579 -67365 62900 317248 -90566 2259 -368424 -58511 41378 368023 -103411 -141761 -24923
20567 -428418 -130170 -10166 -42969 214145 -340964 7146 59415 49067 -49963 -99494 -198762
20556 -198762 65141 154401 108448 188415 52226 -103413 -264152 -324627 -156188 -32806 -57845
20545 -57845 67952 -170958 120673 164342 19541 190323 147614 -32772 -279894 -217933 -23191
20533 96140 56812 -167720 -24742 -133624 -74560 46823 -187870 23926 72682 -126467 -238245
20522 -238245 318201 -97731 183805 183251 63497 -232282 -215662 182528 -50518 -293332 -88840
20510 -92254 -251869 -30642 -42215 61059 58045 -106048 29256 155501 -49089 -24129 -67894
20499 -67894 167973 -138890 169511 -110880 208965 -143570 101869 437986 70286 54415
20489 54415 -243479 230891 -464912 -133131 -542742 239407 -141343 -199520 -269935 -137341
20479 -137341 -178574 -34447 -107974 -108150 147689 -69402 -178143 -261338 -31890 -194549 181038
20467 -76871 265963 -201887 31284 381569 92298 -179825 151631 -110009 39077 78252
20457 78252 94443 372945 -38174 -134901 42477 -30640 141921 21959 -212063 26773 78747
20446 78747 104060 -134118 -87759 86043 -23344 53404 -148368 90790 23604 -174339 81027
20434 -142228 -52864 27604 -227203 -189476 -153968 -131514 184811 -405669 -138764 -81744 -96246
20423 -96246 -4149 80290 -136125 -28474 213606 6650 383834 -101919 -126132 -50132 -159589
20412 -159589 30714 -378934 -72811 -405236 -135957 32056 30058 -161577 24551 -162367 101833
20400 154385 -113071 -105252 241016 -171756 -47145 163063 274692 63223 -87627 -81336 -246485
20389 -246485 233 -60496 -206075 19283 -403093 29064 159803 -155039 154384 41644 70328
20378 70328 207100 -84847 -107706 -259467 -184147 107268 30143 -130634 -134429 -147927 -52518
20366 121655 116143 -23741 302498 123794 116574 -160467 13585 -282054 -166515 -418551 234268
20354 344118 -104964 79317 -158124 12924 -93873 -22238 69126 -200320 -21994 12188 -266064
20342 -87355 8580 -128065 -109793 -240439 -96399 -27626 -154382 -84038 -322892 138192 -431472
20330 235967 -164309 -288639 7792 -112564 -170739 -51180 -422242 94723 -58466 134666 -24909
20318 23969 -87175 -21751 -310364 -191753 -136817 283080 149147 -27401 -47083 -145996 160964
20306 -200257 -459413 -93128 -116935 -119842 -54882 33262 -463255 -66512 -49406 -3558 272239
20294 -179365 -69273 -60869 47056 -114048 490694 -16414 203988 205993 -204683 28448 -120396
20282 -369767 -180969 657 204434 -276408 93248 -22659 -28486 -66290 -170616 182226 144960
20271 144960 24881 62952 -58699 185019 -92384 -343597 30480 -24808 70107 -27440 -613273
20260 -613273 -307563 -151277 48348 -233446 -533204 -462921 -232528 -317739 146773 -58336
20249 -493343 255917 48495 -23201 -94859 -260828 108415 -201837 7438 -337870 -146260
20238 189021 -26216 38746 -130042 -56522 -126050 -160143 -143686 -51936 -263984 104934 116250
20227 116250 -21108 -285549 17392 -67348 -187593 88823 63294 -160732 54724 70940 -132412
20215 235106 40535 -208979 -104099 351008 104634 -209424 -336868 24476 143844 -178609
20204 -219783 -361568 -126950 -239549 -73385 146615 138970 23267 -128797 18742 197151
20194 197151 -342737 -114830 -320368 -174519 -121952 -114593 -22149 356573 -192074 17422
20183 217153 -65803 92987 49716 34491 -37025 -159347 -153039 165314 93127 -321885 -266102
20172 -266102 373322 6468 -87237 80848 119289 -127840 271380 -142261 204917 -180716
20161 21219 -164394 -178531 -46494 -147177 -32990 -291065 -241249 110779 447181 10113 61994
20150 61994 -202029 -105676 -155343 -90831 239234 -159030 -22414 -802 19245 -124192 353183
20138 98614 367949 39317 -19002 -21274 198983 167317 -272646 81253 -223666 -133929 -276535
20127 -276535 -52042 19377 -330878 -151770 -43001 31928 -110707 256518 -383495 -179213
20116 354874 -262595 19058 141767 254342 49732 249416 -102151 -122904 -238751 -178284
20106 -178284 -67555 101716 -75100 -74525 349438 -202843 76233 -21928 -147563 -256410 -195632
20095 -195632 232107 -157016 33574 34551 -240675 -288156 16891 -78158 -123893 -110401 -210184
20084 -210184 127774 -86660 -174683 -122602 -5548 -116260 -440838 118950 -232115 -277543 -176965
20073 -176965 50909 -111373 24062 -187913 -245568 213745 332139 -223415 80682 19686
20062 -94341 25999 109372 21456 213509 71142 -228757 -238584 -49744 -416821 -145210 42124
20050 114158 10197 -201059 -84345 102041 101063 86096 115210 -315048 -117025 -290564 -7477
20038 136910 -250867 -12439 -117803 -200284 -104458 -54571 -96324 -125554 66170 153365 -14160
20026 78384 387055 -170316 138322 -90312 -90139 -364158 1931 4535 -8521 -177202 101171
20014 -331307 -122264 24577 -123194 -451828 -137772 78616 -48637 -289376 118442 -141151
20003 -52759 -154379 128484 -148624 -64743 -140317 -142255 -6205 -90400 -294246 -75836 200641
19991 22289 -259003 -449409 27072 108015 119329 117999 -67345 -137521 -49136 -24379 8960 -233120
19978 -139259 -280400 155906 235394 -210581 48314 -22822 58910 260910 -71569 -113848 -182239
19967 -182239 1494 -144045 -38836 363455 51395 77000 -161912 -154796 -137485 -130316 -153047
19956 -153047 191957 -174628 126798 -224200 -537591 -180339 13014 -310106 85412 42713
19946 42713 -12896 91193 76746 37876 346849 -184429 222905 390049 -267828 -56213 50413
19934 -245276 41189 38280 170338 -52752 -48252 -56803 -62529 -53244 86694 302526 -16215 -404853
19922 -404853 26052 37391 -130045 -128836 -246587 -239319 37519 150937 157 -148298 -113187
19911 -113187 35753 145599 -463313 354804 -193511 -21617 -192276 -35951 128537 -418779
19900 86624 -260031 153634 9617 -37829 -115999 -258638 -173200 111259 -304722 -64694 -80762
19889 -80762 -278469 200616 9158 -88963 74454 -111440 89695 67837 257982 32987 16358
19877 -343704 -224741 -236519 -231110 -132084 -317822 71823 52817 34213 154827 -307373 52288
19865 -325562 -286253 150557 139610 -153775 59602 30473 -354329 -279307 96055 -141683 64614
19853 -92524 161354 49653 -228610 -76108 -152776 230055 -356192 90704 212995 10609 -64020
19841 -240316 124177 -122124 -302846 65759 186501 5856 -422900 -227566 -337356 47655
19830 144412 28643 213319 219114 -21135 61675 -11273 379770 95441 87203 4194 -68241 66346
19817 -57539 212298 -148942 -246221 -985 127413 -265590 -217014 -494111 154111 -171265 -310403
19806 -310403 -52765 -144398 -62734 210835 183902 -24165 202271 201981 -12641 -411802 -45762
19794 139121 -188329 -76900 -47965 106929 44434 89642 -245060 -205494 -305098 -78774 240397
19782 -86406 -199264 -128713 132419 -428825 11887 -300127 175540 -37218 -89167 88818 -20765
19770 149603 -94581 20096 -149876 440777 -242583 43287 -157906 80297 -408143 66457
19759 197659 -201637 17097 -249547 -212303 -16135 218722 -163992 -348200 -3945 -73562 198759
19747 -173929 37216 -140971 -207665 88624 -61587 -22364 146837 -110251 -18337 152087 38284
19735 -135395 110927 -110585 -272892 6215 13385 -360297 -108568 46638 -68683 108260 -237480
19723 178162 -96757 -272138 -186748 -67481 -288659 -138794 180956 30995 -92782 -109983 120723
19711 -242970 -81922 34067 -148025 79739 246402 18355 -122258 -208424 -74577 -53392 -20831
19699 -135214 57580 -7510 -161282 63407 75433 -245769 157509 -280394 -63364 153055 328172
19688 328172 -143645 -196165 4812 93855 -65937 -9819 170206 -139418 -84390 -24357 -61098
19677 -61098 101375 -13535 -83723 -46157 112204 -286222 9718 -260949 345534 53084 63362
19666 63362 34197 -109192 39625 5989 -90328 170067 10991 126352 29602 -405239 -287468
19655 -287468 124441 -213920 -69039 213927 203461 182880 80706 -91078 -89879 -170361 198762
19643 223354 -281871 107169 347542 -153 -29610 36051 312689 -5637 34197 -29907 -5633
19631 -400222 34289 -177135 -213456 137696 91400 -73675 54565 117891 -23222 79413 148026
19620 148026 117504 -212148 191275 -97018 -37199 -260406 -161250 87408 81318 -285925 -12935
19608 -240268 -274754 -182897 -243346 34415 -239363 -135357 15601 -117457 -249567 -70202 -168367
19597 -168367 95491 -166270 81227 -127344 246515 -114783 -505129 132624 -185655 210359
19586 -318037 125552 -293920 36293 -144091 -305959 281257 -289811 34192 -3009 -132459
19576 -132459 60704 -285310 -13782 -173823 91327 -40823 34443 -73794 -112567 -90460 -54869
19565 -54869 117822 -15827 -349706 -349907 -116240 139545 -75521 -43002 -42170 146151 -40104
19553 -52781 -231587 197838 -97246 -224385 211444 51678 139163 -314293 -287657 40645 -167332
19541 -141808 -222436 -147337 158694 8346 -62252 -420098 -107017 -92399 -42170 -47308 -50527
19530 -50527 -80152 127526 -74052 -73329 -360814 -95425 71540 46509 -10321 -83935 71138 45927
19518 45927 -235819 -24395 -13758 -340284 230687 -27794 -238374 199259 -50930 -320567
19508 -320567 179683 53273 -273634 -251369 -79896 -265765 -85382 -8823 122724 -32294 -73048
19497 -73048 24505 -111345 -129926 11437 -304288 98869 11637 -4913 -80853 332767 -119380
19485 -252891 -130940 -44497 145933 9483 -120195 -434717 -121468 -121597 100598 -258064 32562
19473 -248676 78153 -119176 -81514 -126219 39573 -104731 -182762 -412686 292584 26788 169310
19462 169310 -172962 -168682 -39038 303255 -31917 -280748 -116511 -265001 85208 -13936 368961
19450 -205956 -130850 -22427 -103292 40525 -208643 -222851 -115493 319997 -91811 -18992 199176
19438 140616 121208 -309698 18648 -39725 -145368 -154166 -155992 -70385 -311148 176896 -258226
19426 5283 -50678 193296 -134962 -291419 -132954 48519 89305 49788 19632 -134721 -357759
19415 -357759 -187288 -253013 -311643 61640 -259043 -137971 -7525 -151655 -76821 -103364 1228
19403 -14855 42711 -127478 -251841 -161282 302578 -226932 -157585 -484705 -324888 258219
19392 -118419 -93912 -226074 41035 -285247 -69474 -128772 -198349 -154892 288032 -141249 192417
19380 -154700 -266329 67002 -93236 -103081 121074 -104468 70509 79038 -231986 -293843 197281
19368 58138 -27464 89646 -150790 82780 38197 -80508 187666 60681 -416193 -97214 -73121
19357 -73121 -127815 176032 -19094 -274452 43593 186737 -204798 -25855 57823 -53384 -97124
19346 -97124 139548 -193471 55293 -73441 56722 15346 -117269 -369811 45350 -11248 -188711
19335 -188711 -264033 154577 -101840 97764 24798 67309 -168969 15872 -9903 51555 -275144
19323 168321 -543134 -225256 -83999 30608 35793 -282646 -42401 -174155 -99166 152439 -280844
19311 -54536 88319 -134309 -129720 -56985 66436 -47626 -257464 -113500 -172449 -77355 255005
19299 -439664 47797 -219110 -255433 -239662 -122394 -163899 212375 -248640 -41721 65097 -125106
19287 -36237 -94316 -67236 -133326 -190107 239941 40196 -123866 -75787 77893 -113798 -350735
19276 -350735 -51056 -110248 111623 145372 -577819 87153 271981 -147983 -100186 92190 -94677
19264 27908 60547 -90405 229244 -370153 -270538 -83553 -35618 112547 432398 52952 5081
19252 -224400 279436 -156453 -1731 98161 31381 -98429 -130143 -252439 135895 -225260 -24732
19240 -35615 9149 193006 -245173 -123782 16354 -9056 -58456 -213301 -101954 -52480 86446
19228 -52963 -161992 -238215 -369104 -254584 -25451 36194 -201448 -128745 317293 8515 -7268
19216 -118627 -226017 219602 -133672 -40895 158257 171321 -272006 -405842 -220865 75857
19205 144019 -321569 -218275 5760 -151843 -86629 -18721 49282 28811 -306205 -242987 -150779
19194 -150779 127392 -18408 -94032 -333612 -127458 -228737 -122947 -401038 13453 -145085
19183 193570 -89517 -125198 55029 -34986 4713 -153847 -29285 -15635 -365882 -433800 174902
19171 -213815 416 -300108 -208374 20418 97481 -167791 84091 -28653 -37812 40444 -302935
19159 -313604 8829 180000 36335 -172840 -197000 181253 -123046 -180492 -372072 -114469
19148 150828 -223945 -58788 204257 126804 -105192 -19538 42009 -172799 303518 -208606
19137 4907 -276040 -26557 113163 -27647 -204913 -205990 -59314 -15544 -22121 -46276 -95203 -152867
19125 -152867 336933 144387 76384 154929 -18274 -6474 -90048 -70384 -179985 45836 -264202
19113 -15189 47573 136210 47517 -181341 -11183 67219 -205209 84045 197183 -18859 -86657
19102 -86657 -119638 48235 317582 -149483 -218187 171078 -215075 71127 54582 -81753 96138
19090 -225969 -149172 -203990 -58179 -174696 58491 -452032 -249511 -45791 105092 -66940 26475
19078 2957 -233960 45366 -64779 27364 44035 206771 44936 -125520 -38749 99100 205064
19067 205064 -376308 -101757 -37886 162849 -64598 -179786 158262 96140 197556 -123301
19056 8887 -297089 111782 -220411 -166151 -103869 -249260 -138425 -237075 -10966 -79437 73970
19044 -344747 -40411 172540 -40671 -159270 92761 -109932 -208512 30543 116104 40950 -235243
19032 69958 399471 -52017 76553 250708 -159901 -104183 97302 118059 -236815 314168 26428
19020 -263218 37622 239528 118091 -164291 -246467 -188595 65686 233796 270754 -174827
19009 19000 -221864 72317 -170833 -185840 -267310 148336 -355039 -40515 -81108 262293 -329495
18997 -153991 -311652 86987 17053 -107898 -37603 -171311 41655 -295111 56733 67606 -43291
18985 -2984 -75911 181304 -305980 115168 -171482 -55325 -150654 -97243 -359333 183131 -58142
18973 -66199 -33090 52988 -65781 -289607 47631 83304 185541 -78119 391364 -224812 -171626
18962 -171626 -121005 256931 -178065 149936 -9883 -189127 -48057 -52538 -6556 210710 -221373
18950 -52103 -185447 -80148 9412 -36395 -87061 -172615 224256 -73906 -60332 -83288 135700
18938 12623 -121683 -74503 -39665 170324 54833 66669 -30902 -84653 150726 -3647 37069
18926 50056 74456 107327 56475 -109484 37495 223475 -11550 -46815 -160350 182509 203761
18915 203761 113175 93511 -149444 -336611 -115607 179937 60528 247431 170881 44433
18904 -110895 83064 37011 -495037 -89282 8723 -17830 -269271 236265 19573 -82734 -56366
18893 -56366 238165 18155 239333 -125482 -171671 -246502 292889 -384969 195776 83609
18882 -191737 73695 21113 199711 -327129 -112014 -285086 163676 342940 94454 -104967
18871 123192 394353 -107274 54658 -94820 -81000 -30567 -262291 10852 -195012 179458
18860 84254 -57183 -112550 -16235 -333368 -117326 -141232 87811 -308010 -65685 -98978 179474
18848 -143785 -281058 60152 -54880 -1591 -185785 -50485 43382 -291940 -68793 303670 -20752
18836 49577 -177596 -94394 -226984 -112134 -166879 -270372 -21061 36639 103973 -288337 -64727
18824 -158609 123512 154930 104762 -312149 -128951 -70526 176271 1243 -112479 52983 -171996
18812 296854 21026 -155647 439235 160733 73022 296877 88829 201578 34165 145329
18802 145329 14830 -64486 107268 -253073 268144 -14959 1943 10221 -431581 -73645 -238594
18791 -238594 84077 -239258 134249 -230296 -21191 -156454 -247942 -344748 86647 26523 -227040
18779 -203587 -197853 19986 -82479 202688 -169051 32590 78235 -37274 232779 -212738 133113
18767 -30986 122332 -438943 331317 -13203 -41300 -1548 -262042 43739 -243913 55480 136650
18756 136650 124942 -46873 -77262 53692 -319286 -55919 -93170 92528 422738 59984 -103195
18744 -178907 58713 -166200 18885 18012 -463512 232678 -76056 -230437 -188191 -7370 288646
18732 -272319 162611 -529481 -73293 -203414 -94203 -9892 -168513 -218094 245948 41396 86942
18721 86942 -50175 59017 -274244 -62114 -207676 -28808 -101403 -4120 92389 -202463 109575
18709 -156383 -410611 -195329 293737 290916 -35310 -134707 -211931 -234827 -56416 -113895 181682
18697 54697 -94494 -112025 121911 -205249 -99685 -181215 -20314 193045 107337 146194 -35822
18685 -146642 -103169 216860 -63673 43768 -215054 -86289 -44179 158220 -144527 241909
18674 -324710 -251382 -213580 57135 208337 -372002 5189 -14889 19657 88315 73680 54537
18663 54537 -249716 -335559 -179875 -219777 -83067 -69757 -44129 21522 -327219 -145341 15616
18651 8451 -354339 -55414 29537 281982 -200589 89080 -50690 -207007 -189638 -246608 -106080
18639 -142546 70482 -62900 -165537 -157113 -80111 -192248 -75065 -267373 -44279 176909 5696
18627 141959 -71360 -122877 169218 67975 110669 -111548 -211213 5169 -26824 -164352 34969
18615 -16087 96111 -62223 -41923 -1440 73713 -8641 -271414 -103128 -39566 -309920 -115455
18603 -107004 -30333 -88025 -239701 -107581 -131191 66588 109371 60529 33230 -123577 88374
18591 -535937 -120645 -283909 197803 54509 79887 -111068 22826 -77895 168611 76273
18580 -128890 -282755 -124332 -272005 280044 -126045 -43741 -292121 69089 -112222 131416
18569 -27745 -350678 157348 -221319 123896 -314477 -49217 -109734 117311 -229449 -289668
18559 -289668 -46468 -155836 164502 4724 69802 136711 -2671 107591 126707 44220 309417
18548 309417 -215941 -54608 -321693 -19222 97016 104707 -207070 139877 148240 -22472 -12959
18537 -12959 -179601 259353 22478 -287318 53200 -126768 31591 74816 -127099 -145515 21401
18525 -295855 57541 7893 -29662 32632 104686 104914 222113 -10378 -5976 -440690 18219 143208
18513 143208 -132417 -101484 -177708 -103522 -174319 -55319 249756 -68263 13076 438146 -276757
18501 -248544 -187055 17496 -41654 76260 -126537 -90556 130512 140130 -249935 218388 -160183
18489 -30390 -75522 9992 236258 -309014 -224761 49103 70180 62250 -20857 62170 157956 10496
18476 146344 -154614 -90390 -167936 55905 68622 -110221 224990 -139249 -138774 -11053 4900
18464 -184930 99200 -346375 -222558 70314 8706 -154210 110558 -44979 -324206 -45638 -134941
18453 -134941 111149 13390 -55811 -173866 -18509 -183445 46814 -311710 -9107 -143857 41600
18441 -76848 -169298 -67270 -86506 -14433 450322 65339 -165088 -53197 -204871 -73797 123887
18429 242064 -74927 -34613 29070 321004 71857 -272082 -343684 -75574 -391201 -111886 -118773
18418 -118773 36331 -25451 -241354 -34155 252699 -225938 -137429 -301105 19164 -172529
18407 124572 -123580 -97248 -103878 -130802 87529 -109222 -17622 311465 -65827 105162 -2262
18395 377589 -93310 -132549 121269 -42089 -292415 107172 -155807 -53261 -48436 339892 80281
18383 -88854 229721 -61741 -66403 -63515 -88906 -83466 109229 -251573 41842 -199313 -63522
18371 25902 -146888 330968 -214394 103605 -5893 52598 -209732 -59314 70675 -102069 -305283
18360 -305283 135934 -91425 -120084 -21397 -9263 -85577 -285713 -107964 -201988 -47565 -148984
18349 -148984 148298 -376586 -273190 -8081 -140786 123739 -239285 -146212 -36870 223194
18338 -82553 20784 -87984 284755 -145801 -168073 -81341 68955 -34784 -27138 83031 -236197
18326 -75403 -162753 -213705 -173916 -306054 21578 124969 168736 69941 18250 -33630 -309085
18315 -309085 112068 149527 18021 224857 115307 -80782 -111787 197103 -124146 -37592
18304 -163616 72233 -67244 -124163 24243 248060 -9073 63945 15989 270889 -164465 84842
18292 146876 207975 -25653 -181996 66218 58944 19982 -99465 -186663 88368 44657 -83554
18280 44453 -14030 -34447 -340377 -103813 -131747 -163994 -42517 11346 -240519 -15777 -234625
18269 -234625 8762 -171919 -133021 -4985 -340070 -154580 -216578 -5430 -173318 13571 -153688
18257 41903 -5105 96548 42845 -47598 -132991 -36368 47117 -178700 -188104 36105 142895 -241858
18244 -22779 -216299 48262 -54695 -9547 145530 169126 321069 -147885 9961 -375371 124323
18232 -268571 58863 -71269 -109041 121779 -362990 41796 238234 -191491 71125 118612 -240529
18220 -204971 234659 -27066 -31533 107071 178624 21072 -3430 -115047 277812 11356 -113888
18208 13408 120319 10386 -114226 300916 -251609 88296 -57450 -11396 67356 -339978 139974
18196 -47912 153397 -326453 111623 -152241 -144133 209205 -264746 -32894 52535 -105843
18185 -134281 472842 42642 338027 70486 115117 118736 -36115 -133797 -244576 295195 75638
18173 260526 -206033 -25169 -243300 103669 -145197 93416 240674 169820 -216072 -142003
18163 -142003 -14912 -201656 133679 -81012 -42498 203258 -208495 -19743 -9977 24861 -104689
18151 -201673 44028 167909 -31345 -178222 177279 333182 81768 -285922 31878 -91597
18140 77906 287905 122050 208024 -198511 176885 -8289 -314005 3070 163280 143856 -81382
18128 -204066 -208404 13857 -230821 36256 -279138 -83196 71174 231831 -89655 317149 -122213
18116 -3244 -39147 106436 -252544 -102219 95211 -69660 87745 -365351 150572 115615 -506470
18104 -53597 -155169 208883 29367 27688 171624 105576 -37799 -57812 -192573 216234 169831
18093 169831 233998 100087 -56735 280825 21656 -196192 303288 107819 98001 290675
18083 290675 198568 -38008 -218224 233849 -35019 -147917 204675 -129124 -204872 -136211
18073 -136211 -6913 -182348 -79915 38901 206022 290937 -97524 -270757 -97416 79151 -385288
18061 -93716 81492 -231006 -41411 -48441 -116861 -104803 44752 30361 -305043 -91425 -112605
18050 -112605 9901 35619 -208285 -13482 -130009 275998 259946 -97778 159083 -24122 -78966
18039 -78966 -197411 56823 -250839 -77484 -332429 49424 30792 7098 193994 104503 -245032
18027 -24622 -229668 -277351 -166147 79571 -68701 188366 -133778 -6380 -44565 -157135 -483419
18016 -483419 229276 -6844 -210509 53039 -247146 270030 -63470 -56231 -337489 -17132 -205572
18005 -205572 -3803 -185271 134687 29076 -228764 116703 158401 207482 253214 -388198 6328
17993 -38287 -213534 -261436 -163460 -195230 38032 79102 221461 104860 138585 -209147 -119306
17982 -119306 -212675 327802 -349012 -2544 201297 -57163 -217036 -233165 111975 -42976 -135653
17971 -135653 -40174 -167731 -124536 262033 -121803 -306742 112895 -107333 112828 -18634
17960 -165266 37882 -186336 -78038 -311987 322755 -288463 92628 -2920 -33776 4653 84741
17949 84741 30451 213538 79777 -323523 -58509 -128977 145518 87965 318038 -232773 149993
17937 250917 -188966 -43541 117622 -110867 63256 142995 82386 -64571 178549 -41938 79255
17925 -12740 -209548 56015 -32316 -347223 60085 -98272 72902 -48377 -275615 32037 77261
17914 77261 -17068 -357490 10969 148418 27776 143007 28200 -130931 108197 133812 -128379
17902 188961 -138396 20738 21313 184105 -150939 -189170 101247 -11320 220000 222212 -180222
17890 47957 107632 83410 -151642 -246877 151490 75718 113316 36162 -106668 100861 166376
17879 166376 443905 -97284 -36133 137073 -69336 -104258 -103690 -549721 83890 11658 -73300
17867 118665 180670 19251 67309 298645 150949 -113919 -214720 313930 51671 81264
17857 81264 43563 -324500 163649 -281455 130082 -15420 44247 -231816 -29243 -67781 4903
17845 -59495 -90147 -162023 -371445 284344 168593 -213206 -219277 96924 -25324 -152584 116979
17833 -233832 -192595 144812 -304788 -73621 17422 -55878 -9538 72005 518541 199452 -301071
17821 -323008 202702 22986 -392173 -82928 180115 144182 106573 161157 43247 -176375 -363888
17810 -363888 -17112 1170 -15262 128305 -34204 43660 -135347 218884 47160 -196965 171055
17798 79333 260805 -219376 159100 241176 -233254 -161447 238404 -55702 -163876 -5409 -224023
17787 -224023 -96952 -48128 -30041 141360 160823 -201051 141527 -123374 273391 41358
17776 -208109 -83243 368556 -8214 160253 -54167 202328 17026 186514 116013 244153 -170033
17764 -18992 71450 -185842 -158710 -55018 -118425 225569 212827 -5755 223198 148444 362411
17753 362411 -16132 -276235 282148 -317577 52498 -82125 -100525 -106266 363087 -172745 -159379
17742 -159379 -280599 -237952 176156 102256 17008 125252 -19821 -14281 -74478 -399215 80439
17730 9322 99379 40622 -317175 192423 107283 18882 100027 61216 -29699 -180484 170117
17718 29925 -158721 -121821 131272 10073 -50579 284100 375001 2892 -152696 -199606 199811
17706 -35300 -229718 -13020 63583 -123727 -120812 38411 105803 -18671 130154 8332 -43511
17694 -172490 95518 -29153 -1111 15197 50815 -176630 -58014 176645 22168 -139894 -79941
17683 -79941 50193 -41970 -63017 230005 107907 80194 -743 389934 -242656 -71911 320115
17671 15765 -137810 41138 62408 39675 71323 -74371 -148673 151613 -240178 -81351 168290
17659 -268361 -137050 109100 69747 63378 -212136 -85146 -66158 231917 -168383 68479 -199018
17647 269633 -92135 219758 244603 98531 271517 40474 45293 93978 -336876 93165 -105335
17635 -181296 131651 -91336 54175 -101925 135237 -531507 34414 -55151 76184 33398 89997
17624 89997 9600 -2748 96953 102882 308888 -101620 -256713 150910 181937 -67131 -71609 154374
17611 6125 -20863 -85419 -57102 250458 -204864 342470 190887 -78903 -231988 123144 -86921
17599 108825 -180477 128959 74507 -33595 408793 35431 177611 57839 -157526 122857
17588 -27431 253186 -118035 84881 39410 80808 36906 151905 -354 14871 -174121 32128
17576 -45409 -126076 179529 42995 -91135 -95766 76778 -296380 -12168 116161 -32312 393091
17564 137439 53577 429787 -155135 -110144 -124398 -9532 7820 30421 79276 -251520 248848
17552 156887 -9171 63020 -161085 207016 174474 136633 102142 138257 393986 -66291 -84275
17541 -84275 113028 231303 -107747 14300 29809 -107431 -22986 210008 -60333 -92492 -11711
17529 -9961 -196809 -21375 269273 121936 -291487 67587 -74278 -13776 237497 183692 -141849
17517 -197231 379509 -152209 143657 529926 -78520 40083 193259 126671 147481 -126720
17506 179919 -106523 -80925 188749 -21630 -58748 -104422 52894 -77745 94495 -41704 188002
17494 368881 -19239 -169549 189950 296470 -133577 247333 96396 264530 81562 21487
17483 284291 -170942 360207 20374 -357839 109222 494866 88474 -147889 62407 364449
17473 364449 523614 390981 175049 234946 181754 -30286 379597 373739 70402 448276 -92270
17461 167911 59084 273338 138584 181233 309500 127465 200041 130119 179032 310338
17451 310338 205544 178765 300270 153509 476210 433763 170626 432898 -218651 338345
17440 148954 181100 350202 240198 263411 375075 -275620 195193 285238 647516 6905
17429 261154 322217 -45690 351001 107793 88027 375867 354153 -24711 -59457 484829 266157
17418 266157 178360 173449 374541 405987 438728 373665 411542 288283 329374 -89633 296807
17406 283204 291396 6572 127109 419297 180115 379692 -102295 66841 173460 102690 -18837
17394 -221394 84038 85663 39818 498971 238932 84688 134485 265224 -4861 134384 -62399
17382 -71175 206502 85917 194562 234007 -55908 -80023 97773 114772 100620 48385 73317
17371 73317 -98430 -219350 -37514 242054 386547 -72536 -110153 273774 63868 107297 -63475
17359 190181 -79635 377206 -103202 203736 -205188 90821 365097 -63623 -7109 -144057
17349 -144057 -73554 283636 19536 7727 118836 185915 -123699 294393 121796 -100760
17338 -22508 152022 -46551 285303 5974 270481 16862 85375 -82535 204897 -34017 54923
17326 250701 409705 367445 35020 -5084 259916 169254 285459 106578 -112456 382336
17315 35859 17312 -17268 -243820 477697 166081 384362 232653 -112990 237529 47600
17304 120149 90210 152613 116647 218218 97527 66446 -117662 574959 -43510 -55864 16973
17292 176361 439814 215486 196857 221740 103304 177252 107301 174996 -228114 129509
17281 172020 262670 65058 -291413 449937 140894 432454 211934 111748 51709 319405
17271 319405 46733 65135 243428 157791 115318 286038 400797 174885 84344 180880 447940
17260 447940 139722 302539 -132843 513339 153935 427105 378438 383841 140861 372428
17250 372428 146065 258814 359072 159347 11936 284987 275692 113442 173995 419615
17240 419615 -51993 518235 223843 201431 24035 264377 -2564 167474 87499 122686 416353
17229 416353 93097 13346 164954 13289 21236 193886 12450 100864 495229 196216 -74278
17217 215970 410720 -110979 306997 198689 227319 330168 191107 81741 353227 300573
17207 300573 -2981 187903 113927 -92040 310273 317151 455709 7904 152176 396723 378922
17196 378922 82944 338949 600757 81401 294131 137077 -1215 405766 294021 147679
17186 147679 140194 131622 328907 340747 264387 299553 299613 218876 359489 7449 280761 233027
17174 233027 415653 237581 343639 261768 171982 348253 432303 323701 408441 330663
17164 330663 511701 448563 343153 66669 229385 227460 297880 244121 175363 194314 496116
17153 496116 395218 547564 138387 192813 329189 667332 571283 228022 188779 44123
17142 462358 268134 56386 174128 493264 216535 353668 459601 60324 334464 406988
17132 406988 541942 338349 251460 344718 412516 3173 356750 256668 311142 273892 243944
17121 243944 356446 134944 485882 330533 431514 526475 466087 231390 377560 498407
17111 498407 652328 699433 324391 396013 80369 323030 339015 587245 320832 293969
17101 293969 287470 473505 444318 108031 324307 411404 767351 508373 -137713 384333
17090 -89754 227937 315223 510456 321110 242840 795002 425824 652711 429680 692732
17080 692732 402871 392671 -97595 533986 310932 402227 757611 406048 377643 646214
17070 646214 282613 229995 418370 552529 194732 252658 486457 459016 520297 583573
17060 583573 364806 505073 431599 394400 449192 434183 601142 392960 393958 376828 869149
17049 869149 444191 424890 296729 550539 588850 214529 627195 846661 346950 592031
17039 592031 708200 374504 688741 699031 794150 402707 927305 347367 444830 501416
17029 501416 581437 532266 650302 539238 412770 613356 379186 1036964 479899 545372
17019 545372 347274 743238 652097 411181 872561 731131 523407 504381 667103 775457
17009 775457 1003363 803332 739135 589673 889431 832333 597886 268539 994351 1076075
16999 1076075 559750 365886 688136 696720 745913 643060 998074 736233 458989 688298
16989 688298 631512 789931 993752 554016 680461 888774 568032 899775 602438 649169
16979 649169 906076 972656 713167 945620 897144 911272 765310 846949 1031595 806335
16969 806335 778227 993035 1275509 931945 874599 887225 1007169 1075123 1277896 882948
16959 882948 700792 870663 1095258 1056550 940959 1322373 1117870 869973 1210010 1074348
16949 1074348 1005386 1234393 1039321 874127 966742 1162813 1209479 706607 1248950 1490365
16939 1490365 1387119 1160717 1189586 820011 940119 1550606 1066931 1547384 1217202 1069141
16929 1069141 1153840 1018297 1437553 1424859 1363004 1595761 1323950 1542042 1309029 1525817
16919 1525817 1365124 1157946 1469434 1271136 1348760 925838 1510243 1645879 1764927 1687424
16909 1687424 1599982 1593477 1636180 1495810 1437372 1634979 1534182 1712012 1771225 1596478
16899 1596478 1918425 1829906 1786084 1678414 1714158 1900887 1721172 2058111 1926728 1744350
16889 1744350 1952565 2076961 1821626 1984181 1972230 1793438 1697307 2013664 1833733 2057999
16879 2057999 2039163 2104869 2195472 2205349 2440666 2462171 2062639 2728186 2423242 2360728 2704584
16868 2704584 2716553 2456663 2512786 2706923 2672240 2500843 2708550 2689053 2883745 2834897
16858 2834897 2982588 2502766 2931743 2822340 3010655 3206942 3432525 3209940 3076345
16849 3076345 3404545 3495789 3087888 3520683 3278619 3323601 3254215 3637266 3693239 3445869
16839 3445869 3819652 3908365 3795236 3970814 3733210 3921501 4068254 4162685 4237354 4137983
16829 4137983 4398020 4393531 4514445 4721078 4906283 4848746 4730172 4955239 5156578 5087609
16819 5087609 5272785 5562391 5577708 5614306 5487867 5817565 6328837 6212255 6315745 6088470
16809 6088470 6481864 6716912 6600316 7043481 7003329 6779267 7095788 7715767 7912955 7959281
16799 7959281 8009943 8278868 8484850 8775813 8703400 9098592 9257239 9434565 9806067 10154592
16789 10154592 10462421 10552562 10482869 11420398 11371505 11870025 12210647 12503599 12967722 13073837
16779 13073837 13745747 13985324 14552354 14859634 15464631 16074385 16503879 17145834 17673101
16770 17673101 18188234 18975727 19209199 20432449 20914730 21875368 22689639 23674749 24555392
16761 24555392 25485945 26797440 27943758 29264205 30460275 31622834 33288515 34631454
16753 34631454 36785828 38194649 40129885 42018216 44192193 46512772 49058379 51309653
16745 51309653 54640390 57749972 61063343 64412714 68313129 72436716 76781581 81523509
16737 81523509 86519976 92007481 98032557 103879911 110749887 117681201 125301289 132584985
16729 132584985 140798099 148711964 156721844 165233314 172982082 180288464 187011267 192682889
16721 192682889 197168062 200693811 202684473 203104496 202048161 199538281 195537378 190284646
16713 190284646 183950800 177044106 169519814 161104750 152859622 144597794 136248643 128392113
16705 128392113 120679989 113196017 106239382 99959946 93393448 87614781 82754266 77018999
16697 77018999 72503372 68248096 64111450 60270912 57090358 53913440 50873082 48287664
16689 48287664 45443631 43238221 40835402 38896321 37004388 35106568 33517435 31805172
16681 31805172 30556185 29043108 27733097 26525034 25367130 24468453 23100983 22219963
16673 22219963 21445354 20627175 19878888 19099738 18354589 17531602 17033442 16480517 16109850
16664 16109850 15575918 14601370 14120045 13672230 13341761 13337647 12552805 11981798 11722130 11625454
16654 11625454 11033670 10437423 10336302 10084462 9445416 9517733 8963121 8899893 8666191 8442851
16644 8442851 8163134 8060349 7290107 7648890 7433745 7501353 7219761 6974063 6800419 6555532
16634 6555532 6334780 6331538 5778402 5802954 6002986 5529854 5616766 5226087 5460881 5012381
16624 5012381 5199658 4923974 4555016 4627075 4679378 4612976 4751734 4758353 4103439 3950994
16614 3950994 4014022 3928668 3847191 3879686 3880788 3270193 3516037 3931189 3717358 3031761
16604 3031761 3156070 2996096 3026733 3122227 3052644 2959341 2762126 2876191 3037042 2715483
16594 2715483 2664077 2797405 2557736 2736505 2479035 2537935 2418313 2434878 2420516 2373338
16584 2373338 2335489 2263456 2607603 2301143 2226324 1977577 2014024 1982300 1848509 2028272
16574 2028272 1922438 1896805 1718758 2178105 1647929 1882229 1612240 1828511 2024903 1885121
16564 1885121 1758174 1795310 1977133 1820819 1785154 1619008 1762182 1517733 1332636 1527272
16554 1527272 1661189 1285072 1300834 1322242 1244114 1564692 1727611 1696324 1329490 1292929
16544 1292929 1360051 1389515 1128135 1432020 1342293 1204582 1146457 1461546 1409435 1244046
16534 1244046 873026 1232801 1162451 1141288 865948 1141581 1261121 1129728 1017023 1115228
16524 1115228 1197563 1221463 1007534 1239871 723686 1028842 883213 1171077 908446 633097
16514 633097 1108240 699677 1105215 986907 1048303 844651 918195 804071 751283 1054519
16504 1054519 1119145 915568 745956 775370 627316 684510 761367 436271 999375 431699
16493 696905 631166 958661 756697 629136 467321 1006386 639864 290442 639775 642501
16483 642501 880818 771931 608835 483667 739198 578077 805130 758437 910926 719751
16473 719751 555708 759494 426693 823595 510499 438738 563539 492783 423325 401672
16463 401672 297091 232004 404983 368385 339995 315272 564048 333473 516235 439031
16453 439031 639980 520913 505576 482300 352609 709351 395157 362544 404069 620758
16443 620758 406118 440277 308714 499296 449180 716265 232456 419342 596079 737371
16433 737371 835469 431723 324088 588265 386213 451586 530372 514078 396079 431733
16423 431733 395799 208919 748029 488032 413194 235805 340404 350688 181543 433850
16413 433850 205789 602036 640141 299592 216101 472599 189275 508882 106309 319385
16403 319385 181392 439556 103994 274417 386296 -22665 446669 575460 259714 327214
16393 327214 694616 599803 391891 329467 476747 191918 161996 328509 350257 420995
16383 420995 206028 312952 196278 156285 288649 257481 154091 272911 424765 20959
16372 197225 641017 312260 233372 -81099 297575 97750 211471 362274 29000 68447
16362 68447 -65057 200045 54144 239711 264851 9889 217080 334565 200110 117395 167813
16351 167813 71580 149871 382451 211959 301193 269991 374357 130795 326898 314356
16341 314356 5474 330177 84954 590843 498258 -8719 241663 399937 99674 -27016 241979
16329 201034 649008 -23124 -195271 267787 66765 187142 172280 85578 -79517 40988 153083
16318 153083 390074 362057 46529 324365 310191 158092 -91779 143702 -58200 431260
16307 307113 25575 75815 -25671 319913 -107990 256034 386382 -31726 73904 -23711 -3827
16295 8367 120631 163376 158006 221564 179753 219761 185983 159727 192961 -138907 178029
16283 273821 333522 44191 -141191 49965 239141 267019 77712 288063 371059 -30653 89563
16271 -432238 182378 -72154 -15315 446745 -98190 194730 115939 304913 138449 163192
16261 163192 71045 131570 -4795 148329 198002 297107 276649 498707 151601 42327 388251
16250 388251 -255411 -48147 31918 -214769 156538 279929 -163245 105793 57997 286295
16240 286295 -98679 482994 171973 106721 225507 34659 219260 45955 -115744 240295
16229 119349 -36857 -3148 -101838 212045 -107557 261724 249012 213639 -83524 275733 17001
16217 -528 -54019 -106738 67112 -104552 93225 -108732 -56345 284908 137522 39673 102852
16206 102852 -239847 307990 117129 123465 296784 27596 68081 141384 -17422 -29789 115404
16194 -133852 -20813 -141503 -284995 18307 190774 233765 67744 479603 -223806 -78552
16183 -333203 -37473 102952 -86926 2491 209486 -28976 -150594 -180403 204814 62679 -121529
16171 121286 204725 38806 6137 102218 26227 258427 284747 -320719 177021 30133 -207013
16159 -245594 37848 12385 -123586 5549 188464 -204887 65503 175735 14079 -24383 -247071
16148 -247071 -169330 82875 388 -192313 -242072 16174 137301 -53918 178472 135476 -246711
16136 54584 -6534 -306247 -10948 -158840 164057 -88699 3761 -109897 67522 -138004 464
16124 -143992 -135202 105468 -59587 414 101134 238107 34051 87621 -378484 -94473 300276
16112 -6421 116901 -198849 55558 -15317 -165085 -181509 -58758 28468 63584 296993 71582
16100 105966 479324 161038 -38286 217646 515429 348074 -90151 -42708 163991 -90889
16089 56258 -263915 -65342 136772 60058 36611 -68228 298965 269099 68637 190795 -242366
16077 -366773 -72611 58625 -298473 -109090 20036 -8427 44412 -254371 203006 -302343 189097
16065 -55632 -256532 -99558 230259 -19400 -17191 290831 58691 -36376 -91016 219462 -36241
16053 -3857 -417032 -178890 -84659 -86376 -213047 -3317 83951 13592 128439 116708 78794
16042 78794 144341 -37046 25291 -212782 -77182 -219954 120429 28602 94605 63657 -223723
16030 -250636 91967 277581 135695 -149906 -147790 -150625 -18667 -206969 -45938 -109312 160056
16018 108985 -37468 21879 -413960 40526 19200 61379 67509 358658 -45079 -309581 93583
16006 100625 104308 -137516 -289397 -275041 26115 388803 -37919 236573 133308 -81566 -69680
15995 -69680 -232641 -39710 46228 95482 54559 -26572 222543 -188317 -25153 25044 -58698
15983 8140 36761 368711 123516 139284 5454 69869 -87430 -75479 -7508 -256316 86774 247613
15971 247613 56166 72653 -255631 -83227 -62867 -361274 -258138 56138 -393325 244845
15960 -6475 174862 110557 111698 171012 220488 73108 -170313 27331 99947 -212549 -44398
15948 165149 -426287 95883 260897 115608 33221 24703 -14841 -197253 59796 -88071 -66541
15937 -66541 164154 -306964 -249455 7045 7899 335755 -187055 -37886 33768 -332047 67987
15925 -10953 2287 -111997 225360 -222212 -123757 20078 53158 -144750 198551 -97854 -46711
15913 -239396 -173103 208557 -186554 -428647 -14750 80304 -43204 -71982 -65401 -169442 -167505
15902 -167505 102807 -132849 -323553 -92817 239195 13121 70387 -245856 50036 58365 21470
15890 -219722 -24957 3063 58834 -152933 78390 309415 363184 -14162 161360 -370361 71845
15878 157084 41582 80410 -196585 233429 -95772 21628 -82098 -153770 -206080 66316 -31106
15866 153470 -193725 60459 -98057 173020 116838 103726 -173255 -107884 -324738 15194 4256
15854 -8036 39998 -169908 -123913 -491492 172123 -121079 315994 588980 -70160 -79621 -102738
15843 -102738 63067 -158884 106326 -242675 120367 -67074 -28491 -56860 90451 129852 -133261
15831 -59676 44006 -311462 -48004 -94734 -81965 125312 199534 -261342 67289 -4709 -102379
15820 -102379 45636 -370227 -122617 -93324 -108212 18279 -140193 93407 -211362 -444025
15810 -444025 58056 -123985 -197924 30934 67886 -73185 -352443 70881 207101 133934 -171236
15798 220981 -81327 -329579 299564 288295 -52305 -236679 133891 29758 111178 69314 123431
15787 123431 -139749 161376 -118893 -25070 -1404 55033 60193 -52410 152132 -122749 236828
15775 24019 -441790 58086 71494 -262615 -200938 -151051 182004 -96432 -371416 -147748 -18568
15763 -69805 -180365 -55152 -239363 112157 86808 228453 -179432 -64084 8810 24189 -157149
15751 264528 -125108 29645 93793 149352 75898 212919 35721 -70151 100432 -27400 109100
15739 -113061 -254196 31248 -287457 -238526 -33006 -244678 152167 -99554 34562 -211794
15728 -18970 -147541 347328 156041 6999 198782 -164821 -205307 35753 -37170 -240543 -223156
15717 -223156 85117 -146020 133647 -48630 -205192 162238 -118043 -32595 -120357 -24791
15706 -240751 18587 46518 -242283 -333477 -103785 -270743 -300006 -216715 183685 111908 225756
15695 225756 126755 31891 -14054 -61628 211391 -12236 -51068 48831 -90012 -61405 -23286
15683 376679 -19809 -448382 -11207 191611 -77034 226551 -39688 148179 53834 -181131
15672 -264180 533846 128537 -47181 -67291 215046 -383401 18923 139701 -95396 52777
15661 -69650 -181111 17855 -246185 -37997 -132913 217577 123021 -242320 -29263 36047 6 -253544
15648 102234 167238 -208522 -4679 -13420 -153487 176089 -30617 -150521 186138 14961 -81095
15636 2432 -40098 -103909 127833 49087 149069 -296161 -104502 -35757 128603 136962 -209409
15624 -173592 37591 3886 -56303 368 77816 345022 220438 174023 258011 148350 -63236
15612 6824 -263014 -31689 -21700 41259 -182960 -6744 -116444 -150818 -137543 -8678 -167408 114443
15599 49489 -312460 -151101 192757 -48525 -104279 32797 164425 108861 -222976 -191648 33438
15587 116608 188074 -97509 94437 239167 119958 -240301 118044 293832 -146959 -128066
15577 -128066 -22237 85232 228614 145441 -213183 -189090 59285 183771 264154 -75666 -97431
15566 -97431 -177172 -44456 261556 52681 129268 85631 105630 478585 -156538 -304888 59179
15554 415299 -57411 -77302 35049 236073 -7942 24281 247696 -104419 88223 92747 100278
15543 100278 -62730 -296628 82858 -64355 -121592 20893 -105378 98189 343919 -59296 -363631
15532 -363631 -19973 -252036 65039 57956 -104981 -78841 101723 192407 -61948 54039 -153205
15520 192853 93494 -114205 -72668 165599 4830 -141647 -213979 -34558 177846 133675 391613
15509 391613 278059 162825 243455 -166197 99939 -102686 -87429 107311 39447 -111715
15498 -267208 -66909 -2368 -139165 94247 276086 1377 72526 -383000 121382 3978 -18783
15486 -298629 -198505 26408 -11884 6104 17174 355885 138374 180609 85355 53102 188089
15475 188089 6981 -341893 114205 184530 78520 -97207 108560 136276 181352 -12102 150607
15463 183468 170546 174539 250171 -110162 117053 -201007 -147458 105063 107038 -176685 308379
15451 -8666 45875 -38643 -332866 -69743 -47801 170569 -171421 -270606 32811 8919 -35536
15439 68505 -84133 42484 -242037 -206092 -152473 344489 -561165 445212 45427 127164 -163376
15427 -76299 340406 441185 -192829 -573089 95687 -93485 198880 -206937 10149 4276 272527
15416 272527 36878 -169410 119213 76998 -144162 -222762 -107589 -232373 32308 106650
15406 106650 -141747 -219509 208727 -306006 2110 -104431 -215369 -14654 -63013 -138576 44578
15394 -29996 -103000 145584 19996 229925 -18307 54673 100839 -115781 -200131 -171799 -90795
15383 -90795 -147102 -26428 -126354 86071 -10387 53678 -53603 124279 -7215 141908 7714 -86551
15370 23012 259198 43540 123504 101558 143811 -204659 114125 45072 31888 192663 2042
15358 -66683 -10089 -30879 13365 46162 129801 3358 146322 -250743 91932 137677 -75394
15346 94017 178694 -75119 -107620 -208254 57066 117894 50917 -73122 207903 -78188 334855
15334 210333 193354 191946 -34168 8004 -196395 -284896 292340 53895 154464 -261400 24520
15322 197152 -145664 455728 217100 127087 307956 14518 -188071 229581 170583 273581
15312 273581 -161280 -86266 -140209 -36251 -42091 -18714 -214679 -122701 -371989 127965 271487
15301 271487 -126317 62839 160552 -54675 -77295 -178402 473680 313672 220559 192908 122860
15290 122860 264281 91434 -63422 -254425 182260 57912 199093 355222 86107 -88183
15279 -146775 -96188 238619 15423 -27305 275654 -126738 123450 -253262 18403 277402
15269 277402 69921 64784 -30785 -72676 -362884 157793 11452 -1514 151795 -194137 77320
15257 161289 -62297 101391 172720 59758 317386 -199817 136866 387475 297631 210367
15247 210367 1466336 1517189 1234876 1328259 1069511 525473 141493 607129 42643 61735
15237 61735 -12951 -81121 -10193 260912 -17567 443917 331928 -152083 -34026 166884 167876
15226 167876 -76827 157237 75920 87858 393328 347118 -172297 212839 2311 -15159 343585
15214 -160584 -108122 -47853 55255 -279985 313655 -170846 104582 -2250 303432 42000 327838
15203 327838 307456 361745 190264 28682 54783 -4036 123662 -20481 136886 320522 61699
15191 375106 79696 271189 61564 290889 48437 156205 458205 195857 113585 133302
15181 133302 21874 472304 -24946 14059 155235 -308901 285442 369568 237324 378911
15171 378911 -42676 96478 144498 -25227 287071 252202 91493 -207152 -6925 -156172 -106916
15160 -106916 46156 85538 67069 93506 108054 -3761 -161080 -21865 -22710 129419 -175703
15148 -53597 207310 -149973 282883 -139598 242108 188916 117624 165918 173556 329880 165559
15137 165559 74652 -65625 -17364 212728 -45503 89873 -17121 396576 159990 197192 197262
15126 197262 326587 26004 -2183 222003 328833 -210538 313290 232574 200978 343326
15116 343326 345041 74789 263228 -14431 -43085 236334 130741 498396 294119 424463
15106 424463 150220 5477 40563 270170 214750 227781 -37004 318092 271858 201324 359090
15095 359090 16611 286880 59200 67200 99276 -47687 210176 -141476 328905 184965 -37336
15083 227313 290482 94732 260695 44091 399772 -149243 262591 200146 204688 46423 181799
15072 181799 203705 295586 150364 49232 194108 259881 148379 295601 402081 225571
15062 225571 206626 62707 66259 298157 239283 154361 94253 165365 -172748 -37079 240194
15050 387271 -28820 179898 307307 87310 128342 237493 203470 -85335 -26760 93153 103855
15039 103855 274169 577750 385210 -108010 -50067 266145 327703 341309 386481 34087
15028 35717 -6917 -163614 165192 -52101 112382 401149 126621 22051 380878 283633 109906
15016 96138 194787 1547 381952 111895 112330 286616 203289 -63920 -27827 -278892 -39665
15004 245057 389252 265366 82607 280681 192132 -24877 127853 58684 471382 382828
14994 382828 83084 580858 225736 -79211 500687 171406 329266 78931 43282 438582
14984 438582 194191 244050 625768 49826 170363 238551 92602 361415 52004 256581
14974 256581 192851 263013 109383 633522 49357 446991 455287 134014 603538 162751
14963 308221 -81033 121406 173450 -263133 386199 77880 384082 319278 368029 456725 126482
14951 229844 246839 219056 380745 51889 692788 280630 156245 476447 240442 146391
14941 146391 168856 141246 79357 352361 357213 287382 600664 5589 773729 253325 47468
14929 181253 453868 379951 89190 -73015 310995 126198 217190 551486 417756 44485
14918 241612 256717 -56663 206604 364282 384424 198972 471073 696200 662102 326018
14907 375319 284227 423763 553974 321279 321038 210139 248476 399448 7630 534872 105542
14895 316821 228023 79599 307033 314148 507238 250575 289059 255011 416430 503022 315958
14884 315958 211510 426845 277996 670021 380331 567203 342321 576207 412476 531533
14874 531533 203410 186164 99406 253222 288659 405568 239460 264393 326966 435234
14864 435234 539524 1075 466039 314036 427752 394741 343473 402138 630216 575097 577316
14853 577316 327536 508743 165849 622670 414087 599273 375525 405021 79104 319893
14843 319893 657721 379950 52248 632411 271736 160365 770777 471688 222220 295190
14833 295190 218222 652908 654744 505307 789007 736298 573727 535227 451785 342489 574763
14822 574763 582934 351012 303985 345641 951678 582909 391786 490886 216317 727225
14812 727225 403828 529648 520991 594089 404042 269529 254271 651166 460748 885688
14802 885688 227433 438005 555411 223629 451368 601025 535507 523644 682562 165326
14791 1037849 421333 694293 699268 597068 583064 711677 667458 734701 671164 320013
14780 791234 654215 877700 516426 586001 448009 648961 555963 651243 400332 908867
14770 908867 506863 342908 659425 686414 515910 815914 493917 486460 552637 586808
14760 586808 601507 533095 656126 1010603 629892 712448 572651 873812 871912 478403
14750 478403 581463 980929 745468 782841 550191 759050 753585 725859 531471 873440
14740 873440 910380 564236 781122 903046 837689 865957 1164337 521052 697504 697305 841399
14729 841399 963704 563676 690645 468191 817193 698487 705661 783830 645311 843950
14719 843950 964430 998083 829014 769295 1093617 731277 900737 1035183 869147 804080
14709 804080 787107 819238 890720 819019 1124108 623945 1069993 943595 919068 510156
14699 510156 964554 1075704 905527 1003466 898362 838474 734218 1301535 1036331 1251323
14689 1251323 880375 829877 1034685 854325 793543 1194585 1128770 844189 844554 910564 889906
14678 889906 911575 970614 1148533 1034644 1151870 969203 1195180 1090131 1049444 1097263
14668 1097263 765940 1245337 1175908 1222670 884909 1144838 1228174 1102813 1513660 1242016
14658 1242016 1334335 1366815 1065742 1147522 1096651 1270904 1338152 1272174 916236 1207273
14648 1207273 1156717 999755 1169087 1306395 1065971 1538106 1369592 1407896 1399097 1427508
14638 1427508 1408469 1385360 1331498 1140963 1714743 1256382 1309885 1261926 1229241 1373910
14628 1373910 1373860 1331106 1367926 1606080 1294832 1617412 1304870 1358323 1336884 1389397 1754907
14617 1754907 1498931 1355761 1717337 1509497 1418177 1416605 1749268 1696254 1434868 1559262
14607 1559262 1807193 1314142 1537948 1521968 1450742 1852337 1631072 1751364 1661730 1554755
14597 1554755 1663969 1671541 1289474 1753621 1943060 1799933 1916202 1741138 1704735 1694657
14587 1694657 1728554 2016941 1616757 1898783 1777276 2173339 2237148 1969371 2013291 2328682
14577 2328682 2177713 2119375 2030528 2108577 2154782 1707314 2186356 2179437 2226585 2319383 2383937
14566 2383937 2370126 2597711 2552487 2484349 2556352 2560738 2720956 2567261 3088139 3000175 3018201
14555 3018201 3165005 3463181 3733127 4175981 4873420 5787084 7856141 12166159 23673580
14546 23673580 39832115 45011898 19345457 9762218 6205053 3055921 2583617 2007026
14538 2007026 2193768 1855263 1905629 2057929 1995336 2006878 1874996 2140115 2288445 2305911
14528 2305911 2115587 2329794 2293450 2154476 2280472 2437164 2575900 2409524 2567568 2527036
14518 2527036 2656059 2859132 2887546 2638980 2663182 3122381 2571891 2848900 2898921 2601723
14508 2601723 2960278 2892480 2953409 2986697 3182826 2945252 3325495 3026014 3143238 2983761
14498 2983761 3176106 3302184 3292870 3377804 3623067 3554691 3441517 3547730 3717485 3487443
14488 3487443 3302068 3346364 3533748 3736992 3721749 3793245 3915587 3632047 3879166 3937024
14478 3937024 3944660 3869206 4205567 3956106 3988191 4435661 4114234 4362022 4612313 4380620
14468 4380620 4460206 4449789 4302241 4523358 4763892 4847871 4629609 5074042 4813998 5213999
14458 5213999 5015092 5293560 5242448 5104418 5271417 5403236 5416244 5077439 5983472 5544613
14448 5544613 5581403 5814422 5836126 6118585 5723589 6034899 5999955 6218039 6362954 6402270
14438 6402270 6276341 6358895 6456388 6752973 6764163 6548139 6673076 7063180 6915128 7242014
14428 7242014 7189691 7379566 7499581 7433731 7378561 7982737 7915022 7921600 8281087 8078035
14418 8078035 8392323 8381173 8198167 8477060 8729084 8785499 9162771 8933943 9348675 9285614
14408 9285614 9477567 9718734 9770010 9993865 9729531 10279947 10560217 10338245 10647110 10730938
14398 10730938 11252935 11165584 11494364 11695098 11765954 12167730 12484846 12408311 12797126 12605508
14388 12605508 12838293 13211461 13419850 13849178 13927039 14185284 14685841 14934309 15057483
14379 15057483 15351131 15696763 15674830 16214752 16912255 16946812 17186329 17410141 17708288 18346364
14369 18346364 18117888 19048151 19413820 19972167 20192781 20677911 21077346 21380001 21538783
14360 21538783 21849709 22808665 23353603 23553137 24343105 25095062 25133482 25956959 26243382
14351 26243382 27198737 27942182 28634190 29422131 29962165 30824767 31635622 32453540 33003146
14342 33003146 34226285 35241465 36042576 36898266 37899655 38837313 40355588 41224562 42422994
14333 42422994 43587201 45048297 46524246 47675629 49111873 50668126 52357754 54229249
14325 54229249 55872376 57833621 59663246 61846498 63947187 65932996 68771374 71100405
14317 71100405 73935303 76464837 80070475 82754878 85884308 89535958 93098500 97020390
14309 97020390 101174566 105075142 109823891 114588700 119795008 125146859 130754670 136787774
14301 136787774 143401184 150050175 157466959 165091016 172886541 181732379 190880550 200470901
14293 200470901 210640043 221399886 232464473 244273430 256596336 269733702 283253697
14286 283253697 297400139 311735971 326503909 341507197 356844113 372236741 386826724
14279 386826724 401150899 414548350 427009228 438132285 447754716 455319914 460466112
14272 460466112 461348149 458657828 456191578 456857093 453999534 448870044 441131904 431672714
14264 431672714 421274992 408837291 395247337 380386594 365053761 349773033 334124931
14257 334124931 318638415 303621455 288617568 274982596 262168898 249539984 237165098
14250 237165098 225177162 213861788 203302487 193373555 183919677 175232194 167189665
14243 167189665 159134795 151842609 144726903 138304823 131828920 126751921 121144854 115401419
14235 115401419 110653434 105759031 101812556 97450232 94224939 90165476 86507828 83473380
14227 83473380 79897070 76824974 74478762 71524413 68751359 66373065 64372204 62357439
14219 62357439 60011405 57992695 56036458 54318446 52634375 51212047 49831400 48292781
14211 48292781 46427365 44997292 43418887 42556048 41597229 40729282 38813121 38022345 37227698
14202 37227698 36058818 35069704 34445742 33060075 32554831 31389372 30602968 30196480 29252972
14193 29252972 28516390 27880077 27069150 26206213 25645665 25319884 24388605 23904326 23257136
14184 23257136 23151598 22806216 21750180 21343554 21154627 20287158 20389768 19987814 19414326
14175 19414326 18873840 18693080 18023252 17965753 17539499 17100757 16866424 16751284 16035784
14166 16035784 15689908 15442151 15264832 14589951 14682158 14281484 14478535 14029095 13895388
14157 13895388 13544008 13385096 13264929 12783616 12432427 12205539 12387528 11735645 11856914
14148 11856914 11649691 11395946 11104285 10985746 10963948 10612547 10548086 10862623 10170093 9902898
14138 9902898 9738608 9806748 9842548 9319246 9455457 9174976 9298786 9326582 8980401 9064513
14128 9064513 8447144 8560603 8507424 8135929 8053138 8123634 7875105 8025089 8034721 7592207
14118 7592207 8002307 7203060 7372181 7241561 7183232 7052353 6814244 6973871 6813795 6800877
14108 6800877 6523081 6273536 6152598 6648366 5950131 6296004 6144465 6134183 5806321 5691280
14098 5691280 5662409 5833309 5784290 5573426 5548964 5219918 5641665 5410611 5351891 5251544
14088 5251544 5166130 5213519 5134638 4956506 5149157 4787463 4897079 5147509 4852908 4700354
14078 4700354 4382810 4772138 4640125 4525555 4433621 4497087 4364460 4196855 4341488 4410770
14068 4410770 4190737 4314932 4230827 3865677 3888422 3866528 4024949 4290320 4070230 4022891
14058 4022891 4184129 4012130 3569901 3600886 3861568 3722182 3716739 3666787 3715474 3694936
14048 3694936 3258825 3632591 3505788 3312436 3308553 3246208 3446486 3157682 3078853 3213427
14038 3213427 3099506 2830568 3019851 3210394 2811279 3123401 3229330 2923475 2902267 3030570
14028 3030570 2925689 2502348 2775614 2526954 2713429 2729226 2477341 2618731 2564904 3022117
14018 3022117 2579709 2484845 2681359 2792160 2547611 2222013 2175053 2151064 2506457 2495986
14008 2495986 2644013 2198119 2334481 2677435 2113379 2253740 1992336 1980124 2202306 2106411
13998 2106411 1965203 1835943 2155469 1666532 2082079 2170471 2257176 2336730 2698488 3544586
13988 3544586 6838746 16001387 33691510 47247032 24750075 12381279 7614151 5820373
13980 5820373 4466562 4205932 3246684 3337288 2828837 3087712 2958190 2910212 2814115 2625013
13970 2625013 2678862 2338410 2151134 2484150 2252946 2104139 2211427 2547734 2265921 1989478
13960 1989478 2172663 1977093 2335128 1993609 2008659 1821826 2492429 1911014 2180568 1881211
13950 1881211 1856978 1721678 2079036 1758078 1883322 2111588 1781955 1834782 1670971 1756093
13940 1756093 1941114 2058514 1941709 1836713 1698679 1429336 1516994 1693536 1435713 1667218
13930 1667218 1574625 1989763 1744502 1645425 1451747 1784824 1468119 1453763 1419073 1382259
13920 1382259 1685065 1765860 1500643 1239980 1455743 1440555 1464638 1248090 1384444 1763491
13910 1763491 1195936 1595625 1344188 1375255 1222799 1768797 1129366 1387997 1074168 1124858
13900 1124858 1192586 1166518 1588142 1224436 780460 1697080 1230213 1225099 1441418 1439324
13890 1439324 1424176 1133618 1092092 1183982 1126280 1074133 1214380 839728 1220303 1410028
13880 1410028 1225492 1451498 1367438 1228952 1107574 1119602 1291389 1319706 1184614 1016250
13870 1016250 1087209 1086965 1236259 1002425 1166102 1364696 1197694 1005566 993520 1175374
13860 1175374 1332240 899856 1041075 1020044 1176490 1075259 995597 981666 868390 1070129
13850 1070129 855450 731784 896572 668565 977126 746819 909595 1280130 754728
13841 754728 822229 845948 849946 1117764 657198 960224 1054010 731945 1062263 598997
13831 598997 1283037 843056 1213275 717940 955530 791169 1024099 627501 753436 891608
13821 891608 963079 741756 1287682 1268227 1007485 964557 1182498 606348 657478 1075858
13811 1075858 988348 911692 948840 865358 740127 700738 896136 907531 561136 832981
13801 832981 593708 787069 723511 442174 624831 663802 891701 849046 776057 700420
13791 700420 318583 1127314 845147 789664 676993 715831 615858 833170 739422 437937
13781 437937 577594 442672 670897 596882 826110 671425 1022900 646733 617060 697641
13771 697641 823155 1279428 602103 608864 567481 803659 779012 531103 531375 784527 405421
13760 405421 972404 547500 509937 677201 471438 499666 608047 561680 610824 626818
13750 626818 545827 684017 399967 619757 931913 597800 346038 743365 674851 567016
13740 567016 617190 723464 664802 514940 619258 603382 601784 507577 485967 594451 388316
13729 388316 475100 610198 820471 499160 624417 627856 414592 286252 742337 783095
13719 783095 717586 381525 760093 652227 623070 725016 368715 869448 610088 347648
13709 347648 458750 434086 679903 835268 464017 533542 377792 461587 590508 407392
13699 407392 541310 499923 390746 450866 380775 519168 727022 542490 584293 330569
13689 330569 658655 401384 803272 433709 426773 648986 366390 349123 787730 273456
13678 335821 461533 286858 705324 600872 255347 406696 570121 646130 372134 523429
13668 523429 475175 323108 451706 515091 293032 574476 789965 332582 398618 705884
13658 705884 511016 649871 600036 290968 509259 244310 432061 146309 464728 223383
13647 598626 177520 572387 318626 538884 627771 465211 323343 377231 700897 528303
13637 528303 401395 375817 443140 314653 469421 356774 510276 395904 218059 283408
13627 283408 455967 428429 446766 30465 440414 291213 484492 367873 365395 351545 368066
13616 368066 404064 397493 500067 419706 466823 355233 379251 111215 113401 504659 128923
13604 266547 312966 343086 318865 228943 5505 275040 224730 534498 253272 430271 406281
13593 406281 223788 583555 465566 472747 352939 347171 560064 176013 332697 394544
13583 394544 175964 157308 139732 282266 522847 425855 89103 123715 626869 461638
13573 461638 284243 -116637 514302 340441 164636 60576 177064 109339 89904 254008
13563 254008 331489 634482 339669 222726 454621 268341 48151 -46553 483108 349870
13553 349870 213029 264182 58574 480012 289080 184197 282323 282388 35538 177381 168538
13542 168538 313003 -40101 203890 305324 363569 300339 415232 -66387 271299 100866
13531 599610 309868 150085 -31137 270946 107229 145564 355762 279379 374067 435500
13521 435500 374882 86622 197414 185944 118430 -15061 162747 51356 123408 129024 155210
13510 155210 222727 236769 193689 35097 100502 44996 447115 325450 497152 72694 293957
13499 293957 343981 -80803 52936 559330 299110 260663 -82963 312305 144607 180285 463867
13488 463867 572173 181976 227877 483522 682510 291215 372641 224772 11360 204877
13478 204877 74956 461976 487736 400136 182059 144786 231859 63361 325083 298278 143472
13466 -72085 180227 273157 227242 352491 -27937 291444 114523 367573 401315 472908 364337
13455 364337 -52392 311267 314604 428941 -65013 396356 212346 386982 236493 -65480
13444 226056 104950 184999 415687 571744 87438 146316 27190 223501 206484 -93186 396726
13432 54658 398906 92247 387324 394472 247601 73591 259702 77842 335637 147227 219477
13421 219477 46747 158039 339686 114826 144113 274522 222065 214537 -238154 -71213 -38555
13410 -38555 140897 -118783 228491 417064 424774 17978 232483 314911 455035 209718
13399 -55279 218336 586551 107004 389986 270847 147961 248925 287371 46894 319848
13389 319848 131667 519552 152575 246638 352134 368949 432745 247927 365647 54007
13378 94696 340358 225650 311189 -29137 334899 303463 385400 212333 -35806 179416 293931
13367 293931 250255 402243 404160 -105106 345266 305569 103198 300676 6139 124329 237469
13356 237469 161417 245967 234064 -79239 159283 -42532 135309 209651 328960 420696 114632
13344 268339 63806 203090 259027 377059 329941 111202 235236 -199805 97640 33900
13333 262337 494910 232668 55009 -17203 364922 413405 396779 82198 365458 94694 348888
13322 348888 -21213 37533 280270 46299 414528 225282 80915 194206 129962 187624 -54827
13310 195874 357610 98370 484680 426522 51761 269187 -71424 243363 371005 -119494
13299 127444 101342 319686 166569 155528 363510 97502 184569 328290 297436 90626 38942
13287 102876 -159779 150615 140887 -151817 165852 -43507 213947 133897 -31064 102811
13276 -201296 107670 -172329 41311 -21261 529429 61469 82862 172783 300700 183328
13266 183328 -173554 92696 79244 196680 310161 447006 59582 349459 10932 156813
13256 156813 307695 130315 -303508 266562 -198595 -11225 222990 -145294 129058 24841
13245 35444 105914 192103 148108 167277 -61864 66400 364260 -87715 -24682 -55056 148268
13233 37771 -275858 220994 193731 11474 -35023 -15497 99149 105219 42402 215908 335772
13222 335772 289456 135423 -69533 57058 370533 97665 181036 184436 10534 155234 -69331
13210 204242 -136902 -17732 -221442 -114923 237246 23397 -10345 196655 -117827 -42538
13199 42065 -32866 174734 265843 368285 -120611 326237 -75783 46448 324392 493185
13189 493185 29788 237768 85707 -53586 -144084 -9711 -205029 -20071 29749 209134 -334625
13177 76599 69062 57016 321279 -262750 342357 97502 120573 -262623 65076 184043 -107479
13165 -313173 -48549 85663 -176593 180124 32367 -84529 249212 -209947 293862 -122914
13154 156719 122436 152901 -89945 -172572 33675 327285 319582 -180280 158039 364685 214499
13143 214499 142276 383742 -234815 -16660 163561 -6423 51812 235396 220946 -51409 150988
13131 171535 56875 -1557 110042 -82835 91526 -160333 505735 259423 30250 122908 -441431
13119 -86015 -272255 193581 187595 -22882 -198907 226890 24527 130225 146565 -217367 4740
13107 -173498 374232 -139072 244756 62268 99900 18434 171697 98231 -152107 -173454
13097 -173454 156288 181572 -33136 54018 217299 144452 310728 140533 248609 115908
13086 -105565 175342 121593 108908 214919 138200 368110 104930 -32415 -78031 -114111 -37616
13074 -105367 54874 18554 67426 16702 64197 -28930 106619 -4707 -48233 237087 78585
13062 289654 108003 -148439 90367 -70809 -8130 107653 208283 178982 26529 361321 185956
13051 185956 -48638 241133 -99938 -32355 -39976 -169898 217712 -521997 245630 281799 404901
13040 404901 182985 78292 -153486 -238229 34603 280961 -25471 -65023 70801 -10181 -159907
13029 -159907 235790 -69688 218548 425067 215686 142916 284801 -117903 244642 -26917
13018 261512 294107 -3458 164553 130807 232579 171054 167927 -6099 149642 -100887 61900
13006 239155 123601 331835 196012 -53341 224774 -122881 197498 -232953 350226 159723
12995 -191543 -62443 40168 138342 -326769 -5226 -65587 197800 28216 311723 324335 161349
12983 -119954 26012 -148721 72808 129393 105973 39294 -106891 -152873 58737 60585 -194356
12971 -70445 219561 259695 -88251 301197 67539 429858 20637 253838 151444 287203
12961 287203 162530 100498 325939 -165427 103343 289955 -292088 244303 -424416 -17827
12950 150884 50797 -147907 -261016 157879 -10873 413 270346 -85027 -271179 -101528 -19552
12938 -110107 19692 150829 64700 104420 131938 -17581 108630 24686 96558 -37767 -3677
12926 -67401 -120591 -197835 -58963 -83778 175718 -32908 3935 61244 3079 -139916 59801 183032
12914 183032 244681 12918 -86389 406134 73567 28212 -220053 -69267 -37634 -9039 297710
12902 -23922 317391 -49958 82675 246593 119727 210016 230884 -3308 171290 -255443 360708
12890 179750 105309 -184293 150253 208621 -320191 27791 63531 -62779 45265 115314 -1871
12878 176627 39822 -51036 8715 190015 91626 12481 -147886 -1733 -47886 -192381 -17374
12866 136571 -27399 -211676 -114080 457364 198509 258719 -176729 41601 301118 54920
12855 -33853 -44315 83897 80834 26376 176719 -300525 -73415 196178 -134765 -48582 -48242
12844 -48242 88105 -157863 -88552 -161293 98583 84792 141070 218388 -19616 10567 56381
12833 56381 38775 15924 -91247 -104882 -49607 -138428 398804 221496 -62533 198094 -31570
12821 -163553 -156241 -8293 -116979 -115896 131536 100847 140089 58242 196202 -273458 -138323
12810 -138323 292428 203210 162802 -66874 -143394 246312 153585 -616050 221443 205196 -139609
12798 160744 61899 -46979 22063 -59538 -83860 -124043 31505 -128803 78836 239982 -30997
12786 125916 92438 178438 14654 -129383 -8795 -181771 -172764 22430 166743 -31992 75785
12774 58489 354866 212613 -100054 32443 -113345 29476 140011 133473 256292 88939 -70329
12762 34730 185772 -211254 -334875 111502 78963 192530 -141220 -131499 -15322 -248468
12752 -248468 -122356 10484 -182519 -229870 36292 158760 471555 115936 -77016 -145559
12742 -145559 366705 82539 203372 36201 -352049 196195 110565 -147742 189790 318662
12732 318662 190960 28715 49729 216637 -314997 -104228 -150851 342066 55839 -327271
12721 64970 -30509 50088 40129 44071 275447 224106 -283550 93876 62618 5333 88052 120508
12709 120508 233848 218579 401697 303734 16653 310973 388694 -108835 156459 190816
12699 190816 34227 -44688 -127836 -163588 -95759 -20811 -231322 103689 264399 17397 58650
12688 58650 -73243 210197 9169 -45808 -273803 -60577 -171480 -25621 386784 159907 274944
12677 274944 -7595 329347 198941 140890 201344 92858 72062 164575 190157 22205 202130
12666 202130 129872 -367138 346499 215012 81935 207414 179451 -197945 -114137 170132
12655 54620 63804 130009 282534 -190531 18008 180200 110154 -64650 -27913 155505 -300785
12643 481535 33270 -94432 61370 -330006 196445 -71983 41055 -146707 308397 187821
12633 187821 -5462 -164546 260320 67984 359208 295869 164705 668106 -6126 -9296 107759
12621 257366 237380 491451 58715 285354 265265 126123 52067 -62377 138615 217351 155934
12610 155934 193997 59835 -154444 228092 -316702 5167 98694 -100730 129772 29059 -254609
12598 -147065 -211670 188928 193873 26233 211380 -80495 325817 48254 -68087 -104482 11655
12586 59021 -110770 -117519 20639 312081 -369003 157384 269325 45433 -30285 119961 -75964
12574 -195527 -128825 46142 87005 166306 13168 -159845 -30199 -42144 -288567 267183 144708
12563 144708 -194477 90790 -143917 -173752 -419390 98031 79265 -15778 172318 -112547
12552 104445 47443 241009 -96905 -56030 145202 -132773 36059 266509 120515 107710
12542 107710 -237984 232686 85890 474332 -31055 -90491 221575 100446 24430 232350
12532 232350 -36303 -52302 258324 88112 -15301 -11903 -6953 258527 -26754 -257636 92296
12520 329294 135179 147218 91277 322787 -140137 -138714 -269362 348583 -180305 -59546
12509 91432 104477 32459 244067 285800 233694 -101156 167306 -3359 76858 100752 -22432
12497 -334380 65501 -210305 213999 325025 160539 205818 70545 241900 -167500 -188663
12487 -188663 -199660 382172 -9193 -116954 52005 120334 -20809 -41337 67023 -122419 -69310
12476 -69310 -74436 -30105 -124347 -82719 193338 213285 86774 -34700 -204533 -146596 183902
12464 -315045 106064 -68476 -24513 -36663 -31580 165164 220198 -327832 171460 24297 440802
12453 440802 -83493 -136351 105262 143306 162078 93745 -106641 -154687 64820 235261 -45410
12441 -143946 -164937 108471 145328 -56088 262202 32980 106356 55255 206738 -113083 -145854
12430 -145854 -201062 -154878 20812 26533 69317 -65964 -234273 306282 -21525 -156302 -151168
12419 -151168 -22135 -156665 201069 325341 288134 183370 4180 -110556 -277991 35709
12408 9821 357267 144866 -155370 -40912 -3931 -126455 105876 54714 -119185 33149 16807
12397 16807 -26154 -296477 -18724 123885 -113572 -75674 -191574 -349749 226415 -157459
12386 -155614 136190 -4660 -96457 77234 -216333 -130773 182618 26064 184836 -55363 -360140
12375 -360140 138360 -95249 82276 -373519 -179988 -174319 -16758 145186 132091 164394 -80805
12363 29800 277688 110269 100904 179283 74160 138648 -69531 167941 -504 66415 137924 -164538
12350 -52288 573371 144412 -31086 257224 69101 -106424 157188 -53311 20284 186378
12340 186378 255548 -97392 249057 4955 -27263 -391369 76429 149363 109351 118652 66684
12329 66684 232272 -65343 -159508 -94019 177164 -176004 105663 3139 -196114 -102133 117461
12317 167751 42698 133336 -317999 -120382 350648 82227 -19993 -299292 -106409 -37871
12306 88126 -82216 225846 -169661 -21402 188712 24749 48893 -298294 79437 281604 -206373
12294 -365363 170069 182474 -187906 26926 75843 12147 -34901 -59272 157071 19794 143659
12283 143659 -221350 10111 317856 12489 76961 173631 311141 -19008 -151515 62185 27909
12271 185499 161934 -97535 141589 68875 45048 -75812 -126794 54656 110261 -117430 201358
12259 -317387 34316 -18429 -19664 247652 7968 147458 161149 107109 -186887 239435 -63798
12247 -72533 130951 290775 229649 -370003 39217 314195 190564 52245 163550 24591
12236 -17425 -110833 277415 70374 -14742 204413 414188 139408 58989 325835 188651
12226 188651 34975 137385 256281 46485 395442 210214 257216 6301 86097 323541 256169
12215 256169 260126 126288 256 -87715 184864 195354 122609 133076 415950 221358 159307
12204 159307 -68809 59157 167328 349740 56934 -40835 182570 97554 362119 -207832
12193 -145799 374842 90497 29142 -74560 90005 212185 -34069 112149 256167 -82301 29647
12181 51280 68245 231378 211889 176180 64634 -44002 373359 125576 332551 198962 -1619
12169 553842 -119366 -170586 276934 32148 327598 313178 -31615 185055 36800 45619 69736
12158 69736 109734 113283 369164 19425 204383 114831 87811 -70373 163085 -23696 462432
12146 -85681 -110102 -320530 -81707 -128868 60357 -153247 54307 190653 -3605 21981 -183844
12134 -19907 54795 -45175 -35912 70605 -32619 36312 173716 -75510 223166 -70036 116052
12122 -162041 396475 117937 140340 -8209 164937 401144 48437 -4318 -131503 118983 132180
12111 132180 -61410 -61936 26418 -166922 133489 -48740 -120566 -189969 110433 -25483 -103041
12100 -103041 139545 -49990 107828 -30807 -31567 -197101 -23872 156739 -1670 -16390 273261
12088 -105974 -310148 -64137 143794 122081 74947 192581 114638 -77694 -176645 -191787 82467
12076 9824 165312 -260387 26075 -50965 -118428 -215026 357489 247867 128505 332783 45514
12064 293511 317540 404254 522973 1017323 2084994 1154707 527415 154816 119552 202060
12054 202060 64061 70817 -175937 157239 -103234 -107226 -191835 74800 227227 -265437 -37130
12042 16866 208192 99389 396720 -61122 -49676 216298 102349 -7057 -117753 -231181 -77654
12030 30673 -131284 26392 -468875 164106 4187 -63510 3832 -191552 -8675 -81530 45913
12018 -166505 -29933 -195044 165393 18354 -72588 -9104 -163308 26046 105456 26735 87639
12007 87639 -94571 264529 -182560 -67501 121525 8829 -413744 33731 117972 -178787 -38663
11995 -140897 -248658 98977 -77500 -72258 84678 -42358 -252638 193964 -211143 134922 -483407
11983 -183582 39856 73352 48546 115774 139542 -299758 -6613 -423791 -172980 51890 -121738
11971 -67156 -59028 141087 -243793 -265083 -264810 -142200 249905 104792 -21577 -6373 -61547
11960 -61547 -202245 33043 -6299 -29494 -309944 -96161 123131 238162 -244472 -351377 -239806
11949 -239806 -107599 -177035 -41307 2905 -26546 -286548 58853 90935 -87061 -181877 22982
11937 -1584 -21196 -96973 -229485 -11674 -105987 337156 124043 278909 -182099 -80205 68868
11925 -65873 -130729 -54659 -198818 3406 117289 -33558 -24019 -67128 214269 44678 11268
11913 -239090 277967 304950 290427 -173450 21895 -8991 125466 165077 -21919 2284 -370186
11901 182703 53156 143685 16845 -97550 257832 -150076 -374 -114988 -135753 189663 -50559
11889 188743 -299708 129101 -19066 -262708 -27939 -158131 248301 -268547 255452 -81643
11878 -136025 -352050 36103 325877 28823 -123609 232439 -55022 -285657 262179 74404
11867 59328 -8007 -202856 212656 -164897 95137 -51215 52433 -30822 -69543 -382285 101853
11855 163341 -299400 149753 135855 -116162 -173559 409 -13681 -9289 21385 186459 -395292
11843 -552942 243046 -32914 99424 258614 -181336 -320008 -26402 83863 -58925 -171592
11833 -171592 -96826 124794 -126751 217339 -337879 170052 -165380 270028 -25478 232577
11822 -57706 -484968 -122257 189105 -192317 -281616 98713 -154750 1016 -41802 113916 1711
11810 72682 -4579 -14210 337811 324424 58808 -69573 273724 -51152 -116486 -108381 59319 508834
11798 508834 -321169 -92284 -289040 91139 164565 187242 11020 639469 -54683 172279 192238
11787 192238 241702 9752 -120712 -253278 -14658 -276598 194923 -105798 103939 -123587
11776 214364 -25631 -135435 -59891 255 -154901 63952 169768 -244568 166447 51222 8580
11764 -270964 -305405 -56152 195573 367756 127319 -54203 -80626 -160855 -281535 -175736
11754 -175736 33149 -60016 282084 113517 -71112 -17194 -11253 276492 156075 144306 8139
11742 -90918 -75722 410761 77056 285945 -122173 -90421 -19114 143957 -329229 4448 -109809
11730 143515 -21572 50035 420447 162796 -6868 -95544 -72519 131551 249233 -87853 104499
11718 125098 113907 31070 -94950 -37632 160577 189360 8384 237983 77682 353223 342301
11707 342301 -187113 -112352 197098 -96369 38276 298420 -121422 74440 298837 -50964
11696 -30316 17860 48939 -140395 25987 196392 -200347 62912 27956 285671 -175571 11257
11684 319072 -132481 -22902 -11256 5358 -168906 276560 330256 183318 -56918 197111 305746
11673 305746 222096 -293156 -42492 241053 -25963 118198 -35593 283411 21584 69402 83389
11662 83389 -43774 229728 48659 -169471 -268618 -413797 259341 -303123 -186510 236010
11651 -130375 -159650 -172673 -139127 85344 -302275 7886 36261 7303 220868 108972 91728
11640 91728 411428 -276902 -64704 36730 -235539 30857 306164 -199259 120787 152245
11630 152245 -389923 -190244 -196533 81063 265764 104268 179980 -25471 180787 196700 102736
11619 102736 6449 -10813 280822 -170345 132434 392171 -2897 36917 229582 19446 -11522
11607 136288 321839 55759 34014 216111 -160706 154649 273742 78591 -655 188266 -169960
11595 146723 89450 65988 191483 225561 42905 169979 -118758 395948 143829 216760
11585 216760 -126152 29808 58993 107688 24521 -81232 197975 27880 -101402 -78007 -96950
11574 -96950 33238 -85231 -220125 24636 95410 -98436 16154 86210 -109035 -99640 -215795
11563 -215795 210039 81214 -88081 222678 -229254 205166 -213565 567419 190858 136849
11553 136849 126588 140243 -127913 139919 8537 74346 -153937 588521 225102 160744 4777
11541 240943 101204 251441 69313 -229802 -70234 201880 314069 197899 196146 -338869
11530 136602 -142473 232264 171361 457449 -170973 267255 54446 -4580 115400 72286
11520 72286 -13736 -175071 301576 -1643 172304 236812 328868 -43377 -80434 172010 51414
11508 176852 105472 80720 -26762 -23132 3392 -141220 -93067 203758 177483 -99005 186380
11496 147077 -7757 207157 236671 30359 298221 195153 199778 181059 137591 212776 270311
11485 270311 -5869 168472 390402 57827 232874 -29904 224013 61421 67656 -69224 212207
11473 183146 187518 361711 310138 114870 86158 253555 30374 -46537 205081 16679 162442
11462 162442 415210 359623 88048 59708 70019 -105142 85789 162456 287517 50390 -253338
11450 27138 139822 -43510 19086 196314 18510 93388 -332372 -241919 79785 373840 39558
11438 138702 69392 -97572 -291755 -11677 178771 259495 -302333 -98464 41324 -2267 -87961
11427 -87961 -182459 219390 -20191 317301 91823 220479 141724 28255 -99503 58979 135025
11416 135025 -111958 202465 179589 230584 -37949 146183 86613 -169064 15161 -30653 -87969
11405 -87969 167453 -76738 111459 39984 142545 131342 155102 137653 61792 161349 180902
11394 180902 244128 2687 -152044 236478 -61707 -340937 -41665 255371 157268 -54300 216891
11382 -410390 -91282 245195 -208726 -308701 -123969 -19641 -138779 -147235 74188 -356339 27908
11370 -78508 141443 83247 86621 95249 -32469 -85753 -32015 237641 -218991 -13701 12497
11358 -75355 -303774 -177764 -19059 -114222 48717 -116504 -281980 -130747 -24792 234744
11347 308675 75474 -30378 -49570 27862 -91517 -54086 -331781 97732 -302203 145763 -248510
11335 41937 149517 -95979 2141 247427 75634 80161 -172698 -186450 -132200 -203298 -229194
11324 -229194 -95450 256987 -43660 6815 5224 108755 -206449 -158033 85002 134256 -42625
11312 -46264 45108 -124620 -6082 -166735 -214056 189313 -118424 197686 10174 -53519 73506
11300 -27727 -19624 52485 -158336 -154694 72367 32114 165562 -255159 118677 -264655 -195902
11289 -195902 -250112 -130574 -82686 -232325 32323 36283 52517 -141040 -172755 -61074 -20076
11277 -33883 -288977 -295331 132015 -239652 -93604 -61190 69808 -166048 -55758 -320031 320436
11265 -64836 -14322 79119 -63289 -115611 -1864 -59930 6150 94622 17481 -172123 -589897 -74315
11252 -263757 106471 32686 219238 -121712 21353 857 -7233 -209760 -47969 -203867 -262681
11241 -262681 -82655 -185233 -281317 -151530 102728 207108 -62746 -301289 151617 56291
11230 -183629 -24252 63382 -60157 -39970 134429 98402 -328988 314885 7193 -52866 -143694
11219 -143694 49015 -224909 7828 -160872 -87864 125845 148233 -59817 -174705 -165179 83762
11207 119492 49710 -151863 -123471 77056 323763 -319491 -37434 -7973 155799 -8284 -25643
11196 -25643 -47486 132264 263843 38517 90114 254843 -24938 -17768 7276 -117362 155290
11184 -49422 -48360 -42536 46817 -268985 262509 -316572 81567 -224697 287967 -24243 -273706
11173 -273706 37385 76558 -44919 -151907 -40475 172285 -126872 -147079 25289 181355 47922
11161 144942 79572 -19406 62974 15562 -199694 -54806 -223269 -352180 151475 -194177
11150 -8431 165129 -130231 -136895 -52256 -108307 -112017 436493 4714 -124104 141762 33897
11138 -45344 207562 -95485 -335493 186468 258306 27858 260084 243089 -52996 137397 17172
11126 113896 75952 -250125 300245 177037 4811 252598 62166 -67620 30889 157264 -248645
11114 -182508 132982 -179109 351970 96059 -207660 -52536 292361 329597 -34611 333390
11103 -52406 243987 156488 76423 -242058 257187 -137772 -21429 479800 154669 247565
11093 247565 60191 174780 229481 -74362 282395 448588 76619 339192 187280 160675
11083 160675 412919 37755 260945 441828 204501 590059 131514 386575 359385 113359
11072 230761 582970 492195 154892 70607 537432 295924 574080 667796 479618 601686
11062 601686 165881 464434 541804 512616 624845 499490 561617 352693 591846 341301
11052 341301 666590 593764 735543 821953 662572 771519 890720 825937 471368 934814
11042 934814 921702 552132 606903 449556 968431 542907 815523 831630 741244 764849
11032 764849 804198 809058 678329 991664 634382 547048 573910 453505 526624 767646 872088
11021 872088 578452 681975 1021576 888064 721013 645254 692572 595916 794166 626022
11011 626022 660285 990128 728393 686425 809353 197413 640605 365402 552429 676407
11001 676407 770008 735943 792943 528014 796044 819080 998024 801385 499906 925339
10991 925339 734275 718373 581546 677670 1051965 922471 1334104 1243999 914522 1401176
10981 1401176 1288105 1136116 1355841 1492502 1578839 1824058 2168281 2346656 2445934 3067355
10971 3067355 3227040 2924103 2999147 3051114 2508888 2615694 2168360 1877554 1755650 1921476
10961 1921476 1893911 1916869 2089654 1809465 2176458 1961359 1907081 1973978 1630689 1517311
10951 1517311 721371 899769 403372 587922 668050 351490 652482 251911 224847 19288
10940 419996 304639 357340 115177 213957 347558 402516 22707 154188 -24788 345889
10929 79795 92135 165630 75309 5374 -118074 260798 38925 -443255 249200 355070 -58656
10917 -267617 -16840 -328097 -24816 28312 -132686 160459 -89333 135097 237962 -242091
10906 -132127 -167489 79972 -67949 165199 -55009 93447 -165884 200889 -110519 61256 -154087
10894 -130188 108992 18782 183018 131244 117437 -135139 -208245 164121 -169670 -283831
10884 -283831 52572 -76365 -94357 85995 -79190 41201 125222 -244946 -80335 29146 198678
10873 198678 -6365 96090 87421 363509 35624 217359 -192201 282054 -60122 -57059 -134524
10862 -134524 -231689 38114 227979 -219013 119845 61456 42816 -100999 -27056 -182186
10852 -182186 -7479 -64713 -137992 -100206 -331293 105648 601437 -76495 37478 32444 -83179
10840 -37167 -76017 72987 148460 -1113 410717 -209156 -167374 11941 -55656 -129046 -72913
10829 -72913 130707 -24609 -32107 -116318 -17940 -110499 299674 -94143 -125555 -36240 -81330
10818 -81330 -48498 -170685 66451 52298 -11027 -369918 -207945 521 -81063 65464 -147802
10806 134626 -60203 -139236 -196020 31510 95082 -98711 -62457 11124 -212324 -3642 -94645
10795 -94645 -160225 -50056 -147809 38823 -178320 -103540 -242065 144089 -11276 229628 -240128
10783 -320417 -219249 86484 -13087 -207710 -308056 236155 265004 91966 -297904 -125911
10772 -140546 245638 133296 154462 -459913 -115141 7386 -139421 34377 -53123 67683 -126762
10760 -122118 -69658 19665 -221760 -60151 -230737 55418 54661 -254285 61702 -944 107135
10748 7924 -197724 -168078 160270 8424 25359 143639 -421603 -150683 -213703 -87326 216147
10736 -83604 116363 68984 83295 -489209 -126400 -94709 103114 -189691 -341486 -40614
10725 -57065 407964 -475749 11428 37787 57000 -72110 10292 -105029 -30110 218257 22782
10713 -74408 -31856 -417829 -38313 -169150 -63776 185626 -141958 88557 132709 229929 348890
10702 348890 24444 39137 -173658 140117 55559 10839 95349 -142603 53166 -160370 -122972
10691 -122972 -75779 -152017 20588 83952 58939 -79278 71096 -323821 -204769 -716839 -57355
10679 70842 -144121 -180530 -150267 115264 -3584 -120635 -195093 -139847 -142771 -43943 -459095
10668 -459095 -15016 -147817 -274685 4038 -379266 -517231 -296274 19684 103739 -166849
10657 -69269 -2099 -5146 -16559 40511 255642 -212486 -18650 84258 -400143 270573 12954
10645 -405821 -160177 264594 -75277 -67474 -333870 176420 47101 -238731 38869 16124 -68885
10633 -111554 291832 88645 24625 -79845 121791 -365748 -26341 -128482 65705 -155347
10622 204800 23967 -11242 -89105 105721 -1138 -232687 26149 -192087 318611 -154824 -76765
10610 -150502 -114097 -148409 224450 -124400 1485 4869 -22100 -230202 -37936 380114 -234444
10598 -250318 -236249 121886 80166 -187429 -274435 -100615 -54365 274624 -61889 125369
10587 -164249 -162522 220326 180969 130137 -313209 2744 -75868 67045 -56829 5943 -193781
10575 -165207 -118409 -130533 265138 -160304 30115 164571 -185558 70277 -353743 -172619
10564 -18881 91796 -28795 83463 -132127 24999 -192696 -148282 34324 122867 120596 8566 -162167
10551 154493 -33460 -190109 86137 47829 -227981 144094 -183060 -110213 -68407 -174845
10541 -174845 31330 -100405 -209840 -16878 14316 -269141 17875 271063 -119878 -24688
10530 -300992 24409 80304 -230014 -147429 32832 232436 -36935 -158370 192669 -91521 131495
10518 -180028 -306340 114300 -109245 248871 214534 302002 -138327 -70062 146392 266007
10508 266007 6254 -7467 -228435 266296 335551 -41876 283622 -44411 89109 -107570 -142236
10497 -142236 -151119 -316945 -233820 30914 -217188 234329 -21999 -115866 -350079 173122 -64219
10485 -45154 -314154 91851 53552 141025 398751 112584 795629 505158 335431 191680
10475 191680 20312 -101685 241106 209132 141771 -158623 -26655 36309 65242 -85207 36117
10463 142448 -257274 -153890 143822 -62189 75428 161808 163591 94058 -167880 -122781 145744
10451 -38719 215836 94975 189110 -27018 -146130 -153494 26452 -15321 -130552 70547 123401
10440 123401 -1748 168955 -103710 181066 203831 49681 -319949 42281 96085 205690 21906
10428 149226 -235664 330878 -182499 -484236 -104251 484633 -221220 -457711 -206471 -23547
10417 -172052 -100232 -59673 -180732 269286 38257 271650 -158056 -162830 105958 133634 -11441
10405 59151 -163901 144109 100804 -290777 -314244 159668 -111580 -399207 92306 -129805
10394 308826 -5071 184830 150077 73788 191841 74315 348297 137496 158561 -173139 407648
10382 185590 236393 138252 407843 271671 -171797 318744 25298 12461 460620 117708
10371 342236 -6253 282834 539994 176702 420055 -69598 326402 653794 345775 300112
10361 300112 -19667 272438 250870 120027 248529 204017 92501 210038 293629 555414
10351 555414 345482 518326 635071 593935 226230 271988 250530 301817 641376 -661 24081
10339 254720 376755 203402 357824 144821 117881 157774 458600 161262 38061 104962
10329 104962 -73970 208905 -272400 185557 39068 160302 303612 393935 219952 113737
10319 113737 660731 104423 437559 225057 136057 282200 258996 -92676 140783 -13558
10308 184718 34284 107557 286862 24722 1276 108790 -89392 -154743 -140003 -97183 12192
10296 -251972 -147966 80524 -282727 44927 -54869 -86146 -249460 -6852 99058 -224240 -50783
10284 212756 -108961 -52903 -2535 -242922 -99157 -3235 -136935 9361 -9359 -39686 -305778
10273 -305778 -52365 124175 13230 -55100 618284 -294209 72416 -165101 -74382 328164
10262 19853 309462 134801 267155 352710 37870 230946 180297 227825 79109 189466 355907
10251 355907 109972 -178841 -61646 34373 55211 157793 -56560 176287 84359 -293049
10240 -162805 -116572 -144246 -101936 -206710 -252527 -189112 127612 -57359 -194851 -300591 -165500
10229 -165500 315709 -19108 374842 174696 -86273 -42905 36981 -491726 -153248 103388
10218 -386965 -114283 -122447 205424 185904 65264 -205610 -179995 118998 -186989 48739 -83256
10206 -53841 110243 99791 -328637 -52494 -223042 16895 28504 86724 -319460 -27257 -391907
10195 -391907 12070 -207615 -10174 94759 -84418 -293422 134881 126312 -357449 -186666 -1842
10183 -193963 -8115 -118338 -72878 107436 -104408 -138486 240774 -299325 219156 -196968
10172 -20880 -111039 179785 -209789 -305063 74450 212185 -57093 -21664 -11184 247514 -182155
10160 -170919 62596 244079 -150555 110350 -324845 47975 -210459 -179243 154429 54747
10149 -1640 -346448 59533 -155720 -87598 -40542 -236448 8094 28265 -150268 -238690 -185516
10138 -185516 -147783 6919 82520 -16247 27444 -108415 29202 -346664 -269123 -4731 -33082
10127 -33082 209390 -149034 -218733 -217927 -403144 -243508 -31989 31825 235016 327206 -52635
10115 157015 -96726 87244 -131935 -15417 138668 -295376 -312046 61685 -270902 20718 -135083
10103 -90114 161284 -61028 -249149 -102447 -93496 133435 -11569 -340555 -286504 -66239 -461669
10092 -461669 -188451 292769 -191478 -254253 -29193 -308313 239468 -16755 -305147 127762
10081 -78920 -62764 -174430 -175825 98660 -29303 -409431 -141240 -82874 153252 -155160 213747
10069 6227 -341608 -83776 -2536 170289 80334 45170 -93992 -62808 -242270 34987 -270653
10057 87562 167022 -7878 13492 -53524 -173657 184023 135780 -51199 -324476 -115983 -62324
10046 -62324 234073 -63433 -286489 -130243 3589 -167331 -2869 13750 -277574 -168787 265295
10034 405069 -298283 -91912 -65876 150336 186343 -53057 -55965 403278 -119661 473126 28665
10022 -77801 -43286 -28002 112577 13855 -495837 -7107 76468 -519743 -99851 66583 63369
10011 63369 9344 42682 58927 -314062 29438 -432755 -156254 -108613 -181785 -268547 -132328
9999 4782 -118236 -73438 -271591 -310514 81588 -33636 15393 -257419 123143 -169916 93983
9987 -73380 -262564 -225456 110614 -175260 -348767 311669 -88211 34317 -115466 -94545 -44388
9975 -127156 304294 24072 105520 -92538 -256691 -293402 -21024 -163045 -133403 49197 -288332
9963 -62949 -214888 21649 -229293 365450 -198959 83203 -217470 -26666 -29219 -140120 -167778
9952 -167778 -272691 -153131 -163961 103357 -116723 -48636 -110927 48408 -245957 -14066 28008
9940 113843 -136932 -207252 92586 -220153 -462914 -182290 -206873 -515043 -6682 -171848 -144472
9929 -144472 99872 73262 268366 -123702 -81352 111844 -44751 85597 -113752 -242876 121883
9917 -147320 -143615 -279573 -255846 -301348 122809 -44059 -255086 -126158 -215971 11770 -269287
9905 -47894 -192018 79341 -31661 -252038 107609 -102930 -48926 50483 -26666 -351819 -100169
9893 -43102 -275153 49438 -248463 161038 -239574 -185597 -108006 -45571 -225911 138618 -229769
9881 -10276 -415866 45418 -161875 31539 -26 -39887 86932 -388677 -221933 -185110 222383
9869 12453 -45696 -196986 -24453 241768 21043 195913 -337261 66696 -104662 -352455 30515
9857 33594 -309844 -45587 -120424 -30599 -41763 -49595 -100091 -37060 155535 -139995 -291830
9846 -291830 -60282 50355 -199945 -344932 -192673 -48242 69750 206099 -94884 4366 -99811
9834 -233433 60970 -345389 83785 -93163 195846 -327820 219032 -251850 -191301 -155875 168976
9822 -126579 -75221 2114 -127201 -128941 -101082 330765 -282968 156295 -128073 -202012 -241998
9811 -241998 -283621 94797 -179707 60803 166404 -151737 114371 -336266 -272323 -122534
9800 -2025 -175927 144416 102924 -103719 430174 -404279 86899 -30663 -81904 -44245 43690
9788 111408 -217357 59137 -89339 -88395 46969 -72574 -185085 199314 -182688 -254113 -86639
9776 -105952 -363634 80094 -87392 -194593 -126044 -423716 -361719 54521 -122354 9525 60602
9765 60602 -55617 -347854 137459 17407 -194775 -151107 -20969 -370560 44114 37482 -109185
9753 -155187 -84919 -29049 84199 -13843 -366818 -95362 -256659 -263705 -186874 -276320 -78483
9741 -269695 90948 -83152 -130564 1221 40087 261050 24548 33040 -263241 144785 105036
9730 105036 17210 -103479 58446 231658 136480 -57320 183366 -252037 -67553 -169350 207849
9718 130077 189241 33905 -131491 -128473 -492414 100191 151220 300875 59937 -86427 13929
9706 -264734 85414 -173246 46281 -403282 -189039 225636 97865 -10971 41817 96227 -128589
9694 -283348 101880 42725 -147839 38951 166563 -358105 123617 -186787 -297373 -76204
9683 -53949 96560 218970 163092 187223 -135490 122957 162822 8757 -250789 248493 -52084
9671 -310524 128877 -269574 -279027 -193998 41217 -170484 14636 224003 -316454 77601 -79682
9659 343421 -283159 -116430 -418077 -126596 -183871 -88620 -65757 -290162 -130242 123287
9648 -14129 -199765 -163938 -93273 86235 -51666 -297190 108086 27022 -388355 -59738 -156312
9637 -156312 -159476 61476 -41155 146719 33170 192811 -17096 -139817 247611 -221716 -224354
9626 -224354 -75855 -55269 -139894 55613 392039 160537 -250796 -20015 -289647 99696 132875
9615 132875 17367 -368463 -87904 -68375 -97596 -5798 -73771 -428067 -228575 -199415 169272
9603 -250642 -37736 42377 -250697 -130034 -384799 -297527 -277801 -90315 -287051 -125412 -177582
9592 -177582 -167946 152212 -203323 193887 122824 118540 -196481 -286079 -102604 -200944 285747
9580 -254822 -421568 6631 68595 -361635 -217898 370231 176542 -94162 14719 115775 -94058
9568 -194261 -449489 -129015 243475 -227397 -135195 79668 -194176 -296913 -179491 -140096
9558 -140096 -166828 -57045 275706 -200103 195578 72792 -287663 -311932 34696 -437020 -515919
9547 -515919 112766 1884 -141779 -206826 34837 80130 139717 -609889 73308 -57176 -31828
9536 -31828 -55318 -20317 -78517 -333892 164255 18196 -165427 -52980 -333361 61709 -46741
9524 -418344 2808 -44471 -27343 10967 -211892 128547 -126398 -24675 -167143 101000 -121361
9512 -118803 62369 -44234 -20652 -161693 298812 -434982 245432 -203447 104596 -391361
9501 8616 -84479 -191228 -248122 -337434 -114053 -160191 -196379 95368 -218860 -268904 -90567
9489 294107 -64009 -309735 -15234 -53199 12023 -265190 -99069 -9661 -296455 -8766 -91040
9478 -91040 121475 162641 -151361 38046 40355 103152 30536 279240 -82702 82149 -112626
9466 -1220 7599 -62989 -13179 28672 -106195 -149864 -438745 -95531 311253 -251144 -135270
9455 -135270 -56698 -141033 -134834 60320 149406 210711 -8337 108798 -23713 -185457 -258262 -192678
9443 -192678 78333 -41054 259500 113686 -249122 -156015 -205570 -13585 -165675 -127744 9472
9431 -384540 -343252 90495 95262 -303213 -137845 -342596 -61753 -319440 -52423 -203701 -122760
9420 -122760 -142585 64693 -188940 -131121 144467 -329479 149477 -183328 153139 270 165607
9409 165607 -249593 56078 -8584 -370223 84575 7049 -43662 -257034 270872 -27837 81091
9397 -25291 38252 -56881 122197 -221604 -58032 -335780 187136 -79628 -379956 -562338 50642
9385 -84233 187138 -40013 -153210 190104 -101407 -155028 -513288 -14682 67026 -95662 -281095
9374 -281095 -83852 88358 141416 -202126 261655 -120747 54585 -339485 302855 -123754
9363 -6457 11817 -498724 -304414 -104 -35022 -69042 -107010 -132056 -85284 -85573 -99265 139513
9350 -175650 -288857 112802 -440204 -139372 113005 -103744 34139 -83910 29738 67648
9340 67648 -234412 -461415 -319644 -310203 45368 -349801 -9191 -75567 -116648 -420015 -56020
9328 80843 -90554 -68191 230819 -29868 -190736 -267514 130564 -596138 -56102 -20013 53782
9316 -64379 277223 -78091 -126856 -263660 -245409 120070 -9348 22103 -117064 -305552 97902
9304 -5016 75397 248501 -211066 -55334 27758 226014 -99352 -307599 51686 -208170 -211696
9293 -211696 69064 -317109 40072 -46104 148239 -166098 -11420 17247 -76600 3977 -22522
9281 -86694 -29084 -270069 -124886 -11818 -93290 -395706 -21369 -140433 -44487 87742 58673
9270 58673 -328947 191310 109622 228518 -171450 -170484 -214592 -80088 41133 -112585 377833
9258 -6244 -37428 193131 -16455 -303836 23995 81474 -40453 -87424 -21073 -141519 180728
9246 -94417 89639 86672 90959 -261336 -9206 99138 -138525 -185610 -128703 12133 -12224 -78149
9234 -78149 44786 57150 40763 -211412 -304078 -366836 -209008 -2965 -47718 60657 -111443
9222 -160770 116237 24954 -64166 -92572 -182763 -413616 -189509 70932 -375844 -183882 -151329
9211 -151329 -279333 -57456 247614 -201077 -339041 -47764 99156 -177444 -259378 55066 -58680
9199 -70449 -112609 -250733 -112421 -244509 81712 -167485 170799 -170705 -142642 -288644
9189 -288644 -242312 179867 -146133 -189960 93389 21580 -225688 -376059 -67946 -59109 -378064
9178 -378064 28149 271824 -207533 52596 68693 -2439 264815 219280 -5001 187785 35269
9166 -228394 225733 64175 177923 66362 155602 -5674 -43023 96882 75857 -276136 95908
9154 -65314 -206523 -254710 186289 30810 -102208 -102368 -157009 10320 49132 -365789 -142110
9142 -368232 -148189 17913 39904 71195 -185036 -33056 -176740 -365561 -4425 -115856 -47260
9130 166639 -364260 34145 121465 -62513 -318219 -188577 -58698 162542 148503 261921 -1539
9118 -84510 -271061 -419430 -228766 -179837 -299447 -13128 -216684 -459456 -109515 -132933
9108 -132933 -246726 68598 -205007 172517 226743 -323793 75223 63430 -151540 58485 -28907
9096 16743 172864 66159 -413026 -141176 -76091 -28797 -226533 36460 183811 378 -181568
9084 -274702 -203725 -42266 88934 -215213 -84423 38110 130984 -32936 -213842 -134136 -76826
9073 -76826 33799 34291 -84023 -268769 -313458 -119914 -125996 -198179 366456 56238 179984 267540
9061 267540 69672 -140079 108790 -68967 -110190 -451117 -188072 -79256 74223 -265736 -166040
9050 -166040 -123083 90800 70344 424529 -321295 -296095 -102866 241179 -117351 -50689 -96090
9039 -96090 -268183 -213598 339411 43871 66867 -34949 -319738 -209676 58084 186975 -15432
9027 320649 -13858 -251692 198946 50410 -135843 444455 -160424 72557 165617 -222471
9016 -34170 -216327 73869 -434125 -102507 -177795 -206806 145431 -168536 -233879 -197504 -67055
9004 -86011 -172084 -46661 -246388 -180704 -55588 -380061 -177431 -108516 -168943 -94608 35725
8992 76516 -139041 13540 -301378 37616 -56075 -153595 112885 -121848 -26542 -252160 -132198
8981 -132198 -360213 -298235 -272874 -73281 -138786 62056 34934 -183220 -14658 61774 -31082
8969 -45196 118523 -271740 86450 43375 -95970 23361 -234317 209879 -154982 -200760 50448
8957 -173146 177528 -184226 239354 -59683 -217574 -160941 -210071 280606 52207 10860 126937
8946 126937 -114341 -24130 90773 -505099 252835 -37069 291649 -180708 42327 66278 -147142
8934 219702 36136 87446 -329825 -84747 -223827 -188680 -14934 245321 14575 375483 1260213
8923 1260213 4461593 10242402 10594266 2261437 690129 622359 651502 150014 91927 -86556
8912 1604 126722 170745 235893 310041 455452 158765 225027 70282 -91650 66366 -143486
8900 -55000 -102644 -117042 50499 -29753 -240771 1714 76300 -138918 86035 248661 71313
8888 27020 142824 -169528 -104533 295423 85680 -116547 150157 5601 -78862 14561 -385044
8876 -382148 83429 -359066 1297 114855 256377 118247 87310 -230532 -69057 -84638 -75139
8865 -75139 83827 96606 37437 -119403 -132523 -95842 -64475 -64794 -95808 -274388 -58457 -223969
8853 -223969 466819 -564233 -87176 98189 -225151 -127525 42954 211876 -65534 155602 -12660
8841 -212768 -132392 57556 53755 120158 -95959 101301 14483 -160737 233168 -507749 -208210
8829 119357 -358801 -331339 72649 -238026 -124532 -204249 28107 115110 117169 121024 78942
8818 78942 162318 31009 -166842 140315 -105515 -361619 -60075 22972 32199 -181606 -182306
8807 -182306 -7859 142228 -154664 -5018 -83574 -77080 -51258 235259 249333 -48900 -46001 93161
8794 185639 -135017 -124321 221838 -155919 12195 23198 -199088 271845 -467873 135497
8783 -247333 -31264 -350651 188462 -214039 -75772 9944 204318 -41424 -194936 190627 20384
8771 221014 155312 -200595 -335053 -156150 -380066 -172678 211419 -150785 -207451 137345
8760 -97705 -420309 16556 -7454 11097 129181 212948 -19874 -835 38186 -48488 -134681 138977
8747 -284039 -310838 -562357 -1328 -391923 38358 -78833 -38679 221715 -144638 -40342 -58721
8736 -58721 -74420 90598 40950 -153959 -171398 -67395 -125123 126716 -147712 -107351 21947
8724 -251934 81600 104801 -7479 -38243 13639 -173809 -176782 125643 330665 -416783 -121501
8712 -228396 -206449 -177911 -118532 136496 190873 -178000 -101248 -158310 15443 23514 -116095
8700 94476 -68966 217217 -81117 163934 444044 -56204 -77882 -259106 -183140 -188584 -103762
8689 -103762 -223598 -45302 -179866 -71415 158981 79410 104254 42080 76683 -60603 -100107
8678 -100107 71672 -29799 -36144 -239500 19629 -281256 50127 38699 59990 -207566 -218342
8667 -218342 -150919 -213540 -245725 -97883 19588 -115750 -183955 -244918 14109 -25899 196861
8655 49079 -373641 -90212 -243458 -86461 -317118 -153279 -315189 -167216 224522 -45 -84138
8644 -84138 -266855 149062 55320 196676 72597 -204170 -234875 -93152 -117498 211315 -84083
8632 -129280 -24891 -78891 -34889 66689 -265515 -24878 103269 91011 -118955 140049 -170434
8620 70005 -202400 -388080 -279509 -209549 66888 70938 -148276 259022 -2073 -379833 -318233
8609 -318233 -457246 -252789 -191565 168914 87595 4956 -34368 -306351 -423474 -92007 11534
8597 -231118 -47781 -185714 -44023 -145526 59166 -199638 12993 -24903 175649 68470 -228011
8585 -270702 -242359 355651 -31199 -66187 17766 -8927 -305617 -45647 60938 137909 -331851
8573 -158821 -36963 11734 143503 -122359 -57820 -132680 71680 -88601 -169967 -48890 96159
8561 73630 189242 330009 99285 -151229 45609 133012 -91882 -245838 -38022 48576 -51883
8549 -472258 63040 148244 158295 213793 35196 60767 95978 -383927 64523 30041 -157370
8537 89108 296084 -337451 -16063 -110451 14086 27340 89398 116993 -94854 -8329 -19870 30058
8524 122255 89123 -59011 12316 -134000 240993 -95170 218852 -160480 -44075 -36542 -121775
8513 -121775 24007 -248160 -72904 119966 -64410 -277641 130955 511639 -76295 -209157
8503 -209157 -269004 150586 -3099 61554 319503 -215065 30270 -28902 32549 51299 -77725
8491 -54775 -107463 -208597 -92509 -146886 138053 200759 17293 250361 -293727 -168477 -54850
8479 103658 -252988 147155 -136733 -222204 -38621 31568 -287781 74277 -485216 -79631 152166
8467 -108228 -218261 -261176 185105 -73549 -545010 81523 345216 -163417 222686 56218
8456 14041 108129 -17871 -331868 112426 -160392 40654 41553 135943 -220040 -363365 38226
8444 -20607 -135726 -107535 -157901 -15354 2149 -217316 -356498 -123107 29378 -22527 -40036
8433 -40036 -288636 -2797 -271060 -194814 -196357 -10582 -206478 -224273 -108566 -19220 43951
8421 -76139 331048 -89292 -90450 123376 446817 -231267 -322611 290696 279173 -4736 36335
8409 -298968 153589 156287 -167697 308885 200311 172963 36898 -341609 -342618 -209656 89353
8397 73907 16405 185654 -137496 -125970 -210989 -201320 134962 -49507 -430945 52117 -213140
8385 -185132 -219468 16433 150040 -156662 -142486 -175179 111095 -3801 -435031 -56927 89313
8373 5791 68750 -278444 -161954 -199364 194385 62406 53235 38442 250765 -374766 -159147
8361 -137781 -196935 -231411 174308 -40352 12923 124189 -318334 210650 104299 -344079
8350 -338388 78232 338672 -84357 -64837 196273 -124919 129028 -33115 185887 107010 63312
8339 63312 -107182 -327396 -238428 -62166 87040 -72245 31990 -187735 -118700 -186209 -167316
8328 -167316 -130730 -314515 68740 -463101 282497 -202395 162896 -40726 297000 272562
8318 272562 -31953 -106950 -135973 -222503 -153632 -63306 -172398 -24660 158376 -90672 221110
8306 53361 47021 -60955 -50409 -51703 138613 306632 44450 27923 -179463 -117767 228273
8294 84561 41084 -318856 -161777 113130 125599 -51936 -34893 52482 -191987 68441 -222440
8282 -109733 -592533 -411032 -257865 -12144 -101070 -259470 -6272 -111049 -118346 63143 -201446
8270 201093 -181608 -269075 -76909 -2566 103883 -205862 -36178 135432 -82986 -64800 -74813
8259 -74813 -171708 -286451 52585 186107 367731 -80266 -2059 -100771 175135 -22276 151715
8247 -8202 48821 413275 -10600 -141366 138030 -151717 -234800 -124821 172912 -209804 29136
8235 -277534 105531 211347 240242 -20689 -193061 -74196 91619 61344 -126125 20880 -28971
8223 -142554 35139 157456 -248682 201479 -69087 -92884 29 -267497 -150457 -201772 -208786
8212 -208786 37988 -15150 -118104 101523 -73371 -36736 357572 448881 -256463 -146587 -100107
8201 -100107 -25709 -167075 -15493 -710 224409 -407047 206403 221122 -39654 -188206 -155798
8190 -155798 249456 -208844 -183643 -38321 -187118 -189845 -282287 -275141 211775 6874 -31565
8178 95659 -346119 115340 -158470 -338203 -287954 -58160 -207877 -175174 52079 -283411 -82551
8166 89971 143734 -200503 75267 46253 -224267 -92131 -95730 127199 -149741 159049 -50822
8154 194406 -27354 88691 -89395 -136995 98621 27668 -151685 74826 238672 126651 75941
8143 75941 -138277 -288743 -211187 44212 -7676 81984 -239329 20473 173201 -233887 -239662
8132 -239662 -157604 92835 -181346 -142826 -105286 -74414 -360742 -164894 -194703 -220204 333611
8120 20714 -305361 -201007 -5457 88804 -144730 -208055 220400 -147062 36715 -79363 100444
8108 -145336 -260895 95919 72818 -47716 -5996 68946 -111922 242125 -162065 202040 105332
8097 105332 -21469 -121658 -86872 319893 -234946 -271357 -135306 -93800 -249773 -62794 132912
8085 -13762 -38259 -229928 -394214 -143330 -139702 242338 -96062 -269549 -321912 75758 -194201
8073 -308133 54409 72483 -248954 -136648 -111577 -211167 -141422 -81805 -144635 -105248 117616
8061 -70695 -428181 -327724 -40848 261241 -849 93641 -25450 226210 -116787 105925 3737
8049 -119325 -70351 -91501 114344 -65333 -175447 -58577 80672 -210477 -95560 -134052 -341820
8038 -341820 13424 64559 -198985 166905 -229335 -321325 -159109 -216219 -128945 10294 -313683
8026 42763 -144266 -34801 -52471 -154532 -96189 108839 168017 -48223 64305 -120374 -231018
8015 -231018 3379 -277314 -73775 291057 -92467 -22932 71076 18094 -162254 -219 19910 128115
8003 128115 -47545 -230104 22345 -9098 -78657 -133979 -304851 20754 50342 -179908 -127942
7992 -127942 -24953 -253825 193277 96872 -518318 -342715 -178047 -97853 -12560 110156
7981 -248984 -26853 -28 142373 265064 150915 227115 -82369 -206336 270445 176426 -82968
7969 -101682 127864 146520 -120561 -101019 -179715 6499 64724 -497561 -151034 -122835 -37181
7957 221616 -138572 -122128 15702 113090 57354 72034 31353 366061 -132417 132872 196095
7946 196095 328313 -47144 -43340 62006 -44035 350989 -148132 189312 -102866 -235459 31875
7934 266151 -151665 221453 -186299 -39716 183281 -278759 877 -46561 -4236 -17253 -173713
7923 -173713 166597 -242810 -103733 -102322 205827 -346592 104730 6144 4829 -157950 -109086
7912 -109086 43967 -33964 33528 -349981 -59815 107813 193262 -36830 79670 -39007 -320217
7901 -320217 -199228 -72413 -19810 243670 -170497 -231281 16439 -147374 -217444 -35365 -155169
7890 -155169 181832 -254974 -111684 -117845 231273 -249609 49576 -256269 -107286 -222890
7880 -222890 80668 -239519 -158869 280108 -109959 -129199 -21969 80387 -132090 57901 -273374
7868 390797 146491 206238 -1114 -304398 107856 98427 -18193 136016 63967 112790 -81796
7856 -16619 -145955 113534 49684 10644 -225636 -156784 -114791 10854 -144882 115091 222144
7845 222144 29538 -115511 -212160 -39554 156412 -164134 42678 -66356 218376 -133488 -107088
7834 -107088 -76970 28726 -291544 -399955 -98251 -50464 -124761 -336943 -148653 -151532 -65555
7822 -185035 389108 9525 -101780 99253 -51320 -148954 -25733 -109251 146687 21 -62304 257057
7809 256785 248513 -91111 -76016 24200 -145658 -272150 128522 -77994 90061 -332315 -87100
7797 -74544 82734 94498 -220692 168323 -130047 -68392 -61129 -70812 -52823 109554 31051
7785 -133249 -24173 -40497 258482 64790 13951 162264 -292940 -36412 92732 262649 -84817
7773 -314757 -104444 30831 19062 68416 -169177 -488393 71135 -185165 -105424 -249728 71526
7761 6630 -95157 -294605 -203491 261997 -63792 23462 -253634 -146415 255842 135097 -2369
7749 62022 37921 107904 -127057 131459 -222528 58975 100475 47160 -89681 229885 -127519
7737 65660 104760 -252805 319243 -106776 66035 122404 -343490 -88940 133839 -89853 113505
7725 -229209 -72308 -251343 -223047 -67522 -72383 -1539 -78081 -67014 233433 -166332 168257
7713 135031 148341 -154062 231974 241049 -450125 157011 -131808 225716 -302174 250311
7702 -97499 77476 -181924 78434 288316 -44420 -71828 -145684 -122752 -10921 -9962 48592 -396397
7689 -27422 -183539 -155867 334339 181162 79565 120971 -118980 437397 -208129 109700
7678 -85055 -111823 142018 15283 61593 214760 -108452 2286 -155456 158506 20281 -287034
7666 -96787 -2827 -36288 -97485 107611 332052 125434 -202073 154269 77121 -98456 75091
7654 -164047 -175333 1601 119473 164488 -274399 -334739 116499 -230687 -184959 -350185 199802
7642 -243671 -74645 368289 -39204 6756 -66963 -103752 -130884 -332011 -236304 107083 -173545
7630 186212 53900 -154920 -191923 -54375 214435 -106665 -43313 -316942 -21217 86060 8037
7618 -291925 -107209 -326372 -135455 131211 -95838 21911 -122738 241248 -253125 -82764
7607 -265753 -86027 -171851 -69685 -278692 -69890 -178685 5430 26987 -143220 104752 -75182
7595 58210 153636 -38942 -171068 189532 -58781 -112036 88842 -213382 350222 -237513 211067
7583 -182987 -244619 89170 -41154 42291 -10050 118706 -210871 -20270 -84586 -210411 -148346
7572 -148346 -41524 -80181 -203436 211437 -30313 77474 -125105 33657 204172 -136204 -108829
7561 -108829 -91103 -56498 220048 -90187 -94186 -122682 -172432 -11901 293111 3643 -360480
7549 -141351 -176977 78320 -9097 -119299 -304209 2241 230257 43219 328346 43788 -95160
7537 -221225 101354 131674 -294410 -258606 -199278 -353756 13724 -72165 -47248 -393235 -114476
7525 -291318 -100870 -176679 -151239 47294 114531 -59172 -283999 133604 292729 157942 28449
7513 64190 -147850 -52610 -191102 -57094 168599 -393981 64682 -202989 -226349 -333367 81681
7501 187222 -78281 127050 -78877 -167520 -185927 116477 -321285 -55820 -93709 -218005 31576
7489 -138920 119571 189804 -40018 228426 61667 -303706 -139637 -411510 -50826 -88552 36897
7477 189327 -168371 -83214 35314 -29166 -111349 -39089 -106494 -120987 -157020 123453 -355271
7465 -78492 -131849 24337 293859 -86785 45869 -68986 152663 -314090 -140325 -133508 -70294
7454 -70294 40747 59009 -198462 117432 -205402 -60194 -123358 -376303 210044 39952 -97290
7442 -236296 158448 121201 52647 8918 -265045 -160258 274080 -80240 100451 223 -45608
7430 -306776 -174729 329341 -99884 -200379 55893 111404 57479 -111412 -197159 743 92587
7419 92587 -375701 -209956 1731 -293924 187471 -119788 -37662 -184628 -242532 -143675 63141
7407 -32713 175858 99667 200654 90396 -368412 -117960 -118700 42847 -71664 34805 190408
7396 190408 195338 -143349 -82410 30559 120001 116860 125643 101310 147158 187573 -166865 -143450
7384 -143450 -223193 -135857 251462 -63343 -175669 46851 -16967 98775 154860 -138336 -183062
7373 -183062 62991 -291759 -119356 -312966 56950 21395 -202099 -7142 250196 1861 -50080
7361 -114784 37974 -2333 -536445 -59638 -35225 -28460 76127 -167109 99938 -180423 146941
7349 -110368 -28905 -40075 -39120 92989 -361103 385362 -256242 -44319 62452 -14108 62933
7337 198940 44113 -308693 -141349 -90452 -152824 28888 97855 -270984 76983 -88337 341904
7325 13003 17269 216125 200268 -255200 -89043 105629 -110244 -17425 -75705 -185707 -326476
7314 -326476 -151085 -46977 204138 95483 -49894 -125265 177998 -255475 -426913 164967
7303 -201764 -67631 -241294 -87810 -255409 -240523 -134885 -73398 68354 -25860 43783 86810
7292 86810 -223436 -380152 -95197 157913 69606 -57660 -25489 -206256 61715 -34851 -53207
7281 -53207 86990 -81869 -59627 -143724 -283728 -174157 138822 -255777 106986 -176947 70676
7269 3021 23992 -245656 -203117 -201065 -20727 135457 16328 14329 -21804 22718 -195981 91735
7256 -198356 5345 -96078 213709 -71883 156094 -106560 -118129 -146268 -126568 -132472 -15944
7244 -48944 -204521 193271 -59242 13402 -83194 15216 31144 259708 -376580 -272696 167348
7232 94750 -101243 48436 7453 -423289 -166462 -224387 145194 14478 118458 -14455 -182676
7221 -182676 113319 118250 -359874 28016 -14305 370702 92665 -27045 359370 272373 242619
7210 242619 179975 195037 -317342 100344 -33650 -52882 577132 -420959 -35907 72166 -226928
7198 99630 -178273 113668 127023 -111482 -261070 32695 -107290 -58832 -332785 82973 144465
7187 144465 46736 187209 237956 -166797 17944 -323174 308182 28673 4154 -119179 -268
7175 -289088 -137787 66126 -223049 269767 -97756 -61335 309104 -19849 50616 250299 182746
7164 182746 129309 73865 -133277 52685 12448 -120270 -546857 152407 -374573 256005
7153 -276240 7701 -7113 333402 -19069 -145823 329638 -151924 114287 -83760 142407 -94453
7141 -185952 -2292 -82563 326828 19651 114824 165602 -90818 315462 24775 -35304 -159625
7130 -159625 159054 46675 -330743 112852 59613 6116 -135992 29970 90608 29374 -6000
7118 -11290 -252026 -174087 148921 -69834 -16439 26674 -492204 38973 89948 284696 70058
7106 -3762 -73606 -231374 47564 89828 91104 -21743 -131184 228473 193119 7573 159847 -22191
7093 178621 -138011 -18426 -174018 -195669 -25856 -165571 -268830 -74291 -205817 -180968 23400
7081 217976 3957 -195460 -283707 -207057 178470 -36772 78702 -173169 307109 -179727 20750
7069 166166 106515 69437 20817 -66876 -60311 -359144 -134050 -198943 -105730 -162232 -452064
7058 -452064 -115638 -94916 188394 -294440 -284346 -80647 224973 300459 -218802 -16966 70101
7046 127879 38196 -108338 -183128 -74167 -140489 -57109 -23173 -164176 14658 148641 -83937
7034 -29741 -278536 146352 -161044 -148800 182837 5108 -24142 -594010 184606 132508 -123677
7022 -308711 153430 114631 249910 -191273 339896 -188112 -193287 -230986 -253070 -45911 81337
7010 -235109 106684 245041 -128200 -42296 -48487 11982 16331 437712 31115 132878 141035
6999 141035 74904 -161262 -163440 -39904 -404129 -3857 217055 100320 37232 -16100 -70306
6988 -70306 85350 141857 348509 12498 115040 -141791 7732 213565 -83918 -117216 -105661
6977 -105661 -69588 156345 -107320 -22721 -66377 -93344 -72451 191227 -325134 -87025 27988
6965 137344 53419 -17785 -281592 -37463 195598 123014 211545 -230310 -104959 102735 -63625
6953 -289032 -160334 72130 93584 -131331 31898 40335 244650 -27111 160890 -84392 -307059
6942 -307059 117709 -170805 -206517 313556 -114271 -67256 -43004 231038 56412 145530 -62891
6930 -201583 -4440 -14885 75453 51380 -72208 -310272 126657 -144331 -258494 -300467 -71582
6918 138398 -272878 522551 -139022 -106886 -278774 -155376 -58835 22140 -106703 197001
6907 50056 -86342 -66206 -291837 -127204 116327 228225 101609 -66744 88645 -18161 -198831
6896 -198831 -133846 -78800 -14528 -24475 377184 170177 113400 -207735 -72143 -71394 -160507 -428909
6884 -428909 220964 -390498 212226 135558 207957 -43231 87396 -9668 -20771 -161415 -265380
6873 -265380 -58766 -142074 -235439 -10471 -156885 -5683 38820 -48931 -140806 -135598 -62961 -173260
6861 -173260 -237438 -201850 -57514 -94373 -51422 -201342 101750 -93620 42830 8653 55945
6850 55945 -99070 188702 51847 78589 4332 57513 -299609 64947 -3197 -292142 63068 -307302
6837 161754 -126701 135759 11240 27002 -67312 159458 -46702 -256404 -37796 386546 178438
6825 62517 -330739 -6877 248427 198803 -110157 -20460 -217981 168795 77737 70672 -377240
6813 17159 82719 284252 238534 142250 244708 11413 -6603 81120 -21873 2251 -37044 170065
6800 -331615 -106646 -44695 419170 272938 179371 -323432 -153308 -23041 -229551 249252
6789 -24398 104331 13038 73029 53603 -88742 -166446 411889 -106323 130262 106456 -99078
6777 60116 7657 142790 88594 -2871 -221340 -19958 -70073 434551 33843 325479 187386
6766 187386 -127628 -64771 88804 -207256 -36377 -174930 -124529 269703 278872 -70425 89662
6754 266040 47076 5964 -155694 34467 -176067 -75535 75679 153722 -154523 75037 -336588
6742 29312 30405 275704 -24170 101543 -157798 -468187 -71765 222647 102024 167525 -30770
6730 -60388 82422 -56752 62738 265637 -534571 -105849 30140 -159177 -176128 90872 -53383
6718 129515 -116828 -290086 76732 -214540 55492 -503475 50288 -19859 -226109 442934
6707 138774 -47775 -178649 -255042 37070 -182245 179701 -119574 82148 -163739 -9062 -235240
6696 -235240 92251 19045 -141752 -11533 -200367 -91108 -237729 317866 -110691 -38946 165737
6684 -41723 100652 184471 -348979 -3163 -143880 -5063 195323 -6062 -191861 49515 -292958
6672 -35486 347148 15696 -150576 -192178 -70476 249999 174872 95588 102618 204899 -136799
6660 -50535 69217 -224303 -27880 -148293 132968 137809 -82772 193124 -97006 -126069 -37558
6648 232134 210717 -33112 54474 -147382 42775 -194481 -286403 -118109 -257831 232930 126020
6637 126020 -85720 70030 -122540 -216471 26870 222813 135347 81082 97769 -132723 -114304
6626 -114304 -383831 -202601 -186973 28105 4860 187414 -180654 -45758 -225568 452827 35887
6614 -67268 -151017 -64172 22969 21782 201367 4202 -104417 -236463 -140335 -106954 -281073
6603 -281073 11725 -201761 -75008 39188 -203846 93887 -141961 -5863 -143918 -43861 -16899
6591 91513 46849 -112951 172896 87252 9877 51437 -317949 81987 -55389 166222 -71429
6579 -442552 -23629 -45539 -202719 -109084 -224794 88588 224439 -4581 65997 -22983 -28423
6568 -28423 -291241 142116 -13308 82847 -124984 -126315 19738 -376852 187073 -72618 -24763
6556 -73360 -56708 -187746 140039 -361991 105114 -167157 -343257 -32405 229096 229564 54297
6544 317107 109065 -291482 -115500 221994 124304 -216315 20297 -149744 61508 101171
6534 101171 -87253 145409 302416 91697 238091 -246566 162663 29402 28032 315666 -78334
6522 94074 -100628 -238990 -129845 -50558 -84157 -143962 131864 102097 239728 -158172 472535
6510 -95767 89167 -72814 44553 -140594 -320634 -66980 111151 47726 82399 -50611 -25440
6499 -25440 -111395 -234886 -195604 124411 -111902 371049 -129827 306860 -137163 46338
6488 -99528 316788 124296 213189 -174984 -39905 138357 -102629 -148830 -78524 151769 251670
6477 251670 130169 -244114 -117684 -143697 -62711 -266627 -26023 68967 -13941 103019 -222051
6465 -124649 -22982 112935 3340 -142985 -183446 -99856 -99457 80973 9791 17387 44781 365387
6453 365387 -36223 -86772 -33041 161833 125967 212475 32513 -39977 41190 84114 105826
6442 105826 -220574 -218086 147157 -121044 -41142 20222 -191185 259378 430546 163967
6431 -148821 330471 -96531 148917 174953 -28993 193106 91181 58861 -8500 2295 -297153
6419 -74903 -159940 -77374 304914 224219 -283733 -178856 82061 -50544 -38773 -236929 233235
6407 -281618 124289 -149231 -99821 -57969 262375 -415553 -164216 -76144 -79507 24796 -440838
6395 -218768 240240 96802 50229 10407 27916 -223311 33614 -250101 168291 -26976 241030
6383 89125 -38970 -327959 -79367 -239916 365676 140347 -114682 -159841 85405 -115885 -92331
6372 -92331 39948 83410 -10066 253511 120706 -16871 -75274 267933 -121724 155466 -15736
6360 265607 40363 -137935 96891 -93160 -53699 -203620 28691 83836 348636 15499 372644
6349 372644 -127468 -289694 6036 -111961 -196987 -90487 240122 -21698 -141945 4787 -45135
6337 -43536 232405 -127195 -184385 26256 -317976 37857 132301 312674 -9928 83489 -170931
6325 -171948 -42407 82932 250113 -76385 -47942 123804 -207470 -92727 -94667 -156423 -83662
6314 -83662 -234068 -297598 145370 -66079 -209634 -420436 17912 343816 -338707 -396510 -84759
6302 26470 -1114 -36168 93062 -21363 -77706 -328399 350004 90134 132989 -22142 -220110
6291 -220110 -77165 12467 222448 -151065 212048 33049 168129 149446 170904 143666 -239905
6279 -343475 166578 -2057 14958 107481 -141097 -10788 109823 -32486 47034 309411 -24586
6267 -65970 -250761 111539 352313 -95567 84420 -47621 -170897 -160389 27533 -79251 -50720
6256 -50720 16328 205175 -59047 -16103 150875 -332145 -25574 61642 127081 -213955 2256
6244 259053 -336001 -459895 404673 -198780 -632 -254999 14918 -118918 76341 171633 150652
6233 150652 7362 22074 -121985 -101742 -106865 86054 66962 -147759 -229661 34868 1071 -285551
6220 352892 64114 163397 138673 -196172 -168221 33987 15931 -52967 -126106 -174035 128848
6208 -298334 -219371 351294 36205 141109 31283 93195 232329 -161696 -1227 -193670 -161003
6197 -161003 101452 368424 114959 -65160 380688 -79996 -64066 -317942 -174312 23640
6186 -3491 -19099 16112 229924 116980 -199761 43701 -103918 261999 -289548 35005 -468546
6174 88531 280797 164211 -362 196800 -202689 146167 11951 -209638 176705 -28538 -106446
6163 -106446 -166412 -126916 64064 -66150 -74578 90727 -130725 -35590 -216526 -373208 -34120
6151 -330635 -132481 -73098 383537 -204310 -201351 -89350 -176520 142237 -368100 -6402 174043
6139 -274575 -328495 328934 -7947 -99011 14797 -166631 -46718 -53574 -75015 -155028 166397
6127 -116858 164518 -127685 6450 72936 36677 -36152 -303306 -110511 154393 -71501 176368
6115 -90563 98611 -148906 -27680 151346 -90891 190874 52846 246950 29207 19060 -108131
6103 126704 53304 86557 169221 -201696 204097 -74220 -44697 10096 -196009 120507 109736
6092 109736 -160627 -27139 -156670 129796 215961 -32647 -223308 67691 -176359 285435
6081 68190 -52573 66542 -230729 -103389 81811 48240 86135 65048 -158664 -200226 -198888
6070 -198888 -174790 -183055 74636 118385 -161531 108485 195738 -143848 -269001 47097 64991
6059 64991 305946 98490 -158286 160480 111272 68066 393155 25070 63311 -70481 -66165
6048 -66165 -212009 -20660 19886 -182149 -120342 38857 100615 131483 68711 -298616 51502
6036 -295243 -71075 228363 74396 27830 -35913 -14558 -126372 -3860 -110343 78716 229366
6025 229366 -100331 -47121 138513 -154571 -57813 -69961 194401 -59471 -495775 -248081
6015 -248081 204088 390315 233410 -9725 -113875 120182 -25758 247573 39422 -68797 -104969
6004 -104969 -159848 -140402 -114267 -6450 45572 -20578 -189376 175734 280887 108302 54213
5993 54213 151202 185885 20899 -57728 220185 -354175 -32800 14810 -13724 -324515 -125869
5981 145114 -10689 75506 -413259 -78843 181878 186082 -181915 40441 115925 -79909 -214207
5970 -214207 142049 192041 299536 -56804 144222 -160667 7001 171415 133380 -66995 157675
5958 -116755 -179179 -344729 -98311 108221 49967 -29201 361318 -173160 -214065 160310 -272530
5946 93881 -100684 -166588 138943 -205166 67634 -125698 -399705 226367 -109634 -7992 98059
5934 192959 1575 89889 39238 19918 -267986 87053 170751 -232783 -132588 -74708 126824
5922 -43106 150499 200570 -196612 23005 -163346 -38080 115764 -105947 20851 66023 156250
5911 156250 -94992 17055 141671 111123 79700 -72521 -118517 -181603 -248630 -184031 111278
5899 -399988 -166784 -208373 116556 -107477 -18206 74816 -411570 89034 92441 -8720 168405
5887 -138905 159446 92541 -206062 119361 101413 -232477 -227922 7061 176421 106774 11275
5875 50059 28893 172347 -206543 156317 -63018 115404 131006 -38811 375648 -226702 -293453
5864 -293453 -349873 99535 150015 -47521 67308 76710 -87766 178883 -168708 84452 -290279
5852 -146094 264900 261906 190196 43382 -223889 421159 -359547 -343169 179745 40016 -217581
5840 68878 82082 -46726 122198 195591 -116640 -19 -153003 -39475 168358 -98519 30914 -11316
5827 102232 30764 115790 -115187 -158140 93328 117274 63981 -2440 -55238 -131862 6007 50816
5815 50816 346699 239053 180232 40711 -116951 21500 33235 95887 221267 288935 370019
5804 370019 159042 -35705 77373 474306 97675 -235770 47657 -264177 -58008 -12550 -342540
5793 -342540 317099 223037 -290715 -256936 -216931 126841 -167630 -145828 303348 116769
5782 83614 -167068 128492 -288876 143227 -443780 -38556 -308203 -372089 365737 -88699
5771 31367 184622 -116056 -13129 42829 -178035 289283 -366769 -12478 -194749 -184626 45673
5759 142745 122355 -264205 -33093 11522 16036 214615 -387060 -28852 -80507 -245775 -76342
5747 264644 -35806 249744 -188137 -84552 153225 195004 -155017 -167201 -69579 63488 -78140
5735 190758 32308 -6095 -180836 -110977 -20932 139472 -72920 93945 222616 128445 32906
5723 253501 -194687 40331 -53106 31795 -191987 -12759 219016 268379 244977 -162986 -245889
5712 -245889 -129787 184426 272852 145878 -5507 -47239 -96856 322721 -224560 189000 262388
5701 262388 109181 -120776 -100162 -31968 -146904 -60662 -140213 -214726 -23567 7727 62093
5690 62093 -59472 1775 26298 -149719 -131724 -215280 37517 92756 35145 4258 136183 -47456
5677 -4412 -100726 123783 -80016 -3483 -35807 127994 100786 13114 -27670 88721 -167295 17946
5664 -262237 -87057 -198357 -133224 -242499 -109534 106865 -37328 -32974 178570 -154897 20809
5652 -122961 41775 264410 -29047 139850 186724 192183 -188485 -46250 -201888 90086 -71677
5640 62860 -105801 -229909 -6788 96894 274911 104170 84949 238226 -124168 -197818 29097
5628 126580 -13523 -199639 -57058 -48644 228610 -391748 -123575 -82348 111738 31482 -164020
5616 303622 -182834 62337 57541 105619 174982 15903 -92192 149569 74641 77219 -144868
5604 39775 149382 154155 51632 -11471 -397428 263810 195772 -157006 135721 -19358 116735
5592 27128 -306679 84080 801 -87279 10661 93876 117067 -412287 -27937 -75978 171152 -138452
5579 57633 28003 -280415 313457 -128137 -145272 87956 -219868 282535 88343 -54639 -104503
5568 -104503 58388 -212930 190331 -102402 -12744 -163118 70637 16567 -81705 21893 269318
5557 269318 -42075 23688 161662 115150 -16115 5759 -49039 -120654 130080 111847 -15729
5545 182324 28619 -130980 -431585 155686 67447 -97094 -271014 -127111 52865 -273904
5534 79022 -52401 158962 122467 66399 -315475 194850 -99528 -39637 -100699 105436 -197560
5522 218260 -22175 -203940 -213969 20902 -82082 48184 -178613 134062 -210882 -149855 -88065
5511 -88065 307439 305394 -21681 13738 72949 94653 -40099 -10890 44542 40038 -152314 -89047
5499 -89047 -73503 222160 325824 124944 -209042 -110829 268384 -317864 -14774 -17086 -206395
5488 -206395 76700 103210 1145 117177 -10625 -10382 4695 121646 -317089 -6680 -84621 165575
5475 -83437 -22800 40569 68080 -313305 -41268 264368 168158 170186 219631 -110972 -168736
5464 -168736 214771 166983 48146 115529 15665 -203207 7249 123021 -437451 -98665 147944
5452 278925 130980 -10825 -221746 -157666 -35085 -87084 -60794 111868 82726 218127 -286019
5440 -47956 -57159 -66614 -15835 129529 -176217 33228 -247432 183367 -123852 -19091 -153701
5429 -153701 114512 48476 176348 -67311 49639 -272663 233667 -161330 60473 -119628
5418 159305 357055 -22910 -49861 -246098 -225031 185679 -50328 -319209 -231084 -78606 -193835
5407 -193835 -65671 -46829 -110320 131998 -6320 -128940 47079 -92147 -34502 90371 14195
5395 -165389 20964 -156702 -36362 221814 2476 121698 200266 114712 -18522 28454 -82011
5383 79535 181148 82371 -120740 -67508 271320 6926 -68178 -14344 -117044 150942 -161277
5371 91709 -2920 -204915 -67285 -257925 25038 169349 -247871 -327148 359638 -151657 -169917
5360 -169917 13790 166788 82579 324470 83839 -10684 -114507 -45861 -110453 -157204 -58131
5348 -123301 439701 -164636 -201893 419314 295049 -380803 -90342 -139834 -145696 -191605 -3549
5336 -99771 -521168 -175994 340130 169323 -169999 -103335 113982 330125 377444 328728
5326 328728 147130 -72982 49336 -93784 99163 -219111 -109632 59993 -382542 -300237 -124511
5314 77914 -38295 165558 -99694 266607 -151328 -204549 -47370 -67164 151539 -303386 1820
5302 -123026 269384 30212 -269512 148025 129437 36278 -310031 -1061 -89498 -69057 -25497
5290 -132154 -62140 7503 701 16913 79576 164849 116536 141105 -6399 -221760 -271009 -51864
5277 40296 63883 -230296 61846 262552 132946 106684 -238561 1317 -13536 166556 148786
5266 148786 230576 -78876 241302 185554 -93618 237396 -85107 -17976 -12717 278877 38700
5254 120288 -102013 61700 -152013 -121635 -52263 -36846 -317625 140138 213527 171379 124421
5243 124421 153081 34257 309800 -119722 239527 122996 -95387 112919 -377233 66787
5232 72036 336558 -22612 -107971 -54171 169092 369669 -123968 -105721 -100589 69057 -173802
5220 -128135 -61813 -27126 -28589 -99536 296210 30754 84927 -192084 48361 -221048 57765
5208 -392630 167664 38891 16974 176383 -111692 -171925 74685 -14373 -108665 220535 123628
5197 123628 -392256 -10977 183265 -73625 53959 188866 155893 400042 25008 304051 -92701
5185 115538 -250495 -286558 -77050 244312 6901 -202438 65820 195311 187335 259927 -92068
5173 33691 -272125 33436 29595 -47018 -1261 -137648 320462 -57947 -16908 309227 173638
5162 173638 -73694 39115 -101965 -13296 -114050 -60003 117819 18380 19697 29275 -280661
5150 311582 -70570 -278863 -1683 64545 -233326 134563 162948 125971 30909 61996 28300
5138 98633 11060 -111049 118462 -132987 -231187 50229 98314 46162 53041 85122 395678
5127 395678 153070 37960 -70581 -121443 80601 29623 82802 249573 -53210 -61504 27190
5115 119001 -114091 131971 -245110 -60863 114879 -238122 -214866 214960 -302186 256830
5104 -37253 103053 70700 -8227 115125 -151581 61629 -13686 44883 250407 -85535 -16713
5092 44270 38138 24667 -142416 -72521 -73431 146325 -73119 202370 -87258 -22825 188159 122134
5080 122134 167701 21229 235234 35756 -101778 365663 227046 -138649 -169 -274335 -122065
5068 74253 -206258 -19131 151291 -85238 125795 209601 19697 -238901 82236 130628 26281
5056 13667 36609 -99505 5570 62021 63123 69250 -44572 -292558 122040 187922 284308 -292752
5043 -101089 162136 -225494 130698 -158631 -106722 47310 -152766 -197109 104284 -117242
5032 70066 80063 212638 207905 -123471 365361 165132 495315 -79311 -225532 432286 -16430
5020 -300275 -52614 -30446 -661259 -199194 -60987 232455 -165302 48526 393 220942 97846
5008 160321 -332780 67944 171583 -104317 44507 86558 -108118 -81995 204749 -31490 -115949
4997 -115949 -50873 -46027 -42167 185317 -226490 38442 92974 -145011 310473 -302788 -149810
4985 74915 -97131 196715 -239850 -19646 -8561 14823 -247155 282863 56530 34187 -91392
4973 53543 -81018 18048 -207289 -75154 -101418 -32953 233638 20375 43998 -143720 -112791
4962 -112791 70261 76914 -164136 4387 198973 303790 -84442 443132 -148280 282959 140286
4950 -186305 -247827 -123439 -243337 173743 184470 -260657 93305 -159053 -215182 -222026 15381
4938 111268 -65051 137749 58702 104504 231835 -5761 -42636 -73530 160349 72541 -137301
4926 -3938 20267 232191 37314 -246342 83213 350796 361146 -395133 455801 387109 -196022
4914 130693 35896 -111105 -60988 -291091 39721 64516 161758 -255600 -229006 66315 -146626
4902 326173 226409 -175288 257121 427392 85052 -132843 -190324 227249 -87954 17187 45166
4891 45166 -110627 -78664 112232 80693 188605 -243872 144982 -147602 71079 -325368
4880 3335 27039 100020 -99416 -182350 -121162 326906 60114 243486 117639 -127535 -31611
4868 24618 -89226 -112905 -354942 8214 10082 -189774 -54228 -13959 -134391 258894 140483
4857 140483 50602 178558 38296 -31638 386634 -240503 -76583 -62200 76320 94105 247934
4846 247934 107252 200014 133084 78418 13021 24359 -36002 -359169 122059 -203625 -127191
4835 -127191 17791 -222017 -122699 -348194 72172 333313 -296847 196878 84677 283267
4825 283267 109546 202886 -239106 -171971 94316 406864 -187592 -26868 -36963 2725 146913
4814 146913 -298817 227155 -86793 62149 -127891 269961 -118880 163960 308008 -509496
4803 135759 46668 81623 11266 238739 200955 -47220 148675 304401 59351 -419 58218
4791 -149740 -367327 -66786 -150461 122677 102066 82606 -64402 -280364 5877 -221314 -2558
4779 -147241 329278 -169445 -132513 18630 34873 130602 -283883 90086 73886 290176 -292205
4767 -353670 -1934 -118858 21726 146776 42637 96912 -260661 -207038 79355 301480 277239
4756 277239 211547 111869 223105 99850 -428410 -12869 67115 11750 158596 264080 112594
4744 89826 -207073 47398 -42652 -73896 10441 198063 -116803 -11339 313938 -210730 -257909
4733 -257909 166701 251556 315675 138355 179228 113581 141277 -157596 -118610 -139226 32985
4721 204391 74932 38636 -17944 63134 -133364 209555 -197130 157338 78399 -24730 78462
4709 -140412 -263964 31449 202332 -277916 -56435 168077 43602 100373 80629 137802 182098
4698 182098 -116182 125138 127078 242445 72871 -149420 -65133 231688 289773 -95167 -431250
4687 -431250 -47579 -300775 -23288 -195283 6140 -222394 351704 142400 -30997 -19806 -142098
4676 -142098 79637 -78086 86607 -72696 -111061 117333 91520 -176307 137188 -193547 108791
4664 -182135 -128175 184618 45503 -197127 -29293 374371 81776 56191 137960 -32484 217102
4652 56207 -131760 -81811 221202 57908 406491 5300 -132941 6731 410024 -170978 -199927
4641 -199927 -106859 302590 280496 -144274 -3824 68928 -76197 -97514 -17064 -47472 197022
4629 -130071 166204 -268610 -10443 6353 176980 85731 -332017 27834 77387 -441235 -147203
4617 -138513 200639 -160221 112383 218916 237526 -221548 39033 31722 134454 138635 314522
4606 314522 -54054 60376 -247158 68171 180602 20027 254523 -247226 349952 78809 203031
4595 203031 37012 81258 -74985 95941 -359228 -58870 -8547 -140277 -41141 17367 -190238
4583 134216 -204820 173335 -15301 242205 64988 -182129 48476 -36574 50833 2741 180377
4572 180377 96505 -49003 104891 174106 -71156 57772 -40068 -178382 -204129 -294038 -15172
4560 45268 82570 123400 166115 7262 -89612 -130552 -48768 -29011 271626 -94779 -311737 104350
4547 -187426 -20750 111136 -141898 -56985 31891 -92590 21209 -328115 281169 103156 -36463
4535 -151650 -80757 -71317 -211756 -275235 -200275 -387431 347375 117739 34991 -30815 -95512
4524 -95512 111979 331087 -183828 -193278 -252078 160449 -70811 133661 -27059 -263135 -195714
4513 -195714 -270482 -53427 -128894 -85144 65068 -156532 243306 -200227 -153025 180516 489494
4502 489494 -323583 87791 -53388 -198957 64508 18204 60464 178255 359926 -54735 -35741
$$ [...]
##END NTUPLES=NMR SPECTRUM
##END=
