##TITLE=AC1570_ROEFFECT0021_8271160_rmaLZ5i7eE
##JCAMPDX= 6.0         $$ Bruker NMR JCAMP-DX V2.0
##DATA TYPE= NMR SPECTRUM
##DATA CLASS= NTUPLES
##ORIGIN= BRUKER
##OWNER= Administrator
$$ 1.72 TOPSPIN		Version 2.1
$$ 2013-10-18 18:24:54.418 -0700  Administrator@X
$$ Compression mode = diff/dup
##.OBSERVE FREQUENCY= 400.02188249412
##.OBSERVE NUCLEUS= ^1H
##.ACQUISITION MODE= SIMULTANEOUS (DQD)
##.ACQUISITION SCHEME= undefined
##.AVERAGES= 64
##.DIGITISER RES= 22
##SPECTROMETER/DATA SYSTEM= spect
##.PULSE SEQUENCE= noesygpps1d.comp
##.SOLVENT NAME= COFFEE_meoh
##.SHIFT REFERENCE= INTERNAL, COFFEE_meoh, 1, 14.96091
##AUDIT TRAIL= $$ (NUMBER, WHEN, WHO, WHERE, PROCESS, VERSION, WHAT)
$$ ##TITLE= Audit trail, TOPSPIN		Version 2.1
$$ ##JCAMPDX= 5.01
$$ ##ORIGIN= Bruker BioSpin GmbH
$$ ##OWNER= Administrator
$$ $$ E:\/data/COFFEE/nmr/AC1570_ROEFFECT0021_8271160_rmaLZ5i7eE/12/pdata/1/auditp.txt
$$ ##AUDIT TRAIL=  $$ (NUMBER, WHEN, WHO, WHERE, PROCESS, VERSION, WHAT)
(   1,<2013-10-18 18:24:49.339 -0700>,<Administrator>,<X>,<go>,<TOPSPIN 2.1>,
      <created by zg
	started at 2013-10-18 18:13:19.230 -0700,
	POWCHK enabled, PULCHK disabled,
       configuration hash MD5:
       C8 4E 4E 5D D3 5C D8 9E 9F 52 82 E0 59 8A DE 15
       data hash MD5: 64K
       1D 44 73 C4 22 62 8B 0B E4 69 BA A2 8E 93 36 31>)
(   2,<2013-10-18 18:24:52.355 -0700>,<Administrator>,<X>,<proc1d>,<TOPSPIN 2.1>,
      <Start of raw data processing
       efp LB = 0.3 FT_mod = 6 PKNL = 1 PHC0 = 0 PHC1 = 0 SI = 128K 
       data hash MD5: 128K
       D5 F7 1D C3 25 EC 71 FC 44 A3 F9 68 13 62 AC 20>)
(   3,<2013-10-18 18:24:53.355 -0700>,<Administrator>,<X>,<proc1d>,<TOPSPIN 2.1>,
      <pk PHC0 = -82.70508 PHC1 = 0 
       data hash MD5: 128K
       DF E0 D6 B9 BF AA 98 69 3B 04 03 6E B7 88 2E CF>)
(   4,<2013-10-18 18:24:53.839 -0700>,<Administrator>,<X>,<proc1d>,<TOPSPIN 2.1>,
      <abs ABSG = 1 
       data hash MD5: 128K
       1D 24 ED CA 96 18 FE 4F 18 16 E1 6D 80 A2 25 E6>)
(   5,<2013-10-18 18:24:53.964 -0700>,<Administrator>,<X>,<proc1d>,<TOPSPIN 2.1>,
      <abs ABSG = 2 
       data hash MD5: 128K
       DC C6 44 4F 30 6C C4 33 8B 02 2C E9 54 65 F7 12>)
(   6,<2013-10-18 18:24:54.074 -0700>,<Administrator>,<X>,<proc1d>,<TOPSPIN 2.1>,
      <abs ABSG = 3 
       data hash MD5: 128K
       0A 6C 07 09 B8 B0 7A 0A FB 9B 0C F0 F1 6B D3 B7>)
(   7,<2013-10-18 18:24:54.152 -0700>,<Administrator>,<X>,<proc1d>,<TOPSPIN 2.1>,
      <abs ABSG = 4 
       data hash MD5: 128K
       53 F4 C7 09 06 45 68 6D CF 4F 8B E5 88 56 B2 FC>)
(   8,<2013-10-18 18:24:54.230 -0700>,<Administrator>,<X>,<proc1d>,<TOPSPIN 2.1>,
      <abs ABSG = 5 
       data hash MD5: 128K
       A4 C0 93 E9 0D CB 9A 6E A2 E4 1D 76 9A A6 30 2D>)
$$ ##END=
$$ 
$$ $$ hash MD5
$$ $$ 2A F2 A2 C1 B0 14 E6 A5 7D 6A 1D F6 0F A9 E8 3F
##$RELAX= 
##$RELAX= 
##$RELAX= 
##$RELAX= 
##$RELAX= 
##$RELAX= 
##$RELAX= 
##$RELAX= 
$$ Bruker specific parameters
$$ --------------------------
##$DU= <E:\>
##$EXPNO= 12
$$ [...]
##$TP07= 0
##$TPNAME0= <>
##$TPNAME1= <>
##$TPNAME2= <>
##$TPNAME3= <>
##$TPNAME4= <>
##$TPNAME5= <>
##$TPNAME6= <>
##$TPNAME7= <>
##$TPOAL= (0..7)
0.5 0.5 0.5 0.5 0.5 0.5 0.5 0.5
##$TPOFFS= (0..7)
0 0 0 0 0 0 0 0
##$TUNHIN= 0
##$TUNHOUT= 0
##$TUNXOUT= 0
##$USERA1= <user>
##$USERA2= <user>
##$USERA3= <user>
##$USERA4= <user>
##$USERA5= <user>
##$V9= 5
##$VALIST= <valist>
##$VCLIST= <CCCCCCCCCCCCCCC>
##$VD= 0
##$VDLIST= <DDDDDDDDDDDDDDD>
##$VPLIST= <PPPPPPPPPPPPPPP>
##$VTLIST= <TTTTTTTTTTTTTTT>
##$WBST= 1024
##$WBSW= 4
##$XGAIN= (0..3)
0 0 0 0
##$XL= 0
##$YL= 0
##$YMAX_a= 6189039
##$YMIN_a= -13753809
##$ZGOPTNS= <>
##$ZL1= 120
##$ZL2= 120
##$ZL3= 120
##$ZL4= 120
##$ABSF1= 14.96091
##$ABSF2= -5.597272
##$ABSG= 5
##$ABSL= 3
##$ALPHA= 0
##$AQORDER= 0
##$ASSFAC= 0
##$ASSFACI= 0
##$ASSFACX= 0
##$ASSWID= 0
##$AUNMP= <proc_prof1d_extract.lims>
##$AXLEFT= 0
##$AXNAME= <>
##$AXNUC= <1H>
##$AXRIGHT= 0
##$AXTYPE= 0
##$AXUNIT= <>
##$AZFE= 0.1
##$AZFW= 0.1
##$BCFW= 0
##$BC_mod= 0
##$BYTORDP= 0
##$COROFFS= 0
##$CY= 15
##$DATMOD= 1
##$DC= 0
##$DFILT= <>
##$DTYPP= 0
##$F1P= 0
##$F2P= 0
##$FCOR= 0.5
##$FTSIZE= 131072
##$FT_mod= 6
##$GAMMA= 0
##$GB= 0
##$INTBC= 1
##$INTSCL= 1
##$ISEN= 128
##$LB= 0.3
##$LEV0= 0
##$LPBIN= 0
##$MAXI= 10000
##$MC2= 0
##$MEAN= 0
##$ME_mod= 0
##$MI= 0
##$NCOEF= 0
##$NC_proc= -2
##$NLEV= 6
##$NOISF1= 0
##$NOISF2= 0
##$NSP= 0
##$NTH_PI= 0
##$NZP= 0
##$OFFSET= 14.96091
##$PC= 1
##$PHC0= -82.70508
##$PHC1= 0
##$PH_mod= 1
##$PKNL= yes
##$PPARMOD= 0
##$PPDIAG= 0
##$PPIPTYP= 0
##$PPMPNUM= 2147483647
##$PPRESOL= 1
##$PSCAL= 4
##$PSIGN= 0
##$PYNMP= <proc.py>
##$REVERSE= no
##$SF= 400.020009674477
##$SI= 131072
##$SIGF1= 0
##$SIGF2= 0
##$SINO= 400
##$SIOLD= 131072
##$SPECTYP= <>
##$SREGLST= <1H.CDCl3>
##$SSB= 0
##$STSI= 131072
##$STSR= 0
##$SW_p= 8223.68421052631
##$SYMM= 0
##$S_DEV= 0
##$TDeff= 65536
##$TDoff= 0
##$TI= <>
##$TILT= no
##$TM1= 0
##$TM2= 0
##$TOPLEV= 0
##$USERP1= <user>
##$USERP2= <user>
##$USERP3= <user>
##$USERP4= <user>
##$USERP5= <user>
##$WDW= 1
##$XDIM= 131072
##$YMAX_p= 408818373
##$YMIN_p= -11112
##$CURPLOT= <Network HP LaserJet P1505>
##$CURPRIN= <$Network HP LaserJet P1505>
##$DFORMAT= <normdp>
##$LAYOUT= <+/1D_H.xwp>
##$LFORMAT= <normlp>
##$PFORMAT= <normpl>
##$SURQMSG= 1
$$ End of Bruker specific parameters
$$ ---------------------------------
##NTUPLES= NMR SPECTRUM
##VAR_NAME=  FREQUENCY,     SPECTRUM/REAL,   SPECTRUM/IMAG
##SYMBOL=    X,             R,               I
##VAR_TYPE=  INDEPENDENT,   DEPENDENT,       DEPENDENT
##VAR_FORM=  AFFN,          ASDF,            ASDF
##VAR_DIM=   131072,        131072,          131072
##UNITS=     HZ,            ARBITRARY UNITS, ARBITRARY UNITS
##FACTOR=    0.0627417313425164, 1,          1
##FIRST=     8223.62146879497, -940,         -68559
##LAST=      0,             1103,            -69172
##MIN=       0,             -11112,          0
##MAX=       8223.62146879497, 408818373,    0
$$ Real data points
##PAGE= N=1
##DATA TABLE= (X++(R..R)), XYDATA
$$ [...]
63798C56421n154m598m308m383m904n643o001n623m830m119l557l045k789k932
63784B94535l012k475j618j313j806k395k481k197j861j475j069r47j162j199
63770B69525o60J4K7p27j526j673j153m49m0r0m30p08o82m36l00m63o70m53K49
63751B59355Q01N28l69r99r68q07r82j057m65L75N65J64J91J147K370L073L288
63734B66210L419L479L252K852K623K750L146L569L670L293K866L072L974M864
63720C13039N178N081M943M781M549M479M570M179K737O26j157k068k282k129
63706C46526j819j667j956k489k681k325j858j734j784j473o44K29N41K77J37
63691C27280Q60K362L717M081L525K778K363K251K244K273K212J719O53m87q45
$$ y = [356421, 351267, 346669, 342361, 337978, 333074, 327431, 321430, 315807, 310977, 306858, 303301, 300256, 297467, 294535, 291523, 289048, 287430, 286117, 284311, 281916, 279435, 277238, 275377, 273902, 272833, 271886, 270724, 269525, 268865, 268879, 268906, 268179, 266653, 264980, 263827, 263378, 263338, 263248, 262818, 262110, 261428, 260992, 260692, 260229, 259559, 259106, 259355, 260156, 260684, 260315, 259316, 258348, 257541, 256559, 255502, 255037, 255412, 255977, 256141, 256332, 257479, 259849, 262922, 266210, 269629, 273108, 276360, 279212, 281835, 284585, 287731, 291300, 294970, 298263, 301129, 304201, 308175, 313039, 318217, 323298, 328241, 333022, 337571, 342050, 346620, 350799, 353536, 354162, 353005, 350937, 348655, 346526, 344707, 343040, 341084, 338595, 335914, 333589, 331731, 329997, 328213, 326740, 326096, 326325, 326866, 327143, 327280, 328140, 330502, 334219, 338300, 341825, 344603, 346966, 349217, 351461, 353734, 355946, 357665, 358318, 357831, 356986]
63676C56986j22J023J623J424J077J245J865K377K474K336K218K120J932J671
63662C80249J453J304J056M70m56j372j933k369l306m873o231o427n462m194l300
63647C44609k819k569k423k124j371k62P31J431K189L256M332M967N143N213N486
63632C65789O026O673P072O913O287N611N133M748M415M383M800N413N928O486
63618D45677P460Q928J0585J2105J3436J4747J6270J8084K0038K1909K3672K5483
63606F38394K7336K8970L0167L1020L1698L2057L1552K9546K5778K0586J4645
63595I41749Q456K251l591q271j1105j2143j2015j1316j0516j0200j0887j2624
63583H49788j5099j8128k1567k4851k7145k8035k7671k6334k4228k1723j9164
$$ y = [356986, 356864, 357887, 359510, 360934, 362011, 363256, 365121, 367498, 369972, 372308, 374526, 376646, 378578, 380249, 381702, 383006, 384062, 384532, 384076, 382704, 380771, 378402, 375096, 370223, 363992, 357565, 352103, 347909, 344609, 341790, 339221, 336798, 334674, 333303, 333041, 333772, 335203, 337392, 340648, 344980, 349947, 355090, 360303, 365789, 371815, 378488, 385560, 392473, 398760, 404371, 409504, 414252, 418667, 423050, 427850, 433263, 439191, 445677, 453137, 462065, 472650, 484755, 498191, 512938, 529208, 547292, 567330, 589239, 612911, 638394, 665730, 694700, 724867, 755887, 787585, 819642, 851194, 880740, 906518, 927104, 941749, 950205, 952456, 948865, 940594, 929489, 917346, 905331, 894015, 883499, 873299, 862412, 849788, 834689, 816561, 794994, 770143, 742998, 714963, 687292, 660958, 636730, 615007, 595843]
63572E95843j6466j3372j0169p548n681m006k105k39J236K378L404M316N028N505
63558E58124N692N748O334Q037J0396J2195J2959J3543J5044J7791K1629K6388
63546G13880L1583L6376M0316M3685M6848M9790N2331N3781N2055M4504L0717
63535A195866J3815j863j3790k1427k4751k4188k1396j8486j6282j4407j2957
63524A040134j2898j4820j8295k2651k7422l1866l5036l6665l7311l7351l6506
63513G29313l4536l1728k8469k5018k1854j9559j8026j6456j4519j2951j2507
63502D93690j2796j2635j1347r298p372o248o077o499o926o898o263n145l918
63489C92268l049k716k645k489k158j579m56J175K514K839K620L026M265N292
$$ y = [595843, 579377, 566005, 555836, 548288, 542607, 538601, 536496, 536257, 537493, 539871, 543275, 547591, 552619, 558124, 563816, 569564, 575898, 583935, 594331, 606526, 619485, 633028, 648072, 665863, 687492, 713880, 745463, 781839, 822155, 865840, 912688, 962478, 1014809, 1068590, 1120645, 1165149, 1195866, 1209681, 1207818, 1194028, 1172601, 1147850, 1123662, 1102266, 1083780, 1067498, 1053091, 1040134, 1027236, 1012416, 994121, 971470, 944048, 912182, 877146, 840481, 803170, 765819, 729313, 694777, 663049, 634580, 609562, 587708, 568149, 550123, 533667, 519148, 506197, 493690, 480894, 468259, 456912, 447614, 440242, 433994, 427917, 421418, 414492, 407594, 401331, 396186, 392268, 389219, 386503, 383858, 381369, 379211, 377632, 377176, 378351, 380865, 383704, 386324, 389350, 393615, 398907]
63475C98907N375N067N156N429N155M314L510K927K098P86n54j360j619j689j726
63460D31776j537r44j19M99N64J58k80l33jL45M10L65O19J321K191K949L633M349
63442D45965N023N759P137R507J2199J4179J5581J7747K1394K5603K9189L2372
63430F41655L6245M1030M5524M7916M6438L9814K8321J4579K353n873r858j0415
63418I17729q140l449K905R900J6559K2152K6462K9870L2717L4446L3893L0514
63406A145558K4875J7872J0095K192m818j0042j3276j4749j4699j3620j2605j2894
63394A103889j4989j8462k2624k7153l1931l6387l9384m0114l9012l7362l5848
63383G60623l3970l1160k7846k4885k2400j9929j7328j4733j1890q483n073k708
$$ y = [398907, 404282, 409349, 414505, 419934, 425089, 429403, 432913, 435840, 437938, 438724, 438170, 436810, 435191, 433502, 431776, 430239, 429295, 429176, 429675, 430239, 430397, 430117, 429784, 429783, 430128, 430538, 430903, 431522, 432843, 435034, 437983, 441616, 445965, 450988, 456747, 463884, 473391, 485590, 499769, 515350, 533097, 554491, 580094, 609283, 641655, 677900, 718930, 764454, 812370, 858808, 898622, 926943, 941522, 943875, 938002, 928144, 917729, 909589, 906140, 909045, 918945, 935504, 957656, 984118, 1013988, 1046705, 1081151, 1115044, 1145558, 1170433, 1188305, 1198400, 1200592, 1195774, 1185732, 1172456, 1157707, 1143008, 1129388, 1116783, 1103889, 1088900, 1070438, 1047814, 1020661, 988730, 952343, 912959, 872845, 833833, 796471, 760623, 726653, 695493, 667647, 642762, 620362, 600433, 583105, 568372, 556482, 547999, 542926, 540218]
63371E40218j449j53K001M660P181R543J1790J3512J4559J5756J8077K1446K4938
63358F82079K7910L0373L2480L4328L6194L8344M0567M2280M3063M2835M1426
63347A091879L8381L3352K6536J8654J0573L015l475q439j1571j3001j3335j3281
63335A159288j3340j3863j5170j7361k0242k3757k8153l3189l7462l9266l8185
63324H79300l5401l2298k9294k6059k2302j8089j3688r288m679M07N115O932L396
63311G04052n351j6306k5922l2113l4287l2778k8880k4437k0547j7136j4075j1849
63299D40371j0577r325p395n564n003n469n659n074m419m171l855k999k009j722
63285C67130k478l780m580l987k160m50r8q88j547j401r39p56o38n3R85J912K199
$$ y = [540218, 538769, 538616, 540617, 545277, 552458, 562001, 573791, 587303, 601862, 617618, 635695, 657141, 682079, 709989, 740362, 772842, 807170, 843364, 881708, 922275, 964555, 1007618, 1050453, 1091879, 1130260, 1163612, 1190148, 1208802, 1219375, 1222390, 1218915, 1210476, 1198905, 1185904, 1172569, 1159288, 1145948, 1132085, 1116915, 1099554, 1079312, 1055555, 1027402, 994213, 956751, 917485, 879300, 843899, 811601, 782307, 756248, 733946, 715857, 702169, 692881, 688202, 688609, 693724, 700656, 704052, 698701, 682395, 656473, 624360, 590073, 557295, 528415, 503978, 483431, 466295, 452220, 440371, 429794, 420469, 413074, 407510, 402507, 397038, 391379, 386305, 381886, 377715, 373860, 370861, 368852, 367130, 364652, 360872, 356292, 352305, 350145, 349695, 349597, 348709, 347162, 345761, 344822, 344066, 343428, 343375, 344360, 346272, 348471]
63268C48471J772J039O45R09J441J578J261J118J624K547L359L814L881L548L058
63253C80065L044L992N629P192Q232Q814Q959Q428P299O397O613P945R570J0882
63239D83061J2010J3182J4203J4910J5745J7259J9206K0773K1644K2325K3267
63228F77585K4293K5039K5480K5746K5807K5661K5500K5416K5208K4745K4254
63217I54734K4060K4254K4775K5474K5888K5351K3600K1015J7960J4234R461L627
63205A194433k998j0108j7107k3020k7298l0451l3383l6213l8180l8570l7189
63194H99916l4119k9668k4639k0060j6348j3062r646o105k757L82L603P059J0461
63181G65017J3332J5481J7165J8768K0391K1822K2819K3235K2928K1882K0391
$$ y = [348471, 350243, 351282, 351927, 352836, 354277, 355855, 357116, 358234, 359858, 362405, 365764, 369578, 373459, 377007, 380065, 383109, 387101, 392730, 399922, 408154, 416968, 425927, 434355, 441654, 448051, 454664, 462609, 472179, 483061, 495071, 508253, 522456, 537366, 553111, 570370, 589576, 610349, 631993, 654318, 677585, 701878, 726917, 752397, 778143, 803950, 829611, 855111, 880527, 905735, 930480, 954734, 978794, 1003048, 1027823, 1053297, 1079185, 1104536, 1128136, 1149151, 1167111, 1181345, 1190806, 1194433, 1191435, 1181327, 1164220, 1141200, 1113902, 1083451, 1050068, 1013855, 975675, 937105, 899916, 865797, 836129, 811490, 791430, 775082, 762020, 752374, 746269, 743512, 743894, 747497, 754556, 765017, 778349, 793830, 810995, 829763, 850154, 871976, 894795, 918030, 940958, 962840, 983231]
63170I83231J8850J7267J5361J3205J1286R714P867N201J978j257m597q530j3090
63157A056486j7757k2199k6502l0652l4175l6453l7127l6241l4233l1809k9534
63146G19804k7492k5382k2923k0023j6843j3885j1776j0633r794q535o892n483
63134E40143m677m249l788l071k185j500j432j928k324k074j412q68l80N54J897
63119E12706K914L128K940L018L425L679L461K956K566K482K601K732K815K906
63105E54329L052L190L183K898K311J695J498J831K225K283K346K965L883M279
63091E91968M100M244N123N922N825N163M578L800K175n7j958l088l652l706l107
63076F17330k054r02M09K023L516M416N177O555Q258R310R760J0780J2806J4849
$$ y = [983231, 1002081, 1019348, 1034709, 1047914, 1059200, 1068914, 1076781, 1081982, 1083960, 1082703, 1078106, 1069576, 1056486, 1038729, 1016530, 990028, 959376, 925201, 888748, 851621, 815380, 781147, 749338, 719804, 692312, 666930, 644007, 623984, 607141, 593256, 581480, 570847, 561053, 552518, 545626, 540143, 535466, 531217, 527429, 524358, 522173, 520673, 519241, 517313, 514989, 512915, 511503, 510635, 510255, 510809, 512706, 515620, 518748, 521688, 524706, 528131, 531810, 535271, 538227, 540793, 543275, 545876, 548608, 551423, 554329, 557381, 560571, 563754, 566652, 568963, 570658, 572156, 573987, 576212, 578495, 580841, 583806, 587689, 591968, 596068, 600312, 605435, 611357, 617182, 622345, 626923, 630723, 632898, 632841, 630883, 627795, 624143, 620437, 617330, 615276, 614374, 614783, 616806, 620322, 624738, 629915, 636470, 644728, 654038, 663798, 674578, 687384, 702233]
63062G02233J6081J7025J8498K0328K1997K3794K6465L0034L3824L7377M0777
63051I88433M4241M7865N1619N5190N8048N9970O1406O2980O4794O6406O7304
63040A628256O7250O6395O5255O4345O3740O3204O2709O2441O2270O1715O0447
63029B328027N8288N4630M8521L9682K8771J6443K806j1883k6686m0735n3841
63018B444023o5782p5649q2581q6718q8633q8318q5514q0703p4782o7967n9858
63007A587518n0616m1092l1769k2371j2815l847L681R654J4486J8557K2138K5514
62995A519038K8742L1442L3059L3389L2760L1853L1316L1332L1472L1137L0100
62984A865640K8533K6537K3911K0293J5356Q905J053p705j6818k5965l4881m3140
$$ y = [702233, 718314, 735339, 753837, 774165, 796162, 819956, 846421, 876455, 910279, 947656, 988433, 1032674, 1080539, 1132158, 1187348, 1245396, 1305366, 1366772, 1429752, 1494546, 1560952, 1628256, 1695506, 1761901, 1827156, 1891501, 1955241, 2018445, 2081154, 2143595, 2205865, 2267580, 2328027, 2386315, 2440945, 2489466, 2529148, 2557919, 2574362, 2577168, 2565285, 2538599, 2497864, 2444023, 2378241, 2302592, 2220011, 2133293, 2044660, 1956342, 1870828, 1790125, 1715343, 1647376, 1587518, 1536902, 1495810, 1464041, 1441670, 1428855, 1425008, 1428689, 1438343, 1452829, 1471386, 1493524, 1519038, 1547780, 1579222, 1612281, 1645670, 1678430, 1710283, 1741599, 1772931, 1804403, 1835540, 1865640, 1894173, 1920710, 1944621, 1964914, 1980270, 1989175, 1990228, 1982523, 1965705, 1939740, 1904859, 1861719]
62972A861719n0392n6638o1852o5500o6990o6489o4776o2304n9011n5121n1383
62961A201263m8214m5126m1459l7314l3435l0470k8518k7137k5572k3389k1073
62950H39556j9609j9238j9198j8890j8583j8463j7867j6264j4406j3424j3127
62939F50487j2364j0908r716r215q608p286n775m726l938l093k601k790k995k417
62925E64055j405r69j351j937k291k362j931q67J94L36m41j332j936k445k654
62910E42664j930m64N34L71k29l56k14n79j492k290k557k417k126j811j431p13
62894E24960N79K061K824K419J295O5j179k372k980k551j434l96K09N42Q34J224
62878E26100J675J852J503J139J606K611K661J045j001j990k206k879m047m645
$$ y = [1861719, 1811327, 1754689, 1692837, 1627337, 1560347, 1493858, 1429082, 1366778, 1307767, 1252646, 1201263, 1153049, 1107923, 1066464, 1029150, 995715, 965245, 936727, 909590, 884018, 860629, 839556, 819947, 800709, 781511, 762621, 744038, 725575, 707708, 691444, 677038, 663614, 650487, 638123, 627215, 617499, 608284, 599676, 592390, 586615, 581889, 577951, 574858, 572257, 569467, 566472, 564055, 562650, 561681, 560330, 558393, 556102, 553740, 551809, 550942, 551136, 551472, 551031, 549699, 547763, 545318, 542664, 540734, 540270, 540804, 541175, 540946, 540590, 540376, 539797, 538305, 536015, 533458, 531041, 528915, 527104, 525673, 524960, 525539, 527600, 530424, 532843, 534138, 534203, 533024, 530652, 527672, 525121, 523687, 523291, 523500, 524042, 524876, 526100, 527775, 529627, 531130, 532269, 533875, 536486, 539147, 540192, 539191, 537201, 534995, 532116, 528069, 523424]
62864E23424m395m136m278m172l342k267j585j299j110q89n73j28K23K60K31M91
62848D96455Q03P07M18N55J041J158P46L99L79K77m5j21K14M55L29K00K76J95
62830E04441j48j98L63R97J140J009J109J453J765K029K405K992L894N015N699
62815E33965N217L828K673K389K587K876L409M090M268L863L787M545N392N642
62801E88531N927P019Q322Q741Q580R201J1072J3295J5084J6518J7799J8739J9387
62788G48215K0378K2363K5398K9144L3288L7790M2921M8963N5616O2024O7694
62777A193794P3128P9064Q5484R1787R7512J02188J04969J05242J03385J00067
62767B136620R4954Q7005P5993O2804M8137L1872J4074m166k1553l7717n3041
$$ y = [523424, 519029, 514893, 510615, 506443, 503101, 500834, 499249, 497950, 496840, 495951, 495378, 495250, 495473, 495733, 495964, 496455, 497258, 497965, 498383, 498938, 499979, 501137, 501883, 502282, 502661, 502938, 502893, 502772, 502986, 503441, 503770, 503970, 504246, 504441, 504293, 504095, 504458, 505455, 506595, 507604, 508713, 510166, 511931, 513960, 516365, 519357, 523251, 528266, 533965, 539182, 543010, 545683, 548072, 550659, 553535, 556944, 561034, 565302, 569165, 572952, 577497, 582889, 588531, 594458, 601477, 609799, 618540, 627120, 636321, 647393, 660688, 675772, 692290, 710089, 728828, 748215, 768593, 790956, 816354, 845498, 878786, 916576, 959497, 1008460, 1064076, 1126100, 1193794, 1266922, 1345986, 1431470, 1523257, 1620769, 1722957, 1827926, 1933168, 2036553, 2136620, 2231574, 2318579, 2394572, 2457376, 2505513, 2537385, 2551459, 2547293, 2525740, 2488023, 2434982]
62756B434982o7520q0263r0131r6689j00546j02655j03311j02054r8721r4121
62746A498971q9264q4193p8272p1437o4530n8280n2683m7518m2918l9040l5588
62735H35248l2060k8335k4795k1895j9703j7784j5581j3002j0559q732p374o015
62723F29413m595l453k644j756n41O46J368J788K510L802N245O309P102Q336J0505
62708F64035J3382J6395J9275K2008K4505K6822K9600L3575L8579M3631M8093
62697I79900N2143N5964N9274O2036O4832O7962P0807P2693P3724P4043P2862
62686A706240O9151O2873N4669M4626L2393J8374L842j0290k3961l7131m9221
62675A871565n9590o8001p4383p8564q0452q0225p8254p5094p1352o7275o2613
$$ y = [2434982, 2367462, 2287199, 2197068, 2100379, 1999833, 1897178, 1793867, 1691813, 1593092, 1498971, 1409707, 1325514, 1247242, 1175805, 1111275, 1052995, 1000312, 952794, 909876, 870836, 835248, 803188, 774853, 750058, 728163, 708460, 690676, 675095, 662093, 651534, 642802, 635428, 629413, 624818, 621365, 618721, 616965, 616424, 617070, 618438, 620226, 622736, 626538, 631783, 638092, 645194, 653530, 664035, 677417, 693812, 713087, 735095, 759600, 786422, 816022, 849597, 888176, 931807, 979900, 1032043, 1088007, 1147281, 1209317, 1274149, 1342111, 1412918, 1485611, 1559335, 1633378, 1706240, 1775391, 1838264, 1892933, 1937559, 1969952, 1988326, 1992168, 1981878, 1957917, 1920786, 1871565, 1811975, 1743974, 1669591, 1591027, 1510575, 1430350, 1352096, 1277002, 1205650, 1138375, 1075762]
62664A075762n7340n2173m7891m4336m0716l6741l2873k9573k6847k4464k2086
62653F60722j9382j6542j4380j3323j2669j1570j0373r965j0144r828q811p975
62641E15760p556o627m770l048k547k900l002k481j634n89O17J554J758J333O84
62626D86552j15j135k069k468k238j596o85L03R21Q81N46O11J339K409L394M146
62610D90796M752N245N504N458N474O223P885R676J0759J1423J2685J4811J7060
62597F07751J8989K1175K4203K7805L1440L5047L8658M1915M4555M6927M9287
62586I87752N1008N1109M9298M5928M1220L5178K7977J9890J1003J499p953j6669
62574A297240k4580l1851l8039m2372m4798m6133m6990m7100m5879m3367m0344
$$ y = [1075762, 1018422, 966249, 918358, 874022, 833306, 796565, 763692, 734119, 707272, 682808, 660722, 641340, 624798, 610418, 597095, 584426, 572856, 562483, 552518, 542374, 532546, 523735, 515760, 508204, 501577, 496807, 493759, 491212, 488312, 485310, 482829, 481195, 480606, 481223, 482777, 484535, 485868, 486552, 486437, 485302, 483233, 480765, 478527, 476931, 476246, 476549, 477470, 478351, 478897, 479508, 480847, 483256, 486650, 490796, 495548, 500793, 506297, 511755, 517229, 523452, 531337, 541013, 551772, 563195, 575880, 590691, 607751, 626740, 647915, 672118, 699923, 731363, 766410, 805068, 846983, 891538, 938465, 987752, 1038760, 1089869, 1139167, 1185095, 1226315, 1261493, 1289470, 1309360, 1320363, 1321862, 1313909, 1297240, 1272660, 1240809, 1202770, 1160398, 1115600, 1069467, 1022477, 975377, 929498, 886131, 845787]
62563H45787l7667l5627l3808l1561k8644k5334k1988j8751j5826j3638j2344
62552E70599j1428j0190q608p297o631o223n390m040k894k756l499l979l208j474
62538D92982M5P19R66J264J399J092P03P68J122J125O53L56R18K385M168N600
62522E16265O667Q123J0613J3629J5937J7259J8698K1119K3915K6230K8577L2126
62510G39158L6641M0453M2513M3420M4167M4847M4917M3890M1317L6831L0787
62499A188941K4289J8042J1703M811k099q045j2815j6855k0128k1916k1873k0523
62487A123532j8395j5252j0700n191J19M538Q294J1814J5007J7600J9770K1869
62475A173005K3458K3149J9710J3211N069k845r174j3763j7850k3223l0592l8656
$$ y = [845787, 808120, 772493, 738685, 707124, 678480, 653146, 631158, 612407, 596581, 582943, 570599, 559171, 548981, 540373, 533076, 526445, 520222, 514832, 510792, 507898, 505142, 501643, 497664, 494456, 492982, 493027, 493746, 494712, 495976, 497375, 498467, 499170, 499938, 501060, 502185, 502838, 503194, 504112, 506497, 510665, 516265, 522932, 531055, 541668, 555297, 571234, 588493, 607191, 628310, 652225, 678455, 707032, 739158, 775799, 816252, 858765, 902185, 946352, 991199, 1036116, 1080006, 1121323, 1158154, 1188941, 1213230, 1231272, 1242975, 1247786, 1245687, 1237642, 1224827, 1207972, 1187844, 1165928, 1144055, 1123532, 1105137, 1089885, 1079185, 1073994, 1074113, 1078651, 1086945, 1098759, 1113766, 1131366, 1151136, 1173005, 1196463, 1219612, 1239322, 1252533, 1257602, 1254757, 1245583, 1231820, 1213970, 1190747, 1160155, 1121499]
62463A121499m5121m8668m9671m9190m7825m5739m3234m0725l8233l5296l1547
62452F46250k7188k2816j8886j5425j2269r410p040n313m130l190k141p78P92
62439E18456K138K851K996L058L354L655L580L201K926K841K491J398l97k460
62425E50088m362n823o674o955p052p423q087q563q415p682o689n589m392l287
62411D59095k641k576k804k972k944k761k541k514k790k972k429j241m02o59j418
62396D25431j420l39R86J818K323K895L478L913M411N100N421M620K853J328J213
62381D64031K546M321N489N846N976O470P292P995Q337Q465Q615Q903R436J0331
62367E64053J1535J2786J3841J4644J5380J6498J8546K1633K5191K8582L1897
$$ y = [1121499, 1076378, 1027710, 978039, 928849, 881024, 835285, 792051, 751326, 713093, 677797, 646250, 619062, 596246, 577360, 561935, 549666, 540256, 533216, 527903, 523773, 520583, 518442, 517664, 518456, 520594, 523445, 526441, 529499, 532853, 536508, 540088, 543289, 546215, 549056, 551547, 552945, 552548, 550088, 545726, 539903, 533229, 526274, 519222, 511799, 503712, 495149, 486734, 479052, 472363, 466774, 462382, 459095, 456454, 453878, 451074, 448102, 445158, 442397, 439856, 437342, 434552, 431580, 429151, 427910, 427508, 426849, 425431, 424011, 423672, 424658, 426476, 428799, 431694, 435172, 439085, 443496, 448596, 454017, 458637, 461490, 462818, 464031, 466577, 470898, 476387, 482233, 488209, 494679, 501971, 509966, 518303, 526768, 535383, 544286, 553722, 564053, 575588, 588374, 602215, 616859, 632239, 648737, 667283, 688916, 714107, 742689, 774586]
62356G74586L5748M0325M5097M9449N3154N6178N8434N9824O0053N8348N3955
62345A345151M7084L8871L0169K0931J1081J324p383j4781k1223k6917l1807l5968
62333A356532l9628m2779m5087m6160m5789m4029m1295l8139l4913l1736k8888
62322I18089k6773k5413k4318k3141k2064k1352k0930k0699k0778k1099k1150
62311F70372k0522j9403j8122j6583j4640j2683j1311j0540r839q812p435n782
62299E14700m020k563j785j560j386r27k14N67J156J295J038Q81J258J995K523
62284E12958K562K317K130K200K582L179L788M209M345M194L883L702L771L799
62270E59619L524L361M011N413O784P930R602J2211J4987J7177J9326K2518K6783
$$ y = [774586, 810334, 850659, 895756, 945205, 998359, 1054537, 1112971, 1172795, 1232848, 1291196, 1345151, 1392235, 1431106, 1461275, 1482206, 1493287, 1494611, 1487228, 1472447, 1451224, 1424307, 1392500, 1356532, 1316904, 1274125, 1229038, 1182878, 1137089, 1093060, 1051765, 1013626, 978713, 946977, 918089, 891316, 865903, 841585, 818444, 796380, 775028, 754098, 733399, 712621, 691522, 670372, 649850, 630447, 612325, 595742, 581102, 568419, 557108, 546568, 536729, 527917, 520482, 514700, 510680, 508117, 506332, 504772, 503386, 502459, 502245, 502812, 503968, 505263, 506301, 507182, 508440, 510435, 512958, 515520, 517837, 519967, 522167, 524749, 527928, 531716, 535925, 540270, 544464, 548347, 552049, 555820, 559619, 563143, 566504, 570515, 575928, 582712, 590642, 600244, 612455, 627442, 644619, 663945, 686463, 713246]
62257G13246L1186L5253L9449M4275M9587N4788N9169O2146O3608O3883O3030
62246A279620O0425N5400M7982L8600K7637J5881M782m674j3012k1378k9865l7630
62234A423768m4333n0322n5442n8822o0074n9822n8699n6616n3284m8898m3920
62223H33536l8766l3837k9507k5815k2556j9661j7219j5230j3748j2990j2826
62212E91381j2423j1146r512q528q238p830o995o166n448m407l109k342k384k442
62198E00411j737m63P67J765K676L640M781O073P059P312P300P993R465J0652
62184E67694J0802J0368J0148J0306J0641J1000J1012J0219Q890Q018P927P771
62172F84796O935O227O859Q905J1563J4453J7815K1729K5963L0417L5121L9841
$$ y = [713246, 744432, 779685, 819134, 863409, 912996, 967784, 1026953, 1089099, 1152707, 1216590, 1279620, 1340045, 1395445, 1443427, 1482027, 1509664, 1525545, 1530327, 1525653, 1512641, 1491263, 1461398, 1423768, 1379435, 1329113, 1273671, 1214849, 1154775, 1094953, 1036254, 979638, 926354, 877456, 833536, 794770, 760933, 731426, 705611, 683055, 663394, 646175, 630945, 617197, 604207, 591381, 578958, 567812, 558300, 549772, 541534, 533704, 526709, 520543, 515095, 510688, 507579, 505237, 502853, 500411, 498674, 498211, 498978, 500743, 503419, 507059, 511840, 517913, 524972, 532284, 539584, 547577, 557042, 567694, 578496, 588864, 599012, 609318, 619959, 630959, 641971, 652190, 661080, 669098, 677025, 684796, 691731, 697958, 704817, 713722, 725285, 739738, 757553, 779282, 805245, 835662, 870783, 910624]
62160I10624M4135M7728N0470N2085N2201N0436M6362L9846L1623K3158J5585
62149A364253R197L906m48m449q898j3822j8372k2077k5407k8557l0675l1009
62137A193642l0102k8921k7482k5256k2329j9263j6213j3164j0595q899p543n805
62125I78070m006k969k471j416N00K463L958N400P143Q760R651R684Q978P791
62111A031536O730O272N844M140O54l745p948j1473j3852j4116j1686p349k753
62098I82254Q16K830L247K526J691J726K798M314N629O535P199P898Q703R265
62084A047431R084Q134P005O303O106O259O875Q212J0215J2522J4863J7146J9129
62071A179284K0369K0628K0203J9596J8946J8013J6747J5691J5544J6410J7715
$$ y = [910624, 954759, 1002487, 1052957, 1105042, 1157243, 1207679, 1254041, 1293887, 1325510, 1348668, 1364253, 1373450, 1377356, 1376908, 1372459, 1363561, 1349739, 1331367, 1309290, 1283883, 1255326, 1224651, 1193642, 1163540, 1134619, 1107137, 1081881, 1059552, 1040289, 1024076, 1010912, 1000317, 991418, 983875, 978070, 974064, 971095, 968624, 967208, 967708, 970171, 974129, 979529, 986672, 995432, 1005083, 1014767, 1023745, 1031536, 1038266, 1044538, 1050382, 1054522, 1055176, 1051431, 1043483, 1032010, 1018158, 1004042, 992356, 985007, 982254, 983070, 985900, 989147, 991673, 993364, 995090, 997888, 1002202, 1007831, 1014366, 1021565, 1029463, 1038166, 1047431, 1056515, 1064649, 1071654, 1077957, 1084063, 1090322, 1097197, 1105409, 1115624, 1128146, 1143009, 1160155, 1179284, 1199653, 1220281, 1240484, 1260080, 1279026, 1297039, 1313786, 1329477, 1345021, 1361431, 1379146]
62060A379146J8938K0095K1367K2566K3279K3368K2866K1467J8589J4131Q853
62049A594665L843m09m283q553j3765k0013k7065l4473m1450m6984n0533n2660
62037A298320n4477n6253n7009n5775n2938m9787m7035m4345m1184l7492l3424
62026G68601k9124k4977k1637j9374j7668j5794j3716j2075j1396j1497j1629
62015E79714j1175j0165r229q878q877q488p390o042m946l841k108J01J703J974
62001E02353J598J911L264M741N508N753N928N708M511K686J256M82m51k031l558
61986E39659m279m669n801p675r037q897p603o274n578n282m774l785k632j818
61972D61555j427j055l95L44P94R38J031J189J368J598J917K141K010J505Q40
$$ y = [1379146, 1398084, 1418179, 1439546, 1462112, 1485391, 1508759, 1531625, 1553092, 1571681, 1585812, 1594665, 1598508, 1598099, 1593816, 1585263, 1571498, 1551485, 1524420, 1489947, 1448497, 1401513, 1350980, 1298320, 1243843, 1187590, 1130581, 1074806, 1021868, 972081, 925046, 880701, 839517, 802025, 768601, 739477, 714500, 692863, 673489, 655821, 640027, 626311, 614236, 602840, 591343, 579714, 568539, 558374, 549145, 540267, 531390, 522902, 515512, 509470, 504524, 500683, 498575, 498676, 500379, 502353, 503951, 505862, 509126, 513867, 519375, 525128, 531056, 536764, 541275, 543961, 545217, 545699, 545248, 543217, 539659, 535380, 530711, 524910, 517235, 508198, 499301, 491698, 485424, 479846, 474564, 469790, 466005, 463373, 461555, 460128, 459073, 458678, 459022, 459816, 460754, 461785, 462974, 464342, 465940, 467857, 469998, 472008, 473513, 474353]
61957D74353J85l75p13p87p49o68k47Q25K306L529M161M559N280O456P757Q798
61941E14670R532J0272J1369J2855J4438J5866J7072J7939J8170J7641J6694J5849
61929F92367J5318J4921J4272J2993J0986Q676O720N191L464J082j570l876n773
61916G74771p427q497q447p449o216m960l186o20K354N294Q108J0629J2427J3441
61902G80222J4264J5252J5683J4458J1447P690M223J104k257o129j0025j3122
61890H32810j4903j5389j4983j4223j3599j3286j2930j1907j0032p926o481o020
61878F91131o151o369o553o870p373p896q227q273p940p020n380l391j862j241
61864F06585j065n65K92R30J288K144M072O661R136J1240J3146J4966J6901J9394
$$ y = [474353, 474538, 474163, 473450, 472663, 471914, 471246, 470999, 471824, 474130, 477659, 481820, 486379, 491659, 498115, 505872, 514670, 524202, 534474, 545843, 558698, 573136, 589002, 606074, 624013, 642183, 659824, 676518, 692367, 707685, 722606, 736878, 749871, 760857, 769533, 776253, 781444, 784908, 785990, 784420, 780544, 774771, 767344, 758847, 750400, 742951, 736735, 731775, 728589, 727969, 730323, 735617, 743725, 754354, 766781, 780222, 794486, 809738, 825421, 839879, 851326, 859016, 863239, 864343, 862086, 855957, 845932, 832810, 817907, 802518, 787535, 773312, 759713, 746427, 733497, 721590, 711558, 703632, 697151, 691131, 684980, 678611, 672058, 665188, 657815, 649919, 641692, 633419, 625479, 618459, 613079, 609688, 607826, 606585, 605520, 604955, 605247, 606177, 607465, 609609, 613681, 620342, 629478, 640718, 653864, 668830, 685731, 705125]
61850G05125K2517K5541K7679K9080L0435L1765L2329L1673L0219K8668K7274
61839A022305K5664K3086J8916J3344P488K432j717n454q746j0837j1147r822
61827A065512p359m179o66K799N973Q797J1203J3018J3903J3269J0607O160R33
61814A139970m354r870j5865k1711k6397k9586l1599l2737l3238l3483l3465l2499
61802H35166l0223k7464k5200k3160k0668j8285j7070j6479j4755j1651r026q157
61790F13028q088p395o185n291m674l871l083k715k484k002j672j973k407k171
61776E59017j470j198j586k052k156j834j010K25J212J318Q33N69P08P27L49j41
61760E53511m27m06L2Q42J546J690J562J876K791L759M271M265L841L171K685
$$ y = [705125, 727642, 753183, 780862, 809942, 840377, 872142, 904471, 936144, 966363, 995031, 1022305, 1047969, 1071055, 1089971, 1103315, 1110803, 1113235, 1111518, 1106064, 1097318, 1086481, 1075334, 1065512, 1058153, 1053974, 1053308, 1056107, 1062080, 1070877, 1082080, 1095098, 1109001, 1122270, 1132877, 1139037, 1139970, 1135616, 1125746, 1109881, 1088170, 1061773, 1032187, 1000588, 967851, 934613, 901130, 867665, 835166, 804943, 777479, 752279, 729119, 708451, 690166, 673096, 656617, 641862, 630211, 621185, 613028, 604940, 597545, 591360, 586069, 581395, 577524, 574441, 571726, 569242, 567240, 565568, 563595, 561188, 559017, 557547, 556349, 554763, 552711, 550555, 548721, 547711, 547936, 549148, 550466, 551299, 551868, 552576, 553303, 553652, 553511, 553084, 552678, 552710, 553552, 555098, 556788, 558350, 560226, 563017, 566776, 571047, 575312, 579153, 582324, 585009]
61745E85009K844L560M179M113L288K104J202J073J581K066K155K128K255K203
61731F19760J648J052J126J793K329K344K024J573J066P70R18J248J324J195J201
61716F41371J273J125R44J128J379R10l36j531k149k602l421m522n616o660p523
61701F13770p731p062n979n114m556l991l242k451j945k064k881l907m404m088
61687E54355l336k655k241k109k250k577k986l481l932l865l063k208k313l340
61673E13999m154m006l384l031k869k435j816j568j955k710l328l308k476j401
61659D75558j065j732k489k354j411l99L77J069J585J637J380J290J446J493J332
61644D77717J298J519J736J830K038K398K435J779P94J95J69J97k18r07j267j083
$$ y = [585009, 587853, 591413, 595592, 599705, 602993, 605097, 606299, 607372, 608953, 611019, 613174, 615302, 617557, 619760, 621408, 622460, 623586, 625379, 627708, 630052, 632076, 633649, 634715, 635485, 636403, 637651, 638975, 640170, 641371, 642644, 643769, 644713, 645841, 647220, 648130, 647794, 646263, 644114, 641512, 638091, 633569, 627953, 621293, 613770, 606039, 598977, 592998, 587884, 583328, 579337, 576095, 573644, 571699, 569635, 566754, 562847, 558443, 554355, 551019, 548364, 546123, 544014, 541764, 539187, 536201, 532720, 528788, 524923, 521860, 519652, 517339, 513999, 509845, 505839, 502455, 499424, 496555, 494120, 492304, 490736, 488781, 486071, 482743, 479435, 476959, 475558, 474493, 472761, 470272, 467918, 466507, 466108, 466485, 467554, 469139, 470776, 472156, 473446, 474892, 476385, 477717, 479015, 480534, 482270, 484100, 486138, 488536, 490971, 492750, 493544, 493739, 493908, 494105, 493887, 492980, 491713, 490630]
61628D90630q87j371k529l622m021l749l151k413j715j410j592j694j090j0O51
61613D62027M42k29q48j414k177l178m306n405o161o254n903n768o011n866m745
61598D04204l394l186m307n337m971l548k458k381k659k375j555j048j476k569
61584C62940l550l938l794l358k758k134j780j794j809j393p19m60q66j382j417
61569C31788j149j165j498j575j083m38k06m40q17j093j160q71k23M12N59J24
61553C21165n32j006j085o96R0R69J542J666J483J157P95O46R92J754K414K593
61537C33947K475K460K582K516K083J503J184J374J929K217J536q7j643k106j593
61522C50377j107j260j760k234k821l565l906l414k589k218k189j725o79K03M09
$$ y = [490630, 489743, 488372, 485843, 482221, 478200, 474451, 471300, 468887, 467172, 465762, 464170, 462476, 461386, 461376, 462027, 462469, 462240, 461392, 459978, 457801, 454623, 450317, 444912, 438751, 432497, 426594, 420826, 414815, 408949, 404204, 400810, 397624, 393317, 387980, 383009, 379461, 377003, 374622, 371963, 369588, 368033, 366985, 365509, 362940, 359390, 355452, 351658, 348300, 345542, 343408, 341628, 339834, 338025, 336632, 335913, 335453, 334587, 333205, 331788, 330639, 329474, 327976, 326401, 325318, 324880, 324674, 324234, 323417, 322324, 321164, 320293, 320070, 320482, 321041, 321165, 320633, 319627, 318542, 317846, 317936, 318905, 320447, 322113, 323596, 324753, 325548, 326194, 327186, 328940, 331354, 333947, 336422, 338882, 341464, 343980, 346063, 347566, 348750, 350124, 352053, 354270, 355806, 355719, 354076, 351970, 350377, 349270, 348010, 346250, 344016, 341195, 337630, 333724, 330310, 327721, 325503, 323314, 321589, 320910, 321113, 321522]
61507C21522K43J9n00j409k071j853j063n30n35p59r83j196j182o80L3L18J9l95
61489C08998n33m23j49K50M58Q1n41m54O41J785J859R05j21m53Q3J324K738L386
61471C19834K692J221J87J20N08P49Q38R70J056R86R52J142J276Q92l2r71j360
61454C31060j013j23Q94J561J543Q94M7m61l82O8M47M95L48K79L34L61M10Q49
61436C37611J881L079L656L246K331J809K190L223M144M255L419K182J351J239
61422C75616J358J067M86M35J343K577L136K808K209J882J736J475J059N67o8
61407C97686r27j777k237k212k015k032k295k479k313j996k009k513l060l118
61393C66703k688k151j680j136n58j86m1K05P09J152J173Q53N58M66M92M99N01
$$ y = [321522, 321765, 321784, 321284, 319875, 317804, 315951, 314888, 314358, 313823, 313064, 312081, 310885, 309703, 309023, 309056, 309374, 309393, 308998, 308465, 308042, 307893, 308143, 308601, 308682, 308141, 307687, 308328, 310113, 311972, 312877, 312756, 312303, 312386, 313710, 316448, 319834, 322526, 323747, 323934, 324054, 324562, 325311, 326149, 327119, 328175, 329161, 330113, 331255, 332531, 333423, 333391, 332420, 331060, 330047, 329924, 330818, 332379, 333922, 334816, 334863, 334402, 334020, 334088, 334535, 335030, 335378, 335657, 335991, 336352, 336762, 337611, 339492, 342571, 346227, 349473, 351804, 353613, 355803, 359026, 363170, 367425, 370844, 373026, 374377, 375616, 376974, 378041, 378527, 378962, 380305, 382882, 386018, 388826, 391035, 392917, 394653, 396128, 397187, 397754, 397686, 396759, 394982, 392745, 390533, 388518, 386486, 384191, 381712, 379399, 377403, 375394, 372881, 369821, 366703, 364015, 361864, 360184, 359048, 358490, 358304, 358263, 358468, 359177, 360329, 361502, 362355, 362913, 363379, 363871, 364370, 364871]
61376C64871O68J181J883K163J559M81n2M61J527K397K827K892K578J964J417
61361C88817J248J376J671K241L035L620L786M008M729N547N758N495N534O104
61347D42969O727P315Q458J0304J1884J2184J1374J0343R364P950N995M285L600
61334E52752L729L853L518K820J758J11j878l307l588l255l188l329k951k006
61320E45039j354j465j793j756j521j267n29R73K522L304L734M795O458P722Q224
61305E73086Q624R363J0051J0445J1057J2250J3415J3679J2882J1346R097O015
61293G01310K477p45l188m956o363p677r064j0485j1548j1733j0864r299p655
61280F10210o395n569m918m203l399k581j687o38N10J660K823L936M668M763M449
$$ y = [364871, 365539, 366720, 368603, 370766, 372325, 372806, 372754, 373215, 374742, 377139, 379966, 382858, 385436, 387400, 388817, 390065, 391441, 393112, 395353, 398388, 402008, 405794, 409802, 414531, 420078, 425836, 431331, 436865, 442969, 449696, 457011, 465469, 475773, 487657, 499841, 511215, 521558, 530922, 538872, 544867, 549152, 552752, 556481, 560334, 563852, 566672, 568430, 568541, 566663, 563356, 559768, 556513, 553325, 549996, 547045, 545039, 543685, 542220, 540427, 538671, 537150, 535883, 535354, 536327, 538849, 542153, 545887, 550682, 557140, 564862, 573086, 581710, 591073, 601124, 611569, 622626, 634876, 648291, 661970, 674852, 686198, 695295, 701310, 703787, 703042, 699854, 694898, 688535, 680858, 671794, 661309, 649761, 638028, 627164, 617865, 610210, 603815, 598246, 593328, 589125, 585726, 583145, 581458, 580820, 581330, 582990, 585813, 589749, 594417, 599180, 603629]
61265F03629M204M196M336M704N448O250O562O469O744P821R188J0146J0690J1202
61251G01589J1705J1773J1063R508P212M505J976O8j332k689m217n662o609o854
61237G32036o548o113n891n790n398m519l437k519j765r46j8Q37J543K294L308
61222F97074M564N738O511O881P178P688Q377R041R503R475Q515O567M453L295
61208G94860L416M144M760N121N278N047M362L715L771M677N976P150Q145R419
61194H69841J1492J4326J7217J9511K1243K2732K3806K4027K3563K2957K1978
61183A092693J9649J5810J1804Q928O977N125L543L063L491L428J962m08k734
61170A173331m807o956r262j1507j3621j5690j7574j8876j9517k0070k1279k3113
$$ y = [603629, 607833, 612029, 616365, 621069, 626517, 632767, 639329, 645798, 652542, 660363, 669551, 679697, 690387, 701589, 713294, 725067, 736130, 745638, 752850, 757355, 759331, 759399, 758067, 755378, 751161, 745499, 738890, 732036, 725488, 719375, 713484, 707694, 702296, 697777, 694340, 691821, 690056, 689110, 689092, 689929, 691472, 693766, 697074, 701638, 707376, 713887, 720768, 727946, 735634, 744011, 753052, 762555, 772030, 780545, 787112, 791565, 794860, 798276, 802420, 807180, 812301, 817579, 822626, 826988, 830703, 834474, 839151, 845127, 852277, 860422, 869841, 881333, 895659, 912876, 932387, 953630, 976362, 1000168, 1024195, 1047758, 1070715, 1092693, 1112342, 1128152, 1139956, 1148884, 1155861, 1160986, 1164529, 1167592, 1171083, 1174511, 1176473, 1176065, 1173331, 1168524, 1161568, 1152306, 1140799, 1127178, 1111488, 1093914, 1075038, 1055521, 1035451, 1014172, 991059]
61158I91059k4544k4648k3759k3037k2894k2468k0940j8664j6457j4310j1671
61147G67667q662o168m629l549k349j122l12j26n82j706l353n021o090o197n362
61132G12439l930k358q63P95K885N182P157Q727J0384J2579J5260J8126K1001
61119H07384K3826K6584K9340L2078L4526L6412L7899L9306M0425M0670M0017
61108A188467L9223L8781L8193L6752L4516L1964K9050K5320K0882J6582J3002
61097A512732R728N789N94n672j2362j8860k4837l0126l4464l7598l9595m0801
61085A284528m1365m1157m0343l9589l9203l8511l6734l4227l2016l0239k7944
61074H83200k4702k1449j9218j7712j5929j3690j1708j0354r173p718o158m881
$$ y = [991059, 966515, 941867, 918108, 895071, 872177, 849709, 828769, 810105, 793648, 779338, 767667, 759005, 752837, 748208, 744659, 742310, 741188, 740876, 740750, 740168, 738462, 735109, 730088, 723998, 717801, 712439, 708509, 706151, 705288, 706083, 708968, 714150, 721307, 730034, 740418, 752997, 768257, 786383, 807384, 831210, 857794, 887134, 919212, 953738, 990150, 1028049, 1067355, 1107780, 1148450, 1188467, 1227690, 1266471, 1304664, 1341416, 1375932, 1407896, 1436946, 1462266, 1483148, 1499730, 1512732, 1522460, 1528249, 1528843, 1523171, 1510809, 1491949, 1467112, 1436986, 1402522, 1364924, 1325329, 1284528, 1243163, 1202006, 1161663, 1122074, 1082871, 1044360, 1007626, 973399, 941383, 911144, 883200, 858498, 837049, 817831, 800119, 784190, 770500, 758792, 748438, 739265, 731547, 725389, 720508]
61062G20508l952l180k325j080P71K903M515N113N117N425O507Q131R879J1610
61048G69942J3368J5071J6509J7663J8863K0457K2417K4442K6393K8295K9967
61037A003387L1103L1872L2889L4262L5191L5062L4486L4519L5254L6028L6713
61026A380766L7752L8963L9518L9374L9589M0740M1965M2270M1917M1928M2950
61015A827732M5349M9690N6288O4785P4915Q7128J01807J18550J37160J58974
61005B722378J86444K21964K67689L25575L96673M81243N80538O97161Q31949
60996F711614R81413J139619J301308J462291J620723J780346J942320K075948
60988A9015582K095060J889089J412034P53701J09600l37685n17892m71526k82732
$$ y = [720508, 716556, 713376, 711051, 709971, 710742, 713645, 718160, 723273, 728390, 733815, 740322, 748453, 758332, 769942, 783310, 798381, 814890, 832553, 851416, 871873, 894290, 918732, 945125, 973420, 1003387, 1034490, 1066362, 1099251, 1133513, 1168704, 1203766, 1238252, 1272771, 1308025, 1344053, 1380766, 1418518, 1457481, 1496999, 1536373, 1575962, 1616702, 1658667, 1700937, 1742854, 1784782, 1827732, 1873081, 1922771, 1979059, 2043844, 2118759, 2205887, 2307694, 2426244, 2563404, 2722378, 2908822, 3130786, 3398475, 3724050, 4120723, 4601966, 5182504, 5879665, 6711614, 7693027, 8832646, 10133954, 11596245, 13216968, 14997314, 16939634, 19015582, 21110642, 22999731, 24411765, 25165466, 25275066, 24937381, 24419489, 23947963, 23665231]
60979B3665231m1486J39272J21113j91960p64931j424484j958917k239503k263779
60970A5040556k109562j865712j596165j338355j110690r17839p56946o24053
60962D721234n15837m28047l55997k96923k49958k13751j85776j63754j46089
60953B165102j30998j16814j03353r1560q1552p2252o3096n4739m7792m2094l7798
60942A323054l5867l6591l8505l9640l9396l8476l7466l6337l5045l3774l2477
60931I19480l0735k8337k5704k3530k2075k0926j9491j7647j5750j4041j2294
60920F88950j0230q100o512n760n610n667n708n623n287m489k994p87J565L121
60906F26869L383K771K073J612J242Q95O79O03N38L83l6j006k495l880m595m922
$$ y = [23665231, 23623745, 23763017, 23884130, 23692170, 22927239, 21502755, 19543838, 17304335, 15040556, 12930994, 11065282, 9469117, 8130762, 7020072, 6102233, 5345287, 4721234, 4205397, 3777350, 3421353, 3124430, 2874472, 2660721, 2474945, 2311191, 2165102, 2034104, 1917290, 1813937, 1722377, 1640825, 1568573, 1505477, 1450738, 1402946, 1360852, 1323054, 1287187, 1250596, 1212091, 1172451, 1133055, 1094579, 1057113, 1020776, 985731, 951957, 919480, 888745, 860408, 834704, 811174, 789099, 768173, 748682, 731035, 715285, 701244, 688950, 678720, 670620, 664108, 658348, 652738, 647071, 641363, 635740, 630453, 625964, 622970, 622183, 623748, 626869, 630252, 633023, 635096, 636708, 637950, 638845, 639524, 640127, 640665, 641048, 641012, 640006, 637511, 633631, 629036, 624114]
60890F24114n587o706p656q024q106q261q341p970p140o266n820n946o294o218
60876E25779n352l969k630j624j000p96q16m27Q39K465L356L131K503K289K586
60861E26334L156M014N252O554P396P645P715Q133Q956R579R179P563N577M377
60847F21430M302M710M900M830M757M645M213L345K116N16j513l739n570o489
60833F42453o577o419o477o653o560o111n557n032m414l678l051k695k557k683
60819E73989l200l826l807k773j270j03N27Q12P91N53O41J516K747L456L519L644
60803E77216M267N002N377N545O072P293Q968J0393J0885J0529J0274J0949J2287
60790F85057J3378J3955J4628J5844J7229J8088J8192J7956J8135J9323K1308
$$ y = [624114, 618527, 611821, 604165, 596141, 588035, 579774, 571433, 563463, 556323, 550057, 544237, 538291, 531997, 525779, 520427, 516458, 513828, 512204, 511204, 510408, 509592, 509165, 510004, 512469, 515825, 518956, 521459, 523748, 526334, 529490, 533504, 538756, 545310, 552706, 560351, 568066, 576199, 585155, 594734, 603913, 611476, 617053, 621430, 625732, 630442, 635342, 640172, 644929, 649574, 653787, 657132, 659248, 659764, 658251, 654512, 648942, 642453, 635876, 629457, 622980, 616327, 609767, 603656, 598099, 593067, 588653, 584975, 581924, 579229, 576672, 573989, 570789, 566963, 563156, 560383, 559113, 559010, 559537, 560349, 561140, 561693, 562334, 563850, 566597, 570053, 573572, 577216, 581483, 586485, 591862, 597407, 603479, 610772, 619740, 630133, 641018, 651547, 661821, 672770, 685057, 698435, 712390, 727018, 742862, 760091, 778179, 796371, 814327, 832462, 851785, 873093]
60779H73093K3059K3699K3451K3168K3094K2694K1656K0361J9242J8255J7173
60768A108945J5940J4601J3238J2018J0917R494P401M961K619N1l384p331j0525
60755A178945j2351j3478j4725j6132j7582j9359k1492k3216k3783k3356k2593
60744I70878k1786k0988k0450k0276j9990j9141j8170j8051j9053k0313k0679
60733G51981j9746j8047j6495j5588j5014j4047j2383j0388q589p218o240n563
60721F02663n005m454m109m232m586m517l771k839k287k169k207k227k199k181
60707E55880k402l091m115n073n760o180o154n497m633m384m949n634n828n595
60693D86585n191m660m192m196m588m699m286l969m174m345l811k758j690n62
$$ y = [873093, 896152, 919851, 943302, 966470, 989564, 1012258, 1033914, 1054275, 1073517, 1091772, 1108945, 1124885, 1139486, 1152724, 1164742, 1175659, 1185153, 1192554, 1197515, 1200134, 1200185, 1196801, 1189470, 1178945, 1166594, 1153116, 1138391, 1122259, 1104677, 1085318, 1063826, 1040610, 1016827, 993471, 970878, 949092, 928104, 907654, 887378, 867388, 848247, 830077, 812026, 792973, 772660, 751981, 732235, 714188, 697693, 682105, 667091, 653044, 640661, 630273, 621684, 614466, 608226, 602663, 597658, 593204, 589095, 584863, 580277, 575760, 571989, 569150, 566863, 564694, 562487, 560260, 558061, 555880, 553478, 550387, 546272, 541199, 535439, 529259, 523105, 517608, 512975, 508591, 503642, 498008, 492180, 486585, 481394, 476734, 472542, 468346, 463758, 459059, 454773, 450804, 446630, 442285, 438474, 435716, 434026, 433464]
60679D33464P44J655J554R52R66J680J986J160q8n21K12J353J964J804J363J172
60663D51420J188R72L70k88o75p71n39J85J261K149K541K659K729K619K398K667
60647D70885L800N235O080O100N659M948L918K688J576P94M13M08M33jp80j061
60631E11095l91M90N07m03j462k163k556k673k467k215k367k886l312l432l461
60616D82304l597l740l640l085k106j217j039j438j542j027p59j446k342k283
60602D53043j537j430k251k857k473j719j374j174n25L42O83L00k86n62m15K0
60586D37785N63J033J295J258P68k73j555k358k081q70M15R59Q61J088K330M033
60570D45251N034N124N292O181P192P635P937Q837J0016J0635J0856J1453J2087
$$ y = [433464, 434208, 435863, 437417, 438369, 439335, 441015, 443001, 444161, 444073, 443552, 443764, 445117, 447081, 448885, 450248, 451420, 452608, 453580, 453950, 453662, 452987, 452216, 451677, 451862, 453123, 455272, 457813, 460472, 463201, 465820, 468218, 470885, 474685, 479920, 486000, 492100, 497759, 502707, 506625, 509313, 510889, 511683, 512096, 512504, 512937, 512936, 512156, 511095, 510704, 511194, 511701, 511298, 509836, 507673, 505117, 502444, 499977, 497762, 495395, 492509, 489197, 485765, 482304, 478707, 474967, 471327, 468242, 466136, 464919, 463880, 462442, 460900, 459873, 459114, 457668, 455326, 453043, 451506, 450076, 447825, 444968, 442495, 440776, 439402, 438228, 437703, 438045, 438728, 439028, 438742, 438180, 437765, 437785, 438348, 439381, 440676, 441934, 442702, 442429, 440874, 438516, 436435, 435565, 435980, 436939, 437800, 438888, 441218, 445251, 450285, 455409, 460701, 466882, 474074, 481709, 489646, 498483, 508499, 519134, 529990, 541443, 553530]
60557E53530J1267Q442M958K326M55j647m082n861o298n860n478n411n003l563
60543E37775j348N78J686K739M726P323R134R514R362R789J0713J1192J0698R487
60529F33368P951O130L922J416j092l379n414p052p678o610m133j799j112k006
60515F12512l057l081k101q48N5L85L67N70J338K265K715K821L391M711O151P170
60499F35364Q151R849J2486J5792J9543K3639K7863L1888L5444L8262M0042M0568
60487I38891L9654L6959L2118K5174J6561O641m353j5789k6484l5290m1624m5380
60475I27078m6680m5860m3362l9530l4866l0380k7080k4883k2679j9790j6828
60464E75140j4692j3268j1726r763p963p008o965p275p190o335n078m134l664
$$ y = [553530, 564797, 573239, 578197, 580523, 580978, 579331, 575249, 569388, 563090, 557230, 551752, 546341, 541338, 537775, 536427, 537005, 538691, 541430, 546156, 553479, 562613, 572127, 581489, 591278, 601991, 613183, 623881, 633368, 641319, 647449, 651371, 652787, 651695, 648316, 642902, 635850, 628172, 621562, 617429, 615630, 614518, 612512, 609455, 606374, 604273, 603425, 603480, 603865, 604232, 604802, 606140, 608405, 611120, 613941, 617332, 622043, 628194, 635364, 643515, 653364, 665850, 681642, 701185, 724824, 752687, 784575, 820019, 858281, 898323, 938891, 978545, 1015504, 1047622, 1072796, 1089357, 1095998, 1091645, 1075856, 1049372, 1014082, 972458, 927078, 880398, 834538, 791176, 751646, 716780, 686400, 659320, 634437, 611758, 591968, 575140, 560448, 547180, 535454, 525691, 517728, 510720, 503755, 496480, 489290, 482955, 477877, 473743, 470079]
60451D70079l156k424k094k592l152k705j460p24j085j731j793j514j555j849
60437D42245j839j460j132r63o87m38p61j694k425k387k139k548l340l226j508
60422D15698R75K828L567L769M033M190L605K099L71n78m81m0mk24l7O48J221
60405D41640J298J202J271J341J177R82R88J016P92N32O84J297J925K039J448
60390D59632N11P8P72K182L212L372L184L062K667J800J139J259J598J317O91
60375D86476O38J173J479J327J362J847K185J909J390J184J286J379J353J342
60361E06330J492J782J910J500P72O52J687L185M005L953L686L576L532L776M738
60346E46576O136P107P451P919R055J0466J1418J1566J0864R382P327M762J389
$$ y = [470079, 466923, 464499, 462405, 459813, 456661, 453956, 452496, 451772, 450687, 448956, 447163, 445649, 444094, 442245, 440406, 438946, 437814, 436851, 436164, 435726, 434965, 433271, 430846, 428459, 426320, 423772, 420432, 417206, 415698, 416673, 419501, 423068, 426837, 430870, 435060, 438665, 440764, 441135, 440557, 440076, 440036, 440032, 439808, 439771, 440419, 441640, 442938, 444140, 445411, 446752, 447929, 448911, 449899, 450915, 451707, 452239, 452923, 454220, 456145, 458184, 459632, 460143, 460221, 460993, 463175, 466387, 469759, 472943, 476005, 478672, 480472, 481611, 482870, 484468, 485785, 486476, 487114, 488287, 489766, 491093, 492455, 494302, 496487, 498396, 499786, 500970, 502256, 503635, 504988, 506330, 507822, 509604, 511514, 513014, 513786, 514438, 516125, 519310, 523315, 527268, 530954, 534530, 538062, 541838, 546576, 552712, 559819, 567270, 575189, 584244, 594710, 606128, 617694, 628558, 637940, 645267, 650029, 651418]
60333F51418k806o852r539j0750j1211j1150j0249q787p636o922n916m523l690
60320E51387l836m104l751l198l033k896k173j044oR25J945K930L874N205P087
60305E49312Q916J0082J0745J1438J2418J3862J5950J8239J9501J8853J6555J3398
60293G19269R879O331L080J1l262o375q219q486q265q488q761q570q556r510j0948
60278F49130j1781j1873j1818j1765j1517j1250j1132j0591r089p244o083n605
60266E29382n089m476m282m379m020l094k272j873j519r47l31K15O82Q07M23M0
60250D99267L10J010J396J360J389J492J221O87N75J066J553J579J299R20M22
60235E15546r3m24o28p60m60N03J523J930K194L226M642M996L904K645K302K506
$$ y = [651418, 648612, 641760, 632221, 621471, 610260, 599110, 588861, 580074, 572438, 565516, 559600, 555077, 551387, 547551, 543447, 539696, 536498, 533465, 530569, 528396, 527352, 527346, 528271, 530216, 533146, 537020, 542225, 549312, 558228, 568310, 579055, 590493, 602911, 616773, 632723, 650962, 670463, 689316, 705871, 719269, 729148, 735479, 738559, 738570, 735308, 728933, 720714, 712228, 703963, 695475, 686714, 678144, 669588, 660078, 649130, 637349, 625476, 613658, 601893, 590376, 579126, 567994, 557403, 548314, 541070, 534987, 529382, 524293, 519817, 515535, 511156, 507136, 504042, 501770, 499897, 498378, 497431, 497100, 497315, 497997, 498804, 499227, 499267, 499577, 500587, 501983, 503343, 504732, 506224, 507445, 508132, 508707, 509773, 511326, 512905, 514204, 515124, 515546, 515453, 515029, 514401, 513641, 513181, 513684, 515207, 517137, 519331, 522557, 527199, 532195, 536099, 538744, 541046, 543552]
60219E43552K487K272K235K409K850L841N127N843N753N822O741P778P890P367
60205F11967P313P938Q366P995P142O313N598M910M257L650L034K412J855J389
60191F84139J054R31R07N95k46j367k357l096l701m153m365m443m561m668m603
60176F50066m445m410m422m149l530l021l033l346l292k503j313l38J53M03P85
60161F13605J468K323K957K945K259J482J286J663J944J669J082O55N32O78J132
60146F37680J784K167J989J657J887K903M283N518O425P150P990R062J0056J0535
60132G11086J0514J0306R746Q296O180M566L944L134Q74k186m181m437l911l381
60118G50550k527j081K79Q21P63P19Q14Q40Q33R01Q50M35k56j000j801k766l764
$$ y = [543552, 546039, 548311, 550546, 552955, 555805, 559646, 564773, 570616, 576369, 582191, 588932, 596710, 604600, 611967, 619280, 627218, 635584, 643579, 650721, 657034, 662632, 667542, 671799, 675449, 678483, 680895, 682750, 684139, 685193, 686124, 687031, 687626, 687380, 686013, 683656, 680560, 676859, 672706, 668341, 663898, 659337, 654669, 650066, 645621, 641211, 636789, 632640, 629110, 626089, 623056, 619710, 616418, 613915, 612602, 612264, 612417, 612820, 613605, 615073, 617396, 620353, 623298, 625557, 627039, 628325, 629988, 631932, 633601, 634683, 635338, 635870, 636548, 637680, 639464, 641631, 643620, 645277, 647164, 650067, 654350, 659868, 666293, 673443, 681433, 690495, 700551, 711086, 721600, 731906, 741652, 749948, 756128, 760694, 764638, 767772, 768646, 766460, 762279, 757842, 753931, 750550, 748023, 746942, 747221, 748042, 748805, 749524, 750338, 751178, 752011, 752912, 753762, 754197, 753941, 752941, 751140, 748374, 744610]
60101G44610m539m938m861m268l427k922l113l670l894l398k345j065K90J632
60087G04092K698L214L428M132N732P468Q136P609O913O681O340N240L726K413
60073G77822J086p77k995n143p492j0368j2887j3702j2901j1981j1765j1601j0863
60060F66433j0056r780r621q819p377n901m808m234m204m383m103l132k058j508
60046E86449j239m66J080K804L863M013L919M515N933P267P690P476P332P107
60032F47743O026M066K071N17q39j975k399k332k965m922p358r263j0751j2302
60018F05317j3487j3443j2213j0698r477q415p238n902m488l194k284j722j137
60005E11619m37J5J46N78J736L058L670L548L349L445L740M222M954N581N465
$$ y = [744610, 740071, 735133, 730272, 726004, 722577, 719655, 716542, 712872, 708978, 705580, 703235, 702170, 702460, 704092, 706790, 710004, 713432, 717564, 723296, 730764, 738900, 746509, 753422, 760103, 766443, 771683, 775409, 777822, 778908, 778131, 775136, 769993, 762501, 752133, 739246, 725544, 712643, 700662, 688897, 677296, 666433, 656377, 646597, 636976, 628157, 620780, 614879, 610071, 605837, 601633, 597250, 593147, 590015, 587957, 586449, 585210, 584744, 585824, 588628, 592491, 596504, 600423, 604938, 610871, 618138, 625828, 633304, 640636, 647743, 653769, 657835, 659906, 660423, 659584, 657609, 655210, 652878, 649913, 644991, 637633, 628370, 617619, 605317, 591830, 578387, 566174, 555476, 545999, 537584, 530346, 524444, 519956, 516762, 514478, 512756, 511619, 511182, 511197, 511343, 511921, 513657, 516715, 520385, 523933, 527282, 530727, 534467, 538689, 543643, 549224, 554689]
59990E54689M478L274K693L028L856M400M207L587L137K928K558J994J683J560
59976E98072P92j036l143m583n374n896n866m901l635l108l238k944j761l22Q27
59961E53884J838K749L062K609K109K225K646K616K014J362J018Q29M04n01j738
59946E77126k620k309p42J033J771J263L39k91p71j614k859l989m611m885n179
59931E51662n478n313m349k907j752j376j579j796j661j164m21M68J267J660J608
59916E28869J498J715K228K811L470M277M940N083M971N303O161O788O646O138
59902E90898N795N406M572L635L320L701M240M629M905M920M401L516K739K223
59888F48900J900K022K839L890M381M305M358M751M945M654M303M261M438M786
$$ y = [554689, 559167, 562441, 565134, 568162, 572018, 576418, 580625, 584212, 587349, 590277, 592835, 594829, 596512, 598072, 598864, 597828, 594685, 590102, 584728, 578832, 572966, 568065, 564430, 561322, 558084, 555140, 553379, 553057, 553884, 555722, 558471, 561533, 564142, 566251, 568476, 571122, 573738, 575752, 577114, 578132, 578961, 579365, 578864, 577126, 574506, 572197, 571455, 572488, 574259, 575522, 575861, 575570, 574799, 573185, 570326, 566337, 561726, 556841, 551662, 546184, 540871, 536522, 533615, 531863, 530487, 528908, 527112, 525451, 524287, 523866, 524334, 525601, 527261, 528869, 530367, 532082, 534310, 537121, 540591, 544868, 549808, 554891, 559862, 565165, 571326, 578114, 584760, 590898, 596693, 602099, 606671, 610306, 613626, 617327, 621567, 626196, 631101, 636021, 640422, 643938, 646677, 648900, 650800, 652822, 655661, 659551, 663932, 668237, 672595, 677346, 682291, 686945, 691248, 695509, 699947, 704733]
59874G04733N452O097N845M304J991m94l021n454p403q796r936j0686j0373q969
59860F63290p560p087p278p322o971o384n473m086k418q04O18J727K484L345M925
59845F21006O951Q340Q699Q864R467R920R518Q540P440N798L219M83j230j741
59831G05274j465k88J958M246M921L398L70l442p640j1394j3614j4062j3499j2589
59817F42174j1535j0685j0518j0804j0582r319p398n400l570k154j510j584j785
59804E55330j599r56NJ016J492R30l64j449j778j629j529j798k626l906m828m396
59788E31915k701j135r72k065l255l691l374k735k132j713j448j239r96p06m21
59773E03332k68l01l19O2R31J915K622L092L570M064M342M294M030L790L795M070
$$ y = [704733, 710185, 716282, 722127, 726431, 728422, 727928, 724907, 719453, 712050, 703254, 693318, 682632, 672259, 663290, 655730, 648643, 641365, 634043, 627072, 620688, 615215, 611129, 608711, 607907, 608525, 610252, 612736, 616081, 621006, 627957, 636297, 644996, 653860, 663327, 673247, 682765, 691305, 698745, 704543, 707762, 708245, 707015, 705274, 703809, 703521, 705479, 709725, 714646, 718044, 718414, 714972, 707332, 695938, 682324, 668262, 654763, 642174, 630639, 619954, 609436, 598632, 588050, 578731, 571333, 565933, 562363, 560209, 558699, 557115, 555330, 553731, 552775, 552780, 553796, 555288, 556218, 555854, 554405, 552627, 550998, 549469, 547671, 545045, 541139, 536311, 531915, 529214, 528079, 527107, 525042, 521787, 518096, 514722, 511987, 509855, 508142, 506694, 505455, 504459, 503753, 503332, 503064, 502763, 502444, 502506, 503437, 505352, 507974, 511066, 514636, 518700, 523042, 527336, 531366, 535156, 538951, 543021]
59757E43021M326M295M226M606N318N650N384N185N569O118O282O312O711P191
59743F20194P019O052M850L914L390L246L182K675J616N81n3p01j703k440k193
59728F49629j366r12q50n14P4J83k15k50M94J338J532J145O27J51l22q10j291
59711F48643j569j234j87R35J396J195P70K43l48n40q2K89k36j169j400r81r04
59694F44821j194p95M18J126N84k25k07K87L79J12PO4J03L77R55J079J39j231
59676F46799j940j942k069k682l363l850m375n047n540n602n396n218n120m936
59662E89719m468l701k883k282j800j080m8R27J533J859K149K477K839L159L129
59647E91529K469J507J058J399J773J259k21j994l387m053l924l244k559k271
$$ y = [543021, 547347, 551642, 555868, 560474, 565792, 571442, 576826, 582011, 587580, 593698, 599980, 606292, 613003, 620194, 627213, 633265, 638115, 642029, 645419, 648665, 651847, 654522, 656138, 656719, 656666, 655965, 654262, 651822, 649629, 648263, 647351, 646501, 645987, 646061, 646244, 646029, 645779, 646273, 647611, 649143, 650288, 650915, 651066, 650744, 649934, 648643, 647074, 645840, 645653, 646588, 647984, 649179, 649949, 650192, 649844, 649304, 649222, 649511, 649275, 648106, 646706, 645725, 644821, 643627, 642832, 643250, 644376, 644960, 644735, 644528, 644815, 645194, 645306, 645313, 645377, 645480, 645857, 646812, 647891, 648030, 646799, 644859, 642917, 640848, 638166, 634803, 630953, 626578, 621531, 615991, 610389, 604993, 599775, 594655, 589719, 585251, 581550, 578667, 576385, 574585, 573505, 573457, 574384, 575917, 577776, 579925, 582402, 585241, 588400, 591529, 593998, 595505, 596563, 597962, 599735, 600994, 600773, 598779, 595392, 591339, 587415, 584171, 581612, 579341]
59633E79341k267k099j445k96J052K106K451K061J239K83n97j184j423j604j938
59618E75680j997j122N14J848K072J381L72o59j514j718q98O67K242L350M025
59603E84243M490M729M433L363J837O26J01k74j230k604l514l527l082k702k405
59588E84484k038j666j385j108p85n74o70j177k089l137l794l803l512l271k855
59573E52620j996j159r92j238j123o69o01r23p47K26J145J396J475J975K520K444
59557E54353J852J373J288J403J386R67K29q1P48K199K840K144J141Q40J064J476
59541E75222K630M997P728R581J0596J1736J3258J4652J5943J7714J9450J9016
59529G22523J4611O990p72n589o402m255r44K254M755O300O858O728O194N114
$$ y = [579341, 577074, 574975, 573530, 573234, 574286, 576392, 578843, 580904, 582143, 582426, 581829, 580645, 579222, 577618, 575680, 573683, 572561, 573075, 574923, 576995, 578376, 578748, 578089, 576575, 574857, 573959, 574626, 576868, 580218, 584243, 588733, 593462, 597895, 601258, 603095, 603721, 603822, 603548, 602318, 599714, 596200, 592673, 589591, 586889, 584484, 582446, 580780, 579395, 578287, 577502, 576928, 576258, 575081, 572992, 569855, 566061, 562258, 558746, 555475, 552620, 550624, 549465, 548473, 547235, 546112, 545443, 544842, 543919, 543172, 543398, 544543, 545939, 547414, 549389, 551909, 554353, 556205, 557578, 558866, 560269, 561655, 562622, 562851, 562770, 563518, 565717, 568557, 570701, 571842, 572682, 573746, 575222, 577852, 582849, 590577, 600158, 610754, 622490, 635748, 650400, 666343, 684057, 703507, 722523, 737134, 744124, 743352, 737763, 731361, 727106, 726162, 728416, 733171, 739471, 746329, 753057, 759251, 764365]
59515G64365L180N71k117m617p073r438j1348j2624j3373j3559j3123j2536j2377
59502F55931j2268j1143q896o835o017n964n563m536l378k422j670j148q74p39
59488E84478p22p85m92O97K440L669M003M217M904N550N601N513N980O837P457
59473F39347P708P806P774P673P739P668O548M184J778N04J76J28N62J890L523
59458G05008M582N416P081R635J2087J3921J5513J7140J8531J9453J9779J9095
59446H67241J7101J4361J1815R594P025L650n54n744j1974j8329k3150k5297k4781
59433H20958k2327j9039j6111j4061j2333j0320q373o922n215k233J468M292O012
59420G15796Q034J1039J3937J5839J7542K0114K3056K4995K5438K4773K3249K1098
$$ y = [764365, 767545, 768116, 765999, 761382, 754309, 744871, 733523, 720899, 707526, 693967, 680844, 668308, 655931, 643663, 632520, 623624, 616789, 610772, 604808, 599245, 594709, 591331, 588909, 587239, 586091, 585217, 584478, 583756, 582971, 582479, 583176, 585616, 589285, 593288, 597505, 602409, 607959, 613560, 619073, 625053, 631890, 639347, 647055, 654861, 662635, 670308, 678047, 685715, 692263, 696447, 698225, 698729, 698905, 699033, 699595, 701485, 705008, 709590, 715006, 722087, 731722, 743809, 757730, 773243, 790383, 808914, 828367, 848146, 867241, 884342, 898703, 910518, 920112, 927137, 930787, 930233, 924489, 912515, 894186, 871036, 845739, 820958, 798631, 779592, 763481, 749420, 737087, 726767, 718394, 711472, 706257, 704024, 705492, 709784, 715796, 723830, 734869, 748806, 764645, 782187, 802301, 825357, 850352, 875790, 900563, 923812, 944910]
59408I44910J9154J7932J6007J0650P73j1319k1583k7356k8573k6595k2744j7910
59396H53346j2688p358k249J339J074m516j3899k3096k8656k9765k7548k3491
59384F82493j8958j5198j2668j0699q539o468n222m698m026k720j115K52J088
59371E93522J415J680K518L888M794M527L798L808M514M788M172L574M087N823
59357F46908Q095J0081J1307J1985J2998J4921J7226J8983K0271K2056K4652K7116
59345H46599K8441K8645K8362K7852K6905K5379K3444K1183J8197J3825P999J753
59333A098584l656q163j2739j7692k1965k4674k6395k8002k9121k8875k7591k6300
59321H43411k4911k2389j8758j5483j3498j2149j0554q883p604o433m872l216
$$ y = [944910, 964064, 981996, 998003, 1008653, 1009426, 998107, 976524, 949168, 920595, 894000, 871256, 853346, 840658, 833300, 831051, 832390, 833464, 828948, 815049, 791953, 763297, 733532, 705984, 682493, 663535, 648337, 635669, 624970, 616431, 609963, 604741, 600043, 596017, 593297, 592182, 592434, 593522, 594937, 596617, 599135, 603023, 607817, 612344, 616142, 619950, 624464, 629252, 633424, 636998, 641085, 646908, 655003, 665084, 676391, 688376, 701374, 716295, 733521, 752504, 772775, 794831, 819483, 846599, 875040, 903685, 932047, 959899, 986804, 1012183, 1035627, 1056810, 1075007, 1088832, 1096831, 1098584, 1094928, 1086765, 1074026, 1056334, 1034369, 1009695, 983300, 955298, 926177, 897302, 869711, 843411, 818500, 796111, 777353, 761870, 748372, 736223, 725669, 716786, 709182, 702749, 697877, 694661]
59309F94661k208j966j812j091K02J587K694L671M882O231P111P337P632Q708
59295G37639J0223J1361J2059J2862J3730J3809J2266Q630K660n017j2213j6362
59283H01647j6830j5228j3227j1020q220n172k565m38J747M297P144J0164J3151
59270G65450J5666J7409J8553J9422J9840J9045J6439J2319P816L893N41k833
59258I13560o356r597j2440j5192j7530j8372j7466j6109j5452j4857j3120j0543
59246G46526q472p270o163m865l820k909j303J135L536N331O778Q069R007R685
59232G55265J0371J0587R483P274N081L120L98l395p019r335j0657j1815j2972
59219G46386j3983j4976j5785j5635j4203j2266j0711r531q401p471o967o568
$$ y = [694661, 692453, 690487, 688675, 687584, 687786, 689373, 692067, 695738, 700620, 706851, 713962, 721299, 728931, 737639, 747862, 759223, 771282, 784144, 797874, 811683, 823949, 832579, 835239, 830222, 818009, 801647, 784817, 769589, 756362, 745342, 737122, 731950, 729385, 728947, 730694, 734991, 742135, 752299, 765450, 781116, 798525, 817078, 836500, 856340, 875385, 891824, 904143, 911959, 915852, 916393, 913560, 907204, 897607, 885167, 869975, 852445, 834073, 816607, 800498, 785046, 770189, 757069, 746526, 738054, 730784, 724621, 719756, 715936, 713027, 711724, 712859, 716395, 721726, 728504, 736573, 745580, 755265, 765636, 776223, 785706, 792980, 798061, 801181, 801579, 798184, 791165, 781830, 771173, 759358, 746386, 732403, 717427, 701642, 686007, 671804, 659538, 648827, 639296, 630895, 623424, 616457, 609889]
59207F09889n811m688l421k126r95l24l8K64P15J211J983L309M606M933M460M320
59191F18287M741M645L584K741L263M723O018O808P176O828N595M095L071K634
59177F84209K684L310M218M640M520M842O093P356P831Q210R500J1297J2470J2894
59163G84074J3295J3849J4054J3602J2403J0105O546K477j065l852o266q447j0373
59150H40402j2339j4493j6206j6772j6408j5807j5085j3934j2419j0849r202p503
59138F79385o364o258o621o488n781n003m165k931j647j049j069r31m21n5P3N87
59122F31262J724K838L362L614M252N447O887Q202R098R447R439R495R769R923
59108G24759R430Q115O424N196M938N238N196M504L730L336K991K199J158M67
$$ y = [609889, 604078, 599390, 595969, 593843, 592848, 592524, 592486, 592750, 593465, 594676, 596659, 599968, 604574, 609507, 613967, 618287, 623028, 627673, 631257, 633998, 637261, 641984, 648002, 654810, 661986, 668814, 674409, 678504, 681575, 684209, 686893, 690203, 694421, 699061, 703581, 708423, 714516, 721872, 729703, 737913, 747413, 758710, 771180, 784074, 797369, 811218, 825272, 838874, 851277, 861382, 867928, 870405, 869340, 865488, 859222, 850775, 840402, 828063, 813570, 797364, 780592, 764184, 748377, 733292, 719358, 706939, 696090, 686888, 679385, 673021, 666763, 660142, 653654, 647873, 642870, 638705, 635774, 634127, 633078, 632009, 631078, 630657, 630602, 630675, 631262, 632986, 635824, 639186, 642800, 647052, 652499, 659386, 667588, 676686, 686133, 695572, 705067, 714836, 724759, 734189, 742304, 748728, 753924, 758862, 764100, 769296, 773800, 777530, 780866, 783857, 786056, 787214, 787681]
59094G87681K28l5o60j485k080k111j611j026q46j089j444j898k803m206n688
59079G60927o991q308r722j0904j1562j1689j1269j0301r227q571q075p055n764
59066F41489n288n768n864m622k870j894j716j578j311j226j288j324j542k021
59052F03177k221j760j183j178j586j890k036k097j751j004o27j001j229m17Q64
59037E84061J512J643K131K907L090K614K468L271M629N898O785P270P679Q648
59023F44606J0355J2047J3041J3672J4459J4915J4190J2466J0602Q758O414L532
59011G79057N99k230m942o848p064n756l953k229n48R63K112L391N461P942R752
58996G75707J0582J1060J1564J1876J1929J1826J1251R842Q119O924N983M220
$$ y = [787681, 787909, 787874, 787214, 785729, 783649, 781538, 779927, 778901, 778055, 776966, 775522, 773624, 770821, 766615, 760927, 753936, 745628, 735906, 725002, 713440, 701751, 690482, 680181, 670954, 662383, 654308, 647253, 641489, 636201, 630433, 624569, 619947, 617077, 615183, 613467, 611889, 610578, 609352, 608064, 606740, 605198, 603177, 600956, 599196, 598013, 596835, 595249, 593359, 591323, 589226, 587475, 586471, 585844, 584843, 583614, 583197, 584061, 585573, 587216, 589347, 592254, 595344, 597958, 600426, 603697, 608326, 614224, 621009, 628279, 635958, 644606, 654961, 667008, 680049, 693721, 708180, 723095, 737285, 749751, 760353, 769111, 775525, 779057, 779656, 777426, 772484, 765636, 758572, 752816, 748863, 746634, 746086, 747049, 749161, 752552, 758013, 765955, 775707, 786289, 797349, 808913, 820789, 832718, 844544, 855795, 865637, 873756, 880680, 886663, 890883]
58984H90883J443j406l731n800p682q835r029q560p385n081k008O14K229L573
58970H39225N428P662R925J2347J4959J7169J8356J8570J8265J7850J7657J7719
58958A015132J7322J5386J1662P061K572j667o088j0959j6091k0843k4348k6124
58946I63015k6491k6021k4819k2859k0696j9021j7657j5779j3143j0296p653n192
58934G53388l118j957j738j768j495j066q99j157j740k371k719k742k725k766
58920G25127k581k210k273k860k971j871m03J83R1M90J591K598L286M216N514
58905G27927O756Q009R726J1618J2873J3558J4546J6087J7715J9484K1824K4129
58893I04252K5084K4712K4649K5950K7972K9791L1409L3094L4756L6492L8479
$$ y = [890883, 892326, 890920, 887189, 881389, 873707, 864872, 855843, 847283, 839898, 834817, 832809, 833423, 835652, 839225, 844653, 852315, 862240, 874587, 889546, 906715, 925071, 943641, 961906, 979756, 997413, 1015132, 1032454, 1047840, 1059502, 1066563, 1069135, 1067468, 1061380, 1050421, 1034330, 1013487, 989139, 963015, 936524, 910503, 885684, 862825, 842129, 823108, 805451, 789672, 776529, 766233, 758580, 753388, 750270, 748313, 746575, 744807, 743312, 742246, 741347, 740190, 738450, 736079, 733360, 730618, 727893, 725127, 722546, 720336, 718063, 715203, 712232, 710361, 709958, 710141, 710232, 710722, 712313, 714911, 718197, 722413, 727927, 734683, 742692, 752418, 764036, 776909, 790467, 805013, 821100, 838815, 858299, 880123, 904252, 929336, 954048, 978697, 1004647, 1032619, 1062410, 1093819, 1126913, 1161669, 1198161, 1236640]
58882A236640L9825L8778L4694K8662K1760J4010N618k184q543j4126j9933k5882
58870A349319l1338l6020l9541m0886l9459l6119l2398k9152k6498k4336k2364
58859I91208k0125j7686j5752j4650j3899j3089j2505j2357j2246j1866j1508
58848H35525j1329j0867r800q565p669p105o863p256q192q872q851q670q894r156
58834G13436q840q150p798p952q044p418n900m032k762k496k497j781m41P18J603
58819F47646K833M308N166N242N402O037O570O700O941P362P157O012M677L502
58805G25555J790n96k338k461j839j850k462k821k922l383m196m788n008n162
58791F87519n400n671n946n921n080l491j956r00J88J775L544N043O162O563N651
$$ y = [1236640, 1276465, 1315243, 1349937, 1378599, 1400359, 1414369, 1419987, 1417803, 1409260, 1395134, 1375201, 1349319, 1317981, 1281961, 1242420, 1201534, 1162075, 1125956, 1093558, 1064406, 1037908, 1013572, 991208, 971083, 953397, 937645, 922995, 909096, 896007, 883502, 871145, 858899, 847033, 835525, 824196, 813329, 803529, 794964, 787295, 780190, 773327, 766071, 757879, 749007, 740156, 731486, 722592, 713436, 704596, 696446, 688648, 680696, 672652, 665234, 659334, 655302, 652540, 650044, 647547, 645766, 645325, 646043, 647646, 650479, 654787, 659953, 665195, 670597, 676634, 683204, 689904, 696845, 704207, 711364, 717376, 722053, 725555, 727345, 726749, 724411, 721950, 720111, 718261, 715799, 712978, 710056, 706673, 702477, 697689, 692681, 687519, 682119, 676448, 670502, 664581, 659501, 656010, 654054, 653154, 653342, 655117, 658661, 663704, 669866, 676429, 682080]
58776F82080L707K028J276P59n9o27o93j280l039m806n098m199l451l269l147
58761F60182k980k980k788j902o73K34R69K094L475M563N363O111O431N816M633
58746F88548L672L057K576K624L746N500O771P140P108P125P194P272P307O995
58732G66635O143N196M896N565P010Q633R470Q779P137O174O636P465P403O643
58718H63785O136O097O204O536P321Q241Q942R644J0450J0587R347P138M706J891
58704I67025j822o047r823j2852j5463j7763j9695k1514k3309k4471k4506k3894
58692G65866k3273k2318k0380j7744j5244j3092j1053r296q105p155o081n365
58680F06760n620o412o771o529o143n567m355k637r75N10J987L245M102N064O700
$$ y = [682080, 685787, 687815, 689091, 689850, 689791, 689164, 688471, 687191, 684152, 679346, 674248, 670049, 666598, 663329, 660182, 657202, 654222, 651434, 649532, 648859, 649093, 650062, 652156, 655631, 660194, 665557, 671668, 678099, 683915, 688548, 692220, 695277, 697853, 700477, 704223, 709723, 716494, 723634, 730742, 737867, 745061, 752333, 759640, 766635, 772778, 777974, 782870, 788435, 795445, 804078, 813548, 822327, 829464, 835638, 842274, 849739, 857142, 863785, 869921, 876018, 882222, 888758, 896079, 904320, 913262, 922906, 933356, 943943, 953290, 960428, 965134, 967025, 965203, 959156, 949333, 936481, 921018, 903255, 883560, 862046, 838737, 814266, 789760, 765866, 742593, 720275, 699895, 682151, 666907, 653815, 642762, 633466, 625361, 618206, 612125, 606760, 601140, 594728, 587957, 581428, 575285, 569718, 565363, 562726, 561751, 562261, 564248, 567493, 571595, 576659, 583359]
58665E83359Q566R827J0616J1748J3249J4160J3717J1864Q785M764N90k729m712
58652F83804n494n417m997m840n164n579n792n935n956n424m449l909m098m027
58638F12723k831j001N74J866L180M290N063N985P103P381O207M539L401K341
58624F60821O97o78n26Q06K038K879L803M710N456O929R834J2957J4483J4542
58610G38751J4652J5014J4260J1722Q122M107k05m162o774q050q793r113q571
58597G60960p659p530q231q650q315p818p388o470m827k786l02K968O557R405
58583G09914J1190J2343J2961J2862J2551J2736J3059J2660J1746J1175J0684
58572H43881R212P022N838O632Q675J1055J3638J6277J8414J9937K1384K2964
$$ y = [583359, 591925, 601752, 612368, 624116, 637365, 651525, 665242, 677106, 685891, 690655, 691245, 688516, 683804, 678310, 672893, 667896, 663056, 657892, 652313, 646521, 640586, 634630, 629206, 624757, 620848, 616750, 612723, 609892, 608891, 609465, 611331, 614511, 618801, 623864, 629849, 636952, 644333, 650540, 655079, 658480, 660821, 661518, 660840, 660314, 661120, 663158, 666037, 669840, 674550, 680006, 686935, 696769, 709726, 724209, 738751, 753403, 768417, 782677, 794399, 802521, 806628, 806423, 802261, 795487, 787437, 778644, 769531, 760960, 753301, 745771, 737540, 728890, 720575, 712757, 705369, 698899, 694072, 691286, 690984, 693952, 700509, 709914, 721104, 733447, 746408, 759270, 771821, 784557, 797616, 810276, 822022, 833197, 843881, 853093, 860115, 865953, 872585, 881260, 892315, 905953, 922230, 940644, 960581, 981965, 1004929]
58560A004929K4305K5239K5839K5702K4222K1553J8189J3797P740Q06m926q259
58548A179136j0013j1719j3899j5747j5964j4147j1680j0658j1476j2532j2935
58537A038366j3955j6645j9654k1186k1608k2057k1760j9297j5560j2701j0760
58526H43183q119m863k780k064q38J648M017N385O463P514P592O513N400M635
58512H73686L381J627O40P03N03n88j592j973k590l920n207o070p064p956p444
58497H36136n460l901m149n477o618p304p533o944n668m417l174j319P56J860
58483G76788K167L209N312P105Q026R289J1585J3822J4990J5390J5286J4130J1845
58470I08944R082N678Q32m612q254r303r576j0458j1012j0095q275o452m410j946
$$ y = [1004929, 1029234, 1054473, 1080312, 1106014, 1130236, 1151789, 1169978, 1183775, 1191515, 1192321, 1187395, 1179136, 1169123, 1157404, 1143505, 1127758, 1111794, 1097647, 1085967, 1075309, 1063833, 1051301, 1038366, 1024411, 1007766, 988112, 966926, 945318, 923261, 901501, 882204, 866644, 853943, 843183, 835064, 830201, 827421, 825357, 824519, 826167, 830184, 835569, 842032, 849546, 857138, 863651, 869051, 873686, 877067, 878694, 879334, 880037, 880540, 879952, 878360, 876387, 873797, 869877, 864670, 858600, 851536, 843580, 836136, 830676, 826775, 822626, 817149, 810531, 803227, 795694, 788750, 783082, 778665, 775491, 774172, 774928, 776788, 778955, 782164, 787476, 794581, 802607, 811896, 823481, 837303, 852293, 867683, 882969, 897099, 908944, 918026, 923704, 924536, 919924, 911670, 902367, 892791, 882333, 871321, 861226, 852951, 846499, 842089, 840143]
58456H40143L37K286M605P139Q566Q626Q772R666R970Q531N851K518j780o587
58442I08643j0088j1379j1509j1353j0355q322o360m939l095n92J309K289L859
58429H38108O521Q426Q365P905Q832J0598J1905J2931J4200J5048J4834J4040
58417I71713J2703R656M713k06l572n988q109r101q723q774j0501j2491j3056
58404I18264j2783j2883j2822j1674j0141r241q403o698m608k911j259O11J816
58391H27268J939K020K656K843K073J568J994K066J008J80O15J177R50J097K334
58376H51788L017J924P11J188K356K593K727M213O208P082P318Q258R559J0295
58362I19237J1130J2965J4873J5662J6013J6899J7430J6481J4827J3427J1303
$$ y = [840143, 840480, 842766, 847371, 854510, 863076, 871702, 880474, 890140, 900110, 908641, 914492, 917010, 915230, 908643, 898555, 887176, 875667, 864314, 853959, 845637, 839277, 834338, 831243, 830651, 831960, 834249, 838108, 844629, 853055, 861420, 869325, 878157, 888755, 900660, 913591, 927791, 942839, 957673, 971713, 984416, 994072, 998785, 998579, 995007, 989019, 980910, 971809, 963086, 954312, 943811, 931320, 918264, 905481, 892598, 879776, 868102, 857961, 848720, 840317, 833619, 829011, 826100, 824841, 825452, 827268, 829207, 831227, 833883, 836726, 838799, 840367, 842361, 844427, 845435, 845615, 846230, 847407, 848357, 849454, 851788, 854805, 856729, 857440, 858628, 860984, 863577, 866304, 870517, 876725, 883807, 891125, 899383, 908942, 919237, 930367, 943332, 958205, 973867, 989880, 1006779, 1024209, 1040690, 1055517, 1068944, 1080247]
58351A080247P399K984j27k084l676m260l250j864j085K56L096N878P028P693
58337A098235R511J1620J2502J2823J3857J5024J5539J6462J8400J9365J7750
58326A261088J5329J4289J3429J0481O183K845N97j617l062k457o98O13J835L723
58312A322578N101M940M815O437Q767J0324J2009J4679J6494J5962J5108J6182
58300A453396J7777J7758J7384J8644K0049J9219J7283J6699J6998J6759J7287
58289A649253K0095K3111K3751K3409K4656K6435K6538K6233K7702K9477K9208
58278A929868K8412K9523L0841K9608K7518K7733K9020K8397K7099K8206L0720
58267B246945L1886L2982L6910M2333M6197M9631N5232O1049O3632O4412O6624
$$ y = [1080247, 1087646, 1090630, 1090503, 1088419, 1084743, 1080483, 1077233, 1075369, 1074284, 1074540, 1077636, 1083514, 1090542, 1098235, 1107746, 1119366, 1131868, 1144691, 1158548, 1173572, 1189111, 1205573, 1223973, 1243338, 1261088, 1276417, 1290706, 1304135, 1314616, 1320799, 1323644, 1324241, 1322624, 1319562, 1317105, 1316407, 1317020, 1318855, 1322578, 1327679, 1332619, 1337434, 1343871, 1352638, 1362962, 1374971, 1389650, 1406144, 1422106, 1437214, 1453396, 1471173, 1488931, 1506315, 1524959, 1545008, 1564227, 1581510, 1598209, 1615207, 1631966, 1649253, 1669348, 1692459, 1716210, 1739619, 1764275, 1790710, 1817248, 1843481, 1871183, 1900660, 1929868, 1958280, 1987803, 2018644, 2048252, 2075770, 2103503, 2132523, 2160920, 2188019, 2216225, 2246945, 2278831, 2311813, 2348723, 2391056, 2437253, 2486884, 2542116, 2603165, 2666797, 2731209, 2797833]
58256B797833O8713O7616O5591O6487O8185O6566O4087O6187P1768P5813P8944
58245C557790Q5404R3837R9337J02888J09351J17843J23661J28093J36406J47609
58235D702219J56247J63013J73332J86718J98160K08729K24032K43274K60942
58226F516666K78089L00535L27236L52327L77279M08644M45397M81641N20069
58217A0007883N68803O26574O85904P49318Q26643R18076J017096J128794J267149
58208A7796240J435454J629018J856364K137384K482503K897399L407899M054604
58200C7696865M861257N832987O984213Q340004R913680J1716871J3782814J6125584
58192A15254275J8663660K1228393K3662423K5881238K7860377K9608521L1036440
$$ y = [2797833, 2866546, 2934162, 2999753, 3066240, 3134425, 3200991, 3265078, 3331265, 3403033, 3478846, 3557790, 3643194, 3737031, 3836368, 3939256, 4048607, 4166450, 4290111, 4418204, 4554610, 4702219, 4858466, 5021479, 5194811, 5381529, 5579689, 5788418, 6012450, 6255724, 6516666, 6794755, 7095290, 7422526, 7774853, 8152132, 8560776, 9006173, 9487814, 10007883, 10576686, 11203260, 11889164, 12638482, 13465125, 14383201, 15400297, 16529091, 17796240, 19231694, 20860712, 22717076, 24854460, 27336963, 30234362, 33642261, 37696865, 42558122, 48391109, 55375322, 63715326, 73629006, 85345877, 99128691, 115254275, 133917935, 155146328, 178808751, 204689989, 232550366, 262158887, 293195327]
58185B93195327L1572163K9818111K3972093J3186564j190417j5863703k7367734
58178C47322404l3869282l5578145l3853520l0164775k5690222k1373038j7925912
58171A48867510j5662301j4399234j3619604j2808574j1719941j0402128r029363
58164F1226365p733742o568992n556806m707358m005211l417627k924178k518873
58156B3793578k187487j906312j663006j458420j287999j139715j010033r04036
58148A2236570q18942p43511o74235o16687n70096n25344m79494m38529m04140
58139F965592l70698l36787l07428k83255k58985k34183k14580k01280j89220
58130D569176j77574j71132j69703j66305j57877j48526j40474j30965j19873
$$ y = [293195327, 324767490, 354585601, 378557694, 391744258, 390553841, 374690138, 347322404, 313453122, 277874977, 244021457, 213856682, 188166460, 166793422, 148867510, 133205209, 118805975, 105186371, 92377797, 80657856, 70255728, 61226365, 53492623, 46923631, 41366825, 36659467, 32654256, 29236629, 26312451, 23793578, 21606091, 19699779, 18036773, 16578353, 15290354, 14150639, 13140606, 12236570, 11417628, 10674117, 9999882, 9383195, 8813099, 8287755, 7808261, 7369732, 6965592, 6594894, 6258107, 5950679, 5667424, 5408439, 5174256, 4959676, 4758396, 4569176, 4391602, 4220470, 4050767, 3884462, 3726585, 3578059, 3437585, 3306620, 3186747]
58121C186747j11417j06284j00251r2436q6875q4417q0982p5396p1162o8923o4943
58110B243661n8729n4494n3221n0802m6004m2903m3237m3545m2227m2507m5740
58099A720252m8392m8320m8063m9179m9121m6322m3003m0466l6790l1405k6925
58088A252266k4407k1696j8246j6536j6942j6456j4315j3691j5757j7303j6436
58077A060481j5556j6307j6574j4995j3801j4457j4908j3712j2757j3293j3364
58066I00757j1692j0224j0314j0121q338o887p358q108p417o407o561p221p606
58053G92503q463r930j0510r840r556j0097r705p885o496o209n372l806l944o406
58039F84284q229p444n973n891o268n842n480n800n550m527m902p503r836j0004
$$ y = [3186747, 3075330, 2969046, 2868795, 2776359, 2689484, 2605067, 2524085, 2448689, 2377527, 2308604, 2243661, 2184932, 2130438, 2077217, 2026415, 1980411, 1937508, 1894271, 1850726, 1808499, 1765992, 1720252, 1671860, 1623540, 1575477, 1526298, 1477177, 1430855, 1387852, 1347386, 1310596, 1279191, 1252266, 1227859, 1206163, 1187917, 1171381, 1154439, 1137983, 1123668, 1109977, 1094220, 1076917, 1060481, 1044925, 1028618, 1012044, 997049, 983248, 968791, 953883, 940171, 927414, 914121, 900757, 889065, 878841, 868527, 858406, 850068, 843181, 835823, 827715, 820298, 813891, 807330, 800109, 792503, 784040, 774110, 763600, 753760, 744204, 734107, 724402, 716517, 710021, 703812, 698440, 694634, 690690, 684284, 676055, 668611, 662638, 656747, 650479, 644637, 639157, 633357, 627807, 623280, 618378, 610875, 601039, 591035]
58025E91035r464r754r739q451p538q202q659p294n633n434n519m318l052l469
58011D94509m613m641l963l843l745k654j368r88p46L80J415R98k62j038j448
57996D67993k007k116j419j090j825k218j033O33J281J441K161K746K132J022
57982D67701P14R84R47P38Q14Q38O04O68R06K31j121j187N04J659Q48j32N67J734
57964D78017J568R39J509K619K799K714L780N189N135L805K690J863M29j278k310
57949E09468k964l910m434l709k739k827l167k248o94k82r36r70J82J662L005
57934D85437M286N060N093N450O949Q268P562N237L129J668j1j796k651k672k999
57919E28010l880m548m831n240n749n928n954o111n873m772l536l005k740k091
$$ y = [591035, 581571, 571817, 562078, 553627, 546089, 537887, 529228, 521934, 516301, 510867, 505348, 501030, 497978, 494509, 489896, 485255, 481292, 477449, 473704, 471050, 469682, 468694, 467948, 468328, 469743, 470741, 470479, 469441, 467993, 465986, 463870, 462451, 461361, 459536, 457318, 456285, 456918, 458199, 459640, 461801, 464547, 466679, 467701, 468415, 469399, 470346, 471084, 471898, 472736, 473340, 474008, 474914, 475145, 474024, 472837, 473341, 475000, 475848, 475716, 476283, 478017, 479585, 480524, 482033, 484652, 487451, 490165, 493945, 499134, 504269, 508074, 510764, 512627, 513056, 511778, 509468, 506504, 502594, 498160, 494451, 491712, 488885, 485718, 483470, 482776, 482494, 481558, 480588, 480770, 482432, 485437, 489723, 494783, 499876, 505326, 512275, 520543, 528105, 533342, 536471, 538139, 538128, 536332, 533681, 531009, 528010, 524130, 519582, 514751, 509511, 503762, 497834, 491880, 485769, 479896, 475124, 471588, 468583, 465843, 463752]
57905D63752j610j875k015j248p43j931l935m813m554m686n524o117o359o875
57891D11467p142n989l806k249j886j968k232k972l546k860j330n01q37j432j746
57876C70971j912j700r58p07j888l407l459k417k246l265l813l180k508k530k570
57861C34411k234k037j875p94J146K535K700K626L238M285N293O162O503N838
57847C67797M751M412M751M662M054L961M420M191L011K213K371K243R66l96n37
57832D12870K09P41Q47R30J035J024R83Q58L68k87m74j84j04l90m14l3k7q24j864
57813D15264k602l143l545l556l371l556l956l819l326l742n486p346q142p990
57799C51684p313n941m009k583k408k857k943k642k405k152j496m63O09J428J650
$$ y = [463752, 462142, 460267, 458252, 457004, 456261, 454330, 450395, 445582, 441028, 436342, 430818, 424701, 418342, 411467, 404325, 398336, 394530, 392281, 390395, 388427, 386195, 383223, 379677, 376817, 375487, 374986, 374149, 372717, 370971, 369059, 367359, 366401, 365694, 363806, 360399, 356940, 354523, 352277, 349012, 345199, 342019, 339511, 336981, 334411, 332177, 330140, 328265, 327471, 328617, 331152, 333852, 336478, 339716, 344001, 349294, 355456, 361959, 367797, 372548, 376960, 381711, 386373, 390427, 394388, 398808, 402999, 406010, 408223, 410594, 412837, 413803, 413407, 412870, 413079, 413820, 414667, 415597, 416632, 417656, 418639, 419497, 419865, 419578, 419104, 418920, 418816, 418426, 418012, 417979, 417952, 417128, 415264, 412662, 409519, 405974, 402418, 399047, 395491, 391535, 387716, 384390, 380648, 375162, 367816, 359674, 351684, 344371, 338430, 334421, 331838, 329430, 326573, 323630, 320988, 318583, 316431, 314935, 314472, 315081, 316509, 318159]
57784C18159J118N04Q83K257L429L714L842M550N359N484N023M418L524K228J252
57769C65744J296J806J561K96j113j947k399k994l916n000o016o799p207p090
57755C26222o381n373m675m577m598m105l167k284j521o16J85L60J24K89Q56P40
57739B91479o31k292k893k298j480j260j630k021j837r70OL58N6k31M5Q04J633
57722B76838K104J858Q73k63q49q25o92p41r33j403k328l311l569k892j887j220
57706B60760j058j252j515j516j271j304j863k260j701n37J42j9l87l86J2O74
57690B46519J281J135l5j255j312l77M06P95J585K965M181N070O561R182J2273
57675B88974J5148J8027K1363K5234K9781L5181M0776M5298M8451N1318N4538
$$ y = [318159, 319277, 319781, 320664, 322921, 326350, 330064, 333906, 338456, 343815, 349299, 354322, 358740, 362264, 364492, 365744, 367040, 368846, 370407, 370703, 369590, 367643, 365244, 362250, 358334, 353334, 347318, 340519, 333312, 326222, 319841, 314468, 309793, 305216, 300618, 296513, 293346, 291062, 289541, 288925, 289110, 289470, 289594, 289883, 290739, 291479, 290848, 288556, 285663, 283365, 281885, 280625, 278995, 276974, 275137, 274167, 274173, 274531, 274587, 274356, 274401, 275205, 276838, 278942, 280800, 281673, 281410, 280561, 279736, 279044, 278303, 277370, 275967, 273639, 270328, 266759, 263867, 261980, 260760, 259702, 258450, 256935, 255419, 254148, 252844, 250981, 248721, 247020, 246483, 246625, 246606, 246219, 245833, 245845, 246519, 247800, 248935, 248900, 247645, 246333, 245956, 246362, 247157, 248742, 251707, 255888, 260958, 267519, 276701, 288974, 304122, 322149, 343512, 368746, 398527, 433708, 474484, 519782, 568233, 619551, 674089]
57664F74089N6709N4847M5876K8055K646k5144m8298o2265o7016o5164n9324n1529
57652D83482m3514l6248k9730k3972j9412j6067j3173j0298p926o375n134l797
57640B67836k824k626k804k864k844k676j926p35r1m40q89o03j1Q4k68n93q76
57623B44850j157j118p95r54j941k932l109k774k539k251j645j220j478j939j832
57608B17166j226n84J01Q71J178O31j51l85k85n09r32r48n41k53m24j095k235
57591B10379l384l653k772j625j108j087j108j355k062k697k639k091j520q08
57577A82470J61P64M62k27m77l39l68o31r92j662k597k993k355j389r01o17q4
57560A68225J56m47j129q84j23J25K3L82Q93O74J09M39J647K428K281J951J808
$$ y = [674089, 730798, 785645, 831521, 859576, 862222, 837078, 788780, 726515, 659499, 594335, 535011, 483482, 439968, 403720, 373990, 350018, 330606, 314539, 301366, 291068, 283142, 276767, 271633, 267836, 265012, 262386, 259582, 256718, 253874, 251198, 249272, 248537, 248446, 248006, 247117, 246514, 246503, 246587, 246319, 245726, 244850, 243693, 242575, 241780, 240826, 238885, 235953, 232844, 230070, 227531, 225280, 223635, 222415, 220937, 218998, 217166, 215940, 215356, 215457, 216328, 217506, 218137, 217986, 217601, 217316, 216807, 215875, 214927, 214386, 214133, 213709, 212614, 210379, 206995, 203342, 200570, 198945, 197837, 196750, 195642, 194287, 192225, 189528, 186889, 184798, 183278, 182470, 182631, 183395, 183857, 183630, 183153, 182814, 182446, 181815, 180823, 179161, 176564, 173571, 171216, 169827, 168926, 168309, 168225, 168381, 167934, 166805, 165921, 165798, 165923, 165946, 166328, 167221, 167895, 168004, 168443, 170090, 172518, 174799, 176750, 178558]
57543A78558J321L87m11r87j845k671k358q48M41N18l6l26l91n80p69q16r39j151
57525A67097j056o24l92m72j87Q11J846K099J681J314J485K096K593K344J392
57510A82027P42J245K253K293J079j06k26K85M50Qo97j311j596j455j235j446
57494A82310k007k311k160j983k009j970j792j806k009j888j275p40p00q35p07
57479A58118l96j42J02M37P67R76R62M09r21k537l503l514l105k706k146j278
57463A41523l99K61P69J012O44j71o52l71J58K25k56q94j328j320p93J4O77J026
57445A40125J105Q26K50j3N63J444J566Q71M21P61J140P42j28o31n21k24k13o27
57427A47457j141j052kJ364K032J837J354P18l89j612j946j218m28j93K0O68J246
$$ y = [178558, 179879, 180266, 179855, 178868, 177023, 174352, 171994, 171146, 171587, 172105, 172069, 171743, 171352, 170772, 170003, 169187, 168248, 167097, 166041, 165417, 165025, 164553, 164366, 165177, 167023, 169122, 170803, 172117, 173602, 175698, 178291, 180635, 182027, 182769, 184014, 186267, 188560, 189639, 189533, 189307, 189592, 190042, 190050, 189353, 188042, 186446, 184991, 183756, 182310, 180303, 177992, 175832, 173849, 171840, 169870, 168078, 166272, 164263, 162375, 161100, 160360, 159660, 158825, 158118, 157722, 157580, 157682, 158119, 158886, 159862, 160824, 161233, 160312, 157775, 154272, 150758, 147653, 144947, 142801, 141523, 141124, 141385, 142154, 143166, 143810, 143639, 142987, 142616, 142774, 142999, 142743, 141849, 140521, 139201, 138408, 138422, 139099, 140125, 141230, 142056, 142306, 142293, 142856, 144300, 145866, 146737, 147158, 147919, 149059, 149801, 149673, 149042, 148521, 148297, 148084, 147457, 146316, 145264, 145262, 146626, 148658, 150495, 151849, 152567, 152178, 150566, 148620, 147402, 146974, 146781, 146801, 147469, 148715]
57410A48715J286J181J276J096K77o06r50j055j260j041M9J247J501J002O91P68
57394A54177P41O44J017J764K141J858J424J312J559K138K949L488L252K557K264
57379A83285K562K705K098J065K63j80o43j348k080k414k178j637j299j425j851
57364A76923k241k330j932j040j5O36Q92J276K082K855K892K007O50m43o24J87
57348A81775J255J652J388J383K082K677K164P76k71j92O32J206R38J39k73J74
57332A97505Q03N80l93q42n6J132J566J280J143J472J784J672J266R05P94R17
57316B11528J037R54Q74J172J634J584R35M95P09R01M10k59j96M85R54J010J228
57299B25455J925K806L543M004M008L507K945K826L004L022K940L187L669L793
$$ y = [148715, 150001, 151182, 152458, 153554, 153831, 153225, 152275, 151220, 149960, 148919, 148968, 150215, 151716, 152718, 153409, 154177, 154918, 155562, 156579, 158343, 160484, 162342, 163766, 165078, 166637, 168775, 171724, 175212, 178464, 181021, 183285, 185847, 188552, 190650, 191715, 191978, 191798, 191155, 189807, 187727, 185313, 183135, 181498, 180199, 178774, 176923, 174682, 172352, 170420, 169380, 169365, 170001, 170893, 172169, 174251, 177106, 179998, 182005, 182655, 182212, 181588, 181775, 183030, 184682, 186070, 187453, 189535, 192212, 194376, 195152, 194881, 194689, 195321, 196527, 197465, 197604, 197331, 197505, 198308, 198888, 198495, 197653, 197597, 198729, 200295, 201575, 202718, 204190, 205974, 207646, 208912, 209817, 210611, 211528, 212565, 213519, 214393, 215565, 217199, 218783, 219718, 220213, 220922, 221823, 222233, 221974, 221778, 222263, 223217, 224227, 225455, 227380, 230186, 233729, 237733, 241741, 245248, 248193, 251019, 254023, 257045, 259985, 263172, 266841, 270634]
57285B70634L393K963K924L204L614M081M417M305L740L086K660K545K720L044
57271C17330L128K670J901J396J507K176L103L841L985L655L589M248N111N331
57257C62971M899M607M962N753O546P116P361P333P351P650P954P783P233P007
57243D56526P659R082J0606J1473J1425J1053J1310J2305J3061J2840J2235J2281
57231E91856J2979J3479J3452J3410J3755J4350J5001J5686J6280J6688J7149
57220G54085J7834J8331J8206J7853J7967J8365J8334J7930J7860J8028J7481
57209I52274J6080J5018J5030J5253J4640J3618J3360J3990J4520J4314J3839
57198A111936J3942J4944J6450J7765J8539J9136K0105K1246K1679K1083K0306
$$ y = [270634, 274027, 276990, 279914, 283118, 286732, 290813, 295230, 299535, 303275, 306361, 309021, 311566, 314286, 317330, 320458, 323128, 325029, 326425, 327932, 330108, 333211, 337052, 341037, 344692, 348281, 352529, 357640, 362971, 367870, 372477, 377439, 383192, 389738, 396854, 404215, 411548, 418899, 426549, 434503, 442286, 449519, 456526, 464185, 473267, 483873, 495346, 506771, 517824, 529134, 541439, 554500, 567340, 579575, 591856, 604835, 618314, 631766, 645176, 658931, 673281, 688282, 703968, 720248, 736936, 754085, 771919, 790250, 808456, 826309, 844276, 862641, 880975, 898905, 916765, 934793, 952274, 968354, 983372, 998402, 1013655, 1028295, 1041913, 1055273, 1069263, 1083783, 1098097, 1111936, 1125878, 1140822, 1157272, 1175037, 1193576, 1212712, 1232817, 1254063, 1275742, 1296825, 1317131]
57187A317131K0301K0956K1490K1567K1423K1225K0901K0551K0342K0133J9692
57176A545712J9248J9320J9894K0310K0159J9857K0054K0750K1307K1308K1090
57165A769009K1378K2557K4334K6054K7212K7747K8018K8597K9893L1910L4227
57154B070936L6253L7522L7903L7728L7611L7811L7865L7230L6213L5745L6076
57143B478893L6419L6206L6006L6539L7410L7692L7401L7382L7823L7944L7309
57132B887024L6555L6450L7020L7953L9276M1215M3913M7711N3213O0634O9524
57121C390488P9425R0378J02339J14613J26452J37961J49845J62487J75753J89643
57111D719384K04689K21887K42596K68468L01018L41285L90311M50025N23495
$$ y = [1317131, 1337432, 1358388, 1379878, 1401445, 1422868, 1444093, 1464994, 1485545, 1505887, 1526020, 1545712, 1564960, 1584280, 1604174, 1624484, 1644643, 1664500, 1684554, 1705304, 1726611, 1747919, 1769009, 1790387, 1812944, 1837278, 1863332, 1890544, 1918291, 1946309, 1974906, 2004799, 2036709, 2070936, 2107189, 2144711, 2182614, 2220342, 2257953, 2295764, 2333629, 2370859, 2407072, 2442817, 2478893, 2515312, 2551518, 2587524, 2624063, 2661473, 2699165, 2736566, 2773948, 2811771, 2849715, 2887024, 2923579, 2960029, 2997049, 3035002, 3074278, 3115493, 3159406, 3207117, 3260330, 3320964, 3390488, 3469913, 3560291, 3662630, 3777243, 3903695, 4041656, 4191501, 4353988, 4529741, 4719384, 4924073, 5145960, 5388556, 5657024, 5958042, 6299327, 6689638, 7139663, 7663158]
57102G663158O14541P27551Q67658J040618J252139J507250J809606K160288K556522
57093B0199331K991659L456484L940128M429405M908000N357795N762401O110028
57085E7155231O391775O593038O680403O593111O251371N585522M572632L256401
57077A03079484J736403J35795j430165k870345m120554n141169n913513o435110
57069G9040826o715302o773111o636502o340532n924251n427754m889518m343049
57061C1990807l813849l318888k868660k469319k123299j829156j582053j374963
57053A2610620j200286j051446r23759q14123p20131o39600n70468n10611m57770
57044E722426m10205l67287l29029k95121k64923k38176k14957j94798j76601
$$ y = [7663158, 8277699, 9005250, 9872908, 10913526, 12165665, 13672915, 15482521, 17642809, 20199331, 23190990, 26647474, 30587602, 35017007, 39925007, 45282802, 51045203, 57155231, 63547006, 70140044, 76820447, 83413558, 89664929, 95250451, 99823083, 103079484, 104815887, 104951682, 103521517, 100651172, 96530618, 91389449, 85475936, 79040826, 72325524, 65552413, 58915911, 52575379, 46651128, 41223374, 36333856, 31990807, 28176958, 24858070, 21989410, 19520091, 17396792, 15567636, 13985583, 12610620, 11410334, 10358888, 9435129, 8621006, 7900875, 7261275, 6690807, 6180196, 5722426, 5312221, 4944934, 4615905, 4320784, 4055861, 3817685, 3602728, 3407930, 3231329]
57035C231329j59707j44432j31135j19182j07423r5384q3379p1521n9227m5986
57025B213953l2142j8575n854N955J6993K7685L8442M7535M8684L3120k968n2437
57013B320391j00269j33584j48382j47803j36918j20456j02864q7283p4228o2762
57003A205842n2710m4664l8497l3470k9539k7099k5636k4098k2473k1587k1395
56992H64674k0999k0368k0401k0897k0146j7222j3363j0237p916n482k790p99
56980G04054p21l327q499j4824k0166k3149k3783k2617k0032j6588j3204j0432
56968E26712q138o003l773q93L061P360J0532J2140J3192J4448J5470J5930J6481
56955F16519J7290J6623J2207L665p084j7454k5383k9654l0138k7842k4111j9817
$$ y = [3231329, 3071622, 2927190, 2796055, 2676873, 2569450, 2474066, 2390687, 2319166, 2259939, 2213953, 2181811, 2163236, 2157382, 2163337, 2180330, 2208015, 2246457, 2293992, 2342676, 2375796, 2372828, 2320391, 2220122, 2086538, 1938156, 1790353, 1653435, 1532979, 1430115, 1342832, 1268604, 1205842, 1153132, 1108468, 1069971, 1036501, 1006962, 979863, 954227, 930129, 907656, 886069, 864674, 843675, 823307, 802906, 782009, 761863, 744641, 731278, 721041, 713125, 707643, 704853, 704054, 703333, 700006, 691507, 676683, 656517, 633368, 609585, 586968, 566936, 550348, 537144, 526712, 518574, 512571, 508798, 507905, 510966, 518326, 528858, 540998, 554190, 568638, 584108, 600038, 616519, 633809, 650432, 662639, 666304, 659220, 641766, 616383, 586729, 556591, 528749, 504638, 484821]
56943D84821j5475j1602q398n410k084J633N460R222J2808J6089J9144K2111K4704
56930E53023K6240K6168K3835J7886P229o891k0859l1392l7541l9730l8368l4336
56918D45264k9625k5882k2873j9452j5603j2336j0105q440p048o168n887n879
56906B75966n776n293m252k965k152j910j363J2J393J857J937K940N105P593R933
56891B83025J2360J4858J6989J8681K0320K1995K3340K3883K2916J9324J2604
56880D90295L996m231j0570j4689j6442j5648j2848r264n636j791K506O953J1165
56867D23796J5133J9142K3529K8501L3726L8273M1469M3606M5297M6209M4796
56856H03477L9006K7139R071j2303l1405m3282m6896m4667l9340l2244k4046j5509
$$ y = [484821, 469346, 457744, 449346, 443936, 441852, 443485, 448945, 458167, 470975, 487064, 506208, 528319, 553023, 579263, 605431, 629266, 647152, 654381, 647490, 626631, 595239, 557698, 517968, 479600, 445264, 415639, 389757, 366884, 347432, 331829, 319493, 309388, 300948, 293900, 287732, 281845, 275966, 270190, 264897, 260645, 257680, 255528, 253618, 252255, 252267, 253660, 255517, 257454, 260394, 265499, 273092, 283025, 295385, 310243, 327232, 345913, 366233, 388228, 411568, 435451, 458367, 477691, 490295, 494291, 490060, 479490, 464801, 448359, 432711, 419863, 410599, 404963, 403172, 405678, 412631, 423796, 438929, 458071, 481600, 510101, 543827, 582100, 623569, 667175, 712472, 758681, 803477, 842483, 869622, 878693, 866390, 834985, 791703, 744807, 700140, 660800, 628556, 604510, 589001]
56844E89001p068J330R685J7989K6732L6379M6216N4689O1101O6149P0673P4615
56832A047491P7021P5748O7039M7218J6326k0130n3778p7874q9889r1208q5282
56821I12682p5556o4135n1912l9521k7677j6689o372L405J2602K1371K9819L7340
56809G35357M3034M6937M9996N2393N2395M7125L4195J3070j3868m1140o2338
56798I57156p3721p5830p1678o4090n4884m5357l6338k7964k0071j2706n946M25
56786D68996O596J2295J7058K0747K3548K5710K7321K7918K6109K0077R034n775
56774F79634k1522l5068m4077m7703m6752m2968l7936l2707k8008k4184k0863
56763B97846j7411j3906j1100r297q031p002o518o629o581n768m595l824l452
$$ y = [589001, 581933, 583263, 592948, 610937, 637669, 674048, 720264, 774953, 836054, 902203, 972876, 1047491, 1124512, 1200260, 1267299, 1314517, 1330843, 1310713, 1256935, 1179061, 1089172, 997964, 912682, 837126, 772991, 721079, 681558, 653881, 637192, 630820, 634225, 646827, 668198, 698017, 735357, 778391, 825328, 875324, 927717, 980112, 1027237, 1061432, 1074502, 1060634, 1019494, 957156, 883435, 807605, 735927, 671837, 616953, 571596, 535258, 507294, 487223, 474517, 468571, 468996, 475592, 487887, 504945, 525692, 549240, 574950, 602271, 630189, 656298, 676375, 685409, 679634, 658112, 623044, 578967, 531264, 484512, 441544, 403608, 370901, 342893, 318709, 297846, 280435, 266529, 255429, 246132, 238101, 231099, 224581, 217952, 211371, 205603, 201008, 197184, 193732]
56750A93732k939k156j486j215j334j729k106j983j271o28o78j054q75j32J96
56735A74342m25j152q46M07J404J410R07O49N92K93j02n1L67M55Q1j1N94J231
56717A80145J271J165J552J930J346Q0n57j06M82M42K33N38J081J161Q32P46J116
56700A93457J479J420J079Q21O65K86n03j400j885j781j274m81N12J172P43o38
56684A93672j717j588q73o91j035j020m55m2j13k27j55l06q82j351j150l83M42
56667A82126R12Q54M23J60N53J439K222K564K505K061J301O18L52L20K77O09J784
56650B01080L292M022L626K673J548J80j150j748j531j186j067p30J42J122J676
56635B11949J818J816J780J758J725J499J091J019J690K565K708J994J004k0j175
$$ y = [193732, 190793, 188637, 187151, 185936, 184602, 182873, 180767, 178784, 177513, 176885, 176207, 175153, 174278, 174146, 174342, 173917, 172765, 171919, 172326, 173730, 175140, 176047, 176696, 177288, 177581, 177479, 177428, 177795, 178250, 178331, 178320, 178914, 180145, 181416, 182581, 184133, 186063, 187409, 187489, 186932, 186826, 187308, 187750, 187983, 188521, 189602, 190763, 191595, 192341, 193457, 194936, 196356, 197435, 198256, 198921, 199207, 198704, 197304, 195419, 193638, 192364, 191883, 192395, 193567, 194310, 193672, 191955, 190367, 189494, 188803, 187768, 186748, 186293, 186251, 186138, 185911, 185756, 185450, 184568, 183217, 182067, 181684, 182126, 183038, 183892, 184315, 184475, 185028, 186467, 188689, 191253, 193758, 195819, 197120, 197738, 198090, 198410, 198687, 199296, 201080, 204372, 208394, 212020, 214693, 216241, 216421, 215271, 213523, 211992, 210806, 209739, 209009, 209151, 210273, 211949, 213767, 215583, 217363, 219121, 220846, 222345, 223436, 224455, 226145, 228710, 231418, 233412, 234416, 234396, 233221]
56620B33221k037j962j247q63r59p89j94N3l45p10o21n18o74o62l10j57n04r48
56602B19774j233j583j899j615p70j95k46l84l06l97o69n22K7J77j55J8Q76J139
56584B12037J25q99o01L66N09k27o34j18P94J419J496J109P68J138K176L074L387
56567B25919L466L498L143K666L164M886O507O987P125Q239J0237J2046J3015
56554C10898J2786J0718O780K396p74k437l199l226k456j490j091j217j436j821
56540C24431k524l150l408l743m368m495l557k495k588l592m265m205l923l578
56526B74540k932k253k058k067j633j000j078k012k930l081k537j833j520j837
56512B45769k288j932o53M23L42m21q15n90j21M23P94K90j252k662k686j586n67
$$ y = [233221, 231184, 229222, 227975, 227112, 226153, 225364, 225170, 225223, 224878, 224168, 223547, 223029, 222355, 221693, 221383, 221226, 220722, 219774, 218541, 216958, 215059, 213444, 212674, 212479, 212233, 211849, 211543, 211146, 210477, 209955, 209982, 210159, 210004, 210022, 210898, 212037, 212162, 211263, 210662, 211028, 211537, 211310, 210676, 210558, 211352, 212771, 214267, 215376, 216144, 217282, 219458, 222532, 225919, 229385, 232883, 236026, 238692, 241856, 246742, 253249, 260236, 267361, 275600, 285837, 297883, 310898, 323684, 334402, 341182, 343578, 342804, 340367, 337168, 333942, 331486, 329996, 328905, 327688, 326252, 324431, 321907, 318757, 315349, 311606, 307238, 302743, 299186, 296691, 294103, 290511, 286246, 282041, 278118, 274540, 271608, 269355, 267297, 265230, 263597, 262597, 261519, 259507, 256577, 253496, 250959, 249126, 247606, 245769, 243481, 241549, 240896, 241319, 241661, 241240, 240425, 239835, 239714, 240137, 240931, 241221, 239969, 237307, 234621, 233035, 232468]
56495B32468j24O3J11j48n18o26m93k26L81J299J898J837J605J521J066J7p73
56478B39358o37j85r0J59J065J821J545R19J046J540J359P75Q40J477J722J433
56462B54147J156P77r3q07m09O69J128P09J27m69j357j960j390q3O58N95N13N80
56444B54491L04r5J03O80P11J96l3K06L88N23R69J330J005M84N97Q74L42n23m86
56425B62066J95J86n27p11k30j51n38k57P40J123N29J58N90R06N18P1n8l94r48
56406B63268q61k9N16L76L27O72O92K57L11J141J718J475J211J579K086K164J911
56389B78814J308N1j329j648p54K58Q23J326J629R79k01l39Q38J710J373R51J458
56372B87247K095J817J035O47O43P24J083J679J785J119L98J61J14O7L22P24O61
$$ y = [232468, 232344, 232407, 232518, 232370, 231852, 231226, 230733, 230507, 230888, 232187, 234085, 235922, 237527, 239048, 240114, 240131, 239358, 238721, 238536, 238446, 238605, 239670, 241491, 243036, 243955, 245001, 246541, 247900, 248675, 249515, 250992, 252714, 254147, 255303, 256080, 255987, 255180, 254771, 255440, 256568, 257277, 257404, 256935, 255578, 253618, 252228, 252145, 252803, 253398, 253911, 254491, 254795, 254700, 254803, 255483, 256194, 256390, 256357, 256563, 256951, 257474, 258443, 259773, 260778, 261262, 261859, 262733, 263075, 262552, 262066, 262261, 262447, 261920, 261209, 260979, 260828, 260290, 260033, 260773, 261896, 262425, 262583, 263173, 264079, 264597, 264668, 264610, 264216, 263268, 262407, 262378, 262894, 263270, 263597, 264269, 264961, 265218, 265529, 266670, 268388, 269863, 271074, 272653, 274739, 276903, 278814, 280122, 280173, 278844, 277196, 276442, 276700, 277523, 278849, 280478, 281457, 281256, 280917, 281755, 283465, 284838, 285789, 287247, 289342, 291159, 292194, 292841, 293484, 294208, 295291, 296970, 298755, 299874, 300272, 300433, 300547, 300614, 300936, 301660, 302321]
56355C02321L65P89J836K305J972J962K514K420J320O11J072J548J134P96J500
56340C24465K425K465J988J749J498J055J362K999M824N482N209M839M220K963
56326C67543J747J451J829K205K580L019K868J727L57m44r77j695k112j716j049
56311C77333q88j039q98l99K52R97J468J155N36Q26K053K827K682K930M299N443
56295C99577N117M198M057M324L917L138L090L819M552N022N311N066M181L554
56281D58923M023N190O229P171Q367R480J0014J0208J0565J1107J1757J2686J3716
56268E79436J4282J4481J5141J6444J7681J8801K0750K3697K6497K8684L1398
56257H07292L5429L9973M4294M9056N4962O1623O8803P7114Q6474R5540J03868
$$ y = [302321, 302686, 303475, 305311, 307616, 309588, 311550, 314064, 316484, 317804, 318415, 319487, 321035, 322169, 322965, 324465, 326890, 329355, 331343, 333092, 334590, 335645, 337007, 340006, 344830, 350312, 355521, 360360, 364580, 367543, 369290, 370741, 372570, 374775, 377355, 380374, 383242, 384969, 385326, 384882, 383905, 382210, 380098, 378382, 377333, 376445, 375406, 374508, 374109, 374361, 375358, 376826, 377981, 378517, 379343, 381396, 384223, 386905, 389835, 394134, 399577, 404694, 408892, 412949, 417273, 421190, 424328, 427418, 431237, 435789, 440811, 446122, 451188, 455369, 458923, 462946, 468136, 474365, 481536, 489903, 499383, 509397, 519605, 530170, 541277, 553034, 565720, 579436, 593718, 608199, 623340, 639784, 657465, 676266, 697016, 720713, 747210, 775894, 807292, 842721, 882694, 926988, 976044, 1031006, 1092629, 1161432, 1238546, 1325020, 1420560, 1524428]
56246A524428J12841J23157J33115J40853J46621J51227J53955J53640J50434
56237B790271J44811J36081J23439J07189Q7617O4187L7366R677j6642m1568o5333
56226C377095q6380j03158j16418j27640j36406j41382j42759j41741j38673j33476
56216B109062j26968j20058j12579j04422r6628q9854q3074p5397o7890o1831
56206A170361n6602n1045m5592m1265l7748l4308l1257k8863k6153k2563j9318
56195G75647j7402j5721j3143j0711r746r427q442p424p454p693o873n708n416
56182F50487n251l994k406j781j457l65M58l24j427p86Q95J445R52J165K020J981
56166F41612J207J401K808M058M679N278N653N164M504M869N914O663P598R559
$$ y = [1524428, 1637269, 1760426, 1893541, 2034394, 2181015, 2332242, 2486197, 2639837, 2790271, 2935082, 3071163, 3194602, 3301791, 3389408, 3453595, 3490961, 3500638, 3483996, 3442428, 3377095, 3290715, 3187557, 3071139, 2943499, 2807093, 2665711, 2522952, 2381211, 2242538, 2109062, 1982094, 1862036, 1749457, 1645035, 1548407, 1458553, 1375479, 1300082, 1232192, 1170361, 1113759, 1062714, 1017122, 975857, 938109, 903801, 872544, 843681, 817528, 794965, 775647, 758245, 742524, 729381, 718670, 708924, 699497, 691055, 683631, 676177, 668484, 661611, 655903, 650487, 645236, 641242, 638836, 637055, 635598, 635233, 635691, 635367, 633940, 633154, 634049, 635494, 636446, 637611, 639631, 641612, 642819, 644220, 647028, 651086, 655765, 661043, 666696, 671860, 676364, 681233, 687147, 693810, 701408, 710967]
56152G10967J1572J2236J2284J3355J5155J6404J7586J9998K3063K5456K8117
56141I06193L3180M0481M7803N4093N9926O5463P0488P5797Q2103Q8172R2230
56130A615929R4079R3666Q9157P9328O6543N4565M4648L6500L1220K9691K9285
56119B264611K5762J7810O943n530j8153k7730l2117l3689l6554m1592m7649n5695
56107B016417o7173p9449q7560q9962q8479q3649p4756o3695n3928m5742l6928
56096A245096k7784k0995j6826j2965r013o678n676l937j789j469k535k264n20
56083A132645L11R2J037L026L651L028L786O074P290P035P587R206R775R388J0482
56068A214413J3019J4320J4045J4596J6355J7328J7665J9476K2055K2492K1141
$$ y = [710967, 722539, 734775, 747059, 760414, 775569, 791973, 809559, 829557, 852620, 878076, 906193, 939373, 979854, 1027657, 1081750, 1141676, 1207139, 1277627, 1353424, 1435527, 1523699, 1615929, 1710008, 1803674, 1892831, 1972159, 2038702, 2093267, 2137915, 2174415, 2205635, 2235326, 2264611, 2290373, 2308183, 2315126, 2309596, 2291443, 2263713, 2231596, 2197907, 2161353, 2119761, 2072112, 2016417, 1949244, 1869795, 1782235, 1692273, 1603794, 1520145, 1445389, 1381694, 1327766, 1282024, 1245096, 1217312, 1196317, 1179491, 1166526, 1157513, 1150835, 1145159, 1141222, 1139433, 1137964, 1135429, 1133165, 1132645, 1132956, 1133048, 1134085, 1137111, 1140762, 1143790, 1147576, 1153650, 1160940, 1167975, 1175562, 1184768, 1194543, 1203931, 1214413, 1227432, 1241752, 1255797, 1270393, 1286748, 1304076, 1321741, 1341217, 1363272, 1385764, 1406905]
56057A406905K1178K2608K2370K0517K0303K1748K1303J8668J7696J9456K0639
56046A633391K0050K0519K2947K4546K4543K5614K8152K9092K7887K7603K8730
56035A913074K8122K5484K4552K6193K6838K5475K5577K8208K9929K9629L0879
56024B213960L5329M0208M4286M9720N6143N9771O0264O1646O4712O5811O4819
56013B816669O6469P1705P5758P7109Q0166Q6580R2242R5555J00216J07116J12058
56002C781643J14375J18989J27045J33618J37499J43829J54041J63064J69596
55993E043699J78881J92185K04297K14683K29705K50207K68966K84436L04386
55984G171445L31572L59004L84310M14844M53243M92353N30456N76631O34591
$$ y = [1406905, 1428083, 1450691, 1473061, 1493578, 1513881, 1535629, 1556932, 1575600, 1593296, 1612752, 1633391, 1653441, 1673960, 1696907, 1721453, 1745996, 1771610, 1799762, 1828854, 1856741, 1884344, 1913074, 1941196, 1966680, 1991232, 2017425, 2044263, 2069738, 2095315, 2123523, 2153452, 2183081, 2213960, 2249289, 2289497, 2333783, 2383503, 2439646, 2499417, 2559681, 2621327, 2686039, 2751850, 2816669, 2883138, 2954843, 3030601, 3107710, 3187876, 3274456, 3366698, 3462253, 3562469, 3669585, 3781643, 3896018, 4015007, 4142052, 4275670, 4413169, 4556998, 4711039, 4874103, 5043699, 5222580, 5414765, 5619062, 5833745, 6063450, 6313657, 6582623, 6867059, 7171445, 7503017, 7862021, 8246331, 8661175, 9114418, 9606771, 10137227, 10713858, 11348449]
55975A1348449O96731P60914Q36944R29412J031491J143443J279036J445769J638755
55966B1110944J863026K140771K487772K907263L418650M065761M882140N873519
55958D8749846P047479Q431301J0048133J1910243J4046206J6480057J9146892
55951A35860157K1868919K4452593K6788207K8858919L0705910L2303147L3169704
55944C34007556L1925870K6555896J5774503N54548j5786645k9328787l7657979
55937C26044962m0627343l9576457l6151273l1666387k7003399k2664567j8853033
55930A09502503j5606807j2911785j0720673q945872p498708o324509n380752
55923D2113397m611218l966990l428529k984574k609879k282137j999944j764970
$$ y = [11348449, 12045180, 12806094, 13643038, 14572450, 15603941, 16747384, 18026420, 19472189, 21110944, 22973970, 25114741, 27602513, 30509776, 33928426, 37994187, 42876327, 48749846, 55797325, 64228626, 74276759, 86187002, 100233208, 116713265, 135860157, 157729076, 182181669, 208969876, 237828795, 268534705, 300837852, 334007556, 365933426, 392489322, 408263825, 408818373, 393031728, 363702941, 326044962, 285417619, 245841162, 209689889, 178023502, 151020103, 128355536, 109502503, 93895696, 80983911, 70263238, 61317366, 53818658, 47494149, 42113397, 37502179, 33535189, 30106660, 27122086, 24512207, 22230070, 20230126, 18465156]
55915A8465156j563587j381942j222333j089225r74124q68324p76166p02278o38759
55906I248418n77415n22409m79046m41749m04201l70353l44648l21747k96123
55897E490727k72074k54505k39058k20770k03517j91833j81742j68491j55445
55888C603292j46836j39248j28415j17309j09755j02918r3522q4769p9860p5166
55878B525494o7012n8862n4979n3028m9894m8705n2979n9244o2263o2681o3243
55867A892604o2487n8515n4238n2731n1763m8657m5948m6589m8040m6854m4819
55856A331963m4896m5198m2678l8912l6721l4732l0667k6479k5009k4811k3270
55845I58590k1592k1856k2360k0700j8411j7931j8039j6684j5278j5744j6340
$$ y = [18465156, 16901569, 15519627, 14297294, 13208069, 12233945, 11365621, 10589455, 9887177, 9248418, 8671003, 8148594, 7669548, 7227799, 6823598, 6453245, 6108597, 5786850, 5490727, 5218653, 4964148, 4725090, 4504320, 4300803, 4108970, 3927228, 3758737, 3603292, 3456456, 3317208, 3188793, 3071484, 2961729, 2858811, 2765289, 2680520, 2600660, 2525494, 2458482, 2399620, 2344641, 2291613, 2241719, 2193014, 2140035, 2080791, 2018528, 1955847, 1892604, 1830117, 1771602, 1717364, 1664633, 1612870, 1564213, 1518265, 1471676, 1423636, 1376782, 1331963, 1287067, 1241869, 1199191, 1160279, 1123558, 1088826, 1058159, 1031680, 1006671, 981860, 958590, 936998, 915142, 892782, 872082, 853671, 835740, 817701, 801017, 785739, 769995, 753655]
55834G53655j4787j2605j2044j1720r554p101o684p059o083m920n423o261n730
55821F43684n592p849j0472j0648r607r910j0569r333p390p213p856o847m859
55808E35539m155m163k777m95P92J620L614N890O565O484P677R524R976R191Q446
55793E93728O966L414p41l015l865n545q119r936j0861j1756j1897j0163p780
55780E20430o813p013p083p794j0578j4080j5390j4001j1725r521p088m797l298
55767D01249j937L9J677J823J180O45p77l877o754p266o483o859q372r342r709
55752C45237j0434j0863r766q004p240o994n743l998l354l527l088k231k044k019
55738B65932j082j25o19j696j487m42l95j174j200o43r36j801j759j191j811l435
$$ y = [753655, 738868, 726263, 714219, 702499, 692945, 685844, 679160, 672101, 666018, 661098, 655675, 649414, 643684, 638092, 630243, 619771, 609123, 599516, 589606, 579037, 569704, 562314, 555101, 547245, 540398, 535539, 531384, 527221, 524444, 523949, 524741, 526361, 529975, 535865, 542430, 548914, 556591, 566115, 576091, 585282, 593728, 600694, 604108, 603367, 600352, 596487, 590942, 582823, 572887, 562026, 550270, 538373, 528210, 520430, 513617, 506604, 499521, 491727, 481149, 467069, 451679, 437678, 425953, 416432, 409344, 404547, 401249, 399312, 399351, 401028, 402851, 404031, 404676, 403899, 400022, 393268, 386002, 379519, 372660, 364288, 354946, 345237, 334803, 323940, 314174, 306170, 298930, 291936, 286193, 282195, 278841, 275314, 272226, 269995, 267951, 265932, 264850, 264725, 264106, 262410, 260923, 260481, 260086, 258912, 257712, 257069, 256133, 254332, 252573, 251382, 249571, 246136]
55722B46136m161l578l145l457l633l242k604j524J76J414J334J132K157L241
55708B30246K605J363J977L964M501K963J591J501J202m41k575m246n576o501
55694B32574o426n574m862m274l086j612q25n30K41J285J614J438J757K313K049
55679B16082J226J023J443J652J915K935L796L004J188L03M04k47j920k901k374
55664B27529j467j066p48j60M70J307K628L653L422K603K563L050K893K435K909
55649B52021L797L352J597K92lm07j266j788k107l220m753n295n103n865p543
55634B23709q138o975n682n318n052m310l764l465k374n75K66n13j565j855j938
55619A72451k216j974j022l65m30m40j86n78j753k517k358k176k445k395j720
$$ y = [246136, 241975, 238397, 235252, 231795, 228162, 224920, 222316, 220792, 220968, 222382, 223716, 224848, 227005, 230246, 232851, 234214, 236191, 240155, 244656, 247619, 249210, 250711, 251913, 251472, 248897, 244651, 239075, 232574, 226148, 220574, 215712, 211438, 208352, 206740, 205915, 205385, 205626, 206911, 208525, 209963, 211720, 214033, 216082, 217308, 218331, 219774, 221426, 223341, 226276, 230072, 233076, 234264, 234567, 234971, 234724, 232804, 229903, 227529, 226062, 224996, 224248, 224088, 224558, 225865, 228493, 232146, 235568, 238171, 240734, 243784, 246677, 249112, 252021, 255818, 259170, 260767, 261059, 261056, 260649, 259383, 257595, 255488, 252268, 247515, 242220, 237117, 231252, 223709, 215571, 208596, 202914, 197596, 192544, 188234, 184470, 181005, 178631, 178056, 178322, 177809, 176244, 174389, 172451, 170235, 168261, 167239, 166874, 166444, 166004, 165818, 165240, 163487, 160970, 158612, 156436, 153991, 151596, 149876]
55604A49876j186j062o89j84n49j577j690n62K55j5k54J40K1j216k211j884j169
55587A36044j169j326q50l72p07j279j155n38j1N37J221J521J274J266J912K477
55571A38845K391K126K021J577P78P06J886L212L478K929K318J661P65m0o03j367
55555A62683k405l032l038l123l483l239j971o75k96n27p20r03j117r15k80J21
55539A37080J88O81J649J949J140M52R31J874K108J622R82K46n72r77r03j108
55523A47342j855k219j563o92o36j309k150l005l582l100j545k46k58j003j327
55508A22852j006m82N6M13J71n83j030p23j26L21O46N64m32j724j821n82L38j0
55490A16842m67J29J069J204P84N25J56o81j191n74M32N37k69j054j312j008o4
$$ y = [149876, 148690, 147628, 146939, 146755, 146206, 144629, 142939, 142377, 142632, 142617, 142363, 142503, 142524, 141308, 139097, 137213, 136044, 134875, 133549, 132699, 132327, 131620, 130341, 129186, 128648, 128637, 129174, 130395, 131916, 133190, 134456, 136368, 138845, 141236, 143362, 145383, 146960, 147738, 148444, 150330, 153542, 157020, 159949, 162267, 163928, 164693, 164653, 164050, 162683, 160278, 157246, 154208, 151085, 147602, 144363, 142392, 141717, 141421, 140894, 140174, 139271, 138154, 137239, 136959, 137080, 137268, 137949, 139598, 141547, 142687, 143139, 144070, 145944, 148052, 149674, 150656, 150902, 150330, 149353, 148450, 147342, 145487, 143268, 141705, 141013, 140377, 139068, 136918, 133913, 130331, 127231, 125686, 125440, 125182, 124179, 122852, 121846, 121364, 121420, 121833, 122004, 121421, 120391, 119668, 119542, 119863, 120509, 121073, 120641, 118917, 117096, 116514, 116852, 116842, 116375, 116504, 117573, 118777, 119561, 120086, 120242, 119561, 118370, 117796, 118228, 118765, 118496, 117442, 116130, 115122, 115058]
55473A15058J131J511P08k39m25l29o13q16l88Q8oq5M42P71J3j048j033j31L76
55454A14985J84QN6p0k38O6O46P55K71k85n97o53m08r6l20j028j220l97N16O06
55434A12781L75N48O27Qm45L14J460J332P9n74l9N07K66j30q8o2n31j057r44j72
55414A14255P06J111Q23K30P5N06P19J32n45k37Q71J530J032j73j200j422o86
55397A17727L62N58n04j751j902j082l45m5L62J131J737J572N02j034k127j995
55381A13166r36j51j24oQ04J464J085L12K88P72P45K78L01Q34J010O34L61L29
55363A21166L7m07k24O35J228J034N66L03l4p77j606j914j415l57N17L44r43k241
55345A15912k355j269J61J272J773J362J91p33o03L1R1l04j26P17J065J95j204
$$ y = [115058, 116189, 117700, 118408, 118169, 117744, 117415, 116802, 115986, 115598, 115686, 115680, 115595, 116037, 116808, 116821, 115773, 114740, 114609, 114985, 115169, 115177, 115233, 115163, 114925, 114991, 115637, 116392, 116663, 116378, 115781, 115128, 114720, 114624, 114304, 113276, 112056, 111659, 112175, 112781, 113156, 113704, 114331, 114339, 113894, 114208, 115668, 117000, 117079, 116505, 116466, 116973, 117239, 117109, 117021, 116959, 116428, 115371, 114427, 114255, 114961, 116072, 116895, 117125, 117200, 117706, 118425, 118557, 118012, 117775, 118646, 120176, 121208, 121035, 119835, 118413, 117727, 118089, 118647, 118143, 116392, 114490, 113408, 113063, 113018, 113380, 114511, 116248, 117820, 118322, 117288, 115161, 113166, 112230, 112079, 111955, 111949, 112753, 114217, 115302, 115614, 115902, 116674, 117419, 117697, 117998, 118832, 119842, 120476, 120837, 121166, 121203, 120796, 120572, 121207, 122435, 123469, 124035, 124338, 124304, 123527, 121921, 120007, 118592, 118235, 118752, 119096, 118153, 115912, 113557, 112288, 112449, 113721, 115494, 116856, 117047, 116314, 115711, 115742, 115833, 115529, 115403, 116120, 117185, 117380, 116176]
55328A16176j951j563m05O96R32K84l63l31p0k54n03k8Q19R24J41n34n64m03k92
55309A12711K31J264K001J784R40J79k32m01m92o54r02r42o27l51m84n93M4J223
55291A14699J946J752J109N48R2l35o62q89r56n36M39J232J081L53K4J86P3m57
55273A19699o66k95o5l78n34J14J051J284O52r4k94RL16K71J7m4J57K65J52J86
55253A21803M57L43n57j554j670j014m78m19m92n12n92n74k39J03Q6P7N57R69
55235A16294L74q69j330n46L81M49q9m99n11q4P63J559J565Q18J76J20K46J92
55217A19009J73K82J74j26M3R23J759J741R73j7r62j614j431k01J343K121J729
55200A25919O36l85q03o15l03k72l48j32K89M32J48k71o46j015j206r63m81k20
$$ y = [116176, 114225, 112662, 112257, 112953, 113885, 114169, 113806, 113475, 113405, 113151, 112648, 112620, 113439, 114363, 114504, 113970, 113406, 113003, 112711, 112942, 114206, 116207, 117991, 118931, 119110, 118878, 118477, 117985, 117331, 116429, 115487, 114860, 114509, 114025, 113432, 113476, 114699, 116645, 118397, 119506, 120054, 120146, 119811, 119149, 118260, 117304, 116768, 117207, 118439, 119520, 119873, 119897, 120083, 120156, 119699, 119033, 118738, 118673, 118295, 117761, 117875, 118926, 120210, 120862, 120768, 120474, 120483, 120799, 121070, 121087, 121043, 121200, 121465, 121617, 121803, 122260, 122603, 122046, 120492, 118822, 117808, 117330, 116911, 116419, 115907, 115315, 114741, 114502, 114605, 114691, 114768, 115325, 116294, 116668, 115799, 114469, 113923, 114304, 114753, 114664, 114165, 113654, 113570, 114333, 115892, 117457, 118275, 118451, 118571, 118817, 119009, 119182, 119464, 119638, 119512, 119555, 120478, 122237, 123978, 124951, 124934, 123972, 122358, 120927, 120726, 122069, 124190, 125919, 126555, 126170, 125367, 124752, 124449, 124177, 123829, 123697, 123986, 124418, 124566, 124295, 123649, 122634, 121428, 120465, 119984, 119764]
55182A19764k09j34J6L9J44O57J240J259Q88Q70J189J031K22m07l42k4J90O16
55164A27009J305J557J017L38J59J99J4j85q7J5j61k49J14N02L89N3k6j41q81
55145A30941j900k146j215J76J191J656J711J289K89r10j530j146k43K03j50o20
55129A27596m40J81M41J30j37J01O42J088J253J018L35m12o02j23M65O57M52L3
55111A32678m26o45l80J50M52M47M29M11J58j05K12J082J689J559J199J261J616
55094A41787J683J217M80n9n0M11P16L93k43n70o31r12j262r74j0P44P44M16K31
55075A44111K0l44l90K19J022J308R97N23K24J29j0n19j285j504o43M46L41r81
55057A43664k013j736p58o4J83J09n05j518j962j178K62J338J651J159k27j974
$$ y = [119764, 119555, 119421, 119437, 119476, 119620, 120277, 121517, 122776, 123664, 124534, 125723, 126754, 126976, 126569, 126227, 126203, 126393, 127009, 128314, 129871, 130888, 131226, 131385, 131584, 131598, 131413, 131326, 131341, 131180, 130931, 131045, 131547, 131936, 131989, 131963, 131822, 130941, 129041, 126895, 125680, 125856, 127047, 128703, 130414, 131703, 131992, 131082, 129552, 128406, 128163, 128366, 128216, 127596, 127156, 127337, 127778, 127908, 127771, 127872, 128514, 129602, 130855, 131873, 132208, 131796, 131194, 131071, 131536, 132193, 132645, 132678, 132252, 131607, 131227, 131377, 131829, 132276, 132705, 133116, 133274, 133169, 133381, 134463, 136152, 137711, 138910, 140171, 141787, 143470, 144687, 145167, 145108, 145058, 145469, 146185, 146578, 146335, 145765, 145134, 144222, 142960, 141986, 141976, 142720, 143464, 143880, 144111, 144131, 143787, 143397, 143616, 144638, 145946, 146943, 147466, 147690, 147819, 147809, 147290, 146005, 144501, 143858, 144304, 144645, 143664, 141651, 139915, 139157, 139093, 139276, 139385, 138880, 137362, 135400, 134222, 134484, 135822, 137473, 138632, 138405, 136431]
55041A36431k711j708k1Q03O94P70J477K114K017J329N18j07l49j85Q4R4j19k53
55023A40878j67M7K46K31j51o77q52n69k81k55j31M09R89R97L44n37j091q59K56
55004A38827J574K071J501O83L71M64N94P47Q24M57k19l62L05P92L19k79K93J735
54986A50697K475J861Q46L77K38j63p05q05l50J67K68J1k92n92j123j758j774
54969A49378p76M60Q06L88L80J160J696J201K97j58l58q31j183p26K65R22J050
54952A53971J052R43M91O7L38J105J421R20K08j50k35k52j12K23N55P56Q83Q90
54934A63074O35K51N7Q7J06J21M48J131J746J955J966K254K983L868M549M958
54918A90189N338N877O465O807O719O140N062L621K092M88j535l977o050p038
$$ y = [136431, 133720, 132012, 131991, 132794, 133488, 134258, 135735, 137849, 139866, 141195, 141713, 141606, 141257, 141072, 141156, 141250, 141131, 140878, 140711, 140758, 141004, 141235, 141084, 140407, 139555, 138986, 138705, 138450, 138319, 138728, 139717, 140714, 141058, 140521, 139430, 138571, 138827, 140401, 142472, 143973, 144656, 145027, 145491, 146085, 146832, 147656, 148113, 147894, 147532, 147837, 148629, 148948, 148669, 148962, 150697, 153172, 155033, 155879, 156256, 156494, 156331, 155626, 154821, 154471, 154638, 154906, 154917, 154625, 154033, 152910, 151152, 149378, 148602, 149062, 149868, 150256, 150636, 151796, 153492, 154693, 154990, 154832, 154474, 153643, 152460, 151734, 151999, 152921, 153971, 155023, 155966, 156457, 156524, 156862, 157967, 159388, 160308, 160516, 160366, 160131, 159879, 159767, 159990, 160545, 161301, 162184, 163074, 163709, 163960, 164017, 164104, 164210, 164331, 164779, 165910, 167656, 169611, 171577, 173831, 176814, 180682, 185231, 190189, 195527, 201404, 207869, 214676, 221395, 227535, 232597, 236218, 238310, 238798, 237263, 233286, 227236, 220198]
54904B20198p264p425p314o221m427l087k536k061j521j754k835l407k637j522
54890A66187j210j196m14Q27J386J124Q49R25J159J730K920M225M843M908N202
54875A93465N787N983N621N296N358N447N046L870J842o41k683l821m760o336
54861B19474q097q726p748o005m566l888l873l993l560k497j635j574j795j604
54847A59913j368j803k517k519j867j494j551j213k15O62R03Q84R44Q53N29L91
54831A50532O28Q48P76N92M10Q6k82l30p9K6j35j67J55N99R38J120J029O29K67
54812A57642K58K99o9o20q28p93q96q58j72P11Q16J84j76O9K21j7k2M54P23L98
54792A57324O4K07M31L46K37L09J50l67n39K7N55K03n68o48J42R94J349J490J908
$$ y = [220198, 212934, 205509, 198195, 191974, 187547, 184460, 181924, 179863, 178342, 176588, 173753, 170346, 167709, 166187, 164977, 163781, 163367, 164194, 165580, 166704, 167553, 168478, 169637, 171367, 174287, 178512, 183355, 188263, 193465, 199252, 205235, 210856, 216152, 221510, 226957, 232003, 235873, 237715, 237074, 234391, 230570, 225810, 219474, 211377, 202651, 194903, 188898, 184332, 180444, 176571, 172578, 169018, 166521, 164886, 163312, 161517, 159913, 158545, 156742, 154225, 151706, 149839, 148345, 146794, 145581, 145366, 146028, 146931, 147815, 148759, 149612, 150141, 150532, 151160, 152008, 152784, 153376, 153786, 153872, 153590, 153260, 153181, 153207, 153072, 152905, 153060, 153659, 154597, 155717, 156746, 157375, 157642, 157900, 158199, 158130, 157510, 156682, 155889, 154993, 154135, 153963, 154674, 155490, 155674, 155498, 155567, 155788, 155771, 155749, 156203, 156926, 157324, 157388, 157595, 158026, 158372, 158609, 158918, 159068, 158701, 158162, 158189, 158744, 158947, 158379, 157731, 157873, 158867, 160216, 161706, 163614]
54773A63614K638L294L508L320L226L646M419N098N691O582P710Q427Q311P595
54759B37079O632N485M189K853J286r22l650o103p634q254q178p467o338n274
54745B03704m548l997l494l157k959k638k106j542j041o42o21j097j403o91P20
54730A74488J528J190O25Q46J728K589L184L651M083M633N506O406O593N863M890
54715B27803M209L489K292Q24n28j913l522m963n669n717n635n648n535n088m392
54700A90007l767l531l602l430k650j751j412j435j032k26J14k36m10J32O93M67
54684A67931k90q50r99q56m10J10J36l66o03j88J31k89q35o77k02l02p96p37m3
54665A59865M72M97N86R58J036M10n00j100j307j292j048n63l7L18N03O14O61
$$ y = [163614, 166252, 169546, 173054, 176374, 179600, 183246, 187665, 192763, 198454, 205036, 212746, 221173, 229484, 237079, 243711, 249196, 253385, 256238, 257524, 256602, 252952, 246849, 239215, 230961, 222783, 215316, 208978, 203704, 199156, 195159, 191665, 188508, 185549, 182911, 180805, 179263, 178222, 177580, 176959, 175862, 174459, 173768, 174488, 176016, 177206, 177831, 178677, 180405, 182994, 186178, 189829, 193912, 198545, 204051, 210457, 217050, 222913, 227803, 232012, 235501, 237793, 238617, 238089, 236176, 232654, 227691, 222022, 216305, 210670, 205022, 199487, 194399, 190007, 186240, 182709, 179107, 175677, 173027, 171276, 169864, 168429, 167397, 167171, 167285, 167049, 166639, 166771, 167464, 167931, 167641, 166791, 165792, 164936, 164526, 164636, 164772, 164406, 163803, 163615, 163746, 163457, 162622, 161945, 161743, 161441, 160645, 159908, 159865, 160337, 160834, 161420, 162378, 163414, 163824, 163324, 162224, 160917, 159625, 158577, 158014, 157977, 158295, 158798, 159412, 160073]
54648A60073O20N02K99k0l96o48n19J14R86J426R58r3r00j024p57n35m58m16l10
54629A58902j4M76Q52Q68Q21J111J415J048J51l26r6po58j421j426p35L7O17R54
54610A62569Q19K70p2K06O70P55N70M30J39n63j314j617j571j488j222n44K64
54593A58301Q42J286J640J504Q74O96J478K046R74j092j968q26Q61J407P49k73
54577A68499j304k332k969k713j704o16Q3M42P36J099J389J369J067Q63R93J124
54561A66026P52Pm93m90l66m05k83M01J364J834J426N69o0l18n60r73j254j115
54543A66062p20l02K73J059J514J127M10M14J197J727J430R10P76P57N13L91O57
54526A78195P64J91n91q51p47q78j174j103o56k52M3M34P69Q25R46J553K202K023
$$ y = [160073, 160693, 161195, 161494, 161474, 161078, 160430, 159911, 160025, 161011, 162437, 163395, 163302, 162402, 161378, 160621, 160086, 159628, 159212, 158902, 158888, 159364, 160216, 161084, 161905, 163016, 164431, 165479, 165630, 165304, 165208, 165201, 164543, 163122, 161696, 160961, 160998, 161615, 162569, 163388, 163658, 163586, 163792, 164462, 165217, 165787, 166217, 166356, 165793, 164479, 162862, 161291, 159803, 158581, 158037, 158301, 159143, 160429, 162069, 163573, 164447, 165143, 166621, 168667, 169641, 168549, 166581, 165755, 166616, 168023, 168772, 168499, 167195, 164863, 161894, 159181, 157477, 156861, 156944, 157386, 158122, 159221, 160610, 161979, 163046, 163909, 164902, 166026, 166778, 166785, 166292, 165802, 165436, 165031, 164748, 165149, 166513, 168347, 169773, 170342, 170282, 169964, 169404, 168431, 167177, 166062, 165342, 165040, 165313, 166372, 167886, 169013, 169423, 169837, 171034, 172761, 174191, 175101, 175877, 176634, 177147, 177538, 178195, 178959, 179150, 178559, 177708, 176961, 176083, 174909, 173806, 173150, 172898, 172941, 173375, 174144, 174969, 175915, 177468, 179670, 181693]
54508A81693R72j48q24j185j301j026o15o08r30q36j8Q45R57L12m72q13m92K91
54490A75802J007J184Q40L80J02M0J43K46O1m65q95p62k03K27K38ok18k11P9M14
54470A78003L34k55q05p50j53N89J260J665J443O50Q5L40Q74P81J98L6N00P95
54452A85590L88k93o62p61r12j154j355j483j498j224n96Q6L22j42r81j473j144
54435A72708k76M47O95N90K07l60n34K57J434J669P56L6L99R70P08J84N49J568
54417A82007K075J841J587J560J393J095R45N69n65j860k123j313n33k49J78J037
54401A87644J642J472R30N18K55J20K77N78O47N65P18R25O27Qq5N47J160J237
54383A99785R84N99m4p45r82p88o68o49k66L35M29p4n10o57q88j041m89M40N37
$$ y = [181693, 182665, 182517, 181693, 180508, 179207, 178181, 177566, 176958, 176028, 175192, 175174, 176019, 176976, 177288, 176816, 176003, 175511, 175802, 176809, 177993, 178833, 179213, 179315, 179355, 179498, 179744, 179805, 179340, 178445, 177683, 177480, 177707, 177945, 177939, 177721, 177510, 177589, 178003, 178337, 178082, 177277, 176527, 176374, 176963, 178223, 179888, 181331, 181981, 182066, 182406, 183280, 184061, 184259, 184295, 184795, 185590, 185978, 185685, 185023, 184262, 183350, 182196, 180841, 179358, 177860, 176636, 176040, 176126, 176448, 176306, 175325, 173852, 172708, 172432, 172879, 173574, 174164, 174371, 174011, 173477, 173734, 175168, 176837, 177593, 177629, 178028, 178998, 179706, 179890, 180439, 182007, 184082, 185923, 187510, 189070, 190463, 191558, 192503, 193072, 192507, 190647, 188524, 187211, 186678, 186429, 186607, 187644, 189286, 190758, 191688, 192206, 192461, 192581, 192858, 193436, 194083, 194648, 195366, 196291, 196918, 196926, 196841, 197388, 198548, 199785, 200769, 201368, 201324, 200579, 199597, 198809, 198141, 197492, 197226, 197561, 197990, 197916, 197406, 196749, 195861, 194820, 194331, 194771, 195308]
54364A95308l06o86J05R38P17Q1J89R11J337J209Q05K25l02j73O04R31J08r88
54346B01013j220q80r12j189q82p7L54K72L95R27J215R50O73Q12J079J065Q86
54329B04481Q30Q65Q00P07R13J651K774L755M124L937L739M011M782N660N992
54314B49021N143L131Q95o09j558k859m668o172o904p208p142o065l964k162j768
54299B07111k196k129j388q56q83q45k14O79J118Q17K19J06P61J440J128j32j192
54282B03544j311r64q35q38o18l48l12l05p2K06L51N51P44L66o11j144m91N18
54264A98431N88k11p15m06J58M48N21N44N94Q58J342J571J158M94J73P9j89l61
54246B05077Q5P53O90j18o36l14J53k5o63j026q40l64R5M55P21Q53O50o8j059
$$ y = [195308, 195002, 194316, 194421, 195359, 196076, 196157, 196346, 197257, 198594, 199803, 200608, 200833, 200531, 200358, 200962, 201893, 202001, 201013, 199793, 198913, 198001, 196812, 195930, 195853, 196207, 196479, 196874, 197801, 199016, 199966, 200639, 201451, 202530, 203595, 204481, 205311, 206176, 206976, 207683, 208596, 210247, 213021, 216776, 220900, 224837, 228576, 232587, 237369, 243029, 249021, 254164, 257295, 258190, 257581, 256023, 253164, 248496, 242324, 235420, 228212, 221070, 215005, 211041, 208879, 207111, 204915, 202786, 201398, 200542, 199659, 198814, 198600, 199279, 200397, 201214, 201433, 201539, 202300, 203740, 204868, 204736, 203544, 202233, 201269, 200434, 199596, 198978, 198630, 198318, 198013, 197941, 198147, 198498, 199049, 199793, 200159, 199548, 198404, 197913, 198431, 199019, 198808, 198093, 197687, 197845, 198293, 198814, 199358, 199952, 200810, 202152, 203723, 204881, 205375, 205548, 205627, 205438, 205077, 205162, 205915, 206605, 206487, 205851, 205537, 205690, 205665, 205002, 203976, 203136, 202772, 202867, 203322, 204043, 204896, 205546, 205478, 204419]
54227B04419j618j225j29R52J499J398Q14J64n9J70L57K16L3j9l21j033j545j341
54209B02732q76q29r50n97l1o1o17p41j26M03J77m02n95l42o8M4J64M32P13O99
54189A99129K37l46m51J36J007J694K093K111J481L91l21k14Nm39j088r68k15
54172B04242J47j34j99M34J071R17J55m34m76k63l29r16j643j821j366j046j440
54155A96899j989j736p26J38M49O34R95J229J047O17K06n3r8m4k57p75r35k72
54137A95329N91P57M63O37J265J416Q69M44N13M08k29o47j79O61R43N31o8m15
54119B03289k64M58J314J518Q95K09J75O97J296J712J703J018j9m68J34J104J481
54102B16252J050J87p21j278j105m16k4k90o09l90M7R1j75l49m93p76p90j50N73
$$ y = [204419, 202801, 201576, 201447, 202399, 203898, 205296, 206110, 206274, 206215, 206385, 206742, 206958, 206991, 206972, 206651, 205618, 204073, 202732, 201856, 201027, 200077, 199480, 199449, 199388, 198771, 198030, 197904, 198307, 198484, 198082, 197487, 197145, 197077, 197121, 197285, 197717, 198430, 199129, 199366, 199020, 198569, 198705, 199712, 201406, 203499, 205610, 207091, 207482, 207161, 206947, 206952, 206513, 205425, 204457, 204242, 204389, 204255, 204056, 204490, 205561, 206478, 206633, 206199, 205723, 205460, 205131, 204215, 202572, 200751, 199385, 198339, 196899, 194910, 193174, 192448, 192586, 193035, 193669, 194664, 195893, 196940, 197557, 197763, 197710, 197612, 197568, 197311, 196536, 195601, 195329, 195920, 196677, 197140, 197777, 199042, 200458, 201327, 201771, 202284, 202692, 202463, 201816, 201637, 202298, 203241, 203772, 203704, 203289, 203025, 203483, 204797, 206315, 207210, 207419, 207594, 208291, 209587, 211299, 213002, 214020, 214001, 213533, 213667, 214771, 216252, 217302, 217489, 216768, 215490, 214385, 213969, 213945, 213655, 213046, 212656, 212703, 212794, 212619, 212270, 211777, 211001, 210211, 210061, 210634]
54083B10634M05n31r88k08J136J868J599P89N3k25J57J136K186K547J893P17j24
54066B23044l28l78p15j006o18L75J205J366J055O16J13l33l75Q0O47J024J393
54049B27165J904K208J928J336J074J395K041K736L386L871L984L760L606L959
54035B64353M822N655N921N722N788O524P338P316O408N429M905M487L728K795
54021C41191K151J914J861J780J554J197R77J186J625J723J420J395K102L022
54007C65098L446L614M439O154P954R048R633J0455J1672J2491J1819Q942L677
53994D68442l601j1577j8048k1195k1115j9585j8057j6496j4398j2105j0254q615
53982B93396o604m619l656l657l427k426j549j641k229k343j936j689j896k152
$$ y = [210634, 211039, 210508, 209520, 209312, 210448, 212316, 213915, 214704, 214757, 214532, 214689, 215825, 218011, 220558, 222451, 223168, 223044, 222716, 222338, 221623, 220617, 219999, 220374, 221579, 222945, 224000, 224616, 224729, 224396, 224021, 224101, 224748, 225772, 227165, 229069, 231277, 233205, 234541, 235615, 237010, 239051, 241787, 245173, 249044, 253028, 256788, 260394, 264353, 269175, 274830, 280751, 286473, 292261, 298785, 306123, 313439, 319847, 325276, 330181, 334668, 338396, 341191, 343342, 345256, 347117, 348897, 350451, 351648, 352625, 353811, 355436, 357159, 358579, 359974, 362076, 365098, 368544, 372158, 376597, 382751, 390705, 399753, 409386, 419841, 431513, 444004, 455823, 464765, 468442, 464841, 453264, 435216, 414021, 392906, 373321, 355264, 338768, 324370, 312265, 302011, 293396, 286792, 282173, 278517, 274860, 271433, 269007, 267458, 265817, 263588, 261245, 259309, 257620, 255724, 253572]
53968B53572j979j295m21J79L42M04O95Q94M75k96n08P9O95P28M77L71K66j0j51
53949B54517O5L73O93J523K963M056L955L256L234M073M769M727M551N057O122
53934C03934O842O562N507M520M208M372M331L722K796K027J773K180L002L545
53920C59321L389L059L386M194M509M131L998M695N567N847N774N958O337O457
53906D26622O147N381M089K644J807J632J151k44j823k683k965l184l153k651
53892D32770k383l139m523n605o368p380q423q662p922o796n715m851m603n100
53878C51300n528n027m012l456l290k717j845j603k072k333k064j961k366k740
53864C10286k739k642k450j774r16p94j468j907j647j407j605j607j090p52q65
$$ y = [253572, 251593, 250298, 249877, 250056, 250398, 250802, 251497, 252391, 252866, 252570, 252062, 252141, 252836, 253564, 254041, 254412, 254678, 254668, 254517, 254582, 254955, 255648, 257171, 260134, 264190, 268145, 271401, 274635, 278708, 283477, 288204, 292755, 297812, 303934, 310776, 317338, 322845, 327365, 331573, 335945, 340276, 343998, 346794, 348821, 350594, 352774, 355776, 359321, 362710, 365769, 369155, 373349, 377858, 381989, 385987, 390682, 396249, 402096, 407870, 413828, 420165, 426622, 432769, 438150, 442239, 444883, 446690, 448322, 449473, 449229, 447406, 444723, 441758, 438574, 435421, 432770, 430387, 427248, 422725, 417120, 410752, 403372, 394949, 386287, 378365, 371569, 365854, 361003, 356400, 351300, 345772, 340745, 336733, 333277, 329987, 327270, 325425, 323822, 321750, 319417, 317353, 315392, 313026, 310286, 307547, 304905, 302455, 300681, 299765, 298971, 297503, 295596, 293949, 292542, 290937, 289330, 288240, 287488, 286623]
53849B86623m18J119K396J937N14K77J926M168N800P046Q637J0635J2595J4278
53835C57533J5784J7326J8974K0640K2278K4080K5852K6018K2034J2711k0j2298
53823E50912k1091k5443k5611k2220j6546j0668o495m630m370m692n098n658o489
53810C91901p406q150q733r215r191p951n476k855j334j072j151p36J90J161J898
53795C31880K446K871L081L015K872K950L170L003K114R19J79J57M72P86J084
53780C60999J255Q53m20k294m113n275n458m841m165m184m857n451n476n143m729
53765C06701m120l277k655k639k906k848k369j875j618j510j451j445j437j381
53751B75170j396j558j592j088q3Q70J265J114Q68R34J296J515J179L72l83o55
$$ y = [286623, 286205, 287324, 289720, 291657, 292171, 292448, 294374, 298542, 304342, 311388, 320025, 330660, 343255, 357533, 373317, 390643, 409617, 430257, 452535, 476615, 502467, 528485, 550519, 563230, 563210, 550912, 529821, 504378, 478767, 456547, 440001, 429333, 422838, 418208, 413838, 409146, 404048, 398390, 391901, 384495, 376345, 367612, 358397, 349206, 341255, 335779, 332924, 331590, 330518, 329367, 328631, 328821, 329982, 331880, 334326, 337197, 340278, 343293, 346165, 349115, 352285, 355288, 357402, 358321, 358500, 358657, 359129, 359915, 360999, 362254, 363107, 362687, 360393, 356280, 351005, 345547, 340706, 336541, 332357, 327500, 322049, 316573, 311430, 306701, 302581, 299304, 296649, 294010, 291104, 288256, 285887, 284012, 282394, 280884, 279433, 277988, 276551, 275170, 273774, 272216, 270624, 269536, 269453, 270323, 271588, 272702, 273570, 274504, 275800, 277315, 278494, 278866, 278483, 277828]
53735B77828n33m68p87j356j614j098r8N39M80M67J194K016J676K83n82LJ124
53718B79074J612J710K257L043L211K827K735K977K619J398L83M87J274J774J834
53703C09215J978K380K774L117L650M319M626M231L365K489J826J361J094J058
53689C47483J202J405J590J652J330M50o43j182p46K07Q29P93L33l43j213j998
53673C51149k156j584q63n00l20Q5O02P39K43p21j758k354k102j252o58p38q21
53656C36991j70P22P40r4m80L05J338J421P38L73O17O94P3p10p76K1J059J644
53638C44506J539R51L17N3L46J061J815K182J965J415J157J659K688L384L106
53623C68144K090J246J251K014K968L660M034M287M560M757M582L917L162L011
$$ y = [277828, 277295, 276827, 276040, 274684, 273070, 271972, 271874, 272413, 272893, 273360, 274554, 276570, 278246, 278529, 277947, 277950, 279074, 280686, 282396, 284653, 287696, 290907, 293734, 296469, 299446, 302065, 303463, 303846, 304333, 305607, 307381, 309215, 311193, 313573, 316347, 319464, 323114, 327433, 332059, 336290, 339655, 342144, 343970, 345331, 346425, 347483, 348685, 350090, 351680, 353332, 354662, 355112, 354469, 353287, 352541, 352748, 353577, 354370, 354703, 354360, 353147, 351149, 348993, 347409, 346546, 346046, 345726, 345811, 346413, 347152, 347395, 346674, 344916, 342562, 340460, 339208, 338550, 337812, 336991, 336821, 337543, 338283, 338189, 337709, 338014, 339352, 340773, 341511, 341884, 342501, 343195, 343268, 342558, 341782, 341803, 342862, 344506, 346045, 346996, 347313, 347366, 347712, 348773, 350588, 352770, 354735, 356150, 357307, 358966, 361654, 365038, 368144, 370234, 371480, 372731, 374745, 377713, 381373, 385407, 389694, 394254, 399011, 403593, 407510, 410672, 413683]
53609D13683L720M756N369N344N000M584M112L622L255K979K621K211J960J858
53595D65074J623J173P57M99J88k55n25n07o25j199j815j832j339r86j011j068
53579D58152j032j358k304l362l745l198k055q31j1L8n69j160j127o22k43j17
53563D36456K54J099J853J866J320Q92P38L97j79k72N53J600J879J442J181J501
53547D52580K018K638L964O239Q616J0049J0456J0436J0268R846R239Q594P638
53534E52581O026M072K562J800J517J668K522L819M719M993N565P278R678J1685
53520F20485J3051J4298J5563J6345J6547J6872J7868J9185K0246K1201K2593
53509H14254K4357K5747K6365K6684K7341K8201K8547K8007K6903K5716K4594
$$ y = [413683, 417403, 422159, 427528, 432872, 437872, 442456, 446568, 450190, 453445, 456424, 459045, 461256, 463216, 465074, 466697, 467870, 468627, 469126, 469314, 469059, 468534, 468027, 467402, 466203, 464388, 462556, 461217, 460231, 459220, 458152, 457120, 455762, 453458, 450096, 446351, 443153, 441098, 440267, 440256, 440294, 439725, 438565, 437438, 436816, 436573, 436456, 436710, 437809, 439662, 441528, 442848, 443740, 444478, 444875, 444696, 444424, 444977, 446577, 448456, 449898, 451079, 452580, 454598, 457236, 461200, 467439, 476055, 486104, 496560, 506996, 517264, 527110, 536349, 544943, 552581, 558607, 562679, 565241, 567041, 568558, 570226, 572748, 576567, 581286, 586279, 591844, 599122, 608800, 620485, 633536, 647834, 663397, 679742, 696289, 713161, 731029, 750214, 770460, 791661, 814254, 838611, 864358, 890723, 917407, 944748, 972949, 1001496, 1029503, 1056406, 1082122, 1106716]
53498A106716K3560K2855K2660K2640K2219K1351K0632K0465K0549K0451K0375
53487A344473K0814K1610K1912K1206J9940J8944J8586J8706J8996J9066J8426
53476A562679J6913J5049J3527J2287J0560P875M693J771p08l118n718q353j0767
53463A616690j2916j4866j6534j7613j7805j7199j6336j5843j5959j6611j7789
53452A437219j9559k1684k3540k4570k4597k3739k2339k1058k0436k0128j9101
53441A196468j6964j4566j2828j1564j0053q281o706n209l320j368k72o4K99J389
53427A106961K569L295M128N720P657R173J0401J1966J3796J5333J6702J8580
53415A226281K0901K2684K3396K3769K4801K6610K8670L0734L2952L5277L7309
$$ y = [1106716, 1130276, 1153131, 1175791, 1198431, 1220650, 1242001, 1262633, 1283098, 1303647, 1324098, 1344473, 1365287, 1386897, 1408809, 1430015, 1449955, 1468899, 1487485, 1506191, 1525187, 1544253, 1562679, 1579592, 1594641, 1608168, 1620455, 1631015, 1638890, 1643583, 1645354, 1644646, 1641528, 1635810, 1627457, 1616690, 1603774, 1588908, 1572374, 1554761, 1536956, 1519757, 1503421, 1487578, 1471619, 1455008, 1437219, 1417660, 1395976, 1372436, 1347866, 1323269, 1299530, 1277191, 1256133, 1235697, 1215569, 1196468, 1179504, 1164938, 1152110, 1140546, 1130493, 1122212, 1115506, 1110297, 1106977, 1105609, 1105337, 1105273, 1105572, 1106961, 1109530, 1112825, 1116953, 1122673, 1130330, 1139503, 1149904, 1161870, 1175666, 1190999, 1207701, 1226281, 1247182, 1269866, 1293262, 1317031, 1341832, 1368442, 1397112, 1427846, 1460798, 1496075, 1533384]
53404A533384L8814M0115M1784M3975M6261M8187M9873N1839N4275N6767N8846
53393B064120O0393O1366O1481O0689N9666N9298N9640N9795N8905N6945N4510
53382B716808N2162N0042M7877M5193M1698L7540L3139K8762K4317J9523J4189
53371C111250Q371K466l039q021j2832j7916k3464k9572l6357m3590n0417n5849
53359B841030n9477o1436o1929o1241o0014n8981n8294n7491n6142n4168n1648
53348B200209m8785m6125m4328m3587m3572m3945m4498m4783m4106m2199l9469
53337A714812l6450l3351l0355k7857k6042k4501k2574k0034j7233j4781j3171
53326A448463j2521j2536j2910j3705j5047j6427j6867j5949j4238j2518j1079
$$ y = [1533384, 1572198, 1612313, 1654097, 1698072, 1744333, 1792520, 1842393, 1894232, 1948507, 2005274, 2064120, 2124513, 2185879, 2247360, 2308049, 2367715, 2427013, 2486653, 2546448, 2605353, 2662298, 2716808, 2768970, 2819012, 2866889, 2912082, 2953780, 2991320, 3024459, 3053221, 3077538, 3097061, 3111250, 3119621, 3122087, 3119048, 3111027, 3098195, 3080279, 3056815, 3027243, 2990886, 2947296, 2896879, 2841030, 2781553, 2720117, 2658188, 2596947, 2536933, 2477952, 2419658, 2362167, 2306025, 2251857, 2200209, 2151424, 2105299, 2060971, 2017384, 1973812, 1929867, 1885369, 1840586, 1796480, 1754281, 1714812, 1678362, 1645011, 1614656, 1586799, 1560757, 1536256, 1513682, 1493648, 1476415, 1461634, 1448463, 1435942, 1423406, 1410496, 1396791, 1381744, 1365317, 1348450, 1332501, 1318263, 1305745, 1294666]
53315A294666r993r442r243q526o590l915j696n00J23Q25J872L360N386P771J0040
53300A274138J1896J3509J5157J6812J8227J9319K0389K1945K4200K6658K8471
53289A490721K9374K9954L0624L0731K9298K6550K3847K2013K0483J8431J5975
53278A768001J3673J1368Q392M718J133j879m719p874j1081j3681j5566j7272
53266A735213j9200k1171k2900k4524k6340k8155k9309k9566k9541k9977l0732
53255A443798l1036l0668l0332l0628l1152l1046l0140k8986k8015k7200k6529
53244A118066k6202k6210k6182k5878k5375k4628k3345k1668k0398k0007j9719
53233H58454j8359j5970j3832j2749j2106j0984r482q417q081q077q244r020j0689
$$ y = [1294666, 1284673, 1275231, 1265988, 1257462, 1250872, 1246957, 1245261, 1244761, 1244884, 1245709, 1247581, 1250941, 1256327, 1264098, 1274138, 1286034, 1299543, 1314700, 1331512, 1349739, 1369058, 1389447, 1411392, 1435592, 1462250, 1490721, 1520095, 1550049, 1580673, 1611404, 1640702, 1667252, 1691099, 1713112, 1733595, 1752026, 1768001, 1781674, 1793042, 1801434, 1806152, 1807285, 1805406, 1800687, 1792813, 1781732, 1768051, 1752485, 1735213, 1716013, 1694842, 1671942, 1647418, 1621078, 1592923, 1563614, 1534048, 1504507, 1474530, 1443798, 1412762, 1382094, 1351762, 1321134, 1289982, 1258936, 1228796, 1199810, 1171795, 1144595, 1118066, 1091864, 1065654, 1039472, 1013594, 988219, 963591, 940246, 918578, 898180, 878173, 858454, 840095, 824125, 810293, 797544, 785438, 774454, 764972, 756555, 748474, 740397, 732153, 723133, 712444]
53220G12444j2712j4144j4517j4156j3731j3702j4062j4475j4613j4387j3779
53209E58166j2675j1023r169p696o831o281n832n780o435p432q021p971p806q006
53195D47208q428q646q528q184p659o969o274n638m849l742k641k044k002k172
53181C69432k402k772l083k894k252j780j764j688j133o26r07j700j905r82M24
53166C43968J315J249M55m71q52m47J96K42m19j074j152q41n77m03j18L07P67
53149C42145J157J245P61j50r11j259j600k257k780k502j515n54j08j03l88q85
53133C30296j302j157l14Q33J752K089J656N21q07j615j589j009l10K82O61P55
53117C30742O55O26Q33J153J354J295R44L51l55j031j591j920j841j409j126j480
$$ y = [712444, 699732, 685588, 671071, 656915, 643184, 629482, 615420, 600945, 586332, 571945, 558166, 545491, 534468, 525299, 517603, 510772, 504491, 498659, 492879, 486444, 479012, 470991, 463020, 455214, 447208, 438780, 430134, 421606, 413422, 405763, 398794, 392520, 386882, 382033, 378291, 375650, 373606, 371604, 369432, 367030, 364258, 361175, 358281, 356029, 354249, 352485, 350797, 349664, 349038, 348131, 346431, 344526, 343544, 343968, 345283, 346532, 346987, 346516, 345664, 345217, 345413, 345655, 345236, 344162, 343010, 342169, 341592, 341189, 341071, 341378, 342145, 343302, 344547, 345308, 345158, 344247, 342988, 341388, 339131, 336351, 333849, 332334, 331780, 331672, 331569, 331181, 330296, 328994, 327837, 327523, 328356, 330108, 332197, 333853, 334374, 333567, 331952, 330363, 329354, 329044, 329326, 329987, 330742, 331397, 332023, 332856, 334009, 335363, 336658, 337602, 337953, 337598, 336567, 334976, 333056, 331215, 329806, 328680, 327200]
53101C27200k243k569j979r68m61q56j772k528k680k193j336m72J22L38K47J22
53085C07972K91P54J010N69l23q60o67l26n88j264j424o45M05Q13N41K45K53K29
53067C06985j02m50n11n13p47q96m87J76L09m8J56J492L029L401K388R37J8J1
53049C15148Q55K094K961L056K833K855K819J970L47j170k091k739l334l435k725
53034C19444j702j177j413k043k537k490j850j075o55m55M5P63R25K30n71p25
53018C04714m33k65j65K08O34O03K51J48L55L86J59J62N85R37Q05M11J48j0k45
52999C09388m53l86lN58J127J431J180N09nm0L2j62k55L06J187J412Q08L71Q33
52980C17838J578J640J148R94J374J600J366J128J089P83J13j53L86R05O18J68
$$ y = [327200, 324957, 322388, 320409, 319441, 318980, 318124, 316352, 313824, 311144, 308951, 307615, 307143, 307265, 307603, 307850, 307972, 308263, 309017, 310027, 310596, 310273, 309413, 308746, 308420, 307832, 306568, 305144, 304499, 304904, 305717, 306258, 306503, 306756, 306985, 306883, 306433, 305922, 305409, 304662, 303766, 303279, 303455, 303764, 303716, 303872, 305364, 308393, 311794, 314182, 315119, 315137, 315148, 316003, 318097, 321058, 324114, 326947, 329802, 332621, 334591, 334938, 333768, 331677, 328938, 325604, 322169, 319444, 317742, 316565, 315152, 313109, 310572, 308082, 306232, 305157, 304502, 304047, 304092, 304855, 305780, 306010, 305439, 304714, 304281, 304016, 303851, 304059, 304693, 305296, 305547, 305695, 306050, 306436, 306595, 306757, 307342, 308279, 309084, 309495, 309643, 309633, 309388, 308935, 308549, 308546, 309104, 310231, 311662, 312842, 313351, 313346, 313306, 313338, 313176, 312921, 313227, 314414, 315826, 316634, 317005, 317838, 319416, 321056, 322204, 323198, 324572, 326172, 327538, 328666, 329755, 330538, 330651, 330498, 330884, 331789, 332407, 332575]
52964C32575O52J666J750O42k31J05Q68R15M12K16M54N87M65L67K71m5l49k07
52946C41113J54p8j167k430l079l023k658k315k120k136k361k717l079l208k701
52931C08195j402J57J073J017N76M47N75L79l36j070j223p43n6M29N57L36j17
52914C08794m88m52m5K94K60L1n1M9J40K23M11N56M36K65N45J241J653J284N09
52895C15655pj44k44m63o49p09p37p47o28l55m1K24M34N41M39R6l44o25o03m44
52875C10649n19r66j471j702j698j544q91N50K145K699J972J080J038J551J756
52860C14649J563J551J913K258K320K241K170K018J608P79n04j878k712k870k956
52845C22150l378l588k937j886j553k144k807k973k981l108k908j996q29j39j1
$$ y = [332575, 333227, 334893, 336643, 337285, 337054, 337159, 338027, 338942, 339354, 339570, 340024, 340611, 341076, 341443, 341714, 341669, 341320, 341113, 341267, 341189, 340022, 337592, 334513, 331490, 328832, 326517, 324397, 322261, 319900, 317183, 314104, 310896, 308195, 306793, 306950, 308023, 309040, 309616, 310063, 310638, 311017, 310681, 309611, 308388, 307645, 307589, 308018, 308575, 308911, 308794, 308306, 307854, 307809, 308103, 308363, 308394, 308343, 308392, 308532, 308755, 309166, 309722, 310158, 310423, 310968, 312209, 313862, 315146, 315655, 315648, 315504, 315260, 314797, 314148, 313439, 312702, 311955, 311327, 310972, 310931, 311155, 311589, 312130, 312569, 312665, 312321, 311696, 311093, 310649, 310130, 309164, 307693, 305991, 304293, 302749, 301858, 302408, 304553, 307252, 309224, 310304, 311342, 312893, 314649, 316212, 317763, 319676, 321934, 324254, 326495, 328665, 330683, 332291, 333070, 332566, 330688, 327976, 325106, 322150, 318772, 315184, 312247, 310361, 308808, 306664, 303857, 300884, 297903, 294795, 291887, 289891, 289062, 288923, 288912]
52830B88912m2p7k70n45m87J63J120J741J578P32k84j069j548j701j326m31M12
52813B86878O21M30O10J370K001J920J440J238J473J867K327L013L766L945K962
52798C15861Q71j593l537m499m645m415l974l162j895n64J42j57j047j555j045
52783B84786N5O80L91j51r8N43J116J257J116Q82N88L51L64O18J005J575K319
52766B97397K847K741K097J329N89p4k94J73P75O99Q0k68j92k92n09R4J629K681
52748C11502K159R07M81J053J632J786J874J887J323L08l39l51l99q76j256j123
52732C20568j026j596k377k319j212J6M91K77J5M6K00K40J79J17J4k02m08l91
52714C12632j69ll7j50k40l59m58k89J34L16j08o89o30J63Q91Q47J44o10j005
$$ y = [288912, 288870, 288793, 288523, 287978, 287491, 287654, 288774, 290515, 292093, 292825, 292541, 291472, 289924, 288223, 286897, 286466, 286878, 287499, 287929, 288539, 289909, 291910, 293830, 295270, 296508, 297981, 299848, 302175, 305188, 308954, 312899, 315861, 316732, 315139, 311602, 307103, 302458, 298043, 294069, 290907, 289012, 288448, 288590, 288433, 287386, 285831, 284786, 284841, 285521, 285912, 285761, 285663, 286206, 287322, 288579, 289695, 290577, 291165, 291516, 291880, 292498, 293503, 295078, 297397, 300244, 302985, 305082, 306411, 307000, 306926, 306632, 306805, 307580, 308279, 308359, 308091, 307899, 307607, 307098, 307192, 308821, 311502, 313661, 314568, 315049, 316102, 317734, 319520, 321394, 323281, 324604, 324912, 324573, 324222, 323823, 322947, 321691, 320568, 319542, 317946, 315569, 313250, 312038, 312054, 312545, 312822, 312837, 312883, 313083, 313323, 313502, 313619, 313633, 313431, 313023, 312632, 312463, 312460, 312423, 312273, 312033, 311674, 311216, 310927, 311061, 311377, 311269, 310580, 309950, 310113, 311004, 311851, 311995, 311385, 310380]
52695C10380r73n72P0O90J029J013P63M83M22P44J285J564J249N93K17M61J111
52678C20529J738K106K118J633O83k17l69L22J147J406J200J107J252J189O72
52663C36516Q0j40n1j1j92n51j030j438j359n90L89P94M14j75l55j09K15M43O29
52644C33479O47J79p54j490j293k28P71R51N53L95P44J077R70P45R85J700K285
52627C41716K290J897J723K179L049L574L071J510n32k467l993m890m899m059
52613C40169k934k214k103k274k266j845j130n01k59k36J6N45Q36N34K2j02J56
52596C26414L20K43K99P71J412J704J311L39n92p07K13J454K071J891J534J492
52580C40169J617J573J376J274J394J630J732J470Q80L33J30N9l07r35j311j139
$$ y = [310380, 309407, 308835, 308905, 309595, 310624, 311637, 312400, 312883, 313305, 314049, 315334, 316898, 318147, 318740, 318957, 319418, 320529, 322267, 324373, 326491, 328124, 328807, 328590, 328221, 328543, 329690, 331096, 332296, 333403, 334655, 335844, 336516, 336596, 336456, 336405, 336394, 336202, 335651, 334621, 333183, 331824, 331234, 331623, 332417, 332831, 332656, 332301, 332192, 332407, 332850, 333479, 334126, 334305, 333551, 332061, 330768, 330540, 331311, 332262, 332815, 333210, 333954, 335031, 336001, 336746, 337731, 339431, 341716, 344006, 345903, 347626, 349805, 352854, 356428, 359499, 361009, 360477, 358010, 354017, 349127, 344228, 340169, 337235, 335021, 332918, 330644, 328378, 326533, 325403, 324902, 324643, 324407, 324423, 324968, 325804, 326338, 326360, 326258, 326414, 326734, 326977, 327276, 328047, 329459, 331163, 332474, 332813, 332221, 331514, 331727, 333181, 335252, 337143, 338677, 340169, 341786, 343359, 344735, 346009, 347403, 349033, 350765, 352235, 353115, 353448, 353578, 353637, 353330, 352395, 351084, 349945]
52564C49945o39j26K63L44j28r52j412j107m88j98k61l04l14n71r89j103p96n29
52546C40635p26j242j565j337n42M94J219J178M84k48n43m49k52nL76P68Q47M78
52528C39570j35p39j258j657j719j185j54Q66J430J661K086K907L627L581K722
52513C51603J699J170J248J626K058K519L056L526L557K821J414q1j157j888k594
52498C70577l105k906k158j905k765l851l783k503j311j073j312j251r49p70m99
52483C40436K74J210J530J140P62R13J331J534J433J189R40Q82J244J859K104
52468C58781J553O04K02R06K355L543L742L149K603K529K403J564K83n41o67q32
52452C82177j600k526k905k820k916l405l857l845l417k906k573k459k373k027
$$ y = [349945, 349306, 349180, 349443, 349787, 349659, 348707, 347295, 346188, 345700, 345502, 345241, 344937, 344623, 344052, 343063, 341960, 341164, 340635, 339909, 338667, 337102, 335765, 335223, 335717, 336936, 338114, 338598, 338350, 337807, 337358, 337106, 337101, 337477, 338245, 339092, 339570, 339435, 338696, 337438, 335781, 334062, 332877, 332723, 333589, 335019, 336680, 338766, 341673, 345300, 348881, 351603, 353302, 354472, 355720, 357346, 359404, 361923, 364979, 368505, 372062, 374883, 376297, 376216, 375059, 373171, 370577, 367472, 364566, 362408, 360503, 357738, 353887, 350104, 347601, 346290, 345217, 343905, 342654, 341705, 340935, 340436, 340710, 341920, 343450, 344590, 345352, 346265, 347596, 349130, 350563, 351752, 352692, 353574, 354818, 356677, 358781, 360334, 360938, 361140, 362046, 364401, 367944, 371686, 374835, 377438, 379967, 382370, 383934, 384217, 383676, 383009, 382177, 380577, 378051, 375146, 372326, 369410, 366005, 362148, 358303, 354886, 351980, 349407, 346948, 344575, 342548]
52438C42548j420q65n16r7O27J290J277N36l39q49j018j011p29o3O87J032Q99
52421C41989Q00J212J928K217J715R35O58R74J273J142R17J211K285L994N977
52406C69227P655Q425Q312Q224R130J0953J2645J3212J2404J0437P372L001k621
52393D78376q550j3001j4499j3173j0621q330o575n058l913l435l224k482j139
52380C84376L0N40P42J163J792K321K610K680K655K847L595M760N704N978N685
52365D27478N039L998K607J260L14l71j085j782k196k257k063j581q05l3L49L67
52349D29239M15P08J100J433J767K146K439K624L001L780M578M733M220L908M618
52334D70709O098P321P766P859Q182Q767R473J0503J2046J3789J5310J6694J8139
$$ y = [342548, 341128, 340263, 339747, 339650, 340277, 341567, 342844, 343380, 343041, 342192, 341174, 340163, 339434, 339371, 340058, 341090, 341989, 342789, 344001, 345929, 348146, 349861, 350796, 351454, 352428, 353701, 354843, 355760, 356971, 359256, 363250, 369227, 376882, 385307, 393619, 401843, 410973, 421926, 434571, 447783, 460187, 470624, 477996, 480997, 478376, 469826, 456825, 442326, 429153, 418532, 410202, 403627, 398569, 394656, 391221, 387997, 385515, 384376, 384406, 384946, 385688, 386851, 388643, 390964, 393574, 396254, 398909, 401756, 405351, 410111, 415815, 421793, 427478, 432517, 436515, 439122, 440382, 440696, 440325, 439240, 437458, 435262, 433005, 430942, 429361, 428556, 428523, 428872, 429239, 429654, 430362, 431462, 432895, 434662, 436808, 439247, 441871, 444872, 448652, 453230, 457963, 462183, 466091, 470709, 476807, 484128, 491894, 499753, 507935, 516702, 526175, 536678, 548724, 562513, 577823, 594517, 612656]
52321F12656J9189J9170J8334J7764J7952J8205J7790J6997J6577J6738J7228
52310H08600J8006J9147K0371K1249K1793K2302K2670K2417K1415K0180J9274
52299A037424J8752J8333J7868J7393J6851J5875J3968J1010P528M310J622r31
52287A180003l640o081p535p882p715p655p822p995p963p642p014o053m708l038
52273A087260j363r9P24J573K822M324N699O893Q045R097J0009J1182J3017J5065
52259A174248J6231J6099J5498J5486J6191J7076J7828J8471J8795J8400J7294
52248A361617J5872J4172J1703Q269M607J723j74j756l590n506o987p831q257
52235A383862q531q801r208r879j0724j1388j1586j1434j1311j1406j1441j1001
$$ y = [612656, 631845, 651015, 669349, 687113, 705065, 723270, 741060, 758057, 774634, 791372, 808600, 826606, 845753, 866124, 887373, 909166, 931468, 954138, 976555, 997970, 1018150, 1037424, 1056176, 1074509, 1092377, 1109770, 1126621, 1142496, 1156464, 1167474, 1175002, 1179312, 1180934, 1180003, 1176363, 1170282, 1162747, 1154865, 1147150, 1139495, 1131673, 1123678, 1115715, 1108073, 1101059, 1095006, 1090298, 1087260, 1085897, 1085798, 1086522, 1088095, 1090917, 1095241, 1100940, 1107833, 1115878, 1124975, 1134984, 1146166, 1159183, 1174248, 1190479, 1206578, 1222076, 1237562, 1253753, 1270829, 1288657, 1307128, 1325923, 1344323, 1361617, 1377489, 1391661, 1403364, 1411633, 1416240, 1417963, 1417789, 1416033, 1412443, 1406937, 1399950, 1392119, 1383862, 1375331, 1366530, 1357322, 1347443, 1336719, 1325331, 1313745, 1302311, 1291000, 1279594, 1268153, 1257152]
52223A257152j0097r267q942q898q562p786o987o435n840m893l794k804j624J61
52209A171384K177L466L779L978M866O168P066P303P163O735N846M696L980M170
52195A242777N014N837O160N991N754N911O463O833O533N760N053M426L347J555
52181A317414n59k586m560o527q128r101r822j0837j1885j2018j0750q688o844
52168A215109n649m816l885k659j252Q2J200K167L101L915M475M944N605O232
52154A228569O043M673K824J475O91k02j317j787r31Q39K510L505L771L379K561
52139A256603J855J573J242K28j188j988j770j187q06j55J512M030O473Q339R990
52124A284751J1979J4425J7181K0165K3302K6285K8651L0104L0779L1150L1588
$$ y = [1257152, 1247055, 1237788, 1228846, 1219948, 1211386, 1203600, 1196613, 1190178, 1184338, 1179445, 1175651, 1172847, 1171223, 1171384, 1173561, 1177027, 1180806, 1184784, 1189650, 1195818, 1202884, 1210187, 1217350, 1224085, 1229931, 1234627, 1238607, 1242777, 1247791, 1253628, 1259788, 1265779, 1271533, 1277444, 1283907, 1290740, 1297273, 1303033, 1308086, 1312512, 1315859, 1317414, 1316855, 1314269, 1309709, 1303182, 1295054, 1285953, 1276131, 1265294, 1253409, 1241391, 1230641, 1221953, 1215109, 1209460, 1204644, 1200759, 1198100, 1196848, 1196930, 1198130, 1200297, 1203398, 1207313, 1211788, 1216732, 1222337, 1228569, 1234612, 1239285, 1242109, 1243584, 1244275, 1244073, 1242756, 1240969, 1240038, 1240877, 1243387, 1246892, 1250663, 1254042, 1256603, 1258458, 1260031, 1261273, 1261501, 1260313, 1258325, 1256555, 1255368, 1254562, 1254407, 1255919, 1259949, 1266422, 1274761, 1284751, 1296730, 1311155, 1328336, 1348501, 1371803, 1398088, 1426739, 1456843, 1487622, 1518772, 1550360]
52113A550360L1861L1264K9418K6937K4978K4047K3466K2184J9973J7606J5923
52102A818017J4976J4281J3672J3555J4208J5087J5214J4089J2026R588P008M243
52090A965964J264j950n527r616j4150j8736k2682k5145k5555k4116k1706j9097
52078A778948j6395j3382j0177p334n339m262l718l013j438J229M460P459R827
$$ y = [1550360, 1582221, 1613485, 1642903, 1669840, 1694818, 1718865, 1742331, 1764515, 1784488, 1802094, 1818017, 1832993, 1847274, 1860946, 1874501, 1888709, 1903796, 1919010, 1933099, 1945125, 1954713, 1961721, 1965964, 1967228, 1965278, 1959751, 1950135, 1935985, 1917249, 1894567, 1869422, 1843867, 1819751, 1798045, 1778948, 1762553, 1749171, 1738994, 1731660, 1726321, 1722059, 1718341, 1715328, 1713890, 1715119, 1719579, 1727038, 1736865]
$$ [...]
##END NTUPLES=NMR SPECTRUM
##END=
