##TITLE=AC1571_ROEFFECT0021_8270940_PfGW3nuCP6
##JCAMPDX= 6.0         $$ Bruker NMR JCAMP-DX V2.0
##DATA TYPE= NMR SPECTRUM
##DATA CLASS= NTUPLES
##ORIGIN= BRUKER
##OWNER= Administrator
$$ 1.72 TOPSPIN		Version 2.1
$$ 2013-10-18 18:45:49.747 -0700  Administrator@X
$$ Compression mode = diff/dup
##.OBSERVE FREQUENCY= 400.02188249412
##.OBSERVE NUCLEUS= ^1H
##.ACQUISITION MODE= SIMULTANEOUS (DQD)
##.ACQUISITION SCHEME= undefined
##.AVERAGES= 8
##.DIGITISER RES= 22
##SPECTROMETER/DATA SYSTEM= spect
##.PULSE SEQUENCE= zg30
##.SOLVENT NAME= COFFEE_meoh
##.SHIFT REFERENCE= INTERNAL, COFFEE_meoh, 1, 14.98509
##AUDIT TRAIL= $$ (NUMBER, WHEN, WHO, WHERE, PROCESS, VERSION, WHAT)
$$ ##TITLE= Audit trail, TOPSPIN		Version 2.1
$$ ##JCAMPDX= 5.01
$$ ##ORIGIN= Bruker BioSpin GmbH
$$ ##OWNER= Administrator
$$ $$ E:\/data/COFFEE/nmr/AC1571_ROEFFECT0021_8270940_PfGW3nuCP6/10/pdata/1/auditp.txt
$$ ##AUDIT TRAIL=  $$ (NUMBER, WHEN, WHO, WHERE, PROCESS, VERSION, WHAT)
(   1,<2013-10-18 18:45:42.826 -0700>,<Administrator>,<X>,<go>,<TOPSPIN 2.1>,
      <created by zg
	started at 2013-10-18 18:44:36.716 -0700,
	POWCHK enabled, PULCHK disabled,
       configuration hash MD5:
       C8 4E 4E 5D D3 5C D8 9E 9F 52 82 E0 59 8A DE 15
       data hash MD5: 64K
       C4 0B 3A 3B 4E AF E2 08 B6 91 0C 94 B9 EC EC D8>)
(   2,<2013-10-18 18:45:45.747 -0700>,<Administrator>,<X>,<proc1d>,<TOPSPIN 2.1>,
      <Start of raw data processing
       efp LB = 0 FT_mod = 6 PKNL = 1 PHC0 = 0 PHC1 = 0 SI = 32K 
       data hash MD5: 32K
       45 91 B1 C6 D8 AF 70 D3 CE AB 30 E6 D2 E2 F4 4B>)
(   3,<2013-10-18 18:45:46.138 -0700>,<Administrator>,<X>,<proc1d>,<TOPSPIN 2.1>,
      <pk PHC0 = 93.96606 PHC1 = 0 
       data hash MD5: 32K
       2D BA E6 DC A2 EF B9 9A BC 38 DC 30 B0 F9 70 75>)
(   4,<2013-10-18 18:45:46.372 -0700>,<Administrator>,<X>,<proc1d>,<TOPSPIN 2.1>,
      <abs ABSG = 1 
       data hash MD5: 32K
       56 81 6F 74 CB 18 27 AD F9 F9 C9 FF 1E C5 6F 8E>)
(   5,<2013-10-18 18:45:46.466 -0700>,<Administrator>,<X>,<proc1d>,<TOPSPIN 2.1>,
      <abs ABSG = 2 
       data hash MD5: 32K
       98 4E 49 5D C8 12 29 9E FD 12 87 A5 F8 7F 81 05>)
(   6,<2013-10-18 18:45:46.513 -0700>,<Administrator>,<X>,<proc1d>,<TOPSPIN 2.1>,
      <abs ABSG = 3 
       data hash MD5: 32K
       C1 B0 CB CF 47 1F 21 69 66 31 EC B2 23 09 F4 EE>)
(   7,<2013-10-18 18:45:46.576 -0700>,<Administrator>,<X>,<proc1d>,<TOPSPIN 2.1>,
      <abs ABSG = 4 
       data hash MD5: 32K
       D9 1B 9B EC 9E 42 53 E6 83 7A 68 1E C5 93 D9 10>)
(   8,<2013-10-18 18:45:46.622 -0700>,<Administrator>,<X>,<proc1d>,<TOPSPIN 2.1>,
      <abs ABSG = 5 
       data hash MD5: 32K
       E6 8F D0 84 3C 23 4D 58 2F 9D EE 02 B4 8F D0 9D>)
$$ ##END=
$$ 
$$ $$ hash MD5
$$ $$ B7 FE 77 7D 7D 37 01 BF 05 7E 55 D7 FD 69 51 5D
##$RELAX= 
##$RELAX= 
##$RELAX= 
##$RELAX= 
##$RELAX= 
##$RELAX= 
##$RELAX= 
$$ Bruker specific parameters
$$ --------------------------
##$DU= <E:\>
##$EXPNO= 10
$$ [...]
##$TP= (0..7)
150 150 150 150 150 150 150 150
##$TP07= 0
##$TPNAME0= <>
##$TPNAME1= <>
##$TPNAME2= <>
##$TPNAME3= <>
##$TPNAME4= <>
##$TPNAME5= <>
##$TPNAME6= <>
##$TPNAME7= <>
##$TPOAL= (0..7)
0.5 0.5 0.5 0.5 0.5 0.5 0.5 0.5
##$TPOFFS= (0..7)
0 0 0 0 0 0 0 0
##$TUNHIN= 0
##$TUNHOUT= 0
##$TUNXOUT= 0
##$USERA1= <user>
##$USERA2= <user>
##$USERA3= <user>
##$USERA4= <user>
##$USERA5= <user>
##$V9= 5
##$VALIST= <valist>
##$VCLIST= <CCCCCCCCCCCCCCC>
##$VD= 0
##$VDLIST= <DDDDDDDDDDDDDDD>
##$VPLIST= <PPPPPPPPPPPPPPP>
##$VTLIST= <TTTTTTTTTTTTTTT>
##$WBST= 1024
##$WBSW= 4
##$XGAIN= (0..3)
0 0 0 0
##$XL= 0
##$YL= 0
##$YMAX_a= 632607
##$YMIN_a= -536727
##$ZGOPTNS= <>
##$ZL1= 120
##$ZL2= 120
##$ZL3= 120
##$ZL4= 120
##$ABSF1= 14.98509
##$ABSF2= -5.573092
##$ABSG= 5
##$ABSL= 3
##$ALPHA= 0
##$AQORDER= 0
##$ASSFAC= 0
##$ASSFACI= 0
##$ASSFACX= 0
##$ASSWID= 0
##$AUNMP= <proc_prof1d_extract_pilot.lims>
##$AXLEFT= 0
##$AXNAME= <>
##$AXNUC= <1H>
##$AXRIGHT= 0
##$AXTYPE= 0
##$AXUNIT= <>
##$AZFE= 0.1
##$AZFW= 0.1
##$BCFW= 0
##$BC_mod= 0
##$BYTORDP= 0
##$COROFFS= 0
##$CY= 15
##$DATMOD= 1
##$DC= 0
##$DFILT= <>
##$DTYPP= 0
##$F1P= 0
##$F2P= 0
##$FCOR= 0.5
##$FTSIZE= 32768
##$FT_mod= 6
##$GAMMA= 0
##$GB= 0
##$INTBC= 1
##$INTSCL= 1
##$ISEN= 128
##$LB= 0
##$LEV0= 0
##$LPBIN= 0
##$MAXI= 10000
##$MC2= 0
##$MEAN= 0
##$ME_mod= 0
##$MI= 0
##$NCOEF= 0
##$NC_proc= -8
##$NLEV= 6
##$NOISF1= 0
##$NOISF2= 0
##$NSP= 0
##$NTH_PI= 0
##$NZP= 0
##$OFFSET= 14.98509
##$PC= 1
##$PHC0= 93.96606
##$PHC1= 0
##$PH_mod= 1
##$PKNL= yes
##$PPARMOD= 0
##$PPDIAG= 0
##$PPIPTYP= 0
##$PPMPNUM= 2147483647
##$PPRESOL= 1
##$PSCAL= 4
##$PSIGN= 0
##$PYNMP= <proc.py>
##$REVERSE= no
##$SF= 400.02
##$SI= 32768
##$SIGF1= 0
##$SIGF2= 0
##$SINO= 400
##$SIOLD= 32768
##$SPECTYP= <>
##$SREGLST= <1H.CDCl3>
##$SSB= 0
##$STSI= 32768
##$STSR= 0
##$SW_p= 8223.68421052631
##$SYMM= 0
##$S_DEV= 0
##$TDeff= 65536
##$TDoff= 0
##$TI= <>
##$TILT= no
##$TM1= 0
##$TM2= 0
##$TOPLEV= 0
##$USERP1= <user>
##$USERP2= <user>
##$USERP3= <user>
##$USERP4= <user>
##$USERP5= <user>
##$WDW= 1
##$XDIM= 32768
##$YMAX_p= 463280435
##$YMIN_p= -635930
##$CURPLOT= <Network HP LaserJet P1505>
##$CURPRIN= <$Network HP LaserJet P1505>
##$DFORMAT= <normdp>
##$LAYOUT= <+/1D_H.xwp>
##$LFORMAT= <normlp>
##$PFORMAT= <normpl>
##$SURQMSG= 1
$$ End of Bruker specific parameters
$$ ---------------------------------
##NTUPLES= NMR SPECTRUM
##VAR_NAME=  FREQUENCY,     SPECTRUM/REAL,   SPECTRUM/IMAG
##SYMBOL=    X,             R,               I
##VAR_TYPE=  INDEPENDENT,   DEPENDENT,       DEPENDENT
##VAR_FORM=  AFFN,          ASDF,            ASDF
##VAR_DIM=   32768,         32768,           32768
##UNITS=     HZ,            ARBITRARY UNITS, ARBITRARY UNITS
##FACTOR=    0.250966925370066, 1,           1
##FIRST=     8223.43324360094, 144158,       38217
##LAST=      0,             68603,           -190727
##MIN=       0,             -635930,         0
##MAX=       8223.43324360094, 463280435,    0
$$ Real data points
##PAGE= N=1
##DATA TABLE= (X++(R..R)), XYDATA
$$ [...]
19540H0729M5635m5234Q745b1650B45239f399A38158b69004J8769a03495j84658
$$ 80729 126364 81130 89875 -21650 245239 -6399 138158 -269004 -250235 -103495 -288153
19529b88153h6768B03576J1900B9784a08595K4111K9913o118E8723J88759a66318
$$ -288153 -86768 203576 215476 29784 -108595 -84484 -54571 -60689 58723 247482 -166318
19517h4480H9239K1985a31054B34618l9569J54899a98342j0302j68780e4567A93354
$$ -84480 89239 111224 -131054 234618 195049 349948 -198342 -208644 -377424 -54567 193354
19505e36346F7921a71122A45898b23016d3670m5721o5199I8176K1252k0097P1993
$$ -536346 67921 -171122 145898 -223016 -43670 -89391 -154590 98176 119428 99331 171324
19494A71324h4276I8704B0732N6741k3126Q0832a0293r7889j18056A15581a71907
$$ 171324 -84276 98704 20732 77473 54347 135179 -10293 -108182 -226238 115581 -171907
19482a28060q9928j48101B8709b01565g7355j45443A21153M2323d493A1377a38415
$$ -128060 -217988 -366089 28709 -201565 -77355 -222798 121153 163476 -4493 11377 -138415
19470b25097r2301J37366c6880j17632E2192a37104A36763m0364b76653a4942
$$ -225097 -317398 -180032 -36880 -154512 52192 -137104 136763 96399 -276653 -14942
19459i8629j13111a2671m9072C951L07774j1127C2790a50905l4111a2207k3431
$$ -98629 -211740 -12671 -61743 3951 311725 300598 32790 -150905 -185016 -12207 -35638
19448c5638a0882k35785A1891h8782j14831B51568b56128b5667F4955b10762r5620
$$ -35638 -10882 -246667 11891 -88782 -203613 251568 -256128 -25667 64955 -210762 -306382
19437c06382O985d0768k199j78752Q810k9224j13079c7086A06129m8231c5046
$$ -306382 -299397 -40768 -42967 -221719 -212909 -242133 -355212 -37086 106129 57898 -35046
19425a92092A4610c5787j7687k53860P8132j07699h0552j43648A59364J72160
$$ -192092 14610 -35787 -53474 -307334 -229202 -336901 -80552 -224200 159364 331524
19415C31524d689A83834B84J94728b84189B21167g4358b2410k6880l00978I7120
$$ 331524 -4689 183834 284 195012 -284189 221167 -74358 -22410 -49290 -350268 97120
19403b8699D8682J78021a91325L1437O7647F4263a60947B91793i7659a3398j04173
$$ -28699 48682 226703 -191325 -159888 -92241 64263 -160947 291793 -97659 -13398 -117571
19392a17571a7261l94983g3027D7626g8216A18113a46580B91586f8365A02068
$$ -117571 -17261 -412244 -73027 47626 -78216 118113 -146580 291586 -68365 102068
19381B03579D7733O0071i3186j41004H8538J36179a63844k6075A00933L26412
$$ 203579 47733 107804 -93186 -234190 88538 224717 -163844 -189919 100933 427345
19371D27345h85j26121p2150P8119A07467J43442p8474a2976m6640m4574p9912
$$ 427345 -885 -127006 -199156 -121037 107467 250909 172435 -12976 -59616 -104190 -184102
19360a84102L4508A4722a0983A7625d18872J17985q4403G6157a26567n4278B05583
$$ -184102 -149594 14722 -10983 17625 -418872 -300887 -385290 76157 -126567 -180845 205583
19348B39789b17884a1988o0498K4097j16358I6402m6602b41983C073a2834m65652
$$ 239789 -217884 -11988 -72486 -48389 -164747 96402 49800 -241983 3073 -12834 -478486
19337d78486a20586r9597A84534G8630a06916B74897A01120D7561a93709R4059
$$ -478486 -120586 -220183 184534 78630 -106916 274897 101120 47561 -193709 -99650
19327i9650D5754b10670B16315a99222H3299j0356f0168j40341o5969a6484n7506
$$ -99650 45754 -210670 216315 -199222 83299 72943 -60168 -200509 -266478 -16484 -73990
19316g3990j73164p8156J02023q7642a31713A41082b7185F1207a88742a9199j33820
$$ -73990 -247154 -325310 -223287 -310929 -131713 141082 -27185 61207 -188742 -19199 -153019
19305a53019A62532J3977c72115a20057n3183p4863N4796B15853c72909A21274
$$ -153019 162532 176509 -372115 -120057 -173240 -248103 -193307 215853 -372909 121274
19294e257A82764i6166F8444b90414B7339c18121G2071b70809O4564d541j96883
$$ -5257 182764 -96166 68444 -290414 27339 -318121 72071 -270809 -206245 -4541 -201424
19283b01424k7751A16220b86629f9464E5765a36383m6667D2630J18000g5120l1258
$$ -201424 -229175 116220 -286629 -69464 55765 -136383 -183050 42630 160630 -75120 -106378
19272a06378M2917k7812A60391b76565A01055a48667J9811j01439B52104a07824
$$ -106378 -63461 -91273 160391 -276565 101055 -148667 -128856 -230295 252104 -107824
19261H5744d6819a0164j47284A0815Q8308c63054a32895r9126k952C03264C9105
$$ 85744 -46819 -10164 -157448 10815 99123 -363054 -132895 -232021 -234973 303264 39105
19249a08705J6801J8978k68137J0043a1445k06645a602B6638R3384b62952h6173
$$ -108705 -91904 -72926 -341063 -331020 -11445 -218090 -1602 26638 120022 -262952 -86173
19237E5918i9930k07749g6933B3712c13935E4563c60235A01890E140J07765Q1215
$$ 55918 -99930 -307679 -76933 23712 -313935 54563 -360235 101890 5140 112905 194120
19226A94120k1697b11261C9459J10438f7675k318A81709R9856a33811F9169c46419
$$ 194120 172423 -211261 39459 149897 -67675 -69993 181709 281565 -133811 69169 -346419
19214a15128G7527a4665A7542J42928b76589a17628o6140B8274a98470A9479g9945
$$ -115128 77527 -14665 17542 160470 -276589 -117628 -183768 28274 -198470 19479 -79945
19202b3048A41019a11852o053J8860j03847B31157H7803K9132h4442k52872h9461
$$ -23048 141019 -111852 -117905 -99045 -202892 231157 87803 116935 -84442 -337314 -89461
19190a04526d0447n2005j85769b8107j29649G3473J38856a85016b6918r5942A39922
$$ -104526 -40447 -92452 -278221 -28107 -157756 73473 212329 -185016 -26918 -122860 139922
19178B1584b3904C11984G1098j5652Q8593b02337g8284c1524p5236g950q7328
$$ 21584 -23904 311984 71098 55446 144039 -202337 -78284 -31524 -106760 -7950 -95278
19167i5278c8601m6896A33213m6692i0401H7890g3475D6427a30994c588j44497
$$ -95278 -38601 -85497 133213 86521 -90401 87890 -73475 46427 -130994 -3588 -148085
19156a48085A99255c63449a20726A52353A8698a61512b8577j61420M0430J9404
$$ -148085 199255 -363449 -120726 152353 18698 -161512 -28577 -189997 -149567 -130163
19146a30163M7129L8168A78395C1279a28646C53572j14990c18320F3274a37926
$$ -130163 -83034 -44866 178395 31279 -128646 353572 238582 -318320 63274 -137926
19135i3231A8208d3534A3208g2725j74920i6139i224A87296i4761j55116G0821
$$ -93231 18208 -43534 13208 -72725 -247645 -96139 -9224 187296 -94761 -249877 70821
19123c46148I46d13852A12356h9028o9055M0646j23653C2552b41630j28894E2544
$$ -346148 946 -413852 112356 -89028 -158083 -117437 -241090 32552 -241630 -370524 52544
19111C62124c48568n1235a13871A23294b60311c9241j20989j12813D02258c16610
$$ 362124 -348568 -399803 -113871 123294 -260311 -39241 -160230 -273043 402258 -316610
19100a77559p6309Q0745L4950K1170A35109a79185e7152q5864J9425K8386L6847
$$ -177559 -253868 -173123 -138173 -117003 135109 -179185 -57152 -143016 -123591 -95205 -58358
19089e8358k25465A21169D1904c84084f3352F4046J23224a30052G2035J96664
$$ -58358 -283823 121169 41904 -384084 -63352 64046 187270 -130052 72035 268699
19079B68699d46122C03350j42195D2795O709f6018j34845K1557A5216N6359R5069
$$ 268699 -446122 303350 161155 42795 49504 -66018 -200863 -179306 15216 71575 166644
19068A66644n1978a5415F4180N9422k0097b22477c9759k27418L5286O6766B52825
$$ 166644 114666 -15415 64180 123602 103505 -222477 -39759 -267177 -231891 -165125 252825
19056c32272B2388a50947k80248a79588E7542J83618b1521l608r6718A4166J76108
$$ -332272 22388 -150947 -431195 -179588 57542 241160 -21521 -25129 -121847 14166 190274
19045A90274b32549j0847A8841a41751e3052B064L1410d03450B02488b8596G0788
$$ 190274 -232549 -243396 18841 -141751 -53052 2064 33474 -403450 202488 -28596 70788
19033E0521b14982A21653N3510J80446q8473a03109D10694j95900I9780a23437
$$ 50521 -214982 121653 175163 355609 267136 -103109 410694 214794 99780 -123437
19022d6533J0332A93792q2502a83862F3945N6820a06649I3980b30582A11179b98659
$$ -46533 -36201 193792 111290 -183862 63945 120765 -106649 93980 -230582 111179 -298659
19010a40913j9922M8330c9137l9732k3664d9725p8136G0848c29287d251B70167
$$ -140913 -160835 -112505 -39137 -78869 -102533 -49725 -127861 70848 -329287 -4251 270167
18998D22430b07907A23282a83525b6354q5058r150K494K5820r8228Q210G3438
$$ 422430 -207907 123282 -183525 -26354 -111412 -120562 -118068 -92248 -190476 -182266 73438
18986a86246M6552O2534r9496A17252i1008B0033a87576L7529D0148D380b25410
$$ -186246 -139694 -77160 -176656 117252 -91008 20033 -187576 -150047 40148 4380 -225410
18974H7721A2248J11195h0528l6562b881C6014c85634A78629a39159B55880D0887
$$ 87721 12248 123443 -80528 -117090 -2881 36014 -385634 178629 -139159 255880 40887
18962a5023p1381k43086B55079a54810H5263Q6550F5664c1042B21492d0607B08323
$$ -15023 -86404 -329490 255079 -154810 85263 171813 65664 -31042 221492 -40607 208323
18950c3938B23783o3167k9380a41140C03670I7492l5101d91484B74314g258k50335
$$ -33938 223783 160616 131236 -141140 303670 97492 62391 -491484 274314 -7258 -257593
18939b57593D5219a22484l3503k2123a6401j8695m0539a2344I1214g4157B5668
$$ -257593 45219 -122484 -155987 -178110 -16401 -35096 -75635 -12344 91214 -74157 25668
18927i1293e991j72543B90689f6616o2530a1640H875J26386i4247R836J8603B01437
$$ -91293 -5991 -178534 290689 -66616 -129146 -11640 8875 135261 -94247 -84411 -65808 201437
18914A20452E0623b34489g2969B13633i484j50819r6694A60831f4730A716J84994
$$ 120452 50623 -234489 -72969 213633 -9484 -160303 -256997 160831 -64730 1716 186710
18903A86710b11332i6085L7518f645A6906M8450J20525a01959b175k58162A18363
$$ 186710 -211332 -96085 -58567 -6645 16906 65356 185881 -101959 -2175 -260337 118363
18891a58j81777l3624K3186p7488A8719i014k09829e2743C96216a05369K9686
$$ -158 -181935 -215559 -192373 -269861 18719 -9014 -218843 -52743 396216 -105369 -75683
18880g5683m51206B748b37650R2830C5900a70558j3607r0572A72072q1473J04797
$$ -75683 -526889 2748 -237650 -144820 35900 -170558 -184165 -274737 172072 90599 195396
18869A95396a31974j65457J38384C8221J41604a29969j67229B18559a40677l30800
$$ 195396 -131974 -297431 -159047 38221 179825 -129969 -297198 218559 -140677 -471477
18859d71477A08302B4672c04729F1917b1830j4646H6249b49460A1121J40577m7837
$$ -471477 108302 24672 -304729 61917 -21830 -36476 86249 -249460 11121 151698 103861
18848A03861d2407B82037g853A95775f2723k21454B60136A09732a46241N3989
$$ 103861 -42407 282037 -7853 195775 -62723 -284177 260136 109732 -146241 -92252
18838i2252M4973j87868f3260f200A17631K47593b82994L5337C40328j23379o2311
$$ -92252 -47279 -235147 -63260 -6200 117631 365224 -282994 -247657 340328 216949 154638
18827A54638a97409P5213d8097k62482C8215H587i0632l60236b8257a98B26534
$$ 154638 -197409 -122196 -48097 -310579 38215 8587 -90632 -450868 -28257 -198 226534
18815A6258f8356i328D82468a4374m219C56566A34643f2841D4814M54286A78460
$$ 16258 -68356 -9328 482468 -14374 -18593 356566 134643 -62841 44814 499100 178460
18803i8014k11150C6834r496J68559J19225a25342C26002A58381d1951J7859O749
$$ -98014 -309164 36834 27338 195897 315122 -125342 326002 158381 -41951 -24092 -17343
18792a7343B7640d35074a51512l42418K00768A08753b87420M528B5026J9517e9983
$$ -17343 27640 -435074 -151512 -493930 -293162 108753 -287420 -282892 25026 44543 -59983
18780a88507A13811a2379l13234J10887M8112N3451B02692a43282K8950J1415
$$ -188507 113811 -12379 -325613 -214726 -166614 -113163 202692 -143282 -114332 -102917
18770a02917J4283A46146c887B1642b19389C3841b1766k15797A30614a50406I3670
$$ -102917 -88634 146146 -3887 21642 -219389 33841 -21766 -237563 130614 -150406 93670
18758e37860I2815a39038E0832N7373b30672A0202K2838a30280K6401H0276l471
$$ -537860 92815 -139038 50832 108205 -230672 10202 33040 -130280 -103879 80276 76805
18747G6805E830a07938q8237i3862j79398g7397A12969c9666n2770A17792e15083
$$ 76805 5830 -107938 -196175 -93862 -273260 -77397 112969 -39666 -92436 117792 -515083
18735b77084g4064j05247L6421O2602l73123b20871J3547A41953f0518k20054
$$ -277084 -74064 -179311 -142890 -80288 -453411 -220871 -207324 141953 -60518 -280572
18725b80572b5960B2933a38128f9030j6132A64284d4108B52207a50089c5594r7455
$$ -280572 -25960 22933 -138128 -69030 -85162 164284 -44108 252207 -150089 -35594 -133049
18714a33049I0048b73400M993a15087a6363k30318C568J2637Q768i9591K9858
$$ -133049 90048 -273400 -268407 -115087 -16363 -246681 3568 16205 24973 -99591 -69733
18703f9733j11561K5823m6051c1333j59022B63652b05551e1495j23017g3082B89231
$$ -69733 -181294 -155471 -201522 -31333 -190355 263652 -205551 -51495 -174512 -73082 289231
18691A60573h5391r8673A89976a64075A70780l8387a28082A98210a41138j37545
$$ 160573 -85391 -184064 189976 -164075 170780 132393 -128082 198210 -141138 -278683
18681b78683J33791B94238A45901d73284F6236C2761a91648b8205j31359m48673
$$ -278683 -144892 294238 145901 -473284 66236 32761 -191648 -28205 -159564 -608237
18671f08237c0242l8355r4562A64893m0716c75073a39893k9600A43975a42884
$$ -608237 -30242 -68597 -163159 164893 124177 -375073 -139893 -169493 143975 -142884
18660g9384L1525j31669B03375a23037j94987a10388A97975b15200B09396h1801
$$ -79384 -47859 -179528 203375 -123037 -318024 -110388 197975 -215200 209396 -81801
18649B14590f6688B35305I8923Q8610D2678i6928c5920E5436f5012A83099a27279
$$ 214590 -66688 235305 98923 187533 42678 -96928 -35920 55436 -65012 183099 -127279
18637C98532d8224F4126O1580b30364a3107j02050k21738a64045A26919a17992
$$ 398532 -48224 64126 125706 -230364 -13107 -115157 -336895 -164045 126919 -117992
18626D7757c87753a93382a201k3966j66413e4642m1891B63340c12607a13231A34452
$$ 47757 -387753 -193382 -1201 -25167 -191580 -54642 -96533 263340 -312607 -113231 134452
18614e1407k64408j02533M6427C04856o7086a97162B35292r9858a69234b2579
$$ -51407 -315815 -418348 -371921 304856 237770 -197162 235292 135434 -169234 -22579
18603A59933R2318a50110j3804A59506b87636R3066C44282a78094A00406i8740
$$ 159933 252251 -150110 -163914 159506 -287636 -194570 344282 -178094 100406 -98740
18592a75756P3668I8226a34866r9369n5585A22665A7008O6702k8297a36965a928
$$ -175756 -102088 98226 -134866 -234235 -289820 122665 17008 83710 55413 -136965 -1928
18580c98204B50288A03071A5313a1651B21366D3168l311J9447c4082m7494q2835
$$ -398204 250288 103071 15313 -11651 221366 43168 39857 59304 -34082 -81576 -164411
18569a64411B54005b33207p7991Dd5854m0180C22202j42571b98050K5754C9428
$$ -164411 254005 -233207 -311198 4 -45854 -86034 322202 179631 -298050 -272296 39428
18557a15471C06905b07790b7102A1689f8494j08037M4j60588J08527j3240F4779
$$ -115471 306905 -207790 -27102 11689 -68494 -176531 -176487 -337075 -228548 -241788 64779
18545G6990a4486j21831B25439j10272a68090l11041K34856A21418a30397A48424
$$ 76990 -14486 -136317 225439 115167 -168090 -479131 -244275 121418 -130397 148424
18534d7135A1131K28718B1381J37665c95596A1278a47495K7214k2258q4835f0222
$$ -47135 11131 239849 21381 159046 -395596 11278 -147495 -120281 -142539 -227374 -60222
18522c44501g4727L0814D12046a65514I3253b28961d5321k01332B41200e3297
$$ -344501 -74727 -43913 412046 -165514 93253 -228961 -45321 -246653 241200 -53297
18511D0554a79512p0112d5307k88577a43307G795K5696L38924F8376O675b15595
$$ 40554 -179512 -249624 -45307 -333884 -143307 7795 33491 372415 68376 75051 -215595
18499F7697M8850L585O3022f5325k00A47077m9622a07446l16733a85498G2084
$$ 67697 116547 120132 183154 -65325 -65525 147077 97455 -107446 -424179 -185498 72084
18487I8092c4802k42250b4730j22112o5925d3245A69893j3913a3717k20395j93291
$$ 98092 -34802 -277052 -24730 -146842 -212767 -43245 169893 155980 -13717 -234112 -427403
18476d27403g1676l02819Q7681d5414A41803H750L3923a4690B46330j22083i6061
$$ -427403 -71676 -374495 -286814 -45414 141803 8750 42673 -14690 246330 124247 -96061
18464c46758I3588e2140j72174L8751A0355J47090a59457F6622c44749n8447C3570
$$ -346758 93588 -52140 -224314 -185563 10355 157445 -159457 66622 -344749 -403196 33570
18452C3805a84198A57866F6953K4392J2255g5407A60355b30255A0501N7944a81247
$$ 33805 -184198 157866 66953 91345 103600 -75407 160355 -230255 10501 68445 -181247
18440D6788J24525a31787A58037b91419J12951G828a15457M9966C3881P5963N9425
$$ 46788 171313 -131787 158037 -291419 -178468 7828 -115457 -65491 33881 109844 169269
18429A69269c83533H6193a08865o2697L8189O6335j905J5709k19188D8467L0415
$$ 169269 -383533 86193 -108865 -171562 -133373 -67038 -68943 -53234 -272422 48467 78882
18418G8882a93589o9371D3312a84833d3568k99877a46068D2683b4926k0167o2219
$$ 78882 -193589 -262960 43312 -184833 -43568 -343445 -146068 42683 -24926 -45093 -107312
18407a07312A47859m7520m9854c50620F678J27570E251a62998A11233J2218e5651
$$ -107312 147859 100339 50485 -350620 6678 134248 5251 -162998 111233 123451 -55651
18395i5897l68714d3003A7059c20211g1407A90891L3975h5841k62514c2731l01818
$$ -95897 -464611 -43003 17059 -320211 -71407 190891 224866 -85841 -348355 -32731 -334549
18384c34549c4461A22691m9284a07861k36677B93011a9049j06064L1448j89010
$$ -334549 -34461 122691 73407 -107861 -344538 293011 -19049 -125113 -93665 -282675
18374b82675A8213P2471a91593A00032M5453a46083A0960J46241Q0134a54441
$$ -282675 18213 90684 -191593 100032 145485 -146083 10960 157201 237335 -154441
18363B11213b5260A39004L7079M84486H7742K1293c3206k17953r1366A24261g9564
$$ 211213 -25260 139004 176083 660569 87742 109035 -33206 -251159 -342525 124261 -79564
18351d6640p8705C3346a38641j37353g65j8493A6625a1267n9323f773j72859A42627
$$ -46640 -125345 33346 -138641 -275994 -765 -19258 16625 -11267 -70590 -6773 -179632 142627
18338B40424f1172j16480e7091O30j02979l91266C6208f3474j63855b4140D9994
$$ 240424 -61172 -177652 -57091 -56461 -159440 -550706 36208 -63474 -227329 -24140 49994
18326a74928m5862F8249a97865a0305j28471B48968b21085H2220d23906O3968
$$ -174928 -220790 68249 -197865 -10305 -138776 248968 -221085 82220 -423906 -359938
18316c59938F8082K61376b59903J4166f6706m8459B3802K77943I5623L4332b13587
$$ -359938 68082 329458 -259903 -245737 -66706 -115165 23802 301745 95623 129955 -213587
18304C83483b22988B43986b21628A23206a1650A29748d8622J938p5391A20882
$$ 383483 -222988 243986 -221628 123206 -11650 129748 -48622 -46684 -122075 120882
18293B4071a57324L4928J2075D70413A58866J5414N680e9615c683j68639o2009
$$ 24071 -157324 -122396 -110321 470413 158866 174280 179960 -59615 -3683 -172322 -234331
18282b34331B61916a12729B36610a14162m3206g8335A33829J03533e8703B48518
$$ -234331 261916 -112729 236610 -114162 -157368 -78335 133829 237362 -58703 248518
18271a76191A28828J0580o4657d36690A92017a01050j76098a00125L7242B15408
$$ -176191 128828 139408 74751 -436690 192017 -101050 -277148 -100125 -62883 215408
18260b35062C84376a16803E316b44875E9539a1471C05938b2881l6990i26l74004
$$ -235062 384376 -116803 5316 -244875 59539 -11471 305938 -22881 -59871 -926 -374930
18249c74930B0536a64240c5214l56625J88704j03020H9974g4999b4954A82058
$$ -374930 20536 -164240 -35214 -391839 -203135 -306155 89974 -74999 -24954 182058
18238a0840n7014j5882k05403A32131l3330C5346a19777I1368c4505B08355A8475
$$ -10840 -67854 -83736 -289139 132131 98801 35346 -119777 91368 -34505 208355 18475
18226c6805G419d2848j34370b627r3550G9133k5504N2353g945j07971A31853c56734
$$ -36805 7419 -42848 -177218 -2627 -96177 79133 53629 105982 -7945 -115916 131853 -356734
18213d93535f0429j10713A34182D7936c3454B62470a99484H5516K32638A25555
$$ -493535 -60429 -171142 134182 47936 -33454 262470 -199484 85516 318154 125555
18202E5897J83162O7588a55438N7813q3771k18734a23601q9833P2762j14901d6009
$$ 55897 239059 306647 -155438 -97625 -181396 -400130 -123601 -213434 -140672 -255573 -46009
18190a83129F7709a68673H5924a47321l9272A17957e9839e803j26154d6303j35177
$$ -183129 67709 -168673 85924 -147321 -186593 117957 -59839 -5803 -131957 -46303 -181480
18179a81480r2419a17481j20612I5147c04093J21971B38200D951a56941B6166
$$ -181480 -273899 -117481 -238093 95147 -304093 -182122 238200 4951 -156941 26166
18168b66843D9881b61061P5371N9903C44344c63375C62070H7231K8392N6009a86676
$$ -266843 49881 -261061 -185690 -125787 344344 -363375 362070 87231 115623 171632 -186676
18156a82228A13314a94888B90389a32796j53844K99C67280a20994A72350N0968
$$ -182228 113314 -194888 290389 -132796 -286640 -286341 367280 -120994 172350 223318
18146B23318f4403J6258B20220b27879E5483J67772j00644a41133H8360P0650
$$ 223318 -64403 -48145 220220 -227879 55483 223255 122611 -141133 88360 159010
18136A59010a09617A11686n0355B7970K72063e6256r3334d1087A12593E0998d6169
$$ 159010 -109617 111686 61331 27970 300033 -56256 -149590 -41087 112593 50998 -46169
18124A20863a83285C4565d5894k5483C36357g0616H2477a40638l1252j39418A39813
$$ 120863 -183285 34565 -45894 -71377 336357 -70616 82477 -140638 -171890 -311308 139813
18112e5208j44967B52625b26463P3197k23772b3403k70214B6929J17442D3674
$$ -55208 -200175 252625 -226463 -153266 -377038 -23403 -293617 26929 144371 43674
18101A15047J2255b05226B65785b63878J25803e1182j43452F7402R5875c59004
$$ 115047 127302 -205226 265785 -263878 -138075 -51182 -194634 67402 163277 -359004
18090b72315k68337A98756D5993Q6661c76130g7346k5884G0983L92505h5301j89884
$$ -272315 -540652 198756 45993 132654 -376130 -77346 -103230 70983 463488 -85301 -275185
18079b75185l075h1261B93396i3950A7070J77401a96838e2254j25417c5424C23953
$$ -275185 -278260 -81261 293396 -93950 17070 194471 -196838 -52254 -177671 -35424 323953
18067A22738h2657B15563a3105F3055f3993C99763h5979n9253j5420O4760A86516
$$ 122738 -82657 215563 -13105 63055 -63993 399763 -85979 -145232 -160652 -95892 186516
18055A52785b48673A14737a8943A13614f6082j68088c4273j53360a0638l2680
$$ 152785 -248673 114737 -18943 113614 -66082 -234170 -34273 -187633 -10638 -43318
18045d3318q8712O2311a0505k93761B10611a74685O3839j6553A76403a49704L5302
$$ -43318 -132030 -69719 -10505 -304266 210611 -174685 -110846 -127399 176403 -149704 -114402
18034a14402b3449j23131C1891i2427L6055A04249a35029j11184A50663E4292
$$ -114402 -23449 -146580 31891 -92427 -56372 104249 -135029 -246213 150663 54292
18023a73569B18703H926h1654p3992k5899A36935c3552m003P037F6799K6857m1500
$$ -173569 218703 8926 -81654 -155646 -181545 136935 -33552 -37555 -30518 66799 93656 52156
18011E2156a90800A25461a83714F1421P6012b02203D7110c55604b270q1674L6546
$$ 52156 -190800 125461 -183714 61421 137433 -202203 47110 -355604 -2270 -83944 -47398
18000d7398A77891a16706B07921c4896A23898b71653P7146j0039B9703a04976
$$ -47398 177891 -116706 207921 -34896 123898 -271653 -194507 -204546 29703 -104976
17989g1104p2280r3154C6008K27988B1321J9172M7519l3444a12682A55108D3579
$$ -71104 -143384 -236538 36008 263996 21321 40493 88012 54568 -112682 155108 43579
17977b23160A93535H3469J3857d6495l15612Q5813D5987L1543A3784M2284J19510
$$ -223160 193535 83469 97326 -46495 -362107 -276294 45987 77530 13784 56068 175578
17966A75578A4096i7007B74040m9644J9979J02504a60791D4368b52359N3349D201
$$ 175578 14096 -97007 274040 224396 244375 346879 -160791 44368 -252359 -199010 4201
17954c83147A34382d410j45036B08627H9458i041A61721c6715B22098j7224a18962
$$ -383147 134382 -4410 -149446 208627 89458 -9041 161721 -36715 222098 204874 -118962
17942C9873e69378A16330m2745b0760A60297a69977I3671B6851a90684A18340
$$ 39873 -569378 116330 73585 -20760 160297 -169977 93671 26851 -190684 118340
17931A48544c3807q6659k51748b5114I693e9217k56871D9222K00004n3493m6501
$$ 148544 -33807 -120466 -372214 -25114 9693 -59217 -316088 49222 249226 195733 149232
17920A49232F4280a76589o8348I976a75065M4797e0969p177K8994o5106c8827
$$ 149232 64280 -176589 -244937 9976 -175065 -130268 -50969 -58146 -29152 -94258 -38827
17908g4402l57947D75301E8884K5556d1842N114F9188a14895k07203a35843c8247
$$ -74402 -432349 475301 58884 84440 -41842 -36728 69188 -114895 -322098 -135843 -38247
17896h9978f163a039C3977b15258R7804M977A41253A4833b00569e2696k51053
$$ -89978 -6163 -1039 33977 -215258 -117454 -112477 141253 14833 -200569 -52696 -303749
17885c03749F5611b84314j30898D82693A46215g5704B8530L3869g6712j70412
$$ -303749 65611 -284314 -415212 482693 146215 -75704 28530 62399 -76712 -247124
17875b47124A42022c16199h416A81309i14j67040l23499f709A7526a83460C8759
$$ -247124 142022 -316199 -8416 181309 -914 -167954 -491453 -6709 17526 -183460 38759
17863c70671i1781D40356b98553f9659J8868K2733A10231d26028D4070K72789
$$ -370671 -91781 440356 -298553 -69659 -50791 -28058 110231 -426028 44070 316859
17853C16859c55937G8112h8790c2441o7662o4192C56947c16881B0491g5231j59259
$$ 316859 -355937 78112 -88790 -32441 -100103 -164295 356947 -316881 20491 -75231 -234490
17842b34490k6657D1111A7107a2289A77121b76153e3264C9680d5473r632j2356
$$ -234490 -261147 41111 17107 -12289 177121 -276153 -53264 39680 -45473 -55105 -67461
17831f7461H6298Q9388c52068A5670a04044k67923a0608k8670m8052I6179M31998
$$ -67461 86298 175686 -352068 15670 -104044 -371967 -10608 -39278 -87330 96179 528177
17820E28177A52331D1204e8689k96434f5566I1175h0675L9971E1137O6847a90508
$$ 528177 152331 41204 -58689 -355123 -65566 91175 -80675 -40704 51137 117984 -190508
17808d5264o0726j98588h5966j00219r2125J26188B03252a05204B52291c11830
$$ -45264 -105990 -304578 -85966 -186185 -278310 -152122 203252 -105204 252291 -311830
17797f0768A66349a95036B22922c15825h4035e467B16055g2158l9194A65495a98570
$$ -60768 166349 -195036 222922 -315825 -84035 -5467 216055 -72158 -111352 165495 -198570
17785C3772J69545N7786b0329r9371A15786a38832b3160p6144B3034a04291n2398
$$ 33772 203317 261103 -20329 -119700 115786 -138832 -23160 -99304 23034 -104291 -156689
17774a56689g3523B49687B0413Q3161N0303o9495g3135K206q0266B03967E2630
$$ -156689 -73523 249687 20413 103574 153877 84382 -73135 -70929 -151195 203967 52630
17762F4413J51437h2909D95554b36411c6992A26186Q0727a61696A84376b49428
$$ 64413 215850 -82909 495554 -236411 -36992 126186 206913 -161696 184376 -249428
17751B8968J64006B9376P9866J3314b77050B09714o0431N1522b90615c3872n3234
$$ 28968 192974 29376 109242 122556 -277050 209714 149283 200805 -290615 -33872 -87106
17740h7106G7553j1312J90737l0714J27443b62585E314J52735A9622b62307C53678
$$ -87106 77553 66241 256978 226264 353707 -262585 5314 158049 19622 -262307 353678
17728a03689B160N400i2630p6611A41939O0859f490m6914A24016J66091D4388
$$ -103689 2160 7560 -92630 -169241 141939 202798 -6490 -53404 124016 290107 44388
17716b30539G1643d6538A06250Q9654I68J81637D6165L24312a63759p1946J7247
$$ -230539 71643 -46538 106250 195904 968 182605 46165 370477 -163759 -235705 -218458
17705b18458f9714A67281a38509B00908l2148a98886g6449b663C4016R5380a48953
$$ -218458 -69714 167281 -138509 200908 168760 -198886 -76449 -2663 34016 129396 -148953
17693E359J58465c60308F20R9593a17616I9630c33671A92224D1849a3688C0016
$$ 5359 163824 -360308 620 100213 -117616 99630 -333671 192224 41849 -13688 30016
17681B1693a01611n415o7607N5250o6657f2025C04619B0969a77710Q3252G3676
$$ 21693 -101611 -107026 -174633 -119383 -186040 -62025 304619 20969 -177710 -94458 73676
17669H8307b29571c0169E9018D245R0755J00539e0719B78595a39385B0471J61817
$$ 88307 -229571 -30169 59018 4245 95000 195539 -50719 278595 -139385 20471 182288
17658A82288a65660P5424A30350A9551L03015j24275b34242a28A19609a07272
$$ 182288 -165660 -90236 130350 19551 322566 198291 -234242 -128 119609 -107272
17647C22137l9149b7328j36807o7383j99890d4724l918p9518F8887g89A5484J75868
$$ 322137 282988 -27328 -164135 -231518 -431408 -44724 -48642 -128160 68887 -789 15484 191352
17635A91352g1119A05815K38343g2504A73199a03142E8914d5017j19851H2480
$$ 191352 -71119 105815 344158 -72504 173199 -103142 58914 -45017 -164868 82480
17624a58259A94993h511k0932I0186J19133J15817o9755a43332c9948A18850R618
$$ -158259 194993 -8511 -29443 90186 209319 325136 255381 -143332 -39948 118850 128468
17613A28468h7971b9255B00126a06955C25852b40762l6355B2907a92288b3724
$$ 128468 -87971 -29255 200126 -106955 325852 -240762 -277117 22907 -192288 -23724
17602B3241q78d20232D4719r805i1377D14745a56843B1869L58409a57728D9235
$$ 23241 22363 -420232 44719 34914 -91377 414745 -156843 21869 380278 -157728 49235
17590A02865a35189J5412n2630d0131m3146B52903n5255C6374A7453R9073M4539
$$ 102865 -135189 -119777 -172407 -40131 -83277 252903 197648 36374 17453 116526 161065
17579A61065K96644B27549a07109j11521B53820E1321R9710g1645j9929j56731
$$ 161065 457709 227549 -107109 -218630 253820 51321 151031 -71645 -91574 -248305
17569b48305D2643a14749f142q2506J6861j61800P939C78974A69942A9143L66504
$$ -248305 42643 -114749 -6142 -88648 -71787 -233587 -225648 378974 169942 19143 385647
17558C85647d7622a2636A09381a24120G8279J77251b03847G3352Q706K01539a62499
$$ 385647 -47622 -12636 109381 -124120 78279 255530 -203847 73352 82058 283597 -162499
17546A94752R4314a9451j47354j60224a53613A62331F2046a18720b282m50828
$$ 194752 289066 -19451 -166805 -327029 -153613 162331 62046 -118720 -2282 -453110
17536d53110A18348A1802M2824a51968B57789f2784A07564B9089e2261n1437j64476
$$ -453110 118348 11802 54626 -151968 257789 -62784 107564 29089 -52261 -103698 -268174
17525b68174q2242A61587a89816A20636M7912N2678o646J8050j3482a61745M1674
$$ -268174 -350416 161587 -189816 120636 168548 221226 214580 232630 219148 -161745 -120071
17514a20071e4409k42656B31187l7257a41558A13178B1334f8284m0894j4373j2214
$$ -120071 -54409 -297065 231187 193930 -141558 113178 21334 -68284 -109178 -123551 -135765
17503a35765A26642J49g7065I9229c41880B59431h5473F2975K04903A1174i6166
$$ -135765 126642 126791 -77065 99229 -341880 259431 -85473 62975 267878 11174 -96166
17491A43341K88680I4509k5924k9383d5288D09965A91893L46962a18845H9377
$$ 143341 432021 94509 68585 39202 -45288 409965 191893 538855 -118845 89377
17480I163b61430a2860D48175j62651J14319A29621O5948C550g5805C9719R6447
$$ 9163 -261430 -12860 448175 285524 399843 129621 195569 3550 -75805 39719 136166
17469A36166M391Q4045e2700A04830M4728R0209K4980E8351J08419L4321q1500
$$ 136166 140557 224602 -52700 104830 149558 239767 264747 58351 166770 201091 119591
17458A19591h7136B05288F8582J40447p5125n2377l4343N8704K55110n3880m2845
$$ 119591 -87136 205288 68582 209029 133904 81527 47184 105888 360998 307118 264273
17447B64273l001m8038M8213A05481N7876J74784j56195p3167L3936J88560i0287
$$ 264273 261272 213234 261447 105481 163357 338141 181946 108779 142715 331275 -90287
17435C49379F9412R2301F2914Q298K70667A35077K59667r9373J65528a5940n7044
$$ 349379 69412 161713 62914 71212 341879 135077 394744 295371 460899 -15940 -72984
17424g2984A97908L75550k00431n6360j609M6632I8963M16504B23960j7681P5813
$$ -72984 197908 573458 373027 316667 315058 361690 98963 515467 223960 206279 282092
17413B82092I2647N5434L3744g6863B93883m2701o9797d157A74577J4683J1830
$$ 282092 92647 148081 181825 -76863 293883 251182 181385 -4157 174577 189260 201090
17402B01090I0789A2170Q6381K0901J23981c6531D21413j97685D4905L534K75389
$$ 201090 90789 12170 98551 119452 243433 -36531 421413 223728 44905 48439 323828
17391C23828A17057K1683M1537K91954A58439K76842a31828e3061a2939B34628
$$ 323828 117057 138740 180277 472231 158439 435281 -131828 -53061 -12939 234628
17380A18521j5355d0591O885A27637R388A0668J77559K5494r8313J38191a07941
$$ 118521 103166 -40591 -33706 127637 137025 10668 188227 213721 115408 253599 -107941
17368B07912j4467f3612A85109J50948j61786C5123K62235L8122A65609p4961
$$ 207912 193445 -63612 185109 336057 174271 35123 297358 335480 165609 90648
17358I0648K43264A20519a45252C36696H2068b746A83632L51809H6502a9808A24070
$$ 90648 333912 120519 -145252 336696 82068 -2746 183632 535441 86502 -19808 124070
17346A58723J1355L3120G3784J48205j4213L46162A69186F0096k6419b33288G3714
$$ 158723 170078 203198 73784 221989 207776 553938 169186 60096 33677 -233288 73714
17334A67542o6178p831J05493a50325A31989n995L7900b40033B880L58978A1601
$$ 167542 101364 93533 199026 -150325 131989 125994 163894 -240033 2880 361858 11601
17322a79811C1225K60573G4762j3513K58885N8875b54385C39657e1567B12951
$$ -179811 31225 291798 74762 61249 320134 379009 -254385 339657 -51567 212951
17311H964L940a7805B59305r1452L69029A62028J45517r6254a29236E14023k01716
$$ 8964 12904 -17805 259305 167853 536882 162028 307545 211291 -129236 514023 312307
17300C12307o6464I9969K22063C925L02123H2019J54360d2627B245b94504d2248
$$ 312307 245843 99969 322032 3925 306048 82019 236379 -42627 2245 -294504 -42248
17288D09023A45249M52835j23847A53900l2629J07860a3149j0500Q042B07599
$$ 409023 145249 598084 474237 153900 121271 229131 -13149 -23649 -15607 207599
17277a20897N9873A14092A4003g6068B0640a20566B47P8643m029J06772J64719
$$ -120897 -61024 114092 14003 -76068 20640 -120566 247 78890 74861 181633 346352
17266C46352A68138b44724B97165A28361J73515j2501G28K23567j03004L23717
$$ 346352 168138 -244724 297165 128361 301876 289375 728 224295 121291 445008
17256D45008a26303d0513c884C7318J06036J90924r4414r3599m6959D3119e9962
$$ 445008 -126303 -40513 -3884 37318 143354 334278 239864 146265 99306 43119 -59962
17244D19585A68498J76655A66014L86683i7111C29663r4314J0206l9373J75893
$$ 419585 168498 345153 166014 552697 -97111 329663 235349 245555 206182 382075
17234C82075o9232j41196L67369n0572A33583h924I9632R2320J1181C9936M2728
$$ 382075 312843 171647 539016 488444 133583 -8924 99632 191952 203133 39936 82664
17223H2664L78468H3073J56432I7581h7986D64992B4212L85584j48425M84G6634
$$ 82664 461132 83073 239505 97581 -87986 464992 24212 409796 261371 261855 76634
17211A08923M908m2867a0700C26820j26182a9682H3824J72033F6706E629K9245
$$ 108923 113831 70964 -10700 326820 200638 -19682 83824 255857 66706 5629 34874
17200C4874J01805E7973J36576J50050A03652C55a5710F6270J4369P2892P7489
$$ 34874 136679 57973 194549 344599 103652 355 -15710 66270 80639 153531 231020
17189B31020O5063n6207G3098L54848J15158r8847k04320r8243J03643o5152N6582
$$ 231020 296083 239876 73098 427946 543104 444257 239937 141694 245337 180185 236767
17178B36767q8561N3959L5507L42908j27953j16974A65966N00216l12407k3335
$$ 236767 148206 202165 237672 580580 452627 335653 165966 666182 353775 330440
17168C30440q2840J37555j30140p0148J20017K9913o9951N4737n7930K54525j51697
$$ 330440 247600 385155 255015 184867 304884 334797 264846 319583 261653 516178 364481
17157C64481J09321A44855Q4575G4250R0573G6736J09016K91600K387F1663M45203
$$ 364481 473802 144855 229430 74250 164823 76736 185752 477352 479739 61663 506866
17146E06866j36281K25171j77815j54970n5935J49171K37664j72130Q0146B14787
$$ 506866 370585 595756 417941 262971 207036 356207 593871 421741 501887 214787
17135F50391k20186j38236j22771k3360K77190L731k12229P6760E8539a70100
$$ 650391 430205 291969 169198 145838 423028 426759 214530 291290 58539 -170100
17124C12562A27982J39052J6152A22532M67643B34585J69739F9718N37883j46083
$$ 312562 127982 267034 283186 122532 590175 234585 404324 69718 607601 461518
17114D61518k04660M71188B10208K20441j94095n4147O5358j13954Q3658a6517
$$ 461518 256858 728046 210208 430649 236554 182407 247765 133811 217469 -16517
17103B62241L7514m0088R6416q9301J88430L9076r0126C5424I62M09788r7432
$$ 262241 299755 259667 356083 266782 455212 494288 404162 35424 962 410750 313318
17092C13318K46J64870J33820C2607R3140L27073j42989L11745j90817K2582P6553
$$ 313318 313564 478434 612254 32607 125747 452820 309831 621576 430759 453341 529894
17081E29894A83192M33931q8930k30047j01734N68602B38884O9000L93427c4564
$$ 529894 183192 617123 528193 298146 196412 765014 238884 307884 701311 -34564
17070C07943J40574P8547j01841o4990l5861L11084B86717k6978j14126N82778
$$ 307943 448517 527064 425223 360233 324372 635456 286717 259739 145613 728391
17060G28391C24533J5964J2980A75876J35481L17440k79971O9568j12255J24248
$$ 728391 324533 340497 353477 175876 311357 628797 348826 418394 306139 430387
17050D30387K23342K05622j55144l5756P9439K78089H7826L77411j15185l6636
$$ 430387 653729 859351 704207 668451 747890 1025979 87826 465237 350052 313416
17040C13416L02578J23882k88354K31254k13580j50946M5668L91495k59051L23320
$$ 313416 615994 739876 451522 682776 469196 318250 363918 755413 496362 819682
17030H19682L5308k90742j9922L19597l02038R643l6054p3998L38990l72198K4758
$$ 819682 854990 564248 544326 863923 561885 571528 535474 461476 800466 428268 453026
17019D53026J34536J20561K0111k77374J05830r988m2350j5914K01000j64173
$$ 453026 587562 708123 728234 450860 556690 546702 504352 488438 689438 525265
17009E25265l8923Q5183o4240J45559J82021k43308Q5425p4072J0062B36135J40281
$$ 525265 486342 571525 507285 652844 834865 591557 676982 602910 612972 236135 376416
16998C76416L34762J96961k51101L34273k41547N020p704o8676J67148j45886
$$ 376416 711178 908139 657038 991311 749764 754784 747080 678404 845552 699666
16988F99666k27956K79966P2331P9606k97883n1752P0341k23867K89761P6366
$$ 699666 471710 751676 824007 903613 605730 553978 624319 400452 690213 766579
16978G66579J11162J3947o1521j33114L82653j8206J6778l55163J47280J0465
$$ 766579 877741 891688 830167 697053 1079706 1061500 1078278 723115 870395 880860
16968H80860J97360l03688N16615o23201K584N3457L9312L4104j47534O9379J93360
$$ 880860 1078220 774532 1291147 667946 670530 723987 763299 797403 649869 719248 912608
16957I12608j58050L53695l02167J71459J50040l4670J0856k34197J26134P0468
$$ 912608 754558 1108253 806086 977545 1127585 1092915 1103771 869574 995708 1066176
16947A066176j24536J00539M39814k48093l65169j5433K55214k56584M46212k10583
$$ 1066176 941640 1042179 1481993 1233900 868731 853298 1108512 851928 1298140 1087557
16937A087557Q6344k7252P4674j30385r2754J27772o7925L84195l36788L11907
$$ 1087557 1173901 1146649 1221323 1090938 998184 1125956 1058031 1442226 1105438 1417345
16927A417345O9209j34830J3898K89772k67873P1035R500K936k060l23066L12652
$$ 1417345 1486554 1351724 1365622 1655394 1387521 1458556 1468056 1470992 1468932 1145866 1458518
16916A458518J43058m63158L21070j26333M67839n08554K63073p7659K3355r7234
$$ 1458518 1601576 1138418 1459488 1333155 1800994 1292440 1555513 1477854 1501209 1403975
16906A403975O0687J40050K32746k66009m5332J79867o9101r4413J49454j46844
$$ 1403975 1464662 1604712 1837458 1571449 1526117 1705984 1636883 1542470 1691924 1545080
16896A545080j15676L40852J1165q8681J26131j31114K05324r9074K95048k39833
$$ 1545080 1429404 1770256 1781421 1692740 1818871 1687757 1893081 1794007 2089055 1849222
16886A849222l080J51528j64432L3015M92863k67814L44311l05213J3431M25297
$$ 1849222 1846142 1997670 1833238 1866253 2359116 2091302 2435613 2130400 2143831 2569128
16876B569128k27610l77126L65708j35079j71323L89133l11669J13179M49411
$$ 2569128 2341518 1964392 2330100 2195021 2023698 2412831 2101162 2214341 2663752
16867B663752m08604J39195j83343M82170j25073O5985p4255O044O3803K88577
$$ 2663752 2255148 2394343 2211000 2693170 2568097 2634082 2559827 2565871 2629674 2918251
16857B918251l28691M12754k12396O356K35726L6802j34836j51586M32226J20655
$$ 2918251 2589560 3002314 2789918 2796274 3032000 3068802 2933966 2782380 3214606 3335261
16847C335261m79614N72723o1592P5452k33014L00260K16236k43227K13575p9294
$$ 3335261 2855647 3428370 3366778 3442230 3209216 3509476 3725712 3482485 3696060 3616766
16837C616766K2981L25011j06260P3352J49281j75445N1747Q8595n1683K97036
$$ 3616766 3639747 3964758 3858498 3931850 4081131 3905686 3957433 4046028 3994345 4291381
16827D291381M23387j93236J1249J05719j29483K53353K30663j37189O8666M45664
$$ 4291381 4714768 4521532 4532781 4638500 4509017 4762370 4993033 4855844 4924510 5370174
16817E370174j24669P9445L18510L75345j16133m0422K45500j96433K76915j11252
$$ 5370174 5245505 5324950 5643460 6018805 5902672 5862250 6107750 5911317 6188232 6076980
16807F076980P06606r9390Q3401M07036J26053K3868O7007K26371M16451l77050
$$ 6076980 6783586 6684196 6767597 7174633 7300686 7324554 7391561 7617932 8034383 7657333
16797G657333O76158p8260K46861K70357K58338j51588M82278J80101L29404L71263
$$ 7657333 8333491 8255231 8502092 8772449 9030787 8879199 9361477 9541578 9870982 10242245
16787A0242245K98422O2016N38844J23041K65177K94779P72935J94138L20252
$$ 10242245 10540667 10602683 11141527 11264568 11529745 11824524 12597459 12791597 13111849
16778A3111849R5398J126424J10331O24588M99500N86318J90896P39789N32033
$$ 13111849 13207247 14333671 14444002 15068590 15568090 16154408 16345304 17085093 17617126
16769A7617126M11792J135338J84590Q98373M45621J079012J162025P62880P62277
$$ 17617126 18028918 19164256 19348846 20247219 20692840 21771852 22933877 23696757 24459034
16760B4459034Q72319J216467J242869J195353J482011J106759J442041J491121
$$ 24459034 25331353 26547820 27790689 28986042 30468053 31574812 33016853 34507974
16752C4507974J723615J892211J888726J705770K411904K090863K723144K139141
$$ 34507974 36231589 38123800 40012526 41718296 44130200 46221063 48944207 51083348
16744E1083348L234303K708380L634320L441374L857618M313852M168837M418179
$$ 51083348 54317651 57026031 60660351 64101725 67959343 72273195 76442032 80860211
16736H0860211N190083N731641N194586O288150O577105O790783P330716P018755
$$ 80860211 86050294 91781935 96976521 103264671 109841776 116632559 123963275 130982030
16728A30982030P899947Q148798P631809P467793P614961O775999O220255N495228
$$ 130982030 138881977 147030775 154662584 162130377 169745338 176521337 182741592 188236820
16720A88236820M147839L198291J662549J73135j157991k324688l898151n034036
$$ 188236820 192384659 195582950 197245499 197418634 196260643 193935955 190037804 185003768
16712A85003768o023382o585287p217990p794032p776318q094138p559460p943408
$$ 185003768 178980386 172395099 165177109 157383077 149606759 141512621 133953161 126009753
16704A26009753p263495o917693o659805o436050n963006n942499m985823m898429
$$ 126009753 118746258 111828565 105168760 98732710 92769704 86827205 81841382 76942953
16696G6942953m597347m245746m010240l740281l250597l175404k940770k327531
$$ 76942953 72345606 68099860 64089620 60349339 57098742 53923338 50982568 48655037
16688D8655037k717290k715609j631747k127205k007938k067328j378005k078112
$$ 48655037 45937747 43222138 41590391 39463186 37455248 35387920 34009915 31931803
16680C1931803j526455r08241j375521j360834r46168j373679p98167j013480
$$ 31931803 30405348 29497107 28121586 26760752 25814584 24440905 23642738 22629258
16672B2629258j003785l00918j261214l04332r40811o93223j036668l86837p67280
$$ 22629258 21625473 21324555 20063341 19759009 18818198 18124975 17088307 16701470 15934190
16663A5934190j55418o29635q35843k13734l75843j035052j97244k55393m76985
$$ 15934190 15778772 15149137 14313294 14099560 13723717 12688665 12491421 12236028 11759043
16654A1759043l79213L8127k36344o09800l91931j22881k97904l15553k94862
$$ 11759043 11379830 11417957 11181613 10571813 10179882 10057001 9759097 9443544 9148682
16645I148682m57960Q3954p09678k7249J55312m76177n7429l57935K05755k75054
$$ 9148682 8690722 8774676 8064998 8037749 8193061 7716884 7659455 7301520 7507275 7232221
16635G232221l40836j86302J6284l22734l26226j2851j41063r3401n9623m30696
$$ 7232221 6891385 6705083 6721367 6398633 6072407 6059556 5918493 5825092 5765469 5334773
16625E334773k685j37394K50536k26358l43524J74196k46067J85422k59124j33694
$$ 5334773 5332088 5194694 5445230 5218872 4875348 5049544 4803477 4988899 4729775 4596081
16615D596081k92617K01962l74839P4366m92697K38754M7143q1241l00044P9636
$$ 4596081 4303464 4505426 4130587 4204953 3712256 3951010 3998153 3916912 3616868 3696504
16605C696504j18936j3712o0838r5405j43444o6716J9392J14813L8399k63343
$$ 3696504 3577568 3563856 3503018 3407613 3264169 3197453 3216845 3331658 3370057 3106714
16595C106714o8345l8235J7817K6733j56264j51964L7070L5472l66941o169J22791
$$ 3106714 3038369 3000134 3017951 3044684 2888420 2736456 2773526 2808998 2442057 2435888 2558679
16584B558679K18552k24462l09411L41315j94727K8454j10739P4675k95491l6826
$$ 2558679 2777231 2552769 2243358 2584673 2389946 2418400 2307661 2382336 2086845 2050019
16574B050019L59207l66535J48137m5204k456j33818K18663n84144O19361j00861
$$ 2050019 2409226 2042691 2190828 2145624 2143168 2009350 2228013 1643869 2263230 2162369
16564B162369j73507L0096k21943m4332J1385q2363K34022J72404n19298K37126
$$ 2162369 1988862 2018958 1797015 1752683 1764068 1681705 1915727 2088131 1568833 1805959
16554A805959l84333J98507p3898L9726J82366m2255P8598l00738J41938j31599
$$ 1805959 1421626 1620133 1546235 1585961 1768327 1726072 1804670 1503932 1645870 1514271
16544A514271k48998K5428K40542J37692q480m7132k20319j56750k4352N7436
$$ 1514271 1265273 1290701 1531243 1668935 1660455 1613323 1393004 1236254 1211902 1269338
16534A269338j74380L52879k93221k1308P0868J51972j45683J2287k88209k107
$$ 1269338 1094958 1447837 1154616 1133308 1204176 1356148 1210465 1222752 934543 932436
16524I32436L33943m37061K66803j69433K48893j00036J25675m36020O1183J18112
$$ 932436 1266379 829318 1096121 926688 1175581 1075545 1201220 765200 826383 944495
16514I44495j2925R4322J1135J45297J40589j56874j46338O6957j32639n7363
$$ 944495 931570 1025892 1037027 1182324 1322913 1166039 1019701 1086658 954019 896656
16504H96656K93664j52609k18148r3567J25805l1J3604J70218O4077l47352j57771
$$ 896656 1190320 1037711 819563 725996 851801 851770 865374 1035592 1099669 752317 594546
16493E94546L18956k88274J10231n7070J97895Q9808j79816k2994J13528j83443
$$ 594546 913502 625228 735459 678389 876284 966092 786276 763282 876810 693367
16483F93367p2529J21423p4629m9834j24937J72463k57187N31065l71403l2235
$$ 693367 620838 742261 667632 617798 492861 665324 408137 939202 567799 535564
16473E35564J99982r5547J47900k53784K96619K8164j70785k081N8630q8285o5354
$$ 535564 735546 639999 787899 534115 830734 858898 688113 686032 744662 656377 591023
16462E91023J06765C23947J55524R6423J17657j26633E3565N88700J44840j84681
$$ 591023 697788 323947 479471 575894 693551 566918 53565 642265 787105 602424
16452F02424j32374P5386j1308K855j83841N7113K07221j54291j50735L40815
$$ 602424 470050 545436 534128 536983 353142 410255 617476 463185 312450 653265
16442F53265j25652q8184K75915o0885J92972l08415j72591J64113j15054l3755
$$ 653265 527613 439429 715344 654459 847431 539016 366425 530538 415484 381729
16432C81729K07561j4369k03259K38637J55266l00228J70199k13391o5805J05476
$$ 381729 589290 574921 371662 610299 765565 465337 635536 422145 356340 461816
16422D61816A41299J24967R9674j06563K0903O37385D43516q9704L91579A36450
$$ 461816 141299 266266 365940 259377 280280 917665 443516 353812 745391 136450
16411E42082j72565P1242b5398C78204M5334J43417B67168m6358j3818J72445
$$ 542082 369517 440759 -25398 378204 423538 566955 267168 220810 206992 379437
16401C79437j06140J12513j69148P9752J78190Q7120j60945K56359q0321j57507
$$ 379437 273297 385810 216662 296414 474604 561724 400779 657138 576817 419310
16391D19310J26768j19729n5525j28310J79287o23K7507Q2135K52849C50062l3668
$$ 419310 546078 426349 370824 242514 421801 421178 448685 530820 783669 350062 316394
16380C16394j43309K34815A77962Q3585J00119o6343L50J16213j52077I5386N25238
$$ 316394 173085 407900 177962 261547 361666 295323 295673 411886 259809 95386 620624
16369F20624N6665B37500r7540J6539F0385L59743k7593J97215k66910L8586D5898
$$ 620624 677289 237500 139960 156499 60385 420128 392535 589750 322840 361426 45898
16357C67552A14216K28773o8512G3642R9569K80446A37167P0027J63837j17628
$$ 367552 114216 342989 274477 73642 173211 453657 137167 207194 371031 253403
16347B53403j00018k9205K66006j66709J598b83791C16238N8490K18709B13694
$$ 253403 153385 124180 390186 223477 225075 -283791 316238 374728 593437 213694
16336C00349F0630J8742C8443J01585J74659A01792J37015J47694A49174O4677
$$ 300349 60630 79372 38443 140028 314687 101792 238807 386501 149174 213851
16326B13851K68744B19195J32591N1421a8866A16368M7035B7033h0742C37704
$$ 213851 482595 219195 351786 403207 -18866 116368 163403 27033 -80742 337704
16315c2420a3980B34744m5821N6772q2036l2476a44102A49268J04026q8914K56216
$$ -32420 -13980 234744 188923 245695 163659 131183 -144102 149268 253294 164380 420596
16304D20596G5479L6614l3252a0386E1727J24791F523J3010L31866Q3465Q1454
$$ 420596 75479 112093 78841 -10386 51727 176518 6523 19533 351399 434864 516318
16293E16318G5860Q3863m3343J89240A633e7291D77685k18221b96229A84479k8407
$$ 516318 75860 159723 116380 305620 1633 -57291 477685 259464 -296229 184479 156072
16282A56072n1241d2314C96528A02378K44561E7250J55774Q9971d1043A57936
$$ 156072 104831 -42314 396528 102378 346939 57250 213024 302995 -41043 157936
16271b20590C61886j80615h3644k9522A62672K10357i6607D6647O4138L7524J8452
$$ -220590 361886 181271 -83644 -113166 162672 373029 -96607 46647 110785 148309 166761
16260A66761J43004D5841d7544A93027a81174C13814A02696j0247L21072A58891
$$ 166761 309765 45841 -47544 193027 -181174 313814 102696 92449 413521 158891
16249C14605J1847G2710h1218E0396a33864c8276A01945a14815C21873b31935
$$ 314605 326452 72710 -81218 50396 -133864 -38276 101945 -114815 321873 -231935
16238A51015l9534J16134I4474a33397j19433D20372h0509B8167g0707B60788
$$ 151015 111481 227615 94474 -133397 -252830 420372 -80509 28167 -70707 260788
16227B30741B8169a17469k385A3918J36993a59878E0158c4847C75536f5598C13522
$$ 230741 28169 -117469 -119854 13918 150911 -159878 50158 -34847 375536 -65598 313522
16215B61373E7989e3974k74741J39806H1857E15a65661C9193a27697L4650F9128
$$ 261373 57989 -53974 -328715 -188909 81857 515 -165661 39193 -127697 -93047 69128
16203a87518E5112c25562E2330a03941d840k15252d0170A0916e1001j03859H810
$$ -187518 55112 -325562 52330 -103941 -4840 -220092 -40170 10916 -51001 -154860 8810
16191G9169K27222f8005I1559J44773b49247E0301d4156d659o8105A75903f1059
$$ 79169 306391 -68005 91559 236332 -249247 50301 -44156 -4659 -72764 175903 -61059
16179a07192B40111A11433R5593M6600b27036g8258H3625k2396b38277A23198
$$ -107192 240111 111433 207026 253626 -227036 -78258 83625 61229 -238277 123198
16168A40696Q416c448j04959B38795a28139G8791b42210F8317K39852a81783H3957
$$ 140696 149112 -3448 -108407 238795 -128139 78791 -242210 68317 308169 -181783 83957
16156B17810d4123o2114K3393B45168a4826A34743E4495h221j61017C6756a22546
$$ 217810 -44123 -106237 -82844 245168 -14826 134743 54495 -8221 -169238 36756 -122546
16144F3796Q8589F1162c75382B00549f3489a7326r5310L4702D7187A2633a34312
$$ 63796 152385 61162 -375382 200549 -63489 -17326 -112636 -77934 47187 12633 -134312
16132a118A57475g7778p4023k6169o2129h0223A82974o1029a39411I9089J65846
$$ -1118 157475 -77778 -151801 -177970 -240099 -80223 182974 121945 -139411 99089 264935
16121B64935d2462K0530j1146C40175I5115J69659A14730n2986a26346A65J31457
$$ 264935 -42462 -21932 -33078 340175 95115 264774 114730 61744 -126346 165 131622
16110A31622a83215J4340A90441d69409g8470B79611J39033a88666B44763k8975
$$ 131622 -183215 -168875 190441 -469409 -78470 279611 418644 -188666 244763 215788
16100B15788J12211Q3921a89593A03612J22313J0287a44574b8293D2981i0774
$$ 215788 327999 411920 -189593 103612 225925 236212 -144574 -28293 42981 -90774
16089d71j0254C986i3063j53057J19992A63537b74191C0104L3491a44738k8437
$$ -471 -10725 3986 -93063 -246120 -126128 163537 -274191 30104 63595 -144738 -173175
16078a73175P2366H4836b28762b6168B15673q6529b2589A60000D3230c8244k37114
$$ -173175 -100809 84836 -228762 -26168 215673 129144 -22589 160000 43230 -38244 -275358
16067b75358J2772a0304m2346A99328Q6093G1759J74340a19525c0698E3195a47730
$$ -275358 -262586 -10304 -52650 199328 285421 71759 246099 -119525 -30698 53195 -147730
16055d0443B96151D560L5023a80667d0476m0480r0941E8997J25242o4506a04157
$$ -40443 296151 4560 39583 -180667 -40476 -80956 -171897 58997 184239 119733 -104157
16043A44325a83961Q335a9662F3589j0921a77225n183A03248j1533b90675C9505
$$ 144325 -183961 -175626 -19662 63589 52668 -177225 -182408 103248 91715 -290675 39505
16031a05001G5021B4505a22781C04171b08136f5801A76903a4124A10243f0792
$$ -105001 75021 24505 -122781 304171 -208136 -65801 176903 -14124 110243 -60792
16020B57035c7101J6937j75713o9974k07992c5345o1249H1779d20857K07731A11636
$$ 257035 -37101 -20164 -195877 -265851 -473843 -35345 -96594 81779 -420857 -213126 111636
16008A09854g0173D32833A00292J44923f9586p8678k24613i0308B3624a20309
$$ 109854 -70173 432833 100292 245215 -69586 -148264 -372877 -90308 23624 -120309
15997G8677J19494i8587k65127B23068D4701R6060o9329d2331k63631I5769O8391
$$ 78677 198171 -98587 -363714 223068 44701 140761 71432 -42331 -305962 95769 164160
15986A64160m9037B4868K83883J60452G3759K11605j21267C9931J66427c802C60679
$$ 164160 115123 24868 308751 469203 73759 285364 164097 39931 206358 -3802 360679
15974C978L21318e8636K2745A19180k575A2520K080N0367J31124a34324L0157
$$ 3978 325296 -58636 -35891 119180 116605 12520 14600 64967 196091 -134324 -104167
15963a04167j67215J15447N3162C20757c14475I1646b29416A16412a44534o2458
$$ -104167 -271382 -155935 -102773 320757 -314475 91646 -229416 116412 -144534 -206992
15953b06992B5324L1455e5607A46938b89618J35894N2055m6033d4312l4930B9494
$$ -206992 25324 56779 -55607 146938 -289618 -153724 -101669 -147702 -44312 -79242 29494
15941b15018B09573l7030D0632a86519P4990h311j95828b5564B76857l2420b87116
$$ -215018 209573 172543 40632 -186519 -111529 -8311 -204139 -25564 276857 244437 -287116
15929a62544g2758j44470H492b62206l52611i38C6151d37338A33294E5424a40594
$$ -162544 -72758 -217228 8492 -262206 -614817 -938 36151 -437338 133294 55424 -140594
15917H0328a64783N552P4627B5371K68073a277A25787a54995e0701f224p4277
$$ 80328 -164783 -159231 -84604 25371 293444 -1277 125787 -154995 -50701 -6224 -80501
15906h0501B23310c13185e9536k63529A1718a58610H7613A3313b35679A82052
$$ -80501 223310 -313185 -59536 -323065 11718 -158610 87613 13313 -235679 182052
15895B02239b27306i2356B8281b03505k31167a407k5345j36099n0795I5464c63383
$$ 202239 -227306 -92356 28281 -203505 -434672 -1407 -26752 -162851 -213646 95464 -363383
15883C194b60577A70278o0488e7988A93668A1084a34581A46437g3675B57730N1723
$$ 3194 -260577 170278 109790 -57988 193668 11084 -134581 146437 -73675 257730 309453
15872C09453i2681n7927n557E2526c0126k27157i8305A2186f5486H7220a13351
$$ 309453 -92681 -150608 -156165 52526 -30126 -257283 -98305 12186 -65486 87220 -113351
15860a75907a3991l56961C6650D571h2047q9150Q0206E7052d1159I039K64334
$$ -175907 -13991 -370952 36650 4571 -82047 -171197 -90991 57052 -41159 9039 273373
15849B73373b07543M6151A60833o3372b07968g3008A82143a09608E6705J79449
$$ 273373 -207543 -161392 160833 97461 -207968 -73008 182143 -109608 56705 236154
15839B36154b34853i6021k73333A1091J07464B3997P5656c3700j22787C7773L1213
$$ 236154 -234853 -96021 -369354 11091 118555 23997 99653 -33700 -156487 37773 68986
15828F8986J87381f9532B19471d4106A61527j4755a12229A35642c2635j3620n390
$$ 68986 256367 -69532 219471 -44106 161527 146772 -112229 135642 -32635 -46255 -51645
15817e1645E8486N9411K35629b28602R7113k49701G3502b04696b0796A75437H0865
$$ -51645 58486 117897 353526 -228602 -131489 -381190 73502 -204696 -20796 175437 80865
15805d15528b1449D2966K77735h7485A28986K660a80j41294n3592f9354C08657
$$ -415528 -21449 42966 320701 -87485 128986 131646 -180 -141474 -195066 -69354 308657
15793b21840L361I880b55795J08961A07725a37049L856L4665a0687q4005r7442
$$ -221840 -218479 9880 -255795 -146834 107725 -137049 -133193 -98528 -10687 -94692 -192134
15782a92134A68837e7347r726A96047i9033j06274C87857A8464b03260B37701
$$ -192134 168837 -57347 -67073 196047 -99033 -205307 387857 18464 -203260 237701
15771a51698A20731e1250k82611B92060b59622B55883a46977I5475D3308L0546
$$ -151698 120731 -51250 -333861 292060 -259622 255883 -146977 95475 43308 73854
15761G3854R1842D485K8668e881k28b691o1994B86630I6095a37896J8248o8266
$$ 73854 165696 4485 33153 -5881 -6109 -2691 -64685 286630 96095 -137896 -119648 -187914
15749a87914A83420M86053B11577e4824D59809A69831i5083A20097B5782a79299
$$ -187914 183420 669473 211577 -54824 459809 169831 -95083 120097 25782 -179299
15738C05224a89218p0536O2879E9076c7447A07104i9847A26254K4316J3621I500
$$ 305224 -189218 -259754 -196875 59076 -37447 107104 -99847 126254 150570 164191 9500
15726C88298d60499i5571k9422A97847a61969H0121d37466h6708j89187a08285
$$ 388298 -460499 -95571 -124993 197847 -161969 80121 -437466 -86708 -275895 -108285
15715e1020p788k23960a21554J2014j06101N081C06790B2152J14456a92190K8945
$$ -51020 -58808 -282768 -121554 -109540 -215641 -210560 306790 22152 136608 -192190 -163245
15704a63245c5878D7996c3314O866A98303a59436B45332a75582j92387Q082a59155
$$ -163245 -35878 47996 -33314 -26448 198303 -159436 245332 -175582 -367969 -359887 -159155
15692A1714J95293B6152M2616L1527K54910a6832p1895j072K1807A16788B9458
$$ 11714 207007 26152 68768 100295 355205 -16832 -88727 -89799 -67992 116788 29458
15680C7685b288A46645b01722A2788b77074J18246P2889F2603P8282K34948h0760
$$ 37685 -2288 146645 -201722 12788 -277074 -158828 -85939 62603 140885 375833 -80760
15668B08618A9455R0478J21168b32945h9891n3158j06658F8178b36824e6133H4254
$$ 208618 19455 109933 231101 -232945 -89891 -143049 -249707 68178 -236824 -56133 84254
15656b69199f2224B26406a80762A89785a29825C2285b798j56555B50829c4007
$$ -269199 -62224 226406 -180762 189785 -129825 32285 -2798 -159353 250829 -34007
15645I4766a17718i626c227A0894d7535J8808A7937b84636D4344i0885A78575
$$ 94766 -117718 -9626 -3227 10894 -47535 -28727 17937 -284636 44344 -90885 178575
15633A28274J45606E9801d04140c7772j02o5785A64116a34402j6633N8110N099
$$ 128274 273880 59801 -404140 -37772 -37874 -103659 164116 -134402 -151035 -92925 -87826
15622h7826J9010n9949e9169B5766O8304O3629J31414a41326F880g7087a5677
$$ -87826 -68816 -128765 -59169 25766 94070 157699 289113 -141326 6880 -77087 -15677
15610a07370B9032a82766O3284H8655a46497q0441A98658d4509j96874a16631
$$ -107370 29032 -182766 -119482 88655 -146497 -226938 198658 -44509 -241383 -116631
15599b19325j79553G6120b53713A77217e6326A1743J8700N7572k9633N9013c84788
$$ -219325 -398878 76120 -253713 177217 -56326 11743 30443 88015 58382 117395 -384788
15587F969N7524a65861K0774n1310c0497D4420b18962g2896L5639b850A83340
$$ 6969 64493 -165861 -145087 -196397 -30497 44420 -218962 -72896 -37257 -2850 183340
15575I4895b674m25k02588B15368o1405e5043a3418B778a52667f5978B28823h0032
$$ 94895 -2674 -3099 -205687 215368 153963 -55043 -13418 2778 -152667 -65978 228823 -80032
15562b12850B70663a0678D962a57480B42550O6458I8967R0235D1821a90211f3022
$$ -212850 270663 -10678 4962 -157480 242550 309008 98967 189202 41821 -190211 -63022
15550B05650a15352D0952M7899f1605j21351r3623A38342b19907c9296j81776
$$ 205650 -115352 40952 88851 -61605 -182956 -276579 138342 -219907 -39296 -221072
15540b21072g8268A06339b49633r894f080l12588b7724q6248j1626A58158a07913
$$ -221072 -78268 106339 -249633 -259527 -6080 -318668 -27724 -113972 -125598 158158 -107913
15528C875K2465a40369O820o3431j3522P4731A99581E9534J49541i1333B85961
$$ 3875 26340 -140369 -133549 -196980 -210502 -135771 199581 59534 209075 -91333 285961
15516A56776f2480j55327A32446P3706b51309C09598a55715j25990G4753g5394
$$ 156776 -62480 -217807 132446 206152 -251309 309598 -155715 -281705 74753 -75394
15505d7216j27152B75799A01341L39622a71246F0166L66241A94099b08830a3089
$$ -47216 -174368 275799 101341 440963 -171246 60166 426407 194099 -208830 -13089
15494B75633j09545i5978A27995k3650a89330e9261q2210D7384K07322q7543b99101
$$ 275633 166088 -95978 127995 104345 -189330 -59261 -141471 47384 254706 167163 -299101
15482A33193J03433c57826a21732j98747A14916h7230B53769a75633A24785C819
$$ 133193 236626 -357826 -121732 -320479 114916 -87230 253769 -175633 124785 3819
15471D993Q7744a12769a9431m9293I648J11236a14615l5918b2221m7045Q531j05957
$$ 4993 92737 -112769 -19431 -68724 9648 120884 -114615 -150533 -22221 -69266 -60735 -166692
15459a66692B56701j21729J05842j14760b06369j32945G9712J40362d272r0893
$$ -166692 256701 134972 240814 126054 -206369 -339314 79712 220074 -4272 -95165
15449i5165n5456b4298j41372A71238g7666K0959l84541g9461B89096A32844K66590
$$ -95165 -150621 -24298 -165670 171238 -77666 -56707 -441248 -79461 289096 132844 399434
15438C99434a85487E3346J3661B7786K6894g7173k9258d9523k03075Q3531A16421
$$ 399434 -185487 53346 67007 27786 54680 -77173 -106431 -49523 -252598 -169067 116421
15426c6601q0485r4393A04337c3560k80975a05073j5236A79539A681O1079a73350
$$ -36601 -117086 -211479 104337 -33560 -314535 -105073 -120309 179539 1681 62760 -173350
15414A022b54293c4401F1921a25511A01521b46791c3849o6371C6090K01734a78546
$$ 1022 -254293 -34401 61921 -125511 101521 -246791 -33849 -100220 36090 237824 -178546
15402b85051P7080c0320B06194m0558D6073J2159a79410e9125H8178L6660D576
$$ -285051 -207971 -30320 206194 165636 46073 58232 -179410 -59125 88178 124838 4576
15390B3709b90030J43798J4004A5195a9736j4545q3575q4468c8259A17905l629
$$ 23709 -290030 -146232 -132228 15195 -19736 -34281 -117856 -202324 -38259 117905 114276
15379A14276g8695q6293Q1118A15036J20820r0085a88042p147e3274j64381F4304
$$ 114276 -78695 -164988 -83870 115036 235856 145771 -188042 -195189 -53274 -217655 64304
15367b0014B07323g7290b8955p9865j95172a04086B29616a03203L0175H3244c6585
$$ -20014 207323 -77290 -28955 -108820 -303992 -104086 229616 -103203 -73028 83244 -36585
15355a65647F7247B6140G071M3226A0770a255k05925a6884l68637J24311A03664
$$ -165647 67247 26140 7071 50297 10770 -1255 -207180 -16884 -385521 -261210 103664
15343A10656J17932o0859K37811a36862n4344A64118a85022A56447J1699b31217
$$ 110656 228588 167729 405540 -136862 -191206 164118 -185022 156447 168146 -231217
15332A07183a20887n4731Q4412C6937d57945A9200J92965D4012e1245H3453K66849
$$ 107183 -120887 -175618 -91206 36937 -457945 19200 212165 44012 -51245 83453 350302
15321C50302a06065C1713P8923B5493K04527A2292g6245l2622k13137F021d7676
$$ 350302 -106065 31713 110636 25493 230020 12292 -76245 -108867 -322004 6021 -47676
15309B77382G688K92197H1309a89470Q1210B0069a41015j6911e6021a1404A64100
$$ 277382 7688 299885 81309 -189470 -108260 20069 -141015 -157926 -56021 -11404 164100
15297a74081d988F6463a69275B16084L1498h5221L2964A39958E3261K24508c97498
$$ -174081 -4988 66463 -169275 216084 247582 -85221 -52257 139958 53261 277769 -397498
15285C64086G2865P6692J46590J1499j32865q6961O7156F5188c8782B58776b04007
$$ 364086 72865 149557 296147 307646 174781 87820 154976 65188 -38782 258776 -204007
15273D89314a93735J8939C39172J0329a10929A07754a18749B30760b46283A88444
$$ 489314 -193735 -174796 339172 349501 -110929 107754 -118749 230760 -246283 188444
15262H5187J89462d0812C39457A31395J3712i7770r1963D17422A71887LJ4445
$$ 85187 274649 -40812 339457 131395 145107 -97770 -189733 417422 171887 171890 186335
15251A86335j8945K5983r6545N45544J131807o50446j43206L62272D89493j58225
$$ 186335 167390 193373 96828 642372 1774179 1123733 980527 1342799 489493 331268
15241C31268l6866C0014Q6371J24368C7512J78196a57880c1070A87785a76891
$$ 331268 294402 30014 116385 240753 37512 215708 -157880 -31070 187785 -176891
15230a32474H7896a06768F4987c11052d162B12673H0446Q6399O64m543D785h3375
$$ -132474 87896 -106768 64987 -311052 -4162 212673 80446 166845 167509 162966 4785 -83375
15217a34371C17534c519C42138A50517e5316C26907b0667C4509K50908a9331e588
$$ -134371 317534 -3519 342138 150517 -55316 326907 -20667 34509 285417 -19331 -5588
15205I2218K19183j43107L941a4B05576J81337A80562f1380I685J70033k5946
$$ 92218 311401 168294 172235 -14 205576 386913 180562 -61380 9685 179718 153772
15194A53772a25498G3198J10862k4497K0350l066O1177C3955L44530r1761n9435
$$ 153772 -125498 73198 184060 159563 179913 176847 238024 33955 378485 286724 227289
15183B27289o6554J59578I4819M4558E9169j9485b10716C6607J79876E6987c5062
$$ 227289 160735 320313 94819 139377 59169 39684 -210716 36607 216483 56987 -35062
15171C93690f681B0385J57214p7029a20303J7187j84065F4247b49431e8612B07712
$$ 393690 -6681 20385 177599 100570 -120303 -103116 -287181 64247 -249431 -58612 207712
15159I6135h3397B72914D9649K03076F6272J17956i6781B6727a50241J0986A01569
$$ 96135 -83397 272914 49649 252725 66272 184228 -96781 26727 -150241 -139255 101569
15147C71055F2511d6952I6546a77270C2250J39636o6521n1410a93370a4343j54004
$$ 371055 62511 -46952 96546 -177270 32250 171886 105365 53955 -193370 -14343 -168347
15136a68347E2305M508a20937A31760c21102i5756q8526B97620Q8847A47428L86840
$$ -168347 52305 56813 -120937 131760 -321102 -95756 -184282 297620 386467 147428 534268
15125E34268b73291B12397O7699A12428J84495I6456D6922L25a10839B6700K77053
$$ 534268 -273291 212397 280096 112428 296923 96456 46922 47247 -110839 26700 303753
15114C03753a93422A02514Q9848m8041a56810I9327R0444a7001p0514A06401L85056
$$ 303753 -193422 102514 192362 144321 -156810 99327 189771 -17001 -87515 106401 491457
15103D91457g5786B29335g7777A57752i8678d4915j32777B0984a6457D00402A46869
$$ 491457 -75786 229335 -77777 157752 -98678 -44915 -177692 20984 -16457 400402 146869
15091i4058H8199a02809C44556B262f754G7676e629B20327l4181L4670b758G3178
$$ -94058 88199 -102809 344556 2262 -6754 77676 -5629 220327 186146 220816 -2758 73178
15078B95924a05855B48319J75453A83295p4556M4595O3475r3661a55071B82346
$$ 295924 -105855 248319 423772 183295 108739 153334 216809 123148 -155071 282346
15067h4364L0381C40380j17378J12521A41633b63783A12152K27973j34912e1004
$$ -84364 -53983 340380 223002 335523 141633 -263783 112152 340125 205213 -51004
15056B45216B5463c03739B92223M8535A41644J24573A16080J88861n1246d9385
$$ 245216 25463 -303739 292223 340758 141644 266217 116080 304941 253695 -49385
15045a73171A88690E2449L03328b21752B7480O6826J55181J90261r4538B1148
$$ -173171 188690 52449 355777 -221752 27480 94306 249487 439748 345210 21148
15034A86666J32588a13532B4500P7189L9212h747A79176J04339J75435B13085
$$ 186666 319254 -113532 24500 101689 140901 -8747 179176 283515 458950 213085
15023C05416L178j45978E7368J23369K29615A95853a09985C09407R7258j51351
$$ 305416 308594 162616 57368 180737 410352 195853 -109985 309407 406665 255314
15013B55314j22419F0741L35395j25582J61048o2362D3528N03046B09164J38118
$$ 255314 132895 60741 396136 270554 431602 369240 43528 546574 209164 347282
15003C47282r8890A14811M9892K28100C8806b2060H1239R5320J87396A61581L11935
$$ 347282 248392 114811 164703 392803 38806 -22060 81239 176559 363955 161581 473516
14992D73516A31693b12696A63251J8050d5951B62956P1657J2695o9856G8437J29600
$$ 473516 131693 -212696 163251 181301 -45951 262956 334613 347308 277452 78437 208037
14981B08037J07585j34891a43622B15591F4030J90382m9279o2237J79418H5589
$$ 208037 315622 180731 -143622 215591 64030 254412 205133 142896 322314 85589
14970B04506J34200H0067K16347O0452Q9257A01384O5918i3917B43809P726J97815
$$ 204506 338706 80067 296414 356866 446123 101384 167302 -93917 243809 251535 449350
14959D49350p8122L98776C00849j00231P9415H025K38563E1003k273k2618L47580
$$ 449350 371228 770004 300849 200618 280033 8025 246588 51003 48730 26112 373692
14948C73692j48863K00452m7186A48115a4344C57616A20130K82142A04612K98155
$$ 373692 224829 425281 378095 148115 -14344 357616 120130 402272 104612 402767
14938D02767j94470a54340B63573M920m2531N1756k6211k0112J79473A13639J78009
$$ 402767 208297 -154340 263573 268493 225962 277718 251507 231395 410868 113639 291648
14927B91648k2973k7803O9533F0081M19178A43669J58044A21707k3349J52388
$$ 291648 268675 240872 310405 60081 479259 143669 301713 121707 98358 250746
14917B50746K20111q5344M3901o2369j0432J4484A75497J68648A54402K85826
$$ 250746 470857 385513 429414 367045 356613 371097 175497 344145 154402 440228
14907D40228q511K8231L4040A50746K33007J54888C2472J09979K90438r0672K67046
$$ 440228 431717 459948 493988 150746 383753 538641 32472 142451 432889 342217 609263
14896F09263k56071j75705K41921n1217k9002p6500J28537J272j89810J16428
$$ 609263 353192 177487 419408 368191 339189 262689 391226 392498 202688 319116
14886C19116Q4660A38350J61778K97305A77829K25016A79978L58812k46050J46365
$$ 319116 403776 138350 300128 597433 177829 402845 179978 538790 292740 439105
14876D39105j46055j08142L2008L27789k9788A71747K00353J2754j38806R0555
$$ 439105 293050 184908 216916 544705 514917 171747 372100 384854 246048 336603
14866C36603j2733O427o9913J20313j35691K13100B16274N84340l46029j90250
$$ 336603 323870 330297 260384 380697 245006 458106 216274 800614 454585 264335
14856B64335J95126M8053A10607K72120Q1973B09987K46437j87918J46621p2737
$$ 264335 459461 507514 110607 382727 464700 209987 456424 268506 415127 342390
14846C42390j21860J69259k4413A63247K35503m2229J88400B70171L33558k16242
$$ 342390 220530 389789 365376 163247 398750 356521 544921 270171 603729 387487
14836C87487A54381K83389A15225L60560D7840M52391k24235l5865J6333J53921
$$ 387487 154381 437770 115225 475785 47840 500231 275996 240131 256464 410385
14826D10385q5440k7840r8841N25860J28023D07824A53130L95196J88396j20405
$$ 410385 324945 297105 198264 724124 852147 407824 153130 548326 736722 616317
14816F16317L968k06245K32806j98247J68307j67036q7227M9232k878R7442J15167
$$ 616317 620285 414040 646846 448599 616906 449870 362643 411875 408997 506439 621606
14805F21606j69008r4318n6947K68806J44541k18633l9839K1011J51877j67478
$$ 621606 452598 358280 301333 570139 714680 496047 456208 477219 629096 461618
14795D61618L1051k28067K05636K58443p460p9994j49681R7729J2086j41405J33174
$$ 461618 492669 264602 470238 728681 721221 641227 491546 589275 601361 459956 593130
14784E93130K43348k87801j57774R4967J6353J67517j05216k36831K95528B73751
$$ 593130 836478 548677 390903 485870 502223 669740 564524 327693 623221 273751
14773F72568j88975m5988P0610P2233k01055R5877l0322p7925J77565O6425J23423
$$ 672568 483593 437605 508215 580448 379393 475270 444948 367023 544588 611013 734436
14762G34436k03119m448j09480L6022J04120j44817R779J34767n2486j12690K40646
$$ 734436 531317 526869 417389 453411 557531 412714 422493 557260 504774 392084 632730
14751F32730K33098k2651J01028m02645k1882R3314J49839p6050q2396J15620
$$ 632730 865828 843177 944205 541560 519678 612992 762831 686781 604385 720005
14741G20005N0018r666o3213K1844k43716K83142l56843M90091n3055j37038m7888
$$ 720005 770023 760357 697144 718988 475272 758414 401571 891662 838607 701569 653681
14730F53681J58302k05621K51770j46362l26353M59965j43227J82395J34499D65341
$$ 653681 811983 606362 858132 711770 385417 845382 702155 884550 1019049 465341
14719G10975L2318L39926k02337O6880k57260j69996O17926m51586J11184O6769
$$ 710975 743293 1083219 880882 947762 690502 520506 1138432 686846 798030 864799
14709H64799K79962m75412L31047j72050j63966K69191m0560K60029k45377k93915
$$ 864799 1144761 669349 1000396 828346 664380 933571 893011 1153040 907663 613748
14699F13748K98171m8201k03399J55344M5359l38114L60863k57876o8447M38506
$$ 613748 911919 863718 660319 815663 861022 522908 883771 625895 557448 995954
14689I95954J05009q3140q6315q3971K51622j59996l1244j82409J92987j51484
$$ 995954 1100963 1017823 931508 847537 1099159 939163 907919 725510 918497 767013
14679G67013L90884J31619k16714j09355l73876M20104P2465j6638j80629N5683
$$ 767013 1157897 1289516 1072802 963447 589571 1009675 1082140 1065502 884873 940556
14669I40556K82725l63918r4718L18983o4493k3514L07054k55809J9494n9104
$$ 940556 1223281 859363 764645 1083628 1019135 995621 1302675 1046866 1066360 1007256
14659A007256R9906p5929R9076j26749K64228j29518m11688M17522J51266r0109
$$ 1007256 1107162 1031233 1130309 1003560 1267788 1138270 726582 1144104 1295370 1205261
14649A205261r8472k43121K06788N7195N0125p7582J91316K44015l50473k0169
$$ 1205261 1106789 863668 1070456 1127651 1177776 1100194 1291510 1535525 1185052 1164883
14639A164883M55910m61249M05947m35073j13452O2934M56684k33775k262n7088
$$ 1164883 1620793 1159544 1565491 1130418 1016966 1079900 1536584 1302809 1300547 1243459
14629A243459j50814k6255M59179n3789l6026o8370j16759j49984M05186k27013
$$ 1243459 1092645 1066390 1525569 1471780 1435754 1367384 1250625 1100641 1505827 1278814
14619A278814K65953n0947l75771J71608L19139k52409q7605K34539K96729n42666
$$ 1278814 1544767 1493820 1118049 1289657 1608796 1356387 1268782 1503321 1800050 1257384
14609A257384j21147J32082K86364Q1541q6446Q3901k12969J79649J75975L1755
$$ 1257384 1136237 1268319 1554683 1636224 1549778 1633679 1420710 1600359 1776334 1808089
14599A808089l52640N67460m53291J35636j05800K9351M40887m05574m2724N2330
$$ 1808089 1455449 2022909 1569618 1705254 1599454 1628805 2069692 1664118 1621394 1673724
14589A673724K76839j50942k05444J59158J98265m45016M63552j55932K99544
$$ 1673724 1950563 1799621 1594177 1753335 1951600 1506584 1970136 1814204 2113748
14580B113748K54273o75375K56249j5315J23040l3821K94365k62328j6886l11525
$$ 2113748 2368021 1692646 1948895 1933580 2056620 2022799 2317164 2054836 2037950 1726425
14570A726425M89251l39902J92811M58389k62594M8912j19883K20986N3014L14021
$$ 1726425 2215676 1875774 2068585 2526974 2264380 2313292 2193409 2414395 2467409 2781430
14560B781430l57363J91653J71053Q0296O2292M04251K73184J87076L74492M21314
$$ 2781430 2424067 2615720 2786773 2867069 2929361 3333612 3606796 3793872 4168364 4589678
14550D589678R51961J488616M093127J0257447K0406954J557284A9401881q487258
$$ 4589678 5541639 7030255 11123382 21380829 41787783 43345067 19401881 10914623
14542A0914623E292344j921912o52977k11860l36783r2576l50801k71533M54903
$$ 10914623 5292344 3370432 2717455 2505595 2168812 2076236 1725435 1453902 1908805
14533A908805L3160K65299k8893r1671J91414R6809m16870M28145j48600q735
$$ 1908805 1941965 2207264 2178371 2086700 2278114 2374923 1958053 2386198 2237598 2228863
14523B228863n023r114L86825j68689J70642o0313o6636J48801N08275q52362
$$ 2228863 2223840 2214726 2601551 2432862 2603504 2543191 2476555 2625356 3133631 2281269
14513B281269K82049k6918R3810n4685Q5075J00555J07449j85400L28538k86461
$$ 2281269 2563318 2536400 2630210 2575525 2660600 2761155 2868604 2683204 3011742 2725281
14503B725281K76788j52399L70573j71170L10690l03703K63869l65324k02947
$$ 2725281 3002069 2849670 3220243 3049073 3359763 3056060 3319929 2954605 2751658
14494B751658P88961m89969M773O03111n19641O712K18816r3195J13552M09392
$$ 2751658 3540619 3050650 3055423 3658534 3138893 3145605 3364421 3271226 3384778 3794170
14484C794170j31281J71860L2424j13454l3741Q7683J26856j73370J58559K58246
$$ 3794170 3662889 3834749 3867173 3753719 3719978 3807661 3934517 3761147 3919706 4177952
14474D177952l7577k97131K70894k59409L96421J65412j4849J56840j68697j23373
$$ 4177952 4140375 3843244 4114138 3854729 4251150 4416562 4401713 4558553 4389856 4266483
14464D266483k1517K31159N39246n35165K53588m18130N33614k8113J8783J33675
$$ 4266483 4244966 4476125 5015371 4480206 4733794 4315664 4849278 4821165 4839948 4973623
14454D973623j70575J96897J17935L41115j28251K99726k20824j92234K29052
$$ 4973623 4803048 4999945 5117880 5458995 5330744 5630470 5409646 5217412 5446464
14445E446464J68887L11339l29074K94259j62437K10263r9839M5548L74971P9334
$$ 5446464 5615351 5926690 5597616 5891875 5729438 5939701 5839862 5885410 6260381 6339715
14435F339715l06719M93238k75944P80174q06249L00529P5531Q8298J38702R3447
$$ 6339715 6032996 6526234 6250290 7030464 6224215 6524744 6600275 6688573 6827275 6920722
14425F920722K05774L31263m6247j5091N6124K87673L08094k80699J96469o6675
$$ 6920722 7126496 7457759 7411512 7396421 7452545 7740218 8048312 7767613 7964082 7897407
14415G897407O33608M0786K06941q0003O6231j61259O22367k65235M40934o4604
$$ 7897407 8531015 8571801 8778742 8698739 8764970 8603711 9226078 8960843 9401777 9337173
14405I337173J961M31278q0218M23462J93898k1050J37370K66216j3665J68329
$$ 9337173 9339134 9770412 9690194 10113656 10307554 10286504 10423874 10690090 10676425 10844754
14395A0844754K70340Q1762L46393j3878L92601L83283k49707N03442R8913L63029
$$ 10844754 11115094 11196856 11543249 11529371 11921972 12305255 12055548 12558990 12657903 13020932
14385A3020932M29204K95044Q1896K16004M16051j16505L92513N78212J87049
$$ 13020932 13450136 13745180 13827076 14043080 14459131 14342626 14735139 15313351 15500400
14376A5500400K40610J7181M34359J69992K45192N89087K13694K01458N51345
$$ 15500400 15741010 15758191 16192550 16362542 16607734 17196821 17410515 17611973 18163318
14367A8163318L66100N58057L69038K85153L47950L44142O72833M35263P61922
$$ 18163318 18529418 19087475 19456513 19741666 20089616 20433758 21106591 21541854 22303776
14358B2303776m0417N44995Q06326M86565P08481K56975Q55653O91208K65863
$$ 22303776 22263359 22808354 23614680 24101245 24809726 25066701 25922354 26613562 26879425
14349B6879425R89554O01446P53624Q00804Q23472O69820O03036J083656R00985
$$ 26879425 27868979 28470425 29224049 30024853 30848325 31518145 32121181 33204837 34105822
14340C4105822R15951Q88854J129523J027809J054654J036406J287714J533894
$$ 34105822 35021773 35910627 37040150 38067959 39122613 40159019 41446733 42980627
14332D2980627J124972J525817J023320J677403J689645J371193J661640J341874
$$ 42980627 44105599 45631416 46654736 48332139 50021784 51392977 53054617 54396491
14324E4396491K299378J793561K153166K279514K268463K014264K859637K240479
$$ 54396491 56695869 58489430 60642596 62922110 65190573 67204837 70064474 72304953
14316G2304953K917197K846151L039378L366735L085787L809348L622898L976125
$$ 72304953 75222150 78068301 81107679 84474414 87560201 91369549 94992447 98968572
14308I8968572M172431M721004M589760N235569N039356N753866N890880O554256
$$ 98968572 103141003 107862007 112451767 117687336 122726692 128480558 134371438 140925694
14300A40925694O872323P103398P528905Q277745Q593689R028252J0064982J0126140
$$ 140925694 147798017 154901415 162430320 170708065 179301754 188330006 198394988 208521128
14292B08521128J0653268J1474053J1880069J2643642J3083514J3754221J3977729
$$ 208521128 219174396 230648449 242528518 255172160 268255674 282009895 295987624
14285B95987624J4975900J5203681J5340953J5470321J5139205J4751434J4320518
$$ 295987624 310963524 326167205 341508158 356978479 372117684 386869118 401189636
14278D01189636J3784837J2281616J0788576R705000P539826N735422K255522
$$ 401189636 414974473 427256089 438044665 447749665 455289491 461024913 463280435
14271D63280435j252589l137227k977897l863863o578292q266826j0058039j1556762
$$ 463280435 462027846 458890619 455912722 452048859 445470567 437203741 427145702 415588940
14263D15588940j2661712j3415836j3960888j5051422j5279086j5499443j5260578
$$ 415588940 402927228 389511392 375550504 360499082 345219996 329720553 314459975
14256C14459975j5159523j4667609j2921357j3220610j2573182j2327066j1945929
$$ 314459975 299300452 284632843 271711486 258490876 245917694 233590628 221644699
14249B21644699j0783315j0447039j0035358r390482q402871p755152p970806
$$ 221644699 210861384 200414345 190378987 180988505 172585634 164830482 156859676
14242A56859676p391649p083186o614385o104949n412003n047080n419001m937248
$$ 156859676 149468027 142384841 135770456 129665507 124253504 119206424 113787423 108850175
14234A08850175m660812m289887l688202l486408m247700l334760l077343l073576
$$ 108850175 104189363 99899476 96211274 92724866 88477166 85142406 82065063 78991487
14226G8991487l292908k945118k386519k293074k689733k311343j914059k058660
$$ 78991487 75698579 72753461 70366942 68073868 65384135 63072792 61158733 59100073
14218E9100073k065941j867924j795791j992580p52559j746625j440865j604841
$$ 59100073 57034132 55166208 53370417 51377837 50625278 48878653 47437788 45832947
14210D5832947j472064j449478r00892n74453r81359j312908j329146j455840
$$ 45832947 44360883 42911405 42010513 41436060 40454701 39141793 37812647 36356807
14202C6356807p79047o37721q71133j033629p01641j249274q84864n36483l79586
$$ 36356807 35577760 34940039 34068906 33035277 32333636 31084362 30199498 29663015 29283429
14193B9283429p08689r31199p30538q88193k50798q43375k02079q70499n42978
$$ 29283429 28574740 27643541 26913003 26024810 25774012 24930637 24728558 23858059 23315081
14184B3315081n61792j35358p88536o35939k95938k08146m14326o24211k05885
$$ 23315081 22753289 22617931 21829395 21193456 20897518 20689372 20275046 19650835 19444950
14175A9444950o48699l98137k02646n39059r0495m87654l75938m44727j92973
$$ 19444950 18796251 18398114 18195468 17656409 17565914 17078260 16702322 16257595 16064622
14166A6064622j80985j17491o88810l11338L61771k82557n24976j65552l20291
$$ 16064622 15883637 15766146 15077336 14765998 15127769 14845212 14320236 14154684 13834393
14157A3834393k63879l24368o6010l26791l63049l52580R1591k16843k86046O868
$$ 13834393 13570514 13246146 13180136 12853345 12490296 12137716 12229307 12012464 11726418 11733286
14147A1733286l50909l4544N3690o42101L901O0738o2189p64129r2382L45556
$$ 11733286 11382377 11347833 11401523 10759422 10763323 10824061 10761872 9997743 9905361 10250917
14137A0250917l09004m52813l5259j51414O2667j32469k83970l12787m9016J02784
$$ 10250917 9941913 9489100 9453841 9302427 9365094 9232625 8948655 8635868 8586852 8689636
14127H689636m57588J35080k62379j77689R5314k81812M41243r4207p37331K62150
$$ 8689636 8232048 8367128 8104749 7927060 8022374 7740562 8181805 8087598 7350267 7612417
14117G612417q8481l40128J91850j98636k5179l36073J601J17978l55288K20396
$$ 7612417 7523936 7183808 7375658 7177022 7151843 6815770 6817371 6935349 6580061 6800457
14107F800457k01529k40975l04488J16228J15260J13120l57773J96115m57548
$$ 6800457 6598928 6357953 6053465 6169693 6284953 6398073 6040300 6236415 5778867
14098E778867j78654L33378j32159l16370L85729j86562m6542j63645K9310J63664
$$ 5778867 5600213 5933591 5801432 5485062 5870791 5684229 5637687 5474042 5503352 5667016
14088E667016j50245j81582k15670K33224l85106J70234k41565K733J27996l14315
$$ 5667016 5516771 5335189 5119519 5352743 4967637 5137871 4896306 4899039 5027035 4712720
14078D712720O9637j01097j32443j98013j4275J49312R3409m877k76793P7419
$$ 4712720 4782357 4681260 4548817 4350804 4336529 4485841 4579250 4574373 4297580 4374999
14068D374999n0586k11492K22344l46472K6125N5293Q1043q9594R6794j49453
$$ 4374999 4324413 4112921 4335265 3988793 4014918 4070211 4151254 4061660 4158454 4009001
14058D009001R0380M3834j83826j939l15433K11125k22347k34171J54249j34355
$$ 4009001 4099381 4143215 3959389 3957450 3642017 3853142 3630795 3396624 3550873 3416518
14048C416518K81840j53564J35763l14746l40370J26041M15264k55269Q0923R2795
$$ 3416518 3698358 3544794 3680557 3365811 3025441 3151482 3566746 3311477 3392400 3485195
14038C485195l43288J10119k95853K01738Q0642j00778K36311J4677k14673l36521
$$ 3485195 3141907 3252026 2956173 3157911 3238553 3137775 3374086 3388763 3174090 2837569
14028B837569K7091M03335l38657k63131L6878J63076N78l3596n4888O5215j57487
$$ 2837569 2864660 3267995 2929338 2666207 2703085 2866161 2866739 2833143 2778255 2843470 2685983
14017B685983N3941o7897k03350J73229J35070n58526K8107O0312m3125L41481
$$ 2685983 2739924 2672027 2468677 2641906 2776976 2218450 2246557 2306869 2263744 2605225
14007B605225q5189l47416n3831K74833j55482k3002K609j43062k76346N6527
$$ 2605225 2520036 2172620 2118789 2393622 2238140 2215138 2217747 2074685 1798339 1854866
13997A854866K94350k41371J57552P1002p2488j59442K34299K07260J194459K469375
$$ 1854866 2149216 1907845 2065397 2136399 2063911 1904469 2138768 2346028 3540487 6009862
13987F009862P551421K1466892R993939k0639069j1982626m434797k089711r59215
$$ 6009862 13561283 35028175 45022114 24383045 12400419 7965622 5875911 4916696
13979D916696p84478n41766k70299J22836o17806K2676j16211p0023k36207l4851
$$ 4916696 4132218 3590452 3320153 3442989 2825183 2847859 2731648 2661625 2425418 2390567
13969B390567M82025m06266j21317l8556N209K2927l62015K27814p9738j23114
$$ 2390567 2872592 2466326 2345009 2306453 2311662 2334589 1972574 2200388 2120650 1997536
13959A997536K26570k29037M09460m81680j10990J56067K81123n00302J72145
$$ 1997536 2224106 1995069 2404529 1922849 1811859 1967926 2249049 1748747 1920892
13950A920892O7556k18200K49022k6323n6712j56195m6087Q2045O1554K0647l2944
$$ 1920892 1988448 1770248 2019270 1992947 1936235 1780040 1733953 1815998 1877552 1898199 1865255
13939A865255j54932j65704Q8256K75614k26586q0612J04040N885l99735N12875
$$ 1865255 1710323 1544619 1632875 1908489 1681903 1601291 1705331 1711216 1311481 1824356
13929A824356L6494k05094L6430l74778J87596Q8979P8341l30017l4820N38558
$$ 1824356 1860850 1655756 1692186 1317408 1505004 1593983 1672324 1342307 1307487 1846045
13919A846045k21442p644l26276N8766J03522p3614K3674K06599r0305j49176
$$ 1846045 1624603 1616959 1290683 1349449 1452971 1379357 1403031 1609630 1519325 1370149
13909A370149j37840P0211j20258K87814k53961L24548j51564K35936o5650j03135
$$ 1370149 1232309 1302520 1182262 1470076 1216115 1540663 1389099 1625035 1559385 1456250
13899A456250r8422K08220K1904l22308J77891K00296n55678k31112L45162J05031
$$ 1456250 1357828 1566048 1587952 1265644 1443535 1643831 1088153 857041 1202203 1307234
13889A307234O8302j16809K69293m69341K7204K72765o9948Q4498p5322j85259
$$ 1307234 1375536 1258727 1528020 1058679 1085883 1358648 1288700 1373198 1297876 1112617
13879A112617K35679j74598m7911K0544k0002J36961P3456j22089J55088k45321
$$ 1112617 1348296 1173698 1125787 1146331 1126329 1263290 1336746 1214657 1369745 1124424
13869A124424J60623j81290j81122L99091m3306k29016J83443j74399j48294Q3733
$$ 1124424 1285047 1103757 922635 1321726 1278420 1049404 1232847 1058448 910154 993887
13859I93887N5541k55543M78610k13446J22475K37701n32552J63695J61301K9958
$$ 993887 1049428 793885 1272495 1059049 1181524 1419225 886673 1050368 1211669 1241627
13849A241627j71515m4178k42673J92097k84239M47141M0110l97695P7016J38756
$$ 1241627 1070112 1025934 783261 975358 691119 1138260 1178370 780675 857691 996447
13839I96447m6594k41956L83385m13843L23699l63957J21994K41663j04972J45237
$$ 996447 949853 707897 1091282 677439 1001138 637181 759175 1000838 895866 1041103
13829A041103j05015j42442q7609o6131L59452j02064k6937K06752K9635j77089
$$ 1041103 936088 793646 706037 639906 999358 897294 870357 1077109 1106744 929655
13819I29655k80940m1097J22757J08579J35353j83943Q8711p8916j07129K07490
$$ 929655 648715 607618 730375 838954 974307 790364 879075 800159 693030 900520
13809I00520j42885r0159K31699j17030K74817j83324l14783J69754J01263l3272
$$ 900520 757635 667476 899175 782145 1056962 873638 558855 728609 829872 796600
13799G96600l03709J12449J00900p7787j09745K67293k13573L71675l72004K86574
$$ 796600 492891 605340 706240 628453 518708 786001 572428 944103 572099 858673
13789H58673k90555K01949L27123j08439j95551q6933J25265k88478N25018n08705
$$ 858673 568118 770067 1097190 988751 793200 706267 831532 543054 1068072 559367
13779E59367L20298j96687l9933K18234l54217M45146k95412K76461l34646J29321
$$ 559367 879665 682978 643045 861279 507062 952208 656796 933257 598611 727932
13769G27932N5426k69658M77121D49253L73781o4365N1437J94064D49492K40606
$$ 727932 783358 513700 990821 449253 823034 758669 810106 1004170 449492 690098
13759F90098l3994k7785J39098N3395k84938K1584L33030j3303C79827N42611
$$ 690098 656104 628319 767417 820812 535874 557458 890488 877185 379827 922438
13749I22438j10736l51945K497K79957k50225P9642J03197k13654K43975j38719
$$ 922438 811702 459757 462254 742211 491986 571628 674825 461171 705146 566427
13739E66427Q0567N9400k15392N87259j95285r3992p3779j80340J80406J25057
$$ 566427 646994 706394 491002 1078261 882976 788984 715205 534865 715271 840328
13729H40328j21635n5295k66294L25673l29642J28063j50099j05990N11940k54531
$$ 840328 718693 663398 397104 722777 393135 521198 371099 265109 777049 522518
13719E22518J92581J29171k43123j94957N8041j47804K7978L50997O479m5403
$$ 522518 715099 844270 601147 406190 464231 316427 344405 695402 701881 656478
13709F56478j77087j41221J36555K20605n9754C01820J31428J72387N9293l7l19120
$$ 656478 479391 338170 474725 695330 635576 301820 433248 605635 664928 664891 345771
13698C45771J26533J25415n9617j02012J64823J26089k67942O8956o0974L43420
$$ 345771 472304 597719 538102 436090 600913 727002 459060 528016 467042 810462
13688H10462l36327j99067K66837J1375A60504J72401M92693k41332j9102B58864
$$ 810462 474135 275068 541905 553280 160504 332905 825598 584266 565164 258864
13677D42132J7280r5388P9565K22460j00969K23857l73397L878r78J01860j00418
$$ 442132 459412 364024 443589 666049 565080 788937 415540 419418 418440 520300 419882
13666D19882J21361m331n0087J39276J655j81483n6974K55639J6976q2887M7468
$$ 419882 541243 536912 486825 626101 627756 446273 389299 644938 661914 579027 626495
13655F26495r9480B10171J50044P1460N4754k15097M23919k01355j84757j39266
$$ 626495 527015 210171 360215 431675 486429 271332 695251 493896 309139 169873
13645A69873J51655L77723l36069N9313j39312j03776o1122J68438J27156j48803
$$ 169873 321528 699251 363182 422495 283183 179407 118285 286723 413879 265076
13635B65076M13967C17450J21792o9119J60899k26458K21394k57512M4217A29245
$$ 265076 679043 317450 439242 370123 531022 304564 525958 268446 312663 129245
13624E19542B31595J28999j75623l0865K11497M56087A38940K26254n6878p0014
$$ 519542 231595 360594 184971 154106 365603 821690 138940 365194 308316 238302
13614B38302J15876q0589q2541m7834L34363A90103R3985p3156L44800A80607
$$ 238302 354178 273589 191048 143214 477577 190103 284088 210932 555732 180607
13603G28492C12354K6588J51814B01281j7243J03487l4530J46875K7975b4353
$$ 728492 312354 338942 490756 201281 184038 287525 252995 399870 427845 -24353
13592A26473M43855j40323A83249K81755m9462K74004B85594J09027L58535B72087
$$ 126473 570328 430005 183249 465004 415542 689546 285594 394621 753156 272087
13581C86921J47898j14652O3488q7129p6510K35867G7280Q1209p6650J86250J4135
$$ 386921 534819 420167 483655 396526 320016 555883 77280 158489 81839 268089 282224
13570B82224o5417k8354J53049K02889k44278K11792A83480K32888m7396J19497
$$ 282224 216807 188453 341502 544391 300113 511905 183480 416368 368972 488469
13560D88469n4996n6633A82268K18988A35965K92963k1251b1200B83427J20344
$$ 488469 433473 376840 182268 401256 135965 428928 407677 -21200 283427 403771
13550D03771j98851M02382B74616J00459C7755K36902A05970J13725G6730M15435
$$ 403771 204920 607302 274616 375075 37755 274657 105970 219695 76730 492165
13540D92165P303N4403O6345A22978K58766A34492j8384L52497J15779j42020
$$ 492165 499468 553871 620216 122978 381744 134492 116108 468605 584384 442364
13530D42364J4579j31208K76368k04417L0097D2847L32743q3651l0699K31510
$$ 442364 456943 325735 602103 397686 427783 42847 375590 291939 261240 492750
13520D92750j96323A26519O05904A95406e9683D5287K70729G3226J45508L54797
$$ 492750 296427 126519 732423 195406 -59683 45287 316016 73226 218734 573531
13510E73531B3411K86162q6156l0800K70960B26285N0064F2394P51324C79589
$$ 573531 23411 309573 223417 192617 463577 226285 276349 62394 813718 379589
13499B86170n5851K4328o1674J74930A74748J19865J46168j54492j08113K77440
$$ 286170 230319 254647 192973 367903 174748 294613 440781 286289 178176 455616
13489D55616k01796g4379D00351A62855J9184L73770F6613K33328M3082L7853
$$ 455616 253820 -74379 400351 162855 182039 555809 66613 299941 343023 380876
13479C80876M5610B03536M1913G7807K16571j18752O8512J17145j55704L7356
$$ 380876 426486 203536 245449 77807 294378 175626 244138 361283 205579 242935
13469B42935a70645G07057A82475J25183a1437B73704f8388A01293D3420J54949
$$ 242935 -170645 707057 182475 307658 -11437 273704 -68388 101293 43420 198369
13459A98369L29044A43971K45040P194j18422a0394A6097c0153G6135L20986M8884
$$ 198369 527413 143971 389011 396205 277783 -10394 16097 -30153 76135 397121 446005
13448D46005A02998P7850k3894J84550A24283K09774k4807j03537L92391A46467
$$ 446005 102998 180848 156954 341504 124283 334057 309250 205713 598104 146467
13437D65893A06745N03580H2409J41705H0704l6098A3841L28076L04664j64787
$$ 465893 106745 610325 82409 224114 80704 44606 13841 341917 646581 481794
13427D81794D2059J65161r402J50245J71680A5021L26359A34719N8441a8838B94082
$$ 481794 42059 207220 197818 348063 519743 15021 341380 134719 193160 -18838 294082
13415B09793K41150A40165N55952B32352E8859K82048j06620J04143F7198K487
$$ 209793 450943 140165 696117 232352 58859 340907 234287 338430 67198 69685
13405F9685L36867B4806J47520L4443M8742O2567K85354A8672J47894P5773n9266
$$ 69685 406552 24806 172326 206769 255511 318078 603432 18672 166566 242339 183073
13394A83073K19169H0717b4658A50528M9642O3910L6082g8242A91930i3337A05981
$$ 183073 402242 80717 -24658 150528 200170 264080 300162 -78242 191930 -93337 105981
13382B35369a1391B86912K5432A51680N7728L06130A94083O2108K582D4195N78272
$$ 235369 -11391 286912 312344 151680 209408 515538 194083 256191 258773 44195 622467
13371F22467B89436j0180L7477A55149J61553j37021K16777q0495j28990B6762
$$ 622467 289436 279256 316733 155149 316702 179681 396458 315963 186973 26762
13360D83073E7914A3562O6487K02359N8861l8813a4470B79635E9168R7590K59490
$$ 483073 57914 13562 80049 282408 341269 302456 -14470 279635 59168 156758 416248
13349D16248J54288B39236g93D90591B20344j2215q313L9803K34259G0679P1630
$$ 416248 570536 239236 -793 490591 220344 208129 199816 239619 473878 70679 142309
13338A42309J71379J0244B5589K10210J07043J09677k20545j07255l8888Q8407
$$ 142309 313688 323932 25589 235799 342842 452519 231974 124719 85831 174238
13328A74238e5362B15431L7790K2221H4340L00729n9548A31789J19310J57810
$$ 174238 -55362 215431 253221 275442 84340 385069 325521 131789 251099 408909
13318D08909j87965K45363F1114J82332f1463F7192d3607j82679A38596K8559
$$ 408909 220944 466307 61114 243446 -61463 67192 -43607 -226286 138596 167155
13308A67155a42422A95958D6743M48345B23719L75909I1765K06261j16466E6651
$$ 167155 -142422 195958 46743 495088 223719 599628 91765 298026 181560 56651
13297B5436K22031H1619J24999C0654M12269j62751P2477H8431a45245C59792
$$ 25436 247467 81619 206618 30654 442923 280172 352649 88431 -145245 359792
13286a40864C26974P6539H628K25780A03159A7113K47506M105r0996E8997h64
$$ -140864 326974 403513 8628 234408 103159 17113 264619 268724 177728 58997 -864
13274b20224C65377r1891G1382b4568B33014l3906a42710B19991C9191a51317
$$ -220224 365377 273486 71382 -24568 233014 199108 -142710 219991 39191 -151317
13263A08645m0773J99745o0765a77741B76644A8325a9915B84460A12042R5808
$$ 108645 67872 267617 206852 -177741 276644 18325 -19915 284460 112042 207850
13253B07850E3018J86035F6461j8860J67869I9506Q8858m1160f7522a6970I1880
$$ 207850 53018 239053 66461 47601 215470 99506 188364 147204 -67522 -16970 91880
13241A5653J71728J44854j10709a6098A42229o8584J11017a30307e3596K6332
$$ 15653 187381 332235 221526 -16098 142229 73645 184662 -130307 -53596 -27264
13231b7264A96782J32502a22551A89668K4035d2270A40813K03860B1174K2925
$$ -27264 196782 329284 -122551 189668 213703 -42270 140813 344673 21174 44099
13221D4099N20925a6280A37352O74M5846A6023L25964f8098A30330N7303E6639
$$ 44099 565024 -16280 137352 138026 183872 16023 341987 -68098 130330 187633 56639
13209g9202p9926M4216C6708M04495A15725K02227n9088q7863F1473K02783A05887
$$ -79202 -159128 -114912 36708 441203 115725 317952 258864 171001 61473 264256 105887
13197A33595n3786M2690m0668R9550l149c63127C32572j00973a60208e5808D820
$$ 133595 79809 122499 81831 181381 178232 -363127 332572 231599 -160208 -55808 4820
13185F56025H2946o390B4863R3084J15021A3024J30528N6671r0223j8913H972
$$ 656025 82946 76556 24863 117947 232968 13024 143552 200223 110000 91087 8972
13173C44226F995A585a37855D33843C2271a60721C63547j03320j22484l7180L4331
$$ 344226 6995 1585 -137855 433843 32271 -160721 363547 260227 137743 100563 134894
13162A34894J15523E0695O0469b100E1952K5233e5489B86461o8622j9943n2726
$$ 134894 250417 50695 111164 -2100 51952 77185 -55489 286461 217839 197896 145170
13151A45170n228a36466o031B88647A10659a27543C18905b47048j2449A49303
$$ 145170 139942 -136466 -142497 288647 110659 -127543 318905 -247048 -259497 149303
13140I4605D1486L775N2583a0841C5116J62658l1164f9968B28641f0582C19159
$$ 94605 41486 45261 97844 -10841 35116 197774 166610 -69968 228641 -60582 319159
13128b5111j50523B70935n2560e7919j96670f0053A25408k5205c5171F2970J03024
$$ -25111 -175634 270935 218375 -57919 -254589 -60053 125408 100203 -35171 62970 165994
13117A65994f7759B19040r3560k6679a4543j1129B23662F1868l182a10905B26298
$$ 165994 -67759 219040 125480 98801 -14543 -25672 223662 61868 58686 -110905 226298
13105C8431a76224H4601C5606a10932D38557k04836J24710b1855j19847f0753
$$ 38431 -176224 84601 35606 -110932 438557 233721 358431 -21855 -141702 -60753
13094b38051J04532C8228b74877A57109L02826j73828A2879L41765f8993l2507
$$ -238051 -133519 38228 -274877 157109 459935 286107 12879 354644 -68993 -101500
13084a01500j109r941d1486K0652k0842B31223D3677K83054j40727K3922D9607
$$ -101500 -102609 -112550 -41486 -20834 -41676 231223 43677 326731 186004 209926 49607
13072F9805K13324c01530C02816j3345l3353J7216h983B87895F9402P5032l5048
$$ 69805 283129 -301530 302816 289471 256118 273334 -8983 287895 69402 144434 109386
13061A09386a94720b2727f772D1870L08130b4385j31043B65641L19608A38809
$$ 109386 -194720 -22727 -6772 41870 350000 -24385 -155428 265641 585249 138809
13050A39047f0019d600J029B82266o0298L2619h2552R191A69306F6792J3561J13784
$$ 139047 -60019 -4600 -3571 282266 221968 254587 -82552 -73361 169306 66792 80353 194137
13038A94137K0057j3561J40593c18766A46008I398a86898C54361A76278l2929
$$ 194137 214194 200633 341226 -318766 146008 9398 -186898 354361 176278 143349
13028A43349e5764D0179a4992I9013D5080a78581A59864f3205J2510I6679P270
$$ 143349 -55764 40179 -14992 99013 45080 -178581 159864 -63205 -50695 96679 103949
13017A03949M414K95510a5771A02435J08399R1507J14410i4780a4411B80622G2616
$$ 103949 108363 403873 -15771 102435 210834 302341 416751 -94780 -14411 280622 72616
13005b69392C93491j84877p9545g1529k2104m240I1575c1814A78066Q5263a67853
$$ -269392 393491 208614 129069 -71529 -93633 -97873 91575 -31814 178066 263329 -167853
12993A45583h331I4770d8017H4933c3702A10633K10848r0279F3443b54561F1786
$$ 145583 -8331 94770 -48017 84933 -33702 110633 321481 231202 63443 -254561 61786
12981A82392c1888B6534K11144F1497J9333J01879J41849A06581R3969l0543J78286
$$ 182392 -31888 26534 237678 61497 80830 182709 324558 106581 200550 170007 348293
12970C48293L793A04411i2280b4028j63558D04230F3089l91b28788A12071c33597
$$ 348293 352086 104411 -92280 -24028 -187586 404230 63089 62698 -228788 112071 -333597
12958B78363q9911d6911j00442D8126F438a2128j10867E0001O5774h0982H8752
$$ 278363 188452 -46911 -147353 48126 6438 -12128 -122995 50001 115775 -80982 88752
12946A8280K9939i4727I815a52345C7287e009D996Q7624J85371a68053E9952K32161
$$ 18280 48219 -94727 9815 -152345 37287 -5009 4996 92620 277991 -168053 59952 292113
12934B92113N7567D0892M7093O951C8746i1041K8563H3833Q7717b40057C17978
$$ 292113 349680 40892 87985 94936 38746 -91041 -62478 83833 171550 -240057 317978
12922c8481G7263a22688q9368d6079B66274d0844p3192n3011E1089J43163c9903
$$ -38481 77263 -122688 -212056 -46079 266274 -40844 -114036 -167047 51089 194252 -39903
12910g8125j54130b1126j17208A636K63953a4456B03760d6343A94533f4436D32511
$$ -78125 -232255 -21126 -138334 1636 265589 -14456 203760 -46343 194533 -64436 432511
12898g0082A49985c1404l5319k07681A87345n3233b44298a14664c2125B80422
$$ -70082 149985 -31404 -66723 -274404 187345 134112 -244298 -114664 -32125 280422
12887B88873a57904a3973A73066J44835j53484n3378l7058g750A0962h1089B41747
$$ 288873 -157904 -13973 173066 317901 164417 111039 73981 -7750 10962 -81089 241747
12875b66428E0880a75751G361a60539C08766a45574A92419a30276D8100a4590
$$ -266428 50880 -175751 7361 -160539 308766 -145574 192419 -130276 48100 -14590
12864A84921a6291B24524F8386h6218C47412b14529H0671N6766L5869b69084E8026
$$ 184921 -16291 224524 68386 -86218 347412 -214529 80671 137437 173306 -269084 58026
12852f7919B03167H2626M2513A0876c6426B87270c00747a03410M5329j40186B95877
$$ -67919 203167 82626 125139 10876 -36426 287270 -300747 -103410 -58081 -198267 295877
12840B7797J48572Q6642k6813b3115m9242A07784J00067A6869R0524a21325B88867
$$ 27797 176369 263011 236198 -23115 -72357 107784 207851 16869 107393 -121325 288867
12828C6854L568b08537A41235i642I280L61488d14101B90440E7568J41749M1016
$$ 36854 40422 -208537 141235 -9642 9280 370768 -414101 290440 57568 199317 240333
12817B40333f3836A14895L481a7499E7031J03642J13298j04134a98608j4621A41179
$$ 240333 -63836 114895 118376 -17499 57031 160673 273971 169837 -198608 -213229 141179
12805G3430b18000C4741A2797O247M1117J68174F9812b34295D6071b30977A53596
$$ 73430 -218000 34741 12797 19044 60161 228335 69812 -234295 46071 -230977 153596
12793A68725J26576a87287A01272A9982J01096Q737J60381c8205B77850j3579
$$ 168725 295301 -187287 101272 19982 121078 129815 290196 -38205 277850 264271
12783B64271e6307k67065A45217Q7439j9075l9203k3704E8982k5612Q3620b65854
$$ 264271 -56307 -323372 145217 232656 213581 174378 150674 58982 33370 116990 -265854
12771i9163B5480J30524d6513k9313B14369a91182a9001l8565E6428e1770K0292
$$ -99163 25480 156004 -46513 -75826 214369 -191182 -19001 -57566 56428 -51770 -31478
12760c1478A41256K76122b6031j65490J0987d6028B74825d2186j2716b5218D0382
$$ -31478 141256 417378 -26031 -191521 -180534 -46028 274825 -42186 -54902 -25218 40382
12748a31453B01337k3019O748k4417f6795f192A61732E8731J28648L7527d79k40952
$$ -131453 201337 178318 185066 160649 -66795 -6192 161732 58731 187379 224906 -479 -241431
12736b41431A09613l0939a94486B08832q6571M9608K31136f4633A75801c06688
$$ -241431 109613 78674 -194486 208832 122261 171869 403005 -64633 175801 -306688
12725B49876d1030j57639i5626D26724i9318n5899A8007P2235C7429f5300l3134
$$ 249876 -41030 -198669 -95626 426724 -99318 -155217 18007 90242 37429 -65300 -98434
12714i8434J8621E09289C7484b1001A38065K27354j69022O19208C1338M81096
$$ -98434 -79813 509289 37484 -21001 138065 365419 196397 815605 31338 512434
12704E12434E399a42446A08201l9599g9747G5736L00788g4677A20934a44268A79223
$$ 512434 5399 -142446 108201 68602 -79747 75736 376524 -74677 120934 -144268 179223
12692a8517A11832k2776K01254k7871b18644B5881a58355d9518A86097J0051a8970
$$ -18517 111832 89056 290310 262439 -218644 25881 -158355 -49518 186097 196148 -18970
12680F5753p66O9382R8651A9688n089L48147B9006a16195H7622c7369B82287F5932
$$ 65753 64987 134369 233020 19688 14599 362746 29006 -116195 87622 -37369 282287 65932
12667f0666j2585B69207h794F4889a11736C21129A12595a40003D7628j4995F465
$$ -60666 -73251 269207 -8794 64889 -111736 321129 112595 -140003 47628 32633 6465
12655A82571k8431J6401J4286a6696j543A86336F691J55471p7771L20771A09676
$$ 182571 154140 170541 184827 -16696 -18239 186336 6691 162162 84391 405162 109676
12643A2829K69350i2438C03298c49110f6838O633A7801c1693l4212K3524r343
$$ 12829 282179 -92438 303298 -349110 -66838 -60205 17801 -31693 -65905 -42381 -51724
12632e1724C91217A67769b1799A20314M3692Q8848K81239B14558A05725a02794
$$ -51724 391217 167769 -21799 120314 164006 252854 534093 214558 105725 -102794
12621B62559j02003K04372a64044C66520B9047K37900B5643J13845n4232a39152
$$ 262559 160556 364928 -164044 366520 29047 266947 25643 139488 85256 -139152
12610A90804E3360B3483J80106I6346M6593f2216h249n7083b9108B29255r2796
$$ 190804 53360 23483 203589 96346 142939 -62216 -8249 -65332 -29108 229255 136459
12599A36459J20819L5187l7314A19886M7611p873M8328R8812l5663d4856C1807
$$ 136459 257278 292465 255151 119886 167497 159624 207952 306764 271101 -44856 31807
12587A06892a12157A87643b0544A36476D5838L17710p4484a58106d579n827B6079
$$ 106892 -112157 187643 -20544 136476 45838 363548 289064 -158106 -4579 -10406 26079
12575A88622G2895a883B63414l0285b94670L0025L6993D86a09530B42507C9774
$$ 188622 72895 -1883 263414 233129 -294670 -264645 -227652 486 -109530 242507 39774
12563f5867j57336f5545j04111m25641B52719g4967a8577A77176e743B31872A7143
$$ -65867 -223203 -65545 -169656 -595297 252719 -74967 -18577 177176 -5743 231872 17143
12551A65696d4746b1683F31346B2445b03127m937C8032N679b74335i1935F4230
$$ 165696 -44746 -21683 631346 22445 -203127 -208064 38032 43711 -274335 -91935 64230
12539b88731A36780M0239B1849F972a51591A06956a37799B0795c1415I7361a17420
$$ -288731 136780 177019 21849 6972 -151591 106956 -137799 20795 -31415 97361 -117420
12527C49879d3922C66881a23377e4213P893B25492a92190b5223E2295K8455a94016
$$ 349879 -43922 366881 -123377 -54213 -46320 225492 -192190 -25223 52295 80750 -194016
12515A12001B8009J96836a90737R3585c2948A20957E6821L8278b92388A02117
$$ 112001 28009 224845 -190737 -97152 -32948 120957 56821 95099 -292388 102117
12504g3345k20694E071K75268A2031a20728A3955d4062E1287b12220f788C16194
$$ -73345 -294039 5071 280339 12031 -120728 13955 -44062 51287 -212220 -6788 316194
12492a17313B34594o3289D5661d23628A26730K04699o6797a63044H5899B0587
$$ -117313 234594 171305 45661 -423628 126730 331429 264632 -163044 85899 20587
12481E6317J8a07810M0004F4689h2346A44292M5471b8836E1131J61782d7005B32944
$$ 56317 56335 -107810 -67806 64689 -82346 144292 189763 -28836 51131 212913 -47005 232944
12468d7364J620A67339C7136e3467J4348H695b2286A319K21235I3320h2615o2804
$$ -47364 -45744 167339 37136 -53467 -39119 8695 -22286 1319 222554 93320 -82615 -145419
12456a45419A06752a92387P8000e3902j2615J8600D0165a2913B33447a73800O5466
$$ -145419 106752 -192387 -114387 -53902 -66517 -47917 40165 -12913 233447 -173800 -108334
12445a08334B2354a830A39497i2357D6819c04892A98626l7372M79O4634q8580
$$ -108334 22354 -1830 139497 -92357 46819 -304892 198626 161254 161733 226367 137787
12434A37787a00806J3901C53393b27387A54550a09838j7791B22501J48283A35367
$$ 137787 -100806 -86905 353393 -227387 154550 -109838 -127629 222501 370784 135367
12423A25933b6410j31186q5061A66485b93038a24501j4952B16735b12226C76998
$$ 125933 -26410 -157596 -242657 166485 -293038 -124501 -139453 216735 -212226 376998
12412e7295k63106F3101L03153a18562b4067A61697a33219C53511d4021j46806
$$ -57295 -320401 63101 366254 -118562 -24067 161697 -133219 353511 -44021 -190827
12402a90827r6469A00531a59442K5666C15667G2468J48969C2935c03687j10970
$$ -190827 -287296 100531 -159442 -133776 315667 72468 221437 32935 -303687 -414657
12392d14657a69639A9117O9239b20631j1961b6375k14579B53592b27406C46633
$$ -414657 -169639 19117 88356 -220631 -232592 -26375 -240954 253592 -227406 346633
12381D1715f3982o2368f1804A46881F6838J0049J72144k2125A0689P2425i2320
$$ 41715 -63982 -126350 -61804 146881 66838 76887 249031 226906 10689 83114 -92320
12369A52575A9179a47571A97872c3804k47586a504p7689l6187d4430q8493A18726
$$ 152575 19179 -147571 197872 -33804 -281390 -1504 -79193 -115380 -44430 -132923 118726
12357a87774N6937a8862A26004i299A75782m0581c00872B01058a54731B66865
$$ -187774 -130837 -18862 126004 -9299 175782 135201 -300872 201058 -154731 266865
12346a16492B57422b70674e2395B66206A26931a66463K725e7543A58119E3078
$$ -116492 257422 -270674 -52395 266206 126931 -166463 -163738 -57543 158119 53078
12335D28952h679l1403e644A38066D5573M4948c7903j95843C12050C1123c10819
$$ 428952 -8679 -40082 -5644 138066 45573 90521 -37903 -233746 312050 31123 -310819
12323a07140a7052A03693P1299m5652A5794m664b82975B14191C6333e5654j24705
$$ -107140 -17052 103693 174992 129340 15794 11130 -282975 214191 36333 -55654 -180359
12312a80359g2053A11039B7134b58519E1221E633K18472b50215h0047q2934A89601
$$ -180359 -72053 111039 27134 -258519 51221 5633 224105 -250215 -80047 -162981 189601
12300B13332b53148J10945d8757D42171f3853j2686C6449c3841r1323B72896O3748
$$ 213332 -253148 -142203 -48757 442171 -63853 -76539 36449 -33841 -125164 272896 336644
12289C36644A4715e1548A12725K29463J23303f3051j3521b2811B24012J47349
$$ 336644 14715 -51548 112725 342188 465491 -63051 -76572 -22811 224012 371361
12279C71361j55264r3226O9006k154B1630Q3133c2054A96610o4796M7665h7899
$$ 371361 216097 122871 191877 189723 21630 104763 -32054 196610 131814 179479 -87899
12267A82368a16784G1052J23613f2906L952A02843b90992I2046k5106K57439o8206
$$ 182368 -116784 71052 194665 -62906 -58954 102843 -290992 92046 66940 324379 256173
12256B56173A6449J15415K21606q8508O2665M2565a5164H1445A5039b12911C14715
$$ 256173 16449 131864 353470 264962 327627 370192 -15164 81445 15039 -212911 314715
12244B08687A3928J63658a97559A89717J37591c76998g7925B31J01976i5286I4286
$$ 208687 13928 177586 -197559 189717 327308 -376998 -77925 231 102207 -95286 94286
12232d3355A0465N54719A78127J07485b8542H2858M2223a4741D38934D1802e441
$$ -43355 10465 565184 178127 285612 -28542 82858 125081 -14741 438934 41802 -5441
12220C88217K4431A47782J04960J09327n281c92140A66201j6265a7656B31004
$$ 388217 412648 147782 252742 362069 356788 -392140 166201 149936 -17656 231004
12209A87303i0000B78340D1370P8137m3294O7759o2337C4944e0723A02524L8163
$$ 187303 -90000 278340 41370 119507 76213 143972 81635 34944 -50723 102524 140687
12198A40687a50314A54930J90360E5844a15383A41178O3088a27278B71892h8316
$$ 140687 -150314 154930 345290 55844 -115383 141178 204266 -127278 271892 -88316
12187C46502G252M61139A86790E8300a92200A82148q3970M5150J6428a21074C08785
$$ 346502 7252 468391 186790 58300 -192200 182148 98178 143328 159756 -121074 308785
12175B47154M2016b35876B50491m78A5893M43391D3290J88772p7668Q8874K10927
$$ 247154 289170 -235876 250491 250013 15893 459284 43290 232062 154394 243268 454195
12164D54195a33096F7150e7871C53752b83809a17165B51579f102D64881A3697
$$ 454195 -133096 67150 -57871 353752 -283809 -117165 251579 -6102 464881 13697
12153A67576F0461O5616a19093b8796b99A74154D7918K09281q0729p450l3791
$$ 167576 60461 126077 -119093 -28796 -299 174154 47918 257199 176470 169020 135229
12142A35229B5950h9780A68643C7990a20303D7907i1487R775A6882Q3858J18226
$$ 135229 25950 -89780 168643 37990 -120303 47907 -91487 -81712 16882 100740 218966
12131B18966D1996P5708a74983B27197a46764O1529B77994A7553J28007R4092
$$ 218966 41996 117704 -174983 227197 -146764 -85235 277994 17553 145560 239652
12121B39652b52635A88501c01918e2042B06910G8982J6326M5638J60123J61881
$$ 239652 -252635 188501 -301918 -52042 206910 78982 95308 140946 301069 462950
12111D62950k3817a78505e5889C19929A21207a45524A63468N0168r1271a58896
$$ 462950 439133 -178505 -55889 319929 121207 -145524 163468 213636 122365 -158896
12100C6402K76245m8821G6606g1266l05096B645d772j63662p3912B14025j04124
$$ 36402 312647 263826 76606 -71266 -376362 2645 -4772 -168434 -242346 214025 109901
12089A09901c81713a31077c6205K650A34575M3587q7634a45818A25260a0114r8801
$$ 109901 -381713 -131077 -36205 -33555 134575 178162 90528 -145818 125260 -10114 -108915
12078a08915A67183a22291J7054H7937K07902A45970N7926a13138q6871h8236
$$ -108915 167183 -122291 -105237 87937 295839 145970 203896 -113138 -200009 -88236
12067a2147A65302M7163b28232C466J06620K33008Q34840P37879F92717k35190
$$ -12147 165302 212465 -228232 3466 110086 343094 1177934 1915813 692717 457527
12057D57527F0757g8308j12971B35431C0407L5700c1706D196b08251E1331c221
$$ 457527 60757 -78308 -191279 235431 30407 66107 -31706 4196 -208251 51331 -3221
12045A66926b26939a01020l6902c2239A69943a12537N6024G0738i3078A53854
$$ 166926 -226939 -101020 -137922 -32239 169943 -112537 -56513 70738 -93078 153854
12034a21513h655F3175a665k13209h3194o3440j24718R9956e1185p8294d7857
$$ -121513 -8655 63175 -1665 -214874 -83194 -146634 -271352 -171396 -51185 -129479 -47857
12022D1823O0953e1168B92003n5031a67122b5609j89938B87342B6519J07743E8479
$$ 41823 102776 -51168 292003 236972 -167122 -25609 -215547 287342 26519 134262 58479
12010B45850R5518F5609A1792g0446j37990f1511A13596d9565k19010B9664K24243
$$ 245850 341368 65609 11792 -70446 -208436 -61511 113596 -49565 -268575 29664 253907
11999B53907a49095B01803k0698a51564e5603l08253F543a27529A50051J95367
$$ 253907 -149095 201803 181105 -151564 -55603 -363856 6543 -127529 150051 345418
11989C45418c09066H9026b28334D0795n61c91890B54318h8544J4101p4646j8438
$$ 345418 -309066 89026 -228334 40795 40234 -391890 254318 -88544 -74443 -149089 -167527
11978a67527j15595M8931j16510B65568G4208b315E3204Q4256h4060j9325j97501
$$ -167527 -283122 -234191 -350701 265568 74208 -2315 53204 137460 -84060 -103385 -300886
11967c00886a30228A15728A0387e422A67357h923C48316a32983G3870b2319H3316
$$ -300886 -130228 115728 10387 -5422 167357 -8923 348316 -132983 73870 -22319 83316
11955c48041a31609M2519E4526a77516P2597E1210J10988o3493f1187E2929b40185
$$ -348041 -131609 -89090 54526 -177516 -104919 51210 162198 98705 -61187 52929 -240185
11943e8141r8765M3966H3354d39406A05930b72592f0968D9015M7259b82229f573
$$ -58141 -156906 -112940 83354 -439406 105930 -272592 -60968 49015 96274 -282229 -6573
11931a22338A28133E4204i568F9036l3991g3995C4353J64134p916b34365e7697
$$ -122338 128133 54204 -9568 69036 35045 -73995 34353 198487 190571 -234365 -57697
11919E4510a55848c9996j49871B18738d5852j63461K9716A2573b17293g1482A28076
$$ 54510 -155848 -39996 -189867 218738 -45852 -209313 -179597 12573 -217293 -71482 128076
11907A40564J69818A17811J8c11796l4576B8834J92558A1992J71201C7561O8275
$$ 140564 310382 117811 117829 -311796 -346372 28834 221392 11992 183193 37561 105836
11896A05836b4478B2859b30351I9476c9808B88859h0685A10369a35025l3438B78413
$$ 105836 -24478 22859 -230351 99476 -39808 288859 -80685 110369 -135025 -168463 278413
11884G6929i6097K4244j5893B2562J37223a02394J5902D2721d7904F7479a39411
$$ 76929 -96097 -71853 -87746 22562 159785 -102394 -86492 42721 -47904 67479 -139411
11872e0286r5546A08427m8957J31477b6247L28A52860E1520b79974f4876C9394
$$ -50286 -145832 108427 59470 190947 -26247 -25919 152860 51520 -279974 -64876 39394
11860F2858b97392E30182A19573B2053a28296A35740f0383E8240a5188l9526A84332
$$ 62858 -297392 530182 119573 22053 -128296 135740 -60383 58240 -15188 -54714 184332
11848a44825f3067a6548F087a05240c9104C49869b53885A9943a88055Q1950E256
$$ -144825 -63067 -16548 6087 -105240 -39104 349869 -253885 19943 -188055 -106105 5256
11836f7885j03455E8999d5875k34404N3782j48382H4481a16251a2051j94359j093
$$ -67885 -171340 58999 -45875 -280279 -226497 -374879 84481 -116251 -12051 -206410 -207503
11825b07503C8515J32374b8999G6224a86670B19931a06807o2637A9446L74556
$$ -207503 38515 170889 -28999 76224 -186670 219931 -106807 -169444 19446 394002
11815C94002d8877A21455a4510k71042A62941g5628j87951f4052o2277b6073j55324
$$ 394002 -48877 121455 -14510 -285552 162941 -75628 -263579 -64052 -126329 -26073 -181397
11804a81397O8069L4003B8003J98557f810B55380G2555e9198j44717G4253L8043
$$ -181397 -113328 -79325 28003 226560 -6810 255380 72555 -59198 -203915 74253 112296
11793A12296f5379l2462c5319D24048H7949C1609R2032d9592J1043A95974d318
$$ 112296 -65379 -97841 -35319 424048 87949 31609 123641 -49592 -38549 195974 -4318
11781B76553a27626j33272B31984d2359A62282f1358m9515C0378J01733h7590
$$ 276553 -127626 -260898 231984 -42359 162282 -61358 -110873 30378 132111 -87590
11770b9718a2288k4242A60902G3472j0504A663J45876b96672D856K52493A27001
$$ -29718 -12288 -36530 160902 73472 62968 1663 147539 -296672 4856 257349 127001
11758b5902n6283l9698A18466A8538J81006a13963c1526l8524D54398b67394a12821
$$ -25902 -82185 -121883 118466 18538 199544 -113963 -31526 -70050 454398 -267394 -112821
11746d9034k00669D652h542E1809M211k8J52109a6971o0234A2490R075c12042
$$ -49034 -249703 4652 -8542 51809 56020 55992 208101 -16971 -77205 12490 21565 -312042
11733C54649c1907C78827r9113b09867A55455J59533D4610b41957J10554B5747
$$ 354649 -31907 378827 279714 -209867 155455 314988 44610 -241957 -131403 25747
11722A32485o6056a06232C16321A8307J33832a5991A98012q5922h7374j90660
$$ 132485 66429 -106232 316321 18307 152139 -15991 198012 112090 -87374 -278034
11712b78034m3090a54570B92030i9343A88890k5446D3227K16062c3746A76025
$$ -278034 -321124 -154570 292030 -99343 188890 163444 43227 259289 -33746 176025
11701B22255b5662m0492r8541B57498I7146a13306L9184D1721a67251F1534L6379
$$ 222255 -25662 -66154 -164695 257498 97146 -113306 -74122 41721 -167251 61534 97913
11690I7913a2901j8058b980A33067J41546G8595j9254K84603e4431A85870E6554
$$ 97913 -12901 -30959 -2980 133067 274613 78595 59341 343944 -54431 185870 56554
11678D47282E8421B7395b26406C08805A05899a11371a2822n4622A93799A3338
$$ 447282 58421 27395 -226406 308805 105899 -111371 -12822 -67444 193799 13338
11667A92515L5919a9101B38900n1672b00558A04800N8780a62790M7709A45920
$$ 192515 228434 -19101 238900 187228 -200558 104800 163580 -162790 -115081 145920
11656B89784p9586A5682a35394e495C75292j55695f8448k9250B46671F7816K7866
$$ 289784 210198 15682 -135394 -5495 375292 219597 -68448 -97698 246671 67816 95682
11645I5682a46487j12325H6049b0247B8640a12208F9693J07241a92547d8286l0979
$$ 95682 -146487 -258812 86049 -20247 28640 -112208 69693 176934 -192547 -48286 -79265
11634g9265G0928b87809g379j73392B00411B6599K34804d892A65911f2460C21997
$$ -79265 70928 -287809 -7379 -180771 200411 26599 261403 -4892 165911 -62460 321997
11622A79244P0297A20077c14490J40032A2002Q5944j4114J22642C8529b47630
$$ 179244 249541 120077 -314490 -174458 12002 97946 83832 206474 38529 -247630
11611i4603a9687k87338B13834J93A2326a94558f1865A98641G5942b51294A3872
$$ -94603 -19687 -307025 213834 214027 12326 -194558 -61865 198641 75942 -251294 13872
11599a32785B16241J40542h2876l6614L1810C52088E5911a79394H8616c3337C53528
$$ -132785 216241 356783 -82876 -119490 -87680 352088 55911 -179394 88616 -33337 353528
11587a15122A28670K7528c298B19036n8492c5009o4199D3723K78186A01141Q3174
$$ -115122 128670 156198 -3298 219036 160544 -35009 -99208 43723 321909 101141 184315
11576A84315k8912a17114A09153M348f7141B03607o7960o6885b6299A91128P6323
$$ 184315 155403 -117114 109153 113501 -67141 203607 135647 68762 -26299 191128 267451
11565B67451G2509L07808D0476e139D62146A21071B5225F126a9569P87I6456A5015
$$ 267451 72509 380317 40476 -5139 462146 121071 25225 6126 -19569 -18782 96456 15015
11552C2983O3159a87831C45473A03181M055k2773g8104L1947B17437r0490h3345
$$ 32983 96142 -187831 345473 103181 107236 84463 -78104 -46157 217437 126947 -83345
11540A2863J47025J02267l9805a86808B22063l6816C73a4732l4925A42498o1131
$$ 12863 159888 262155 222350 -186808 222063 185247 373 -14732 -49657 142498 81367
11529H1367e5639A20645k6329P3511h8302E34665a12791F5925K09499r6243g4194
$$ 81367 -55639 120645 94316 167827 -88302 534665 -112791 65925 275424 179181 -74194
11517H388N8444r8b90265C12008j13093a10405F1279J62338l6824P5830o5519
$$ 8388 66832 66734 -290265 312008 198915 -110405 61279 223617 186793 262623 197104
11506A97104d8156A68964D8417d7637B45291j09313o7717A0972L3418K12421e3210
$$ 197104 -48156 168964 48417 -47637 245291 135978 68261 10972 44390 256811 -53210
11494A50018j0214D7839A0584J06197g1353H7242R5376J4005N4021L50172A20263
$$ 150018 139804 47839 10584 116781 -71353 87242 182618 196623 250644 600816 120263
11482g3034G9077k0316J93186k7656A7458M8965Q5620J60819g8195A63956J807
$$ -73034 79077 58761 251947 224291 17458 66423 152043 312862 -78195 163956 165763
11471A65763K97359h25B61477C7748K81720j01807a16218r3899A25214a57109
$$ 165763 463122 -825 261477 37748 319468 217661 -116218 -210117 125214 -157109
11460b6116A81148D9540P3268d0365B4664a32972D3856h1127A96578J46998a06485
$$ -26116 181148 49540 122808 -40365 24664 -132972 43856 -81127 196578 343576 -106485
11448a29589C24623j18878d0727D0778j243A1584K7185L05178f1078B09001E205
$$ -129589 324623 205745 -40727 40778 39535 11584 38769 343947 -61078 209001 5205
11436C24059e6905D2272a30619A79276K6950J56491E1677J04089J13239c6149
$$ 324059 -56905 42272 -130619 179276 206226 362717 51677 155766 269005 -36149
11425a25271o228I3529a53536e9866B87621L9023a77685a2129A38495a28380c8035
$$ -125271 -131499 93529 -153536 -59866 287621 326644 -177685 -12129 138495 -128380 -38035
11413E3797b17034I9654a62862A6976d02362a86897C35650f0935j03892N8838
$$ 53797 -217034 99654 -162862 16976 -402362 -186897 335650 -60935 -164827 -105989
11403a05989B12137D1014a13780A07837f9764A30414j8024B5939G999J18456J25858
$$ -105989 212137 41014 -113780 107837 -69764 130414 112390 25939 7999 126455 252313
11392B52313J6644b11378G5351J81026j28014J23439b54441g9546k07780E5769
$$ 252313 268957 -211378 75351 256377 128363 251802 -254441 -79546 -287326 55769
11381e6177A11213J36012I5669g3288A892a4904I814L3368a078H0921p658J08713
$$ -56177 111213 247225 95669 -73288 1892 -14904 9814 43182 -1078 80921 73263 181976
11369A81976L5718m1776f5400A48434a83660b3922n3770j2682b3727A06814J6136
$$ 181976 217694 175918 -65400 148434 -183660 -23922 -77692 -90374 -23727 106814 122950
11358A22950Q2890a20607m3965D5509H535b79895g4827l9492A99576e4664r3868
$$ 122950 205840 -120607 -164572 45509 8535 -279895 -74827 -114319 199576 -54664 -148532
11347a48532I1316N3918b41974C21727A57038a82317B28180a28654G3386b4008
$$ -148532 91316 145234 -241974 321727 157038 -182317 228180 -128654 73386 -24008
11336d0495B49548c44606B87620H2000P9067g6753A9474J19743a6341B98268b04247
$$ -40495 249548 -344606 287620 82000 161067 -76753 19474 139217 -16341 298268 -204247
11324A07717a78416g3521b4902j31687e1717G54b78408J25985A08027K4079o1283
$$ 107717 -178416 -73521 -24902 -156589 -51717 754 -278408 -152423 108027 132106 70823
11313G0823b38630a8685G0083d8103C03033c5329A15976k8264k2652f2616n6737
$$ 70823 -238630 -18685 70083 -48103 303033 -35329 115976 87712 65060 -62616 -119353
11302a19353B12618a58402l3310b6262A43024c16329B63721C6180J31828b55394
$$ -119353 212618 -158402 -191712 -26262 143024 -316329 263721 36180 168008 -255394
11291a42271k04030A88770G1673a03730A4541c15473G8783d9361m2122c139m53228
$$ -142271 -346301 188770 71673 -103730 14541 -315473 78783 -49361 -91483 -3139 -456367
11280d56367d8993a3737J367B140P0531d3201A824K1400Q1686J32565E4729A4538
$$ -456367 -48993 -13737 -12370 2140 72671 -43201 1824 23224 104910 237475 54729 14538
11267A43318a75698J3936H83a90815K286B21919I0504L5866J974J70527b34541
$$ 143318 -175698 -161762 883 -190815 -188529 221919 90504 126370 128344 298871 -234541
11255b77035A0202J50692m9465D811a2463j77785n408N6449l18846i5839A30757
$$ -277035 10202 160894 111429 4811 -12463 -190248 -195656 -139207 -458053 -95839 130757
11243b19878n5288r6986a10490E1939j2027a93214F2394J05761a98628K6639B0298
$$ -219878 -275166 -372152 -110490 51939 39912 -193214 62394 168155 -198628 -171989 20298
11231A48974R6797b38006H4685M0759a01496M0298A15671j1076a30788c9816j41199
$$ 148974 245771 -238006 84685 125444 -101496 -61198 115671 104595 -130788 -39816 -181015
11220a81015B1860a86085m3778R5567L6418K1106h324A38701C0968J76019l9719
$$ -181015 21860 -186085 -229863 -134296 -97878 -76772 -8324 138701 30968 206987 167268
11209A67268a03284l1111J9596A73937b0299B41758a13847b5825k78664J06394
$$ 167268 -103284 -134395 -114799 173937 -20299 241758 -113847 -25825 -304489 -198095
11199a98095l42928a77181C4953b7363B59558B6741b61239l0640c8407D5002a52663
$$ -198095 -541023 -177181 34953 -27363 259558 26741 -261239 -291879 -38407 45002 -152663
11187a03838k84676J73738H268f5771K3860q957A09214N2332C3614d0691A11088
$$ -103838 -388514 -214776 8268 -65771 -41911 -50868 109214 161546 33614 -40691 111088
11175b39624A2264a38348m8260j52702i2693J5415A80283a96105p902B15063a82553
$$ -239624 12264 -138348 -186608 -339310 -92693 -77278 180283 -196105 -204007 215063 -182553
11163a56508P0317k2669l6121H3807M5164a09894B5517c031n9852A86171d27688
$$ -156508 -86191 -108860 -144981 83807 128971 -109894 25517 -3031 -62883 186171 -427688
11151b21881C65213G6723R1777a21618j54274A57032e2049A55097h1802J1237
$$ -221881 365213 76723 168500 -121618 -275892 157032 -52049 155097 -81802 -70565
11141g0565j51417I6337J18247a39676k8783B65957N1809c0349j19001a45p779
$$ -70565 -221982 96337 214584 -139676 -168459 265957 317766 -30349 -149350 -145 -7924
11130g924E9613M1279J20866a33378a4285k75515C9977b7458A32589m696k0391
$$ -7924 59613 100892 221758 -133378 -14285 -289800 39977 -27458 132589 127893 107502
11119A07502l3991L32798H7145K84954j19518d0344H7554g9502A18358J26901
$$ 107502 73511 406309 87145 372099 252581 -40344 87554 -79502 118358 245259
11109B45259e9625B5891L53923j74542D3679J40624E7197O7761f4559I1188j5042
$$ 245259 -59625 25891 379814 205272 43679 184303 57197 124958 -64559 91188 76146
11098G6146J02017A7435J33049N12747B82867J0553K45331B44418q7309J96102
$$ 76146 178163 17435 150484 663231 282867 293420 538751 244418 157109 353211
11088C53211A5725J27609e7294C67943j71890J38403L8574R6977F5140g7571A17269
$$ 353211 15725 143334 -57294 367943 196053 334456 373030 470007 65140 -77571 117269
11076A92722P3477d4187a4077C28298A52093K43232J5855o0765L9735m4442q7813
$$ 192722 266199 -44187 -14077 328298 152093 395325 411180 350415 390150 345708 257895
11065B57895A10672k5929L14772J55784J62427o0577j71405o5993L855M34730
$$ 257895 110672 84743 399515 555299 717726 657149 485744 419751 423606 858336
11055H58336r824n3721l25021M34356j88353k30198M05734k38600R9429j53126
$$ 858336 848512 794791 469770 904126 715773 485575 891309 652709 752138 599012
11045E99012j30134K61364q8700J62849M9860j03075j61049Q087r4448l7933J22875
$$ 599012 468878 730242 641542 804391 854251 751176 590127 598214 503766 465833 588708
11034E88708M49264k22494j25450q634k56261R7945J02382L40264k90320k6572
$$ 588708 1037972 815478 690028 681394 425133 523078 625460 965724 675404 648832
11024F48832L85655m03905n6811o4930P7531j89847M24609k9636k83071O0884
$$ 648832 1034487 630582 573771 508841 586372 396525 821134 791498 508427 569311
11014E69311J64655k43911m4480J6348L8956B18031O06638j7k61666J00986K0995
$$ 569311 733966 490055 445575 461923 500879 218031 824669 824652 562986 663972 684967
11003F84967m3897N7621O9048K9898k07937J59439j64164L12336l89029N3798
$$ 684967 641070 698691 767739 797637 589700 749139 584975 897311 508282 562080
10993E62080K51985k97000A60870P28940j92081M22158k41748J24737k01109K54744
$$ 562080 814065 517065 160870 889810 697729 1119887 878139 1002876 801767 1056511
10983A056511n8019K79885J1958N6064n7089J05027M17018N7127K78648J84547
$$ 1056511 998492 1278377 1290335 1346399 1289310 1394337 1811355 1868482 2147130 2331677
10973B331677K93993K25224m3766L2629J28692k39700l07738K4757l59033j13152
$$ 2331677 2625670 2850894 2807128 2839757 2968449 2728749 2421011 2445768 2086735 1973583
10963A973583j82255k85355K66585j17803J60885j38511J93328Q2256m42488K37053
$$ 1973583 1791328 1505973 1772558 1654755 1815640 1677129 1870457 1952713 1510225 1747278
10953A747278m99104O0016j49183n20187k08750M20555k40671j26600A24774J7862
$$ 1747278 1248174 1308190 1159007 638820 430070 850625 609954 483354 124774 142636
10943A42636M08800j42125B3888d0675C34183K5021j29716h3166D19226d6648
$$ 142636 551436 409311 23888 -40675 334183 359204 229488 -83166 419226 -46648
10932A38562o5313J43771j1381q0382b37388A13917N8804q4888a88363a9524A31726
$$ 138562 73249 217020 205639 125257 -237388 113917 172721 87833 -188363 -19524 131726
10920a13919k15098B11556G6532i3305A25037i2847A22327K4069n6095D4379R674
$$ -113919 -329017 211556 76532 -93305 125037 -92847 122327 146396 90301 44379 54053
10909E4053P4554J11361I8327g2323K2852o761A1054L9294k901b11684A04153
$$ 54053 128607 239968 98327 -72323 -49471 -56232 11054 50348 47447 -211684 104153
10897a96218P4058C34469B3719g2410D32223a76350A25794J84837a12553F1935
$$ -196218 -122160 334469 23719 -72410 432223 -176350 125794 310631 -112553 61935
10886b13921i2045F7966e3921A78599k694e4021a8126A71041b71324A76095F0867
$$ -213921 -92045 67966 -53921 178599 175905 -54021 -18126 171041 -271324 176095 60867
10874a69602J7346m3935G4062K9202b25097g9491B1108a71345g3165L2678D26397
$$ -169602 -152256 -196191 74062 103264 -225097 -79491 21108 -171345 -73165 -40487 426397
10862a64555L8234A15958e1507o993A3426c07305q6388a38999n4038D2617A0281
$$ -164555 -126321 115958 -51507 -58500 13426 -307305 -393693 -138999 -193037 42617 10281
10850E1987b18361A9244J72728k9361a74778a6465j10604p9792G0722a92765f8677
$$ 51987 -218361 19244 191972 162611 -174778 -16465 -127069 -206861 70722 -192765 -68677
10838b23653H5811a00180o1919B3412J5914K2180b1769j69139i652A30163a17509
$$ -223653 85811 -100180 -162099 23412 39326 61506 -21769 -190908 -9652 130163 -117509
10826B99292b37942c9104k20743i9874n1861F9368d99105F0217a93108g764k32877
$$ 299292 -237942 -39104 -259847 -99874 -151735 69368 -499105 60217 -193108 -7764 -240641
10815b40641Q2306j73693d5144H5704h1067K1281D7228L2576a02033n717D7441
$$ -240641 -158335 -332028 -45144 85704 -81067 -59786 47228 79804 -102033 -107750 47441
10803h8490A36127d68390A62687a37431J2546C20809N2648c82752a35951C2364
$$ -88490 136127 -468390 162687 -137431 -124885 320809 373457 -382752 -135951 32364
10792a03241k6400q9026D5212J00139c8100a4412B50578j02640a57435n4752K3375
$$ -103241 -129641 -218667 45212 145351 -38100 -14412 250578 147938 -157435 -212187 -188812
10781a88812k3228B65871D4092h8318B21870a72264A36377a3222k46919A16958
$$ -188812 -212040 265871 44092 -88318 221870 -172264 136377 -13222 -260141 116958
10770B94613j38160a42206L1310B15288a12423j88798C08438A07771l4967a08161
$$ 294613 156453 -142206 -110896 215288 -112423 -301221 308438 107771 72804 -108161
10759a54963o0497O9582H7576a79041e2489m6518j04017i9926J6623A2440h8817
$$ -154963 -215460 -145878 87576 -179041 -52489 -99007 -203024 -99926 -83303 12440 -88817
10747C09322e8870A30060E4106M9584a56295M9833j1578A06279d10414B15713
$$ 309322 -58870 130060 54106 103690 -156295 -106462 -118040 106279 -410414 215713
10736a54408A58173a79087A59468a38004b4172F3708b41266I2754a03965F4744
$$ -154408 158173 -179087 159468 -138004 -24172 63708 -241266 92754 -103965 64744
10725c7758I4797N3244a32128B34662A9124c37946d1604I6697g8156A79996b50483
$$ -37758 94797 148041 -132128 234662 19124 -337946 -41604 96697 -78156 179996 -250483
10713b44637J17575a042I3021e105l17907a40154A23695a20384C6553P7904g9778
$$ -244637 -127062 -1042 93021 -5105 -323012 -140154 123695 -120384 36553 114457 -79778
10701A58923J67876a86635f6069A03007R0878b80751a31022B1472a85223d0470
$$ 158923 326799 -186635 -66069 103007 193885 -280751 -131022 21472 -185223 -40470
10690A26492L24140i0723m7254A17030b98110B7266a06242H895f6345C37601d788
$$ 126492 450632 -90723 -137977 117030 -298110 27266 -106242 8895 -66345 337601 -4788
10678C34008A30210A9981N831a15689B1951e849j82999f9418j43566P1615I1740
$$ 334008 130210 19981 25812 -115689 21951 -5849 -188848 -69418 -212984 -141369 91740
10666E2140b20400C6228a44032G5852P7598a58471e1163j9818A48552a45135j6765
$$ 52140 -220400 36228 -144032 75852 153450 -158471 -51163 -70981 148552 -145135 -161900
10655a61900B5149A862b3322A48734D477J86092h5533j24665j80765J72260G1314
$$ -161900 25149 1862 -23322 148734 4477 190569 -85533 -210198 -390963 -218703 71314
10643B06200e3616C2837c34081e0232m366J7332n3956A33815b54365B97207g1045
$$ 206200 -53616 32837 -334081 -50232 -54598 -37266 -91222 133815 -254365 297207 -71045
10631a51940I1882c40274a23033G7850a54177A56556a16988G088f7988j29051
$$ -151940 91882 -340274 -123033 77850 -154177 156556 -116988 7088 -67988 -197039
10621a97039D5448L82207F7900b80757B3500L1890a78596h2693A15711a16534
$$ -197039 45448 427655 67900 -280757 23500 55390 -178596 -82693 115711 -116534
10610a53349A0783a43639p3860B38539e5539I9714a23766C83261d12685J89249
$$ -153349 10783 -143639 -217499 238539 -55539 99714 -123766 383261 -412685 -223436
10600b23436b8986m4651l7516B02287a37137L4275j024j36492h353B43927b70480
$$ -223436 -28986 -73637 -111153 202287 -137137 -102862 -103886 -240378 -8353 243927 -270480
10588B52075p4131A0837a19710C46945b11653A17540a05932H1158a13324A33516
$$ 252075 177944 10837 -119710 346945 -211653 117540 -105932 81158 -113324 133516
10577A34501f8078A76409o3224g9429c5235r7632A34885a79351c9291A63490b5968
$$ 134501 -68078 176409 113185 -79429 -35235 -132867 134885 -179351 -39291 163490 -25968
10565A20685l8552a68643N0263A807J79134a91453l4311R7120b2671j82132n233
$$ 120685 82133 -168643 -118380 1807 180941 -191453 -225764 -128644 -22671 -204803 -210036
10554b10036C0348j4679a57663p6738f5760K5373j44416m5504A74603M9763p0432
$$ -210036 30348 15669 -157663 -234401 -65760 -40387 -184803 -230307 174603 224366 153934
10543A53934a19373A26832b89380E7099c47088A14481O7767p8257h4380g092j24111
$$ 153934 -119373 126832 -289380 57099 -347088 114481 182248 103991 -84380 -7092 -131203
10532a31203O3030n4773n6045j62252A47511b98844a12131p2366A98687c55643
$$ -131203 -68173 -122946 -178991 -341243 147511 -298844 -112131 -184497 198687 -355643
10521b1868E0815F974a05813j83613B13736b54816B0403K6257K80397H8921i4488
$$ -21868 50815 6974 -105813 -289426 213736 -254816 20403 46660 327057 88921 -94488
10509A24401a6641C09881i3680C4809a6093j689j50607B32369a6313l6508D6032
$$ 124401 -16641 309881 -93680 34809 -16093 -17782 -168389 232369 -16313 -52821 46032
10497d00093p2704b31241Q5460d6072H8179a97517A7739c97001A55737c42804
$$ -400093 -472797 -231241 -145781 -46072 88179 -197517 17739 -397001 155737 -342804
10486a81102h3032C6381E593J14575P3249k109M21831Q4016k81147A01273A1032
$$ -181102 -83032 36381 5593 120168 193417 191308 613139 697155 416008 101273 11032
10474B72290a86951D00102d8972j7623j09583p6512A20749k3128d403C3796A6783
$$ 272290 -186951 400102 -48972 -66595 -176178 -252690 120749 97621 -4403 33796 16783
10462b1718c918j21908D20996d9472C8507a76927f2514A8210K85569e375m2530
$$ -21718 -3918 -125826 420996 -49472 38507 -176927 -62514 18210 303779 -5375 -47905
10451d7905K289j85914P8021e5924D8577L3548B6759b04704e0362J52A91180b9780
$$ -47905 -45616 -231530 -153509 -55924 48577 82125 26759 -204704 -50362 -50210 191180 -29780
10438B17200i9956j48518F1000c40590A77064b1265p0709m7027j6517B19108p8340
$$ 217200 -99956 -248474 61000 -340590 177064 -21265 -91974 -139001 -155518 219108 140768
10427A40768a979p8558I5256d0175A78161C3462a88175d257C3909a27666A36452
$$ 140768 -1979 -80537 95256 -40175 178161 33462 -188175 -4257 33909 -127666 136452
10415C3020c03201A31703c65190C9831J27329o4512a29270K5497p3133B19659
$$ 33020 -303201 131703 -365190 39831 167160 102648 -129270 -103773 -176906 219659
10404A70727D0748H793K3763J04411L5296c31684A33488D5712J76710C9886R8633
$$ 170727 40748 8793 32556 136967 172263 -331684 133488 45712 222422 39886 138519
10393A38519a993A2511d5039A53158m2020J1859J7025K49678a2338h60A07054
$$ 138519 -1993 12511 -45039 153158 111138 122997 140022 389700 -12338 -860 107054
10381h2670A38949J3908a17161I2808J19387E7335J55107D8453L88722o0380P7678
$$ -82670 138949 152857 -117161 92808 212195 57335 212442 48453 437175 376795 454473
10370D54473j50702n1215J53597K23912n4205L7314J68000l65855R1381B17463
$$ 454473 303771 252556 406153 630065 575860 613174 781174 415319 506700 217463
10359D79024r0322H4474l9048K63141A03032P3176L6274K46165M3508J7726j25318
$$ 479024 388702 84474 45426 308567 103032 176208 212482 458647 502155 519881 394563
10348C94563j28667n3855N54808B94064E2888M95580B31942p4566k7337K40547
$$ 394563 265896 212041 766849 294064 52888 548468 231942 157376 130039 370586
10338C70586g3811j62074B40579R3833J300G360J10251J17355A10924K19083A16096
$$ 370586 -73811 -235885 240579 334412 335712 7360 117611 234966 110924 330007 116096
10326G7425C7813L33246C6633J44890L03267I0839L09938O102K08936A18020M3050
$$ 77425 37813 371059 36633 181523 484790 90839 400777 406879 615815 118020 161070
10315A61070G7271J19499J58537b6570B09422a36165m0554j29356b2622m4872
$$ 161070 77271 196770 355307 -26570 209422 -136165 -176719 -306075 -22622 -67494
10305f7494A36717m4033R764l3390a41624B01289a07587A5612O5223d0259j67113
$$ -67494 136717 92684 102448 69058 -141624 201289 -107587 15612 80835 -40259 -207372
10294b07372f0644j01434p0069o700j03518A05878a45842B53754b39543B0161
$$ -207372 -60644 -162078 -232147 -238847 -342365 105878 -145842 253754 -239543 20161
10283e8513l4316j03021G9251a18801a131A26743d020j2293r9681p5154N507R1783
$$ -58513 -92829 -195850 79251 -118801 -1131 126743 -4020 -16313 -115994 -191148 -185641 -93858
10271i3858d511C3291b34125A28156a91977P8828B05134J47352c6510A54879a8616
$$ -93858 -4511 33291 -234125 128156 -191977 -113149 205134 352486 -36510 154879 -18616
10259B30862P238J78289A72854N49894A28920i3504G7113J12252d6598l10674
$$ 230862 238100 416389 172854 722748 128920 -93504 77113 189365 -46598 -357272
10249c57272d2954J8319B59211H1186g2588A39026a61999P6643C52075a07135
$$ -357272 -42954 -24635 259211 81186 -72588 139026 -161999 -85356 352075 -107135
10238d5402E3474e766A79918o4378n919a55490E0299a31504J4107l1460A9398
$$ -45402 53474 -5766 179918 115540 109621 -155490 50299 -131504 -117397 -148857 19398
10226a53348B0849c9191j73488R9972K8331J3370j02262A3847c71602a47866C9744
$$ -153348 20849 -39191 -212679 -112707 -84376 -71006 -173268 13847 -371602 -147866 39744
10214A45725c06230D9465b27503h0210A20611B4321J20930b74318m9367J2897
$$ 145725 -306230 49465 -227503 -80210 120611 24321 145251 -274318 -323685 -310788
10204c10788a3824l5791j29693B40159b15940Q0581d6318C5323f1887B67398i423
$$ -310788 -13824 -49615 -179308 240159 -215940 -135359 -46318 35323 -61887 267398 -9423
10192c05828a40873B90053B7833J45135C7517J32256d45815b22106c7355Q003
$$ -305828 -140873 290053 27833 172968 37517 169773 -445815 -222106 -37355 -29352
10182b9352B18071A07590k9402d66016b13186b7980o2885G6842d20307a37275
$$ -29352 218071 107590 78188 -466016 -213186 -27980 -90865 76842 -420307 -137275
10171a25286C2545R1573a92910C4536O6517l6779J7426k0894J0054a52115A29271
$$ -125286 32545 124118 -192910 34536 101053 64274 81700 60806 70860 -152115 129271
10159C35061c8228j7176j7362l4182j58033G8006C7979d0823E2434j6591d8623
$$ 335061 -38228 -55404 -72766 -106948 -264981 78006 37979 -40823 52434 35843 -48623
10147a09430j62512P0899q6983P7812Q9181A10795b31642h1663H9936c91840B50295
$$ -109430 -271942 -201043 -288026 -210214 -121033 110795 -231642 -81663 89936 -391840 250295
10135a39772h593k28774H9457L1534d39396a08730M0073n2222B12639o2620i5767
$$ -139772 -8593 -237367 89457 120991 -439396 -108730 -68657 -120879 212639 150019 -95767
10123A61680d81816b29191A39705J529l780j0178a84617L0541k7245d2265l1852
$$ 161680 -481816 -229191 139705 141234 137454 127276 -184617 -154076 -181321 -42265 -74117
10112g4117A40791N4930a67403b8008A68199L5351c6956A8939L4286J54959H1914
$$ -74117 140791 195721 -167403 -28008 168199 203550 -36956 18939 53225 208184 81914
10100G1815c9329q4576J6013B12628n5806m8221j539b11314R5380A67986L2031
$$ 71815 -39329 -123905 -107892 212628 156822 108601 107062 -211314 -115934 167986 200017
10089B00017i2488j6488A21585a31328B02378b07790D9300J83437m4412a58079
$$ 200017 -92488 -108976 121585 -131328 202378 -207790 49300 232737 188325 -158079
10078B06991c18790e129j04873e80B059g0287a8164k09479P4140g0273A35212
$$ 206991 -318790 -5129 -110002 -580 2059 -70287 -18164 -227643 -153503 -70273 135212
10066i4805A28584b55741k4523g2894I4138a28286C7356J00117a27235A89918
$$ -94805 128584 -255741 -280264 -72894 94138 -128286 37356 137473 -127235 189918
10055c52172f8418q4764l160C5962J62642a58924A7507b54863g936l40330a63035
$$ -352172 -68418 -153182 -156342 35962 198604 -158924 17507 -254863 -7936 -348266 -163035
10043a89987A37354b16026k58906A57287c50152a04482o3150j49298j5011a44369
$$ -189987 137354 -216026 -474932 157287 -350152 -104482 -167632 -316930 -331941 -144369
10032a57339G3085J73559a8171j76363e4768j20979D4224K36552a8068b180o1025
$$ -157339 73085 246644 -18171 -194534 -54768 -175747 44224 280776 -18068 -2180 -63205
10021f3205l1441k84119A52527a55943b0179E052a03770l9443e4415a4129c967
$$ -63205 -94646 -378765 152527 -155943 -20179 5052 -103770 -143213 -54415 -14129 -3967
10009e1298B34613E2148b78251D3681i3672o4537c6112A55471g8739o1490k3130
$$ -51298 234613 52148 -278251 43681 -93672 -158209 -36112 155471 -78739 -140229 -163359
9998a63359d1428c954r4476A49562d141C08286h6354k37514g4162J3758r2276
$$ -163359 -41428 -3954 -98430 149562 -4141 308286 -86354 -323868 -74162 -60404 -152680
9987a52680e9945C1067b51F9134O2105j235i7750q2873o2339B25273a83659d2156
$$ -152680 -59945 31067 -251 69134 131239 130004 -97750 -180623 -242962 225273 -183659 -42156
9974A33945L0421a64479g140A32439c24016i8639j7057j26242J15077p0043j10806
$$ 133945 164366 -164479 -7140 132439 -324016 -98639 -115696 -241938 -126861 -196904 -307710
9963c07710J04569b8572o4430k71823C1154b90863N8725A0124a57603G7879J7889
$$ -307710 -203141 -28572 -93002 -364825 31154 -290863 -232138 10124 -157603 77879 95768
9952I5768c78635a74551A73724c52532A9953a76633O8179F80b85563a4799j00747
$$ 95768 -378635 -174551 173724 -352532 19953 -176633 -108454 680 -285563 -14799 -115546
9941a15546j05887C0930h962l63052A16111K17797j66572d6489j66593I3744a26798
$$ -115546 -221433 30930 -8962 -372014 116111 333908 167336 -46489 -213082 93744 -126798
9929D06982i3336K6468j07123N5334G9704l3636c24345a18635n1185p9571A89969
$$ 406982 -93336 -66868 -173991 -118657 79704 46068 -324345 -118635 -169820 -249391 189969
9917B74660b85446p1832J51643m4530F8057k582B2774Q4953b75285A10855a83721
$$ 274660 -285446 -357278 -205635 -250165 68057 65475 22774 107727 -275285 110855 -183721
9905a7401A87858l0289b14581i1562K9770A10693a26606k36285i4315k6925H5318
$$ -17401 187858 157569 -214581 -91562 -61792 110693 -126606 -362891 -94315 -121240 85318
9893d9800m0188A61409a87433k5391G6540b03719f3088G7702a46134e1203k76852
$$ -49800 -89988 161409 -187433 -212824 76540 -203719 -63088 77702 -146134 -51203 -328055
9882c28055A17246b54788b2622j22691B6584b6561m4674A18740J9984P4043q9952
$$ -328055 117246 -254788 -22622 -145313 26584 -26561 -71235 118740 138724 212767 122815
9871A22815a91137K9218B34775l7488b68765J19658j57p7486m1044B6655K2326
$$ 122815 -191137 -161919 234775 197287 -268765 -149107 -149264 -226750 -267794 26655 48981
9860D8981o772a58444E8018m31J20357a29683C0629K8281Q858a3869m55070I0957
$$ 48981 42209 -158444 58018 57587 177944 -129683 30629 58910 67768 -13869 -468939 90957
9847a22461A87810c3330r8191A9992a54749l1480a5896F5379h9757A19435a51941
$$ -122461 187810 -33330 -131521 19992 -154749 -186229 -15896 65379 -89757 119435 -151941
9835A22675J99117j54567K08027a03685k6589A24876f1699A13667N0675o5632
$$ 122675 321792 167225 375252 -103685 -130274 124876 -61699 113667 164342 98710
9825I8710D3755a76881G221L8202f8882D3926a94791l4749a8167q5985q8402e6241
$$ 98710 43755 -176881 7221 45423 -68882 43926 -194791 -229540 -18167 -104152 -192554 -56241
9812b30893a1299j46158D799h1410J7220A51843b17641G6031d1767c314B675d1317
$$ -230893 -11299 -157457 4799 -81410 -64190 151843 -217641 76031 -41767 -3314 2675 -41317
9799a13892E9614b20004P9881o4972C60375A06159a02145L0795r9563G762M05656
$$ -113892 59614 -220004 -140123 -205095 360375 106159 -102145 -71350 -170913 7762 413418
9788D13418a67516k7634L8139k6006A08380C7626d48777A2858J13955a11736b3692
$$ 413418 -167516 -195150 -157011 -183017 108380 37626 -448777 12858 126813 -111736 -23692
9776A7078a19095A73409b19303A22847c24044I1932k8774b02042e3978j96056
$$ 17078 -119095 173409 -219303 122847 -324044 91932 63158 -202042 -53978 -250034
9766b50034A43927h3141B3640R7486a85313k2967l8290J3352j31368c691m0292
$$ -250034 143927 -83141 23640 121126 -185313 -208280 -246570 -233218 -364586 -3691 -43983
9755d3983k99755R8290R9266L9429j58755d970G0325J57639c2160A63030m2231
$$ -43983 -343738 -245448 -146182 -106753 -265508 -4970 70325 227964 -32160 163030 120799
9744A20799J10193a09929j60302J13296I6802m1754J06603a5011n4065j09667
$$ 120799 230992 -109929 -270231 -156935 96802 55048 161651 -15011 -69076 -178743
9734a78743d2817j57054D5117N6851a25208m6481l02672f2158B94612b35489p6096
$$ -178743 -42817 -199871 45117 101968 -125208 -171689 -474361 -62158 294612 -235489 -311585
9723c11585c2621I7859a4438I1476a05641j24710B33368c082r4445k1401d2807
$$ -311585 -32621 97859 -14438 91476 -105641 -230351 233368 -3082 -97527 -118928 -42807
9711a58444K5476D2830J84550n0228D617O0933i6522d592j83168A06482a13508
$$ -158444 -132968 42830 227380 177152 4617 65550 -96522 -4592 -187760 106482 -113508
9699A41884C5693a61412a3407j27791c5735m0542R783G2624J15792J33971a01769
$$ 141884 35693 -161412 -13407 -141198 -35735 -76277 -66494 72624 188416 322387 -101769
9687A33211C8721c15138a46056q42l0115c5357j71561g831C8651h3897C3215O0624
$$ 133211 38721 -315138 -146056 -146898 -177013 -35357 -206918 -7831 38651 -83897 33215 93839
9675I3839a18258J0098j15890A9062a7478j95026j02188d5974C2941g0377j68029
$$ 93839 -118258 -108160 -224050 19062 -17478 -212504 -314692 -45974 32941 -70377 -238406
9664b38406O9185A73524b21524m7222j49654J66717e20G5497l1261f6174c1000
$$ -238406 -169221 173524 -221524 -268746 -418400 -251683 -520 75497 44236 -66174 -31000
9652i1859C0427b03983e1690J2480C70343I0765b71678I1767c20468G9936i1309
$$ -91859 30427 -203983 -51690 -39210 370343 90765 -271678 91767 -320468 79936 -91309
9640a45725p8799N8457d8953o70G9456Q3217a79116D053a75085L1011M853B68143
$$ -145725 -224524 -166067 -48953 -49623 79456 162673 -179116 4053 -175085 -144074 -139221 268143
9627a68020C4131a07420K7839k3852B27565b05071j74721e9760A31557g6340E935
$$ -168020 34131 -107420 -79581 -103433 227565 -205071 -379792 -59760 131557 -76340 5935
9615b25747D1095a73544f113E8506e0909C6871K11404b01850f9225L3451l61128
$$ -225747 41095 -173544 -6113 58506 -50909 36871 248275 -201850 -69225 -35774 -396902
9604c96902C0624c1075A43134B5356b77660l3077j79247P7652d1874o5513A86901
$$ -396902 30624 -31075 143134 25356 -277660 -310737 -489984 -412332 -41874 -107387 186901
9592a04460k76681A39118M0207c12105B76309a9076j45614h640j05833E72566
$$ -104460 -381141 139118 179325 -312105 276309 -19076 -164690 -8640 -114473 572566
9581c97993K7776D6397a26230E8388Q0448c49968B99789r7794K32633b67534k91433
$$ -397993 -370217 46397 -126230 58388 138836 -349968 299789 201995 434628 -267534 -558967
9570e58967f999o614j15080j5407N4660a8851H3481K70750A19792i4460r1094
$$ -558967 -6999 -13613 -128693 -144100 -89440 -18851 83481 354231 119792 -94460 -185554
9559a85554a34k35189O5186l0115K9853N5861B39442a64169B88032f6881R046
$$ -185554 -134 -235323 -170137 -200252 -170399 -114538 239442 -164169 288032 -66881 -57835
9548e7835m9294b3692j50741h0649j2328D20271c05243A13640b80813N59B91761
$$ -57835 -107129 -23692 -174433 -80649 -92977 420271 -305243 113640 -280813 -280254 291761
9536a12408k2074e353C9176J3700c5887A29947a52014D5788i4111B56664d11159
$$ -112408 -134482 -5353 39176 52876 -35887 129947 -152014 45788 -94111 256664 -411159
9524b69269L8135A05892k3913e3822k64186R9845A33192h2555Q327j39071L731
$$ -269269 -231134 105892 81979 -53822 -318008 -218163 133192 -82555 -74228 -213299 -209568
9513b09568B19547G1253c64829f586l26436a30187A614O3348N4945C9699c50650
$$ -209568 219547 71253 -364829 -6586 -333022 -130187 1614 64962 119907 39699 -350650
9501G5479C140a58234k70136A35802m3484l5405J28753e1016A11604h3177K8610
$$ 75479 3140 -158234 -428370 135802 92318 56913 185666 -51016 111604 -83177 -54567
9490e4567p5359I054K7238a50854j27320c1081m6088c2628a4880B30501c39046
$$ -54567 -129926 9054 36292 -150854 -278174 -31081 -77169 -32628 -14880 230501 -339046
9478H2070Q4064a93633g9004A84299b98288a21601L0643r3465A50322n1855d2963
$$ 82070 166134 -193633 -79004 184299 -298288 -121601 -90958 -184423 150322 98467 -42963
9466a12490m3228b1590j87489B85721I9533g2744A3693J52922b19656A69975a27905
$$ -112490 -155718 -21590 -209079 285721 99533 -72744 13693 166615 -219656 169975 -127905
9454e9683j70570B95a05384B51228a37242n4215A56726a48139n8464j13331a00085
$$ -59683 -230253 295 -105384 251228 -137242 -191457 156726 -148139 -206603 -319934 -100085
9442A71972b84501B47980a75958k8844j02101J02859n1694h4940n9202G9922a1388
$$ 171972 -284501 247980 -175958 -204802 -306903 -204044 -255738 -84940 -144142 79922 -11388
9430c58626H4846a60544J8299l3377E3751b45638o4781m2434a29884k9590H263
$$ -358626 84846 -160544 -142245 -175622 53751 -245638 -310419 -352853 -129884 -159474 8263
9418A60550j8558h0032q3976m59972a32751K7604C8617a67707N5469L9002B2128
$$ 160550 141992 -80032 -164008 -623980 -132751 -105147 38617 -167707 -112238 -73236 22128
9406a87621b3073D0328c23142a13226D9735b21869K5176b7559J003j74275d7217
$$ -187621 -23073 40328 -323142 -113226 49735 -221869 -196693 -27559 -26556 -200831 -47217
9394c41564d1850n3249A32304O6304a18140a9837j78926R4948m7801r0693A16972
$$ -341564 -41850 -95099 132304 198608 -118140 -19837 -198763 -103815 -151616 -242309 116972
9382a93968J1444m3053B68735f7668C26037i65A84915b71545g1939J9309G6406
$$ -193968 -182524 -225577 268735 -67668 326037 -965 184915 -271545 -71939 -52630 76406
9370a43884J3406k04063D3324e4750F1067J58934I9010i8352d0632E8451b26104
$$ -143884 -130478 -334541 43324 -54750 61067 220001 99010 -98352 -40632 58451 -226104
9358d9256J0860E2904e5848j45681Q0069J0663a4570m6119C11064r4474h7977
$$ -49256 -38396 52904 -55848 -201529 -121460 -110797 -14570 -60689 311064 216590 -87977
9346a06390C5286I537b26772L6816K3578g7928l8942F2429a67881m3306r618B97233
$$ -106390 35286 9537 -226772 -189956 -166378 -77928 -116870 62429 -167881 -211187 -220805 297233
9333c18498e5600j78367H943h8432j80424A13484a51591g4986c2414j12494m6045
$$ -318498 -55600 -233967 8943 -88432 -268856 113484 -151591 -74986 -32414 -144908 -190953
9322a90953c5490n557j32356B15989d7887A70419D9570a01858C82107F8152L6358
$$ -190953 -35490 -41047 -173403 215989 -47887 170419 49570 -101858 382107 68152 104510
9311A04510f3661B8666a77573A16045e26819b09773l4595a01029m7020A28681
$$ 104510 -63661 28666 -177573 116045 -526819 -209773 -244368 -101029 -148049 128681
9300F9710b84302A18731a25134k5989n1542j32819a08738k5347B09969C3985M2958
$$ 69710 -284302 118731 -125134 -151123 -202665 -335484 -108738 -134085 209969 33985 76943
9289G6943C7815O4836j6020d4432k35126J33567H2916b9853C45928E7342i9000
$$ 76943 37815 102651 86631 -44432 -279558 -145991 82916 -29853 345928 57342 -99000
9277a57683O0065B08195R33A1871b18327n4909a19981N4669A9497i6733A69436
$$ -157683 -97618 208195 209128 11871 -218327 -273236 -119981 -65312 19497 -96733 169436
9265a5789D5093J85269a98087c5519A8971c0401P574A8647c3877A11305a60132
$$ -15789 45093 230362 -198087 -35519 18971 -30401 -22827 18647 -33877 111305 -160132
9253a88825E7889K1215a27936A25489d0592B9085d5082b863l77038i5121H2235
$$ -188825 57889 79104 -127936 125489 -40592 29085 -45082 -2863 -379901 -95121 82235
9241c37926H8532r873c50558J66507N9432d9044j56273O0214j76454A35510d40518
$$ -337926 88532 78659 -350558 -184051 -124619 -49044 -205317 -145103 -321557 135510 -440518
9229b75749A26920a72084d4529C55346I1276g2749j67038J63B4259b31781E801
$$ -275749 126920 -172084 -44529 355346 91276 -72749 -239787 -239624 24259 -231781 5801
9217a50834n8392G5282a12390j1846k33698A8300i4986I9090J59988e0460C19718
$$ -150834 -209226 75282 -112390 -124236 -357934 18300 -94986 99090 259078 -50460 319718
9205G2413Q2303A8777h1240E2869a28150b5319m7541p0051J1137G4251J42693
$$ 72413 154716 18777 -81240 52869 -128150 -25319 -72860 -142911 -131774 74251 216944
9194B16944h2521k16035A52581a56018C13210D1416K8173K7057p343Q8291a66208
$$ 216944 -82521 -298556 152581 -156018 313210 41416 69589 96646 89303 177594 -166208
9182e74824D0273a09699A71649a98170F6405c91750f9064j18791j13701e9813
$$ -574824 40273 -109699 171649 -198170 66405 -391750 -69064 -187855 -301556 -59813
9171c039H7120c21920Q6781j04735d0524k16082A33772c25912c2109B48461e2988
$$ -3039 87120 -321920 -235139 -339874 -40524 -256606 133772 -325912 -32109 248461 -52988
9159b07608Q8473q1216Q5236k88016B49210a81846A63668k9794f6789j0799G1232
$$ -207608 -119135 -200351 -115115 -403131 249210 -181846 163668 133874 -66789 -77588 71232
9147c0533j49474F4836a18871j91107J23995A70716k1169L41034b54528f8513
$$ -30533 -180007 64836 -118871 -309978 -185983 170716 149547 490581 -254528 -68513
9136a54064j15086p4023B59355A16358a32524E4759K0935J4425b50302M3574l6374
$$ -154064 -269150 -343173 259355 116358 -132524 54759 75694 90119 -250302 -206728 -243102
9125b43102J04132G9388e2259k6635j52802C6223a15883O654a9715i185j22325
$$ -243102 -138970 79388 -52259 -78894 -231696 36223 -115883 -109229 -19715 -9185 -131510
9114a31510B22025r7021c17445a3164j02554e3416j16373O8945h541q6010B08679
$$ -131510 222025 125004 -317445 -13164 -115718 -53416 -169789 -100844 -8541 -94551 208679
9102b90833J38623M3247j36480h8599b3480j12624B22822H5397b14449J2656R4863
$$ -290833 -152210 -108963 -245443 -88599 -23480 -136104 222822 85397 -214449 -201793 -106930
9091a06930A08796a74883A50419i3132r7321P8190k53484e9201p8586e5278A40278
$$ -106930 108796 -174883 150419 -93132 -190453 -112263 -365747 -59201 -137787 -55278 140278
9079c40761E9033P5818D129P1064c7957o0633A57888J89270b7131p4566k44534
$$ -340761 59033 134851 4129 75193 -37957 -98590 157888 347158 -27131 -101697 -346231
9068c46231f140E6788b42010j96229b17650N1482O1365j37042H6992a54647p2172
$$ -346231 -6140 56788 -242010 -438239 -217650 -166168 -104803 -241845 86992 -154647 -226819
9057b26819P8727A05034h3375A81236a57117k028f0694k22431B6202b41060A70209
$$ -226819 -148092 105034 -83375 181236 -157117 -159145 -60694 -283125 26202 -241060 170209
9045b25496A14697a68635j35014a8712k51027J4245J13287k51192i1542D5517
$$ -225496 114697 -168635 -303649 -18712 -269739 -255494 -142207 -393399 -91542 45517
9034D7735N2366Q9501G9901Q350A1642J86863a05024B4438J30879H249a90970
$$ 47735 100101 189602 79901 88251 11642 198505 -105024 24438 155317 8249 -190970
9022b05645K4286f1965F9354J4371g1732B36804h1466B61848g2465j65965D4855
$$ -205645 -181359 -61965 69354 83725 -71732 236804 -81466 261848 -72465 -238430 44855
9010E7322e3249r5216g1825k23094h5948i986q4596j66171i2335k30209F2675
$$ 57322 -53249 -148465 -71825 -294919 -85948 -9986 -94582 -260753 -92335 -322544 62675
8998A1560Q9470a35488k60039A34295a44175l1273k9287A00079b5667A77812b49756
$$ 11560 101030 -135488 -395527 134295 -144175 -175448 -204735 100079 -25667 177812 -249756
8986a27677l2242A45652j1254b43401Q7464M8735j39404j01648a41697j45967
$$ -127677 -159919 145652 134398 -243401 -155937 -107202 -246606 -348254 -141697 -287664
8976b87664R0653M2382f2714A65781h4665L1312k40256C63599g6802j78933E3140
$$ -287664 -197011 -154629 -62714 165781 -84665 -53353 -293609 363599 -76802 -255735 53140
8964d28798a17699o9305i2712C5265f3971C14541a49353d0185P09m05205a83651
$$ -428798 -117699 -187004 -92712 35265 -63971 314541 -149353 -40185 -39476 -444681 -183651
8952B53089I263c0753A90383b22542C96142j81593F8121b80385a05483A46544
$$ 253089 9263 -30753 190383 -222542 396142 214549 68121 -280385 -105483 146544
8941c28590A57527a02358H5982c18480C88206j10974K64025h3099L7943m9692
$$ -328590 157527 -102358 85982 -318480 388206 277232 541257 -83099 -45156 -94848
8931i4848M1566A13222M0023a17435A35567f826E85740P59985K942549J0495799
$$ -94848 -53282 113222 153245 -117435 135567 -6826 585740 1345725 4288274 14784073
8921A4784073n316670B414947H02890D00746J64621G0619a8546j03916j9556H1109
$$ 14784073 9467403 2414947 802890 400746 565367 70619 -18546 -122462 -142018 81109
8910D5467K53223n9041l4756j454a8895E5025h2228C5048J78971D4609a69749
$$ 45467 298690 239649 204893 203439 -18895 55025 -82228 35048 214019 44609 -169749
8898F7793d9j2855D06526F4221a78530A22428d2985m57140A12484a74087k98352
$$ 67793 -49 -12904 406526 64221 -178530 122428 -42985 -500125 112484 -174087 -472439
8887d72439c3095E2166O342L6620c36677C58758c04707a45344a5459m3010A75332
$$ -472439 -33095 52166 58508 95128 -336677 358758 -304707 -145344 -15459 -58469 175332
8875B6446Q2953a63718j81515A19838a05677j33348j9459J03157A36592f0019
$$ 26446 109399 -163718 -345233 119838 -105677 -239025 -258484 -155327 136592 -60019
8864a78963A22132a53036k68521F589e3836A46134b08548k2266h5094j8923C9737
$$ -178963 122132 -153036 -421557 6589 -53836 146134 -208548 -230814 -85094 -104017 39737
$$ [...]
##END NTUPLES=NMR SPECTRUM
##END=
