##TITLE=AC1571_ROEFFECT0021_8270940_PfGW3nuCP6
##JCAMPDX= 6.0         $$ Bruker NMR JCAMP-DX V2.0
##DATA TYPE= NMR SPECTRUM
##DATA CLASS= NTUPLES
##ORIGIN= BRUKER
##OWNER= Administrator
$$ 1.72 TOPSPIN		Version 2.1
$$ 2013-10-18 18:58:48.548 -0700  Administrator@X
$$ Compression mode = diff/dup
##.OBSERVE FREQUENCY= 400.02188249412
##.OBSERVE NUCLEUS= ^1H
##.ACQUISITION MODE= SIMULTANEOUS (DQD)
##.ACQUISITION SCHEME= undefined
##.AVERAGES= 64
##.DIGITISER RES= 22
##SPECTROMETER/DATA SYSTEM= spect
##.PULSE SEQUENCE= noesygpps1d.comp
##.SOLVENT NAME= COFFEE_meoh
##.SHIFT REFERENCE= INTERNAL, COFFEE_meoh, 1, 14.96073
##AUDIT TRAIL= $$ (NUMBER, WHEN, WHO, WHERE, PROCESS, VERSION, WHAT)
$$ ##TITLE= Audit trail, TOPSPIN		Version 2.1
$$ ##JCAMPDX= 5.01
$$ ##ORIGIN= Bruker BioSpin GmbH
$$ ##OWNER= Administrator
$$ $$ E:\/data/COFFEE/nmr/AC1571_ROEFFECT0021_8270940_PfGW3nuCP6/12/pdata/1/auditp.txt
$$ ##AUDIT TRAIL=  $$ (NUMBER, WHEN, WHO, WHERE, PROCESS, VERSION, WHAT)
(   1,<2013-10-18 18:58:43.704 -0700>,<Administrator>,<X>,<go>,<TOPSPIN 2.1>,
      <created by zg
	started at 2013-10-18 18:47:14.669 -0700,
	POWCHK enabled, PULCHK disabled,
       configuration hash MD5:
       C8 4E 4E 5D D3 5C D8 9E 9F 52 82 E0 59 8A DE 15
       data hash MD5: 64K
       EB 32 BE 43 9B 98 EC 7C 4F 9F 46 6E D7 B0 CD 9F>)
(   2,<2013-10-18 18:58:46.735 -0700>,<Administrator>,<X>,<proc1d>,<TOPSPIN 2.1>,
      <Start of raw data processing
       efp LB = 0.3 FT_mod = 6 PKNL = 1 PHC0 = 0 PHC1 = 0 SI = 128K 
       data hash MD5: 128K
       10 11 84 67 16 A4 14 F1 B2 A5 3D 6D 16 F9 EC 4C>)
(   3,<2013-10-18 18:58:47.642 -0700>,<Administrator>,<X>,<proc1d>,<TOPSPIN 2.1>,
      <pk PHC0 = -83.90259 PHC1 = 0 
       data hash MD5: 128K
       9A 02 18 29 9B C3 4F 4E 1E 57 6D 77 AD C2 A7 B5>)
(   4,<2013-10-18 18:58:48.032 -0700>,<Administrator>,<X>,<proc1d>,<TOPSPIN 2.1>,
      <abs ABSG = 1 
       data hash MD5: 128K
       24 D5 21 51 B1 47 E2 63 29 21 F7 9F D9 B7 CE 16>)
(   5,<2013-10-18 18:58:48.126 -0700>,<Administrator>,<X>,<proc1d>,<TOPSPIN 2.1>,
      <abs ABSG = 2 
       data hash MD5: 128K
       2C 91 0D BC 25 32 17 8F 0A CF 52 2C 53 46 04 40>)
(   6,<2013-10-18 18:58:48.188 -0700>,<Administrator>,<X>,<proc1d>,<TOPSPIN 2.1>,
      <abs ABSG = 3 
       data hash MD5: 128K
       D7 AF 2A 09 99 20 D9 EC 73 DB 52 7B EF B9 5C B6>)
(   7,<2013-10-18 18:58:48.251 -0700>,<Administrator>,<X>,<proc1d>,<TOPSPIN 2.1>,
      <abs ABSG = 4 
       data hash MD5: 128K
       67 2A 88 B8 FC D7 9F 66 FD 8E 00 99 60 25 A6 69>)
(   8,<2013-10-18 18:58:48.345 -0700>,<Administrator>,<X>,<proc1d>,<TOPSPIN 2.1>,
      <abs ABSG = 5 
       data hash MD5: 128K
       27 47 D2 95 95 A7 DA 32 A4 BD F4 32 46 04 B4 43>)
$$ ##END=
$$ 
$$ $$ hash MD5
$$ $$ 2E 23 EF 7F F0 52 B6 2C C5 AD BE C5 34 65 19 B0
##$RELAX= 
##$RELAX= 
##$RELAX= 
##$RELAX= 
##$RELAX= 
##$RELAX= 
##$RELAX= 
##$RELAX= 
$$ Bruker specific parameters
$$ --------------------------
##$DU= <E:\>
##$EXPNO= 12
$$ [...]
##$TP07= 0
##$TPNAME0= <>
##$TPNAME1= <>
##$TPNAME2= <>
##$TPNAME3= <>
##$TPNAME4= <>
##$TPNAME5= <>
##$TPNAME6= <>
##$TPNAME7= <>
##$TPOAL= (0..7)
0.5 0.5 0.5 0.5 0.5 0.5 0.5 0.5
##$TPOFFS= (0..7)
0 0 0 0 0 0 0 0
##$TUNHIN= 0
##$TUNHOUT= 0
##$TUNXOUT= 0
##$USERA1= <user>
##$USERA2= <user>
##$USERA3= <user>
##$USERA4= <user>
##$USERA5= <user>
##$V9= 5
##$VALIST= <valist>
##$VCLIST= <CCCCCCCCCCCCCCC>
##$VD= 0
##$VDLIST= <DDDDDDDDDDDDDDD>
##$VPLIST= <PPPPPPPPPPPPPPP>
##$VTLIST= <TTTTTTTTTTTTTTT>
##$WBST= 1024
##$WBSW= 4
##$XGAIN= (0..3)
0 0 0 0
##$XL= 0
##$YL= 0
##$YMAX_a= 6281736
##$YMIN_a= -13316033
##$ZGOPTNS= <>
##$ZL1= 120
##$ZL2= 120
##$ZL3= 120
##$ZL4= 120
##$ABSF1= 14.96073
##$ABSF2= -5.597452
##$ABSG= 5
##$ABSL= 3
##$ALPHA= 0
##$AQORDER= 0
##$ASSFAC= 0
##$ASSFACI= 0
##$ASSFACX= 0
##$ASSWID= 0
##$AUNMP= <proc_prof1d_extract.lims>
##$AXLEFT= 0
##$AXNAME= <>
##$AXNUC= <1H>
##$AXRIGHT= 0
##$AXTYPE= 0
##$AXUNIT= <>
##$AZFE= 0.1
##$AZFW= 0.1
##$BCFW= 0
##$BC_mod= 0
##$BYTORDP= 0
##$COROFFS= 0
##$CY= 15
##$DATMOD= 1
##$DC= 0
##$DFILT= <>
##$DTYPP= 0
##$F1P= 0
##$F2P= 0
##$FCOR= 0.5
##$FTSIZE= 131072
##$FT_mod= 6
##$GAMMA= 0
##$GB= 0
##$INTBC= 1
##$INTSCL= 1
##$ISEN= 128
##$LB= 0.3
##$LEV0= 0
##$LPBIN= 0
##$MAXI= 10000
##$MC2= 0
##$MEAN= 0
##$ME_mod= 0
##$MI= 0
##$NCOEF= 0
##$NC_proc= -2
##$NLEV= 6
##$NOISF1= 0
##$NOISF2= 0
##$NSP= 0
##$NTH_PI= 0
##$NZP= 0
##$OFFSET= 14.96073
##$PC= 1
##$PHC0= -83.90259
##$PHC1= 0
##$PH_mod= 1
##$PKNL= yes
##$PPARMOD= 0
##$PPDIAG= 0
##$PPIPTYP= 0
##$PPMPNUM= 2147483647
##$PPRESOL= 1
##$PSCAL= 4
##$PSIGN= 0
##$PYNMP= <proc.py>
##$REVERSE= no
##$SF= 400.020009746532
##$SI= 131072
##$SIGF1= 0
##$SIGF2= 0
##$SINO= 400
##$SIOLD= 131072
##$SPECTYP= <>
##$SREGLST= <1H.CDCl3>
##$SSB= 0
##$STSI= 131072
##$STSR= 0
##$SW_p= 8223.68421052631
##$SYMM= 0
##$S_DEV= 0
##$TDeff= 65536
##$TDoff= 0
##$TI= <>
##$TILT= no
##$TM1= 0
##$TM2= 0
##$TOPLEV= 0
##$USERP1= <user>
##$USERP2= <user>
##$USERP3= <user>
##$USERP4= <user>
##$USERP5= <user>
##$WDW= 1
##$XDIM= 131072
##$YMAX_p= 434330073
##$YMIN_p= -11969
##$CURPLOT= <Network HP LaserJet P1505>
##$CURPRIN= <$Network HP LaserJet P1505>
##$DFORMAT= <normdp>
##$LAYOUT= <+/1D_H.xwp>
##$LFORMAT= <normlp>
##$PFORMAT= <normpl>
##$SURQMSG= 1
$$ End of Bruker specific parameters
$$ ---------------------------------
##NTUPLES= NMR SPECTRUM
##VAR_NAME=  FREQUENCY,     SPECTRUM/REAL,   SPECTRUM/IMAG
##SYMBOL=    X,             R,               I
##VAR_TYPE=  INDEPENDENT,   DEPENDENT,       DEPENDENT
##VAR_FORM=  AFFN,          ASDF,            ASDF
##VAR_DIM=   131072,        131072,          131072
##UNITS=     HZ,            ARBITRARY UNITS, ARBITRARY UNITS
##FACTOR=    0.0627417313425164, 1,          1
##FIRST=     8223.62146879497, 1477,         -64628
##LAST=      0,             3606,            -64308
##MIN=       0,             -11969,          0
##MAX=       8223.62146879497, 434330073,    0
$$ Real data points
##PAGE= N=1
##DATA TABLE= (X++(R..R)), XYDATA
$$ [...]
63807D30824r806r097q420p723o745n492m538m405m821n045m916n002n667o417
63793C42730o488n787m934m451m264l999l536l100k911k870k666k136j470j070
63779B93048j185j639j942j773j393j398j945k413k125j228n06l79n18n42n70
63764B73492q15j066r91o77m82m89n48o23p06n33K7M03k22j715k818k478r96M92
63746B59255J314J663J925K129K022J471O91J75L17R73J526J578J451J745K535
63731B80770L257L370K852K086J505J468K182L485M837N704O002O031N998N776
63717C35323N170M339L671L249K676J603K50q70j630k330l098l661l831l806l699
63702C33356l199k087q28j74k59n31n56k97L09J493L036M116M193L754L666M029
$$ y = [430824, 421018, 411921, 403501, 395778, 389033, 383541, 379003, 374598, 369777, 364732, 359816, 354814, 349147, 342730, 336242, 330455, 325521, 321070, 316806, 312807, 309271, 306171, 303260, 300390, 297724, 295588, 294118, 293048, 291863, 290224, 288282, 286509, 285116, 283718, 281773, 279360, 277235, 276007, 275501, 275122, 274604, 274062, 273492, 272677, 271611, 270620, 269943, 269461, 268972, 268424, 267801, 267095, 266562, 266589, 266992, 266770, 265055, 262237, 259759, 258763, 259255, 260569, 262232, 264157, 266286, 268308, 269779, 270470, 270645, 270962, 271935, 273461, 275039, 276490, 278235, 280770, 284027, 287397, 290249, 292335, 293840, 295308, 297490, 300975, 305812, 311516, 317518, 323549, 329547, 335323, 340493, 344832, 348503, 351752, 354428, 356031, 356281, 355411, 353781, 351451, 348353, 344692, 340861, 337055, 333356, 330157, 328070, 327242, 327068, 326809, 326278, 325722, 325425, 325734, 327227, 330263, 334379, 338572, 342326, 345992, 350021]
63686C50021M180L740L093K666K235J327P4p45n86K37R19J032Q32P34P63P01O47
63669C71870R87J800K585K790K426J888J440J157J151J337J116j27k039l431l683
63654C81267l514l945m894n408n054m309l656k998k169j434j073q64m27K26Q45
63639C42593J515K542L824M719M820M519M609N309O022O105N684N491N840O188
63625D09780N904N203M912N453O466P376P907Q005P899Q349J0217J3350J6430
63612E17251J8431J9772K1542K3968K6387K8430L0373L2372L4050L4949L4733
63601H22258L2837K8680K2556J5770R579M289m10m605p912r747r763q425p147
63588H87960p318r042j1308j3542j6223j9712k3294k5977k7589k8382k8149k6484
$$ y = [350021, 354201, 357941, 361034, 363700, 365935, 367262, 367336, 366591, 366005, 366242, 367161, 368193, 369025, 369759, 370522, 371223, 371870, 372857, 374657, 377242, 380032, 382458, 384346, 385786, 386943, 388094, 389431, 390547, 390420, 388381, 384950, 381267, 377753, 373808, 368914, 363506, 358452, 354143, 350487, 347489, 345320, 343886, 342813, 341949, 341522, 341748, 342593, 344108, 346650, 350474, 355193, 360013, 364532, 369141, 374450, 380472, 386577, 392261, 397752, 403592, 409780, 415684, 420887, 425799, 431252, 437718, 445094, 453001, 461006, 468905, 477254, 487471, 500821, 517251, 535682, 555454, 576996, 600964, 627351, 655781, 686154, 718526, 752576, 787525, 822258, 855095, 883775, 906331, 922101, 931680, 935969, 935559, 930954, 923042, 913295, 903532, 895107, 887960, 880642, 871600, 860292, 846750, 830527, 810815, 787521, 761544, 733955, 705573, 677424, 650940]
63576F50940k3677k0550j7640j5097j3076j1509r675o824l214O7K271L388L620
63563E39024L260L064L817N352O655P138P163P197P209P233P832R540J2275J5719
63549F42478J9780K4398K9285L4327L9873M6219N2900N8523O1029N8278M9259
63538A116349L5257J9361M479p838j6751k1466k1956j9616j6297j3016j0171q474
63526A039861q659j0645j3863j8247k3878k9753l4036l5868l6092l5888l5487
63515G57445l4522l2869l0524k7298k3373j9811j7732j7089j6747j5778j4245
63504E07457j2689j1368j0214r186q359p738p244o853o610o404n997n332m723
63491D04740m451m312l843k971k104j492r37k78L06P19J335K395L465L979M152
$$ y = [650940, 627263, 606713, 589073, 573976, 560900, 549391, 539716, 532892, 529678, 529745, 532016, 535404, 539024, 542284, 545348, 549165, 554517, 561172, 568310, 575473, 582670, 589879, 597112, 604944, 614484, 626759, 642478, 662258, 686656, 715941, 750268, 790141, 836360, 889260, 947783, 1008812, 1067090, 1116349, 1151606, 1170967, 1175446, 1167608, 1150857, 1129391, 1107435, 1087819, 1071522, 1058506, 1048335, 1039861, 1031202, 1020557, 1006694, 988447, 964569, 934816, 900780, 864912, 828820, 792932, 757445, 722923, 690054, 659530, 632232, 608859, 589048, 571316, 554227, 537480, 521702, 507457, 494768, 483400, 473186, 464000, 455641, 447903, 440659, 433806, 427196, 420792, 414795, 409463, 404740, 400289, 395977, 392134, 389163, 387059, 385567, 384630, 384352, 384658, 385377, 386712, 389107, 392572, 396551, 400703]
63476D00703M704N759O606O589N720M346K731J146p5q30j315j717k084k477k829
63461D26977k684j675k83M69L02qJ57L59J0n11l59M78J128J110R76J558K991M642
63443D35637N810O375O836P681Q843J0046J1648J4618J9403K5293L1338L7440
63431F20968M3741M9210N1557M8833M0855K9224J6503N229l058q223j0808j0938
63419H73093q295l036L897J1490J9124K6209L1991L6026L8279L8480L5938L0478
63407A133674K3020J4764O335j668p873j0980j1307j0566j0009r697r709j0983
63395A095001j4296j9159k4450k9651l4641l8676m0662m0450l9027l7190l4877
63384G41922l2010k9145k6696k4203k1144j7934j5381j3366j1079q352n861l846
$$ y = [400703, 405407, 411166, 417772, 424361, 430081, 434427, 437158, 438304, 438229, 437399, 436084, 434367, 432283, 429806, 426977, 424293, 422618, 422335, 422804, 423106, 423098, 423255, 423614, 423624, 423113, 422754, 423232, 424360, 425470, 426446, 428004, 430995, 435637, 441447, 447822, 454658, 462339, 471182, 481228, 492876, 507494, 526897, 552190, 583528, 620968, 664709, 713919, 765476, 814309, 855164, 884388, 900891, 906120, 903062, 894839, 884031, 873093, 864798, 861762, 865659, 877149, 896273, 922482, 954473, 990499, 1028778, 1067258, 1103196, 1133674, 1156694, 1171458, 1177793, 1176125, 1168252, 1157272, 1145965, 1135399, 1125390, 1115693, 1105984, 1095001, 1080705, 1061546, 1037096, 1007445, 972804, 934128, 893466, 853016, 813989, 776799, 741922, 709912, 680767, 654071, 629868, 608724, 590790, 575409, 562043, 550964, 542612, 536751, 532905]
63372E32905j676R47L267M558N280O394Q105R971J1937J4285J6817J9008K1083
63359F52881K3993K8058L2321L5692L8142M0336M2603M4666M5999M5890M3494
63348A074075L8432L1334K3363J5284P381R6n777r676j1624j1913j0896r386q824
63335A121869j0442j4177j8775k3072k6965l0918l4800l7653l8621l7721l5497
63324H13228l2311k8342k3997j9682j5126r551k836L705P974Q345M369l227j2726
63311F89823k1864k8652l2062l2122k9627k5849k2067j8895j6180j3670j1524
63300D37311r893q464o909n538m841m637m249l498k856k600k431k110j858j884
63286C75543k053k221k389k338j715p84m60j117j959k128j903k049k437k192j060
$$ y = [532905, 531229, 532176, 535443, 540001, 545281, 551675, 559780, 569751, 581688, 595973, 612790, 631798, 652881, 676874, 704932, 737253, 772945, 811087, 851423, 894026, 938692, 984691, 1030581, 1074075, 1112507, 1143841, 1167204, 1182488, 1189869, 1189965, 1184188, 1174512, 1162888, 1150975, 1140079, 1130693, 1121869, 1111427, 1097250, 1078475, 1055403, 1028438, 997520, 962720, 925067, 886446, 848725, 813228, 780917, 752575, 728578, 708896, 693770, 684219, 681383, 685088, 693062, 701407, 705776, 702549, 689823, 667959, 639307, 607245, 575123, 545496, 519647, 497580, 478685, 462505, 448835, 437311, 427418, 418954, 412045, 406507, 401666, 397029, 392780, 389282, 386426, 383826, 381395, 379285, 377427, 375543, 373490, 371269, 368880, 366542, 364827, 364043, 363583, 362466, 360507, 358379, 356476, 354427, 351990, 349798, 348738]
63271C48738K11R16J075R77P63O29Q69J364J626J562J775K713L950M671M591M031
63255C80461L407L026L182M015N276O502P348P643P355O759O467O874P689Q277
63241D64281Q505Q945J0185J2207J4452J6343J7664J8590J9419K0331K1330K2363
63229F54615K3341K4058K4372K4457K4654K4920K4761K3980K3216K3285K4234
63218I19893K5339K6026K6363K6704K7150K7391K6799K4753K1223J6872J2262
63207A180775P035M53p299j4979k1517k6810l1088l4225l6077l6918l6987l5998
63195I06365l3710l0594k7312k3799j9544j4696j0143o455l421o25K130N148Q805
63182G52149J2758J5860J7416J8130J9242K0996K2504K2964K2434K1451K0444
$$ y = [348738, 348949, 349865, 350940, 351917, 352680, 353309, 354178, 355542, 357168, 358730, 360505, 363218, 367168, 371839, 376430, 380461, 383868, 386894, 390076, 394091, 399367, 405869, 413217, 420860, 428215, 434974, 441441, 448315, 456004, 464281, 472786, 481731, 491916, 504123, 518575, 534918, 552582, 571172, 590591, 610922, 632252, 654615, 677956, 702014, 726386, 750843, 775497, 800417, 825178, 849158, 872374, 895659, 919893, 945232, 971258, 997621, 1024325, 1051475, 1078866, 1105665, 1130418, 1151641, 1168513, 1180775, 1187810, 1188263, 1180964, 1165985, 1144468, 1117658, 1086570, 1052345, 1016268, 979350, 942363, 906365, 872655, 842061, 814749, 790950, 771406, 756710, 746567, 740112, 736691, 736066, 738196, 743344, 752149, 764907, 780767, 798183, 816313, 835555, 856551, 879055, 902019, 924453, 945904, 966348]
63171I66348J9572J8706J7485J5749J3951J2695J1715R821O154J184l934q705
63159A080741j3474j8499k3377k7569l1003l3794l5718l6315l5570l4077l2453
63148G58892l0741k8595k5862k2792j9742j6886j4309j2137j0399q832p035m908
63136E56654k836j439j069j497k042k106j717j514k026l042l793l757l085k255
63122E24476j499o60N09K011L429M121L783K889K293K370K744K996L193L526L766
63107E59947L566L084K831K885K779K185J360Q25Q62J396K084K531K667K959L833
63092E95794M934N381M893M133L745L516K893J819O20o35k031l244l641l039j891
63077F13247o99M19J514K542L448M290N152O082P139Q313R406J0196J0766J1490
$$ y = [966348, 985920, 1004626, 1022111, 1037860, 1051811, 1064506, 1076221, 1086042, 1092196, 1093380, 1089446, 1080741, 1067267, 1048768, 1025391, 997822, 966819, 933025, 897307, 860992, 825422, 791345, 758892, 728151, 699556, 673694, 650902, 631160, 614274, 599965, 587828, 577429, 568597, 561562, 556654, 553818, 552379, 551310, 549813, 547771, 545665, 543948, 542434, 540408, 537366, 533573, 529816, 526731, 524476, 522977, 522317, 522826, 524837, 528266, 532387, 536170, 539059, 541352, 543722, 546466, 549462, 552655, 556181, 559947, 563513, 566597, 569428, 572313, 575092, 577277, 578637, 579462, 580324, 581720, 583804, 586335, 589002, 591961, 595794, 600728, 606109, 611002, 615135, 618880, 622396, 625289, 627108, 627728, 627093, 625062, 621818, 618177, 615138, 613247, 612548, 612967, 614481, 617023, 620471, 624761, 629913, 635995, 643134, 651447, 660853, 671049, 681815, 693305]
63063F93305J2701J4411J6372J8268J9941K1651K3891K6853L0158L3381L6611
63052I47543M0183M4017M7719N1200N4707N8152O0976O2784O3771O4289O4482
63041A559823O4458O4469O4575O4504O4202O4181O5019O6608O8227O9125O8864
63030B284055O7180O3810N8321N0052L8497K4003P874q493k4428l9766n4145o6879
63018B400081p7421q5519r0940r3385r2746q9310q3709p6772o9224o1311n2803
63007A526941m3573l4029k4826j6299q417j044N968J2705J8793K3436K6280K8053
62995A513988K9743L1308L1896L1338L0594L0501L0774L0792L0699L0974L1281
62984A853888L0532K8137K4431J9760J3780O090k884j2199k1451l0946m0728m9895
$$ y = [693305, 706006, 720417, 736789, 755057, 774998, 796649, 820540, 847393, 877551, 910932, 947543, 987726, 1031743, 1079462, 1130662, 1185369, 1243521, 1304497, 1367281, 1431052, 1495341, 1559823, 1624281, 1688750, 1753325, 1817829, 1882031, 1946212, 2011231, 2077839, 2146066, 2215191, 2284055, 2351235, 2415045, 2473366, 2523418, 2561915, 2585918, 2593792, 2585299, 2560871, 2521105, 2466960, 2400081, 2322660, 2237141, 2146201, 2052816, 1960070, 1870760, 1787051, 1710279, 1641055, 1579744, 1526941, 1483368, 1449339, 1424513, 1408214, 1399797, 1398753, 1404721, 1417426, 1436219, 1459655, 1485935, 1513988, 1543731, 1575039, 1606935, 1638273, 1668867, 1699368, 1730142, 1760934, 1791633, 1822607, 1853888, 1884420, 1912557, 1936988, 1956748, 1970528, 1976618, 1973734, 1961535, 1940084, 1909138, 1868410, 1818515]
62972A818515n7200o2125o5079o6669o7113o6296o4065o0389n5566n0388m5746
62961A157879m1921l8437l4904l1665k9313k7789k6375k4558k2536k0876j9967
62950H39538j9775j9845j9510j8401j6881j5679j5077j4648j3895j2885j2046
62939F60896j1564j1182j0551r645q709p864o837n321l536k130j344o77L21J324
62925E83181J716J522J137M19j112l075m213l952l220l128l457l251k442j974
62911E58151k329k773k361j198l09m28j274k035k362k655l265l732l268j911n81
62896E27670J96R73K370L897M498L843K435O59j365l072l573k808j790j350j160
62881E31423m55P43J730K012J664R68L17K18Q70J640J477K1j998l556m230m192
$$ y = [1818515, 1761315, 1699190, 1634111, 1567442, 1500329, 1434033, 1369968, 1309579, 1254013, 1203625, 1157879, 1115958, 1077521, 1042617, 1010952, 981639, 953850, 927475, 902917, 880381, 859505, 839538, 819763, 799918, 780408, 762007, 745126, 729447, 714370, 699722, 685827, 672942, 660896, 649332, 638150, 627599, 617954, 609245, 601381, 594544, 589223, 585687, 583557, 582213, 581536, 581857, 583181, 584897, 586419, 587556, 587975, 586863, 583788, 579575, 575623, 572403, 569275, 565818, 562567, 560125, 558151, 555822, 553049, 550688, 549490, 549181, 548753, 547479, 545444, 543082, 540427, 537162, 533430, 530162, 528251, 527670, 527866, 528839, 531209, 535106, 539604, 543447, 545882, 546541, 545176, 542104, 538531, 535723, 533933, 532583, 531423, 530968, 531711, 533441, 535453, 537117, 538085, 538402, 538620, 539490, 541130, 542607, 542628, 540630, 537074, 532844, 528652]
62865E28652l740l111k605k444k540k624k639k747k841k374j053M76J080N02j94
62850E01798J41J331K171K004J349R57Q46O41L56K88L53J35m41r72j169j204j289
62833E07295j323j103o30j1P11J408J785J707J494J584J994K362K484K527K714
62818E24998L035L355L604L718L566L167K873L106L825M432M381L840L581M109
62804E75590N103N955O587P372Q264Q652Q399Q496R956J2331J4085J4467J4276
62791F99533J4583J5512J6782J8691K1744K5658K9655L3683L8460M4218N0199
62780A008718N5830O1688O8703P6789Q4822R1783R7479J02186J06017J08684J09535
62769A972234J07808J03039R5219Q4475P0792N4380L6181J7553o45j8351l5591
$$ y = [528652, 524912, 521801, 519196, 516752, 514212, 511588, 508949, 506202, 503361, 500987, 499934, 500410, 501490, 501992, 501798, 501939, 503270, 505441, 507445, 508794, 509751, 510597, 511238, 511594, 511882, 512235, 512370, 511929, 510957, 509788, 508584, 507295, 505972, 504869, 504239, 504228, 504939, 506347, 508132, 509839, 511333, 512917, 514911, 517273, 519757, 522284, 524998, 528033, 531388, 534992, 538710, 542276, 545443, 548316, 551422, 555247, 559679, 564060, 567900, 571481, 575590, 580693, 586648, 593235, 600607, 608871, 617523, 625922, 634418, 644374, 656705, 670790, 685257, 699533, 714116, 729628, 746410, 765101, 786845, 812503, 842158, 875841, 914301, 958519, 1008718, 1064548, 1126236, 1194939, 1271728, 1356550, 1448333, 1545812, 1647998, 1754015, 1862699, 1972234, 2080042, 2183081, 2278300, 2362775, 2433567, 2487947, 2524128, 2541681, 2541036, 2522685, 2487094]
62758B487094n1789o6079p8041q7816r5466j00564j02634j01948r9670r7008r4213
62747A511866r0497q5089p8268p1243o4980n9446n4062m8646m3592l9183l5129
62736H41731l1010k6911k3308k0464j8272j6613j5434j4355j2690j0271p899o448
62724F38056n750m905l599k403j689r96J33J301J911K242L170M963P018Q817J0505
62709F58774J2333J4143J5759J7529K0080K3628K7750L1833L5577L9126M2850
62698I39382M6953N1316N5701O0018O4244O8214P1733P4871P7653P9406P8838
62687A668329P5082O8483N9985M9973L8046K3949Q319p569k2576l6145m8165n8650
62675A819061o7468p4290p8792q0899q0857p9045p5808p1492o6574o1631n7025
$$ y = [2487094, 2435305, 2369226, 2291185, 2203369, 2107903, 2007339, 1904705, 1802757, 1703087, 1606079, 1511866, 1421369, 1336280, 1258012, 1186769, 1121789, 1062343, 1008281, 959635, 916043, 876860, 841731, 810721, 783810, 760502, 740038, 721766, 705153, 689719, 675364, 662674, 652403, 644504, 638056, 632306, 627401, 623802, 621399, 619710, 618714, 618847, 620148, 622059, 624301, 627471, 632434, 639452, 648269, 658774, 671107, 685250, 701009, 718538, 738618, 762246, 789996, 821829, 857406, 896532, 939382, 986335, 1037651, 1093352, 1153370, 1217614, 1285828, 1357561, 1432432, 1510085, 1589491, 1668329, 1743411, 1811894, 1871879, 1921852, 1959898, 1983847, 1992166, 1984597, 1962021, 1925876, 1877711, 1819061, 1751593, 1677303, 1598511, 1517612, 1436755, 1357710, 1281902, 1210410, 1143836, 1082205, 1025180]
62664A025180n2701m8315m3696l9130l5186l2177k9805k7363k4358k1041j8252
62653F53156j6544j5498j4191j2377j0838j0280j0307r940q946q031p702p606
62641E20896p172o372n426m295k890j537o07Q8J012K068K523J906N66p57j594
62626D98409j915j962k086k448k814k772k284j659j002p5J092J902J939J677J952
62611D87954K881L763M062M052M360N270O640Q177R602J0740J1735J3019J4864
62598E87119J7115J9527K2239K5584K9527L3616L7580M1627M5881M9764N2258
62587I61837N2905N2211N0933M9075M5832M0458L3023K4225J4691M671n659j5792
62575A308410k4983l2589l8393m2674m5957m8491m9920m9609m7457m4265m1086
$$ y = [1025180, 972479, 924164, 880468, 841338, 806152, 773975, 744170, 716807, 692449, 671408, 653156, 636612, 621114, 606923, 594546, 583708, 573428, 563121, 553181, 544235, 536204, 528502, 520896, 513724, 507352, 501926, 497631, 494741, 493204, 492597, 492685, 493697, 495765, 498288, 500194, 500760, 500003, 498409, 496494, 494532, 492446, 489998, 487184, 484412, 482128, 480469, 479467, 479392, 480484, 482386, 484325, 486002, 487954, 490835, 494598, 498660, 502712, 507072, 512342, 518982, 527159, 536761, 547501, 559236, 572255, 587119, 604234, 623761, 646000, 671584, 701111, 734727, 772307, 813934, 859815, 909579, 961837, 1014742, 1066953, 1117886, 1166961, 1212793, 1253251, 1286274, 1310499, 1325190, 1329861, 1324202, 1308410, 1283427, 1250838, 1212445, 1169771, 1123814, 1075323, 1025403, 975794, 928337, 884072, 842986]
62564H42986l8366l5849l3220l0430k7422k4024k0326j6931j4451j2878j1649
62553E77440j0328q927p671o725o169n975n952n815n433m834l967k706j178J39
62539E01899Q63J126J360J726J962J801J286O20j22r55j680j831j054N07K313
62524E09821M036N860Q058J0326J1944J2693J3282J4634J6930J9744K2872K6540
62512F76740L0711L4761L8183M1216M4293M7078M8516M7967M5830M2880L9278
62501A137453L4531K8287K0860J2909M865l162j0962j7918k3227k6447k7690k7300
62489A102199k5485k2458j8760j5085j1638p879l213K193P468J1919J5583J8816
62477A053660K1558K3148K2853K0462J6414J1459O171O81n156j1402j7831k4116
$$ y = [842986, 804620, 768771, 735551, 705121, 677699, 653675, 633349, 616418, 601967, 589089, 577440, 567112, 558185, 550514, 543789, 537620, 531645, 525693, 519878, 514445, 509611, 505644, 502938, 501760, 501899, 502762, 503888, 505248, 506974, 508936, 510737, 512023, 512643, 512521, 511566, 509886, 508055, 507001, 507508, 509821, 513857, 519717, 527775, 538101, 550045, 562738, 576020, 590654, 607584, 627328, 650200, 676740, 707451, 742212, 780395, 821611, 865904, 912982, 961498, 1009465, 1055295, 1098175, 1137453, 1171984, 1200271, 1221131, 1234040, 1238905, 1235743, 1224781, 1206863, 1183636, 1157189, 1129499, 1102199, 1076714, 1054256, 1035496, 1020411, 1008773, 1000894, 997681, 999874, 1007342, 1019261, 1034844, 1053660, 1075218, 1098366, 1121219, 1141681, 1158095, 1169554, 1175725, 1176406, 1171250, 1159848, 1142017, 1117901]
62465A117901l0054l5508m0162m3463m4954m4683m3208m1226l9127l6907l4330
62454F84279l1173k7361k3122j8966j5416j2634j0401q469o768n201l556j823
62442E19389l79N04J179K171L295L842L721L774M537N303N017L719K314J163k46
62427E59303k224m288n905p143q179q756q656q170p641o926n937n215n293n738
62413D69232n629m844m060l530k782j747j214j676k444k527j939j511j766k488
62399D31075l113l063j990k62J126J661K026L126M678N570N382M702L979L075
62385D57972K101J699K087K648L006L666N006O312O690O396O452P171Q003Q618
62371E27827R329J0296J1135J1534J1693J1979J2484J3188J4164J5508J7306J9738
$$ y = [1117901, 1087847, 1052339, 1012177, 968714, 923760, 879077, 835869, 794643, 755516, 718609, 684279, 653106, 625745, 602623, 583657, 568241, 555607, 545206, 536737, 529969, 524768, 521212, 519389, 519010, 519514, 520693, 522864, 526159, 530001, 533722, 537496, 542033, 547336, 552353, 556072, 558386, 559549, 559303, 557079, 552791, 546886, 539743, 531564, 522808, 514152, 505982, 498341, 491415, 485478, 480263, 474970, 469232, 463603, 458759, 454699, 451169, 448387, 446640, 445426, 443750, 441306, 438779, 436840, 435329, 433563, 431075, 427962, 424899, 422909, 422647, 423773, 425434, 427460, 430586, 435264, 440834, 446216, 450918, 454897, 457972, 460073, 461772, 463859, 466507, 469513, 473179, 478185, 484497, 491187, 497583, 504035, 511206, 519209, 527827, 537156, 547452, 558587, 570121, 581814, 593793, 606277, 619465, 633629, 649137, 666443, 686181]
62359F86181K3012K7117L1883L7208M2984M8835N4203N8623O1692O3005O2445
62348A197188O0219N6197M9557L9944K8727J8255R666K249m995j2094j8708k4909
62336A401296l0727l5637l9237m1864m3856m4714m3736m1171l7996l4779l1497
62325I76082k8284k5609k3668k2232k1167k0673k0840k1400k1950k2238k2247
62314G25774k2146k2007k1460j9973j7727j5751j4689j3940j2585j0760r321q466
62302E36949p605o441n328m444l473k290j249n83j64M5l0jP49J993K596J996J082
62285E13802J081K138L457M390M785M665M101L266K347J564J357K006K970L302
62271E55231L041L356M793O246O512O120O547Q165J0122J2098J4801J8603K2846
$$ y = [686181, 709193, 736310, 768193, 805401, 848385, 897220, 951423, 1010046, 1071738, 1134743, 1197188, 1257407, 1313604, 1363161, 1403105, 1431832, 1450087, 1459753, 1462002, 1457007, 1444913, 1426205, 1401296, 1370569, 1334932, 1295695, 1253831, 1209975, 1165261, 1121525, 1080354, 1042358, 1007579, 976082, 947798, 922189, 898521, 876289, 855122, 834449, 813609, 792209, 770259, 748021, 725774, 703628, 681621, 660161, 640188, 622461, 606710, 592021, 578081, 565496, 554736, 545415, 536949, 529344, 522903, 517575, 513131, 509658, 507368, 506119, 505536, 505372, 505417, 505387, 505386, 506135, 508128, 510724, 512720, 513802, 514883, 517021, 520478, 524868, 529653, 534318, 538419, 541685, 544032, 545596, 546953, 548959, 551929, 555231, 558272, 561628, 566421, 572667, 579179, 585299, 591846, 600011, 610133, 622231, 637032, 655635, 678481]
62258F78481K6960L1352L6644M2676M8789N4589N9909O4368O7444O8753O7871
62247A247836O4211N7559M8567L8396K7889J7333O951k771j1365j8925k6186l3900
62235A415595m2027m9605n5521n9307o1086o1044n9314n6222n2159m7266m1697
62224H30347l6166l1595k8116k4958k1623j8633j6776j6026j5624j4875j3500
62213E92455j1545r450p932p325p169o853o398o130n927n364m485l707k990j914
62199E05266o24J19J27K59J247K650L622M208N137O619Q116R149R718R874R637
62184E75124R427R964J1304J2553J2798J2068J1033R972Q555O459L971J958J357
62171F86543K526M929P678J0503J3969J8550K3828K8940L3635L8357M3389M8260
$$ y = [678481, 705441, 736793, 773437, 816113, 864902, 919491, 979400, 1043768, 1111212, 1179965, 1247836, 1312047, 1369606, 1418173, 1456569, 1484458, 1501791, 1508742, 1505971, 1494606, 1475681, 1449495, 1415595, 1373568, 1323963, 1268442, 1209135, 1148049, 1087005, 1027691, 971469, 919310, 872044, 830347, 794181, 762586, 734470, 709512, 687889, 669256, 652480, 636454, 620830, 605955, 592455, 580910, 571460, 563528, 556203, 549034, 542181, 535783, 529653, 523726, 518362, 513877, 510170, 507180, 505266, 504642, 504761, 504888, 505147, 506394, 509044, 512666, 516874, 522011, 528630, 536746, 545895, 555613, 565487, 575124, 584551, 594515, 605819, 618372, 631170, 643238, 654271, 664243, 672798, 679257, 683228, 685186, 686543, 689069, 693998, 701676, 712179, 726148, 744698, 768526, 797466, 831101, 869458, 912847, 961107]
62159I61107N2010N3681N2609M8742M2881L6253K9660K3204J6933J1225O315J759
62147A336379l116q359j3351j7593k1108k4005k6062k7065k7219k6868k5899k3886
62135A091848k0961j8082j6089j4825j3574j2131j0898r970q885p408n907m532
62123I48586k691L6K964N084O532Q389J1048J3656J5274J5853J5639J4370J1602
62110A066342P429K446k733p477j1042j2932j3270j2511j0916q672o281m451l591
62097I82341l559l786l507k103N01L775P041R793J1573J2001J1224J0012R032
62084A044338Q246P343O465O105O436P248Q393R901J1694J3574J5473J7346J8943
62071A181505K0012K0676K1154K1187K0251J8417J6583J5633J5705J6468J7687
$$ y = [961107, 1013117, 1066798, 1119407, 1168149, 1211030, 1247283, 1276943, 1300147, 1317080, 1328305, 1334620, 1336379, 1333263, 1324904, 1311553, 1293960, 1272852, 1248847, 1222785, 1195720, 1168501, 1141633, 1115734, 1091848, 1070887, 1052805, 1036716, 1021891, 1008317, 996186, 985288, 975318, 966433, 959025, 953118, 948586, 945895, 945931, 948895, 953979, 960511, 968900, 979948, 993604, 1008878, 1024731, 1040370, 1054740, 1066342, 1073771, 1076217, 1073484, 1066007, 1054965, 1042033, 1028763, 1016252, 1005336, 996664, 990383, 985932, 982341, 978782, 974996, 971489, 969386, 969887, 973662, 980703, 990496, 1002069, 1014070, 1025294, 1035306, 1044338, 1052584, 1059927, 1066392, 1072497, 1078933, 1086181, 1094574, 1104475, 1116169, 1129743, 1145216, 1162562, 1181505, 1201517, 1222193, 1243347, 1264534, 1284785, 1303202, 1319785, 1335418, 1351123, 1367591, 1385278]
62060A385278J9230K0742K1681K1767K1142K0008J8201J5308J1351P161L700R80
62048A566549k038o251j1532j7218k3089k9300l5614m1283m5742m8951n1047n2129
62036A202355n2448n2319n1671n0002m7045m3267l9506l6226l3258l0114k6522
62025G39977k2719j9317j6746j4965j3683j2799j2363j2268j2239j2076j1704
62014E79098j1073j0253r474q868q205p182n845m489l248k012o60Q44K387L637
62000E14657M310M712N518O634O940N750L965K937K601J823K47j354k568l864
61986E52308n458o849p792q635r261q889p493o309o119o072n106l625k669k164
61972D65867j284MR75J422J745J922J536Q21N85J011J424J431J366J485J530J330
$$ y = [1385278, 1404508, 1425250, 1446931, 1468698, 1489840, 1509848, 1528049, 1543357, 1554708, 1561869, 1565569, 1566549, 1564511, 1558260, 1546728, 1529510, 1506421, 1477121, 1441507, 1400224, 1354482, 1305531, 1254484, 1202355, 1149907, 1097588, 1045917, 995915, 948870, 905603, 866097, 829871, 796613, 766499, 739977, 717258, 697941, 681195, 666230, 652547, 639748, 627385, 615117, 602878, 590802, 579098, 568025, 557772, 548298, 539430, 531225, 524043, 518198, 513709, 510461, 508449, 507789, 508633, 511020, 514657, 518967, 523679, 529197, 535831, 542771, 548521, 552486, 555423, 558024, 559847, 560094, 558740, 556172, 552308, 546850, 540001, 532209, 523574, 514313, 505424, 497931, 491622, 485503, 479431, 474325, 470700, 468031, 465867, 464583, 464587, 465562, 466984, 468729, 470651, 472187, 473008, 473593, 474604, 476028, 477459, 478825, 480310, 481840, 483170]
61956D83170J053O60j34j023j110r4J190J897K243K901L933M943N948P321R029
61941E21927J0574J1765J2979J4480J5836J6445J6481J6830J7937J9006J8814
61930F93074J7179J5094J3401J1956J0410R031Q063O795M267P15k587m902o567
61917G75929p948q827r053q854q132o307l402m67J741L863O907J0659J3932J6032
61903G76073J7162J7509J6873J5203J2781R729N941J581k772o660j0008j2815
61891H40597j4935j6277j6834j6539j5464j4113j3066j2166j0652q216n655m170
61879F92510m329n794p647q866q930q273p766p532o718m760k458j156j134j405
61865F15742j050j32P29J149J146R97J196K264M259O708R182J1797J4874J8329
$$ y = [483170, 484223, 484883, 484749, 483726, 482616, 482522, 483712, 485609, 487852, 490753, 494686, 499629, 505577, 512898, 521927, 532501, 544266, 557245, 571725, 587561, 604006, 620487, 637317, 655254, 674260, 693074, 710253, 725347, 738748, 750704, 761114, 770145, 778208, 785003, 789270, 789985, 787398, 782496, 775929, 767981, 759154, 750101, 741247, 733115, 726808, 723406, 722939, 724680, 728543, 735450, 746109, 760041, 776073, 793235, 810744, 827617, 842820, 855601, 865330, 871271, 872852, 870080, 863420, 853412, 840597, 825662, 809385, 792551, 776012, 760548, 746435, 733369, 721203, 710551, 702335, 696680, 692510, 688181, 682387, 674740, 665874, 656944, 648671, 640905, 633373, 626655, 621895, 619437, 618281, 617147, 615742, 614692, 614560, 615289, 616438, 617584, 618581, 619777, 622041, 626300, 633008, 642190, 653987, 668861, 687190]
61851F87190K1667K4578K7188K9665L1866L3453L4258L4305L3574L1935K9366
61840A019045K6094K2325J7959J2826P216J823k889o971j0351j2337j2249j0397
61828A052094p820n025j602K745P372J1290J4114J5976J6823J6316J4244J0576
61816A147103N304j308q384j4839k0164k4524k8162l1101l3348l4926l5621l5147
61804H84883l3597l1337k8510k5074k1412j8324j6252j4921j3906j3104j2457
61793F55989j1715j0705r513q264p057o210o028o155n801m822l932l492k924j786
61779E67585o52j51Q1N63P09l11j816k109q44M19L36o00j082o52K21J003J345
61762E64045J017K36l02k29J01L82J011K261L422L536K814K388K713L029K623
$$ y = [687190, 708857, 733435, 760623, 790288, 822154, 855607, 889865, 924170, 957744, 989679, 1019045, 1045139, 1067464, 1085423, 1098249, 1105465, 1107288, 1104399, 1097428, 1087077, 1074740, 1062491, 1052094, 1044274, 1039249, 1037647, 1040392, 1047764, 1059054, 1073168, 1089144, 1105967, 1122283, 1136527, 1147103, 1152407, 1151099, 1142715, 1127876, 1107712, 1083188, 1055026, 1023925, 990577, 955651, 920030, 884883, 851286, 819949, 791439, 766365, 744953, 726629, 710377, 695456, 681550, 668446, 655989, 644274, 633569, 624056, 615792, 608735, 602525, 596497, 590342, 584541, 579719, 575787, 572295, 569371, 567585, 566933, 566782, 566863, 567426, 568135, 567824, 566008, 563899, 563055, 563474, 563810, 563210, 562128, 561476, 561697, 562700, 564045, 565062, 565298, 564996, 564767, 564868, 565250, 566261, 568522, 571944, 575480, 578294, 580682, 583395, 586424, 589047]
61747E89047J875J630K079K727L221L621L907L748K986K066J633J753J866J614
61733F23773J340J559K230K895L277L334K946K132J457J477J727J097m87j589
61719F47168j037N63J773K195K474K855K827K144J216L02q10k166l406m478n769
61704F45851p161p776p182o192n732n533m792l757l503m221m721l996k550j644
61690E77091j785k440k912k987k856k820l036l317l219k576j856j709k202k817
61676E40559l128l186l165k926k274j384p53o88j079j654k265k792k963k593j993
61661E07716j879k592l552l765k931j799j279j444j633j349p10n2N42J171J778
61646D88222K088J870J160L61N3N88J719K780L261L157K736K109J173j14j517
$$ y = [589047, 590922, 592552, 594631, 597358, 600579, 604200, 608107, 611855, 614841, 616907, 618540, 620293, 622159, 623773, 625113, 626672, 628902, 631797, 635074, 638408, 641354, 643486, 644943, 646420, 648147, 649244, 648757, 647168, 646131, 646694, 648467, 650662, 653136, 655991, 658818, 660962, 662178, 662480, 661670, 659504, 656098, 651620, 645851, 638690, 630914, 623732, 617540, 611808, 606275, 601483, 597726, 594223, 590002, 585281, 581285, 578735, 577091, 575306, 572866, 569954, 566967, 564111, 561291, 558255, 554938, 551719, 549143, 547287, 545578, 543376, 540559, 537431, 534245, 531080, 528154, 525880, 524496, 523743, 523055, 521976, 520322, 518057, 515265, 512302, 509709, 507716, 505837, 503245, 499693, 495928, 492997, 491198, 489919, 488475, 486842, 485493, 484783, 484731, 485273, 486444, 488222, 490310, 492180, 493340, 493701, 493754, 494342, 496061, 498841, 502102, 505259, 507995, 510104, 511277, 511163, 509646]
61631E09646k601l056l006k868k818k555j853j224j451k433l050k504j320m96
61617D78411j64K49P72P05k43j343j816j800j970k581l390m268n254o114o353
61602D44841n841n063m575m484m555m557m303l639k712k104k338l231m037m251
61588C89151m040l788l599l451l519l908m274m110l443k838k634k546k149j444
61574C43408p63l65l24n12n66j78M04M51l44j364j855j893k055k297j874n15R14
61557C30272J368R14N79R70J562J553J076J030J685K048J127n65j481r37J92Q24
61541C42217R07R21R51R17J167J997K883L018K410J788J528J413J294J201Q20
61526C65432l01j940l256l775l670l108k113j176j017j485j615j045m71k98O5
$$ y = [509646, 507045, 503989, 500983, 498115, 495297, 492742, 490889, 489665, 488214, 485781, 482731, 480227, 478907, 478411, 478247, 478496, 479268, 479973, 479730, 478387, 476571, 474771, 472801, 470220, 466830, 462562, 457308, 451194, 444841, 439000, 433937, 429362, 424878, 420323, 415766, 411463, 407824, 405112, 403008, 400670, 397439, 393402, 389151, 385111, 381323, 377724, 374273, 370754, 366846, 362572, 358462, 355019, 352181, 349547, 347001, 344852, 343408, 342645, 342280, 341956, 341444, 340878, 340700, 341104, 341555, 341211, 339847, 337992, 336099, 334044, 331747, 329873, 329358, 330272, 331640, 332554, 333133, 334103, 335665, 337218, 338294, 339324, 341009, 343057, 344184, 343619, 342138, 341201, 341393, 342217, 343124, 344045, 344996, 345913, 347080, 349077, 351960, 354978, 357388, 359176, 360704, 362117, 363411, 364612, 365432, 365131, 363191, 359935, 356160, 352490, 349382, 347269, 346093, 345076, 343591, 341976, 340931, 340460, 340162, 340227]
61511C40227R52J476P58o41j508j600j496j356j005q19j377k267k378j487n37
61496C26942k22k30j10rj46l75o01j000j423j260l69N12P29O04P50J096J198J144
61478C27230J346J633J348M27l24k68K84O19N50M41N31N95L18j97m52o6P22J211
61460C35948R73M00L15R27J532J379O98L87P89J228R65K43j8N88J513J953J614
61443C51434P83l7m35l26k9J17K94J041K400L649M048L600K791J932J112M99K46
61426C73119K44L81Q84J933L089L554L141K502K281K495K787K970L032K958K730
61411D08100K411J999J396N81l50j330k313l056l203k801k400k469k814k891k519
61396C88341k068j917k033k112j980j682j318q96m62k03l31p63j060p74J16J200
$$ y = [340227, 341179, 342655, 343413, 342772, 341264, 339664, 338168, 336812, 335807, 334988, 333611, 331344, 328966, 327479, 326942, 326720, 326490, 326380, 326371, 326225, 325850, 325249, 324249, 322826, 321566, 321197, 321709, 322438, 323042, 323792, 324888, 326086, 327230, 328576, 330209, 331557, 331984, 331660, 331392, 331676, 332295, 332845, 333286, 333817, 334412, 334730, 334533, 334081, 334015, 334737, 335948, 336921, 337321, 337636, 338563, 340095, 341474, 342172, 342559, 343348, 344576, 345541, 345784, 345766, 346354, 347867, 349820, 351434, 352217, 352180, 351745, 351419, 351390, 351507, 351801, 352842, 355242, 358891, 362939, 366539, 369330, 371262, 372374, 372873, 373119, 373363, 373744, 374628, 376561, 379650, 383204, 386345, 388847, 391128, 393623, 396410, 399380, 402412, 405370, 408100, 410511, 412510, 413906, 414487, 414137, 412807, 410494, 407438, 404235, 401434, 399034, 396565, 393751, 390860, 388341, 386273, 384356, 382323, 380211, 378231, 376549, 375231, 374335, 373873, 373670, 373339, 372576, 371516, 370742, 370858, 372058]
61380C72058J981K205J953J521J203J080J011Q79P54Q11J135J660K178K359J970
61365C94758J221P41R43J568K007K040J927J916K006K203K690L507M318M738M865
61350D31448N289O496Q248R696J0242J0202J0396J1037J1377J0691R219P789O792
61337E48922O003N339N079N235N189M317K668P61j029k621l903m633m703m342
61323E62282l989l943m063l913l248k305j479q38j48O84J533K383L363M407N195
61308E55921N671O242P231Q392R352J0300J1805J3901J5754J6456J5845J4365
61296F91235J2289R494N972K203j175l932o248q269r928j1074j1566j1275j0351
61283F47375r416r049r003q372o784m951l731l070k301j109K77J631K894L926
$$ y = [372058, 374039, 376244, 378197, 379718, 380921, 382001, 383012, 383891, 384645, 385456, 386591, 388251, 390429, 392788, 394758, 395979, 396720, 397663, 399231, 401238, 403278, 405205, 407121, 409127, 411330, 414020, 417527, 421845, 426583, 431448, 436737, 443233, 451481, 461177, 471419, 481621, 492017, 503054, 514431, 525122, 534341, 542130, 548922, 554925, 560264, 565343, 570578, 575767, 580084, 582752, 583513, 582484, 579863, 575960, 571327, 566624, 562282, 558293, 554350, 550287, 546374, 543126, 540821, 539342, 538504, 538356, 539040, 540573, 542956, 546319, 550726, 555921, 561592, 567834, 575065, 583457, 592809, 603109, 614914, 628815, 644569, 661025, 676870, 691235, 703524, 713018, 718990, 721193, 720018, 716086, 709838, 701569, 691641, 680567, 669001, 657726, 647375, 637959, 628910, 619907, 611535, 604751, 599800, 596069, 592999, 590698, 589589, 589866, 591497, 594391, 598317]
61269E98317M589M995N229N041M325L691L858M554M850M599M788O160Q212J0019
61255F73227J1342J2439J3212J3180J2176J0558Q893P586O649N595L780J109j816
61242G77930m374o396p814q305p794o890o323o065n494m373l214k638k723k962
61228G02565k723j718j66J507L110M718O231P285P762Q013Q327Q562Q535Q459
61214G70467Q487Q230P280O053N439N624N840N379M361L304K453J815J531J812
61200H38075K643L809N194O904R027J1417J3744J5761J7536J9359K1403K3477
61188I88349K5108K5762K5043K2914J9811J6492J3597J1385R809Q628P459O043
61176A180400M541L331K345R99j026l250n014o347p841r823j2097j4386j6593
$$ y = [598317, 602906, 607901, 613130, 618171, 622496, 626187, 630045, 634599, 639449, 644048, 648836, 654996, 663208, 673227, 684569, 697008, 710220, 723400, 735576, 746134, 755027, 762613, 769262, 774857, 778637, 779746, 777930, 773556, 767160, 759346, 751041, 743247, 736357, 730034, 723969, 718475, 714102, 710888, 708250, 705527, 702565, 699842, 698124, 697958, 699465, 702575, 707293, 713524, 720809, 728571, 736584, 744911, 753473, 762008, 770467, 778954, 787184, 794464, 800517, 805956, 811580, 817420, 822799, 827160, 830464, 832917, 834732, 836263, 838075, 840718, 844527, 849721, 856625, 865652, 877069, 890813, 906574, 924110, 943469, 964872, 988349, 1013457, 1039219, 1064262, 1087176, 1106987, 1123479, 1137076, 1148461, 1158270, 1166898, 1174357, 1180400, 1184941, 1188272, 1190617, 1191616, 1190590, 1187340, 1182326, 1175979, 1168138, 1158315, 1146218, 1131832, 1115239]
61163A115239j8620k0360k1911k3443k4777k5423k5155k4334k3450k2565k1343
61152H63858j9521j7227j4848j2619j0382p814m956k311l28R73J711J652M16j880
61138G76724m499o578p621p562o683n519m508l615k400n41J825M229O264P885
61124G47401R527J1800J4924J8446K1731K4580K7171K9590L1778L3874L6136L8436
61112A045394M0204M1073M1305M1398M1485M1242M0205L8113L5079L1621K8343
61101A465462K5419K2483J9071J5006J0294M905j092p403j3718j9938k5941l1227
61089A463321l5210l7876l9839m1566m2817m3085m2373m1147l9661l7770l5497
61078A026480l3277l1409k9584k7340k4760k2290k0065j7806j5367j2935j0717
$$ y = [1115239, 1096619, 1076259, 1054348, 1030905, 1006128, 980705, 955550, 931216, 907766, 885201, 863858, 844337, 827110, 812262, 799643, 789261, 781447, 776491, 774180, 773852, 774825, 776536, 778188, 778604, 776724, 772225, 765647, 758026, 750464, 743781, 738262, 733754, 730139, 727739, 727198, 729023, 733252, 739516, 747401, 756928, 768728, 783652, 802098, 823829, 848409, 875580, 905170, 936948, 970822, 1006958, 1045394, 1085598, 1126671, 1167976, 1209374, 1250859, 1292101, 1332306, 1370419, 1405498, 1437119, 1465462, 1490881, 1513364, 1532435, 1547441, 1557735, 1562640, 1561548, 1554145, 1540427, 1520489, 1494548, 1463321, 1428111, 1390235, 1350396, 1308830, 1266013, 1222928, 1180555, 1139408, 1099747, 1061977, 1026480, 993203, 961794, 932210, 904870, 880110, 857820, 837755, 819949, 804582, 791647, 780930]
61067G80930q808p320o254n261l969k549j506q94k82N33J423K540M209O032P046
61052G65870P214P826R722J1977J3285J3943J5325J7794K0341K2192K3662K5286
61040I54437K7049K8763L0479L2200L3716L4907L5801L6338L6564L6939L7883
61029A325076L9118M0074M0873M2158M3964M5518M6197M5955M4777M2699M0528
61018A796937L9730M1183M4758N0171N7429O6132P5364Q4660R4364J04711J15752
61007B571191J28753J46657J72413K07689K53952L13731L90100M86357O07631
60998E278474P61537R55333J193317J477452J803659K144027K425177K534138
60990A8573114K370112J914421J261232N78938L2717k73474l10715j18433J97292
$$ y = [780930, 772122, 764802, 758548, 753287, 749318, 746769, 745263, 744369, 744087, 744620, 746043, 748583, 752792, 758824, 765870, 773084, 780910, 790632, 802609, 815894, 829837, 845162, 862956, 883297, 905489, 929151, 954437, 981486, 1010249, 1040728, 1072928, 1106644, 1141551, 1177352, 1213690, 1250254, 1287193, 1325076, 1364194, 1404268, 1445141, 1487299, 1531263, 1576781, 1622978, 1668933, 1713710, 1756409, 1796937, 1836667, 1877850, 1922608, 1972779, 2030208, 2096340, 2171704, 2256364, 2350728, 2455439, 2571191, 2699944, 2846601, 3019014, 3226703, 3480655, 3794386, 4184486, 4670843, 5278474, 6040011, 6995344, 8188661, 9666113, 11469772, 13613799, 16038976, 18573114, 20943226, 22857647, 24118879, 24697817, 24730534, 24457060, 24146345, 24027912, 24225204]
60981B4225204M74034N41998L02722k17494q84428j528535k017627k289514k346363
60972A6259997k232636k011134j742179j470150j220481j004068q22898o74090
60964E082361n52954m55104l76989l15453k67516k30313k00916j76645j55993
60955B350478j38815j25096j13752j03116r2167q0927o9921n9762n1135m4690
60945A471097m0832l9537m0156m1417m2069m1802m1156m0435l9219l7125l4573
60934A032776l2347l0841k9935k9272k8285k6487k4053k1751j9962j8318j6561
60923G54964j5087j4138j3119j1489r803q965q767q152o772n301m213l141j719
60910F44298l04N41P60P45Q83J396K196K810K820K459K293K262J602Rj701k488
$$ y = [24225204, 24699238, 25241236, 25543958, 25326464, 24442036, 22913501, 20895874, 18606360, 16259997, 14027361, 12016227, 10274048, 8803898, 7583417, 6579349, 5756451, 5082361, 4529407, 4074303, 3697314, 3381861, 3114345, 2884032, 2683116, 2506471, 2350478, 2211663, 2086567, 1972815, 1869699, 1777532, 1696605, 1626684, 1566922, 1515787, 1471097, 1430265, 1390728, 1350572, 1309155, 1267086, 1225284, 1184128, 1143693, 1104474, 1067349, 1032776, 1000429, 969588, 939653, 910381, 882096, 855609, 831556, 809805, 789843, 771525, 754964, 739877, 725739, 712620, 701131, 691328, 682363, 673596, 665444, 658672, 653371, 649158, 646017, 644298, 643994, 644535, 645295, 646040, 646923, 648319, 650515, 653325, 656145, 658604, 660897, 663159, 664761, 664770, 663069, 660581]
60894F60581k314k103k667m033n588o645o932o803o849p260p698p907q046q281
60880E77455q345p822o724n502m579m101m036m258m544m580m025k656o74J166
60866E16775K122K284K550L624N284O755P511P552P268P289Q053R182R592Q663
60852F04504P077O044N946O174O138N872N673N616N493M931L627J813L63j38k26
60837F68907r84k612m215n121n666o358o972o988o423n704n036m398l951l854
60823F00625l865l598l135k946l127l209k772j919j118p94j104j802k240j831
60809E67165o55N63J201J307J417K014L204M664N804O154N864N653O154P314Q552
60794F26375R398R854J0243J0837J1622J2413J3124J3901J4899J5982J6771J7109
$$ y = [660581, 658267, 656164, 653497, 649464, 643876, 637231, 630299, 623496, 616647, 609387, 601689, 593782, 585736, 577455, 569110, 561288, 554564, 549062, 544483, 540382, 536346, 532088, 527544, 522964, 518939, 516283, 515609, 516775, 518897, 521181, 523731, 527355, 532639, 539394, 546905, 554457, 561725, 569014, 577067, 586249, 595841, 604504, 611581, 617625, 623571, 629745, 635883, 641755, 647428, 653044, 658537, 663468, 667095, 668908, 669271, 669133, 668907, 667923, 665311, 661096, 655975, 650309, 643951, 636979, 629991, 623568, 617864, 612828, 608430, 604479, 600625, 596760, 593162, 590027, 587081, 583954, 580745, 577973, 576054, 574936, 574142, 573038, 571236, 568996, 567165, 566510, 567073, 568274, 569581, 570998, 573012, 576216, 580880, 586684, 592838, 598702, 604355, 610509, 617823, 626375, 635773, 645627, 655870, 666707, 678329, 690742, 703866, 717767, 732666, 748648, 765419, 782528]
60782G82528J7287J7760J8633J9546K0047K0004J9741J9777K0404K1420K2255
60771I99402K2392K1810K0979K0453K0373K0350J9837J8598J6765J4560J2098
60760A207617R503O960M449J667j567m856p573r634j1691j4309j7213j9537k0748
60747A123068k1090k1154k1231k1171k0742k0067j9698k0202k1597k3157k3994
60736H88965k3818k3089k2338k1605k0642j9486j8420j7438j6096j4158j2074
60725F79801j0535r707r216q764q385q041p396o152m447k744j486r78j297k169
60711E98484l100l788m236m426m193l697l622m440n610o054n465m713m775n612
60697E34753o338o308n712n176n017m997m726m146l626l582m040m592m708m112
$$ y = [782528, 799815, 817575, 836208, 855754, 875801, 895805, 915546, 935323, 955727, 977147, 999402, 1021794, 1043604, 1064583, 1085036, 1105409, 1125759, 1145596, 1164194, 1180959, 1195519, 1207617, 1217120, 1224080, 1228529, 1230196, 1228629, 1223773, 1216200, 1206566, 1194875, 1180566, 1163353, 1143816, 1123068, 1101978, 1080824, 1059593, 1038422, 1017680, 997613, 977915, 957713, 936116, 912959, 888965, 865147, 842058, 819720, 798115, 777473, 757987, 739567, 722129, 706033, 691875, 679801, 669266, 659559, 650343, 641579, 633194, 625153, 617757, 611605, 607158, 604414, 602928, 601950, 600653, 598484, 595384, 591596, 587360, 582934, 578741, 575044, 571422, 566982, 561372, 555318, 549853, 545140, 540365, 534753, 528415, 522107, 516395, 511219, 506202, 501205, 496479, 492333, 488707, 485125, 481085, 476493, 471785, 467673]
60683D67673k965j722p54r4L66N81M78K72L30O20O84L37lQ5M45P08Q69J009Q16
60664D69735nr50j123m07L37L89o4m62n69l77K23J184K110K762L516M820O320
60647D87439P100O851O288O158O231N664M231K660J631R04q5j090j245m19L18
60632E32636J9r74j718k029k383k734k443j468p16q66j515j936k109k465l013
60617E06286l325l242l067l113l367l607l608l229k495j622r35p35j188k054k593
60602D68106k134q38L58P46M55o1o94j448j951j727q71k7L25K77J25l4k68n72
60584D59767q20q69o81l52q8r2l60n80l25M81J363J832K102K898M420N951O851
60567D81498P415Q253R336J0260J1110J2105J2722J2193J0806R505Q170N598J616
$$ y = [467673, 464708, 462986, 462232, 462138, 462504, 463085, 463563, 463835, 464165, 464785, 465469, 465806, 465803, 465888, 466333, 467041, 467910, 468919, 469735, 469730, 468780, 467657, 467250, 467587, 467976, 467912, 467450, 466881, 466504, 466727, 467911, 470021, 472783, 476299, 481119, 487439, 494539, 501390, 507678, 513836, 520067, 525731, 529962, 532622, 534253, 535157, 535072, 533982, 532737, 532318, 532636, 532655, 531681, 529963, 527934, 525551, 522817, 520374, 518906, 518190, 517324, 515809, 513873, 511764, 509299, 506286, 502961, 499719, 496652, 493539, 490172, 486565, 482957, 479728, 477233, 475611, 474676, 473941, 472753, 470699, 468106, 465972, 465134, 465492, 466238, 466693, 466632, 465938, 464490, 462539, 460812, 459941, 459914, 460239, 460516, 460641, 460607, 460339, 459767, 458947, 458078, 457397, 457045, 456957, 456865, 456505, 455925, 455600, 456081, 457444, 459276, 461378, 464276, 468696, 474647, 481498, 488913, 497166, 506502, 516762, 527872, 539977, 552699, 564892, 575698, 585203, 593373, 598971, 600587]
60554F00587k145m338n581p068q449q405o701m446k538j021K38J292K503M237
60540E58165O107P320P852Q471R524J0505J0945J0947J0609R593P639N066K430
60527F65173P8j881l442m686n548n621m625l054j940j827k317k720k704k325j726
60512F20835r75j1J242K485L059K670J909J572J733K041K635M064O384R120J2125
60497F70888J5769K0123K4708K9228L3901L8771M3194M6247M7257M5826M1825
60486A057737L5453K6918J6184L533r735k1912l2179m0498m6395m8964m8300m5858
60474H45984m2851l9306l5106l0914k7271k3753j9933j6475j4265j3027j1814
60463E71269j0462r511r011q421p647p142o872o147m680l128k213j907j791j730
$$ y = [600587, 598442, 594104, 588523, 581455, 573006, 564601, 557900, 553454, 550916, 549895, 550133, 551425, 553928, 558165, 564272, 571592, 579444, 587915, 597439, 607944, 618889, 629836, 640445, 650038, 657677, 662743, 665173, 665251, 663370, 659928, 655242, 649694, 644073, 639448, 636394, 634454, 632627, 630310, 627590, 624886, 622561, 620835, 619860, 619849, 621091, 623576, 626635, 629305, 631214, 632786, 634519, 636560, 639195, 643259, 649643, 658763, 670888, 686657, 706780, 731488, 760716, 794617, 833388, 876582, 922829, 970086, 1015912, 1057737, 1093190, 1120108, 1136292, 1139825, 1130090, 1108178, 1075999, 1035501, 989106, 940142, 891842, 845984, 803133, 763827, 728721, 697807, 670536, 646783, 626850, 610375, 596110, 583083, 571269, 560807, 551296, 542285, 533864, 526217, 519075, 512203, 506056, 501376, 498248, 496035, 494128, 492337, 490607]
60449D90607j859k157k414k520k569k700k870k894k718k608k836l137k896j995
60435D54434j109q26q52n96j77k74j100k106k737k948k794k020m10J644L268L877
60419D45274L687L342L092K586J579N62K43N78Q89Q53Q23R89R76N55J69K46N70
60402D67013Q12J127J640J823J130m7p71p07k01M76J237J774J830J803K257K895
60386D84091K880K161J639J811K123J952J501J249J215J236J422J830K050J715
60372E08875J114Q61J178J823K489K908K824K261J719J690K063K264K001J511
60358E35581J113Q91Q14R65J433K063K501K559K508K879L914N319O707Q084R712
60343E87043J1554J3169J4149J4316J3466J1283P794L640l56l758o560q773j0284
$$ y = [490607, 488748, 486591, 484177, 481657, 479088, 476388, 473518, 470624, 467906, 465298, 462462, 459325, 456429, 454434, 453325, 452499, 451647, 451051, 450874, 450600, 449500, 447394, 444657, 441709, 438915, 436895, 436485, 438129, 441397, 445274, 448961, 452303, 455395, 457981, 459560, 460122, 460365, 460943, 461832, 462685, 463508, 464497, 465473, 466028, 466197, 466443, 467013, 467825, 468952, 470592, 472415, 473545, 473498, 472727, 472020, 471819, 472295, 473532, 475306, 477136, 478939, 481196, 484091, 486971, 489132, 490771, 492582, 494705, 496657, 498158, 499407, 500622, 501858, 503280, 505110, 507160, 508875, 509989, 510850, 512028, 513851, 516340, 519248, 522072, 524333, 526052, 527742, 529805, 532069, 534070, 535581, 536694, 537585, 538399, 539364, 540797, 542860, 545361, 547920, 550428, 553307, 557221, 562540, 569247, 577331, 587043, 598597, 611766, 625915, 640231, 653697, 664980, 672774, 676414, 676058, 672300, 665740, 656967, 646683]
60330F46683j1053j1214j0929j0220r091p756o634o061n907n624m673l018j220
60317E53283r2j16r91j760j652q21k2M23R83K153L782N468P139Q961J0986J3320
60301F01044J6225J9465K1894K2356K0856J8302J5224J1414O791J926k385n515
60289G47597p024o944o172n903o445p187p765q547r781j1030j1862j2401j2768
60276F33768j2582j1595j0233r043q096p368p106p239p038o074n006m623m569
60263E33196l913k681j777j548j410r87o45o81q14p93p85q63p27l22q1j86j07
60246E14876O08J551K024J973J897J982J912J449P53J32k33l21k34j17N0M13R73
60229E29688J503J920K472L259L862L811L310L071L452M080M347L994L147K171
$$ y = [646683, 635630, 624416, 613487, 603267, 594176, 586420, 579786, 573725, 567818, 562194, 557521, 554503, 553283, 553191, 553075, 552084, 550324, 548672, 547851, 547829, 548252, 549235, 551388, 555170, 560638, 567777, 576738, 587724, 601044, 617269, 636734, 658628, 680984, 701840, 720142, 735366, 746780, 753571, 755497, 753112, 747597, 740573, 733629, 727457, 721554, 715109, 707922, 700157, 691610, 681829, 670799, 658937, 646536, 633768, 621186, 609591, 599358, 590315, 582219, 574851, 567745, 560506, 553468, 547394, 542388, 537765, 533196, 529283, 526602, 524825, 523277, 521867, 520880, 520235, 519554, 518740, 517947, 517162, 516299, 515572, 515250, 515169, 514983, 514876, 515484, 517035, 519059, 521032, 522929, 524911, 526823, 528272, 529025, 529157, 528924, 528603, 528369, 528252, 528302, 528715, 529688, 531191, 533111, 535583, 538842, 542704, 546515, 549825, 552896, 556348, 560428, 564775, 568769, 571916, 574087]
60215E74087J587J884L114M750O104O854P182P487P951Q400Q483Q076P468P048
60201F60475O868O612O047N366M932M764M376L341J887P79M56N26L15k71q26j246
60185G04401j872k726l210l013k800l427m743n740n769n065m227l789m142n174
60171F48704n925n344l573j882j112q70n04j03M4K40R10J745K134K129K283K666
60155F41542K768K353J743J256R29P93R15J138J225J293J571J914K082K471L697
60140F67690N454O575O578O371P038Q520R978J0842J1004J0391R058P402N800
60127G72701M205K447O59r26k298l400l893l614k893k035q86N17J441J327Q28
60112G64180J053J966K489K106J379P54r1j318k327k703l039l987n104n431m940
$$ y = [574087, 575674, 577558, 580672, 585422, 591526, 598380, 605562, 613049, 621000, 629400, 637883, 645959, 653427, 660475, 667343, 673955, 680002, 685368, 690300, 695064, 699440, 702781, 704668, 705447, 705903, 706429, 706744, 706473, 705647, 704401, 702529, 699803, 696593, 693580, 690780, 687353, 682610, 676870, 671101, 666036, 661809, 658020, 653878, 648704, 642779, 637435, 633862, 631980, 630868, 629998, 629494, 629391, 629435, 629675, 630585, 632330, 634464, 636593, 638876, 641542, 644310, 646663, 648406, 649662, 650591, 651384, 652299, 653437, 654662, 655955, 657526, 659440, 661522, 663993, 667690, 673144, 679719, 686297, 692668, 699706, 708226, 718204, 729046, 740050, 750441, 759499, 766901, 772701, 776906, 779353, 780012, 779086, 776788, 773388, 769495, 765881, 762988, 760953, 760067, 760584, 762025, 763352, 764180, 765233, 767199, 769688, 771794, 773173, 773927, 773836, 772518, 770191, 767488, 764449, 760462, 755358, 749927, 744987]
60097G44987m579m976n706n909n029l050n10J584K480K475K622L523M837O020
60083G38769O927P464P359O752O483O972P303O246M015K006P80o34l095o071q590
60068G82686j0566j2244j3132j2661j1518j1048j1371j1289j0188q865q126p668
60056F54010o938o204n990o095n918n308m398l129j560l08K38O99J909L633M886
60041F19527N414N961O947P777P739O962O118N596N249M725L769K404Q78o34k187
60026F86245l747m905n375n629o548q394j0484j1925j2336j1938j1233j0648j0180
60013E72903r412q125o722n729n038m137k895j618m42P84J994K821L132L162L160
59998E43838L264L649M280M619M220L575L644M505N161M921M198L701L553L593
$$ y = [744987, 740408, 735432, 729726, 723817, 718788, 715738, 715228, 716812, 719292, 721767, 724389, 727912, 732749, 738769, 745696, 753160, 760519, 767271, 773754, 780726, 788029, 794275, 798290, 800296, 801076, 800442, 797347, 791276, 782686, 772120, 759876, 746744, 734083, 722565, 711517, 700146, 688857, 678669, 669804, 661678, 654010, 647072, 640868, 634878, 628783, 622865, 617557, 613159, 610030, 608470, 608162, 608400, 609099, 611008, 614641, 619527, 624941, 630902, 637849, 645626, 653365, 660327, 666445, 672041, 677290, 682015, 685784, 688188, 689066, 688432, 686245, 682498, 677593, 672218, 666589, 660041, 651647, 641163, 629238, 616902, 604964, 593731, 583083, 572903, 563491, 555366, 548644, 542915, 537877, 533740, 530845, 529227, 528785, 529569, 531563, 534384, 537516, 540678, 543838, 547102, 550751, 555031, 559650, 563870, 567445, 571089, 575594, 580755, 585676, 589874, 593575, 597128, 600721]
59984F00721L923M534M884M390L102J537N3j282k450l447m332n097n636n871n734
59969E89295n047l818k574j890j609j051l7R28J618K416L453M189M256L985L661
59954E97775K905J487P1n02l25r4q5m8J49M13O85Q34N34k46r97j407j933l037
59936E96179m262m772m524m169m002l775l359k870k206j229l67l26j059j661j402
59921E56196l82Q21J595J512P15J48P29K215L435L706L366K965K658K642L274
59906E85595M380N102M979M635M875N600O180O459O682O694O027M792L803L620
59892F59423L910M000L669L124K535K004J820K293L288M271M918N425N995O364
59878G13039O281O144O614P524P764O535M218J732n57k831n083o942q156q809
$$ y = [600721, 604644, 609178, 614062, 618452, 621554, 623091, 623144, 621862, 619412, 615965, 611633, 606536, 600900, 595029, 589295, 584248, 580430, 577856, 575966, 574357, 573306, 573269, 574197, 575815, 578231, 581684, 585873, 590129, 594114, 597775, 600680, 602167, 602238, 601736, 601411, 601317, 601232, 601184, 601333, 601746, 602431, 603265, 603799, 603553, 602556, 601149, 599216, 596179, 591917, 587145, 582621, 578452, 574450, 570675, 567316, 564446, 562240, 561011, 560644, 560318, 559259, 557598, 556196, 555814, 556635, 558230, 559742, 560457, 560605, 561334, 563549, 566984, 570690, 574056, 577021, 579679, 582321, 585595, 589975, 595077, 600056, 604691, 609566, 615166, 621346, 627805, 634487, 641181, 647208, 652000, 655803, 659423, 663333, 667333, 671002, 674126, 676661, 678665, 680485, 682778, 686066, 690337, 695255, 700680, 706675, 713039, 719320, 725464, 732078, 739602, 747366, 753901, 758119, 759851, 759294, 756463, 751380, 744438, 736282, 727473]
59864G27473r037q872q419p876p399p063o887o727o242n245m004k993k436k158
59850F42115j710m83J859M839P379Q963J0181J1684J2985J2935J1098Q053M569
59837G34467J247j177k030j395M7J845L849N349N142K838n12l508n678p321q723
59822G24440r941j0996j1735j1862j1492j1323j1749j2103j1382r525p520o222
59810E98590n598n098m342l310k185j173l83K28O97Q98O79J77k14k90l35p50j455
59793E76136j841j512r26r92j989l209l822l724l350k996k723k639k717k544j768
59778E39384p60k26j86K1O46J146J077P09M52K82J90N40J427K208K335K305K979
59761E54529M218N008M924M634M701M762M292L650L663M446N273N588N607N780
$$ y = [727473, 718436, 709564, 701145, 693269, 685870, 678807, 671920, 665193, 658951, 653706, 649702, 646709, 644273, 642115, 640405, 639922, 641781, 646620, 653999, 662962, 673143, 684827, 697812, 710747, 721845, 729898, 734467, 735714, 734537, 732507, 731112, 731159, 733004, 736853, 742202, 747344, 750182, 749670, 746162, 740484, 733163, 724440, 714499, 703503, 691768, 679906, 668414, 657091, 645342, 633239, 621857, 612332, 604812, 598590, 592992, 587894, 583552, 580242, 578057, 576884, 576501, 576729, 577426, 578324, 579003, 579180, 578966, 578676, 578341, 577591, 576136, 574295, 572783, 571857, 570865, 568876, 565667, 561845, 558121, 554771, 551775, 549052, 546413, 543696, 541152, 539384, 538624, 538398, 538212, 538233, 538879, 540025, 541102, 541811, 542263, 542545, 542735, 543275, 544702, 546910, 549245, 551550, 554529, 558747, 563755, 568679, 573313, 578014, 582776, 587068, 590718, 594381, 598827, 604100, 609688, 615295, 621075]
59747F21075O148O457O609O655O524O148N776N715N734N186L808K090O21m62j183
59732F86901j356j032q33j219j695j461p10m08p98j044n84J5K3l53m81l21k22
59715F74422j45J62M13M1q35j333q21M47J731K451K401J841J424J561J733R99
59699F86492o49j969j915r18k53l99o49k55O56J448J744J509P74l34j331j646
59683F82305j139j64Q91J789K210J771N42p89j616k130k975m311n592o270o354
59668F58168o198o061o007n979n779n207m394l810l691l651l079j920o98K20J074
59653F02988K270L676M656M791M364L955L775L506K796J659M15o54j517k343l285
59638F31052m198m642m253l121j687l96L64K38o71j494j345m64M6j89k26O99J844
$$ y = [621075, 627223, 633680, 640289, 646944, 653468, 659616, 665392, 671107, 676841, 682027, 685835, 687925, 688546, 688084, 686901, 685545, 684513, 683680, 682461, 680766, 679305, 678595, 678187, 677389, 676345, 675761, 675776, 675799, 675446, 674965, 674644, 674422, 674277, 674439, 674852, 674893, 674058, 672725, 671904, 672351, 674082, 676533, 678934, 680775, 682199, 683760, 685493, 686492, 685843, 683874, 681959, 681041, 680788, 680389, 679740, 679485, 680141, 681589, 683333, 684842, 685616, 685282, 683951, 682305, 681166, 681002, 681893, 683682, 685892, 687663, 688205, 687416, 685800, 683670, 680695, 676384, 670792, 664522, 658168, 651970, 645909, 639902, 633923, 628144, 622937, 618543, 614733, 611042, 607391, 604312, 602392, 601694, 601914, 602988, 605258, 608934, 613590, 618381, 622745, 626700, 630475, 633981, 636777, 638436, 638851, 638197, 636680, 634337, 631052, 626854, 622212, 617959, 614838, 613151, 612755, 613119, 613357, 612686, 611192, 609847, 609383, 609429, 609240, 609014, 609713, 611557]
59621F11557J960J073L44L37M11q7r33j583j935k168k229j864r31M91K091L380
59605F09914M076M355M493M373L741K806K005J295L10q32j572j856k215k766k925
59590F25202k451j939j851j825j514j412k061k931l018k264j603j620j936j998
59576E96779j863j925k272k661k820k646k146j375m40M09Q27O58J38k98m24k53
59560E79688K43J090K054K712K893K746K443K097J930K035K033J508P83O11J057
59545F05923J406J394J669K678L977N165O782R458J2810J5964J8700K1084K2220
59532G29230K0495J5301P926P10m398o569o159m269j872P47L597O310Q235R113
59518G78397R187Q697P590N638K667j196n247q499j0554j1947j3268j4335j4625
$$ y = [611557, 613517, 614590, 614934, 615271, 615682, 615595, 614662, 613079, 611144, 608976, 606747, 604883, 603952, 604443, 606534, 609914, 613990, 618345, 622838, 627211, 630952, 633758, 635763, 637058, 637368, 636536, 634964, 633108, 630893, 628127, 625202, 622751, 620812, 618961, 617136, 615622, 614210, 612149, 609218, 606200, 603936, 602333, 600713, 598777, 596779, 594916, 592991, 590719, 588058, 585238, 582592, 580446, 579071, 578631, 579040, 579867, 580525, 580663, 580365, 579941, 579688, 579931, 581021, 583075, 585787, 588680, 591426, 593869, 595966, 597896, 599931, 601964, 603472, 604255, 604866, 605923, 607329, 608723, 610392, 613070, 617047, 622212, 628994, 638452, 651262, 667226, 685926, 707010, 729230, 749725, 765026, 772952, 773662, 769264, 762695, 756536, 752267, 750395, 751142, 754739, 761049, 769284, 778397, 787584, 796281, 803871, 809509, 812176, 810980, 805733, 797234, 786680, 774733, 761465, 747130, 732505]
59505G32505j4108j3173j1950j0373q744p617p211p287p409p015n570l288j298
59492F27462n21o07o47n51q72j486j532o80M11J167J840K882M281N755P149Q366
59476F52417R374J0300J1116J1257J0237Q615P556P255O656M955K626N70r24j845
59462G40165j858p82Q10K165L322M898P155R772J2442J5147J7823K0160K1763
59449H52982K2406K2175K1475K0670J9557J7364J3448P822R30o727j4362k0671
59437I57069k4338k4998k3494k1189j9038j7289j5850j4716j3863j2858j1057
59426G58379q429n806l836j964R52N133R623J3495J6644J9307K1581K3679K5959
59413H74717K8349L0310L1695L2831L3119L0337K2411R860m281j6811k6053l1442
$$ y = [732505, 718397, 705224, 693274, 682901, 674157, 666540, 659329, 652042, 644633, 637618, 632048, 628760, 627462, 626941, 626334, 625687, 625136, 624264, 622778, 621246, 620566, 620977, 622144, 623984, 626866, 631147, 636902, 644051, 652417, 661791, 672091, 683207, 694464, 704701, 713316, 720872, 728127, 734783, 739738, 742364, 742934, 742010, 740165, 738307, 737525, 738335, 740500, 743822, 748720, 755875, 765647, 778089, 793236, 811059, 831219, 852982, 875388, 897563, 919038, 939708, 959265, 976629, 990077, 997899, 998829, 992102, 977740, 957069, 932731, 907733, 884239, 863050, 844012, 826723, 810873, 796157, 782294, 769436, 758379, 749950, 744144, 740308, 738344, 739296, 744429, 754052, 767547, 784191, 803498, 825079, 848758, 874717, 903066, 933376, 965071, 997902, 1031021, 1061358, 1083769, 1093629, 1089348, 1072537, 1046484, 1015042]
59401A015042l2635k9633k3238j4803n744K285P006O207n52j0987k1278k8497
59389H63173l1928l2280l0324k6651k2200j8109j4828j1994r302p019n389m078
59377F49071k661j331n70l46o1O33J395J694J593J726K510L535L984L710L527
59362F68409M145N174N680N572N729O671P855Q640R384J0974J3561J6372J8687
59349G86853K0565K2496K4650K6640K8008K8837K9683L0733L1232L0108K7158
59338A086963K3204J9081J4770R760L811k761r178j4531j8447k1483k4467k7348
59326A039374k9267k9830k9549k8777k7039k4102k0961j8839j7636j6190j3929
59315G83255j1440r463q083o999n957m707l079j330r0K74J39L91J731L994O134
$$ y = [1015042, 982407, 952774, 929536, 914733, 908989, 911274, 918280, 924487, 923935, 912948, 891670, 863173, 831245, 798965, 768641, 741990, 719790, 701681, 686853, 674859, 665557, 658538, 653149, 649071, 646410, 645079, 644509, 644163, 644102, 644735, 646130, 647824, 649417, 651143, 653653, 657188, 661172, 664882, 668409, 672554, 677728, 683408, 688980, 694709, 701380, 709235, 717875, 727259, 738233, 751794, 768166, 786853, 807418, 829914, 854564, 881204, 909212, 938049, 967732, 998465, 1029697, 1059805, 1086963, 1110167, 1129248, 1144018, 1153778, 1157589, 1154828, 1145650, 1131119, 1112672, 1091189, 1066722, 1039374, 1010107, 980277, 950728, 921951, 894912, 870810, 849849, 831010, 813374, 797184, 783255, 771815, 762352, 754269, 747270, 741313, 736606, 733527, 732197, 732107, 732381, 732520, 732911, 734642, 738636, 744770]
59300G44770P207P539Q457J0611J3211J5381J7374J9411J9937J6596R148J94p391
59287H82445j2687j6104j7683j7136j4886j2005r194o487l842j449N63K295L967
59274G77797N889Q378J1387J4337J6671J8423J9929K1090K1340K0259J7896J4481
59262I67877J0261N655J237k738o540j0545j4601j7944j9822k0199j9741j9060
59250H53840j8066j6315j3909j1608r895q398o551m434k500q34P60K169L217M344
59236G71820O219Q537J0069J0201R669R314Q852P555N512L363J165j502m548p372
59222H38854r849j2404j4950j6621j6901j6271j5345j4102j2449j0854r784q941
59210F80383p740o229m937m118l703l744m162m300l474j939o18J60R34K018K886
$$ y = [744770, 751977, 759516, 767973, 778584, 791795, 807176, 824550, 843961, 863898, 880494, 889642, 889836, 882445, 869758, 853654, 835971, 818835, 803949, 791944, 782750, 776263, 772421, 770972, 771535, 773830, 777797, 783686, 792064, 803451, 817788, 834459, 852882, 872811, 893901, 915241, 935500, 953396, 967877, 978138, 983793, 985030, 982292, 975752, 965207, 950606, 932662, 912840, 892641, 872900, 853840, 835774, 819459, 805550, 793942, 784047, 775649, 769098, 764664, 762164, 761330, 762090, 764259, 767476, 771820, 778039, 786576, 796645, 806846, 816515, 825829, 834681, 842236, 847748, 851111, 852276, 850774, 846226, 838854, 829005, 816601, 801651, 785030, 768129, 751858, 736513, 722411, 709962, 699108, 689324, 680383, 672643, 666414, 661477, 657359, 653656, 649912, 645750, 641450, 637976, 636037, 635419, 635579, 636513, 638531, 641417]
59195F41417L052K904L190M060N047N774O198O369O302O141O092O205O284O022
59181G15057N219M000K900K480K816L449M012M597N351O050O412O704P574R244
59167G85865J1180J2765J3950J5025J5938J6264J5772J4673J3133J0942P945M489
59155I37941J084k195n516q704j1376j3584j5643j7251j7584j6565j5330j4876
59143H00401j4829j4144j2463j0271q119o426n635n727n909n489m752m268l775
59130F98594k782j863k057k981k906j053J352K788L101K982K832K883L658N395
59116G09943P554R499J1078J2081J1895J0458Q930Q430Q628Q402P501O554N747
59103H26700M684L522L097L628M022L083Q70j474k955l417l250k809k199j524
$$ y = [641417, 644469, 647373, 650563, 654623, 659670, 665444, 671642, 678011, 684313, 690454, 696546, 702751, 709035, 715057, 720276, 724276, 727176, 729656, 732472, 735921, 739933, 744530, 749881, 755931, 762343, 769047, 776621, 785865, 797045, 809810, 823760, 838785, 854723, 870987, 886759, 901432, 914565, 925507, 933452, 937941, 939025, 936830, 931314, 922610, 911234, 897650, 882007, 864756, 847172, 830607, 815277, 800401, 785572, 771428, 758965, 748694, 740575, 734149, 728514, 722787, 716878, 711389, 706637, 702369, 698594, 695812, 693949, 691892, 688911, 686005, 684952, 686304, 689092, 692193, 695175, 698007, 700890, 704548, 709943, 717497, 726996, 738074, 750155, 762050, 772508, 781438, 789868, 798496, 806898, 814399, 820953, 826700, 831384, 834906, 838003, 841631, 845653, 848736, 849606, 848132, 845177, 841760, 838510, 835701, 833502, 831978]
59089H31978j113j239j612j519p25K7k28j664l662n637p438r056j0326j1039j1129
59074G65618j0672r851q905q053p434p090o863o352n313m103l438l495l640l189
59060F77220k187j249q80j108j544j673j328r83j239j996k553k550k323k178j958
59045F51471j525j033m82L27J077R92O9n14Q9J157J518J225J183J584J858J928
59029F60924K452L705N175O404P537Q866J0467J2382J4556J6421J7145J6537J5251
59016G97822J3914J2399J0163P032L482K85k150m094o008p638q075o893m823k867
59002H02549j125R50L510O124Q351R964J0798J1007J1222J1911J2757J3137J2924
58989I14079J2287J1094R185O898M555J776j845n605q225r357r671r563q723p007
$$ y = [831978, 830865, 829626, 828014, 826495, 825770, 825797, 825569, 823905, 820243, 814606, 807168, 798112, 787786, 776747, 765618, 754946, 745095, 736190, 728137, 720703, 713613, 706750, 700398, 695085, 690982, 687544, 684049, 680409, 677220, 675033, 673784, 672904, 671796, 670252, 668579, 667251, 666268, 665029, 663033, 660480, 657930, 655607, 653429, 651471, 649946, 648913, 648431, 648758, 649835, 650827, 650896, 650382, 650471, 651628, 653146, 654371, 655554, 657138, 658996, 660924, 663376, 667081, 672256, 678660, 686197, 695063, 705530, 717912, 732468, 748889, 766034, 782571, 797822, 811736, 824135, 834298, 841330, 844812, 845097, 842947, 838853, 832845, 825207, 817132, 810239, 805416, 802549, 801424, 802374, 805884, 812008, 820359, 830323, 841121, 852128, 863350, 875261, 888018, 901155, 914079, 926366, 937460, 946645, 953543, 958098, 959874, 958029, 952424, 944199, 934842, 925171, 915608, 906885, 899878]
58975H99878m802k411J25K494M362O118Q454J1099J2998J3960J5042J6912J8861
58962A003090J9952K0255K0327K0160J9274J7315J4032R259L404k512p826j2753
58950A123977j7607k2035k5390k7394k8006k7242k5496k3556k1813j9894j7427
58939H68117j4656j1955r389p140n701n028m156k426n72J60l62j183j607j744
58925H02358j848j919j977k184k527k760k717k417j927j363r19o26k22M70J266
58910G80688J956K648L479M272M889N630O872Q511J0201J1963J4053J6347J8274
58897H89783J9411J9729J9378J8655J8194J8724K0453K2955K5781K8923L2607
58886A134593L6738M0676M3504M4596M3944M1882L8443L3231K6094J7706R138
$$ y = [899878, 895076, 892665, 892790, 895284, 899646, 905764, 914218, 925317, 938315, 952275, 967317, 984229, 1003090, 1023042, 1043297, 1063624, 1083784, 1103058, 1120373, 1134405, 1143664, 1147068, 1144556, 1136730, 1123977, 1106370, 1084335, 1058945, 1031551, 1003545, 976303, 950807, 927251, 905438, 885544, 868117, 853461, 841506, 832117, 824977, 819276, 814248, 810092, 807666, 807094, 807254, 806892, 805709, 804102, 802358, 800510, 798591, 796614, 794430, 791903, 789143, 786426, 784009, 782082, 780719, 779800, 779174, 778952, 779422, 780688, 782644, 785292, 788771, 793043, 797932, 803562, 810434, 818945, 829146, 841109, 855162, 871509, 889783, 909194, 928923, 948301, 966956, 985150, 1003874, 1024327, 1047282, 1073063, 1101986, 1134593, 1171331, 1212007, 1255511, 1300107, 1344051, 1385933, 1424376, 1457607, 1483701, 1501407, 1510545]
58875A510545R35p096j5190k3069l0117l5830l9879m1888m1551l9124l5560l1879
58863A170297k8395k4890k1505j9010j7863j7460j6832j5840j5102j4866j4674
58852I63860j4184j3607j3091j2292j0950r479q443p840p304o847o867p474q258
58839H37224q784r011r128r152q928q462q040p889p813p418o688n953n241m109
58825G30608k460j001l56o5Q41K440L874M654N279O278P386P983P841P126O080
58810G86508N034M349M018L563K616J422N03K0l29q36j450j951k410l319m914
58795G92824o443o738n771m954n388o405o664o065n432m744l038j81K569M158
58781G37728M851N380N920O354O693O774O180M861L222J392p44k722l695l758
$$ y = [1510545, 1511480, 1504384, 1489194, 1466125, 1436008, 1400178, 1360299, 1318411, 1276860, 1237736, 1202176, 1170297, 1141902, 1117012, 1095507, 1076497, 1058634, 1041174, 1024342, 1008502, 993400, 978534, 963860, 949676, 936069, 922978, 910686, 899736, 890257, 881814, 873974, 866670, 859823, 852956, 845482, 837224, 828440, 819429, 810301, 801149, 792221, 783759, 775719, 767830, 760017, 752599, 745911, 739958, 734717, 730608, 728148, 727147, 726791, 726726, 727567, 730007, 733881, 738535, 743814, 750092, 757478, 765461, 773302, 780428, 786508, 791542, 795891, 799909, 803472, 806088, 807510, 808013, 808033, 807704, 806868, 805418, 803467, 801057, 797738, 792824, 786381, 779643, 773872, 768918, 763530, 757125, 750461, 744396, 738964, 734220, 731182, 731001, 733570, 737728, 742579, 747959, 753879, 760233, 766926, 773700, 779880, 784741, 787963, 789355, 788611, 785889, 782194, 778436]
58767G78436l998m796n218m699m122m374m852m460l276k162j316k47J254L009
58753G39179M862O426O923O173N175M871M842M206L225K893L320L770M150N165
58739H05180O897Q257Q276P140N761M856M659N027N649O397P402Q534R195R100
58725I02330Q821Q981R232Q787P707O800O413O203O038O291P064P942Q701R609
58711A010919J0711J1363J0785Q862O157L341P42j727m229o702r079j1793j5496
58698A013854k0016k4074k6471k7170k6862k5992k4658k3003k1014j8385j5170
58687G61039j2187j0126q678p230n948n410n518n714n935o424o772o176m640k993
58673F67288j724o36L57J077J803L198N240P061Q191R278J1097J3462J5447J6252
$$ y = [778436, 774438, 769642, 764424, 759725, 755603, 751229, 746377, 741917, 738641, 736479, 735163, 734916, 736170, 739179, 744041, 750467, 757390, 763563, 768738, 773609, 778451, 782657, 785882, 788775, 792095, 795865, 800015, 805180, 812077, 820334, 828610, 835750, 841511, 846367, 851026, 856053, 861702, 868099, 875501, 884035, 893230, 902330, 911151, 920132, 929364, 938151, 945858, 952658, 959071, 965274, 971312, 977603, 984667, 992609, 1001310, 1010919, 1021630, 1032993, 1043778, 1052640, 1058797, 1062138, 1062880, 1061153, 1056924, 1050222, 1041143, 1029350, 1013854, 993838, 969764, 943293, 916123, 889261, 863269, 838611, 815608, 794594, 776209, 761039, 748852, 738726, 730048, 722818, 716870, 711460, 705942, 700228, 694293, 687869, 681097, 674921, 670281, 667288, 665564, 664928, 665285, 666362, 668165, 671363, 676603, 683664, 691855, 701133, 712230, 725692, 741139, 757391]
58659G57391J5495J3121R451N223J316j596l276m007m369m680m803m745n030o047
58645G63444p260p724p226o355n521m564l271j760k31J201K463L636N005O585
58631G38422P760P898P081N770M044J821m31j875k202j726p66M60J607K581M048
58616G74492O705J0133J3114J5112J6560J7732J8195J7493J5540J2169P273J765
58604I26283k531m553n060n578o763q257r561j0424j0650j0146r196q314p723
58591H27527p120n968m008j546Q09K711M401O404Q973J1888J4581J6381J6933
58578H91966J6524J5730J4731J3267J1332R396P780O375N271N052O056P967J0498
58565A021945J3765J7539K0887K3241K5154K7238K9010K9580K8852K7098K4033
$$ y = [757391, 772886, 786007, 795458, 800681, 801997, 800401, 797125, 793118, 788749, 784069, 779266, 774521, 769491, 763444, 756184, 748460, 741234, 734879, 729358, 724794, 721523, 719763, 719532, 720733, 723196, 726832, 731837, 738422, 746182, 754080, 761161, 766931, 770975, 772796, 772365, 770490, 768288, 766562, 765796, 766256, 767863, 770444, 774492, 781197, 791330, 804444, 819556, 836116, 853848, 872043, 889536, 905076, 917245, 924518, 926283, 923752, 919199, 914139, 908561, 901798, 893541, 883980, 873556, 862906, 852760, 843564, 835250, 827527, 820407, 814439, 810431, 808885, 809694, 812405, 816806, 823210, 832183, 844071, 858652, 875033, 891966, 908490, 924220, 938951, 952218, 963550, 972946, 980726, 987101, 992372, 997424, 1003480, 1011447, 1021945, 1035710, 1053249, 1074136, 1097377, 1122531, 1149769, 1178779, 1208359, 1237211, 1264309, 1288342]
58554A288342J9301J3451P390J368m498r185j1575j1996j1856j1810j1476j0717
58542A246739j0090j0016j0573j2043j4647j7747k0298k2049k3372k4048k3346
58531A058510k1319j8939j6764j4381j1315p648l770k25K294L586M390N443O415
58518I86277O656O477O554O518N521L899K866K664K437J839J325R26J07j051j956
58503A031059k836m475o544p675p444o837o535o226n912o264p252p807p420o717
58489I41115o058m954l335j987j176j14J627L488N203P407J0349J3198J5308J6908
58475I96979J8070J8163J6904J4806J2042Q119L182j587n404q484j0853j1900
58463A050037j1619j0846r762p656m683k232p89Q31L327N677P039Q193R899J1282
$$ y = [1288342, 1307643, 1321094, 1328484, 1329852, 1325354, 1316169, 1304594, 1292598, 1280742, 1268932, 1257456, 1246739, 1236649, 1226633, 1216060, 1204017, 1189370, 1171623, 1151325, 1129276, 1105904, 1081856, 1058510, 1037191, 1018252, 1001488, 987107, 975792, 968144, 964374, 964149, 966443, 970029, 974419, 979862, 986277, 992933, 999410, 1005964, 1012482, 1018003, 1021902, 1024768, 1027432, 1029869, 1031708, 1033033, 1033959, 1034066, 1033015, 1031059, 1028223, 1023748, 1017204, 1009529, 1002085, 995248, 988713, 982487, 976575, 970311, 963059, 955252, 947832, 941115, 935057, 930103, 926768, 924781, 923605, 923491, 925118, 928606, 933809, 941216, 951565, 964763, 980071, 996979, 1015049, 1033212, 1050116, 1064922, 1076964, 1085083, 1088265, 1086678, 1081274, 1072790, 1061937, 1050037, 1038418, 1027572, 1017810, 1010154, 1005471, 1003239, 1002450, 1003281, 1006608, 1012285, 1019324, 1027517, 1037416, 1048698]
58449A048698J1233R991Q103N113P14l914p419r873j1846j2851j2117j0069p720
58436A008043n289k610j45J542K678L673M328M584N247O935R060J0784J2255J3963
58422A075048J5641J6634J6684J5649J3369J0313P385M514P57l563o439o919o642
58409A152431p464q989r955j0584j1766j3072j3395j2803j2084j1129r324o997
58397A024869m994l386j763k83P43J629K546K758J820O30J19k02j097j997j979
58382A019413j462j358j338n27P48J546K113L479N630P481Q467Q864Q910Q739
58368A070705Q840R522J0329J0954J2000J3867J5617J6220J6192J6759J7983J8949
58356A237937J9217J8849J7575J5119J1870Q297M322K08k787l764l399k755j801
$$ y = [1048698, 1059931, 1069922, 1078025, 1083138, 1083852, 1079938, 1072519, 1062646, 1050800, 1037949, 1025832, 1015763, 1008043, 1002754, 1000144, 999999, 1001541, 1004219, 1007892, 1012220, 1016804, 1022051, 1028986, 1038046, 1048830, 1061085, 1075048, 1090689, 1107323, 1124007, 1139656, 1153025, 1163338, 1170723, 1175237, 1175994, 1172431, 1165992, 1159073, 1152431, 1144967, 1135978, 1126023, 1115439, 1103673, 1090601, 1077206, 1064403, 1052319, 1041190, 1031866, 1024869, 1019875, 1016489, 1014726, 1014443, 1015186, 1016815, 1019361, 1022119, 1023939, 1024569, 1024688, 1024486, 1023389, 1021392, 1019413, 1017951, 1016593, 1015255, 1014728, 1015476, 1017022, 1019135, 1022614, 1028244, 1035725, 1044192, 1053056, 1061966, 1070705, 1079545, 1089067, 1099396, 1110350, 1122350, 1136217, 1151834, 1168054, 1184246, 1201005, 1218988, 1237937, 1257154, 1276003, 1293578, 1308697, 1320567, 1328864, 1333186, 1333394, 1330607, 1326843, 1323444, 1320689, 1318888]
58343A318888j64J609K861M041N897Q173J0259J2329J4667J6704J7843J8477J9166
58330A450750J9700J9834J9917J9904J8927J6748J4289J1871Q584M471J488R07
58318A607390J473J659J925L114M428M951N508P097Q981J0234J1592J3889J6148
58305A698389J7206J7647J8294J8522J7933J7871J9158K0248J9759J8909J9160
58294A903096J9600J9097J8900K0321K1949K2103K2007K3525K5687K6614K6991
58283B149890K8285K9465K8969K8129K9080L0972L1779L2039L3120L3696L1981
58272B487405K9711K9747L1293L1803L2072L4893M0021M4984M9731N5806O2095
58261B929561O6134O8769P2711P7277P9325P8712P8106P8041P6925P5339P5535
$$ y = [1318888, 1318724, 1320333, 1323194, 1327235, 1333132, 1341305, 1351564, 1363893, 1378560, 1395264, 1413107, 1431584, 1450750, 1470450, 1490284, 1510201, 1530105, 1549032, 1565780, 1580069, 1591940, 1600524, 1604995, 1606483, 1607390, 1608863, 1610522, 1612447, 1615561, 1619989, 1624940, 1630448, 1637545, 1646526, 1656760, 1668352, 1682241, 1698389, 1715595, 1733242, 1751536, 1770058, 1787991, 1805862, 1825020, 1845268, 1865027, 1883936, 1903096, 1922696, 1941793, 1960693, 1981014, 2002963, 2025066, 2047073, 2070598, 2096285, 2122899, 2149890, 2178175, 2207640, 2236609, 2264738, 2293818, 2324790, 2356569, 2388608, 2421728, 2455424, 2487405, 2517116, 2546863, 2578156, 2609959, 2642031, 2676924, 2716945, 2761929, 2811660, 2867466, 2929561, 2995695, 3064464, 3137175, 3214452, 3293777, 3372489, 3450595, 3528636, 3605561, 3680900, 3756435]
58250C756435P7140P8055P8989Q2414Q7820R2708R7423J04059J11661J17651J22977
58239D807332J30441J39179J46336J53068J62823J74884J85731J95777K08310
58230F303881K22900K36529K50303K68127K89715L11749L34796L61788L91211
58221H970999M19601M49299M85461N27092N69825O15845O71386P36112Q05271
58212A4250891Q80813R69578J072259J185840J315359J470964J655394J867817
58204B4668915K117874K421573K786583L218603L739854M384263N180897O166908
58196E4685470P415900R030747J1113058J3763918J7097272K1200529K6066381
58189A60373275L1557315L7315132M2488637M5493337M4322484L7555576K5394656
$$ y = [3756435, 3833575, 3911630, 3990619, 4073033, 4160853, 4253561, 4350984, 4455043, 4566704, 4684355, 4807332, 4937773, 5076952, 5223288, 5376356, 5539179, 5714063, 5899794, 6095571, 6303881, 6526781, 6763310, 7013613, 7281740, 7571455, 7883204, 8218000, 8579788, 8970999, 9390600, 9839899, 10325360, 10852452, 11422277, 12038122, 12709508, 13445620, 14250891, 15131704, 16101282, 17173541, 18359381, 19674740, 21145704, 22801098, 24668915, 26786789, 29208362, 31994945, 35213548, 38953402, 43337665, 48518562, 54685470, 62101370, 71132117, 82245175, 96009093, 113106365, 134306894, 160373275, 191930590, 229245722, 271734359, 317227696, 361550180, 399105756, 424500412]
58182D24500412R829661o213013k0028778k9878767l5198129l6485577l4967284
58175B71558525l2058931k8843323k5854605k3201098k0798810j8529991j6319787
58168A05951980j4169586j2140066j0296517q674026p284085o124973n175877
58161D2086850m399499l761477l239095k810786k452255k147263j890286j674902
58153A9711287j489898j328857j192511j078690r79592q91174q15657p52350o94695
58144A0487863o38666n85928n36934m88899m42300m01588l67525l35959l05727
58135F384337k80555k61856k46592k33613k24930k19193k11020j98823j86715
58126D321040j76863j66554j54670j44422j37119j29387j19428j10359j04499
$$ y = [424500412, 434330073, 428117060, 408088282, 378209515, 343011386, 306525809, 271558525, 239499594, 210656271, 184801666, 161600568, 140801758, 122271767, 105951980, 91782394, 79642328, 69345811, 60671785, 53387700, 47262727, 42086850, 37687351, 33925874, 30686779, 27875993, 25423738, 23276475, 21386189, 19711287, 18221389, 16892532, 15700021, 14621331, 13641739, 12750565, 11934908, 11182558, 10487863, 9849197, 9263269, 8726335, 8237436, 7795136, 7393548, 7026023, 6690064, 6384337, 6103782, 5841926, 5595334, 5361721, 5136791, 4917598, 4706578, 4507755, 4321040, 4144177, 3977623, 3822953, 3678531, 3541412, 3412025, 3292597, 3182238, 3077739]
58117C077739r9515r3086q6720q2080p7843p2799o8299o5196o1938n7754n4259
58106B258250n2153m9793m6654m4664m4561m4422m3419m3427m5287m6961m7080
58095A749829m6993m7559m7168m4687m1416l8485l5182l1340k8482k7119k5702
58084A335696k3571k2125k1851k1121j9379j8529j9621k0938k0913k0276j9823
58073A107549j8691j6587j5221j5671j6552j6303j5282j4287j3024j1405j0343
58062I44183j0030r373q146p684q458r037q532p999q435r376j0299j1291j1593
58049H23930r847o637m491m390m681m260m203n105n611m993m700n709o692o463
58035G46148n960o127o060n052m459n619p669r185j0236j1174j1130r634q088
$$ y = [3077739, 2978224, 2885138, 2798418, 2716338, 2638495, 2565696, 2497397, 2432201, 2370263, 2312509, 2258250, 2206097, 2156304, 2109650, 2064986, 2020425, 1976003, 1932584, 1889157, 1843870, 1796909, 1749829, 1702836, 1655277, 1608109, 1563422, 1522006, 1483521, 1448339, 1416999, 1388517, 1361398, 1335696, 1312125, 1290000, 1268149, 1247028, 1227649, 1209120, 1189499, 1168561, 1147648, 1127372, 1107549, 1088858, 1072271, 1057050, 1041379, 1024827, 1008524, 993242, 978955, 965931, 954526, 944183, 934153, 924780, 916634, 908950, 900492, 891455, 882923, 874924, 866489, 857113, 846814, 835523, 823930, 814083, 807446, 802955, 798565, 793884, 789624, 785421, 780316, 774705, 769712, 765012, 759303, 752611, 746148, 740188, 734061, 728001, 722949, 718490, 712871, 705202, 696017, 685781, 674607, 663477, 653843, 645755]
58022F45755p857q207p862p134o894o696n748m562m023l818l273k720k674k698
58008E71589k339k159k532k578j583l66M7N0L92O34R3n18N8J773L529M632N001
57991E75723M526L304J996J120N14K2m6K84K72m42j254j601j657j612j276q45
57975E79028q74j115o42M48R15M02j8J62R7m28j17J680L613M396M633N255N680
57958F03115M975L614K610J950J237P24N08k06j741k992l092k923l590m466m261
57943E95462l145k286k007j756j261m76R89L209N297O438O988P620Q164Q237Q134
57928F39607Q116P556N871L583J544j32j589k584l227m336o159p670q053p775
57914F24752p401o599n329m594m751m434k603m32M19K21J98K06p08k268l400m074
$$ y = [645755, 637898, 629691, 621829, 614695, 607801, 601105, 595357, 590795, 586772, 582954, 579681, 576961, 574287, 571589, 569250, 567091, 564559, 561981, 560398, 560032, 560079, 560129, 560521, 561155, 561248, 560730, 560788, 562561, 566090, 570722, 575723, 580249, 583553, 585549, 586669, 587183, 587205, 587159, 587443, 587715, 587273, 586019, 584418, 582761, 581149, 579873, 579028, 578154, 577039, 576397, 576845, 577760, 578162, 578144, 578306, 578403, 577975, 577858, 579538, 583151, 587547, 592180, 597435, 603115, 608090, 611704, 614314, 616264, 617501, 618225, 618733, 618527, 616786, 613794, 610702, 607779, 604189, 599723, 595462, 592317, 590031, 588024, 586268, 585007, 584531, 585520, 588729, 594026, 600464, 607452, 615072, 623236, 631473, 639607, 647723, 655279, 661150, 664733, 666277, 666145, 664556, 661972, 658745, 654409, 648250, 640580, 632527, 624752, 617351, 610752, 605423, 600829, 596078, 591644, 589041, 588609, 589028, 589249, 589447, 589653, 588945, 586677, 583277, 579203]
57898E79203m993n879n862n161m783m798m493l943l952m513m761m370l784l223
57884E14688k569k052j957j896j333n77k56k81k97o78j904l338l809l102k001
57869D88638j196j015j676k836l489l273l083l471l373j726N85J928K243K625
57855D70881L252L526L700M515N519N593M935M865N676O305O121N526M813L957
57841E39184L488L981M675M163K530J263R49P48L16M52J308J647P16n05p59j36
57825E64020M89P20O21J90m34q24p32l29K23Q42J097N12n70j090o06J24j3j509
57807E62731m087o871q725r087q491p796p108o118n020m292l820l220k743k838
57793D82515l040k432j115p2L82Q51J556K040K292K911L893M397M073L647L719
$$ y = [579203, 574210, 568331, 562469, 557308, 552525, 547727, 543234, 539291, 535339, 530826, 526065, 521695, 517911, 514688, 512119, 510067, 508110, 506214, 504881, 504304, 504048, 503767, 503470, 502792, 500888, 497550, 493741, 490639, 488638, 487442, 486427, 484751, 481915, 478426, 475153, 472070, 468599, 465226, 463500, 464085, 466013, 468256, 470881, 474133, 477659, 481359, 485874, 491393, 496986, 501921, 506786, 512462, 518767, 524888, 530414, 535227, 539184, 542672, 546653, 551328, 555491, 558021, 559284, 560233, 560981, 561297, 561749, 563057, 564704, 565420, 564915, 564156, 564020, 564509, 565229, 565850, 566040, 565606, 564782, 564050, 563721, 563944, 564786, 565883, 566395, 565825, 564735, 564129, 564253, 564240, 562731, 558644, 551773, 543048, 533961, 525470, 517674, 510566, 504448, 499428, 495136, 491316, 488096, 485353, 482515, 479475, 477043, 475928, 475856, 476238, 477089, 478645, 480685, 482977, 485888, 489781, 494178, 498251, 501898, 505617]
57778E05617L987M032M074M441M973N303N220M618L632K814K500K070O52j505
57764E52428l258m130m680n308n748n925o253o782o978o662o307o149n850n285
57750D73113m760m165k829o77J331K285K238J665P99j37o85o49m03m50r67j865
57734D63844k758k924j933l70O40P17M28L10L96O40J026J291J199J068J253J339
57718D66166P82N8R1O60O33j99q51q31q07j218j583j630j870k418k446j547o30
57701D52360o24j120j182p57m84n44n19j15N02R69R86N79J88K36O28J001J296
57684D53400J570J593J397J820L468N514O711P372Q963J1938J5564J9902K6031
57671E65243L3955M2260N0564O0271P1474Q0648Q2880P5463N8409L3228L151k6404
$$ y = [505617, 509604, 513636, 517710, 522151, 527124, 532427, 537647, 542265, 545897, 548711, 551211, 553281, 553933, 552428, 549170, 545040, 540360, 535052, 529304, 523379, 517126, 510344, 503366, 496704, 490397, 484248, 478398, 473113, 468353, 464188, 461359, 460682, 462013, 464298, 466536, 468201, 469000, 468863, 468178, 467529, 467126, 466676, 465709, 463844, 461086, 458162, 456229, 455859, 456499, 457216, 457644, 457954, 458350, 458990, 460016, 461307, 462506, 463574, 464827, 466166, 466948, 467006, 467097, 467757, 468390, 468191, 467340, 466509, 465702, 464484, 462901, 461271, 459401, 456983, 454537, 452990, 452360, 451736, 450616, 449434, 448677, 448193, 447649, 447130, 447015, 447517, 448486, 449472, 450051, 450239, 450475, 451103, 452104, 453400, 454970, 456563, 457960, 459780, 463248, 468762, 475473, 482845, 491808, 503746, 519310, 539212, 565243, 599198, 641458, 692022, 752293, 823767, 904415, 987295, 1062758, 1121167, 1154395, 1157546, 1131142]
57659A131142m9933o4803p1423p1255o5895n7537m8584m0394l3178k7020k2179
57648E78941j8516j5511j2828j0400q111n961m294l309k659j984j500j448j415
57635D91005q34J42Q74J058P84K11l20k86K98O16P1q79j519j936k503k875k378
57618D81529j204k89j59n28r40j171j128r07q24r54r10n06k39n38j003r66n02
57601D68761j93k22k94k57j29J13K01m78j947l044k656j304n27q51j341j215q54
57584D53763r50j395j466p94K10P03J55j022j712j222o2O36L28o25j580k141k260
57567D40566k243k473k838k693j720m59L93Q39J240J538J500J403J649J933J591
57552D40226Q30P24J814L326M071L681K641J505M24o41j518j788j202j11P68J096
$$ y = [1131142, 1081209, 1016406, 944983, 873728, 807833, 750296, 701712, 661318, 628140, 601120, 578941, 560425, 544914, 532086, 521686, 513575, 507614, 503320, 500011, 497352, 495368, 493868, 492420, 491005, 490171, 490313, 491187, 492245, 493029, 493240, 492920, 492634, 492932, 493548, 493619, 492740, 491221, 489285, 486782, 483907, 481529, 480325, 480036, 479877, 479349, 478409, 477238, 476110, 475203, 474379, 473425, 472515, 472009, 471770, 471232, 470229, 469263, 468761, 468568, 468346, 468052, 467795, 467666, 467779, 467980, 467502, 465555, 462511, 459855, 458551, 458024, 457173, 455832, 454617, 453763, 452813, 451418, 449952, 449158, 449368, 450071, 450226, 449204, 447492, 446270, 446208, 446844, 447172, 446547, 444967, 442826, 440566, 438323, 435850, 433012, 430319, 428599, 428140, 428533, 429372, 430612, 432150, 433650, 435053, 436702, 438635, 440226, 441056, 441780, 443594, 446920, 450991, 454672, 457313, 458818, 459242, 458601, 457083, 455295, 454093, 453982, 454750, 455846]
57536D55846J191J485J961K230J891P41r72k380k600j767r35p10o04o3N84P92
57520D56690P60R62J252J228J126J487K226K783L047L284L375K966K331K181K559
57505D88257K700K204J487R20K43o65j176p64j9q5j119j997j829j210j354k328
57489D83265k871k218j205r35j071m72Q63J752J726J643K097K479K218J786J658
57474D90715J353M28m71o51o16j165j902j927j477j497j866j548m47L01N5m64
57458D78821m49k0M03Q47J403J760J634J166O42K28J78P51J735K448K460K021
57442D96028J689J827K374K833K595J614O03J83J49L5k4L09O58L93j92j21Q55
57425E11808J944K526K760K832K519J782J035M56k84j286k004j932j208k74N75
$$ y = [455846, 457037, 458522, 460483, 462713, 464604, 465345, 464373, 461993, 459393, 457626, 456691, 455981, 455377, 455314, 455898, 456690, 457450, 458412, 459664, 460892, 462018, 463505, 465731, 468514, 471561, 474845, 478220, 481186, 483517, 485698, 488257, 490957, 493161, 494648, 495568, 495811, 495146, 493970, 493206, 493187, 493102, 491983, 489986, 488157, 486947, 485593, 483265, 480394, 478176, 476971, 476036, 474965, 474493, 475356, 477108, 478834, 480477, 482574, 485053, 487271, 489057, 490715, 492068, 492496, 492025, 491374, 490758, 489593, 487691, 485764, 484287, 482790, 480924, 479376, 478929, 479230, 479285, 478821, 478372, 478352, 478755, 479602, 481005, 482765, 484399, 485565, 486207, 486435, 486613, 487364, 489099, 491547, 494007, 496028, 497717, 499544, 501918, 504751, 507346, 508960, 509563, 509746, 509895, 509930, 509906, 510215, 510873, 511266, 511074, 510953, 511808, 513752, 516278, 519038, 521870, 524389, 526171, 527206, 527662, 527378, 526092, 524088, 522156, 520948, 520674, 521249]
57410E21249J096J063P01O35J123J728J921J657J101L32m35p47l98L34J061J608
57394E34029J812J502R01O20R32J438J744K104K969M149M912M892M482M261M178
57379E74925L674K518J279N98K81l89j426j955j543j016j359k368k971k539j235
57364E66474M57J831K009Q19o02r55l37J90K97O14J323J785J768J862K343K600
57348E82478K236J864K186K900L124K474J288J73l61j97J84J91j04j02L23O89
57332E99346Q28J189J884K257J880J252R91Q99M81j21l73k39j74l74n29l51O9
57315F08915M33N57N20N05O00P45R76J428J913J914J359J019J478K114J938J145
57299F27559P81J040J040M34mJ94L67k0l60M7P84J017Q31R45J562K241K690K909
$$ y = [521249, 522345, 523408, 524109, 524744, 525867, 527595, 529516, 531173, 532274, 532606, 532171, 531424, 531026, 531360, 532421, 534029, 535841, 537343, 538244, 538864, 539796, 541234, 542978, 545082, 548051, 552200, 557112, 562004, 566486, 570747, 574925, 578599, 581117, 582396, 582994, 583275, 582886, 581460, 579505, 577962, 576946, 575587, 573219, 570248, 567709, 566474, 566931, 568762, 570771, 571590, 570988, 570033, 569696, 569886, 570183, 570797, 572120, 573905, 575673, 577535, 579878, 582478, 584714, 586578, 588764, 591664, 594788, 597262, 598550, 598723, 598362, 598165, 598349, 598540, 598436, 598334, 598657, 599346, 600174, 601363, 603247, 605504, 607384, 608636, 609627, 610526, 611007, 610886, 610513, 610274, 610100, 609726, 609197, 608846, 608915, 609348, 609905, 610425, 610930, 611530, 612275, 613251, 614679, 616592, 618506, 619865, 620884, 622362, 624476, 626414, 627559, 628340, 629380, 630420, 630854, 630850, 631044, 631411, 631391, 631031, 631078, 631862, 632879, 633710, 634655, 636217, 638458, 641148, 644057]
57281F44057K847K506K222K310K575K580K236J754J324J096J252J743K257K664
57267F73423L131L631L808L615L557L939M334M196L522K603J613Q83R29J678K182
57252G17044J709P12J48K27M65N66N96N95N82P91J343J888K079K077K158K150
57236G35130J766J257J191J753K678L617M150L903L081K539K787L314L370K986
57222G73522K557J999J200Q44J723L346M266L927L270L265L740M014M009M116
57208H15798M367M297L639K843K740L634M818N253M758M207M375N076N708O153
57194H77666O624P074P398P880Q737R501R578R258R383R988J0204R596Q938R285
57180A001110J0823J2892J4763J6076J6828J7190J7311J7257J7316J8029J9584
$$ y = [644057, 646904, 649410, 651632, 653942, 656517, 659097, 661333, 663087, 664411, 665507, 666759, 668502, 670759, 673423, 676554, 680185, 683993, 687608, 691165, 695104, 699438, 703634, 707156, 709759, 711372, 712255, 713184, 714862, 717044, 718753, 719465, 719613, 719840, 720305, 720871, 721467, 722062, 722644, 723435, 724778, 726666, 728745, 730822, 732980, 735130, 736896, 738153, 739344, 741097, 743775, 747392, 751542, 755445, 758526, 761065, 763852, 767166, 770536, 773522, 776079, 778078, 779278, 780122, 781845, 785191, 789457, 793384, 796654, 799919, 803659, 807673, 811682, 815798, 820165, 824462, 828101, 830944, 833684, 837318, 842136, 847389, 852147, 856354, 860729, 865805, 871513, 877666, 884290, 891364, 898762, 906642, 915379, 924880, 934458, 943716, 953099, 963087, 973291, 982887, 991825, 1001110, 1011933, 1024825, 1039588, 1055664, 1072492, 1089682, 1106993, 1124250, 1141566, 1159595, 1179179]
57169A179179K1285K2165K2107K1919K2296K3139K3998K4639K4944K4669K3614
57158A433954K1969K0341J9451J9676K0703K1748K2344K2714K3172K3524K3443
57147A673039K3157K3179K3535K3875K4200K4832K5742K6624K7702K9725L2951
57136A958561L6791M0735M4963M9717N4590N8854O2195O4720O6641O8226O9778
57125B575771P1527P3730P7023Q2058Q8518R5026J00401J04567J08013J10947
57115C487581J13608J16817J21425J27499J34757J43534J54497J67560J82044
57106D749322J98186K17749K42841K74686L13873L61345M18964M89559N76802
57097G843327O84895Q18346R82365J183118J426560J716310K052434K431158K843635
$$ y = [1179179, 1200464, 1222629, 1244736, 1266655, 1288951, 1312090, 1336088, 1360727, 1385671, 1410340, 1433954, 1455923, 1476264, 1495715, 1515391, 1536094, 1557842, 1580186, 1602900, 1626072, 1649596, 1673039, 1696196, 1719375, 1742910, 1766785, 1790985, 1815817, 1841559, 1868183, 1895885, 1925610, 1958561, 1995352, 2036087, 2081050, 2130767, 2185357, 2244211, 2306406, 2371126, 2437767, 2505993, 2575771, 2647298, 2721028, 2798051, 2880109, 2968627, 3063653, 3164054, 3268621, 3376634, 3487581, 3601189, 3718006, 3839431, 3966930, 4101687, 4245221, 4399718, 4567278, 4749322, 4947508, 5165257, 5408098, 5682784, 5996657, 6358002, 6776966, 7266525, 7843327, 8528222, 9346568, 10328933, 11512051, 12938611, 14654921, 16707355, 19138513, 21982148]
57088B1982148L274501L703302M108652M470860M771677M995236N129887N161974
57080E7598237N058933M759395M192583L321690K176502Q48184n44050j884599
57072G5526875l076822m049659m763312n210499n409481n393873n205499m889818
57064C7527912m490965m047487l590819l145285k727805k348194k011106j717874
57056A3448377j466923j254203j074830r24323p98318o92371o02928n27794m65020
57047E641667m12117l66949l28381k95326k66137k39799k16659j96892j79168
57038C140239j62026j45803j31724j19665j08219r6738q5897p6234o7230n7991
57028B088712m7928l6664k3964r671O796K6287M7962O7168P6250O8486M2108J919
$$ y = [21982148, 25256649, 28959951, 33068603, 37539463, 42311140, 47306376, 52436263, 57598237, 62657170, 67416565, 71609148, 74930838, 77107340, 77955524, 77411474, 75526875, 72450053, 68400394, 63637082, 58426583, 53017102, 47623229, 42417730, 37527912, 33036947, 28989460, 25398641, 22253356, 19525551, 17177357, 15166251, 13448377, 11981454, 10727251, 9652421, 8728098, 7929780, 7237409, 6634481, 6106687, 5641667, 5229550, 4862601, 4534220, 4238894, 3972757, 3732958, 3516299, 3319407, 3140239, 2978213, 2832410, 2700686, 2581021, 2472802, 2376064, 2290167, 2213933, 2146703, 2088712, 2040784, 2004120, 1980156, 1970485, 1977281, 2003568, 2051530, 2118698, 2194948, 2263434, 2305542, 2307461]
57016B307461m2238p9742j04121j15036j15765j09471r8326q4865p1989o1247
57006A424661n2284m4325l7334l1460k6407k1848j7934j4938j2761j1093r703
56995A144574q566p838p702p949p990p454o489n126l035l92J693K491K713L292
56981A092222L516J626k907q746j4219j8490k1281k2575k2691k1851j9659j5864
56969I29081j1444p925n656l816j918k22J441L867P219J0732J4012J7479K0962
56956I73812K2912K1644J6781R135k3r137j6687k1892k4770k5378k3737k0559
56944I02101j7111j3998j0859p500m441j974M51L420O922J0867J5450K0513K5236
56931I29077K8776L0543K9571K4627J5520L678q842k0268k8930l3480l4050l2310
$$ y = [2307461, 2265223, 2185481, 2081360, 1966324, 1850559, 1741088, 1642762, 1557897, 1485908, 1424661, 1372377, 1328052, 1290718, 1259258, 1232851, 1211003, 1193069, 1178131, 1165370, 1154277, 1144574, 1136008, 1128170, 1120468, 1112519, 1104529, 1097075, 1090586, 1085460, 1082425, 1082033, 1083726, 1086217, 1088930, 1092222, 1095738, 1097364, 1094457, 1085711, 1071492, 1053002, 1031721, 1009146, 986455, 964604, 944945, 929081, 917637, 909712, 904056, 900240, 898322, 898100, 899541, 903408, 910627, 921359, 935371, 952850, 973812, 996724, 1018368, 1035149, 1044284, 1044261, 1035124, 1018437, 996545, 971775, 946397, 922660, 902101, 884990, 870992, 860133, 852633, 848192, 846218, 846669, 850089, 857011, 867878, 883328, 903841, 929077, 957853, 988396, 1017967, 1042594, 1058114, 1061792, 1052950, 1032682, 1003752, 970272, 936222, 903912]
56919I03912k9713k6453k2572j8945j6329j4292j2111j0061q898q568q351p833
56907G19786o935n474l533j885j215j194j003n51l96p36j103r58p0J496L403N328
56891G04960P494J0428J3988J7267J9884K2497K5261K6560K4310J8174R739R56
56879I01518o755j2378j5502j6707j6869j6039j3673r876n653j850J544N020Q968
56866H01748J3541J8595K3870K9463L5961M3590N1306N6990N8321N3377M1308
56855A228070K3430L341j5022k9560l9905m5813m6787m3265l7028k9902k2634
56844I44925j5219p707k66P200J5113K4078L4691M7111O0764P4552Q7191R6741
56832A369174R9871R2577P2675M1956N933k8684n6740p5849q5903q7958q3612
$$ y = [903912, 874199, 847746, 825174, 806229, 789900, 775608, 763497, 753436, 744538, 735970, 727619, 719786, 712851, 707377, 703844, 701959, 700744, 699550, 698547, 697996, 697600, 696864, 695761, 694803, 694733, 696229, 699632, 704960, 712454, 722882, 736870, 754137, 774021, 796518, 821779, 848339, 872649, 890823, 900562, 901518, 894763, 882385, 866883, 850176, 833307, 817268, 803595, 793719, 788066, 786216, 787760, 792780, 801748, 815289, 833884, 857754, 887217, 923178, 966768, 1018074, 1075064, 1133385, 1186762, 1228070, 1251500, 1254841, 1239819, 1210259, 1170354, 1124541, 1077754, 1034489, 997461, 967559, 944925, 929706, 921999, 921733, 928933, 944046, 968124, 1002815, 1049926, 1110690, 1185242, 1272433, 1369174, 1469045, 1561622, 1634297, 1676253, 1682186, 1653502, 1596762, 1520913, 1435010, 1347052, 1263440]
56821A263440p4903o4020n2643m1613l1271k1823j3259n156L159J2324K2749L4382
56809A031366M6481N7745O6562P0736O7338N4117L1821M717k1829m4086o0428
56798A304540p0186p3237p0495o3851n5261m6142l7437k9700k2990j7007j1360
56787H06874n691K99O647J3171J9788K6419L2309L5783L5103K9460J9150N354
56775A024666r903k4079l5097m2061m4950m4188m0746l6082l1326k6793k2641
56764F66800j9449j7584j6413j4853j2541r936p583n829m997n167n833o281o211
56751E34123n726m937m007l286k959k785k508k206j896j281l60J99j20q76j342
56736E00033j506j737j904j585r44n89p04j022j396j805j942j523q24k52L39J269
$$ y = [1263440, 1188537, 1124517, 1071874, 1030261, 998990, 977167, 963908, 958752, 961911, 974235, 996984, 1031366, 1077847, 1135592, 1202154, 1272890, 1340228, 1394345, 1426166, 1430883, 1409054, 1364968, 1304540, 1234354, 1161117, 1090622, 1026771, 971510, 925368, 887931, 858231, 835241, 818234, 806874, 801183, 801482, 808129, 821300, 841088, 867507, 899816, 935599, 970702, 1000162, 1019312, 1024666, 1014763, 990684, 955587, 913526, 868576, 824388, 783642, 747560, 716234, 689441, 666800, 647351, 629767, 613354, 598501, 585960, 576024, 568441, 562612, 557615, 552448, 546615, 540334, 534123, 528397, 523460, 519453, 516167, 513208, 510423, 507915, 505709, 503813, 502532, 502172, 502371, 502251, 501375, 500033, 498527, 496790, 494886, 493301, 492357, 491768, 491064, 490042, 488646, 486841, 484899, 483376, 482552, 482300, 482639, 483908]
56720D83908K193K407J888J272Q63L86l06r32j201j060o09j93k87p68p31L11J462
56703D88603J523O15k21p08j456k536l131k867k379k283k421k450k353k109j546
56688D64281q46n57q40j209j217q66l11K69M95J08m67o09m45o36j188j389j074
56671D53499r27j316j695j539j001k77Q01K017K434J537J37n82m50j69j41j10
56655D52218K28Q20J407J736J660J263Q39O21N93O13N91M82K83O7j25l17l99j75
56637D62405K29L16Nj4P58J728J950J457J001P51K68m50q83r85j188j407j123
56620D64818o22q74j882k384j740r60j071j530j241l49J27q4l42l17l77q05j385
56603D48982j885k332k744k952k857k540k174j937j926k000j893j542j179q69
$$ y = [483908, 486101, 488508, 490396, 491668, 492531, 492917, 492611, 491679, 490478, 489418, 488809, 488616, 488329, 487561, 486830, 487141, 488603, 490126, 490741, 490520, 489812, 488356, 485820, 482689, 479822, 477443, 475160, 472739, 470289, 467936, 465827, 464281, 463435, 462878, 462038, 460829, 459612, 458746, 458435, 458704, 459199, 459307, 458840, 458231, 457786, 457150, 455962, 454573, 453499, 452572, 451256, 449561, 448022, 447021, 446744, 447545, 449562, 451996, 453533, 453670, 453088, 452638, 452469, 452328, 452218, 452446, 453266, 454673, 456409, 458069, 459332, 460171, 460792, 461385, 461998, 462589, 463071, 463354, 463421, 463296, 462979, 462580, 462405, 462634, 462950, 462955, 462941, 463699, 465427, 467377, 468834, 469835, 470586, 470854, 470404, 469521, 468536, 467348, 465941, 464818, 464196, 463322, 461440, 459056, 457316, 456356, 455285, 453755, 452514, 452165, 452292, 452208, 451866, 451549, 451172, 450367, 448982, 447097, 444765, 442021, 439069, 436212, 433672, 431498, 429561, 427635, 425635, 423742, 422200, 421021, 420152]
56589D20152l79L54Q68O31k76j126j177l20P68J154O10LL25J435K168J731N20
56572D27441n47r62o66K22J326K011J949J594J772K843M390N839P182Q957J1267
56557D74618J3054J2911J0694P757N274L051N39j779k884k677j909j079l56k63
56543E16951j250k691l392l103k569k170j709j498k254l660m325l678k792k773
56529D79087l408l922m112m124l949l707l672l591k835j636j183j936k849k894
56515D35269k437k312k454k307j877j527j273j003r22j104j187j035j104j607
56501D13120j931j564r36p19q72r97j040j045p66k13P3j73m81m98o16j086j336
56484C98920q82j54K94O31J014R12P1o71n59j68l64p63m82J86J94m57p26j59P18
$$ y = [420152, 419773, 420127, 420995, 421626, 421350, 420224, 419047, 418727, 419495, 420649, 421259, 421262, 421587, 423022, 425190, 426921, 427441, 426894, 425932, 425266, 425488, 426814, 428825, 430774, 432368, 434140, 436983, 441373, 447212, 454394, 463351, 474618, 487672, 500583, 511277, 519034, 524308, 527359, 527898, 526119, 523235, 520558, 518649, 517570, 517214, 516951, 515701, 513010, 509618, 506515, 503946, 501776, 500067, 498569, 496315, 492655, 488330, 484652, 481860, 479087, 475679, 471757, 467645, 463521, 459572, 455865, 452193, 448602, 445767, 444131, 442948, 441012, 438163, 435269, 432832, 430520, 428066, 425759, 423882, 422355, 421082, 420079, 419157, 418053, 416866, 415831, 414727, 413120, 411189, 409625, 408689, 407970, 407098, 406101, 405061, 404016, 403250, 403037, 403110, 402937, 402456, 401958, 401342, 400256, 398920, 398038, 397884, 398178, 398809, 399823, 400735, 400806, 400135, 399576, 399408, 399044, 398281, 397799, 397985, 398179, 397722, 396996, 396837, 397555]
56465C97555J458K061K325J934J153N68J61l78p23l19L80K67p43j475j178m25
56449D02621p3k32n71q58r02n53o2R5o1r0Q6O3k06k27J55L94J12k50p6N08P94
56428D00667L33o20j401j477q72j75j6m17q05o18J26Q31R06M06N9L64P93L77q78
56409C97583j772j379j70P16Q35N89M22M28N04N25M74N97J113J701J770J299P96
56392D06031L22n70j624j747o65L33J38o09o64o4L17L85O83J129J197J161J781
56375D07534K823L109K248J219R13J031Q03J14m92n79k43J08K31L82Q79J398J202
56358D22680L57j5P58J860K085J417O96L06P0M7M17Q29P47K91M5K20O13J094J528
56339D36045J623J484J823K889L802L782L417L701M366M364L563K783K421K214
$$ y = [397555, 399013, 401074, 403399, 405333, 406486, 407054, 407215, 406837, 406114, 405795, 406175, 406442, 405699, 404224, 403046, 402621, 402548, 402316, 401745, 400887, 399985, 399432, 399370, 399465, 399404, 399314, 399400, 399463, 399257, 399030, 399185, 399579, 399691, 399441, 399365, 399873, 400667, 401000, 400380, 398979, 397502, 396630, 396455, 396439, 396022, 395217, 394599, 394725, 395556, 396462, 396868, 396927, 397291, 398084, 398461, 397583, 395811, 394432, 394262, 394978, 395813, 396402, 396824, 397252, 397756, 398281, 398755, 399352, 400465, 402166, 403936, 405235, 406031, 406353, 405783, 404159, 402412, 401747, 402080, 402218, 401609, 400945, 400881, 401198, 401583, 402266, 403395, 404592, 405753, 407534, 410357, 413466, 415714, 416933, 417846, 418877, 419680, 419794, 419302, 418723, 418480, 418588, 418819, 419201, 420080, 421478, 422680, 423037, 423022, 423780, 425640, 427725, 429142, 429838, 430144, 430214, 430261, 430678, 431507, 432254, 432545, 432590, 432810, 433423, 434517, 436045, 437668, 439152, 440975, 443864, 447666, 451448, 454865, 458566, 462932, 467296, 470859, 473642, 476063, 478277]
56325D78277K183K580L013K745J859J052M36m10j298j586j466j838k751l139k414
56310D77243j297n98j78M78J300J812J810J619J789K568L450L563K853K365K845
56295E01622L573L425K524J968K273K989L592L884L793L544L667M225M548M459
56281E50086M929O449P745P472O402O347P538Q765R618J0715J1908J2244J1797
56268F62015J1796J2754J3970J5107J6646J8637K0473K2128K4292K6985K9571
56257H74374L2193L5813M0593M5703N0950N7122O4506P2567Q1252R1104J01770
56246A547947J11954J21165J29972J38233J44688J48685J50666J50494J46972
56237B790776J39492J28528J13991R4914P1553M6048K0215n758l1567n5518p6078
$$ y = [478277, 480460, 483040, 486053, 488798, 490657, 491709, 492145, 491735, 490437, 488851, 487385, 485547, 482796, 479657, 477243, 475946, 475348, 475170, 475648, 476948, 478760, 480570, 482189, 483978, 486546, 489996, 493559, 496412, 498777, 501622, 505195, 508620, 511144, 513112, 515385, 518374, 521966, 525850, 529643, 533187, 536854, 541079, 545627, 550086, 555015, 561464, 569209, 576681, 583083, 589430, 596968, 605733, 615351, 626066, 637974, 650218, 662015, 673811, 686565, 700535, 715642, 732288, 750925, 771398, 793526, 817818, 844803, 874374, 906567, 942380, 982973, 1028676, 1079626, 1136748, 1201254, 1273821, 1355073, 1446177, 1547947, 1659901, 1781066, 1911038, 2049271, 2193959, 2342644, 2493310, 2643804, 2790776, 2930268, 3058796, 3172787, 3267701, 3339254, 3385302, 3405517, 3399759, 3368192, 3312674, 3236596]
56226C236596r3297j07627j18743j26545j31917j35279j35667j32480j27015j21071
56216B006955j14967j08122j00559r2758q4859p7186p0691o5753o1242n5903n0019
56205A124896m4727m0337l6344l2590k9376k6711k4227k1706j9192j6889j5148
56194H17649j4153j3427j2263j0751r594q922q186p269o570n945m807l482l134
56181G09146l905m443l826k688j971j730j660j650j334k19J331K335K672L082
56167F95140L608L564L190L542M439M402L232K663L662N027N560N761O304O708
56153G56802O749P425R171J0756J1251J1605J2922J4731J6361J8525K2035K6244
56141I24577L0245L4512M0013M6784N4604O3865P4414Q4559R2407R7109R7984
$$ y = [3236596, 3143299, 3035672, 2916929, 2790384, 2658467, 2523188, 2387521, 2255041, 2128026, 2006955, 1891988, 1783866, 1683307, 1590549, 1505690, 1428504, 1357813, 1292060, 1230818, 1174915, 1124896, 1080169, 1039832, 1003488, 970898, 941522, 914811, 890584, 868878, 849686, 832797, 817649, 803496, 790069, 777806, 767055, 757461, 748539, 740353, 733084, 726514, 720569, 715762, 712280, 709146, 705241, 700798, 696972, 694284, 692313, 690583, 688923, 687273, 685939, 685720, 687051, 689386, 692058, 695140, 698748, 702312, 705502, 709044, 713483, 717885, 721117, 723780, 727442, 732469, 738029, 743790, 750094, 756802, 763551, 770976, 780147, 790903, 802154, 813759, 826681, 841412, 857773, 876298, 898333, 924577, 954822, 989334, 1029347, 1076131, 1130735, 1194600, 1269014, 1353573, 1445980, 1543089, 1641073]
56130A641073R3891Q4838P3068O1393N1471M4303M0611L9338L7386L2357K4523
56119B224252J5311N548l689j0466j4030j6183j9319k4425l2007m2870n6306o9268
56107A956548p9058q5382q8422q6995q0572p1248o1616n2148m2621l4246k8165
56096A246075k3334j8230j3370j0001p676n302l376k831k832j908k68R73J804
56083A159724K623K845K139J803K912M414N041N644P474R659J0622J0698J1042
56070A236640J1382J1108J1191J2550J3881J3669J3014J3904J5887J7098J7478
56059A387802J8317J9591K0270K0382K0465J9996J8560J7331J7244J7104J5808
56048A592870J4783J5713J7525J8268J8382J9342K0647K1076K1349K2651K4082
$$ y = [1641073, 1734964, 1819802, 1892870, 1954263, 2005734, 2050037, 2090648, 2129986, 2167372, 2199729, 2224252, 2239563, 2245111, 2241422, 2230956, 2216926, 2200743, 2181424, 2156999, 2124992, 2082122, 2025816, 1956548, 1877490, 1792108, 1703686, 1616691, 1536119, 1464871, 1403255, 1351107, 1308486, 1274240, 1246075, 1222741, 1204511, 1191141, 1181140, 1173464, 1168162, 1164786, 1161955, 1159123, 1157215, 1156947, 1157920, 1159724, 1162347, 1165192, 1167331, 1169134, 1172046, 1176460, 1181501, 1187145, 1194619, 1204278, 1214900, 1225598, 1236640, 1248022, 1259130, 1270321, 1282871, 1296752, 1310421, 1323435, 1337339, 1353226, 1370324, 1387802, 1406119, 1425710, 1445980, 1466362, 1486827, 1506823, 1525383, 1542714, 1559958, 1577062, 1592870, 1607653, 1623366, 1640891, 1659159, 1677541, 1696883, 1717530, 1738606, 1759955, 1782606, 1806688]
56037A806688K4298K4062K4346K3828K1398J9127J9508K1685K3673K6177L0559
56026B065349L5274L8283M0963M5541N0615N3500N5067N7864O1241O2924O3677
56015B630298O5804O8650P0207P1442P4408P7879P9720Q1540Q5969R1370R4598
56004C491885R6954J01699J07752J11965J15571J22036J30250J36607J42111J50500
55994D707330J60850J69216J76340J86394J99269K11560K24044K40470K60083
55985F535556K79059K98325L21896L48794L75005M02084M35062M73198N12043
55976I981022N53100O01848O57960P17761P84369Q64364R56762J057445J172082
55967A7346713J311387J476384J663378J881025K146276K466617K845581L304289
$$ y = [1806688, 1830986, 1855048, 1879394, 1903222, 1924620, 1943747, 1963255, 1984940, 2008613, 2034790, 2065349, 2100623, 2138906, 2179869, 2225410, 2276025, 2329525, 2384592, 2442456, 2503697, 2566621, 2630298, 2696102, 2764752, 2834959, 2906401, 2980809, 3058688, 3138408, 3219948, 3305917, 3397287, 3491885, 3588839, 3690538, 3798290, 3910255, 4025826, 4147862, 4278112, 4414719, 4556830, 4707330, 4868180, 5037396, 5213736, 5400130, 5599399, 5810959, 6035003, 6275473, 6535556, 6814615, 7112940, 7434836, 7783630, 8158635, 8560719, 8995781, 9468979, 9981022, 10534122, 11135970, 11793930, 12511691, 13296060, 14160424, 15117186, 16174631, 17346713, 18658100, 20134484, 21797862, 23678887, 25825163, 28291780, 31137361, 34441650]
55959C4441650L878087M595865N488410O617783Q074349R947996J2330314J5333486
55951A00707940J9055137K3507712K8588700L4021955L9115625M2479229M2196705
55944C29673003L6701557K5828975J1164147m610251j8811208k9562161l6059224
55937C14324838l8465296l7614927l4623684l0533394k6128689k1920422j8187430
55930A06850996j5022947j2403456j0265706q542441p159121o039508n126803
55923D2291014m385145l780583l277376k852875k498676k204274j952826j733838
55915A9605421j546109j385932j244022j115890j003992r07667q20747p40755
55907A0840307o71094o12530n60821n13959m73737m39224m06290l74425l46828
$$ y = [34441650, 38319737, 42915602, 48404012, 55021795, 63096144, 73044140, 85374454, 100707940, 119763077, 143270789, 171859489, 205881444, 244997069, 287476298, 329673003, 366374560, 392203535, 403367682, 398757431, 379946223, 350384062, 314324838, 275859542, 238244615, 203620931, 173087537, 146958848, 125038426, 106850996, 91828049, 79424593, 69158887, 60616446, 53457325, 47417817, 42291014, 37905869, 34125286, 30847910, 27995035, 25496359, 23292085, 21339259, 19605421, 18059312, 16673380, 15429358, 14313468, 13309476, 12401809, 11581062, 10840307, 10169213, 9556683, 8995862, 8481903, 8008166, 7568942, 7162652, 6788227, 6441399]
55898F441399l23363l00423k77829k58711k42498k25378k07844j94413j85287
55889D225653j75565j63483j52431j43773j34572j23774j14100j06240r7266q6394
55879B928055p6709o9910o4737o1615o3068o8204p2277p3298p3824p4931p3943
55868B155539o9814o5475o2757n9821n5554n1931m9991m7909m5031m3552m4198
55857A559506m4415m2834m1472m1412m0286l6387l1744k8713k6787k4939k4047
55846A176470k4722k5488k5153k4545k4338k3687k2404k1867k2339k2064k0259
55835I19604j8321j6925j4905j2186j0738j1112j1129r658q554r113r606q468
55823G78889p112p350q535r459j0693j2780j4234j3625j1935j0755r904q638p488
$$ y = [6441399, 6118036, 5817613, 5539784, 5281073, 5038575, 4813197, 4605353, 4410940, 4225653, 4050088, 3886605, 3734174, 3590401, 3455829, 3332055, 3217955, 3111715, 3014449, 2928055, 2851346, 2781436, 2716699, 2655084, 2592016, 2523812, 2451535, 2378237, 2304413, 2229482, 2155539, 2085725, 2020250, 1957493, 1897672, 1842118, 1790187, 1740196, 1692287, 1647256, 1603704, 1559506, 1515091, 1472257, 1430785, 1389373, 1349087, 1312700, 1280956, 1252243, 1225456, 1200517, 1176470, 1151748, 1126260, 1101107, 1076562, 1052224, 1028537, 1006133, 984266, 961927, 939863, 919604, 901283, 884358, 869453, 857267, 846529, 835417, 824288, 814630, 806076, 796963, 787357, 778889, 771777, 764427, 755892, 746433, 735740, 722960, 708726, 695101, 683166, 672411, 662507, 653869, 646381]
55810F46381o995o280m694l283k898k407n54J905L654M901O378P621P933P844
55796F59506Q001P747O338M316K377M0l151o306q486j0060j1482j1892j0464q098
55782F18386o426o032o759q733j1765j4638j6189j6364j5457j3350j0337p444
55770D84892m980k029J632M395M780L273J113j394m146o121o537o177o161o294
55756D56246n852n057m483l849k841k298l182m937o154o437o444o610o831p087
55742C84184p364p303o685n837n047m129l049k302k105k014j803j797j875j272
55728C31602p4L30q45k541l510m044m914n661n338m243l590l801m202m047l094
55713B82028j505J30J152J715K608L856M434L951L455L709L853K793Q67r54k650
$$ y = [646381, 639386, 633106, 628412, 625129, 622231, 619824, 619270, 621175, 624829, 629730, 636108, 643729, 651662, 659506, 667507, 675254, 681592, 685908, 688285, 688325, 685174, 678868, 670382, 660322, 648840, 636948, 626484, 618386, 611960, 605928, 599169, 590436, 578671, 564033, 547844, 531480, 516023, 502673, 492336, 484892, 479912, 477883, 479515, 483910, 488690, 491963, 493076, 491682, 487536, 481415, 474878, 468701, 462540, 456246, 450394, 445337, 440854, 437005, 434164, 431866, 428684, 423747, 417593, 411156, 404712, 398102, 391271, 384184, 376820, 369517, 362832, 356995, 351948, 347819, 344770, 342468, 340363, 338349, 336546, 334749, 332874, 331602, 331528, 331858, 331013, 328472, 324962, 320918, 316004, 310343, 305005, 300762, 297172, 293371, 289169, 285122, 282028, 280523, 280653, 281805, 283520, 286128, 289984, 294418, 298369, 301824, 305533, 309386, 312179, 313046, 312092, 309442]
55698C09442m583o184o558n977n542n604n517m719l284j686n83m04p00m82M46
55683B58065J310J906L027M722N537M594L154K721K721J676j78j246j054p33j215
55668B85007k310l445m111l766k397r72l00J59J258K474K640J985J873K600L052
55653B83747K743K620L322L998L647K608J887J643J183J24j200k371l396m498
55639B96057n672o691p416p949q346q390p862o889n647m064k244r48q44j456j729
55624B19910j565j687k034j624l83L14l22j258j291p72o89j079j476j974k627
55609B01443k670j677p19j002j989k257j774j658k037j811o17M07K60o83j419
55594A81797j452q64k4N25M64J54K06O00P35K83n20j306j778j642r83m87p58j457
$$ y = [309442, 304859, 298675, 292117, 286140, 280598, 274994, 269477, 264758, 261474, 259788, 259205, 258801, 258101, 257619, 258065, 259375, 261281, 264308, 269030, 274567, 279161, 282315, 285036, 287757, 289433, 289255, 288009, 286955, 286222, 285007, 282697, 279252, 275141, 271375, 268978, 268006, 267706, 267865, 269123, 271597, 274237, 276222, 278095, 280695, 283747, 286490, 289110, 292432, 296430, 300077, 302685, 304572, 306215, 307398, 307522, 306322, 303951, 300555, 296057, 290385, 283694, 276278, 268329, 259983, 251593, 243731, 236842, 231195, 227131, 224887, 223939, 223095, 221639, 219910, 218345, 216658, 214624, 213000, 212617, 212931, 212609, 211351, 210060, 209288, 208599, 207520, 206044, 204070, 201443, 198773, 197096, 196377, 195375, 193386, 191129, 189355, 187697, 185660, 183849, 183232, 183639, 183899, 183216, 181797, 180345, 179481, 179457, 179982, 180446, 180600, 180806, 181406, 182141, 182424, 181904, 180598, 178820, 177178, 176195, 175708, 174950, 173493]
55576A73493j700j117mJ258K329K759K399J839J817K315K733K726K349J697R26
55561A95819L26j59j066k525l690l788l169k616k162j474r39j217k005k297j780
55546A67258j032m20J97P34Q12M98L77P41J311J758J896J542Q12L32N53J078J302
55529A79749J346J569J549O21q20j658j648j597j923k076j602q69n02p29j466
55514A69944k361k757k257j371r61j078j084q31q17j235j663j842j911j829j319
55499A46628n59j16m6J43N57O98L88J65M56R88J297J344J317J253J019M72l65
55482A55639j064j040l92ol75q30o84m46q72j403q88M34J122O72L3j67m07r76
55464A48350j291j092j062j560j794j040K08J061J410J573J461Q67P7m84p73r09
$$ y = [173493, 171793, 170676, 170672, 171930, 174259, 177018, 179417, 181256, 183073, 185388, 188121, 190847, 193196, 194893, 195819, 196145, 195986, 194920, 192395, 188705, 184917, 181748, 179132, 176970, 175496, 174557, 173340, 171335, 169038, 167258, 166226, 165806, 166003, 166737, 167549, 168047, 168424, 169165, 170476, 172234, 174130, 175672, 176484, 176816, 177369, 178447, 179749, 181095, 182664, 184213, 184834, 184014, 182356, 180708, 179111, 177188, 175112, 173510, 172641, 172139, 171410, 169944, 167583, 164826, 162569, 161198, 160237, 159159, 158075, 157244, 156427, 155192, 153529, 151687, 149776, 147947, 146628, 146069, 145953, 145907, 146050, 146607, 147305, 147693, 147858, 148314, 149302, 150599, 151943, 153260, 154513, 155532, 156004, 155639, 154575, 153535, 153143, 153137, 152762, 151932, 151248, 150802, 149930, 148527, 147639, 148073, 149195, 149867, 149900, 149733, 149326, 148350, 147059, 145967, 144905, 143345, 141551, 140511, 140719, 141780, 143190, 144763, 146224, 147091, 147168, 146684, 145911, 145002]
55448A45002q44o46n96o01j37Q59J627J583J057O40L15j81p58j198j504j594j160
55431A41864l10K28P1j87J79R32J299R94K84o03j433j680r71K66J099J124P70
55414A43926P09J161J749J836J199M29L24P86P69l46j812k390j819r33n60p70
55398A44258j106j142q03l93k57l26j78M02J144J639J678J214L36m91o67k14P0
55381A45164l96j144j250n35K76M89J08m28q03r63r39p30m10j05J66N41J017J209
55363A41267P73N1k05R8J81m15j019q24j68l3n60r95r47p60o61m36p6O6L7L57
55343A35731J047J330O94k86o79k20O23J206J062J73q65j302j016m66Q7O88J010
55326A38817M72p27j473j099j86L92M93L19k96j386k171j686m2J547K045J448
$$ y = [145002, 144158, 143512, 142916, 142315, 142178, 143037, 144664, 146247, 147304, 147944, 148259, 148078, 147320, 146122, 144618, 143024, 141864, 141554, 141782, 141853, 141666, 141845, 142777, 144076, 145070, 145354, 144751, 143318, 141638, 140667, 140933, 142032, 143156, 143926, 144635, 145796, 147545, 149381, 150580, 151009, 151333, 152119, 152888, 152542, 150730, 148340, 146521, 145588, 145028, 144258, 143152, 142010, 141207, 140814, 140557, 140231, 140053, 140455, 141599, 143238, 144916, 146130, 146466, 145975, 145308, 145094, 145164, 144768, 143624, 142374, 141839, 142115, 142604, 142712, 142284, 141481, 140518, 139579, 138849, 138439, 138334, 138500, 139041, 140058, 141267, 142040, 142091, 141886, 141984, 142165, 141750, 140731, 139907, 139739, 139706, 139146, 138151, 137204, 136444, 135783, 135347, 135271, 135337, 135374, 135731, 136778, 138108, 138802, 138516, 137837, 137617, 138240, 139446, 140508, 140681, 139816, 138514, 137498, 137032, 137119, 137807, 138817, 139289, 138562, 137089, 135990, 135804, 136196, 136689, 137008, 136712, 135326, 133155, 131469, 131427, 132974, 135019, 136467]
55310A36467N80K91P72J381J276L23p85j394j513j465j296q36n5Q47J584J867
55294A38044J566Q65R6n87j145j404j235q13l52K50J009J376Q76Ok79J45N35N21
55276A39474L66J70k44m94J15J246J571N60q26j632j983k141j703n33N18O87L58
55259A35509K12J99J36M75J456K224J866P71l4l08m75n74m31m14r31j465j170
55242A37046j95N28O23M84L25Ll00j59L34O22N15K89L0l46n72l06J58J96r6K4
55222A39203O89J122P62P7j01M17J079J213N63n30j376j539j207q31o01m70m06
55205A38064l63k39j17k01k94J11R01J129L40n28l48N73R83N01o0l4L49O83R76
55186A42426J378J859K245K211J384q0j229j260n51j35l40o45p04o45m80m7M19
$$ y = [136467, 137047, 137338, 138110, 139491, 140767, 141090, 140305, 138911, 137398, 135933, 134637, 133801, 133746, 134593, 136177, 138044, 139610, 140475, 140571, 139984, 138839, 137435, 136200, 135387, 135035, 135285, 136294, 137670, 138546, 138552, 138273, 138418, 138953, 139474, 139840, 140010, 139766, 139272, 139387, 140633, 142204, 142764, 141938, 140306, 138323, 136182, 134479, 133946, 134464, 135151, 135509, 135721, 135920, 136056, 136531, 137987, 140211, 142077, 142848, 142814, 142506, 142031, 141457, 141026, 140612, 139681, 138216, 137046, 136851, 137379, 138002, 138486, 138811, 138814, 138514, 138355, 138689, 139311, 139826, 140115, 140145, 139799, 139227, 138921, 139079, 139275, 139179, 139203, 139892, 141014, 141776, 141853, 141752, 142169, 143248, 144461, 145024, 144494, 143118, 141579, 140372, 139541, 138940, 138470, 138064, 137701, 137462, 137345, 137144, 136850, 136961, 137862, 138991, 139331, 138803, 138455, 139028, 140011, 140512, 140452, 140418, 140767, 141450, 142426, 143804, 145663, 147908, 150119, 151503, 151423, 150194, 148934, 148383, 148248, 147908, 147263, 146559, 145914, 145434, 145387, 145806]
55169A45806L96n4l20k11k17o01r37q18m35j76j10j14p2J72O53R68O11k24o37
55150A43680o9R38J319O06o05j192n83O09J178O86o2j61K56M83K99n1n45j192
55132A45594j500r54N2O12N15L10K44J0m53q17j020j286j390q28K17R01R10P27
55114A41844O22L02j36OP82J200O81R4M51J332J512P54Mj4M37Q10J012J193J237
55095A54123Q54Q8n55o22l14k89p76j190r66l63OJ18L66O87O72N08Q34J527J589
55076A56297O25m50o73k75pJ30O33J325J351M01p88j310j098p58o96o62k12N56
55058A54389R76N77l43j092j332j242j131j223j611k028j861q56L35P99M43k4
55042A44776j38q7j08m6L07Q62J334J426J036N30N13J005J201O35J8J64O16M34
$$ y = [145806, 146202, 146148, 145828, 145617, 145400, 144799, 143862, 143044, 142609, 142433, 142323, 142209, 142137, 142309, 142962, 143930, 144541, 144317, 143680, 143611, 144549, 145868, 146474, 145869, 144677, 144094, 144703, 145881, 146567, 146505, 146344, 146600, 147083, 147382, 147331, 146786, 145594, 144094, 143140, 143192, 143804, 144319, 144629, 144873, 144883, 144430, 143613, 142593, 141307, 139917, 139089, 139306, 140207, 141117, 141844, 142466, 142768, 142632, 142638, 143420, 144620, 145301, 145395, 145846, 147178, 148690, 149444, 149448, 149434, 149871, 150681, 151693, 152886, 154123, 154977, 155065, 154510, 153888, 153574, 153285, 152509, 151319, 150353, 149990, 149996, 150114, 150480, 151167, 151839, 152347, 153181, 154708, 156297, 156922, 156472, 155799, 155524, 155517, 155647, 156280, 157605, 158956, 159357, 158569, 157259, 156161, 155403, 154707, 154045, 153833, 154389, 155365, 155942, 155599, 154507, 153175, 151933, 150802, 149579, 147968, 145940, 144079, 143223, 143558, 144357, 144800, 144776, 144638, 144551, 144443, 144397, 144704, 145566, 146900, 148326, 149362, 149892, 150405, 151410, 152611, 153246, 153264, 153428, 154044, 154478]
55024A54478j22mO75O58l50j147j034q61j351j741j079J75Q71P65L94Q2m2M11
55006A50778J531K509K440J463M30j47k64OM21M31j36o14l62L11P04P37P87R16
54988A61941R52J013J151Q92r5j229j642j379j183j355j520j385r42j71Q03J373
54972A57224J049K65r2J38L85L21J43o2l79n19k3Q70J263P22j80o13k94N16J349
54953A62083J750J584J161P53J41q46j604j300j39P13O38K06J37L11K69R2J56
54936A66105L88L28j30n39m28K04J013J679K036J993J585J173J398K529L948M712
54920A87994M673M631N234O259P188P876Q146P377N152K084p59k942m617n747
54906B32549o119o012o001o154o115n890n751n402m192k285q16n21r38j275j365
$$ y = [154478, 154356, 154352, 155027, 155685, 155335, 154188, 153154, 152293, 150942, 149201, 148122, 148297, 149168, 149933, 150327, 150409, 150367, 150778, 152309, 154818, 157258, 158721, 159151, 159004, 158740, 158746, 159167, 159598, 159462, 158848, 158486, 158797, 159501, 160238, 161025, 161941, 162893, 163906, 165057, 165949, 165854, 164625, 162983, 161604, 160421, 159066, 157546, 156161, 155219, 155048, 155851, 157224, 158273, 158538, 158446, 158584, 158969, 159290, 159433, 159371, 158992, 158473, 158450, 159320, 160583, 161305, 161125, 160512, 160218, 160734, 162083, 163833, 165417, 166578, 167331, 167472, 166626, 165022, 163722, 163583, 164296, 164934, 165140, 165277, 165588, 165857, 165949, 166105, 166493, 166821, 166691, 166152, 165724, 165928, 166941, 168620, 170656, 172649, 174234, 175407, 176805, 179334, 183282, 187994, 192667, 197298, 202532, 208791, 215979, 223855, 232001, 239378, 244530, 246614, 245855, 242913, 238296, 232549, 226430, 220418, 214417, 208263, 202148, 196258, 190507, 185105, 180913, 178628, 177812, 177291, 176353, 175078, 173713]
54891A73713j349j094m83J21L09J62Pm4Q4O81J840L074L845M276M855N573N931
54874B01501N811N742O155O707O686N777M177K056o41l686o215p325p086o572
54860B13087o659p065o862n721m191k852j735p78l55q87k085l016l051k512k127
54845A63191k084j900j321q89j281k257k798k281j096JP34J270J708J948J896
54830A54841J525R41M45L27M46M12K25L21P46R34N70R7r5l55r78j381r25p9K15
54811A58232N2L66J265J727J175L91L61R60J287Q35j22r54j187q06l30k77n22
54794A62453m82jM59N60N34O09O00L22N3J81O38J005J019P64N05M59O45Q88J042
54775A72253J152J287J371J397J568J934K183K270K876M601O862Q347Q528Q020
$$ y = [173713, 172364, 171270, 170787, 170908, 171217, 171379, 171386, 171342, 171426, 172107, 173947, 177021, 180866, 185142, 189997, 195570, 201501, 207312, 213054, 219209, 225916, 232602, 238379, 242556, 244612, 243971, 240285, 234070, 226745, 219659, 213087, 206428, 199363, 192501, 186780, 182589, 179737, 178002, 177224, 176869, 175982, 173897, 170881, 167830, 165318, 163191, 161107, 159207, 157886, 156997, 155716, 153459, 150661, 148380, 147284, 147285, 148019, 149289, 150997, 152945, 154841, 156366, 157307, 157752, 158079, 158525, 158937, 159162, 159483, 160229, 161163, 161733, 161830, 161735, 161380, 160402, 159021, 158096, 158017, 158232, 158284, 158650, 159915, 161642, 162817, 163208, 163569, 164529, 165816, 166651, 166529, 165575, 164388, 163582, 163252, 162975, 162453, 161971, 161970, 162429, 162989, 163523, 164132, 164732, 165054, 165107, 165288, 165926, 166931, 167950, 168714, 169219, 169678, 170323, 171211, 172253, 173405, 174692, 176063, 177460, 179028, 180962, 183145, 185415, 188291, 192892, 199754, 208101, 216629, 224649]
54761B24649P449O798N917M914L726K033r3k101l758n348o857p640p315o367n525
54746B10482n055m937n052m945m057k613j599j466j588j378j078r64o56M4M95
54731A75633K72J09Q14J938K574K874L554M356M375L755L641M422N294N755O251
54716B25617O877O683N003K562M64j270l300n587p252p698p185o304n414m647
54702A98549m107l767l370k643j692j019j000j365j490j238j130j454j672j143
54688A71459j39M66L09j97n96p95p75n18k85m27q22r86p76n17l48k9M60P34O18
54669A66836M17L67K55j25o14j009j286j311q71j97Q5j75m06k87l00p74j057m08
54651A59140P77J412J204P89N82L12k30p23q15n84k47J18M17M77L52L53O67J176
$$ y = [224649, 232098, 238896, 244813, 249727, 253453, 255486, 255393, 253292, 249534, 244186, 237329, 229689, 222374, 216007, 210482, 205427, 200490, 195438, 190493, 186436, 183823, 182224, 180758, 179170, 177792, 176714, 175750, 175094, 175138, 175633, 175905, 176014, 176828, 178766, 181340, 184214, 187768, 192124, 196499, 200254, 203895, 208317, 213611, 219366, 225617, 232494, 239177, 244180, 246742, 247206, 245936, 242636, 237049, 229797, 222099, 214914, 208610, 203196, 198549, 194442, 190675, 187305, 184662, 182970, 181951, 180951, 179586, 178096, 176858, 175728, 174274, 172602, 171459, 171320, 171786, 172095, 171898, 171302, 170507, 169732, 169214, 168929, 168502, 167680, 166694, 165918, 165401, 165053, 165024, 165484, 166218, 166836, 167253, 167620, 167875, 167750, 167136, 166127, 164841, 163530, 162659, 162462, 162547, 162372, 161966, 161679, 161379, 160605, 159548, 159140, 159917, 161329, 162533, 163322, 163904, 164216, 163986, 163263, 162448, 161864, 161617, 161735, 162152, 162629, 162981, 163334, 164001, 165177]
54633A65177J655J877J562O66k70n73l16k08m71m71K31J013R82J56o59j006j092
54616A68253j136r75m93O5L48J82m69j487k378k447j500j64P55J035J033J035
54600A61657R85P32K80k08n08m10M5M67M87K46K27M92N39J21k08J65R04J078M29
54581A67520l30o09o66r07j116r04n11m79p34o80j39M01N46L97J60j04k54p9K39
54562A61751K81J77N98J578K085J372K15l2P35J340J037L17r7k68o44j205j509
54545A67731j277o04K00P38P43M32M27J094J993K316J803J020O68Q20Q71L48m79
54528A78844r02p04m09n44r45j136j029q12l80N08J573K108J799J026K59l27o08
54511A78321m50j12j46o44j058j012p81o71n05q0K77J91r0j5M92J034J273J105
$$ y = [165177, 166832, 168709, 170271, 170937, 170667, 170094, 169778, 169570, 169099, 168628, 168859, 169872, 170854, 171010, 170351, 169345, 168253, 167117, 166142, 165649, 165714, 166062, 166244, 165775, 164288, 161910, 159463, 157963, 157799, 158554, 159589, 160622, 161657, 162642, 163374, 163654, 163446, 162938, 162528, 162573, 163040, 163527, 163773, 164000, 164492, 165031, 165152, 164944, 165109, 166013, 167091, 167520, 167190, 166581, 165915, 165008, 163892, 162988, 162477, 161998, 161264, 160584, 160445, 160846, 161392, 161789, 161949, 161845, 161591, 161512, 161751, 162032, 162209, 162807, 164385, 166470, 167842, 168057, 168025, 168760, 170100, 171137, 171454, 171357, 171089, 170445, 169240, 167731, 166454, 165850, 166050, 166788, 167531, 167963, 168390, 169484, 171477, 173793, 175596, 176616, 177284, 178104, 178975, 179323, 178844, 177942, 177238, 176829, 176285, 175340, 174204, 173175, 172363, 171983, 172491, 174064, 176172, 177971, 178997, 179256, 178929, 178321, 177871, 177759, 177613, 176969, 175911, 174899, 174118, 173447, 172942, 172862, 173139, 173330, 173240, 173225, 173717, 174751, 176024, 177129]
54493A77129M76m82j315j573j238n68K40R59J214Q68L22Q4J98L93M94M33J24k70
54475A77488l00J56N95O17N52P97J035P68K60J48L65K94r9j36M43J057J067N27
54457A85634p6k89L5M66K10q64j684j213l9L37l68r30o25k77o75j171o91N44J272
54438A79596P70n08j631j955j423n69j30k85m97k53L39Q30Q84L76m40q24j87R30
54420A75023J316P60M50J235K370K636J950J075M04n3o9M65R08N87j08k83M6O3
54402A88775m72q75o64r8M89J058J312O91o76j605j077O21K256K864K353J244
54386A96196K33j52R9M89M70m2o55r12p41m73m12l86l6N45P42K36n21q87p54m09
54366A92630n5J41n1n15o25q7M73L45j20nP76J410J461J305J197Q33N9o90j006
$$ y = [177129, 177605, 177123, 175808, 174235, 172997, 172429, 172669, 173628, 174842, 175710, 176032, 176116, 176314, 176707, 177201, 177634, 177758, 177488, 177188, 177344, 177939, 178556, 179108, 179905, 180940, 181708, 181968, 182116, 182481, 182775, 182676, 182540, 182983, 184040, 185107, 185634, 185558, 185269, 185304, 185770, 185980, 185116, 183432, 182219, 182180, 182517, 182149, 181219, 180594, 180317, 179642, 178471, 177780, 178324, 179596, 180366, 179858, 178227, 176272, 174849, 174280, 174150, 173865, 173368, 173115, 173454, 174284, 175168, 175544, 175104, 174280, 174093, 175023, 176339, 177099, 177549, 178784, 181154, 183790, 185740, 186815, 187219, 187166, 187097, 187562, 188470, 189057, 188949, 188666, 188712, 188775, 188303, 187428, 186764, 186666, 187155, 188213, 189525, 190216, 189540, 187935, 186858, 187479, 189735, 192599, 194952, 196196, 196429, 196277, 196376, 196865, 197335, 197293, 196638, 195726, 194985, 194512, 194100, 193714, 193678, 194223, 194965, 195201, 194680, 193793, 193039, 192630, 192575, 192716, 192665, 192150, 191525, 191438, 191911, 192256, 192136, 192131, 192907, 194317, 195778, 197083, 198280, 199113, 199172, 198482, 197476]
54347A97476r81p64k63L96P21N05J37p0l50q83j231r24k03L55O70J095J660J975
54329A99321J874J749K119L013L882M084L552K978L126L968M776N096N146N095
54315B49779M522L062J137n61k054l875n850o893o292m771l744l784m222m195
54301B12259l650l066k666k282j857j579j387q58J16Q57O14m25j265j283p80l62
54285A92386j54J40O93J246J338P23k98j009r81m87k0M14J110J821J775O51q79
54268A98469j853j864j098M8J029J285P67J23P8O64J313J446Q93m3p13o07N0N18
54250B00505M99M83Q43J160Q67K18r3M0J19r0k98k88k18k06j99k81o48j141j289
54231A99983r32l59K22Q29J216R16O0m35l8N93M94k81q32p42m34l35l10r2K52
$$ y = [197476, 196495, 195731, 195468, 195864, 196585, 197090, 197227, 197157, 196807, 195924, 194693, 193769, 193566, 193921, 194591, 195686, 197346, 199321, 201195, 202944, 205063, 208076, 211958, 216042, 219594, 222572, 225698, 229666, 234442, 239538, 244684, 249779, 254301, 257363, 258500, 257939, 255885, 252010, 246160, 239267, 232975, 228204, 224460, 220676, 216454, 212259, 208609, 205543, 202877, 200595, 198738, 197159, 195772, 194914, 195030, 195887, 196501, 196076, 194811, 193528, 192748, 192386, 192232, 192372, 193065, 194311, 195649, 196372, 196074, 195065, 194084, 193597, 193577, 193991, 195101, 196922, 198697, 199348, 198469, 196616, 194752, 193654, 193702, 194731, 196016, 196783, 196906, 196984, 197648, 198961, 200407, 201300, 201257, 200544, 199937, 199987, 200505, 201004, 201487, 202330, 203490, 204357, 204575, 204482, 204522, 204641, 204551, 204253, 203965, 203747, 203541, 203342, 203061, 202413, 201272, 199983, 199051, 198692, 198914, 199743, 200959, 201875, 201935, 201500, 201462, 202055, 202549, 202268, 201436, 200694, 200260, 199925, 199615, 199523, 199775]
54212A99775N08O32O32M93K66J8l76j053j677j630p97J75O65P45P92Q34O70L20
54194B00992p7n11q83p87n4P69R94P13M77L21j39p11o34J56O54J37p98j101o10
54175A98908O5N65J009J433J619J477J116O77L18J90R8m40j414j984j529o63n31
54158B00914j244j803j529q38l80j31L46J130J722J480K27j318j928j141K6K38
54142A95771m18n98L04J237R89j79j016r31m00%K69O68J155J387J083L85j78j83
54124A99345J45J63l56q49n88M69J661K279K092J375O28J83O5K11O51J229J376
54107B10079O65m29q20j01J020J655J647J249N57k86p66m98J44M49J90l25q64
54090B13566j345j457q21L80J324J390P97K87L24P06Q46M42j88m60k76j21l24
$$ y = [199775, 200283, 200915, 201547, 202040, 202306, 202324, 201948, 200895, 199218, 197588, 196791, 196966, 197631, 198376, 199168, 200002, 200672, 200992, 200915, 200404, 199521, 198734, 198680, 199449, 200443, 201156, 201633, 201954, 201815, 201104, 200470, 200626, 201280, 201417, 200619, 199518, 198908, 198973, 199538, 200547, 201980, 203599, 205076, 206192, 206869, 207187, 207377, 207475, 207035, 205621, 203637, 202108, 201445, 200914, 199670, 197867, 196338, 195500, 195120, 194989, 195335, 196465, 198187, 199667, 199894, 198576, 196648, 195507, 195533, 195771, 195353, 194755, 195059, 196296, 197285, 197106, 196090, 195159, 194759, 194759, 195028, 195696, 196851, 198238, 199321, 199706, 199528, 199345, 199490, 199653, 199297, 198448, 197860, 198329, 199990, 202269, 204361, 205736, 206364, 206547, 206612, 206823, 207474, 208703, 210079, 210744, 210315, 209495, 209394, 210414, 212069, 213716, 214965, 215522, 215236, 214470, 213972, 214116, 214565, 214755, 214430, 213566, 212221, 210764, 209943, 210323, 211647, 213037, 213834, 214121, 214445, 215151, 215997, 216439, 216251, 215791, 215515, 215394, 215070]
54073B15070n52l09K89P14Q32J035J519J898J684R19J11l11l31k62l90o81q12
54056B20423n75k23j76l75j45R67K395K910K031P33N03J672L116L668L428L314
54040B43666L692M020L783L245L118L850N311O926P932P887P005N884M867L962
54026C15148L296L114L274L193K633K073K032K341K434K053J407P95M35M09N57
54011C45194N49L20K27O22J449K474L713N441P968J1382J5155J7973J8426J6060
53997D46953J1403N021k734j0806j7282k0848k1860k1343j9605j6617j3172j0502
53985C08608q899p692o485n581n147m831m332l618k589j220j57j99j039j352m91
53970B54976O25Q32J26q02j722k722l322k748j099M66R69N60Kk93m27m28n4P36
$$ y = [215070, 214518, 214209, 214498, 215212, 216044, 217079, 218598, 220496, 222180, 223099, 223210, 222899, 222568, 222306, 221916, 221235, 220423, 219848, 219625, 219449, 219074, 218929, 219896, 222291, 225201, 227232, 227965, 228468, 230140, 233256, 236924, 240352, 243666, 247358, 251378, 255161, 258406, 261524, 265374, 270685, 277611, 285543, 293430, 300435, 306319, 311186, 315148, 318444, 321558, 324832, 328025, 330658, 332731, 334763, 337104, 339538, 341591, 342998, 343793, 344228, 344637, 345194, 345743, 346063, 346290, 346912, 348361, 350835, 354548, 359989, 367957, 379339, 394494, 412467, 430893, 446953, 458356, 463377, 460643, 449837, 432555, 411707, 389847, 368504, 348899, 332282, 319110, 308608, 299709, 292017, 285532, 279951, 274804, 269973, 265641, 262023, 259434, 258214, 258057, 257858, 256819, 255467, 254976, 255601, 256433, 256559, 255757, 254035, 251313, 247991, 245243, 244144, 244610, 245579, 246139, 246141, 245848, 245421, 244993, 244939, 245675]
53952B45675J495J749J588J496J669J873K006K296K821L249L401L581M005M338
53938B81242M297M348N086O171O639O198N498N088M790M258L472K489J340M16
53924C41332L71J277K374K985L248L580L893L831L531L591M358N540O557P098
53910C93566P321P580P865P637O468M725L163J931M84j401l070l792l616l113
53896D25748k680k508k804l578m330m461l977l551l920n261p000q088p821o557
53882C59212n416n139n431n548n131m310l400k769k637k793k771k549k617l104
53868C05597l413l100k595k433k332j770j126j264k105k548k002j183j044j494
53854B77188j648r91R0P87O11j90p95n57M18J544K480L301M079M801N819P773
$$ y = [245675, 247170, 248919, 250507, 252003, 253672, 255545, 257551, 259847, 262668, 265917, 269318, 272899, 276904, 281242, 285539, 289887, 294973, 301144, 307783, 313981, 319479, 324567, 329357, 333615, 337087, 339576, 340916, 341332, 341703, 342980, 345354, 348339, 351587, 355167, 359060, 362891, 366422, 370013, 374371, 379911, 386468, 393566, 400887, 408467, 416332, 423969, 430437, 435162, 438325, 440256, 440740, 439339, 436269, 432477, 428861, 425748, 423068, 420560, 417756, 414178, 409848, 405387, 401410, 397859, 393939, 388678, 381678, 373590, 365769, 359212, 353796, 348657, 343226, 337678, 332547, 328237, 324837, 322068, 319431, 316638, 313867, 311318, 308701, 305597, 302184, 299084, 296489, 294056, 291724, 289954, 288828, 287564, 285459, 282911, 280909, 279726, 278682, 277188, 275540, 274549, 274639, 275426, 276037, 275847, 275052, 274495, 274913, 276457, 278937, 282238, 286317, 291118, 296937, 304710]
53838C04710J0775J4085J7041J9967K3685K8161L2080L3623L1294K4190J2514
53827E52125j631j4475k2679k5581k4996k2783j9249j4175q538m132j691m58J97
53814C91934j91k085m681o689p863q816r627r516q095n984m020k414j065q3M39
53799C21244Q35J578K679L646L930L310K063R00M71P38R74O52M6j83J97Q03J134
53782C45017R51L08n51j309j826k262k780l278l539l611l825m352m931n090m636
53767C04286l892l376l233l100k678k289k424k862k767j929j264j592k427k611
53753B67842j918j172q36m75K53R51J250J470J848J782P60m79o39K91R65N66j90
53736B72269l22k8j56q17j322j311j178j340j614j542r38kR13J539J911K273K640
$$ y = [304710, 315485, 329570, 346611, 366578, 390263, 418424, 450504, 484127, 515421, 539611, 552125, 550494, 536019, 513340, 487759, 462763, 439980, 420731, 406556, 398018, 393886, 392195, 391737, 391934, 391743, 389658, 384977, 378288, 370425, 361609, 351982, 342466, 334371, 328387, 324367, 321953, 320888, 320805, 321244, 322079, 323657, 326336, 329982, 333912, 337222, 339285, 340185, 340656, 341394, 342368, 343020, 343066, 342883, 343080, 343883, 345017, 345968, 346276, 345725, 344416, 342590, 340328, 337548, 334270, 330731, 327120, 323295, 318943, 314012, 308922, 304286, 300394, 297018, 293785, 290685, 288007, 285718, 283294, 280432, 277665, 275736, 274472, 272880, 270453, 267842, 265924, 264752, 263916, 263441, 263694, 264645, 265895, 267365, 269213, 270995, 271755, 271276, 270637, 270928, 271893, 272459, 272269, 271947, 271919, 271763, 270946, 269624, 268313, 267135, 265795, 264181, 262639, 261701, 261699, 262612, 264151, 266062, 268335, 270975]
53719B70975K620K058J639K213L469L970K937J396R41J683K196J444Oq16m83O03
53703B96851J902L127L994M241L980L643L469L310L067K867K728K396J788J278
53689C38641J188J318J343J345J482J342M25q83j568j406j264j687j974j317k36
53674C36749N1o63j347j230o89m56o20p49n29K1O60R88O26l79j467k048j970j461
53656C25487q04k36R0J83J78J28m8l56o13o50m85k35O1M68J019J568J784J415
53638C28954O81K53O02J433J990J931J599J563K016K658K918K446J638J503K548
53623C54733L927M241L228K085J902K397K602K319K224K802L697M309M468M373
53609C99307M115L660L212L205L737M197L862K841K030K000K357K494K433K455
$$ y = [270975, 273595, 275653, 277292, 279505, 282974, 286944, 289881, 291277, 292218, 293901, 296097, 297541, 297547, 296731, 296248, 296851, 298753, 301880, 305874, 310115, 314095, 317738, 321207, 324517, 327584, 330451, 333179, 335575, 337363, 338641, 339829, 341147, 342490, 343835, 345317, 346659, 347084, 346201, 344633, 343227, 341963, 340276, 338302, 336985, 336749, 336800, 336137, 334790, 333560, 332871, 332415, 331795, 331046, 330517, 330538, 331198, 332186, 332812, 332433, 330966, 328918, 326948, 325487, 324683, 324447, 324537, 324720, 324898, 325026, 324978, 324622, 324009, 323359, 322874, 322639, 322700, 323168, 324187, 325755, 327539, 328954, 329635, 329888, 330490, 331923, 333913, 335844, 337443, 339006, 341022, 343680, 346598, 349044, 350682, 352185, 354733, 358660, 362901, 366129, 368214, 370116, 372513, 375115, 377434, 379658, 382460, 386157, 390466, 394934, 399307, 403422, 407082, 410294, 413499, 417236, 421433, 425295, 428136, 430166, 432166, 434523, 437017, 439450, 441905]
53595D41905K339J696P83K10o6n57j143j040k03K67l75j398j625j043o52j052
53579D38046j931k745l245l342k954k185j390r39r76j240j216o57n1j86j105j875
53563D12009j581k14J553L044L790L623K871K185J829J508J074Q74J141J561J844
53548D37111K165K701L274L912N135P158R320J0876J1739J1867J0718Q188N424
53535E29588L650K642J417No40k40N91J648L388N718P730Q909R668J0438J1181
53520E95693J1994J3158J4316J4651J4290J4502J6006J7987J9446K0575K2094
53509G74712K3919K5396K6263K6664K6660K6384K6246K6321K5976K4771K3325
53498A056637K2545K2375K2069K1368K0628J9947J9054J8091J7728J8282J9308
$$ y = [441905, 444244, 445940, 446723, 446933, 446867, 446310, 445167, 444127, 443924, 444191, 443816, 442418, 440793, 439750, 439098, 438046, 436115, 433370, 430125, 426783, 423829, 421644, 420254, 419315, 418339, 417099, 415883, 415226, 415175, 414989, 413884, 412009, 410428, 410214, 411767, 414811, 418601, 422224, 425095, 427280, 429109, 430617, 431691, 432565, 433706, 435267, 437111, 439276, 441977, 445251, 449163, 454298, 461456, 470776, 481652, 493391, 505258, 515976, 524164, 529588, 533238, 535880, 537297, 537302, 536662, 536422, 537013, 538661, 542049, 547767, 555497, 564406, 574074, 584512, 595693, 607687, 620845, 635161, 649812, 664102, 678604, 694610, 712597, 732043, 752618, 774712, 798631, 824027, 850290, 876954, 903614, 929998, 956244, 982565, 1008541, 1033312, 1056637, 1079182, 1101557, 1123626, 1144994, 1165622, 1185569, 1204623, 1222714, 1240442, 1258724, 1278032]
53487A278032K0207K0728K0731K0020J8734J7561J7132J7348J7526J7205J6564
53476A481788J5993J5438J4417J2636J0337P844N037J689j891n024p466r557j1501
53463A529740j3001j3845j4276j4589j4736j4726j4928j5634j6627j7569j8490
53452A361319j9525k0481k1075k1338k1380k1028k0145j9169j8725j8719j8313
53441A141421j6823j4439j1894r726p929o225m574l284k589k219j755j246r49
53428A057769m75J072L774O372P636P801Q140R442J1459J3569J5346J6663J7748
53415A176316J9064K0737K2331K3534K4695K6235K7907K9297L0665L2489L4474
53404A467744L5887L6835L8246M0592M3386M6095M8679N0964N2413N2953N3411
$$ y = [1278032, 1298239, 1318967, 1339698, 1359718, 1378452, 1396013, 1413145, 1430493, 1448019, 1465224, 1481788, 1497781, 1513219, 1527636, 1540272, 1550609, 1558453, 1563490, 1565179, 1563288, 1558264, 1550798, 1541241, 1529740, 1516739, 1502894, 1488618, 1474029, 1459293, 1444567, 1429639, 1414005, 1397378, 1379809, 1361319, 1341794, 1321313, 1300238, 1278900, 1257520, 1236492, 1216347, 1197178, 1178453, 1159734, 1141421, 1124598, 1110159, 1098265, 1088539, 1080610, 1074385, 1069811, 1066527, 1063938, 1061719, 1059964, 1058718, 1057769, 1057294, 1058366, 1062140, 1068512, 1076148, 1083949, 1092089, 1101531, 1112990, 1126559, 1141905, 1158568, 1176316, 1195380, 1216117, 1238448, 1261982, 1286677, 1312912, 1340819, 1370116, 1400781, 1433270, 1467744, 1503631, 1540466, 1578712, 1619304, 1662690, 1708785, 1757464, 1808428, 1860841, 1913794, 1967205]
53393A967205N4576N6242N7606N8236N8270N8026N7733N7418N6708N5062N2459
53382B589541M9532M6803M4138M1174L7918L4484L0619K6033K1057J6428J2435
53371B950162Q602M381k10m886r868j5979k3683l2211l9997m6127n0893n4721
53359B684570n7202n7866n7471n7427n7945n7768n6026n3382n0882m8589m6109
53348B083903m3731m2165m1494m1280m1396m1858m2097m1275l9477l7711l6494
53337A634925l5138l2782k9543k6248k3403k0920j8569j6327j4325j2782j1995
53326A392893j2186j3227j4587j5625j5975j5720j5187j4594j3945j3233j2469
53315A236145j1499j0066q259o579n253l816j781M29J840K167K229K979M585O560
$$ y = [1967205, 2021781, 2078023, 2135629, 2193865, 2252135, 2310161, 2367894, 2425312, 2482020, 2537082, 2589541, 2639073, 2685876, 2730014, 2771188, 2809106, 2843590, 2874209, 2900242, 2921299, 2937727, 2950162, 2958764, 2963145, 2962935, 2958049, 2948181, 2932202, 2908519, 2876308, 2836311, 2790184, 2739291, 2684570, 2627368, 2569502, 2512031, 2454604, 2396659, 2338891, 2282865, 2229483, 2178601, 2130012, 2083903, 2040172, 1998007, 1956513, 1915233, 1873837, 1831979, 1789882, 1748607, 1709130, 1671419, 1634925, 1599787, 1567005, 1537462, 1511214, 1487811, 1466891, 1448322, 1431995, 1417670, 1404888, 1392893, 1380707, 1367480, 1352893, 1337268, 1321293, 1305573, 1290386, 1275792, 1261847, 1248614, 1236145, 1224646, 1214580, 1206321, 1199742, 1194489, 1190673, 1188892, 1189321, 1191161, 1193328, 1195557, 1198536, 1203121, 1209681]
53301A209681Q412R974J1410J3078J5207J7521J9487K0987K2479K4321K6286K7905
53289A426748K8957K9412K9186K8327K7122K5786K4180K2152J9887J7611J5221
53278A694589J2566R797P010L801j09m028o817q489j0357j3289j6483j8642j9815
53265A629734k1200k3295k5280k6340k6817k7451k8160k8301k7862k7587k7886
53254A339555k8330k8460k8469k8636k8627k7998k7015k6332k5982k5504k4973
53243A039229k5034k5611k5538k4083k2087k0874k0533k0132j9243j8190j7001
53232H00903j5254j3162j1675j1091j0469r018p302o436o664p494q627r981j1131
53219F72599j1658j1882j2476j3450j4252j4702j5000j4903j3851j2094j0706
$$ y = [1209681, 1218093, 1228067, 1239477, 1252555, 1267762, 1285283, 1304770, 1325757, 1348236, 1372557, 1398843, 1426748, 1455705, 1485117, 1514303, 1542630, 1569752, 1595538, 1619718, 1641870, 1661757, 1679368, 1694589, 1707155, 1716952, 1723962, 1727763, 1727654, 1723626, 1716809, 1708320, 1697963, 1684674, 1668191, 1649549, 1629734, 1608534, 1585239, 1559959, 1533619, 1506802, 1479351, 1451191, 1422890, 1395028, 1367441, 1339555, 1311225, 1282765, 1254296, 1225660, 1197033, 1169035, 1142020, 1115688, 1089706, 1064202, 1039229, 1014195, 988584, 963046, 938963, 916876, 896002, 875469, 855337, 836094, 817904, 800903, 785649, 772487, 760812, 749721, 739252, 730234, 722932, 716496, 709832, 702338, 693711, 683730, 672599, 660941, 649059, 636583, 623133, 608881, 594179, 579179, 564276, 550425, 538331, 527625]
53208E27625j0099r407p907o296n791o497p425p913q187q623r085r141q500p203
53194D15551n715m781m849n565o176o325o171n817n101m076l174k737k610k439
53180C50015k139j903j847j843j636j110m72j30k03l34k08j03m94j203j432q58
53164C34100j17R8k8J38O48R65Q38N30J85m37j319j807j396n48k03n58q22l84
53146C29883K79J82p93j673j629j060j016j726k275j866r44n04o71n93K31J216
53130C17041J557J277R01N13j84j054j450j088m38o2M6J97M87P98J029J095R07
53113C21572O04M68M26lr37j671j502p84n82j336k397k871k443j360j53M91O9
53096C07591j129k130k230j636r75m96%O29J209J461J250O79K0m67p06p13m41
$$ y = [527625, 517526, 508119, 500212, 493916, 488125, 481628, 474203, 466290, 458103, 449480, 440395, 431254, 422754, 415551, 409836, 405055, 400206, 394641, 388465, 382140, 375969, 370152, 365051, 360975, 357801, 355064, 352454, 350015, 347876, 345973, 344126, 342283, 340647, 339537, 339065, 338935, 338732, 338398, 338190, 338087, 337593, 336390, 334958, 334100, 333983, 334081, 334053, 334191, 334839, 335804, 336642, 337172, 337357, 336920, 335601, 333794, 332398, 331850, 331647, 331089, 330267, 329883, 330162, 330344, 329551, 327878, 326249, 325189, 324173, 322447, 320172, 318306, 317362, 316858, 316187, 315594, 315825, 317041, 318598, 319875, 320776, 321289, 321105, 320051, 318601, 317513, 317075, 317013, 317059, 317256, 317743, 318541, 319570, 320665, 321572, 322176, 322644, 323070, 323067, 322130, 320459, 318957, 318173, 317591, 316255, 313858, 310987, 308544, 307184, 307031, 307522, 307591, 306462, 304332, 302102, 300466, 299491, 298995, 298995, 299624, 300833, 302294, 303544, 304223, 304243, 303776, 303070, 302357, 301916]
53079C01916L3K59j99j063j518j250q84j077j574j609r36j5O43Q57O33J29k21
53062B94124N4Q81J592J542P35k19o46l55L51J089J781K452K827K587K026J972
53046C12793K711L452L178J826J83j039j644j770j759k013k511k669k132j448
53032C07158j410j923k176j863j423j134o75J15P99R12N26j10q99j575j579p03
53016B94040M46J050Q91L15k54m66q8O71J162R74M71K36L21L77L24L52M55M10
52998C01687K02K1j44m86r45j118p77j64L29N86P30Q58R09Q02O18O27R92J464
52980C06191J573J221Q46Q19R72R83R85J332J923K239K057J684J427J235J027
52965C26514R30R92R52O07J61l4L9J07O8J15L38M49L2r35j906k252j940j597j800
$$ y = [301916, 301949, 302208, 302009, 300946, 299428, 298178, 297294, 296217, 294643, 293034, 292098, 292083, 292726, 293583, 294216, 294345, 294124, 294178, 295059, 296651, 298193, 298928, 298709, 298063, 297708, 298059, 299148, 300929, 303381, 306208, 308795, 310821, 312793, 315504, 318956, 322134, 323960, 324143, 323104, 321460, 319690, 317931, 315918, 313407, 310738, 308606, 307158, 305748, 303825, 301649, 299786, 298363, 297229, 296554, 296669, 297468, 298380, 298906, 298796, 297897, 296322, 294743, 294040, 294486, 295536, 296427, 296742, 296488, 296022, 295934, 296605, 297767, 298741, 299212, 299448, 299769, 300146, 300470, 300822, 301277, 301687, 301889, 301910, 301766, 301280, 300335, 299217, 298440, 298276, 298605, 299191, 299921, 300779, 301688, 302490, 303108, 303735, 304727, 306191, 307764, 308985, 309831, 310650, 311622, 312605, 313590, 314922, 316845, 319084, 321141, 322825, 324252, 325487, 326514, 327444, 328436, 329388, 329995, 330156, 330122, 330161, 330268, 330336, 330451, 330789, 331238, 331270, 330335, 328429, 326177, 324237, 322640, 320840]
52946C20840k422k863k808k427j906j177k48N01O71K58m20j006j177o96K38R36
52930C06294Q23J15m84o83q35j258j764k026k087k162k185j862j125l03K13L21
52914B90992K52L71Q28J363J486R33K4n46l26M51R75N41p00j744j662n53O69J390
52896B94744J715J772J276J74p52p07pL51Q1j97j50k34p13j009n63K30N51J70
52878B96732n35j163j373q05M34J494J585Q94J83k19m06k18N13J224J118M67M44
52861C00369J414K350K405K083K194K490K227J541J181J133N39q90k321k891k791
52846C11033k818l310l908m098l696k889k001j252o99m12n72j198j863j976j402
52831B78939n71N6L81N18N04L50J21j77o42j187j410j000k03L94M89K89J21O1
$$ y = [320840, 318418, 315555, 312747, 310320, 308414, 307237, 306989, 307490, 308161, 308419, 307999, 306993, 305816, 305120, 305358, 306294, 307117, 307232, 306748, 306065, 305230, 303972, 302208, 300182, 298095, 295933, 293748, 291886, 290761, 290458, 290671, 290992, 291244, 291615, 292443, 293806, 295292, 296225, 296249, 295703, 295377, 295828, 296803, 297344, 296644, 294900, 293238, 292685, 293354, 294744, 296459, 298231, 299507, 299681, 298929, 298222, 298215, 298566, 298647, 298450, 298300, 298066, 297353, 296344, 295781, 296011, 296562, 296732, 296197, 295034, 293661, 292856, 293290, 294784, 296369, 297263, 297446, 297227, 296821, 296603, 297116, 298340, 299458, 299925, 300369, 301783, 304133, 306538, 308621, 310815, 313305, 315532, 317073, 318254, 319387, 319926, 319036, 316715, 313824, 311033, 308215, 304905, 300997, 296899, 293203, 290314, 288313, 287061, 286362, 285950, 285378, 284180, 282317, 280341, 278939, 278368, 278424, 278805, 279323, 279827, 280177, 280298, 280121, 279479, 278292, 276882, 275882, 275679, 276073, 276562, 276851, 276972, 277033]
52813B77033P6K39O05J000J179J198J413K073L083M092M671M334K776L66j890
52798C02248l169l534l583l564l290k793k484k502k424j940j384j174j094o11
52784B68702K54Q92R24N82K77K33O48J640K763L058K054M99l70j64M28P22P83
52767B83925R57J141R80N48L26M34L85k21j079j505j244o20l8L71O06O24M56K56
52749B86302J79K74N66J132J964K864L537L754L473K915K449K250K031J401M31
52734C15522m19r80j553k242k573k118j240o77n97n93m79n09o85n61j8K54l68
52717C00164j462j980j569q88n86n84n09l05n5L57R34J235Q75J83k18l95r11j666
52699B92620j694n51P74J005J88n61n72j66K20N90R98J284J464J751K009J753
$$ y = [277033, 277109, 277348, 277953, 278953, 280132, 281330, 282743, 284816, 287899, 291991, 296662, 300996, 303772, 304138, 302248, 299079, 295545, 291962, 288398, 285108, 282315, 279831, 277329, 274905, 272965, 271581, 270407, 269313, 268702, 268956, 269848, 270772, 271354, 271631, 271864, 272512, 274152, 276915, 279973, 282027, 282526, 282156, 281992, 282420, 283142, 283925, 284882, 286023, 287003, 287551, 287877, 288311, 288696, 288475, 287396, 285891, 284647, 284027, 283989, 284360, 284966, 285590, 286046, 286302, 286481, 286755, 287321, 288453, 290417, 293281, 296818, 300572, 304045, 306960, 309409, 311659, 313690, 315091, 315522, 315103, 314123, 312570, 310328, 307755, 305637, 304397, 303720, 303123, 302530, 302051, 301542, 300857, 300296, 300278, 300532, 300164, 298702, 296722, 295153, 294265, 293679, 293095, 292586, 292281, 292226, 292583, 293517, 294752, 295627, 295810, 295592, 295197, 294286, 292620, 290926, 290375, 291149, 292154, 292342, 291781, 291209, 291043, 291263, 291853, 292851, 294135, 295599, 297350, 299359, 301112]
52683C01112R84M34O32J208J514J432J119N39j41j91Q05J989K091J196O53J121
52667C16497J669J315N28L92R15J126O74K68L56L00o08j888k367j692o79j72j40
52650C16494p8K06N58Q17P71Q7j207k293k215j076q7j83r55j238m80Q05J806K223
52632C13955K297K278K158J926J927K609L833M748M693L937L097K042J61k270
52618C47391l909l991l396l424m025m082l163k087j676j743j647j240q50o31l46
52603C11181K13Q48J078O83L0k06K58J038J563J633J383J005O91O21P31P34O08
52586C24092P85J481K100J901J028L30K40M41N71O18N11M4n95p46j21P21J044
52569C34445P43J78l85q15r13o15j97J5J1p5k81o28q54o89l39k44m50n23j67L65
$$ y = [301112, 302096, 302530, 303162, 304370, 305884, 307316, 308435, 308974, 308833, 308642, 309447, 311436, 313527, 314723, 315376, 316497, 318166, 319481, 320009, 320401, 321316, 322442, 323116, 323384, 323740, 324040, 323432, 321544, 319177, 317485, 316806, 316634, 316494, 316416, 316622, 317180, 317997, 318768, 318855, 317648, 315355, 313140, 312064, 311977, 311794, 310839, 309601, 309121, 309926, 311732, 313955, 316252, 318530, 320688, 322614, 324541, 327150, 330983, 335731, 340424, 344361, 347458, 349500, 349661, 347391, 343482, 339491, 336095, 332671, 328646, 324564, 321401, 319314, 317638, 315895, 314248, 313008, 312158, 311527, 311181, 311394, 312242, 313320, 314003, 314033, 313827, 314085, 315123, 316686, 318319, 319702, 320707, 321398, 322019, 322750, 323484, 324092, 324877, 326358, 328458, 330359, 331387, 331717, 331957, 332398, 332969, 333587, 334098, 334142, 333547, 332801, 332680, 333401, 334445, 335188, 335366, 334981, 334166, 333253, 332638, 332441, 332456, 332467, 332392, 332111, 331483, 330629, 329940, 329601, 329357, 328907, 328384, 328217, 328582]
52549C28582N94L66n0k73j81j6j00m34o24l54J08J25n18j200j086j23Q49J026
52531C26691N31Q6O6J77P9j68l82n89p74o77k18K29L89N77J112J568J354Q55J089
52512C31995K194L140L262L181L640M252M139L274K275J251k41k143l692m414
52498C52113m622m682m383l429k113j124q26j017j218j028m06K11K65k63p26n41
52482C26211J46P49J037J243J483J491J110O79N87P28P31O19P95J327J748J750
52466C42434J696K067K750L318L793M499N215N098L716J647k35j674k878l834
52452C67612m311m326m141l805l156k326j873k149k820l128k577j316n6M17j66
52437C31879j251j956j922j536j253r80m04L07O22M24K28M25P11N96J82J5K73
$$ y = [328582, 329176, 329542, 329492, 329219, 329038, 329022, 328922, 328488, 327864, 327510, 327618, 327743, 327225, 326025, 324939, 324816, 325665, 326691, 327222, 327308, 327374, 327551, 327630, 327462, 327080, 326491, 325717, 325040, 324822, 325051, 325440, 326017, 327129, 328697, 330051, 330906, 331995, 334189, 337329, 340591, 343772, 347412, 351664, 355803, 359077, 361352, 362603, 362362, 360219, 356527, 352113, 347491, 342809, 338426, 334997, 332884, 331760, 330934, 329917, 328699, 327671, 327265, 327476, 327741, 327478, 326752, 326211, 326357, 327106, 328143, 329386, 330869, 332360, 333470, 334149, 334736, 335464, 336195, 336814, 337609, 338936, 340684, 342434, 344130, 346197, 348947, 352265, 356058, 360557, 365772, 370870, 374586, 376233, 375998, 374324, 371446, 367612, 363301, 358975, 354834, 351029, 347873, 345547, 343674, 341525, 338705, 335577, 333000, 331684, 331628, 332045, 331879, 330628, 328672, 326750, 325214, 323961, 322981, 322577, 322884, 323506, 323930, 324158, 324583, 325294, 325890, 326072, 326087, 326360]
52420C26360O14Q03J037J442J698J448Q02K08L1M55J543L035M384N319O236P696
52404C63111R761J2074J4264J5818J5906J3963J0380O087J526l322p985j1398
52392D40185j2909j2787j1645r924q099o660n583m390k990j842j049j22R96J547
52378C64728J236J084K086L669M461M219L935M297N091O019P015P563O762M476
52364D26641J773k16j331k024k527k747k539j824p81K3P8l12l51J28M62K95K14
52347D14962Q08J763K415K688K875K944K751K592K887L482L939M286M880N673
52333D58945O265O668P319Q315R311J0210J1350J2822J4280J5564J6858J8014
52321E95921J8421J7976J7468J7415J7239J6309J5268J5342J6577J7786J8267
$$ y = [326360, 326974, 327777, 328814, 330256, 331954, 333402, 334204, 334412, 334443, 334898, 336441, 339476, 343860, 349179, 355415, 363111, 372872, 384946, 399210, 415028, 430934, 444897, 455277, 461364, 462890, 459568, 451583, 440185, 427276, 414489, 402844, 392920, 384821, 378161, 372578, 368188, 365198, 363356, 362307, 362185, 363181, 364728, 365964, 367048, 369134, 372803, 377264, 381483, 385418, 389715, 394806, 400825, 407840, 415403, 422165, 426641, 428414, 428198, 426867, 424843, 422316, 419569, 417030, 415206, 414425, 414448, 414526, 414214, 413863, 413991, 414453, 414748, 414962, 415770, 417533, 419948, 422636, 425511, 428455, 431206, 433798, 436685, 440167, 444106, 448392, 453272, 458945, 465210, 471878, 479197, 487512, 496823, 507033, 518383, 531205, 545485, 561049, 577907, 595921, 614342, 632318, 649786, 667201, 684440, 700749, 716017, 731359, 747936, 765722, 783989]
52310G83989J8574J9373K0384K0972K1076K1051K1035K1005K1096K1362K1457
52299A011374K0966J9902J8513J6807J4670J2266R854P299M201N06l234o221p840
52286A119063q040p529p368p987q743q794q119p287o552n749m836l844k480n67
52272A031168J241K023J948K210L446N146O874R003J1713J4091J5175J5258J5361
52259A134657J5814J6174J6212J6226J6490J7021J7752J8389J8344J7338J5816
52248A320233J4214J2187R230N768K705J62k388m850o461p144p842r074j0148
52235A316592j0311r915r801j0133j0526j0860j1223j1398j1064j0399r920r743
52223A191299r451q706p654o774o460o675o763n922m108k212j074n11K33J422
$$ y = [783989, 802563, 821936, 842320, 863292, 884368, 905419, 926454, 947459, 968555, 989917, 1011374, 1032340, 1052242, 1070755, 1087562, 1102232, 1114498, 1124352, 1131651, 1135852, 1136358, 1133124, 1126903, 1119063, 1111023, 1103494, 1096126, 1088139, 1079396, 1070602, 1062483, 1055196, 1048644, 1042895, 1038059, 1034215, 1031735, 1031168, 1032409, 1034432, 1036380, 1038590, 1042036, 1047182, 1054056, 1063059, 1074772, 1088863, 1104038, 1119296, 1134657, 1150471, 1166645, 1182857, 1199083, 1215573, 1232594, 1250346, 1268735, 1287079, 1304417, 1320233, 1334447, 1346634, 1355864, 1361632, 1364337, 1364499, 1362111, 1357261, 1350800, 1343656, 1335814, 1326740, 1316592, 1306281, 1296366, 1286565, 1276432, 1265906, 1255046, 1243823, 1232425, 1221361, 1210962, 1201042, 1191299, 1181848, 1173142, 1165488, 1158714, 1152254, 1145579, 1138816, 1132894, 1128786, 1126574, 1125500, 1124989, 1125222, 1126644]
52209A126644K694L848N040O170O753O599O167N891N603N007M368M263M773N424
52195A199244N902O339O768O799O193N444N323N871O252N705M344K803J370k06
52181A268151k116m087n737p135q704j0566j2138j2605j1773j0281q901p794o660
52168A159654n392m218l227k127o49J087K818M418N765O594O787O607O306N649
52154A190072M276K330M37r33j654j634q24M03J390J923K342K789K830K184J380
52139A207311J124J209P07p71k503l484l398k548j204N94K735M955P123R325J1688
52124A232863J4226J6952J9882K2842K5515K7731K9541L0868L1377L0982L0207
52113A512986K9628K9111K8012K6053K3636K1327J9509J8438J8076J7816J6953
$$ y = [1126644, 1129338, 1133186, 1138226, 1144396, 1151149, 1157748, 1163915, 1169806, 1175409, 1180416, 1184784, 1189047, 1193820, 1199244, 1205146, 1211485, 1218253, 1225052, 1231245, 1236689, 1242012, 1247883, 1254135, 1259840, 1264184, 1266987, 1268357, 1268151, 1266035, 1261948, 1256211, 1249076, 1240372, 1229806, 1217668, 1205063, 1193290, 1183009, 1174108, 1166314, 1159654, 1154262, 1150044, 1146817, 1144690, 1144041, 1145128, 1147946, 1152364, 1158129, 1164723, 1171510, 1178117, 1184423, 1190072, 1194348, 1196678, 1197115, 1196182, 1194528, 1192894, 1192070, 1192473, 1193863, 1195786, 1198128, 1200917, 1203747, 1205931, 1207311, 1208435, 1209644, 1210351, 1209580, 1207077, 1203593, 1200195, 1197647, 1196443, 1197037, 1199772, 1204727, 1211850, 1221175, 1232863, 1247089, 1264041, 1283923, 1306765, 1332280, 1360011, 1389552, 1420420, 1451797, 1482779, 1512986, 1542614, 1571725, 1599737, 1625790, 1649426, 1670753, 1690262, 1708700, 1726776, 1744592, 1761545]
52102A761545J5647J4793J4664J4414J3356J2017J1220J0700R475P299M803K202
52090A892135j139n733j1147j6394k0676k3541k4829k4702k3445k1116j7764j3962
$$ y = [1761545, 1777192, 1791985, 1806649, 1821063, 1834419, 1846436, 1857656, 1868356, 1877831, 1885130, 1889933, 1892135, 1890996, 1885263, 1874116, 1857722, 1837046, 1813505, 1788676, 1763974, 1740529, 1719413, 1701649, 1687687]
$$ [...]
##END NTUPLES=NMR SPECTRUM
##END=
