##TITLE=AC1572_ROEFFECT0022_8271028_qFFJKTAUVB
##JCAMPDX= 6.0         $$ Bruker NMR JCAMP-DX V2.0
##DATA TYPE= NMR SPECTRUM
##DATA CLASS= NTUPLES
##ORIGIN= BRUKER
##OWNER= Administrator
$$ 1.72 TOPSPIN		Version 2.1
$$ 2013-10-18 19:20:07.600 -0700  Administrator@X
$$ Compression mode = diff/dup
##.OBSERVE FREQUENCY= 400.02188249412
##.OBSERVE NUCLEUS= ^1H
##.ACQUISITION MODE= SIMULTANEOUS (DQD)
##.ACQUISITION SCHEME= undefined
##.AVERAGES= 8
##.DIGITISER RES= 22
##SPECTROMETER/DATA SYSTEM= spect
##.PULSE SEQUENCE= zg30
##.SOLVENT NAME= COFFEE_meoh
##.SHIFT REFERENCE= INTERNAL, COFFEE_meoh, 1, 14.98509
##AUDIT TRAIL= $$ (NUMBER, WHEN, WHO, WHERE, PROCESS, VERSION, WHAT)
$$ ##TITLE= Audit trail, TOPSPIN		Version 2.1
$$ ##JCAMPDX= 5.01
$$ ##ORIGIN= Bruker BioSpin GmbH
$$ ##OWNER= Administrator
$$ $$ E:\/data/COFFEE/nmr/AC1572_ROEFFECT0022_8271028_qFFJKTAUVB/10/pdata/1/auditp.txt
$$ ##AUDIT TRAIL=  $$ (NUMBER, WHEN, WHO, WHERE, PROCESS, VERSION, WHAT)
(   1,<2013-10-18 19:20:01.084 -0700>,<Administrator>,<X>,<go>,<TOPSPIN 2.1>,
      <created by zg
	started at 2013-10-18 19:18:55.459 -0700,
	POWCHK enabled, PULCHK disabled,
       configuration hash MD5:
       C8 4E 4E 5D D3 5C D8 9E 9F 52 82 E0 59 8A DE 15
       data hash MD5: 64K
       5D D6 29 45 CB 18 09 EB 77 48 CA B5 73 42 FA 9A>)
(   2,<2013-10-18 19:20:03.912 -0700>,<Administrator>,<X>,<proc1d>,<TOPSPIN 2.1>,
      <Start of raw data processing
       efp LB = 0 FT_mod = 6 PKNL = 1 PHC0 = 0 PHC1 = 0 SI = 32K 
       data hash MD5: 32K
       3F D5 6E D8 75 C4 33 B2 8E 3E DC 07 A7 ED 15 EA>)
(   3,<2013-10-18 19:20:04.209 -0700>,<Administrator>,<X>,<proc1d>,<TOPSPIN 2.1>,
      <pk PHC0 = 95.31738 PHC1 = 0 
       data hash MD5: 32K
       9A 9E 7E 56 4A A8 35 E0 7E 4F 45 86 1C 92 99 C1>)
(   4,<2013-10-18 19:20:04.334 -0700>,<Administrator>,<X>,<proc1d>,<TOPSPIN 2.1>,
      <abs ABSG = 1 
       data hash MD5: 32K
       F1 07 48 EB 51 DC 8B E2 1B B9 F2 E4 32 D0 38 C3>)
(   5,<2013-10-18 19:20:04.412 -0700>,<Administrator>,<X>,<proc1d>,<TOPSPIN 2.1>,
      <abs ABSG = 2 
       data hash MD5: 32K
       AC 9C 4F F0 E6 FC 84 E4 2E 1F 23 F9 60 02 26 A4>)
(   6,<2013-10-18 19:20:04.491 -0700>,<Administrator>,<X>,<proc1d>,<TOPSPIN 2.1>,
      <abs ABSG = 3 
       data hash MD5: 32K
       9C 96 34 1A 35 A6 34 ED EF CF 52 1D BD AE A1 C0>)
(   7,<2013-10-18 19:20:04.537 -0700>,<Administrator>,<X>,<proc1d>,<TOPSPIN 2.1>,
      <abs ABSG = 4 
       data hash MD5: 32K
       0A 7D C8 86 92 86 F0 C4 C0 9A BA 19 6D AC BC FC>)
(   8,<2013-10-18 19:20:04.600 -0700>,<Administrator>,<X>,<proc1d>,<TOPSPIN 2.1>,
      <abs ABSG = 5 
       data hash MD5: 32K
       32 B3 CC 9C 14 C3 C7 86 93 C7 41 66 8C E3 6B 7E>)
$$ ##END=
$$ 
$$ $$ hash MD5
$$ $$ 8C 60 2D 13 2E 38 B1 68 42 AD FC 7D E9 D9 97 17
##$RELAX= 
##$RELAX= 
##$RELAX= 
##$RELAX= 
##$RELAX= 
##$RELAX= 
##$RELAX= 
$$ Bruker specific parameters
$$ --------------------------
##$DU= <E:\>
##$EXPNO= 10
$$ [...]
150 150 150 150 150 150 150 150
##$TP07= 0
##$TPNAME0= <>
##$TPNAME1= <>
##$TPNAME2= <>
##$TPNAME3= <>
##$TPNAME4= <>
##$TPNAME5= <>
##$TPNAME6= <>
##$TPNAME7= <>
##$TPOAL= (0..7)
0.5 0.5 0.5 0.5 0.5 0.5 0.5 0.5
##$TPOFFS= (0..7)
0 0 0 0 0 0 0 0
##$TUNHIN= 0
##$TUNHOUT= 0
##$TUNXOUT= 0
##$USERA1= <user>
##$USERA2= <user>
##$USERA3= <user>
##$USERA4= <user>
##$USERA5= <user>
##$V9= 5
##$VALIST= <valist>
##$VCLIST= <CCCCCCCCCCCCCCC>
##$VD= 0
##$VDLIST= <DDDDDDDDDDDDDDD>
##$VPLIST= <PPPPPPPPPPPPPPP>
##$VTLIST= <TTTTTTTTTTTTTTT>
##$WBST= 1024
##$WBSW= 4
##$XGAIN= (0..3)
0 0 0 0
##$XL= 0
##$YL= 0
##$YMAX_a= 646366
##$YMIN_a= -549367
##$ZGOPTNS= <>
##$ZL1= 120
##$ZL2= 120
##$ZL3= 120
##$ZL4= 120
##$ABSF1= 14.98509
##$ABSF2= -5.573092
##$ABSG= 5
##$ABSL= 3
##$ALPHA= 0
##$AQORDER= 0
##$ASSFAC= 0
##$ASSFACI= 0
##$ASSFACX= 0
##$ASSWID= 0
##$AUNMP= <proc_prof1d_extract_pilot.lims>
##$AXLEFT= 0
##$AXNAME= <>
##$AXNUC= <1H>
##$AXRIGHT= 0
##$AXTYPE= 0
##$AXUNIT= <>
##$AZFE= 0.1
##$AZFW= 0.1
##$BCFW= 0
##$BC_mod= 0
##$BYTORDP= 0
##$COROFFS= 0
##$CY= 15
##$DATMOD= 1
##$DC= 0
##$DFILT= <>
##$DTYPP= 0
##$F1P= 0
##$F2P= 0
##$FCOR= 0.5
##$FTSIZE= 32768
##$FT_mod= 6
##$GAMMA= 0
##$GB= 0
##$INTBC= 1
##$INTSCL= 1
##$ISEN= 128
##$LB= 0
##$LEV0= 0
##$LPBIN= 0
##$MAXI= 10000
##$MC2= 0
##$MEAN= 0
##$ME_mod= 0
##$MI= 0
##$NCOEF= 0
##$NC_proc= -8
##$NLEV= 6
##$NOISF1= 0
##$NOISF2= 0
##$NSP= 0
##$NTH_PI= 0
##$NZP= 0
##$OFFSET= 14.98509
##$PC= 1
##$PHC0= 95.31738
##$PHC1= 0
##$PH_mod= 1
##$PKNL= yes
##$PPARMOD= 0
##$PPDIAG= 0
##$PPIPTYP= 0
##$PPMPNUM= 2147483647
##$PPRESOL= 1
##$PSCAL= 4
##$PSIGN= 0
##$PYNMP= <proc.py>
##$REVERSE= no
##$SF= 400.02
##$SI= 32768
##$SIGF1= 0
##$SIGF2= 0
##$SINO= 400
##$SIOLD= 32768
##$SPECTYP= <>
##$SREGLST= <1H.CDCl3>
##$SSB= 0
##$STSI= 32768
##$STSR= 0
##$SW_p= 8223.68421052631
##$SYMM= 0
##$S_DEV= 0
##$TDeff= 65536
##$TDoff= 0
##$TI= <>
##$TILT= no
##$TM1= 0
##$TM2= 0
##$TOPLEV= 0
##$USERP1= <user>
##$USERP2= <user>
##$USERP3= <user>
##$USERP4= <user>
##$USERP5= <user>
##$WDW= 1
##$XDIM= 32768
##$YMAX_p= 461703810
##$YMIN_p= -789913
##$CURPLOT= <Network HP LaserJet P1505>
##$CURPRIN= <$Network HP LaserJet P1505>
##$DFORMAT= <normdp>
##$LAYOUT= <+/1D_H.xwp>
##$LFORMAT= <normlp>
##$PFORMAT= <normpl>
##$SURQMSG= 1
$$ End of Bruker specific parameters
$$ ---------------------------------
##NTUPLES= NMR SPECTRUM
##VAR_NAME=  FREQUENCY,     SPECTRUM/REAL,   SPECTRUM/IMAG
##SYMBOL=    X,             R,               I
##VAR_TYPE=  INDEPENDENT,   DEPENDENT,       DEPENDENT
##VAR_FORM=  AFFN,          ASDF,            ASDF
##VAR_DIM=   32768,         32768,           32768
##UNITS=     HZ,            ARBITRARY UNITS, ARBITRARY UNITS
##FACTOR=    0.250966925370066, 1,           1
##FIRST=     8223.43324360094, 89650,        -195549
##LAST=      0,             10999,           -155973
##MIN=       0,             -789913,         0
##MAX=       8223.43324360094, 461703810,    0
$$ Real data points
##PAGE= N=1
##DATA TABLE= (X++(R..R)), XYDATA
$$ [...]
$$ plain form
19553 -123334 -6782 214664 339442 -113739 481034 6962 -157346 -296605 -273172 5851 -325518
19541 146764 -141081 -60530 -321748 74325 -71749 103703 -96057 9176 165944 -109342 -205830
19530 -205830 -391819 -285989 -123077 -187442 -318499 207597 -106988 -62769 137554 -259482
19519 174709 -114634 163916 -219455 -149169 322815 202497 -281133 -77459 2545 44100
19509 44100 -229048 326893 -20679 124567 -318667 -30083 198879 47603 -57023 -90812 -667684
19498 -667684 -54193 -115135 93838 79503 -338512 -50312 -235603 118750 -185740 -230123 -364736
19487 -364736 -132612 -116494 23762 -39313 -81754 -45345 93406 41056 137452 61621 -319972
19475 108998 -11095 -202359 90668 288029 -154134 -203331 -330544 30815 58898 -213798
$$ packed form
19553a23334f782B14664J24778a13739D81034F962a57346j39259K3433E851c25518
19541A46764a41081f0530k61218G4325g1749A03703i6057I176J56768a09342r6488
19530b05830j85989J05830a23077o4365j31057B07597a06988M4219A37554b59482
19519A74709a14634A63916b19455P0286C22815j20318b81133g7459B545M1555
19509D4100b29048C26893b0679A24567c18667c0083A98879D7603e7023l3789n76872
19498f67684e4193o0942I3838j4335c38512e0312j85291A18750a85740m4383j34613
19487c64736a32612J6118B3762c9313m2441L6409I3406D1056R6396F1621c19972
19475A08998a1095j91264I0668J97361a54134m9197j27213C0815K8083b13798
$$ plain form
19464 39135 -54613 -53311 -32269 44481 126443 -199979 -61407 3298 222122 -94597 -267751
19453 -267751 231197 -163123 -170123 -47531 -456427 -121115 17062 -288020 5701 144414 207455
19442 207455 -66943 197735 -354719 26252 -21611 -98452 -128410 34246 127007 111188 -188532
19430 46128 74181 31303 268447 -260336 -100252 -92860 2872 -41960 -157385 -209102 120036
19418 120618 279181 -349666 -5446 -142241 -280312 -98661 -400256 -70958 -20457 -213995
19408 -213995 -31304 -351767 -159306 352634 -92293 364978 108417 1670 -151039 -240822
19398 -240822 26084 -123864 -45193 159234 -14345 -170846 78742 -27233 -162101 -129424 -318974
19387 -318974 277412 119803 219867 35419 -346832 -10650 224606 33187 -212862 38167
$$ packed form
19464C9135e4613J302K1042D4481Q1962a99979f1407C298K18824i4597j73154
19453b67751B31197a63123p000d7531m08896a21115A7062b88020E701J38713O3041
19442B07455f6943A97735c54719B6252b1611p6841k9958C4246R2761j5819a88532
19430D6128K8053C1303K37144b60336a00252P392B872d1960j15425n1717A20036
19418A20618J58563c49666e446j36795j38071i8661l01595g0958b0457j93538
19408b13995c1304l20463a59306C52634i2293C64978A08417A670a51039q9783
19398b40822B6084a23864d5193A59234a4345j56501G8742b7233j34868L2677j89550
19387c18974B77412A19803J00064C5419c46832a0650B24606C3187b12862C8167
$$ plain form
19376 -115153 -213641 -125597 -73680 216085 -69723 -41407 -103837 -96278 -37535 177023 145149
19365 145149 -206410 -228468 -185974 -141093 -85154 49288 -132577 -184639 -103600 123449 -140940
19353 153484 14600 -164913 -205362 -354996 -276113 -140483 85420 56892 -316742 -125738
19342 141198 -11909 -99775 146957 -220646 238067 -322153 -100759 -65631 -24955 141189
19331 -375395 -127624 -5340 -78849 120669 33601 -199859 51891 19524 134568 -311602 -353128
19320 -353128 -180922 -93285 -95164 -136057 414465 -13399 -145250 -1338 -94181 410366 -297990
19308 -98737 185331 -21525 81802 -31501 -179741 34331 -324612 76226 -95932 -182902 -116542
19297 -116542 -90477 -16143 -328085 103768 -393678 -12925 -116094 -43493 205534 63172
$$ packed form
19376a15153r8488Q8044N1917B16085f9723K8316o2430P559c7535A77023l1874
19365A45149b06410k2058M2494M4881N5939D9288a32577n2062Q1039A23449a40940
19353A53484A4600a64913m0449j49634P8883J35630H5420k8528c16742a25738
19342A41198a1909q7866A46957b20646B38067c22153a00759L5128b4955A41189
19331c75395a27624e340p3509A20669C3601a99859E1891A9524J15044c11602m1526
19320c53128J72206Q7637j879m0893D14465a3399j31851a338r2843D10366b97990
19308i8737A85331b1525H1802c1501j48240C4331c24612G6226i5932q6970O6360
19297a16542K6065a6143l11942A03768c93678a2925j03169d3493B05534F3172
$$ plain form
19286 69484 -2438 -226960 -295112 -257951 150303 -42526 -394060 24277 -15938 -198680 246357
19274 76430 -155597 -199252 -143306 -389886 181006 -187345 75529 -14041 -62180 -55092 -99657
19263 -99657 16251 296225 -87942 -100090 -30957 80371 -49134 -285125 157319 -215192 -555136
19252 -555136 -85998 147044 -19418 151906 -126121 -132132 -93637 -166429 10252 61349 57568
19241 57568 -199902 -153914 154928 -165715 112026 200300 -51504 112986 17073 509 -205211
19229 239359 -21518 19354 -271545 -20713 61310 -80981 357913 154639 -199659 -136306 -304096
19218 -304096 -140953 -171445 66800 -3662 -148845 -76576 -49742 -31286 -57990 299740 36944
19206 -52827 251471 145769 -82446 58767 -153562 -97526 -134181 67394 117534 -126440 -8450
$$ packed form
19286F9484b438k24522o8152L7161A50303d2526l51534B4277a5938j82742B46357
19274G6430a55597m3655N5946k46580A81006a87345G5529a4041m8139P088m4565
19263i9657A6251K79974h7942j2148c0957H0371d9134k35991A57319b15192l39944
19252e55136h5998A47044a9418A51906a26121o011L8495p2792A0252N1097l781
19241E7568a99902M5988A54928a65715A12026Q8274e1504A12986A7073E09b05211
19229B39359b1518A9354b71545b0713F1310h0981C57913A54639a99659O3353j67790
19218c04096a40953l0492F6800c662j45183P2269K6834J8456k6704B99740C6944
19206e2827B51471j05702h2446E8767a53562N6036l6655F7394N0140a26440h450
$$ plain form
19194 -324856 231639 45395 -79961 200864 -28098 63083 -258051 -297616 89040 -244439 97366
19182 26773 -265228 -119244 -3259 -214449 315645 -30836 118701 -101019 -166980 132355
19171 -5886 -42831 -106472 93095 -614074 -134321 4255 -131430 -87345 -44966 271302 27604
19159 -117122 -211513 55383 -144657 49146 -109456 365975 -117706 -246800 -20885 240607
19148 -453108 -34385 -47221 -165909 5283 265669 -102496 142533 46665 -133569 96556 -126300
19136 27709 36085 -356205 -276157 -117207 -172814 -159513 -259405 -271671 -118606 380508 -493426
19124 73957 -300096 -315973 -355104 -25150 155589 102379 17928 -163430 14180 -177083 -250665
19113 -250665 -124937 127532 -103393 41434 50885 -46700 57403 -257469 -26026 -305151 -130207
$$ packed form
19194c24856B31639D5395g9961B00864b8098F3083b58051l9565H9040b44439I7366
19182B6773b65228a19244c259k11190C15645c0836A18701a01019o5961A32355
19171e886l6945o3641I3095f14074a34321D255a31430M4085M2379B71302B7604
19159a17122r4391E5383a44657D9146a09456C65975a17706j29094b0885B40607
19148d53108c4385j2836j18688E283K60386a02496A42533D6665a33569I6556a26300
19136B7709Q376c56205Q0048a17207n5607J3301r9892j2266a18606C80508d93426
19124G3957c00096j5877l9131b5150A55589n3210A7928a63430A4180a77083p3582
19113b50665a24937A27532a03393D1434R451d6700E7403b57469b6026k79125a30207
$$ plain form
19101 -339884 -264452 78753 -351941 -78501 -254442 -41217 133435 -130438 -208868 53879 -134766
19089 -16861 229355 -67735 -73030 -1429 31059 -179247 -137185 -190330 24615 -230692 -259462
19078 -259462 -27867 -116803 184369 198793 -86077 -194238 54155 -333342 -225019 270724
19067 -110576 -196885 -43687 -218811 -113653 102642 -198665 -183924 -239748 -237389 -175071 235706
19055 -207825 -92950 -32019 -47805 -4528 93064 -281135 -185531 194261 85757 129226 223231
19044 223231 -56725 7077 -30907 242982 -173871 274673 -47924 -119267 31423 75935 -174219
19032 -164554 306958 252271 204567 -29746 252442 -30014 -234870 -30075 179243 -323356
19021 -161307 -265098 -19425 54521 -87669 -193138 399121 -215709 63779 -292523 36191
$$ packed form
19101c39884P5432G8753c51941g8501j75941d1217A33435a30438p8430E3879a34766
19089a6861B29355f7735n295a429C1059a79247M2062n3145B4615b30692k8770
19078b59462b7867q8936A84369J4424h6077j08161E4155c33342J08323B70724
19067a10576q6309d3687j75124J05158A02642a98665J4741n5824K359O2318B35706
19055b07825i2950c2019j5786d528I3064b81135R5604A94261H5757M3469R4005
19044B23231e6725G077c0907B42982a73871B74673d7924p1343C1423M4512a74219
19032a64554C06958n4687m7704b9746B52442c0014k04856c0075A79243c23356
19021a61307j03791a9425E4521h7669j05469C99121b15709F3779b92523C6191
$$ plain form
19010 -21005 22735 277001 92386 13538 -50141 310949 -1437 -264654 381685 -346901 -118815
18998 116089 -246629 -76443 179782 133592 -108288 -222685 68905 -28479 -17351 -177932
18988 -177932 45681 72781 -63923 99291 -193397 167211 162917 -244861 62822 48078 -142591
18976 -192292 342995 180561 -33817 -296024 -402358 139455 -226046 230245 163081 51443
18965 -108892 -282199 -2906 -101834 -250296 202928 -160158 -192663 83744 -99646 -123703 -115549
18954 -115549 169451 48001 107397 182597 268912 87553 2682 -217731 -122003 574872 -76361
18942 65393 -81313 92599 -113590 171403 -61180 268896 7431 -96234 -160785 -25320 -64604
18931 -64604 19271 117222 176401 170986 -400712 -170067 -173978 -292240 -59895 139520 164522
$$ packed form
19010b1005B2735K54266I2386A3538e0141C10949a437k63217C81685c46901a18815
18998A16089b46629g6443A79782m6190a08288j14397F8905b8479J1128j60581
18988a77932D5681K7100f3923I9291a93397A67211m294b44861F2822j4744a42591
18976a92292C42995j62434c3817k62207j06334A39455b26046B30245o7164E1443
18965a08892j73307b906r8928j48462B02928a60158l2505H3744i9646k4057Q154
18954a15549A69451D8001N9396P5200Q6315H7553B682b17731R5728E74872g6361
18942F5393h1313I2599a13590A71403f1180B68896G431i6234o4551b5320l9284
18931f4604A9271R7951N9179n415d00712a70067l911j18262e9895A39520K5002
$$ plain form
18920 164522 -45442 30360 -130446 -31934 -255064 -133064 210338 -496555 -5560 -118696
18910 -118696 -63617 -44999 359213 -97049 -175477 -143067 -86237 -38318 -50956 -12852 -51623
18899 -51623 237520 298471 60433 196411 69489 -151953 11129 -48419 192251 -58028 -41064
18888 -41064 -123374 -48164 95417 -183523 -339710 -198338 47461 -58952 -208915 474262 -162408
18876 218757 -49168 61931 -193886 -308443 -383435 320559 -139798 -107311 14962 44375 269369
18865 269369 -242581 -43897 -119981 -169730 -112366 -223618 -97346 14818 61711 -73937 -310819
18854 -310819 2789 -109840 148844 -53882 -170528 416803 -207315 -119335 72778 -471441
18843 -371376 -68294 46592 -78465 63252 -98347 -242905 -210956 211110 8432 -67414 -172768
$$ packed form
18920A64522d5442C0360a30446c1934k23130J22000B10338d96555e560j13136
18910a18696N5079J8618C59213i7049p8428L2410N6830c8318j2638a2852l8771
18899e1623B37520O0951F0433J35978F9489a51953A1129d8419A92251e8028J6964
18888d1064q2310d8164I5417a83523j56187J41372D7461e8952j49963D74262a62408
18876B18757d9168F1931a93886j14557p4992C20559a39798L2487A4962K9413K24994
18865B69369b42581d3897p6084m9749N7364j11252i7346A4818M6893g3937k36882
18854c10819B789a09840A48844e3882j16646D16803b07315Q7980G2778d71441
18843c71376f8294D6592g8465F3252i8347j44558L1949B11110H432f7414j05354
$$ plain form
18832 -172768 -32242 86733 -56647 38193 -83270 -128269 -398852 11688 -233747 310880 390685
18821 390685 93900 -280071 340738 187414 203909 207140 149372 147499 331710 -121730 -77257
18810 -77257 123941 -153580 222100 78484 83391 111645 261115 14779 -216957 218189 -303492
18798 -69124 -73737 70578 114400 -116204 136102 -78295 -223881 182394 -474206 -452341 144386
18786 -99075 329681 -99687 -92316 65343 -360295 -182449 29026 -32630 199526 154855 110429
18775 110429 -178284 -339656 -277641 -108829 -294770 58586 124457 42506 -34227 -330020
18765 -330020 -386984 -263444 -96228 1343 -420087 -137535 266922 -12225 -134943 -186457 -168824
18754 -168824 -72578 -74661 4120 -109811 -165916 -136530 -451288 109467 -28982 281524 41459
$$ packed form
18832a72768c2242H6733e6647C8193h3270m4999k70583A1688b33747C10880P9805
18821C90685I3900b80071C40738j53324J6495L231n7768j873J84211a21730M4473
18810g7257A23941a53580B22100G8484M907K8254J49470A4779b16957B18189c03492
18798f9124m613G0578M3822a16204A36102g8295j45586A82394d74206K1865A44386
18786i9075C29681i9687P371F5343c60295J77846B9026c2630A99526m4671m4426
18775A10429a78284j61372O2015a08829j85941E8586O5871D2506c4227k95793
18765c30020n6964J23540i6228A343d20087a37535B66922a2225j22718n1514J7633
18754a68824g2578k083D120a09811n6105K9386l14758A09467b8982B81524D1459
$$ plain form
18742 -124496 -27425 -78720 -16389 -348782 -326979 -112763 4662 -99529 -230571 62672 -504692
18730 -324762 -189947 -314804 -304057 58273 -373663 -287490 15324 315634 -254630 -87799
18719 125644 -498786 -73597 -245632 -106123 -74354 86188 -279657 -101102 37770 -114376
18708 23047 -274206 -166308 8807 -158923 -59384 -294397 -283982 -133213 249918 -272341
18697 -253322 -94021 -34679 -100957 -9700 290186 -41052 172079 -157232 -176982 134683 45733
18685 -135709 -9169 -118766 -76559 94119 44616 -297590 -75424 149025 -61697 -215644 45187
18673 -269871 -174018 105457 -167906 -44520 -131795 -87089 -70905 -29889 -162371 21714 -167304
18661 187489 -118796 153020 73347 141835 36942 -16426 140998 -303045 -9934 106787 66326
$$ packed form
18742a24496b7425n1295a6389l32393K1803a12763D662i9529j31042F2672e04692
18730c24762J34815j24857J0747E8273c73663Q6173A5324L00310b54630h7799
18719A25644d98786g3597j72035a06123L1769H6188b79657a01102C7770a14376
18708B3047b74206J07898H807a58923e9384k35013J0415a33213B49918b72341
18697b53322i4021c4679o6278i700B90186d1052A72079a57232j9750A34683D5733
18685a35709i169j09597M2207I4119D4616b97590g5424A49025f1697j53947D5187
18673b69871R5853A05457a67906d4520q7275M4706J6184b9889j32482B1714a67304
18661A87489a18796A53020G3347O8488C6942a6426A40998c03045i934A06787m0461
$$ plain form
18650 66326 -3100 2173 42037 169597 -332748 -129005 -405102 133098 -198437 141575 -86968
18638 212629 -105685 -48634 -274358 -197562 110354 -290158 407831 -91827 295116 78120
18627 -122261 177521 -74881 100588 -89049 7128 83664 259453 -199660 -323970 -11157 -255763
18616 -255763 55308 22704 -219104 -201758 124699 -28199 -314359 -210885 -8310 -144928 -35149
18604 -89145 -60754 -102279 -150802 -31406 -65126 -2370 19450 210955 -263678 66775 -257399
18592 91843 79655 116134 -421637 -336157 283335 113521 -76916 -254907 -227756 26647 -210758
18580 -94138 -180779 84371 -88813 -48517 -238863 -179667 68654 -125138 13735 2467 108423
18569 108423 27519 -345475 -106043 -66888 -307821 -34635 -258952 -468414 311679 -210595
$$ packed form
18650F6326c100B173L9864J27560c32748a29005k76097A33098a98437A41575h6968
18638B12629a05685d8634k25724P6796A10354b90158D07831i1827B95116G8120
18627a22261A77521g4881A00588h9049G128P6536J75789a99660j24310a1157k44606
18616b55763E5308B2704b19104J7346A24699b8199k86160J03474h310j36618c5149
18604h9145K8391m1525m8523c1406l3720b370A9450J91505b63678F6775b57399
18592I1843j2188L6479d21637Q5480B83335A13521g6916j77991K7151B6647b10758
18580i4138q6641H4371h8813M0296j90346N9196F8654a25138A3735B467J05956
18569A08423B7519c45475a06043L9155k40933c4635k24317k09462C11679b10595
$$ plain form
18558 63547 11225 -305499 53283 -69422 44161 -17657 -253651 -133691 -154423 -215678 -196881
18547 -196881 -99863 -41832 -60077 -38396 -129741 -112602 -200867 53619 -144339 252793 -90069
18535 156888 -175252 28272 73755 58532 -87811 -9022 -307224 236062 -19676 17319 151351
18524 151351 40792 24348 -289443 -145821 245624 151706 -135207 -254163 245678 -233705
18513 -66561 25329 161142 -131574 -318926 -398914 102277 -207366 53018 212872 -133801
18502 -255985 -37170 -89103 49700 55747 -176778 358855 -165567 -76101 30150 22901 -148388
18490 -198407 -326816 8200 -116710 54962 303215 -115745 71275 -66636 -217396 -90097 165168
18478 -123367 179667 8079 -265314 -102799 -134723 -6636 -271828 242900 -246344 -89367 -37198
$$ packed form
18558F3547A1225c05499E3283f9422D4161a7657k35994J19960k0732o1255J8797
18547a96881R7018d1832j8245K1681r1345J7139q8265E3619a44339B52793i0069
18535A56888a75252B8272M5483j5223h7811i022k98202B36062a9676A7319J34032
18524A51351D0792j6444b89443J43622B45624r3918a35207j18956B45678b33705
18513f6561B5329J35813a31574j87352p9988A02277b07366E3018J59854a33801
18502b55985c7170n1933D9700O047a76778C58855a65567g6101C0150p249a48388
18490a98407j28409H200a16710E4962K48253a15745G1275f6636j50760i0097A65168
18478a23367A79667H079b65314a02799l1924f636k65192B42900b46344h9367c7198
$$ plain form
18466 41706 148069 2043 -117095 -391017 -487559 116518 -37583 -68960 -50563 -286797 -90741
18454 76727 46848 -73580 -271284 17936 203920 -426590 -98774 25606 15952 41953 -44925
18442 -186227 -273445 -186884 -265405 34699 -68005 -51658 18313 18448 -140760 102788 -9497 -122100
18430 -122100 -164291 -161055 276807 18920 204703 36860 -31499 -71359 67613 178073 -89602
18418 -197058 -238659 -120465 37172 181021 -138494 -179334 99112 -351412 -232472 30516
18407 344003 112256 170459 -176556 163428 56042 -43102 -138621 177219 28579 17393 99284
18396 99284 66488 -202315 195097 257089 -175407 -198349 314818 -43284 -266492 -804 -207777
18385 -207777 -55075 -399836 94439 -68933 -89588 20638 -235142 77226 -75699 -433856 183843
$$ packed form
18466D1706J06363B043a17095k73922r6542A16518c7583l1377J8397k36234i0741
18454G6727k9879g3580j97704A7936J85984d26590i8774B5606r654K6001d4925
18442a86227q7218Q6561p8521C4699f8005J6347A8313J35a40760A02788i497j12603
18430a22100m2191L236B76807A8920J85783C6860c1499l9860F7613J10460h9602
18418a97058m1601J18194C7172J43849a38494m0840I9112c51412J18940C0516
18407C44003A12256N8203a76556A63428E6042d3102r5519A77219B8579j1186Q1891
18396I9284l2796b02315A95097O1992a75407k2942C14818d3284k23208h04k06973
18385b07777e5075l44761I4439f8933k0655B0638b35142G7226g5699l58157A83843
$$ plain form
18373 135499 35354 -115769 5250 -245402 316450 -112934 17829 -171918 250363 -54012
18362 4374 -341328 -307622 81411 -280113 -499216 -192148 -20779 -265322 -120532 -111743 103319
18350 -303407 -31665 530 -113821 -27098 50356 32693 -175896 97255 -243307 -114202 -98304
18339 -98304 -33821 27235 78283 -103986 44644 -29191 101267 -98603 -201770 -92423 -386742
18328 -386742 -64096 175409 -168437 -461676 110694 -56993 -283666 -377185 -153028 -78072
18318 -78072 -62966 -13595 13513 99963 -112863 -48808 -104741 -335736 -127267 89283 -179044
18306 -162452 -32266 296313 8472 -104200 -144074 19197 126518 -216785 80132 -289845 2145
18294 -33650 27799 98382 -40158 -112313 -309598 -230019 -36132 173834 98905 79429 -506319
$$ packed form
18373A35499C5354a15769E250b45402C16450a12934A7829a71918B50363e4012
18362D374c41328L3706H1411b80113k19103a92148b0779k44543a20532Q789A03319
18350c03407c1665E30a13821b7098E0356j7663a75896I7255b43307a14202J5898
18339i8304c3821B7235N1048a03986D4644b9191A01267i8603j03167i2423k94319
18328c86742f4096A75409a68437k93239A10694e6993k26673r3519a53028P4956
18318g8072J5106a3595A3513Q6450a12863d8808n5933k30995a27267H9283a79044
18306a62452c2266B96313H472a04200l9874A9197J07321b16785H0132b89845B145
18294c3650B7799P0583d0158p2155j97285P9579c6132A73834p4929j9476e06319
$$ plain form
18282 -457866 104209 -329331 -212325 -104199 -227678 18885 -123953 253480 94389 -321752
18271 -188780 -378496 -80054 107906 44954 40972 -370700 117119 295914 189530 45639
18260 166011 147116 106962 -286561 314633 63739 -75783 15415 50006 -151966 79240 -254267
18248 -43760 -37757 -175873 -12115 -142110 -187073 165042 80033 129822 -166764 229761 51284
18236 144665 88098 54730 -86000 -46434 -77290 196423 43274 -61813 58891 318572 -42772
18224 61440 13831 -220868 189526 -139036 164638 29660 354114 237710 85124 -140011
18213 85219 -82793 -86212 -133525 -263958 105154 -95708 -46276 -85273 57306 -467221 -101050
18201 52483 261335 253449 -42730 -8200 -517260 94774 27296 1028 -3804 33550 285682 30477
$$ packed form
18282d57866A04209c29331J17006a04199j23479A8885a23953B53480I4389c21752
18271a88780j89716h0054A07906D4954l982c70700A17119J78795j06384D5639
18260A66011j8895m0154b86561C14633F3739g5783A5415L4591a51966G9240b54267
18248d3760O003j38116a2115j29995m4963A65042H0033M9789a66764B29761E1284
18236A44665n6567l3368h6000L9566l0856A96423D3274f1813E8891K59681d2772
18224F1440A3831b20868A89526a39036A64638B9660L24454j16404H5124a40011
18213H5219h2793l419m7313j30433A05154i5708d6276l8997E7306d67221a01050
18201E2483K08852p886d2730h200n09060I4774B7296A028c804C3550K52132C0477
$$ plain form
18188 -59066 269954 29925 -109790 140856 106622 -17226 -85583 -150467 81673 41407 -197434
18176 98085 -212778 57241 275697 109155 55058 8455 -54 4992 -272907 53385 -110333 211930
18163 238377 -172019 -116966 -59561 202521 -401871 -202382 13181 96735 21776 41777 -130109
18151 137902 39367 -294152 -188264 -75958 -185063 54038 -236706 -338291 37408 206371
18141 206371 250836 -86950 -36111 24017 -118014 -34102 -181407 -224071 -263366 17441 -83852
18129 74872 -45098 -352664 -49768 54979 89831 -124441 -221179 237102 109997 -240152 -254408
18118 -254408 -6640 116570 68254 150320 3167 -132745 -258322 108216 64373 -50601 -172005
18107 -172005 -54381 135572 -258656 -500602 -236792 74114 116524 -105223 -118644 -59027
$$ packed form
18188e9066B69954B9925a09790A40856l4234a7226o8357o4884H1673m0266a97434
18176I8085b12778E7241K18456A09155n4097H455e4D992b72907E3385a10333B11930
18163B38377a72019N5053N7405B02521d01871J99489A3181Q3554B1776K0001a30109
18151A37902C9367b94152J05888g5958j09105E4038b36706j01585C7408J68963
18141B06371M4465h6950c6111B4017a18014c4102j47305m2664l9295A7441h3852
18129G4872d5098l07566d9768E4979L4852a24441r6738B37102A09997b40152j4256
18118b54408f640A16570m8316Q2066C167a32745j25577A08216m3843e0601j21404
18107a72005e4381A35572b58656k41946b36792G4114M2410a05223j3421e9027
$$ plain form
18096 305983 -93744 270658 -93622 -198303 -162492 -245476 -255936 222419 -74869 -335632 -5807
18084 -41822 -65698 -130637 -350063 -79202 145627 -68448 -89764 64959 122711 123474 -96286 344583
18071 -41920 -70290 -40719 -74987 62372 -257057 -161130 -127524 -107718 -57016 -245828 78402
18059 -341135 215867 -252887 -22097 -173136 56609 -186376 42846 158991 -228576 155204
18048 186737 174143 116512 1583 -77451 -217647 -104239 -50785 -101699 98236 114259 74320
18037 74320 88639 -14472 -141256 -242105 -212165 228348 270403 -32009 47579 279569 -40257
18025 -197310 -72791 100885 4823 104769 -412337 -129248 111033 284559 -195886 -163174
18015 -163174 271252 16267 -57958 -316825 65930 58751 -120420 18788 -53503 12521 15784
$$ packed form
18096C05983i3744B70658i3622j04681L5811q2984j0460B22419g4869k60763e807
18084d1822k3876o4939k19426g9202A45627f8448k1316F4959N7752P63i6286C44583
18071d1920k8370K9571l4268F2372b57057R5927L3606J9806N0702j88812G8402
18059c41135B15867b52887b2097j51039E6609a86376D2846J16145b28576A55204
18048A86737j2594n7631A583g7451j40196a04239e0785n0914I8236J6023l9939
18037G4320J4319a4472j26784j00849K9940B28348M2055c2009D7579K31990d0257
18025a97310g2791A00885D823R9946d12337a29248A11033J73526a95886L2712
18015a63174B71252A6267e7958k58867F5930p179a20420A8788e3503A2521L263
$$ plain form
18004 15784 111122 -260998 -659702 -193542 -236604 -75236 176907 7483 -140852 -126870 23136
17992 -101207 3187 -17138 132120 -27216 -174758 -83981 -46332 -47533 -109518 17976 -269060
17980 -15783 152856 31162 -363761 -3156 -366021 -55852 -209476 -25734 -152131 40513 -174550
17968 -116875 -399105 -304329 360305 243575 55484 38613 48423 -59388 -116392 349826 -24070
17956 -332235 -120110 -128988 11012 388602 -70131 -174279 226948 -445245 -299100 25520
17945 -244103 -102847 202674 151261 -17730 -426078 609839 65899 86729 -35918 215528
17934 34524 -112217 -16314 173424 2419 -36056 -132105 -277431 -418470 -73185 140129 -53149
17922 -31353 -11899 78985 -429519 -66058 -129371 -63835 -37416 -41421 268812 36347 -335984
$$ packed form
18004A5784R5338b60998l98704a93542m3062g5236A76907G483a40852J3982B3136
17992a01207C187a7138A32120b7216j47542h3981L7649j201o1985A7976b69060
17980a5783A52856C1162c63761c156l62865e5852j53624b5734j26397D0513a74550
17968a16875k82230R4776C60305j16730E5484j6871R810e9388n7004C49826b4070
17956c32235a20110q878A1012L77590g0131j04148B26948d45245J46145B5520
17945b44103a02847B02674n1413a7730m08348F09839F5899K0830c5918B15528
17934C4524a12217a6314A73424B419c6056r6049j45326j41039g3185A40129e3149
17922c1353a1899G8985d29519f6058o3313f3835K6419m005B68812C6347c35984
$$ plain form
17910 -125510 -170843 -206311 -151367 -163475 147991 288570 -36356 -102039 39025 -35952 -52137
17899 -52137 374424 160457 262958 34500 43474 -199250 178262 -195258 -98857 -85825 -327094
17888 -327094 417586 -182030 -139221 55805 -35244 -77044 -9091 -327748 31912 15317 -287294
17876 -217569 196358 -105933 12246 -342613 -74336 49783 -245906 -120881 50512 116667
17866 116667 192951 223220 144351 8254 -100393 -186100 196735 -93879 56781 84809 -91499
17854 115544 113925 -198523 77274 -55940 215131 -50309 -255213 -4485 -108777 -219205 91256
17842 61421 30593 110074 -135462 -20244 -178893 -58984 155710 -27345 405613 -115919 145986
17830 162605 68601 -19206 -150555 152953 -37595 -256648 57112 -42646 -266236 -262801 112600
$$ packed form
17910a25510m5333l5468N4944j2108A47991J40579c6356o5683C9025c5952j6185
17899e2137C74424A60457J02501C4500Q974a99250A78262a95258R6401J3032k41269
17888c27094D17586a82030M2809E5805c5244m1800i091l18657C1912A5317b87294
17876b17569A96358a05933A2246c42613g4336D9783b45906a20881E0512O6155
17866A16667P6284L0269p8869H254a00393q5707A96735i3879E6781K8028i1499
17854A15544j619a98523G7274e5940B15131e0309k04904d485j04292j10428I1256
17842F1421C0593P9481a35462b0244j58649e8984A55710b7345D05613a15919A45986
17830A62605F8601a9206j31349A52953c7595k19053E7112d2646k23590L435A12600
$$ plain form
17818 288674 -169843 -69973 -368392 -6498 -29575 -91673 -314338 87594 -15117 272545 18295
17806 -219385 71437 -222897 223269 159634 128623 -30884 -81110 -83254 63404 272726 -222804
17794 117552 -187583 -133434 1018 -36043 272259 -164598 -109851 95620 52006 158404 12951
17782 110108 -364716 223026 -139100 155451 -157751 49984 93311 -138621 -221774 17569
17771 112873 90393 -55386 35867 -267104 138563 -14185 423826 192604 -316228 230981
17760 127075 380080 -11823 84860 145167 -130184 47096 138156 201374 134628 54727 -253733
17748 193613 114972 343832 -45246 -51871 142408 -274609 172854 185884 -69128 107331 -373154
17736 209625 -114557 75463 -36962 283382 1509 -215058 27155 -323644 209436 -75333 44338
$$ packed form
17818B88674a69843f9973k98419f498k3077o2098k22665H7594a5117B72545A8295
17806b19385G1437b22897B23269o3635l1011c0884n0226k144F3404K09322b22804
17794A17552a87583N4149A018c6043B72259a64598N4747I5620m3614J06398A2951
17782A10108c64716B23026a39100A55451a57751D9984M3327a38621q3153A7569
17771A12873k2480e5386C5867b67104A38563a4185D23826A92604c16228B30981
17760A27075K53005a1823H4860O0307a30184D7096R1060O3218o6746E4727b53733
17748A93613p8641K28860d5246o625A42408b74609A72854J3030f9128A07331c73154
17736B09625a14557G5463c6962B83382A509b15058B7155c23644B09436g5333D4338
$$ plain form
17724 16765 54763 61297 -65493 -493344 72497 -312079 -82593 88360 8867 43484 23962 -200239
17711 155894 -131502 210606 110353 -42508 -225478 -170831 -190836 -127881 -210687 71633 -27549
17699 -174732 160182 343574 -17903 125058 24385 -49705 -87306 -156416 324441 55269 -241057
17687 344823 433151 -194902 -365562 -55900 -90183 -283102 69645 -79673 27727 -144513 163445
17675 153487 109470 165156 -243467 -85681 -171962 149657 116098 -35798 -216982 101389 -246897
17663 -65926 248070 233674 155224 6235 6286 -220736 -79210 -93089 17775 -19779 113981 174171
17651 174171 -11935 29120 -30470 252868 -351313 -35639 39215 92873 -11059 -72746 275963
17639 -56129 -215578 113580 -14330 -293156 -131857 302557 192023 81972 87586 236550
$$ packed form
17724A6765L7998O534f5493m27851G2497c12079h2593H8360H867L4617j9522b00239
17711A55894a31502B10606j00253d2508j82970N4647k0005O2955q2806G1633b7549
17699a74732A60182J83392a7903A25058B4385d9705l7601o9110C24441E5269b41057
17687C44823Q8328a94902j70660e5900l4283j92919F9645g9673B7727a44513A63445
17675A53487m4017N5686b43467h5681q6281A49657l3559c5798j81184A01389b46897
17663f5926B48070j4396p8450F235N1b20736g9210j3879A7775a9779A13981O0190
17651A74171a1935B9120c0470B52868c51313c5639C9215N3658a1059o1687B75963
17639e6129j59449A13580a4330k78826a31857C02557j10534H1972N614J48964
$$ plain form
17629 236550 -45428 -72273 189467 -147826 238493 722146 -291990 -318343 -89329 -31637
17618 196960 -55406 30886 43816 -110910 63525 -171202 212546 100321 61020 -253510
17607 -9716 164866 308530 87267 -20068 89622 348202 -20465 -41741 57755 136979 116073
17596 116073 -142482 -158068 -65788 -139803 -241344 211063 82556 298195 -126147 176082
17585 48054 35806 -122779 442011 24140 -135173 61319 -269274 66640 172370 108361 9296
17573 60183 -17065 302326 235497 122748 93179 1114 160562 36886 -60732 -191532 -284272
17562 -284272 -214993 -69411 38431 14697 -3776 84006 -187191 72333 80285 172390 127212 77323
17550 77323 -109960 -86711 190735 -27142 385409 337730 249628 98599 139351 49805 155733
$$ packed form
17629B36550d5428k6845A89467a47826B38493M83653b91990k6353h9329c1637
17618A96960e5406C0886J2930a10910F3525a71202B12546A00321l9301b53510
17607i716A64866J43664H7267b0068H9622K58580b0465k1276E7755P9224k0906
17596A16073a42482j5586f5788p4015j01541B11063H2556K15639a26147A76082
17585D8054j2248a22779D42011B4140a35173F1319b69274F6640J05730o4009I296
17573F0183a7065C02326o6829j12749k9569A114J59448C6886f0732j30800r2740
17562b84272O9279f9411C8431A4697c776H4006a87191G2333P952R2105m5178m9889
17550G7323a09960K3249A90735b7142C85409m7679q8102I8599M0752D9805J05928
$$ plain form
17539 155733 62243 -32408 309767 -18976 14161 -83260 195720 19182 293801 71366 153711
17528 153711 195694 171964 253214 131139 -66858 -141613 69994 -51577 221067 126290 -68366
17516 238767 37836 217974 -95861 -100035 231066 -77553 46189 -88495 140988 255108 -167667
17504 149205 98800 -26058 116950 -70163 254213 -122297 -236464 79354 -103835 -150836
17494 -150836 259407 15644 6953 70649 37611 82855 144128 217329 134113 439594 361640
17483 361640 220113 -250507 -101712 72260 42715 408412 339015 -59749 -92049 159943
17472 -117747 302598 -10979 180050 362545 17425 218065 61832 -81113 -4617 -69732 226245
17460 535324 333501 119424 -25970 25434 340412 4491 189548 85476 156034 266157 44648
$$ packed form
17539A55733F2243c2408C09767a8976A4161h3260A95720A9182K74619G1366Q2345
17528A53711M1983k3730Q1250j22075f6858p4755F9994e1577B21067r4777f8366
17516B38767C7836J80138i5861m174B31066g7553D6189h8495A40988J14120a67667
17504A49205n0405b6058A16950g0163B54213a22297j14167G9354a03835m7001
17494a50836B59407A5644F953O3696l3038M5244O1273P3201q3216L05481p7954
17483C61640j41527b50507a01712G2260k9545L65697o9397e9749l2300A59943
17472a17747C02598a0979A80050J82495A7425K00640F1832h1113d617o5115B26245
17460E35324k01823A19424b5970B5434L14978D491J85057H5476P0558J10123D4648
$$ plain form
17448 361159 106402 270905 581873 103472 250276 327821 49434 96451 270656 -38288
17437 215930 134052 147121 228156 400401 -353446 172238 -10270 53599 324593 250909 277786
17426 277786 471517 190410 442291 538114 287069 327758 334053 -98288 587320 266845
17415 31640 326070 336263 372074 149529 21762 85199 330717 136745 112844 277981 -144576
17403 39009 -12002 80874 121592 101592 230398 108672 160410 333128 -174527 200019 240561
17392 240561 57198 503983 637968 229304 -192189 -48082 71220 27859 254169 -225113
17381 272412 397249 63993 223757 -27332 225088 206310 120198 -68318 424504 97342 -49889
17369 94523 73055 -292371 365388 66143 89832 246516 -186414 -28639 416313 26387 -118400
$$ packed form
17448C61159A06402J64503L10968A03472J46804P7545D9434M7017J74205c8288
17437B15930q1878J3069Q1035J72245c53446A72238a0270E3599K70994p3684K6877
17426B77786J93731A90410K51881R5823k51045M0689O295i8288E87320B66845
17415C1640K94430J0193L5811A49529B1762O3437K45518A36745k3901J65137a44576
17403C9009a2002H0874M0718k0000J28806A08672N1738J72718a74527B00019M0542
17392B40561E7198M46785J33985B29304a92189d8082G1220B7859K26310b25113
17381B72412J24837F3993J59764b7332B25088j8778q6112f8318D24504I7342d9889
17369I4523k1468b92371C65388F6143K3689J56684a86414b8639D16313B6387a18400
$$ plain form
17357 -10274 130164 16278 -143629 317781 -43095 41748 -145406 -144596 164607 333075 82747
17345 225848 -25090 348207 163996 214865 422225 128489 274281 514301 33369 -105221
17334 205727 97300 119455 -5005 24192 392319 138725 -50053 142656 -84302 364081 185078
17323 185078 317316 113343 -57462 248216 196336 143332 -120913 314593 248014 108084
17312 361387 -240737 -11041 276121 369023 230826 -113543 -82703 53363 -15841 174067
17301 121634 -8328 174086 -56739 -211890 54793 199062 189059 511221 118347 24806 293823
17290 293823 441903 -127724 391304 70753 284878 528052 355564 315172 233414 270038
17280 270038 469004 315203 309733 165999 165305 -33438 -57597 337646 102947 145616 -7885
$$ packed form
17357a0274A30164A6278a43629C17781d3095D1748a45406Q10A64607J68468H2747
17345B25848b5090C48207A63996N0869K07360A28489J45792K40020C3369a05221
17334B05727I7300K2155e005B4192L68127A38725e0053A42656h4302C64081j79003
17323A85078J32238A13343e7462B48216n1880n3004a20913C14593o6579A08084
17312C61387b40737a1041B76121R2902j38197a13543L0840E3363a5841A74067
17301A21634h328A74086e6739j55151E4793J44269j0003L22162A18347B4806K69017
17290B93823J48080a27724C91304G0753K14125K43174j72488m0392q1758L6624
17280B70038J98966j53801n470j43734o94c3438k4159C37646A02947M2669g885
$$ plain form
17268 155221 -94059 -56729 -237748 191369 163740 92543 -142151 337717 -31425 106360
17257 187022 149760 256681 222158 412997 135863 488603 130155 99738 96035 215579
17247 215579 299210 180107 341827 -63909 -86810 234724 50407 26786 231761 329825 276496
17236 276496 455426 106653 81949 198697 328315 96210 -54342 220767 59167 350864
17226 350864 120877 352442 54501 300026 -1177 -607 330801 230577 92799 -172161 441254
17214 59227 424461 96082 429701 91924 144886 224063 464835 -170487 -42699 82644 308577
17203 308577 418772 254483 -136789 41510 230008 295932 351616 468512 409079 12158
17192 683478 48771 -23299 303961 512297 -75799 182423 518122 138825 249061 206111
$$ packed form
17268A55221i4059L7330j81019A91369k7629p1197a42151C37717c1425A06360
17257A87022l7262J06921l4523J90839A35863L52740A30155l0417l703J19544
17247B15579Q3631j19103J61720f3909k2901B34724E0407k3621K04975R8064n3329
17236B76496J78930A06653k4704J16748J29618I6210e4342B20767E9167K91697
17226C50864A20877K31565E4501K45525a177N70C30801j00224I2799a72161D41254
17214E9227L65234I6082L33619I1924N2962P9177K40772a70487d2699H2644K25933
17203C08577J10195j64289a36789D1510J88498O5924N5684J16896n9433A2158
17192F83478D8771b3299C03961K08336g5799A82423L35699A38825J10236m2950
$$ plain form
17182 206111 443322 -162788 300268 519976 252023 469478 471834 183526 -99033 109590
17171 169969 53297 575412 631056 213308 367537 171775 728106 183598 373678 155262
17160 -37605 177175 103009 228044 349512 21054 115538 79125 204498 174332 28881 405881
17149 405881 174102 327811 526183 213249 -39923 294202 -23083 400826 443870 -56273
17138 -89255 31167 498412 221825 403039 530534 138801 335351 168027 617840 327114
17128 327114 -15203 9420 352304 409799 306570 325280 297435 132492 262022 97626 312418
17117 312418 429685 263239 243337 288154 604966 616168 598962 326084 849315 428395
17107 428395 450016 352071 737398 392354 606736 283280 342781 430285 447726 661064
$$ packed form
17182B06111K37211a62788C00268K19708B52023K17455K356A83526i9033A09590
17171A69969E3297N22115N5644B13308J54229A71775N56331A83598J90080A55262
17160c7605A77175p4166J25035J21468B1054R4484l6413J25373l0166B8881L77000
17149D05881A74102J53709J98372B13249c9923B94202b3083D00826M3044e6273
17138h9255C1167M67245B21825J81214J27495A38801J96550j67324M49813k90726
17128C27114a5203I420L42884N7495j03229J8710k7845A32492J29530I7626K14792
17117C12418J17267j66446j9902M4817L16812J1202j7206k72878N23231m20920
17107D28395K1621r7945L85327l45044K14382B83280N9501Q7504J7441K13338
$$ plain form
17097 661064 292450 702365 467775 487839 189405 480730 523811 215502 604320 567777
17087 567777 679670 311196 216622 176557 187680 63049 710867 185304 402461 471219
17077 471219 475741 335426 268921 654535 149210 805832 683035 447677 573388 422069
17067 422069 496089 606597 488061 441856 497304 555151 275682 324505 283040 366943 587696
17056 587696 255850 328505 421688 243659 376958 397622 416844 469880 523963 626145 624062
17045 624062 741052 560548 421013 644185 337789 373521 383755 448089 213043 557528
17035 557528 604080 529312 468045 625221 298911 456385 387951 697724 504113 643317
17025 643317 581528 561499 706336 754498 746864 695394 979269 418375 693468 896326 463510
$$ packed form
17097F61064B92450M09915k34590K0064A89405K91325M3081B15502L88818l6543
17087E67777J11893C11196r4574m0065J1123F3049O47818A85304K17157O8758
17077D71219M522j40315o6505L85614A49210O56622j22797k35358J25711j51319
17067D22069P4020J10508j18536m6205N5448N7847B75682M8823m1465Q3903K20753
17056E87696B55850P2655R3183j78029J33299K0664J9222N3036N4083J02182k083
17045F24062J16990j80504j39535K23172l06396L5732J0234O4334B13043L44485
17035E57528M6552p4768o1267J57176B98911J57474o8434L09773j93611J39204
17025F43317o1789k0029J44837M8162p634n1470K83875D18375K75093K02858m32816
$$ plain form
17014 463510 733578 290093 538634 412517 862395 36799 551433 830037 266286 863818
17004 863818 402543 889285 646354 529922 869614 759969 725959 730979 652896 422838
16994 422838 750017 714497 786703 912562 764142 859569 783446 449430 549635 955788
16984 955788 600786 886743 605101 861156 969218 732761 859012 1243478 726198 883365
16974 883365 963949 912827 862548 820525 1022214 670270 1071401 957414 690849 1009387
16964 1009387 690924 838764 668724 659305 1039106 1133723 1262429 867866 914295 758833
16954 758833 817632 1196374 846101 1060584 814200 929626 885385 1175646 944971 985083
16944 985083 888549 1321196 842938 1172486 1142860 1033326 1148253 849152 1217529 1010777
$$ packed form
17014D63510K70068B90093K48541j26117M49878C6799N14634K78604B66286N97532
17004H63818D02543M86742k42931j16432L39692j09645l4010N020p8083k30058
16994D22838L27179l5520P2206J25859j48420R5427p6123l34016J00205M06153
16984I55788l55002K85957k81642K56055J08062k36457J26251L84466n17280J57167
16974H83365Q0584n1122n0279m2023K01689l51944M01131j13987k66565L18538
16964A009387l18463J47840j70040r419L79801R4617J28706l94563M6429j55462
16954G58833N8799L78742l50273K14483k46384J15426m4241K90261k30675M0112
16944I85083r6534M32647m78258L29548k9626j09534J14927k99101L68377k06752
$$ plain form
16934 1010777 1199910 1327504 1139823 1441681 1489195 1303339 1413295 1371037 1322754 1385594
16924 1385594 1325430 1230490 1064840 1421231 1166876 1517321 1046672 1301349 998066 1457420
16914 1457420 1491537 1563709 1547611 1423553 1562185 1356558 1404727 1432828 1358884 1327345 1676669
16903 1676669 1688849 1431903 1620791 1851453 1593610 1971610 1521952 1448804 1535397 1664048
16893 1664048 1740080 1518662 1662104 1646862 1977939 2011275 1925513 1982046 2088996 2134821
16883 2134821 2242419 1963798 1897359 2063290 1870717 2316772 2348275 1853021 2451549 2160009
16873 2160009 2033105 2317129 2255522 2559558 2480011 2406071 2170653 2401535 2333970 2740815
16863 2740815 2393584 2332893 2629183 2865369 2735863 2626290 2849830 3004537 3080676 2924399
$$ packed form
16934A010777J89133J27594j87681L01858M7514j85856J09956m2258m8283O2840
16924A385594o0164r4940j65650L56391k54355L50445m70649K54677l03283M59354
16914A457420L4117P2172j6098j24058J38632k05627M8169K8101p3944l1539L49324
16903A676669J2180k56946J88888K30662k57843L78000m49658p3148Q6593J28651
16893A664048P6032k21418J43442j5242L31077L3336q5762N6533J06950M5825
16883B134821J07598k78621o6439J65931j92573M46055L1503m95254N98528k91540
16873B160009j26904K84024o1607L04036p9547p3940k35418K30882o7565M06845
16863B740815l47231o0691K96290K36186j29506j09573K23540J54707P6139j56277
$$ plain form
16853 2924399 2904148 3256526 2881115 3058799 3248080 3078683 3421962 3116897 3305678 3514126
16843 3514126 3283511 3695898 3285753 3594323 3502065 3882923 4059024 4189909 3595527 4038177
16833 4038177 3681894 4281874 3899070 4132722 4365969 4306468 4406820 4650898 4961093 4611981
16823 4611981 5063610 4875646 4965596 5504466 5173485 5161989 5330526 5401601 5389547 5724567
16813 5724567 5430077 6026471 5832155 6578789 6360414 6241673 6767371 6644060 7201119
16804 7201119 7651099 6931904 7451739 7626378 7693906 8323970 8070107 8376634 8288596 8368032
16794 8368032 8996451 9095270 9312159 9933075 9993864 10080822 10605846 10853345 11108208 11065842
16784 11065842 11893730 11987243 12385770 12496669 13300708 13584687 14082945 14271146 14450028
$$ packed form
16853B924399k0251L52378l75411J77684J89281j69397L43279l05065J88781K08448
16843C514126k30615M12387m10145L08570r2258L80858J76101J30885n94382M42650
16833D038177l56283N99980l82804K33652K33247n9501J00352K44078L10195l49112
16823D611981M51629j87964Q9950N38870l30981j1496J68537P1075j2054L35020
16813E724567k94490N96394j94316P46634k18375j18741N25698j23311N57059
16804G201119M49980p19195N19835J74639O7528O30064k53863L06527q8038P9436
16794H368032O28419R8819K16889O20916O0789Q6958N25024K47499K54863m2366
16784A1065842Q27888R3513L98527J10899Q04039K83979M98258J88201J78882
$$ plain form
16775 14450028 15569042 15591699 16298146 16638963 17249339 17718648 18632240 19430779 20073842
16766 20073842 20771894 21539160 21990997 23108783 24504709 25082545 26302301 27263550 28389957
16757 28389957 29793659 30926973 32286908 33919849 35339452 37251177 38801105 40995125
16749 40995125 43003473 45340359 47773940 49961554 52882624 56063394 58973116 62162185
16741 62162185 66031002 70235362 74177664 78741528 83661848 88518460 94076073 100027294
16733 100027294 106286272 112870927 119830603 127124334 134884110 142635315 150476580 158331723
16725 158331723 165972026 173794849 180688853 186949510 192261675 196563192 199522590 200734887
16717 200734887 201210418 200057569 196901491 192981155 187812101 181741268 174792703 167207947
$$ packed form
16775A4450028J119014K2657P06447L40817O10376M69309R13592P98539O43063
16766B0073842O98052P67266M51837J117786J395926N77836J219756R61249J126407
16757B8389957J403702J133314J359935J632941J419603J911725J549928K194020
16749D0995125K008348K336886K433581K187614K921070L180770K909722L189069
16741F2162185L868817M204360L942302M563864M920320M856612N557613N951221
16733A00027294O258978O584655O959676P293731P759776P751205P841265P855143
16725A58331723P640303P822823O894004O260657N312165M301517K959398J212297
16717B00734887M75531j152849l156078l920336n169054o070833o948565p584756
$$ plain form
16709 167207947 159476822 151501912 143116916 135059694 127348396 119931214 112650511 105843565
16701 105843565 99321659 93153454 87614509 82503472 77465634 72773012 68416514 64470533
16693 64470533 61070343 57663935 54183900 51416649 48477679 45999933 43863649 41441843
16685 41441843 39300724 37711445 35519242 33691966 32550727 30986370 29570856 28020484
16677 28020484 27084282 25745325 24733854 23821435 22956997 21664613 20905026 20593481 19194365
16668 19194365 18843839 18414943 17606448 17171614 16157537 15831176 15237361 14835310 14284613
16659 14284613 13493305 13548639 12995591 12507986 12147780 11533429 11156603 10804445 10537850
16650 10537850 10276095 10052704 9872032 9466045 9071648 8981291 8645351 8447533 8452356 8194610
$$ packed form
16709A67207947p731125p974910q384996q057222p711298p417182p280703o806946
16701A05843565o521906o168205n538945n111037n037838m692622m356498l945981
16693F4470533l400190l406408l480035k767251k938970k477746k136284k421806
16685D1441843k141119j589279k192203j827276j141239j564357j415514j550372
16677B8020484r36202j338957j011471r12419q64438j292384p59587l11545j399116
16668A9194365l50526m28896q08495m34834j014077l26361n93815m02051n50697
16659A4284613p91308N5334n53048m87605l60206o14351l76826l52158k66595
16650A0537850k61755k23391j80672m05987l94397r0357l35940j97818M823k57746
$$ plain form
16640 8194610 7901141 7703010 7457029 7054980 6922216 7087264 6993502 6631554 6544324 6308442
16630 6308442 6237827 5891872 5869287 5805679 5797835 5910512 5445515 5042739 5163929 5260695
16620 5260695 5275299 4245581 4744924 4638455 4929957 4383269 4597027 4447481 4152517
16611 4152517 4370495 4315588 3983739 3884613 3907045 3831890 3815121 3763070 3501030 3471655 3509966
16600 3509966 3237083 3478080 3227715 2932743 3136854 3194787 3091018 2695994 3173035 3086772
16590 3086772 2599996 2487945 2637169 2768002 2764797 2599251 2556393 2524670 2665124 2350404
16580 2350404 2279051 2615477 2569957 2387911 2269485 2350784 2168788 2139874 2428884 2028258
16570 2028258 2057480 2162298 1786490 2130241 1898129 1650079 1947018 2120763 2180751 1888772
$$ packed form
16640H194610k93469j98131k45981m02049j32764J65048r3762l61948q7230k35882
16630F308442p0615l45955k2585o3608p844J12677m64997m02776J21190R6766
16620E260695J4604j029718M99343j06469K91502n46688K13758j49546k94964
16611D152517K17978n4907l31849r9126K2432p5155j6769n2051k62040k9375L8311
16600C509966k72883K40997k50365k94972K04111N7933j03769l95024M77041q6263
16590C086772m86776j12051J49224J30833l205j65546m2858l1723J40454l14720
16580B350404p1353L36426m5520j82046j18426Q1299j81996k8914K89010m00626
16570B028258K9222J04818l75808L43751k32112k48050K96939J73745N9988k91979
$$ plain form
16560 1888772 1746555 2010255 1763921 1733540 1779347 1533129 1342022 1737048 1442401 1537268
16550 1537268 1419988 1458160 1516278 1465179 1711907 1325933 1400183 1344520 1324702 1753877
16540 1753877 1305436 1128126 1451874 1541009 1071153 1105222 1325100 1269847 1033166 1314882
16530 1314882 1232872 1199543 921545 1083427 1114208 1103118 1019871 1012690 1486128 913360 1132571
16519 1132571 763138 1075639 849591 1184823 944944 828971 1263213 1048557 985631 737487
16509 737487 711772 1161251 838739 967093 890526 954075 1019261 1145722 912191 774452
16499 774452 479974 910126 820706 732716 658954 609094 835088 581016 903342 841751
16489 841751 858567 1023497 804416 917021 833900 699545 815651 711028 818082 384259
$$ packed form
16560A888772j42217K63700k46334l0381M5807k46218j91107L95026k94647R4867
16550A537268j17280L8172N8118n1099K46728l85974P4250n5663j9818M29175
16540A753877m48441j77310L23748Q9135m69856L4069K19878n5253k36681K81716
16530A314882q2010l3329k77998J61882L0781j1090q3247p181M73438n72768K19211
16519A132571l69433L12501k26048L35232k39879j15973M34242k14656o2926k48144
16509G37487k5715M49479l22512J28354p6567O3549O5186J26461k33531j37739
16499G74452k94478M30152q9420q7990p3762m9860K25994k54072L22326o1591
16489H41751J6816J64930k19081J12605q3121j34355J16106j04623J07054C84259
$$ plain form
16478 867338 564954 774667 839827 1174627 620041 1011294 622553 934557 668783 838679
16468 838679 757835 615721 573357 421329 457961 739564 776621 457989 500970 574688 486953
16457 486953 383982 878260 685414 867501 557035 734478 141421 688483 184037 684180
16447 684180 660297 867583 487210 508680 361514 -23949 656560 363812 541332 421291
16437 421291 260785 393522 253959 135016 347368 604305 359431 430505 383712 289120
16427 289120 543830 456001 410327 468781 177602 320632 436352 271568 556285 607618
16417 607618 538424 492098 520129 344427 303377 574625 368809 203142 602924 468484
16407 468484 370097 549348 273462 133804 269556 381140 509551 626337 362949 648641
$$ packed form
16478H67338l02384K09713O5160L34800n54586L91253l88741L12004k65774J69896
16468H38679q0844j42114m2364j52028L6632K81603L7057l18632M2981P3718q7735
16457D86953j02971M94278j92846J82087l10466J77443A41421N47062A84037N00143
16447F84180k3883K07286l80373K1470j47166b3949F56560k92748J77520j20041
16437D21291j60506J32737j39563j18943K12352K56937k44874P1074m6793r4592
16427B89120K54710q7829m5674N8454A77602J43030J15720j64784K84717N1333
16417F07618o9194m6326K8031j75702m1050K71248k05816j65667L99782j34440
16407D68484r8387J79251B73462A33804J35752J11584J28411J16786k63388K85692
$$ plain form
16397 648641 437673 455903 56986 224795 24556 425114 129186 309369 434400 488234
16387 488234 285153 465604 413678 280899 270200 263971 237507 403931 151819 470796
16377 470796 331918 354278 386439 198865 45551 200275 132308 341793 175419 175554 245882
16366 245882 357579 446379 71330 108244 366729 170948 143960 223994 419643 304911
16356 304911 356654 238980 312231 23789 376655 261129 406850 -150851 300104 684639
16346 684639 348588 412848 174926 229995 299425 259283 284419 185851 314968 148249 359085
16335 359085 341768 213187 193264 300240 233612 119084 59106 139072 601923 144258
16324 133799 54618 -113210 265449 57373 270355 308996 14521 133876 297531 65686
$$ packed form
16397F48641k10968J8230E6986J67809B4556M00558A29186J80183J25031N3834
16387D88234k03081J80451n1926j32779j0699o229k6464J66424A51819L18977
16377D70796j38878K2360L2161j87574D5551J54724o7967K09485j66374J35P0328
16366B45882J11697Q8800G1330L6914K58485A70948k6988Q0034J95649j14732
16356C04911N1743j17674P3251B3789L52866j15526J45721a50851C00104L84535
16346F84639l36051O4260A74926N5069O9430m0142K5136r8568J29117A48249K10836
16335C59085j7317j28581j9923J06976o6628j14528E9106P9966M62851A44258
16324A33799E4618a13210B65449E7373K12982L8641A4521J19355J63655F5686
$$ plain form
16313 145496 -148111 243118 140343 214978 625517 340375 390268 196561 225387 175694
16303 175694 -3219 103849 38430 314071 -17573 115012 267424 210430 76228 82539 394492
16292 394492 121092 135022 -23964 314994 395065 -104941 81161 -121426 355473 162904
16281 -2043 124524 117919 -8149 145879 124922 -29244 -25129 343713 125017 245842 96847
16269 465140 265970 99270 184735 156242 114738 154676 25693 172362 -51966 409408 137265
16257 1113 142394 -22845 -37689 109039 202784 -169133 253831 7131 222640 33649 99417
16246 99417 -34587 63973 453603 -195927 91813 323041 22664 -32538 13642 -120741 122796
16234 128782 278764 -19713 -131394 -73424 153725 -251321 185222 -7068 -116998 22593
$$ packed form
16313A45496a48111B43118j02775P4635M10539k85142M9893j93707K8826m9693
16303A75694c219A03849C8430K75641a7573A15012J52412n6994G6228O311L11953
16292C94492A21092J3930b3964C14994Q0071a04941H1161a21426C55473A62904
16281b043A24524o605h149A45879k0957b9244M115C43713A25017J20825I6847
16269D65140j99170I9270Q5465k8493m1504L9938B5693J46669e1966D09408A37265
16257A113J41281b2845j4844A09039R3745a69133B53831G131K15509C3649O5768
16246I9417c4587F3973L89630a95927I1813K31228B2664c2538A3642a20741A22796
16234A28782J49982a9713j11681N7970A53725b51321A85222g068j09930B2593
$$ plain form
16223 -174817 418889 -85236 24376 -101074 -54304 347307 -4147 31050 217071 -26597 87712
16211 295617 -66741 -121944 188283 93238 219281 15140 211508 278949 120624 -16735 -44070
16200 -44070 47247 126216 368963 13252 90820 -267303 91045 3064 -41465 -259273 -68345
16188 292263 -170999 358792 299570 67094 297108 225336 201354 347760 18852 41999 -184628
16176 -119855 -266307 -408999 185814 41986 81182 -298395 31461 156657 -32822 -107025
16166 -107025 47983 234288 -164798 -187008 66611 135951 -126551 25021 61470 -92405 205813
16154 237000 197074 -14818 10527 136624 84811 -6587 -132309 3635 -3311 71771 221034
16143 221034 -59983 201209 -25100 130648 -270990 -134966 188863 -210267 578941 84930
$$ packed form
16223a74817D18889h5236B4376a01074M6770C47307d147C1050J86021b6597H7712
16211B95617f6741n5203A88283I3238J26043A5140J96368O7441A20624a6735k7335
16200d4070D7247P8969K42747A3252P7568b67303I1045C064d1465k17808f8345
16188B92263a70999C58792n9222F7094K30014p1772k3982J46406A8852K3147a84628
16176a19855j46452j42692A85814D1986L9196b98395C1461J25196c2822p4203
16166a07025D7983J86305a64798k2210F6611O9340a26551B5021L6449i2405B05813
16154B37000l9926a4818A0527J26097n1813f587j25722C635c311G1771J49263
16143B21034e9983B01209b5100A30648b70990a34966A88863b10267E78941H4930
$$ plain form
16132 -74875 -328631 182509 78334 269556 -92874 -138982 240050 -13213 -18071 -114533 -60459
16121 -60459 -307924 127553 281794 -169993 -52871 -9099 8260 38520 95637 37666 178603
16110 178603 299595 -161132 197015 -32398 154109 15937 -71686 80027 -104112 -135040
16100 -135040 133394 76072 259001 88029 154296 13595 -165927 -96874 -219190 -160882 -256843
16089 -256843 169702 -88162 84290 -361932 46856 -18115 152976 324482 338588 -126443
16078 20213 -50695 -77846 -255393 -62263 -220085 -144147 46394 335187 648 339794 -346066
16066 -332321 357398 -97164 47033 -170925 143028 -18419 142348 292622 218994 34388
16055 242009 19571 271841 248927 69319 -266277 -48213 -542472 138729 -178815 -46094
$$ packed form
16132g4875k53756A82509G8334J91222i2874m6108B40050a3213m858r6462N4074
16121f0459k47465A27553J54241a69993e2871i099H260L0260N7117C7666J40937
16110A78603J20992a61132A97015c2398A54109A5937g1686H0027a04112l0928
16100a35040A33394n7322J82929H8029O6267A3595a65927O9053j22316N8308r5961
16089b56843A69702h8162H4290c61932D6856a8115A52976J71506J4106a26443
16078B0213e0695k7151j77547f2263j57822P5938D6394K88793F48L39146c46066
16066c32321C57398i7164D7033a70925A43028a8419A42348J50274p3628C4388
16055B42009A9571K52270k2914F9319b66277d8213m94259A38729a78815d6094
$$ plain form
16044 -47394 -55765 -23569 492 -35205 68694 199942 -13832 140320 -241255 333916 3376 -228100
16031 -303357 3010 201275 46844 54806 -284315 56255 -95472 155562 238294 -277017 147653
16019 155294 -325168 516842 -213410 -250782 193960 -83609 -60545 117930 -156733 -13417
16008 8894 -144811 219021 64962 65636 195194 -126695 -220517 91678 -273506 -212116 27946
15996 -65858 -249134 -286831 -124018 -20936 19146 69032 -107717 -135658 -9628 -82687 -34860
15984 159502 141128 113556 258275 396244 362409 200278 261743 87915 -75912 -134868 -5321
15972 -63072 -127077 -40907 102842 -144643 -200903 128587 143310 -162508 59297 129875 157053
15961 157053 320282 -199134 -518018 -36414 -74148 75827 127810 -171651 187 -21357 -137038
$$ packed form
16044d7394q371b3569D92c5205F8694J31248a3832A40320b41255C33916C376b28100
16031c03357C010J98265D6844P962b84315E6255i5472A55562Q2732b77017A47653
16019A55294c25168E16842b13410l7372A93960h3609K3064A17930a56733a3417
16008H894a44811B19021F4962O74J29558a26695r3822I1678b73506O1390B7946
15996f5858j83276l7697a24018b0936A9146M9886a07717k7941i628p3059c4860
15984A59502j8374k7572J44719J37969l3835j62131O1465H7915g5912n8956e321
15972f3072o4005d0907A02842a44643n6260A28587J4723a62508E9297P0578K7178
15961A57053J63229a99134l18884c6414l7734G5827N1983a71651A87b1357j15681
$$ plain form
15950 -137038 -363214 188465 8082 -146812 -158410 247839 10456 53073 189009 -14334 116366
15938 290765 -307763 123288 -218155 54147 303616 -155755 -105069 -79343 -104851 83700
15927 -106466 -151838 150170 -75876 -254281 60769 341773 119608 -171315 -221890 -507940
15917 -507940 104429 -3055 260646 -16793 -377089 26180 88806 -73671 -217077 -56214 89358
15905 -193753 27873 218371 -161206 -61527 2486 -115537 -44155 -44745 47990 138052 -81445
15893 -189434 161738 -194895 210950 66491 337794 -305137 -105183 236096 73153 44052
15883 44052 -113377 51092 -55836 182692 -278986 361202 -140672 209542 57571 50476 -214328
15871 -116962 -163889 24400 -195707 104025 -258676 -107838 126434 -476598 -143839 195717
$$ packed form
15950a37038k26176A88465H082a46812j1598B47839A0456M2617J35936a4334A16366
15938B90765c07763A23288b18155E4147K49469a55755N0686K5726k5508H3700
15927a06466m5372A50170g5876j78405F0769K81004A19608a71315n0575k86050
15917e07940A04429c055B60646a6793l60296B6180O2626g3671j43406e6214H9358
15905a93753B7873J90498a61206f1527B486a15537d4155n90D7990R0062h1445
15893a89434A61738a94895B10950F6491K71303c05137a05183B36096G3153k9101
15883D4052a13377E1092e5836A82692b78986C61202a40672B09542E7571p095b14328
15871a16962m6927B4400a95707A04025b58676a07838A26434d76598a43839A95717
$$ plain form
15860 25215 -72278 -335316 295005 53636 48389 -40322 79588 -65434 66427 -101988 134119
15848 79095 -258792 -308485 -269955 227196 -19554 25386 -152708 157663 -32436 206558 -25262
15836 135129 142926 -73577 168991 -135799 31467 -101387 -244344 -152182 -243209 285831 -226203
15824 -205380 -9059 103878 117757 -479887 71263 -259677 -293267 -180678 -208649 -393802 -263859
15813 -263859 -130616 -19182 -127863 -196759 -160990 -20669 -208258 173401 145314 -54921 91734
15801 32231 160678 92550 177564 231667 -77286 140541 -44425 -71110 -32308 80393 -42461
15789 -179288 172382 113833 -42506 -83535 258129 -67934 -10232 -149217 -231786 -160222 148090
15777 -93904 228431 326475 207810 233716 298746 425277 61157 -192371 -374555 36191 -116474
$$ packed form
15860B5215g2278k63038B95005E3636n247d0322G9588f5434F6427a01988A34119
15848G9095b58792m9693L8530B27196a9554B5386a52708A57663c2436B06558b5262
15836A35129P797g3577A68991a35799C1467a01387j42957R2162r1027B85831b26203
15824b05380i059A03878J3879d79887G1263b59677l3590J12589k7971j85153J29943
15813b63859a30616a9182j08681o8896L5769b0669j87589A73401k8087e4921I1734
15801C2231J28447o8128Q5014N4103g7286A40541d4425k6685c2308H0393d2461
15789a79288A72382n8549d2506m1029B58129f7934a0232j38985q2569P1564A48090
15777i3904B28431R8044j18665K5906O5030J26531F1157a92371j82184C6191a16474
$$ plain form
15765 -216903 -200409 -155660 -13084 -133002 -15832 -249563 124539 404457 138998 40765
15754 -28577 -82424 327572 280294 -296482 15384 -71252 121976 107873 2845 41665 11289
15742 76929 -188601 92872 -170784 94344 -82128 -31132 -7010 -16888 -29018 -319860 375246
15730 175534 -105972 170672 84186 320006 -183017 -141519 -180095 6774 -40904 69584 -184906
15718 -30828 25291 -538840 -54720 -198153 -25494 86397 -55245 -126240 -64140 -18966 -50380
15707 -50380 -147682 -132724 -183943 -76640 -234397 -146658 -88824 74251 -18316 83840 -8834 45399
15694 -257653 141213 -61547 -115852 -53642 21586 89542 16156 374548 -21362 186982 -119082
15682 89166 -202013 26489 126829 -392213 -323754 -53882 -111693 -486020 91851 -150778 -194626
$$ packed form
15765b16903J6494M4749a3084j19918a5832k33731A24539K79918A38998D0765
15754b8577n3847C27572m7278b96482A5384g1252A21976j4103B845L8820A1289
15742G6929a88601I2872a70784I4344h2128c1132g010r878j2130k90842C75246
15730A75534a05972A70672H4186K35820a83017M1498l8576F774d0904F9584a84906
15718c0828B5291e38840e4720j43433b5494H6397e5245p0995O2100a8966l1414
15707e0380r7302J4958n1219g6640j57757Q7739N7834G4251a8316H3840h834D5399
15694b57653A41213f1547n4305e3642B1586O7956A6156L58392b1362A86982a19082
15682H9166b02013B6489J00340c92213O8459e3882n7811l74327I1851a50778m3848
$$ plain form
15671 -194626 383621 -63344 274886 -55756 50360 -319666 -107429 208457 -271691 -288284
15661 -288284 -5260 112015 -156106 94695 179238 -167851 -89247 -49227 -246870 -52885 -359178
15650 -359178 -247161 70299 32084 -197320 -29199 -177063 61986 259508 581225 123519
15639 200726 95480 -132122 203031 41011 348297 11558 206953 88949 -241252 231250
15628 -124692 53451 12307 -49019 198414 -207641 53011 37621 -27334 -83268 -91018 112040
15616 158650 4521 -149320 -95082 94359 -184803 75508 -121784 -29123 -250547 76102 47764
15605 47764 60835 -392042 94164 3809 -46874 73301 76276 25356 10751 -195053 285896
15593 -208171 -220786 11032 -270724 -85200 -22763 -96137 23008 16452 -155350 -28144 -60110
$$ packed form
15671a94626C83621f3344B74886e5756E0360c19666a07429B08457b71691j6593
15661b88284e260A12015a56106I4695Q4543a67851P8604M0020j97643e2885l06293
15650c59178J12017G0299C2084a97320b9199j47864F1986J97522L21717A23519
15639B00726I5480a32122B03031D1011L07286A1558J95395H8949b41252B31250
15628a24692E3451A2307d9019A98414b07641E3011j5390b7334n5934p750A12040
15616A58650D521a49320N4238I4359a84803G5508a21784b9123k21424G6102k8338
15605D7764J3071c92042I4164C809d6874G3301K975B5356A0751a95053B85896
15593b08171j2615A1032b70724h5200b2763p3374B3008o556a55350b8144l1966
$$ plain form
15582 -60110 -89329 -106209 -123974 8585 -17371 -138240 187545 -124838 90688 112315 -245968
15570 -62392 -156962 68604 -24991 -309294 -87077 132004 -35372 45342 281781 245013 -226920
15558 65768 185931 98563 -313884 -251899 -190611 -160263 33749 -78542 120414 -106775 257551
15546 167666 75469 -284652 -51826 -110404 -170837 48913 -109117 -202304 37821 378400 172706
15534 -13630 -64642 85903 -47810 28322 -63759 112974 284116 4018 302175 195820 -123578
15522 55245 -209209 -126796 287250 -118134 -65551 167815 220470 87414 -190682 -82513 6726
15510 45280 89396 34548 179700 119860 -105898 -338134 83059 -122077 -304041 -11500 -265736
15499 -265736 -71054 77443 -139380 -193237 -306387 -105397 -63485 49439 28135 -25791 -100199
$$ packed form
15582f0110k9219j6880j7765H585a7371j20869A87545a24838I0688K1627b45968
15570f2392r4570F8604b4991k84303h7077A32004c5372D5342K36439l6768b26920
15558F5768J20163q7368c13884O1985O1288L0348C3749g8542A20414a06775B57551
15546A67666G5469b84652e1826n8578o0433D8913a09117r3187C7821L40579A72706
15534a3630n1012H5903d7810B8322f3759A12974J71142D018K98157j06355a23578
15522E5245b09209Q2413B87250a18134N2583A67815N2655H7414a90682h2513F726
15510D5280M4116C4548J45152n9840a05898k32236H3059a22077j81964a1500k54236
15499b65736g1054G7443a39380n3857j13150a05397M1912D9439k1304b5791p4408
$$ plain form
15488 -100199 160950 85767 122583 123150 791 96361 190074 -62800 8148 47154 -27084 -185775
15476 -185775 -74274 70655 330421 -151768 30905 -279672 200519 -291918 -112749 -105575
15466 -105575 -164318 -49039 -144890 102477 -54269 -78368 358135 155471 234837 230400 32745
15454 -190160 -144080 78802 -80944 79008 15435 48949 -42681 -73626 284449 -28119 137691
15442 165356 -43939 -136233 -28394 62906 142839 -198011 -103547 168449 37575 -321052 -226468
15431 -226468 84959 234456 -80768 -29088 141365 -125115 130882 -70440 -114125 -35912 -47341
15420 -47341 130529 -14436 -173628 -95840 -195413 49564 -23535 16251 136323 198490 126887
15409 126887 112499 -205962 70205 -31970 105414 -30446 -336025 -7683 105230 339299 172557
$$ packed form
15488a00199A60950p5183L6816N67G91R5570R3713f2800H148L9006b7084j58691
15476a85775g4274G0655K59766a51768C0905b79672B00519b91918a12749P174
15466a05575n8743d9039r5851A02477e4269k4099C58135A55471P9366m437C2745
15454a90160M6080G8802h0944G9008A5435L3514d2681l0945B84449b8119A37691
15442A65356d3939r2294b8394F2906P9933a98011R4464A68449C7575c21052R4584
15431b26468H4959J49497h0768b9088A41365a25115A30882g0440m3685c5912j1429
15420d7341A30529a4436j59192P7788r9573D9564b3535A6251J20072O2167p1603
15409A26887j4388b05962G0205c1970A05414c0446l05579g683A05230K34069j66742
$$ plain form
15398 172557 -130332 11314 -395691 180361 -53455 81636 -111383 194351 7958 159866
15388 159866 251836 -14731 220127 230102 -65527 -34239 -53368 5630 21418 344076 -109342
15376 223377 161841 156657 124179 200416 156628 -101864 -120396 -257462 30821 67236 -150749
15364 301946 -125024 132580 276188 -22318 -315888 -116428 77859 11041 337931 421657
15354 421657 -30942 246160 -172062 133567 -365243 -303207 -152461 77138 216443 -118455
15343 184358 224503 88749 -91400 -118588 297571 -127001 -83562 -130415 -30453 105492 -244654
15331 -97237 96673 267794 224683 3331 198353 -43953 -184077 209368 -381164 -7544 255589
15319 -216864 213502 -36855 41735 -3777 191461 170945 261429 54898 -31112 22941 -102963
$$ packed form
15398A72557a30332A1314c95691A80361e3455H1636a11383A94351G958J51908
15388A59866R1970a4731B20127R975f5527L1288j9129E630J5788L22658a09342
15376B23377o1536n184l2478P6237m3788a01864j8532j37066C0821L6415a50749
15364C01946a25024A32580J43608b2318k93570a16428G7859A1041L26890Q3726
15354D21657c0942B46160a72062A33567c65243O2036J50746G7138J39305a18455
15343A84358M0145H8749i1400k7188B97571a27001M3439m6853c0453A05492b44654
15331i7237I6673J71121m3111C331J95022d3953j40124B09368c81164g544B55589
15319b16864B13502c6855D1735c777A91461k0516R0484E4898c1112B2941a02963
$$ plain form
15307 -156770 -5927 -420 -114613 136391 85011 248319 78295 26411 38261 -130760 23592
15295 190331 114698 -203514 -127101 -58576 45633 -14949 -46121 -322358 -194512 174066 49358
15283 71110 12365 59080 105674 -73398 -59240 48833 142926 52997 -64445 -189803 -193603 385503
15270 259880 8472 21295 207235 -196671 -144611 11652 149431 435659 -35616 -138164 -280361
15259 -280361 79606 50396 -75570 -68511 73481 18280 259141 327062 -17239 293736 665583
15248 665583 1242168 1687984 1363663 1592600 769767 514010 -315286 210780 57061 -201363
15237 69483 246940 -81747 57121 142463 -151156 -96029 78959 155667 35568 -236733 48439
15225 -43099 -37798 100201 89917 -147196 337768 -166614 99422 262591 7240 -94813 235104
$$ packed form
15307a56770e927d20j14193A36391n1380J63308G8295B6411J1850a30760B3592
15295A90331p5633b03514P6413e8576D5633a4949l1172k76237J27846A74066D9358
15283G1110A2365M6715M6594g3398J4158D8833R4093E2997f4445j25358l800C85503
15270B59880H472J2823J85940a96671N2060A1652J37779K86228c5616j02548j42197
15259b80361G9606k9210g5570P059G3481A8280K40861O7921a7239B93736L71847
15248F65583N76585M45816l24321K28937G69767k55757c15286B10780E7061b01363
15237F9483J77457h1747E7121Q5342a51156N5127G8959P6708C5568b36733D8439
15225d3099N301A00201j0284a47196C37768a66614I9422J63169G240i4813B35104
$$ plain form
15213 48244 278830 186961 -110013 325196 -108903 327434 127531 -75311 372518 84544
15202 -18639 -146929 54500 5689 240682 68004 -69316 -288216 147754 105683 198398 -148625
15190 25195 73900 302570 193846 -165436 113684 325940 -129692 -73576 3922 53053 256300
15179 256300 -245405 274483 39461 -134675 -56452 164943 27489 -55547 200223 -29406
15168 338858 134900 -197602 171226 219103 -141074 61301 217937 71086 -1617 61837 257778
15157 257778 -175169 143589 78876 281790 -93245 -187743 -29578 8276 -24457 240863 149463
15146 149463 31002 224535 -255138 -351122 290032 138658 138275 -293935 457132 120082
15135 -6489 227943 251779 46535 -111721 -94495 79632 299915 165421 -104373 -205631 106628
$$ packed form
15213D8244K30586r1869a10013C25196a08903C27434A27531g5311C72518H4544
15202a8639j28290E4500E689K34993F8004f9316k18900A47754m2071R2715a48625
15190B5195M8705K28670j08724a65436A13684K12256a29692N6116C922M9131K03247
15179B56300b45405B74483C9461a34675e6452A64943B7489e5547B00223b9406
15168C38858A34900a97602A71226M7877a41074F1301J56636G1086a617F1837J95941
15157B57778a75169A43589o4713K02914i3245r4498b9578H276b4457B40863r1400
15146A49463C1002J93533b55138r5984B90032A38658l83b93935D57132A20082
15135f489B27943K3836D6535a11721J7226G9632K20283j34494a04373j01258A06628
$$ plain form
15123 87746 125330 161173 239737 153511 141430 360455 -104486 -310078 -42629 58568 -82730
15111 24893 41105 18546 -12969 33031 49430 110124 171077 67697 205865 256435 187578
15100 187578 39310 317962 154452 78973 -55976 130611 258897 53168 -106771 183270
15089 446733 -135583 158215 392677 142554 272682 98076 145927 232169 104797 449786
15079 449786 60730 222568 133025 -43977 94946 208725 -20047 -165 269340 52350 106747
15068 106747 171030 695491 22967 20459 -227880 269801 -9484 59816 -8197 112536 191292
15057 191292 113125 249383 114513 403585 162991 198809 189208 405111 98788 35856 40665
15046 40665 62422 -123224 68 183406 212462 481128 140172 341739 151197 368439 64008
$$ packed form
15123H7746L7584L5843P8564q6226j2081K19025a04486k05592d2629E8568h2730
15111B4893J6212A8546a2969C3031J6399O0694O0953F7697J38168N0570o8857
15100A87578C9310K78652A54452p5479e5976A30611J28286E3168a06771A83270
15089D46733a35583A58215K34462A42554J30128I8076M7851Q6242A04797L44989
15079D49786F0730J61838q9543d3977I4946J13779b0047a65B69340E2350N4397
15068A06747O4283N24461B2967k508b27880B69801i484E9816h197A12536P8756
15057A91292p8167J36258A14513K89072A62991L5818r601K15903I8788C5856M809
15046D0665K1757a23224F8J83338K9056K68666A40172K01567A51197K17242F4008
$$ plain form
15034 140371 -7897 101692 -61867 2469 -41455 80201 546720 166988 283482 179254 132300
15023 132300 303147 86761 297558 72021 68949 44436 375165 -122670 53155 -111983 325468
15011 271653 152482 -13395 349600 111160 248033 153443 345959 181279 1433 182882
15001 182882 262959 195524 160578 229360 -76548 -75231 226653 226911 327103 268192 164614
14990 164614 -152616 581 -27354 347973 593470 178750 61077 -162790 377701 729035
14980 729035 137714 304869 214384 417908 183584 280408 184427 325902 388179 201198
14970 201198 147401 -190732 366730 3882 49827 -142608 410600 377452 3856 231571 438287
14959 438287 177555 309766 365447 326586 29944 101231 20139 355733 241372 102065
$$ packed form
15034A40371g897A01692f1867B469d1455H0201M66519A66988J16494j04228m6954
15023A32300J70847H6761K10797G2021l072k4513L30729a22670E3155a11983C25468
15011B71653j19171a3395C49600A11160J36873r4590J92516j64680A433J81449
15001A82882Q0077o7435l4946O8782g6548J317B26653K58J00192n8911j03578
14990A64614a52616E81b7354C47973K45497A78750F1077a62790C77701L51334
14980G29035A37714J67155r0485K03524A83584R6824r5981J41475O2277j86981
14970B01198n3797a90732C66730C882M5945a42608D10600l3148C856K27715K06716
14959D38287A77555J32211N5681l8861B9944P1287B0139L35594j14361A02065
$$ plain form
14948 257735 535950 348257 297714 -37063 262146 58671 71039 285620 187677 571945
14938 571945 -175816 512543 374734 424858 444436 339583 284502 411632 -45448 512105
14927 312817 239135 423749 113698 373873 277842 167454 406876 501029 191728 314478
14917 314478 201578 612561 171564 -156915 68444 111040 423734 492066 248999 217483
14907 217483 63303 197149 343709 372457 376271 262742 571119 547960 133788 702462
14897 702462 351204 303242 704765 520151 209562 447930 498522 63471 608516 34258
14886 143375 270949 487417 530241 92901 325205 418154 581323 168867 323594 375394
14876 375394 328549 203319 85942 245558 256049 415896 256060 141684 65136 239143
$$ packed form
14948B57735K78215j87693n0543c7063B62146E8671J2368K14581r7943L84268
14938E71945a75816E12543j37809N0124J9578j04853n5081J27130d5448E12105
14927C12817p3682J84614A13698K60175r6031j10388K39422R4153A91728J22750
14917C14478j12900M10983A71564a56915F8444M2596L12694O8332k43067l1516
14907B17483F3303J33846J46560K8748L814j13529L08377k3159A33788N68674
14897G02462C51204m7962M01523j84614B09562K38368N0592F3471N45045C4258
14886A43375J27574K16468M2824I2901K32304R2949J63169A68867J54727N1800
14876C75394m6845j25230H5942J59616J0491J59847j59836j14376F5136J74007
$$ plain form
14866 239143 185371 523219 456186 575303 417710 98837 492741 468312 237220 203718
14856 203718 415788 731515 331211 424934 206680 280076 243836 486264 513820 400937
14846 400937 498755 258051 44281 604076 714935 654474 341193 560656 346023 371776
14836 371776 213759 427209 408320 620620 746295 680387 768323 572098 373919 614255
14826 614255 230943 33650 499190 254036 864418 594131 408790 105722 590573 194165
14815 198321 359663 462517 340595 373813 519005 357324 481166 200015 657259 515043
14805 515043 134587 298987 278300 362262 648740 545562 510652 634494 413672 446092
14795 446092 634554 623612 413998 321904 466031 695411 692092 363194 712044 528331
$$ packed form
14866B39143n3772L37848o7033J19117j57593I8837L93904k4429k31092l3502
14856B03718K12070L15727C31211R3723B06680P3396l6240K42428K7556j12883
14846D00937R7818k40704D4281N59795J10859o0461l13281K19463k14633K5753
14836C71776j58017K13450j8889K12300J25675o5908Q7936j96225j98179K40336
14826F14255B30943C3650M65540k45154O10382k70287j85341A05722M84851A94165
14815A98321J61342J02854j21922L3218J45192j61681J23842B00015M57244j42216
14805E15043A34587J64400k0687Q3962K86478j03178l4910J23842k20822L2420
14795D46092J88462j0942k09614r2094J44127K29380l319l28898L48850j83713
$$ plain form
14785 528331 634874 502253 672835 551839 431624 559433 430538 743417 505941 495023
14775 495023 519633 324081 361122 690249 526415 825703 869999 733969 505920 468342
14765 468342 388034 534397 503046 606744 317644 398073 372003 808320 734375 843961
14755 843961 818566 560069 798635 512375 498936 407343 826498 534341 978878 333466
14744 826884 394487 827692 770917 630274 682951 678701 585939 688419 657178 654428 795769
14733 795769 825491 697464 714744 883634 939823 687717 791183 647371 791470 979039
14723 979039 1021053 896892 762028 709541 678416 1061699 982590 694789 925900 658583
14713 658583 609107 754084 1039429 793132 467710 1050547 1017346 768117 742863 673455
$$ packed form
14785E28331J06543j32621J70582j20996j20215J27809j28895L12879k37476j0918
14775D95023K4610j95552L7041L29127j63834K99288M4296j36030k28049l7578
14765D68342q0308J46363l1351J03698k89100Q0429k6070M36317p3945J09586
14755H43961k5395k58497K38566k86260j3439r1593M19155k92157M44537C33466
14744H26884C94487M33205n6775j40643N2677m250r2762J02480l1241k750J41341
14733G95769K9722j28027J7280J68890N6189k52106J03466j43812J44099J87569
14723I79039M2014j24161j34864n2487l1125L83283p9109k87801K31111k67317
14713F58583m9476J44977K85345k46297l25422N82837l3201k49229k5254o9408
$$ plain form
14703 673455 1139166 777346 835835 885062 733785 502057 999445 1199232 929719 680966
14693 680966 836215 918701 811777 494344 907757 905914 812222 785519 1422057 930321
14683 930321 1043651 646651 1003356 1026576 979041 1001867 1071735 872372 720454 970160
14673 970160 724997 825631 930862 859627 1222786 1305923 673359 1073906 1283201 909902
14663 909902 1198020 1084784 1507291 833918 900324 1051600 1418428 994570 1173553 1157725
14653 1157725 1031354 1104444 1146219 1093623 1146760 1063004 1358817 1514001 923953 1281150
14643 1281150 902717 1191435 1251767 1269440 1239826 1005272 1222939 1141141 972210 1130299
14633 1130299 1235363 1196791 1584207 1431324 1272194 1198647 1471020 1513748 1113732 1219431
$$ packed form
14703F73455M65711l61820N8489M9227j51277k31728M97388J99787k69513k48753
14693F80966J55249Q2486j06924l17433M13413j843r3692k6703O36538m91736
14683I30321J13330l97000L56705K3220m7535K2826O9868j99363j51918K49706
14673I70160k45163J00634J05231p1235L63159Q3137o32564M00547K09295l73299
14663I09902K88118j13236M22507o73373O6406J51276L66828m23858J78983j5828
14653A157725j26371P3090M1775n2596N3137q3756K95813J55184n90048L57197
14643A281150l78433K88718O0332J7673k9614k34554K17667q1798j68931J58089
14633A130299J05064l8572L87416j52883j59130p3547K72373M2728m00016J05699
$$ plain form
14623 1219431 1420574 1290711 1732433 1587995 1350146 1741061 1388680 1558764 1400450
14614 1400450 1487077 1519116 1432210 1665666 1572417 1494479 1364247 1507452 1280625 1518040
14604 1518040 1686454 1395261 1539147 1562447 1824613 1765238 1587528 1893124 1686612 1918048
14594 1918048 1565386 1534988 1788916 1803545 1742832 1590420 1773913 1725146 1752941 1784641
14584 1784641 1813464 2312400 2295122 1866638 1869401 1998411 1875466 2268595 2201728 2102013
14574 2102013 1670460 2155554 2225001 1953080 2456892 2334162 2467536 2253362 2484059 2772539
14564 2772539 2346566 2375938 2854024 2447792 3034883 2626370 2633527 2921610 3119075 2956907
14554 2956907 3683679 3991411 4260404 4710111 5705206 7303485 11323706 19763154 36601758
$$ packed form
14623A219431K01143j29863M41722j44438k37849L90915l52381J70084j58314
14614A400450Q6627L2039q6906K33456r3249p7938j30232J43205k26827K37415
14604A518040J68414k91193J43886K3300K62166n9375j77710L05596k06512K31436
14594A918048l52662l0398K53928J4629o0713j52412J83493m8767K7795L1700
14584A784641K8823M98936j7278m28484K763J29010j22945L93129o6867r9715
14574B102013m31553M85094O9447k71921N03812j22730J33374k14174K30697K88480
14564B772539m25973K9372M78086m06232N87091m08513P157K88083J97465j62168
14554B956907P26772L07732K68993M49707R95095J598279M020221Q439448J6838604
$$ plain form
14545 36601758 46082357 25602009 10583057 5061082 3833394 2617212 2083934 2081975
14537 2081975 1941967 2153374 2131790 2091010 1952400 1898673 2017117 2058860 2189283 2136063
14527 2136063 2372748 2468851 2518319 2205629 2286396 2313915 2178877 2423531 2605272 2499574
14517 2499574 2341345 2749938 2682907 2375751 2524370 2990388 2861807 2844917 2849470 3050971
14507 3050971 3132548 3223906 2912385 2895502 2905786 3266056 3301830 2959114 2777189 3184513
14497 3184513 3064534 3301744 3189617 3516612 3148263 3551123 3783859 3366081 3673188
14488 3673188 3468645 3794317 3910223 3573699 3836563 3518407 3947629 4040422 3851971 3911902
14478 3911902 4035151 4037071 4101359 3894187 4009088 4120087 4225134 3991579 4402661 4383169
$$ packed form
14545C6601758R480599k0480348A0583057E061082j227688j216182n33278j959
14537B081975j40008K11407k1584m0780j38610n3727J18444M1743J30423n3220
14527B136063K36685R6103M9468l12690Q0767K7519j35038K44654J81741j05698
14517B499574j58229M08593o7031l07156J48619M66018j28581j6890M553K01501
14507C050971Q1577R1358l11521j6883J0284L60270L5774l42716j81925M07324
14497C184513j19979K37210j12127L26995l68349M02860K32736m17778L07107
14488C673188k04543L25672J15906l36524K62864l18156M29222R2793j88451N9931
14478C911902J23249J920O4288k07172J14901J10999J05047k33555M11082j9492
$$ plain form
14468 4383169 4403117 4528064 4527308 4617276 4517438 4683022 4708145 5210363 4492739 4607041 4842491
14457 4842491 4996635 4949757 5250041 4947667 5342658 5016753 5434524 5602985 5441026 5621117
14447 5621117 5531817 5793413 5953698 5928352 5937577 5767924 6022800 5989114 6434834 5994219
14437 5994219 6191513 6440931 6279096 6682044 6625280 6583628 6886181 6907111 7314192 7041556
14427 7041556 7023258 7263312 7872918 7106862 7613693 7971030 7739434 8138389 8118908 7827720
14417 7827720 8432125 8116533 8383216 8546417 8931851 8728912 8742873 8880301 9227103 9336846
14407 9336846 9619906 9590333 9743937 9833602 10375900 10212054 10312794 10592266 10339816 11034110
14397 11034110 10886425 11446531 11505731 11488712 11980539 12208330 12155143 12599118 12634606 13064780
$$ packed form
14468D383169J9948J24947p56Q9968r9838J65584K5123N02218p17624J14302K35450
14457D842491J54144m6878L00284l02374L94991l25905M17771J68461j61959J80091
14447E621117q9300K61596J60285k5346R225j69653K54876l3686M45720m40615
14437E994219J97294K49418j61835M02948n6764m1652L02553K0930M07081k72636
14427G041556j8298K40054O09606p66056N06831L57337k31596L98955j9481k91188
14417G827720O04405l15592K66683J63201L85434k02939J3961J37428L46802J09743
14407I336846K83060k9573J53604Q9665N42298j63846J00740K79472k52450O94294
14397A1034110j47685N60106N9200j7019M91827K27791n3187M43975L5488M30174
$$ plain form
14387 13064780 13236110 13335508 13708271 13628909 14127966 14346972 14596775 14659921 14985847 15114693
14377 15114693 15636016 15906055 16101832 16713573 17026936 17144157 17508530 17871221 17962343
14368 17962343 18667221 19110799 19358441 19780035 20206134 20519507 21260956 21552844 22045345
14359 22045345 22674434 23006015 23561249 24141122 24598149 25435182 25968102 26350235 26953352
14350 26953352 27569118 28498109 29372539 30049917 30871456 31497211 32411293 33148053 33741069
14341 33741069 34745911 35903523 36744108 37672424 39094856 39931211 41235479 42322552
14333 42322552 43900921 44866716 46118450 47541298 49432618 50688061 52479014 54088935
14325 54088935 55995597 57720137 59843003 62022963 64118182 66282068 68409709 71118775
$$ packed form
14387A3064780J71330R9398L72763p9362M99057K19006K49803O3146L25926J28846
14377A5114693N21323K70039J95777O11741L13363J17221L64373L62691R1122
14368A7962343P04878M43578K47642M21594M26099L13373P41449K91888M92501
14359B2045345O29089L31581N55234N79873M57027Q37033N32920L82133O03117
14350B6953352O15766R28991Q74430O77378Q21539O25755R14082P36760N93016
14341C3741069J004842J157612Q40585R28316J422432Q36355J304268J087073
14333D2322552J578369R65795J251734J422848J891320J255443J790953J609921
14325E4088935J906662J724540K122866K179960K095219K163886K127641K709066
$$ plain form
14317 71118775 73693856 76262715 79480589 82603321 85716879 89100164 92482085 96630040
14309 96630040 100424519 104845279 109369136 114102228 119432033 124924676 130548143 136600932
14301 136600932 142966536 149766942 156648380 164472346 172625322 181523288 190211659 199703608
14293 199703608 209885880 220815310 231809064 243351065 255620713 268892422 282174732
14286 282174732 296179483 310658370 325236628 340099937 355535807 370545081 385560440
14279 385560440 399602773 413220784 425873949 437261109 446985263 455144081 460554051
14272 460554051 461703810 459880353 458232631 457377702 454600288 450411481 442435894 433351961
14264 433351961 423277417 411872944 399013210 385040823 369727217 354507224 338851870
$$ packed form
14317G1118775K575081K568859L217874L122732L113558L383285L381921M147955
14309I6630040L794479M420760M523857M733092N329805N492643N623467O052789
14301A36600932O365604O800406O881438P823966Q152976Q897966Q688371R491949
14293A99703608J0182272J0929430J0993754J1542001J2269648J3271709J3282310
14286B82174732J4004751J4478887J4578258J4863309J5435870J5009274J5015359
14279C85560440J4042333J3618011J2653165J1387160R724154Q158818N409970
14272D60554051J149759j823457j647722q54929k777414m188807p975587r083933
14264D33351961j0074544j1404473j2859734j3972387j5313606j5219993j5655354
$$ plain form
14257 338851870 323315376 308276343 293466165 280144393 266630616 253247391 240634357
14250 240634357 228993363 217728156 206693927 196659551 187151805 178704615 170024776
14243 170024776 162164758 154527629 147181990 140692806 134509113 128816355 123265416 117957520
14235 117957520 112997136 108217955 103855145 99505432 95901783 92069881 88618436 84978497
14227 84978497 81653625 78536666 75538909 73029420 69990072 67808988 65625188 63573575
14219 63573575 61183741 59346756 57147585 55503962 53587090 52042990 50720414 48910703
14211 48910703 47429025 46126786 44617518 43342299 42968233 41746777 40162097 38830642
14203 38830642 37596157 36689738 35783870 35397726 34316963 33094251 32619115 31291485 30975062
$$ packed form
14257C38851870j5536494j5039033j4810178j3321772j3513777j3383225j2613034
14250B40634357j1640994j1265207j1034229j0034376r507746q447190q679839
14243A70024776p860018p637129p345639o489184o183693n692758n550939n307896
14235A17957520m960384m779181m362810m349713l603649l831902l451445l639939
14227H4978497l324872l116959k997757k509489l039348k181084k183800k051613
14219F3573575k389834j836985k199171j643623j916872j544100j322576j809711
14211D8910703j481678j302239j509268j275219l74066j221456j584680j331455
14203C8830642j234485r06419r05868l86144j080763j222712m75136j327630l16423
$$ plain form
14194 30975062 30150532 29345221 28435119 27738549 27299906 26458942 25858415 25873026 24474975
14185 24474975 23917953 23596571 23070481 22465090 21813304 21746958 21176019 20464524 20271131
14176 20271131 19701540 19497394 19099770 18758506 18813172 18051731 17685539 17338746 17307143 16864076
14166 16864076 16126027 15894077 15936676 15801749 15198271 15166066 14829105 14585709 14363924 13995006
14156 13995006 13829104 13412644 13477105 12905351 13170128 12866075 12130445 12314560 12194913
14147 12194913 11872386 11506747 11424804 11418630 11133305 11176165 10842149 10797022 10299112 10273375
14137 10273375 9922395 9945781 10071027 9836672 10001358 9622717 9252974 9291126 9147983 9138873
14127 9138873 9031457 8549392 8663232 8497363 8050157 8316691 8338770 8060803 7854329 7875252
$$ packed form
14194C0975062q24530q05311r10102o96570m38643q40964o00527J4611j398051
14185B4474975n57022l21382n26090o05391o51786o6346n70939p11495j93393
14176B0271131n69591k04146l97624l41264N4666p61441l66192l46793l1603m43067
14166A6864076p38049k31950M2599j34927o03478l2205l36961k43396k21785l68918
14156A3995006j65902m16460O4461n71754K64777l04053p35630J84115j19647
14147A2194913l22527l65639q1943o174k85325M2860l34016m5127m97910k5737
14137A0273375l50980K3386J25246k34355J64686l78641l69743L8152j43143r110
14127I138873j07416m82065J13840j65869m47206K66534K2079k77967k06474K0923
$$ plain form
14117 7875252 7612442 7464922 7367905 7530392 7427114 7192682 7260198 7190894 6871848 6649181
14107 6649181 6488531 6888804 6927803 6334919 6404013 6474036 6172655 6388092 6062140 6235829
14097 6235829 5976455 5909896 5820813 5548039 5607832 5664133 5854200 5241896 5446441 5266958
14087 5266958 5634704 5218301 5257114 5106302 4833089 5080650 5105579 4803036 4886103 4725448
14077 4725448 5102355 4540236 4893942 4451774 4620605 4536786 4603178 4303478 4488646 4190160
14067 4190160 4306189 3934707 4207996 4103515 4008471 3986968 4164031 4483760 4205203 4230139
14057 4230139 4025483 4142592 4090154 3958022 3811330 3992922 3887118 3761938 3750948 3661356
14047 3661356 3805398 3589772 3984573 3262529 3560612 3358081 3152015 3369203 3652791
$$ packed form
14117G875252k62810j47520r7017J62487j03278k34432O7516o9304l19046k22667
14107F649181j60650M00273L8999n92884O9094P0023l01381K15437l25952J73689
14097F235829k59374o6559q9083k72774N9793N6301J90067o12304K04545j79483
14087E266958L67746m16403L8813j50812k73213K47561K4929l02543Q3067j60655
14077D725448L76907n62119L53706m42168J68831q3819O6392k99700J85168k98486
14067D190160J16029l71482K73289j04481r5044k1503J77063L19729k78557K4936
14057D230139k04656J17109n2438j32132j46692J81592j05804j25180j0990q9592
14047C661356J44042k15626L94801p22044K98083k02531k06066K17188K83588
$$ plain form
14038 3652791 3404417 3156990 3159263 3194019 3345936 3372102 3104005 3264264 2783843 3214597
14028 3214597 3100091 3292344 2613266 3150195 2819840 2910931 2860311 2778889 2606566 2586213
14018 2586213 2669162 2719585 2641670 2555804 2684952 2431558 2776002 2526087 2173968 2394077
14008 2394077 2266511 1909163 2720985 2433151 1853314 2270100 2150894 2242958 2155272 2271206
13998 2271206 2012392 2304457 1935865 2335793 2111950 2391910 2413378 2554240 2642864 3293673
13988 3293673 6114257 13222416 29503954 45808661 29554160 14346648 8716083 6160780
13980 6160780 5045926 4267019 3873118 3538446 3473847 3039319 2973617 2564754 2805593 2408313
13970 2408313 2726813 2281545 2475609 2317305 2458753 2797139 2321292 2050924 2257570
$$ packed form
14038C652791k48374k47427K273L4756J51917K6166k68097J60259m80421M30754
14028C214597j14506J92253o79078N36929l30355R1091n0620q1422j72323k0353
14018B586213Q2949N0423p7915q5866J29148k53394L44444k49915l52119K20109
14008B394077j27566l57348Q11822k87834n79837M16786j19206R2064q7686J15934
13998B271206k58814K92065l68592L99928k23843K79960K1468J40862Q8624O50809
13988C293673K820584P108159J6281538J6304707j6254501A4346648n630565k555303
13980F160780j114854p78907l93901l34672o4599m34528o5702m08863K40839l97280
13970B408313L18500m45268J94064j58304J41448L38386m75847k70368K06646
$$ plain form
13961 2257570 2128926 1991360 2006100 2285983 1897447 2036718 2340120 2163009 1973498 2065877
13951 2065877 2188926 2087785 2010871 2075785 1669218 1924197 1986279 2047754 1876859 1863771
13941 1863771 2281286 1793895 1840159 1777682 1704020 2187013 1579626 1620271 1632708 1679163
13931 1679163 1528924 1761655 1916031 1636658 1760603 1653237 1704074 1614458 1555670 1244522
13921 1244522 1548754 1378558 1626175 1765651 1777818 1708452 1775253 1332372 1282870 1576015
13911 1576015 1127823 1608088 1525772 1583304 1372080 1509044 1479418 1427471 1382007 1308671
13901 1308671 1666184 1494634 1392790 1644654 1502452 1534730 1256805 1141047 1371972 1523740
13891 1523740 1414622 1130525 1232411 1120855 1335887 970310 1227643 1220392 1152314 1336479
$$ packed form
13961B257570j28644j37566J4740K79883l88536J39271L03402j77111j89511R2379
13951B065877J23049j01141p6914O4914m06567K54979O2082O1475j70895j3088
13941A863771M17515m87391M6264o2477p3662M82993o07387M0645J2437M6455
13931A679163j50239K32731J54376k79373J23945j07366N0837q9616n8788l11148
13921A244522L04232j70196K47617J39476J2167o9366O6801m42881m9502K93145
13911A576015m48192M80265q2316N7532k11224J36964k9626n1947m5464p3336
13901A308671L57513j71550j01844K51864j42202L2278k77925j15758K30925J51768
13891A523740j09118k84097J01886j11556K15032l65577K57333p251o8078J84165
$$ plain form
13881 1336479 1219563 1029621 1311266 1282739 1185279 1106269 1379252 1249643 1460346 1152580
13871 1152580 1368323 1147625 1124157 1311281 937350 1164191 1199329 856896 1326565 1074143
13861 1074143 978721 1176848 954573 972924 1281404 1209221 1157387 1323503 1192320 1121788
13851 1121788 1098784 1017698 1363355 1167771 974505 1073031 921543 1222376 1441029 1093226
13841 1093226 771431 879737 759834 1224604 1175402 898635 928343 1029088 830827 758760
13831 758760 1263376 1017278 987645 1037651 762747 1094775 897977 495615 1082634 1125202
13821 1125202 1004232 765676 1129719 996279 699996 947659 817790 990861 780779
13812 780779 871622 629753 833790 999836 1049079 846468 910939 531672 655417 814711
$$ packed form
13881A336479j16916j89942K81645k8527r7460p9010K72983j29609K10703l07766
13871A152580K15743k20698k3468J87124l73931K26841L5138l42433M69669k52422
13861A074143r5422J98127k22275J8351L08480p2183n1834J66116j31183p0532
13851A121788k3004q1086L45657j95584j93266R8526j51488L00833K18653l47803
13841A093226l21795J08306j19903M64770m9202k76767K9708J00745j98261p2067
13831G58760N04616k46098k9633N0006k74904L32028j96798m02362N87019M2568
13821A125202j20970k38556L64043j33440k96283K47663j29869J73071k10082
13812G80779R0843k41869K04037J66046M9243k02611O4471l79267J23745J59294
$$ plain form
13802 814711 585421 724814 889915 818396 688768 575613 820178 703167 763938 954889
13792 954889 590940 757272 1026110 730488 715847 1188083 678970 577757 807794 728909
13782 728909 778248 1088718 749834 579894 653530 824804 453545 375160 649015 617595
13772 617595 715046 967432 837098 839091 963658 449791 779355 1063580 421326 1032268
13762 1032268 798984 716979 621236 808483 623163 486484 738338 604032 796548 944186
13752 944186 485129 491758 707290 614696 735717 427020 867204 793944 686119 1000842
13742 1000842 762198 611031 744290 690750 518562 683294 1219380 601674 578491 522602
13732 522602 745487 559075 491133 397987 682773 889979 740890 667158 244663 376392
$$ packed form
13802H14711k29290J39393J65101p1519j29628j13155K44565j17011O0771J90951
13792I54889l63949J66332K68838k95622j4641M72236n09113j01213K30037p8885
13782G28909M9339L10470l38884j69940P3636J71274l71259p8385K73855l1420
13772F17595R7451K52386j30334J993J24567D49791L29564K84225D21326O10942
13762A032268k33284q2005r5743J87247j85320j36679K51854j34306J92516J47638
13752I44186m59057O629K15532r2594J21021l08697M40184p3260j07825L14723
13742A000842k38644j51167J33259n3540j72188J64732N36086F01674k3183n5889
13732E22602K22885j86412o7942r3146K84786K07206j49089p3732B44663J31729
$$ plain form
13722 376392 805216 780530 751620 460838 354430 331969 545571 679805 488357 336763
13712 336763 654519 398777 520462 566189 673055 383597 390328 396548 658174 605228 446708
13701 446708 616924 254883 421988 626161 571787 941435 355911 413357 776143 739233
13691 739233 399334 361923 679861 609466 1037274 494143 536877 277471 553889 321329
13681 321329 422111 420429 480429 554195 507664 744829 359414 544398 486986 486287 265865
13670 265865 192128 271310 547902 569876 696786 569994 550964 667615 361670 523500
13660 523500 445315 366315 177037 621439 370566 354914 582367 206991 648708 331560
13650 331560 303166 307792 173160 323584 305038 630871 330787 177381 405237 780071
$$ packed form
13722C76392M28824k4686k8910k90782j06408k2461K13602J34234j91448j51594
13712C36763L17756k55742J21685M5727J06866k89458O731O220K61626n2946j58520
13701D46708J70216B54883J67105K04173n4374L69648C55911N7446L62786l6910
13691G39233l39899l7411L17938p0395M27808D94143M2734k59406K76418k32560
13681C21329J00782j682O0000P3766m6531K37165C59414J84984n7412o99k20422
13670B65865p3737P9182K76592K1974J26910j26792j9030J16651l05945J61830
13660E23500p8185p9000A77037M44402k50873j5652K27453B06991M41717l17148
13650C31560k8394M626j34632J50424j8546L25833l00084j53406K27856L74834
$$ plain form
13640 780071 432935 348770 237521 321657 294795 476039 433445 426412 197403 483178 325941
13629 325941 189474 510878 895294 305098 359493 386239 411660 371578 485786 452414
13619 452414 342127 217632 482670 538257 215066 475042 208424 595144 186376 210682
13609 210682 367408 576123 279212 515420 356018 262223 291439 580423 344262 362162
13599 362162 511439 209495 473643 373218 192018 429173 541677 171237 452288 483521
13589 483521 463058 637378 299246 363392 294213 609970 284586 289363 191897 273950 222265
13578 222265 88125 256354 119187 215076 308354 403496 354554 -54053 241343 221501 50418
13566 305460 453723 336387 163655 366041 290916 812951 521787 437018 165932 340400
$$ packed form
13640G80071l47136q4165j11249Q4136k6862J81244m2594p033A97403K85775j57237
13629C25941j36467L21404L84416C05098N4395K6746K5421m0082J14208l3372
13619D52414j10287j24495K65038N5587B15066K59976B08424L86720A86376K4306
13609B10682J56726K08715B79212K36208j59402r3795K9216K88984k36161J7900
13599C62162J49277B09495K64148j00425j81200K37155J12504A71237K81051L1233
13589D83521k0463J74320B99246O4146o9179L15757B84586M777r7466Q2053n1685
13578B22265H8125J68229A19187R5889R3278R5142m8942e4053B41343j9842E0418
13566C05460J48263j17336A63655K02386p5125N22035k91164q4769A65932J74468
$$ plain form
13556 340400 76146 469730 414296 311130 526579 340088 413339 409258 487891 142913 116296
13545 116296 421374 306599 234468 99383 404567 371111 548591 -36105 662860 383195
13535 383195 338244 473314 212009 271706 148383 215054 124268 363547 221683 561930
13525 561930 319408 206412 98462 330089 273408 88835 561524 439998 410745 309869
13515 309869 330622 30014 345888 113607 288198 363946 610087 417446 290571 281394
13505 281394 250676 287432 224470 414667 201554 140974 139988 393480 413971 35528 497400
13494 497400 20827 280495 243562 89648 342185 121494 203349 227255 197679 22249 166960
13483 166960 309320 460537 293600 365455 355471 99776 107784 279576 319895 509099 296246
$$ packed form
13556C40400G6146L93584n5434j03166K15449j86491P3251m081P8633A42913k6617
13545A16296L05078j14775p2131I9383L05184l3456J77480c6105F62860k79665
13535C83195m4951J35070B12009N9697j23323O6671r0786K39279j41864L40247
13525E61930k42522j12996I8462K31627n6681H8835M72689j21526k9253j00876
13515C09869K0753C0014L15874A13607J74591P5748K46141j92641j26875r177
13505B81394l0718L6756o2962J90197B01554o0580r86K53492K0491C5528M61872
13494D97400B0827K59668l6933H9648K52537A21494Q1855K3906k9576B2249J44711
13483A66960J42360J51217j66937P1855r984I9776Q008J71792M0319J89204k12853
$$ plain form
13472 296246 71319 221796 67297 357934 265332 584548 205959 362598 399211 141815
13461 243294 167630 -6241 370577 228116 99116 47329 155172 44066 -46526 219579 191474
13450 191474 298748 127776 625922 39752 221855 -29224 219802 8360 12832 267019 86115
13438 15650 134586 319933 123605 329993 401951 -47010 15138 465953 206807 5162 241087
13427 241087 48410 254810 116977 119178 116859 422210 185012 427677 551724 326175
13417 326175 339064 225484 -39949 129738 262403 192909 62008 214941 165910 367790
13407 367790 90011 286328 276083 158894 107505 247707 142570 69224 255663 304017
13397 304017 243508 163727 147998 141400 224608 420910 81760 228802 441537 569411 350459
$$ packed form
13472B96246G1319J50477F7297K90637r2602L19216B05959J56639L6613A41815
13461B43294p5664f241C70577j42461I9116D7329J07843D4066d6526B19579k8105
13450A91474J07274A27776M98146C9752J82103b9224B19802H360M472K54187H6115
13438A5650J18936J85347A23605K06388P1958d7010A5138M50815B06807E162K35925
13427B41087D8410K06400A16977K201k319L05351A85012K42665J24047k25549
13417C26175J2889j13580c9949A29738J32665o9494F2008J52933m9031K01880
13407C67790I0011J96317j0245j17189n1389J40202j05137F9224J86439M8354
13397C04017o0509p9781j5729o598Q3208J96302H1760J47042K12735J27874k18952
$$ plain form
13386 350459 426190 390076 284188 234803 99230 183934 377511 -98500 160590 269289 278095
13375 278095 199001 269084 316997 -283777 48729 282875 354377 477365 265845 205458 -47827
13363 -80264 337916 426463 12015 508684 222314 155598 -137253 87355 116972 -81268 306146
13351 349413 119476 39090 -3110 256984 211407 176983 73153 328192 466061 280204 271202
13340 271202 157068 295786 389691 128306 495261 324623 -173781 224345 439973 -21405
13329 -122102 223503 289636 354115 207502 440491 163267 350937 157019 359702 136543
13318 362227 110944 229516 462347 507615 137714 80199 96252 466128 194341 -198004
13307 175147 189021 -72637 418351 144559 -53162 64261 -30754 19696 348909 139687 -117944
$$ packed form
13386C50459P5731l6114j05888m9385I9230Q4704J93577i8500A60590J08699Q806
13375B78095p9094P0083M7913b83777D8729K34146P1502J22988k11520o0387d7827
13363h0264C37916Q8547A2015M96669B22314o6716a37253H7355K9617h1268C06146
13351C49413A19476C9090c110B56984m5577l4424G3153K55039J37869j85857r002
13340B71202j14134J38718R3905A28306L66955j70638a73781B24345K15628b1405
13329a22102B23503O6133O4479j46613K32989A63267J87670A57019K02683A36543
13318C62227A10944J18572K32831M5268A37714n7515J6053L69876A94341a98004
13307A75147J3874g2637D18351A44559e3162F4261c0754A9696L29213A39687a17944
$$ plain form
13295 397278 198387 -52027 432074 -40603 45797 91343 -99494 -34699 294254 -5930 -144063
13284 -144063 280112 30767 180720 -1123 88049 84594 62466 311068 -29582 14078 501646
13273 501646 217845 -81644 -68596 -203067 -118321 125466 132113 -1660 67448 73084 271493
13262 271493 -46653 -134914 -31389 -112339 60069 6857 34172 -36932 92797 219887 -11364
13250 -21558 24778 250056 91570 185266 -163563 335791 130523 59660 187685 31371 -141737
13238 431894 441596 476490 80258 258931 208980 177119 -11565 21716 -13739 12834 1433 -109066
13225 544111 -1116 117635 -152641 355867 39668 361206 -118978 -125941 227607 313498 278705
13214 278705 1702 385573 364561 78802 280909 22895 146969 -370564 147856 394994
$$ packed form
13295C97278A98387e2027D32074d0603D5797M5546i9494c4699B94254e930j38133
13284a44063B80112C0767J49953a123H8049l455k2128K48602b9582A4078M87568
13273E01646B17845h1644J3048j34471Q4746A25466O647a660F7448N636J98409
13262B71493d6653q8261c1389q0950F0069F857K7315c6932I2797J27090a1364
13250b1558B4778K25278I1570R3696a63563C35791A30523E9660J28025C1371a41737
13238D31894R702L4894H0258J78673m9951l1861a1565B1716a3739A2834A433a09066
13225E44111a116A17635a52641C55867C9668L21538a18978o963B27607Q5891l4793
13214B78705A702L83871k1012G8802K02107B2895J24074c70564A47856K47138
$$ plain form
13204 394994 -58053 -27816 36938 192745 426299 46492 12414 47193 205178 294346 281657
13193 281657 -217172 163952 57547 -203454 -7559 40743 -11260 111346 156841 53476 42050
13182 42050 50545 -156650 63644 272756 142183 342473 7543 287483 135892 84529 -122894
13170 79705 214205 -25495 -12118 221248 -146246 117590 -138034 268902 -20884 121542
13159 10088 213103 233238 98623 270798 402648 93644 134549 100986 83950 188241 346074
13148 346074 211216 345657 25285 -43948 -325773 7480 -16528 -98977 92277 310733 137677
13136 238209 210231 -132839 53977 -20904 223274 141846 202817 435520 -50597 150363 224849
13125 224849 199356 -184228 -122137 -169965 333123 -59506 114267 312149 199171 40234
$$ packed form
13204C94994e8053b7816C6938J55807K33554D6492A2414L4779J57985Q9168j2689
13193B81657b17172A63952E7547b03454g559D0743a1260A11346M5495E3476j1426
13182D2050Q495a56650F3644K09112j30573K00290G543K79940A35892n1363a22894
13170G9705J34500b5495a2118B21248a46246A17590a38034B68902b0884A21542
13159A0088K03015K0135I8623J72175J31850I3644M0905l3563j7036J04291J57833
13148C46074j34858J34441B5285d3948k81825G480a6528q2449I2277K18456A37677
13136B38209k7978a32839E3977b0904B23274q1428O0971K32703e0597A50363P4486
13125B24849k5493a84228O2091m7828C33123e9506A14267J97882j12978D0234
$$ plain form
13114 74187 -109579 -13732 326641 1983 27347 338245 129672 12160 -58330 224463 455602
13103 455602 -407856 -301448 -60071 126535 97190 -236948 150725 301156 78940 109349
13093 109349 450688 80401 68873 79181 155816 246478 -211481 -71312 49709 58892 174628
13082 174628 -85590 215859 170466 60627 -163789 -190375 31717 107989 241807 216772 230914
13071 230914 141631 -226034 64891 -9236 6355 223417 -70372 -41624 243639 139471 213467
13060 213467 27643 -287411 -320168 -4051 -35476 291243 19422 175533 194160 326869 371522
13049 371522 330753 49305 143040 397377 49449 95781 310561 205397 180909 -7094 152485
13037 14202 279084 145823 289753 249641 115092 292438 277953 -47175 7466 -32654 11112
$$ packed form
13114G4187a09579a3732C26641A983K5364L10898A29672A2160e8330B24463K31139
13103D55602d07856J06408f0071A26535k9345b36948A50725J50431G8940L0409
13093A09349L41339H0401j1528J0308P6635R0662b11481g1312D9709R183J15736
13082A74628h5590B15859m5393F0627a63789k6586C1717P6272J33818k5035J4142
13071B30914q9283b26034F4891i236F355K17062g0372K8748B43639j04168P3996
13060B13467B7643b87411l2757d051l1425B91243A9422J56111J8627J32709M4653
13049C71522m0769D9305R3735K54337D9449M6332K14780j05164k4488g094A52485
13037A4202K64882j33261J43930m0112A15092J77346j4485d7175G466c2654A1112
$$ plain form
13025 131133 31420 27968 219131 -103739 -32462 -238208 125395 -265787 84410 -91018 -128544
13014 -128544 161848 -89826 320024 51386 56300 -118191 374715 127520 9821 145619 19336
13002 164035 -118180 244235 -482580 -164128 33628 88266 263712 -269498 364130 -28108
12991 250604 359861 -14293 204232 -17071 100860 242903 284080 300344 130246 -161914
12980 -82852 8776 64184 -182229 281508 -144281 -22088 150166 319649 166427 176389 -52038
12968 -96469 -231308 -179554 115095 73256 116962 -123518 285977 260064 -83711 -12322 104968
12956 24900 -76581 57193 137747 12099 -28830 114995 269942 147991 -12734 -4268 -76944
12945 -76944 280001 64055 224440 262323 -40027 75289 159075 -45016 135821 -78633 -86480
$$ packed form
13025A31133C1420l452J91163a03739c2462k05746A25395b65787H4410i1018l7526
13014a28544A61848h9826C20024E1386M914a18191C74715A27520I821J35798A9336
13002A64035a18180B44235d82580a64128C3628N4638J75446b69498C64130b8108
12991B50604J09257a4293B04232a7071A00860J42043M1177J6264A30246a61914
12980h2852H776N5408a82229B81508a44281b2088A50166J69483j53222R962e2038
12968i6469j34839N1754A15095m1839M3706a23518B85977k5913h3711a2322A04968
12956B4900g6581E7193Q0554A2099b8830A14995J54947j21951a2734d268p2676
12945g6944B80001F4055J60385L7883d0027G5289Q3786d5016A35821g8633p847
$$ plain form
12934 -86480 88450 86275 358616 155366 -205315 39192 -205027 119839 40475 -188404 124963
12922 -319741 310791 -139891 -147272 157673 247641 126900 170496 212220 -327166 282813
12911 -132586 -6406 -100388 -96214 203607 -12114 235367 -110450 -33877 -96543 -210948 35501
12899 -69565 -180171 292816 426493 524800 103247 -79960 -90833 209272 220854 28515 65871
12888 65871 -100665 444961 -67766 174719 50860 283041 314352 122821 -166210 -79481
12877 27434 153084 -112130 217620 -15007 58466 57110 -246492 185735 -80774 220196 320117
12866 320117 7220 98098 291278 -134938 344344 47739 45416 -119244 343359 120172 19901
12854 -40379 144212 -157070 85953 6124 -11508 219460 5131 -134625 115793 206153 -182955
$$ packed form
12934h6480H8450k175K72341A55366b05315C9192b05027A19839D0475a88404A24963
12922c19741C10791a39891p381A57673Q9968j20741M3596M1724c27166B82813
12911a32586f406r3982M174B03607a2114B35367a10450c3877o2666j14405C5501
12899f9565j10606B92816J33677R8307A03247g9960j0873B09272J1582B8515L7356
12888F5871a00665D44961f7766A74719E0860K32181L1311A22821a66210g9481
12877B7434J25650a12130B17620a5007E8466j356b46492A85735h0774B20196R9921
12866C20117G220R0878J93180a34938C44344D7739k323a19244C43359A20172A9901
12854d0379A44212a57070H5953F124a1508B19460E131a34625A15793R0360a82955
$$ plain form
12842 383196 -80376 120303 -162100 257514 131750 171014 311340 142015 -197848 -70146
12831 228183 -20110 -196193 192498 -27807 -7098 -192981 -84894 69672 226653 300324 87452
12819 -398254 65967 229178 -44964 218132 -112288 28794 -71316 -125811 70572 271295 -2937
12807 -168224 -207893 -22421 202058 -119917 11586 -82853 409361 545937 143902 25583
12796 81150 -109051 337857 -21440 -20311 69359 -70951 131858 -215718 -40963 -144202 239479
12784 148067 -135402 153933 35462 46595 -2112 -148352 92294 -48621 7151 89694 -302021
12772 -240321 60351 151310 -31229 -40932 17705 3415 377718 -20283 -82764 136436 139844 -31208
12759 -38110 166474 17636 99822 -180509 218312 -2932 -29739 -130593 90675 33294 423420
$$ packed form
12842C83196h0376A20303a62100B57514j25764L9264J40326A42015a97848g0146
12831B28183b0110j76083A92498b7807g098j85883h4894F9672J56981P3671H7452
12819c98254F5967J63211d4964B18132a12288B8794g1316n4495G0572K00723b937
12807a68224l9669b2421B02058a19917A1586h2853D09361J36576A43902B5583
12796H1150a09051C37857b1440J129F9359g0951A31858b15718d0963j03239B39479
12784A48067a35402A53933C5462J1133b112j46240I2294d8621G151Q2543c02021
12772b40321F0351R0959c1229r703A7705C415L74303b0283o2481A36436L408c1208
12759c8110A66474A7636Q2186a80509B18312b932k6807j00854I0675C3294L90126
$$ plain form
12748 423420 -167223 -176505 270639 14185 -35551 114867 59735 84544 -30459 77623 -118054
12736 -195262 -228916 16817 306660 245533 225601 113823 -87073 377082 -72629 -73397 -93295
12725 -93295 97418 18117 239759 13339 240550 96291 -50953 165180 70521 120269 -87312
12713 -196398 -55398 -86104 54136 -70437 340527 -98660 77063 347214 72698 306194 314716
12702 314716 -75314 254272 51967 153207 217986 -109006 -161724 110134 115219 213325 194643
12691 194643 -37 -55035 -226036 259416 26682 128007 250019 96017 -81993 115771 138099
12680 138099 142554 -203519 -87835 -141452 267574 223974 444241 80438 131387 253325 115163
12668 -264550 -93595 63586 13984 54389 191415 -22292 -17632 188137 -87296 190094 -2474
$$ packed form
12748D23420a67223r282B70639A4185c5551A14867n5132K4809c0459G7623a18054
12736a95262l3654A6817K89843o1127j9932j11778h7073C77082g2629p68j9898
12725i3295I7418A8117K21642A3339K27211I6291e0953A65180G0521M9748h7312
12713a96398e5398l0706E4136g0437C40527i8660G7063K70151G2698K33496Q522
12702C14716g5314B54272E1967J01240O4779a09006n2718A10134N085R8106j8682
12691A94643c7n4998j71001B59416B6682J01325J22012I6017h1993A15771K2328
12680A38099M455b03519h7835n3617B67574m3600K20267H0438N0949J21938A15163
12668b64550i3595F3586A3984M0405J37026b2292M660A88137h7296A90094b474
$$ plain form
12656 392025 158835 7109 -34653 -17336 -76445 221101 -111122 106326 88768 243577 162751
12645 162751 -127885 221866 -236192 152831 238681 147623 291741 12086 -238572 312479
12634 111841 -294430 436679 508467 161537 198962 -45859 322112 351773 171908 -1872 -81902
12623 -81902 65835 151220 133803 164414 150457 158093 518248 -151828 96947 -26182 265962
12611 77431 -83667 -97970 91199 -173409 -234616 -204031 -72818 14619 162631 52172 123745
12600 123745 166359 -127476 170543 8703 -290908 -46931 -228603 258927 -266412 -114747
12589 62658 296955 -83606 -156333 129533 39799 -219630 -333383 892 -223000 182634 451437
12578 451437 -103455 4399 275369 237696 -160093 -99154 21099 137979 437215 49421 -418709
$$ packed form
12656C92025A58835G109c4653J7317n9109B21101a11122A06326j7558J54809q0826
12645A62751a27885B21866b36192A52831Q5850r1058J44118A2086b38572C12479
12634A11841b94430D36679P1788A61537L7425d5859C22112K9661A71908a872q0030
12623h1902F5835Q5385j7417L0611j3957P636L60155a51828I6947b6182B65962
12611G7431h3667j4303I1199a73409o1207L0585g2818A4619J48012E2172P1573
12600A23745M2614a27476A70543H703b90908d6931j81672B58927b66412a14747
12589F2658K34297h3606p2727A29533C9799b19630j13753H92b23000A82634K68803
12578D51437a03455D399K70970l7673a60093O0939B1099J16880K99236D9421d18709
$$ plain form
12566 407212 189784 336027 -145574 383382 -205290 -197332 146699 385459 276388 235564
12556 235564 121789 -36966 157536 -224881 134034 -207254 -127093 483770 -220322 26321
12545 -188013 -361199 -70165 -250066 11423 -489866 -43072 293541 -274369 362641 121128
12534 35866 -105901 -52749 247244 -39312 -45221 7506 -117719 315682 536848 139682 14960
12522 -283196 137584 -146452 -35881 -23450 187631 136514 156937 6044 295509 393015 107496
12510 214394 98566 -152962 -65957 -182235 155139 -272392 24586 -38127 -471277 -34803
12499 136090 105926 327206 110212 -169295 -121315 22098 200279 -97337 -105819 29629 333151
12488 333151 44346 111805 -290790 219675 -82468 16120 -112586 100642 -9408 310411 138173
$$ packed form
12566D07212A89784J46243a45574C83382b05290P958A46699K38760j09071m0824
12556B35564j13775c6966A57536b24881A34034b07254Q0161D83770b20322B6321
12545a88013j73186g0165j79901A1423d89866d3072B93541b74369C62641A21128
12534C5866a05901e2749B47244c9312n909G506a17719C15682K21166A39682A4960
12522b83196A37584a46452c5881J2431A87631n1117K0423F044K89465R7506A07496
12510B14394I8566a52962f5957j16278A55139b72392B4586c8127m33150c4803
12499A36090l0164K21280A10212a69295M7980B2098J78181i7337q482B9629L03522
12488C33151D4346O7459b90790B19675h2468A6120a12586A00642i408C10411A38173
$$ plain form
12476 -139507 114174 173495 -93851 11632 -277227 25583 326217 448121 75440 185609
12466 185609 -71336 -53376 85422 -14943 -140688 -280584 118645 -66795 -99597 268877 313240
12455 313240 -138606 39715 34189 213446 25790 136761 -12639 -37763 74422 135029 -61502
12443 103350 17793 29332 557755 -459785 -114372 -123470 112501 -45559 -219758 186399
12432 102616 186761 -80011 -80940 96174 -231873 -153871 -3006 255555 -15983 151483 278824
12421 278824 68875 171455 4909 -100610 247971 5684 -253194 79875 -132614 33359 -62311
12409 -205755 19416 -128526 88605 51416 -200188 -96498 -291958 4735 -73619 -25058 279106
12397 -69202 -90482 -138155 3303 82343 65283 112120 104092 -24596 -310806 33780 5421 -48153
$$ packed form
12476a39507A14174N9321i3851A1632b77227B5583L00634J21904G5440J10169
12466A85609g1336J7960H5422a4943j25745j39896A18645f6795l2802B68877M4363
12455C13240a38606C9715n526J79257B5790J10971a2639k5124G4422O0607f1502
12443A03350A7793J1539N28423d59785a14372r098A12501d5559j74199A86399
12432A02616Q4145h0011r29I6174b31873P8002c006B55555a5983A51483J27341
12421B78824F8875J02580D909a00610B47971E684b53194G9875a32614C3359f2311
12409b05755A9416a28526H8605l7189b00188i6498j95460D735g3619b5058B79106
12397f9202k1280m7673C303P9040j7060M6837q028b4596k86210C3780E421d8153
$$ plain form
12384 -108319 -121698 330673 33221 29921 -112475 -161629 -163878 -171081 -29866 -86871 50774 -273356
12371 -3663 62840 -127758 116182 -100349 -64385 -446132 274624 -83006 -112910 -141760 -134526
12360 -134526 163548 137925 193175 35320 115444 -26489 142087 381605 -111354 188747
12349 294518 -72922 118392 42574 -48104 44958 194919 -108498 -103993 82242 -186737 235501
12337 275525 117988 66974 -147497 -134321 298704 -116791 -434192 -97708 -338016 -132011
12326 73052 -36990 -35887 23905 140895 -90468 175051 80283 44756 220362 -248054 -55540
12314 265408 -87348 -191037 84019 19201 174507 -62890 -296285 -16733 -45825 -23387 146219
12302 80744 -303321 113935 -5711 194724 84690 45163 -88931 139167 -18430 346079 295408
$$ packed form
12384a08319j3379C30673C3221l300a12475m9154k249p203b9866n7005E0774b73356
12371c663F2840a27758A16182a00349L5964l81747B74624h3006k9904k8850P234
12360a34526A63548k5623N5250C5320Q0124b6489A42087K39518a11354A88747
12349B94518g2922A18392D2574d8104D4958J49961a08498M505H2242a86737B35501
12337B75525A17988n1014a47497J3176B98704a16791l17401i7708k40308a32011
12326G3052c6990J103B3905J16990i0468A75051H0283l5527J75606b48054e5540
12314B65408h7348j03689H4019A9201J55306f2890k33395a6733k9092K2438A46219
12302H0744c03321A13935e711A94724H4690l9527h8931A39167a8430C46079n0671
$$ plain form
12291 295408 570530 236669 177522 203728 -154592 170615 31241 166480 435662 254781
12281 254781 -16566 55641 -278733 -160001 289462 419209 113172 195406 57804 250068
12271 250068 213374 125308 -94743 53170 51278 80513 228639 111084 142364 -55198 33484
12259 217100 -18794 161306 148192 67403 126445 -12790 -108267 180005 64328 306790 -24354
12247 50335 169944 -167884 -109488 161148 85760 17083 154723 -41962 124832 -24570 -100717
12236 -100717 43923 -129052 -22218 50586 113717 -230356 200241 288059 243268 377541 321636
12225 321636 280120 156650 174640 296385 276813 294054 -34163 -151491 300195 179680
12215 179680 51279 50814 76540 239890 147995 -138041 44724 254928 15326 236989 256975
$$ packed form
12291B95408K75122B36669n9147K6206a54592A70615C1241J35239K69182j80881
12281B54781a6566E5641b78733J18732B89462J29747A13172Q2234E7804J92264
12271B50068l6694q8066i4743E3170j892K9235J48126A11084L1280e5198C3484
12259B17100a8794A61306j3114F7403N9042a2790r5477A80005F4328K42462b4354
12247E0335J19609a67884N8396A61148p5388A7083J37640d1962A24832b4570p6147
12236a00717D3923a29052b2218E0586O3131b30356B00241Q7818m4791J34273n5905
12225C21636m1516j23470J7990J21745j9572J7241c4163j17328C00195j20515
12215A79680E1279m65K5726J63350r1895a38041D4724K10204A5326K21663J9986
$$ plain form
12204 256975 -234743 -108880 29724 31192 245432 472443 231825 213136 390904 8374 436907
12193 436907 -6485 -116317 194983 -91722 104256 192890 -20103 -191722 -66774 -11098 -40078
12182 -40078 344399 235866 260288 142230 -197613 164474 37086 -11351 103129 32306
12171 254029 118704 -228310 71796 70025 -87544 323556 10836 78105 355848 227321 -213831
12159 -133296 51934 153717 401299 7149 -79600 17012 119454 147986 417746 230514 128384
12148 128384 270514 183335 79358 89941 -22870 159780 -131983 2635 24622 -77734 -29307
12136 109525 -37991 -199076 382303 49405 183096 237476 309945 251088 104439 136040 -64848
12124 49009 -77116 -63120 66226 49150 62157 -69496 263203 -164102 -40696 -52922 -313529
$$ packed form
12204B56975b34743a08880B9724J468K14240K27011B31825j8689J77768H374M28533
12193D36907f485j09832A94983i1722A04256Q8634b0103j71619f6774a1098k8980
12182d0078C44399j08533K4422j18058a97613A64474C7086a1351A03129C2306
12171B54029A18704b28310G1796j771h7544C23556A0836O7269K77743j28527b13831
12159a33296E1934J01783K47582G149g9600A7012J02442K8532K69760j87232j02130
12148A28384J42130q7179G9358J0583b2870A59780a31983B635K1987g7734b9307
12136A09525c7991j61085C82303D9405J33691N4380P2469n8857A04439L1601f4848
12124D9009g7116J3996F6226j7076J3007f9496B63203a64102d0696j2226k60607
$$ plain form
12113 -313529 457604 361267 125394 282347 -152171 32037 -15128 -93482 128882 148159
12103 148159 139556 -18467 -124787 361401 -11654 139353 -62666 83881 -388421 258905 -91717
12091 -16597 -142161 256569 -163433 52291 -17182 123057 115283 -16073 124599 -124228 53771
12079 243846 110803 -39905 -48179 -223329 -4666 166648 233370 -38887 304784 379105 1591894
12068 1591894 1258040 653387 342997 -45901 -231667 -161314 342677 -371120 -35236 56209
12057 119433 166398 -181396 -178565 107631 23007 -391911 -291474 -35473 134895 -91916 175230
12045 -133478 -62622 -55168 -211852 298304 236248 23162 -174318 -97771 -220673 -177145 -303550
12034 -303550 170294 86604 -5858 -143896 95029 -47079 -50336 -288739 156835 -152547 317812
$$ packed form
12113c13529D57604r6337A25394J56953a52171C2037a5128p8354A28882J9277
12103A48159q603a8467j06320C61401a1654A39353f2666H3881c88421B58905i1717
12091a6597j25564B56569a63433E2291a7182A23057p774a6073A24599a24228E3771
12079B43846A10803c9905q274j75150d666A66648O6722c8887C04784P4321J212789
12068A591894l33854o04653l10390d5901j85766P0353C42677c71120c5236E6209
12057A19433M6965a81396K831A07631B3007c91911J00437c5473A34895i1916A75230
12045a33478f2622P454j56684B98304o2056B3162a74318P6547j22902M3528j26405
12034c03550A70294q3690e858j38038I5029d7079l257k38403A56835a52547C17812
$$ plain form
12022 -186006 21266 -109250 82225 -374603 -264794 -73740 193751 67907 -175007 146134
12011 -44157 353326 107434 -202711 -12077 127904 103505 -112334 -174097 -109308 9107 -17371
11999 -146148 185205 252001 -95632 151160 79001 26300 -61577 -101734 -190842 85283 -324266
11987 19664 -123892 69005 -68337 4873 -250870 83384 -167158 -96580 42152 240189 -206568
11975 -364753 238002 -139745 300095 48301 410261 -69038 -304048 -83463 101785 -57430
11964 131048 121313 59153 -49217 -2114 14090 25005 65271 90858 121249 -96683 -179092 -189647
11952 -189647 54335 -25470 -25774 -147902 261228 375914 418141 -233227 -211280 325443 269639
11941 269639 339335 -251360 -141051 -208421 158692 -144337 -244341 -34884 -51213 31032
$$ packed form
12022a86006B1266a09250H2225c74603J09809g3740A93751F7907a75007A46134
12011d4157C53326A07434b02711a2077A27904k4399a12334o1763O4789I107a7371
11999a46148A85205O6796i5632A51160p2159B6300f1577m0157q9108H5283c24266
11987A9664a23892F9005f8337D873b50870H3384a67158P0578D2152J98037b06568
11975c64753B38002a39745C00095D8301L61960f9038k35010h3463A01785e7430
11964A31048r735E9153d9217b114A4090J0915M0266K5587L0391i6683q2409j0555
11952a89647E4335b5470l04j22128B61228J14686M2227b33227K1947C25443n5804
11941B69639O9696b51360J10309o7370A58692a44337j00004c4884j6329C1032
$$ plain form
11930 -110509 -399432 -324574 109456 -206439 247361 130721 205174 -38064 -166614 58906
11919 -14741 -142124 -183908 -38889 -63738 258439 -6229 -164267 148538 -203961 -46769 524220
11907 122052 -178487 42572 78289 -241020 -202653 225569 -238405 43621 -111361 78435
11896 -128307 -240258 -119564 -16577 -47662 2185 49882 -88898 126339 66055 282865 -92793
11884 -53875 -283257 -3959 45579 194197 66674 -84361 61536 228652 -71618 115003 62370
11873 62370 -13871 -137308 -46147 15176 -21652 -68127 90590 -165662 179504 102291 93967
11862 93967 48655 -88295 -89510 -462630 -85489 -38458 239098 55818 -113924 209844 251264
11851 251264 122303 -169529 318948 134360 -187309 30478 -120655 -257401 188614 374933
$$ packed form
11930a10509k88923P4858A09456b06439B47361j16640P4453c8064j28550E8906
11919a4741j27383m1784c8889k4849B58439f229j58038A48538b03961d6769E24220
11907A22052a78487D2572L5717b41020L8367B25569b38405D3621a11361G8435
11896a28307j11951a19564a6577l1085B185M7697h8898A26339o0284K16810i2793
11884e3875k29382c959D5579J48618F6674h4361F1536J67116g1618A15003n2633
11873F2370a3871j23437d6147A5176b1652m6475I0590a65662A79504p7213q324
11862I3967m5312h8295j215l73120h5489c8458B39098E5818a13924B09844M1420
11851B51264A22303a69529C18948A34360a87309C0478a20655j36746A88614J86319
$$ plain form
11841 374933 116809 167789 -288674 -186767 -118950 -281632 -32292 -10650 -67866 30708 91577
11830 91577 385434 -282209 -224151 -62188 179451 125841 -729587 -113918 -256250 240303
11819 183386 309470 72229 -108352 65853 71160 -38341 -187893 99208 -191114 115308 -6919
11807 -15891 184218 -8111 -159071 -165818 33858 59356 -66130 409285 42283 -162092 116421
11795 148309 -20849 -125294 -43850 -94866 -126319 -136497 164561 -59642 49188 289205 75139
11783 -202798 39501 3908 -45372 204073 -9724 -217981 -2526 -155814 -101682 -144460 -197068
11772 -197068 -133078 -206339 -111896 335870 62165 -57066 -15684 295769 265514 -112935 236923
11760 -182905 -56552 -121765 -176514 -118004 103774 -71154 -10066 120692 135560 -114564 -191573
$$ packed form
11841C74933A16809N0980b88674J01907O7817j62682c2292a0650n7216C0708O0869
11830I1577K93857b82209N8058f2188A79451n3610g29587a13918j42332B40303
11819A83386J26084G2229a08352F5853N307c8341j49552I9208a91114A15308f919
11807a5891A84218h111j50960o747C3858K5498f6130D09285D2283a62092A16421
11795A48309b0849j04445d3850n1016l1453j0178A64561e9642D9188K40017G5139
11783b02798C9501C908d5372B04073i724k08257b526j53288N4132m2778n2608
11772a97068O3990p3261R4443C35870F2165e7066a5684B95769l0255a12935B36923
11760a82905e6552o5213n4749N8510A03774g1154a0066A20692J4868a14564p7009
$$ plain form
11749 -191573 156333 116233 -108002 139691 241263 -178399 -25556 -163584 -127962 308397
11738 -59695 29325 -50677 -105751 117332 296956 -269330 199249 -420484 151421 296722
11728 296722 -126672 25620 196140 167820 34165 -133162 -387307 -201110 8448 64283 5627
11716 35523 100074 310130 -29394 215954 -113154 70306 -264929 48004 68319 -389981 349626
11704 -140655 196902 677 -160895 -106017 82454 -87661 -139900 -72357 313378 -150533 -253000
11693 -253000 63042 -120041 -248091 153655 -41646 186494 304216 95588 51227 45426 49544
11682 49544 72107 118414 -154713 2550 155247 116345 -60194 438889 -216818 -192079 115030
11670 -11491 35385 75676 57126 63781 160874 38341 -178106 -289782 250093 180045 -122417
$$ packed form
11749a91573A56333m0100a08002A39691J01572a78399b5556j38028L5622C08397
11738e9695B9325e0677n5074A17332J79624b69330A99249d20484A51421J45301
11728B96722a26672B5620J70520k8320C4165a33162k54145J86197H448N5835E627
11716C5523O4551K10056b9394B15954a13154G0306b64929D8004K0315c89981C49626
11704a40655A96902F77a60895N4878H2454h7661n2239O7543C13378a50533j02467
11693b53000F3042a20041j28050A53655d1646A86494J17722I5588m4361n801M118
11682D9544K2563M6307a54713B550J52697l8902f0194D38889b16818K4739A15030
11670a1491C5385M0291j8550O655R7093C8341a78106j11676B50093p0048a22417
$$ plain form
11658 290759 -28374 94871 151700 -194274 141874 -197864 382908 134060 131673 -55516 -204583
11647 -204583 -26885 -37710 109203 -226832 100937 123825 22554 121570 37146 -98916 60799
11635 18939 -10630 206515 -243159 12889 272452 -364952 380192 4201 148356 2555 22590
11624 22590 229255 295872 160598 122856 81101 18611 -105956 -115996 117726 -70097 13951
11612 -79019 -122361 102753 -172638 73158 -6565 84630 -262826 -123921 226822 43410 -11495
11600 -142948 477702 -130537 106213 -49622 197112 -37819 16516 28505 299970 -198814
11589 280438 6826 210037 187989 301095 255519 18721 228911 193215 526 24334 151334
11578 151334 -174551 -110764 37118 59564 330629 -107555 -16722 -105615 296526 -14202 329399
$$ packed form
11658B90759b8374I4871N6829a94274A41874a97864C82908A34060k387e5516j49067
11647b04583b6885j0825A09203b26832A00937K2888B2554R9016C7146i8916F0799
11635A8939a0630B06515b43159A2889K59563c64952C80192D201J44155B555K0035
11624B2590K06665O6617j35274l7742m1755A8611a05956j0040A17726g0097A3951
11612g9019m3342A02753a72638G3158f565H4630b62826a23921B26822D3410a1495
11600a42948D77702a30537A06213d9622A97112c7819A6516J1989K71465a98814
11589B80438F826K03211k2048J13106m5576A8721K10190l5696E26K3808J27000
11578A51334a74551O3787C7118K2446K71065a07555a6722q8893B96526a4202C29399
$$ plain form
11566 52593 133166 40887 -35900 4301 272912 249349 59277 171549 242694 157732 266344
11555 266344 385663 -225464 -154437 247057 -185277 223318 96271 41479 101360 -158284
11544 227657 -249353 382758 -324899 -107683 202770 -226270 19220 357024 -185854 177346
11533 260262 207753 -33994 202611 60655 74862 -323579 64952 36044 52547 -38525 424165
11521 67602 184771 -311237 166853 23452 144691 292405 85256 315416 154679 -52167
11510 292555 -20096 93310 170749 268081 41138 259587 -190433 -66965 410600 99948 -136980
11498 185408 208233 206384 115023 -86417 -152371 80693 146958 359641 258943 28147 -270793
11486 17377 -28095 -37055 -92354 -51913 -235135 239738 221092 -34557 -87085 215218 154320
$$ packed form
11566E2593Q0573D0887c5900D301K68611k3563E9277J12272P1145q4962J08612
11555B66344J19319b25464P1027B47057a85277B23318I6271D1479N9881a58284
11544B27657b49353C82758c24899a07683B02770b26270A9220L37804a85854A77346
11533B60262n2509c3994B02611F0655J4207c23579F4952k8908J6503c8525D24165
11521F7602J17169c11237A66853B3452J21239J47714H5256K30160A54679e2167
11510B92555b0096I3310P7439R7332D1138K18449a90433f6965D10600I9948a36980
11498A85408K2825j849r1361h6417o5954H0693O6265K12683j00698B8147b70793
11486A7377b8095q960n5299M0441j83222B39738j8646c4557n2528B15218o0898
$$ plain form
11475 154320 30149 73896 50755 646785 146192 -11997 296399 49620 60214 -135348 -30267
11463 125135 -216368 65999 284653 -18826 -112678 270679 48653 -167379 41099 73463 -45829
11451 82815 -147896 119578 375691 269982 -285699 -574 -432877 -27783 130667 -63407 152392
11439 -50148 269914 56724 32349 -136948 197102 150561 -101648 133193 -83048 22892 151115
11428 151115 -157790 228704 -502130 158551 48184 -318201 13260 502729 82293 181548
11418 181548 24817 -127681 17316 148189 359106 -176949 23427 189400 233605 77036
11407 -21822 -77588 -175387 -100402 9517 35938 67094 262148 -87583 101793 73091 139927
11396 139927 188086 -89080 -116963 168900 36317 -173419 69662 -6072 -119611 165397 -158599
$$ packed form
11475A54320C0149M3747k3141N96030A46192a1997B96399D9620J0594a35348c0267
11463A25135b16368F5999K18654a8826r3852B70679D8653a67379D1099L2364d5829
11451H2815a47896A19578K56113j05709b85699e74m32303b7783A30667f3407A52392
11439e0148B69914E6724k4375a36948A97102m6541a01648A33193h3048B2892J28223
11428A51115a57790B28704e02130A58551D8184c18201A3260M89469H2293R9255
11418A81548B4817a27681A7316J30873K10917a76949B3427J65973M4205G7036
11407b1822n5766r7799P4985I517K6421L1156J95054h7583A01793k8702O6836
11396A39927M8159h9080k7883A68900C6317a73419F9662f072j13539A65397a58599
$$ plain form
11384 -435294 -17490 -173619 17876 -117032 194430 -15118 279645 137791 65323 203922
11374 203922 157777 311465 -84295 113370 224294 249280 -304036 25431 141897 -82555
11363 -78490 12448 172442 61319 -221101 -64272 -195677 254903 -282164 -81659 47313 -72832
11351 284807 -3718 -301323 -140280 92367 81068 144811 -51069 -181307 261177 -50076 311054
11339 188430 195102 -34942 223833 -23235 -22108 236255 78256 -166337 -381719 -97382 21350
11327 -133666 -47278 -288679 -25967 -150379 -197061 21658 -65462 78314 137815 268237 -283451
11315 191360 -121097 71310 3008 -6593 325639 237272 20693 -56263 -133818 -145523 -23297
11303 57580 133918 7240 -54987 40235 -311282 173422 -3349 154831 283926 15092 -700 -39865
$$ packed form
11384d35294a7490j56129A7876a17032A94430a5118B79645A37791F5323J38599
11374B03922m6145J53688h4295A13370J10924K4986c04036B5431J16466h2555
11363g8490A2448J59994F1319b21101f4272j31405B54903b82164h1659D7313g2832
11351B84807c718k97605a40280I2367j1299O3743e1069j30238B61177e0076C11054
11339A88430O672c4942B23833b3235J127B36255G8256a66337k15382i7382B1350
11327a33666d7278k41401b5967j24412m6682B1658f5462G8314N9501J30422b83451
11315A91360a21097G1310C008f593C25639q8367B0693e6263p7555j1705b3297
11303E7580P6338G240e4987D0235c11282A73422c349A54831J29095A5092g00l9165
$$ plain form
11291 -39865 -252743 344004 -211234 -217405 183455 -264880 -98621 -139718 -103318 4471 -85694
11279 -363476 -30373 85860 -172823 -8479 230233 154613 226742 115488 218390 -36372 -19083
11268 -19083 52023 -155663 41149 254060 217355 -315826 -216800 29783 65007 -116611 70618
11256 291946 171421 333296 273581 -73563 -227734 -71957 267500 -235238 -47510 -274982
11246 -274982 -130507 -196975 312904 -61925 -221486 -272426 31237 -39340 -140028 -191004 124577
11234 -179213 -133063 -283106 -191098 327930 142311 -308783 -43382 -302977 321108 -168915
11223 -58656 -30650 119288 59730 -10888 -134499 205800 96695 -71258 -245527 120066 -17273
11211 -75361 17405 -60317 366088 -98041 -287804 -286497 -217940 -162338 -91125 -63827 -4220 -371589
$$ packed form
11291c9865k12878C44004b11234o171A83455b64880i8621m1097L6400D471h5694
11279c63476c0373H5860a72823h479B30233p5620P2129j11254J02902c6372J7289
11268a9083E2023a55663D1149K12911l6705c15826R9026B9783L5224a16611G0618
11256B91946j20525J61875n9715g3563j54171g1957B67500b35238d7510k27472
11246b74982a30507o6468C12904f1925j59561n0940C1237c9340j00688n0976A24577
11234a79213M6150j50043R2008C27930A42311c08783d3382k59595C21108a68915
11223e8656K8006A19288n9558a0888j23611B05800I6695g1258j74269A20066a7273
11211g5361A7405f0317C66088i8041j89763J307O8557N5602P1213K7298d220l67369
$$ plain form
11199 -371589 -309425 -170949 349224 -271158 164581 -191715 -503735 -290883 -175454 124962
11188 -91917 -181611 35644 -81192 -77643 275778 11446 128452 -74429 -307792 54081 -52390
11176 -162075 -84044 70391 -22800 121402 -36196 -129925 -282825 15850 -33606 -96463 23784
11164 126011 -154931 -68499 229292 -341787 -132716 -227473 212181 60133 -159397 109090
11153 -69486 85309 12588 245506 206770 -9750 250086 -221017 16962 124285 275674 75786
11141 -247690 -32765 -60577 -307043 162423 -337929 132035 133520 176256 -53727 111822 -206323
11129 166708 34890 264267 -83997 -343238 -123267 58789 34946 -99627 195386 97669 -46214
11117 99580 446865 240365 99793 117231 89941 -41759 249060 186735 325452 215281 51961
$$ packed form
11199c71589O2164J38476C49224b71158A64581a91715l12020K12852J15429A24962
11188i1917q9694C5644h1192L549B75778A1446J17006g4429k33363E4081e2390
11176a62075P8031G0391b2800A21402c6196r3729j52900A5850c3606o2857B3784
11164A26011a54931f8499B29292c41787a32716r4757B12181F0133a59397A09090
11153f9486H5309A2588K32918l8736i750B50086b21017A6962J07323J51389G5786
11141b47690c2765k7812k46466A62423c37929A32035J485M2736e3727A11822b06323
11129A66708C4890K29377h3997k59241a23267E8789k3843i9627A95386I7669d6214
11117I9580L47285k06500I9793J7438k7290d1759B49060o2325J38717j10171E1961
$$ plain form
11105 493173 144518 -373512 421834 71134 503366 -68131 409831 324898 330541 -185133
11094 287251 33257 178548 339619 -34357 87101 114451 450823 549402 326317 398203 84723
11082 82738 267409 153355 443082 203009 511608 239256 346490 354629 416813 450276
11072 450276 207245 50303 -84931 310056 -110177 435745 383833 440601 374874 454676 201069
11060 372319 214983 313705 177235 487009 896217 530889 687347 635355 841563 775329
11050 775329 682811 444032 600998 778242 675939 699697 397296 724082 638639 689987
11040 689987 813994 1055832 599275 978529 636806 705614 628854 524842 793649 295881
11029 805166 608611 831221 644783 735493 619624 623444 567429 727768 532818 828784
$$ packed form
11105D93173A44518c73512D21834G1134M32232f8131D09831q4933N643a85133
11094B87251C3257J45291J61071c4357H7101K7350L36372R8579k23085P1886H4723
11082H2738J84671j14054K89727B03009L08599B39256J07234Q139O2184L3463
11072D50276B07245E0303h4931C10056a10177D35745n1912N6768o5727P9802B01069
11060C72319j57336R8722j36470L09774M09208l65328J56458n1992K06208o6234
11050G75329r2518k38779J56966J77244j02303K3758l02401L26786q5443N1348
11040F89987J24007K41838m56557L79254l41723O8808p6760j04012K68807B95881
11029H05166j96555K22610j86438R0710j15869L820n6015J60339j94950K95966
$$ plain form
11019 828784 603207 626348 736517 603772 429439 615130 599057 761725 387623 718340
11009 718340 396340 768615 666471 678253 587870 656512 451843 605457 342181 668884
10999 668884 810846 609467 539803 672264 658923 742769 697819 663178 759034 617028 556658
10988 556658 731717 772639 1018973 1283678 912897 936408 978391 1207568 1219677 1279311
10978 1279311 1395133 1595995 1968591 2328833 2482878 2619691 3041596 2689504 2735657 2617504
10968 2617504 2305095 2341525 1973589 2084970 1645105 1497823 2177430 1790740 2002813 1940568
10958 1940568 1993720 2145249 2218956 2020729 1732667 1024556 1096395 988536 651091 495332
10948 495332 614800 184559 335550 334328 708967 224355 283537 244363 392011 -87985
$$ packed form
11019H28784k25577K3141J10169j32745j74333J85691j6073J62668l74102L30717
11009G18340l22000L72275j02144J1782r0383O8642k04669J53614k63276L26703
10999F68884J41962k01379o9664J32461j3341Q3846m4950l4641R5856j42006o0370
10988E56658J75059M0922K46334K64705l70781K3511M1983K29177J2109N9634
10978A279311J15822K00862L72596L60242J54045J36813M21905l52092M6153j18153
10968B617504l12409L6430l67936J11381m39865j47282O79607l86690K12073o2245
10958A940568N3152J51529P3707j98227k88062p08111P1839j07859l37445j55759
10948D95332J19468A84559J50991j222L74639B24355N9182l9174J47648h7985
$$ plain form
10937 63957 325804 223624 68384 90519 204980 135792 -258210 225143 165486 148624 -243397
10925 124601 -35288 117272 130601 52417 184068 -375675 112082 -115108 134132 -98589
10914 -239189 -249714 141892 56937 -123703 261212 209719 31872 138563 -120780 90304
10903 49588 -171659 229111 -30124 197857 76080 -383461 -14667 109714 -63572 -153449 146012
10891 -308167 -101258 246012 -68602 -31896 -186280 -232753 331127 217828 192857 439466
10881 439466 -120356 -41528 -71787 -22200 -258943 110821 -87741 -157937 -86437 -181432 -152728
10870 -152728 205514 132076 -14434 26575 271122 -13748 -44155 31537 -69329 -59124 -187749
10859 -187749 183635 -91094 -124849 -145436 167504 61806 -20947 103761 -47450 95139 -265389
$$ packed form
10937F3957K61847j02180F8384K2135J14461o9188b58210B25143n9657j6862b43397
10925A24601c5288A17272J3329E2417J31651c75675A12082a15108A34132i8589
10914b39189j0525A41892E6937a23703B61212n1493C1872J06691a20780I0304
10903D9588a71659B29111c0124A97857G6080c83461a4667A09714f3572q9877A46012
10891c08167a01258B46012f8602c1896j54384m6473C31127j13299k4971K46609
10881D39466a20356d1528l0259b2200k36743A10821h7741p0196P1500r4995K8704
10870a52728B05514p3438a4434B6575K44547a3748l0407C1537f9329J0205j28625
10859a87749A83635i1094l3755k0587A67504F1806b0947A03761d7450I5139b65389
$$ plain form
10847 -29044 -134476 376229 28343 213967 146580 170806 -151093 63665 199819 92569 158481
10836 158481 -243678 65618 199270 142725 34848 93324 -129816 63727 118736 62130 113831
10825 113831 65619 303483 -89192 -507492 -7962 60684 71739 116885 -85814 -196255 101921
10813 -140305 354108 -204617 -63969 66916 -181405 -5854 -640 -62560 -169687 -118062 -212029
10802 -212029 -49017 92507 116880 16933 35788 138310 -82283 -429498 72566 168432 66103
10790 -316573 -1776 -57429 -200176 -30192 140863 -104162 81352 216934 -183450 -10475 -128932
10779 -128932 -123354 -220156 -31790 41032 74684 87739 187420 286833 -35005 40655 -46943 14604
10766 -83493 -68633 -46142 -227709 403381 264594 -52328 192539 -269863 -9548 -82396 -32277
$$ packed form
10847b9044j05432C76229B8343J85624o7387K4226a51093F3665J36154I2569O5912
10836A58481b43678F5618J33652n6545C4848N8476a29816F3727N5009n6606N1701
10825A13831m8212K37864h9192m18300g962F0684J1055M5146h5814j10441A01921
10813a40305C54108b04617f3969F6916a81405e854f40o1920j07127N1625r3967
10802b12029d9017I2507K4373A6933J8855J02522h2283l47215G2566R5866F6103
10790c16573a776n5653j42747c0192A40863a04162H1352J35582a83450a0475j18457
10779a28932N578r6802c1790D1032L3652J3055R9681R9413c5005D0655d6943A4604
10766h3493J4860K2491j81567D03381j38787e2328A92539b69863i548p2848c2277
$$ plain form
10754 340813 -262062 -77972 -181718 56860 -223964 90523 14126 -15482 300527 -59888 -106593
10743 -106593 -374615 -141573 14343 265214 226201 -17957 -19423 -3351 -25858 -80526 -57330
10732 -57330 -88596 -386101 5839 -169155 135910 -102119 -113835 -10652 -73425 -274224 90473
10720 -182887 -279147 -2438 -232265 -92368 -83660 -78517 -150504 84299 114739 69012 -239753 -137741
10708 -137741 -18378 -272005 95499 -27429 -54454 -38362 -152522 109606 -68889 220800 -392683
10696 42220 -128404 -518886 15917 144740 39830 -160232 -293976 181397 56967 297279
10686 297279 -73018 153716 151234 -119346 -90667 -391798 50256 -100814 -224536 -174467 -150712
10675 -150712 -78648 46759 -145034 280080 -20920 -221330 314252 -336135 66071 12808
$$ packed form
10754C40813b62062g7972j03746E6860b23964I0523A4126a5482C00527e9888m6705
10743a06593k68022a41573A4343K50871l9013a7957j466c351k2507n4668K3196
10732e7330l1266k97505E839a69155A35910a02119j1716a0652o2773k00799I0473
10720a82887r6260b438k29827i2368Q708N143p1987H4299L0440m5727b39753J02012
10708a37741a8378k53627I5499b7429k7025J6092j14160A09606f8889B20800c92683
10696D2220a28404l90482A5917J28823C9830a60232j33744A81397E6967K40312
10686B97279g3018A53716k482a19346K8679l01131E0256a00814j23722N0069K3755
10675a50712P2064D6759a45034B80080b0920k00410C14252c36135F6071A2808
$$ plain form
10664 -206117 -66633 -180087 119635 96280 -563931 274809 -91655 -130929 -330482 -324769 289287
10652 21387 -141754 -21049 222335 -41251 -83921 316204 -6384 29395 -229409 8843 -10305
10640 -173788 -163733 328726 267245 -237705 36511 -353444 -119398 -26834 -65091 14340 68688
10629 68688 96274 -625702 -317044 -155200 24598 -310138 97088 87542 -25996 22689 -318313
10617 -88039 -24146 -76778 -65083 -256690 -105757 -34373 -14786 -245034 -129490 -123680 198718
10605 27462 -169473 -886 190363 -54986 214109 -318081 72543 -321833 52034 87030 103868
10594 103868 -257472 -61929 -19989 52068 -109684 200510 19056 58669 22591 123577 -453184
10582 -194454 -218291 132984 75317 -261703 194912 280742 5081 34334 75204 -129954 -545418
$$ packed form
10664b06117f6633j13454A19635k3355e63931B74809i1655l9274j99553N713B89287
10652B1387a41754b1049B22335d1251m2670C16204f384B9395b29409H843a0305
10640a73788J0055C28726o1481b37705C6511c53444a19398b6834l8257A4340N4348
10629F8688K7586f25702L08658a55200B4598c10138I7088r546b5996B2689c18313
10617h8039b4146n2632J1695j91607a05757c4373a4786k30248J15544N810A98718
10605B7462a69473h86A90363e4986B14109c18081G2543c21833E2034L4996J6838
10594A03868b57472f1929a9989E2068a09684B00510A9056L9613B2591J00986d53184
10582a94454k3837A32984n7667b61703A94912Q5830E081K9253M0870a29954m15464
$$ plain form
10571 -545418 -239100 220656 42661 -22609 -111354 144894 -132670 -402142 289727 147718
10561 147718 203436 151095 -49587 -102509 -130445 195087 -129633 197706 17624 -285481 -126978
10549 19665 122672 198 75653 -91970 -45709 -359426 -161137 49163 174380 -343186 -317367
10538 -317367 113817 29982 -355778 -40443 -423172 -468643 -79179 19907 -116376 106336
10527 92888 103020 -120007 -2529 -152745 -18625 -140675 -277385 -33352 33235 136246 -199053
10515 31488 193278 -253735 -422923 -205133 -57331 -222351 84857 -231442 47925 -106390
10504 211447 -133002 -43855 -94650 68284 -298150 -273125 -61158 9706 -14175 13273 68615
10493 68615 -298898 -162776 -173546 21299 67162 -90279 -82337 94749 -73318 95536 -10673
$$ packed form
10571e45418b39100B20656D2661b2609q8745A44894a32670k69472B89727j42009
10561A47718N5718n2341d9587n2922k7936A95087a29633A97706A7624b85481a26978
10549A9665J03007A98P5455i1970d5709l13717a61137D9163J25217c43186K5819
10538c17367A13817B9982c55778d0443l82729m5471g9179A9907a16376A06336
10527I2888J0132a20007b529j50216a8625j22050j36710c3352C3235J03011a99053
10515C1488J61790b53735j69188b05133e7331j65020H4857b31442D7925a06390
10504B11447a33002d3855n0795F8284b98150K5025f1158I706a4175A3273N5342
10493F8615b98898J36122j0770B1299M5863i0279P942I4749g3318I5536a0673
$$ plain form
10481 430568 60901 42930 43463 246999 243799 -118406 533655 206862 224316 -30485 138581
10469 236617 -294233 32385 -50162 39362 -74303 -139173 -120089 48995 243452 -243024 -37058
10457 -147947 -57409 130396 -114676 11382 -265221 -43934 -194297 27441 284834 -39110
10446 -366223 99745 -24587 -216592 -149787 -49375 -33267 -144706 -133839 -271698 53800 -38730
10434 -165571 375095 -129391 365501 -30178 -326032 32398 42208 27369 121384 -3167 -43443
10423 -43443 289477 -133214 -35409 156319 17733 172772 -56382 233568 4951 252653 -180431
10411 184287 -214552 -195872 -117902 -207268 -111449 -49186 -79087 -228534 -343366 -47214 113438
10399 40306 129713 -91576 -45911 26900 96442 193304 -84777 163156 281539 -49489 70667
$$ packed form
10481D30568F0901j7971N33K03536l200a18406E33655B06862J7454c0485A38581
10469B36617b94233C2385e0162C9362g4303o4870J9084D8995J94457b43024c7058
10457a47947e7409A30396a14676A1382b65221d3934j50363B7441K57393c9110
10446c66223I9745b4587j92005O6805d9375J6108j11439J0867j37859E3800c8730
10434a65571C75095a29391C65501c0178k95854C2398R810j4839R4015c167m0276
10423d3443B89477a33214c5409A56319A7733J55039e6382B33568D951K47702a80431
10411A84287b14552J8680P7970q9366R5819d9186k9901j49447j14832d7214A13438
10399D0306Q9407i1576M5665B6900O9542R6862h4777A63156J18383d9489G0667
$$ plain form
10387 139535 351922 167274 -78385 41846 -76882 290492 119342 -138536 169627 318446
10377 318446 341021 346914 388392 -16127 497793 379117 123744 461293 343818 44840 531214
10366 531214 489334 423981 256860 141348 124794 145824 324305 63807 -56215 698401 -3637
10354 375719 264706 89555 467147 584508 771590 283673 369183 433079 434816 103746
10343 626942 398192 118171 401518 432899 140504 4003 379070 318091 278370 -95580 291604
10331 -72482 165751 -148883 -154212 -108291 282264 65053 98120 186402 264131 381642 300386
10320 300386 257344 -105973 220350 159125 -62089 52399 -117806 199150 238510 177674 -17967
10308 -21704 85062 205386 99388 -232591 -60725 274323 172049 -196387 -78980 -223631
$$ packed form
10387A39535K12387A67274g8385D1846g6882B90492A19342a38536A69627J48819
10377C18446K2575N893M1478a6127D97793j18676A23744L37549j17475D4840M86374
10366E31214m1880o5353j67121j15512j6554K1030J78481F3807e6215F98401c637
10354C75719j11013H9555L77592J17361J87082B83673Q5510O3896J737A03746
10343F26942k28750A18171K83347L1381A40504D003L75067o0979l9721i5580B91604
10331g2482A65751a48883n329M5921B82264F5053L3067Q8282P7729J17511q1256
10320C00386m3042a05973B20350o1225f2089E2399a17806A99150L9360o0836a7967
10308b1704H5062J20324I9388b32591f0725B74323j02274a96387g8980j44651
$$ plain form
10298 -223631 -98471 53599 50786 -73615 -189320 53573 -96751 -24824 -279780 -61354 -274820
10287 -274820 78645 -149128 305649 115073 -143859 -340295 36929 -245822 109514 36304
10276 -104795 -75872 165551 109068 -95639 -31380 -25090 -47712 113937 -15412 -193066 320041
10264 -191700 -266460 117783 31900 220580 330779 363762 782869 381942 240952 110344
10253 15159 -81062 72719 58420 6101 229928 -287898 -234387 -151386 -296265 -636 167459
10241 -497358 149386 177842 -115190 106731 302606 -44725 23300 -13195 -66386 -287508
10231 -287508 -92572 157180 44653 29890 -367637 -169658 6788 -55582 -187164 -58104 363605
10219 -134525 -321886 455981 326691 -67734 -95732 -263217 -203077 65496 -279129 -81844
$$ packed form
10298b23631i8471E3599k813g3615j15705E3573i6751b4824k54956f1354k13466
10287b74820G8645a49128C05649A15073a43859j96436C6929b45822A09514C6304
10276a04795K8923A65551n6483i5639c1380O290k2622A13937a5412j77654C20041
10264a91700p4760A17783C1900J88680J10199L2983M19107C81942j40990A10344
10253A5159h1062G2719j4299F101K23827b87898N3511Q3001j44879f36A67459
10241d97358A49386K8456a15190A06731J95875d4725B3300a3195n3191k21122
10231b87508i2572A57180D4653j4763c67637a69658F788e5582j31582e8104C63605
10219a34525j87361D55981j29290f7734k7998j67485O0140F5496b79129h1844
$$ plain form
10208 -133307 -198983 -283558 -109070 -205011 56044 -207893 -10738 -59572 58934 -77360 164770
10196 50129 105974 -125001 316110 126221 12495 -188184 -315411 40175 -271737 57637
10185 -336862 26256 -84275 -249924 121500 138924 -56505 274969 -330228 132814 -149616
10174 -4535 120608 178273 149967 170934 -201246 32696 1480 113489 -66010 110685 28935
10162 -294815 -206743 -308430 -62974 9459 -79881 100744 -183527 -218204 -248962 -69039 -98758
10151 -98758 -245262 22522 -102894 -52447 -296803 -88548 88010 47049 158433 130205 -119322
10139 -215330 67392 -120270 213608 -104105 -58649 -302449 7400 126487 -3050 -142902 -75751
10128 -75751 -439711 -320690 154562 59053 -269398 148481 44902 -156012 -17387 -245907
$$ packed form
10208a33307o5676q4575a09070r5941E6044b07893a0738m8834E8934g7360A64770
10196E0129N5845a25001C16110A26221A2495a88184j27227D0175b71737E7637
10185c36862B6256h4275j65649A21500J7424e6505B74969c30228A32814a49616
10174d535A20608N7665k8306K0967b01246C2696A480J12009f6010A10685B8935
10162b94815Q8072j01687f2974I459g9881A00744a83527l4677l0758f9039k9719
10151i8758j46504B2522a02894N0447k44356h8548H8010m0961J11384k8228a19322
10139b15330F7392a20270B13608a04105M5456k43800G400J19087c050j39852O7151
10128g5751l63960J19021A54562E9053b69398A48481D4902a56012a7387k28520
$$ plain form
10118 -245907 -195881 -104237 -202797 -376038 86348 -139276 -234747 -260721 -286208 201600 -16488
10106 113575 95149 -113518 76901 -287242 67275 16773 -46939 -79539 64497 -216946 -27412
10094 -337632 167000 114263 98915 24166 -298735 -343093 105441 -147015 -350598 331439
10083 80812 -201950 87920 184902 37072 -190727 224156 -165019 -77882 -82456 -138402 -341276
10072 -341276 133432 -137807 110080 -17421 -330851 25412 423990 -24591 74277 -426427
10061 188291 159892 -6945 -342577 -238236 24105 -332934 113986 -166298 -26225 46579 -152265
10049 34596 122279 -30031 87314 -111799 186178 69602 114943 -57168 -207980 -204360 -94161
10037 -194611 -41976 34920 -303003 -44553 254950 139618 -218221 105285 -140008 -101644
$$ packed form
10118b45907N0026R1644r8560j73241H6348a39276r5471k5974k5487B01600a6488
10106A13575j8426a13518G6901b87242F7275A6773d6939l2600F4497b16946b7412
10094c37632A67000n2737j5348B4166b98735m4358A05441a47015k03583C31439
10083H0812b01950H7920R6982C7072a90727B24156a65019g7882m574n5946k02874
10072c41276A33432a37807A10080a7421l13430B5412L98578b4591G4277d26427
10061A88291k8399f945l35632J04341B4105c32934A13986a66298b6225D6579a52265
10049C4596Q7683c0031H7314a11799A86178F9602M5341e7168j50812L620i4161
10037a94611d1976C4920c03003d4553B54950j15332b18221A05285a40008L8364
$$ plain form
10027 -101644 -420412 -93358 -215022 75528 -132810 269644 99558 51184 -154701 45776
10016 216422 157081 -295033 -35565 -68115 118033 -308423 -309833 144581 -433411 -139815
10005 -485103 -32478 97304 -197710 5025 -299260 -81049 -89113 -218823 -200614 -139274 -163728
9994 -163728 185480 -83854 -256991 215943 -225565 -130885 17162 -97186 -138214 -91524 50923
9982 -229322 387374 -64591 86047 143364 -82391 -13286 222353 104738 -354275 179447 -170712
9970 -72074 3892 35198 83661 -147235 63919 -64809 225292 392981 -118666 -269034 26357
9958 -463169 -250433 -25865 -189913 298060 152697 -59477 -220177 -214111 108633 102132 161289
9947 161289 -331154 -49844 77382 -98706 -118273 -297126 -316821 -157120 76548 126630 -365840
$$ packed form
10027a01644l18768i3358j21664G5528a32810B69644I9558m8374a54701D5776
10016B16422n9341b95033c5565l2550A18033c08423j410A44581d33411a39815
10005d85103c2478I7304a97710E025b99260h1049q064j29710J8209O1340k4454
9994a63728A85480h3854j73137B15943b25565R4680A7162i7186m1028M6690E0923
9982b29322C87374f4591H6047N7317h2391a3286B22353A04738c54275A79447a70712
9970g2074C892L1306M8463a47235F3919f4809B25292J67689a18666j50368B6357
9958d63169K12736b5865j64048B98060j45363e9477j60700O066A08633o501N9157
9947A61289c31154d9844G7382i8706j9567j78853j9695a57120G6548N0082c65840
$$ plain form
9935 59420 13519 -261249 -156612 316108 -206492 29586 -176773 -280998 -349617 250683
9924 -67146 -166440 -215883 -265995 -71844 -231717 -59431 137625 191488 93688 -118031 -30820
9912 -16356 -157814 111499 -391291 -278192 287114 -56233 141712 86259 -467635 -150011
9901 180559 -96866 40677 -62366 -264178 -19398 -146368 -247447 -442335 225335 19207 -415287
9889 -450953 -8709 129729 -268996 -230408 -136921 -149035 -90133 -93317 -269672 -24142 -241896
9878 -241896 -93949 -37921 -53355 -228673 -236855 -153084 -405033 1021 -13037 -32849 -62859 -75827
9866 -75827 154188 60130 -54527 -41299 -143726 -207804 -8308 -6923 -87210 -198054 -82774 -38557
9853 -67052 33353 1318 -163430 -254762 -71387 -253677 71244 108384 -137390 -65657 -16867
$$ packed form
9935E9420A3519b61249J04637C16108b06492B9586a76773j04225o8619B50683
9924f7146r9294m9443n0112g1844j59873e9431A37625N3863I3688a18031c0820
9912a6356j41458A11499c91291J13099B87114e6233A41712n5453d67635a50011
9901A80559i6866D0677f2366k01812a9398j26970j01079j94888B25335A9207d15287
9889d50953h709A29729b68996L8588R3487j2114N8902l184j76355b4142k17754
9878b41896i3949c7921j5434j75318q182Q3771k51949A021a3037j9812l0010j2968
9866g5827A54188F0130e4527J3228j02427o4078h308J385q0287j10844h2774c8557
9853f7052C3353A318a63430r1332g1387j82290G1244L7140a37390f5657a6867
$$ plain form
9841 99059 -51020 -85918 -263344 -61556 139713 132068 -181964 -47795 99533 22482 -423744
9829 120436 -291032 52098 251485 -310222 -341653 -33713 120414 -161959 -91368 162344
9818 154538 -116741 -74804 -172338 -409980 59648 138007 -490890 -148168 126852 42512 41645
9807 41645 48737 39038 155915 203524 -75551 174697 67625 -25310 160607 314243 -195531
9795 -26881 -427256 -142870 76322 -91676 -227186 -267603 -69109 -309630 114186 -31234 -277911
9784 -277911 116500 -9619 -137602 12183 -166480 -20458 -251804 -140850 -47146 162023 -460728
9772 -162053 -317363 -75850 300154 -24187 -167350 304938 -166748 199548 96644 -184683
9761 491889 -226917 -89441 -125849 -259432 -207152 -30205 -133255 36737 -115080 184103 -259828
$$ packed form
9841I9059e1020l4898j77426f1556A39713p645a81964d7795I9533B2482d23744
9829A20436b91032E2098J99387c10222l1431c3713A20414a61959P0591A62344
9818A54538a16741M1937r7534k37642E9648P8359d90890a48168A26852D2512q67
9807D1645P092r699J16877M7609g5551A74697F7625b5310A60607J53636a95531
9795b6881m00375a42870G6322i1676j35510m0417f9109k40521A14186c1234k46677
9784b77911A16500i619j27983A2183a66480b0458k31346J10954d7146A62023d60728
9772a62053j55310g5850C00154b4187j43163C04938a66748A99548I6644a84683
9761D91889b26917h9441l6408j33583N2280c0205j03050C6737a15080A84103b59828
$$ plain form
9749 35839 -401032 107106 98111 -316938 236425 -227191 360519 -202865 -45145 -52988 108333
9737 -297969 128780 -139241 65222 -199115 -92396 -175144 314399 -304142 -90826 -264885
9727 -264885 -210197 -324502 394099 -482728 -43226 -9515 -21415 164266 53585 59756 -126484
9715 144310 -58300 -64331 53527 -399012 -131426 41411 -334132 210422 -197210 -322512 -129709
9703 -131611 -88770 66335 -376141 119524 -12583 -184441 55327 -136268 -165379 294174 87143
9691 -98610 -12312 346223 -82329 296328 -24236 -192431 137646 -192939 46209 194502 130690
9680 130690 -335599 -82052 43308 -209434 -143348 -148432 -374649 -199339 -132009 -408492 -114939
9668 62008 -65900 -84403 197918 -371778 191296 41264 -309768 26008 -358710 -273548 162919
$$ packed form
9749C5839d01032A07106q995c16938B36425b27191C60519b02865d5145p843A08333
9737b97969A28780a39241F5222a99115i2396q2748C14399c04142i0826j74059
9727b64885N4688j14305C94099d82728d3226i515j1900A64266E3585O171a26484
9715A44310e8300o031E3527c99012a31426D1411c34132B10422a97210j25302a29709
9703a31611M2841F6335c76141A19524a2583j71858E5327a36268k9111B94174H7143
9691i8610a2312C46223h2329B96328b4236j68195A37646a92939D6209J48293o3812
9680A30690c35599h2052D3308b09434O6086n084k26217J75310O7330k76483a14939
9668F2008f5900j8503A97918c71778A91296D1264c09768B6008c58710Q5162A62919
$$ plain form
9656 -252574 15992 22345 56091 -157089 -22929 -372400 109978 -107543 14580 -179397 -518950
9645 -518950 110037 60139 42715 -80859 30769 -73608 -62736 -109235 -24865 -290802 138286
9633 -42633 -239976 -14731 148669 -206387 -33523 -108061 62527 115821 47377 -316154 49810
9621 -5169 -53917 -198131 -220799 38363 40682 127051 -517981 -132784 -61210 -354183 -7677 41718
9608 -198103 44641 -51938 -22591 -50091 62739 115904 -144963 21426 -215388 -278129 -8994
9596 126830 -159238 -94806 -67558 322276 -160018 -39178 -34679 -98501 -4401 -182039 -187084
9585 -187084 287189 194111 -201041 74915 11918 -273089 -112166 89710 -176091 -94326 75253
9573 -154358 149985 118977 322219 -202627 -56738 153469 -14353 -55497 -289481 206698
$$ packed form
9656b52574A5992O353L3746a57089b2929l49471A09978a07543A4580a79397l39553
9645e18950A10037m9898j7424h0859C0769g3608J0872m6499b4865k65937A38286
9633d2633j97343a4731A48669b06387c3523p4538F2527N3294D7377c16154D9810
9621e169m8748j44214k2668C8363K319Q6369e17981a32784f1210k92973g677D1718
9608a98103D4641e1938b2591k7500F2739N3165a44963B1426b15388o2741h994
9596A26830a59238O4432K7248C22276a60018c9178M499o3822d401j77638n045
9585a87084B87189r3078b01041G4915A1918b73089a12166H9710a76091Q1765G5253
9573a54358A49985l1008K03242b02627e6738A53469a4353m1144k33984B06698
$$ plain form
9562 93845 -119034 -118496 -101077 -397979 -229774 -305256 -146790 95999 134542 157890 -210353
9550 317065 256894 -235935 -76363 -284294 2515 -261464 -128524 -164553 -75767 143574 -217043
9538 -282297 92247 -268532 -70296 178864 -106215 84515 -403228 -8208 -243783 -233691 96788
9526 -46816 -25204 61409 -53389 34970 -67342 -186024 -47891 -184905 47019 -501618 137671
9514 96265 -89056 413692 -14639 84221 -85867 154889 -124821 -89223 -60766 -201474 151875
9502 -17484 341797 148488 -52590 145779 -122437 63203 149485 -115216 64241 -111341 -373613
9491 -373613 -63526 103522 -124837 -180142 -166170 91490 -58689 -129574 -103973 -270278 -154802
9480 -154802 -212880 -387374 -110212 38251 178788 174476 112274 -27065 -253542 -42547 -214372
$$ packed form
9562I3845a19034N38J7419k96902J68205p5482a46790I5999L8543K3348b10353
9550C17065o0171b35935g6363k07931B515b61464a28524l6029g5767A43574b17043
9538b82297I2247b68532g0296A78864a06215H4515d03228h208k35575J0092I6788
9526d6816K1612F1409e3389C4970f7342j18682d7891j37014D7019e01618A37671
9514I6265h9056D13692a4639H4221h5867A54889a24821L5598K8457j40708A51875
9502a7484C41797A48488e2590A45779a22437F3203Q6282a15216F4241a11341k62272
9491c73613f3526A03522a24837n5305J3972I1490e8689p0885K5601j66305J15476
9480a54802n8078j74494a10212C8251J40537m312o2202b7065k26477d2547j71825
$$ plain form
9469 -214372 -54468 188739 -270525 -182135 -140551 7804 33720 -101365 205754 -94561 117623
9457 -79269 -356019 -79514 -611942 -100896 -83028 -315986 -122167 59405 101547 -58093 46856
9445 -347010 -293235 148846 219993 -187213 110998 285882 -256224 128278 -174797 48424
9434 -57232 -104906 -301447 -228435 -83004 -24987 84741 159475 -5865 -328829 108791 -249265
9422 196823 -235663 27638 -114881 -162252 -130466 -67239 -284789 -128757 -114790 -130105 80970
9410 24631 -137840 -3854 -139675 -23551 -160113 46078 -188296 46926 -102915 160151 -105695
9398 -82084 -397413 -89282 10581 45335 154955 -279445 -184491 105819 87255 -125105 -648707
9387 -648707 -31289 -92612 -175849 -237433 -369358 -296145 -356111 -599428 -149726 7561 -126348
$$ packed form
9469b14372e4468A88739b70525Q8390M1584G804K5916a01365B05754i4561A17623
9457g9269k76750g9514n32428a00896J7868k32958a22167E9405M2142e8093D6856
9445c47010N3775A48846P1147a87213A10998J74884b56224A28278a74797D8424
9434e7232m7674j96541P3012h3004b4987H4741P4734e865l22964A08791b49265
9422A96823b35663B7638a14881m7371L1786O3227k17550a28757J3967j5315H0970
9410B4631a37840c854j35821b3551j36562D6078a88296D6926a02915A60151a05695
9398h2084l15329h9282A0581L4754J09620b79445R4954A05819j8564a25105n23602
9387f48707c1289o1323q3237o1584j31925P3213n9966k43317a49726G561a26348
$$ plain form
9375 -239379 -12355 -60763 -56759 -18172 164145 -145547 -127449 163364 -117311 -139101 -344468
9364 -344468 -241588 -55773 -239856 1915 143345 -74240 15240 -99069 87428 -44966 -76264
9353 -76264 83838 -275383 -258180 -100677 -161516 13133 -442780 149660 147211 78860 -59595
9341 -48950 -313026 -256900 -67059 54293 -196573 -144869 48151 -382568 -24174 -258424 54275
9329 173594 -34972 122900 260501 -53806 275681 181405 -59936 -23339 62708 -194774 -228007
9318 -228007 24919 -356873 -110362 20540 19724 -46718 -17529 -82950 -126859 -98020 83211 68536
9306 68536 217330 -162948 -48184 29 238812 -29596 -186600 55848 90269 -178747 126973
9294 194620 -139898 260839 -158262 149466 23804 -136759 102161 33183 68600 -109676
$$ packed form
9375b39379a2355m8408M004a8172A64145a45547J8098A63364a17311k1790k05367
9364c44468J02880e5773j84083A915J41430g4240A5240i9069H7428d4966l1298
9353g6264H3838b75383J7203a00677o0839A3133d42780A49660k449o8351e9595
9341d8950k64076N6126f7059E4293a96573N1704D8151c82568b4174k34250E4275
9329A73594c4972A22900J37601e3806B75681r4276e9936b3339F2708a94774l3233
9318b28007B4919c56873a10362B0540q16d6718a7529o5421m3909K8839H3211j4675
9306F8536J48794a62948d8184B9K38783b9596j57004E5848L4421a78747A26973
9294A94620a39898B60839a58262A49466B3804a36759A02161C3183L5417a09676
$$ plain form
9283 -229648 17214 32770 50608 -130664 -113318 23002 -302968 57514 -472227 -107811 206940
9271 -81063 -161184 83517 -392467 -289374 222850 -553655 40292 104933 -234453 -42605 -24143
9260 -24143 211612 117161 -257984 -91210 44515 -54505 -174418 -17952 -373109 -266601 -106138
9248 -95014 37001 -150826 259282 -27637 -60498 -342257 -77560 142525 -361839 -303196 -220860
9237 -220860 158807 -42684 -48215 90634 292295 343170 -155696 120058 -395736 -328662 -147747
9225 81339 -47671 260033 157690 20197 -132433 200335 -86307 -276993 40093 50723 160449
9214 160449 -20549 84383 -243463 145102 214299 -91277 -109042 256991 -267549 -275385 -157963
9203 -157963 91434 -59037 -82748 52896 -434092 10050 -392422 -311340 -22790 9078 -141400
$$ packed form
9283b29648A7214J5556J7838a30664J7346B3002c02968E7514d72227a07811B06940
9271h1063q0121H3517c92467J03093B22850e53655D0292O4641b34453d2605J8462
9260b4143B11612r4451b57984i1210D4515e4505j19913a7952l55157J06508a06138
9248i5014C7001a50826B59282b7637l2861k81759g7560A42525c61839N8643Q2336
9237b20860A58807d2684n531I0634K01661N0875a55696A20058c95736O7074a47747
9225H1339d7671B60033j02343B0197a32433B00335h6307j90686D0093J0630J09726
9214A60449b0549H4383b43463A45102O9197i1277j7765B56991b67549p836J17422
9203a57963I1434e9037k3711E2896d34092A0050c92422Q1082b2790I078a41400
$$ plain form
9191 -206706 -232681 -28041 -29405 -268392 89541 -37707 -6113 36441 83789 28702 -276102 -137046
9178 353 -330455 -348624 -269905 225053 -12204 -149646 -251115 -201554 57062 49392 86172 -315889
9165 34095 -158563 195648 184373 94847 -185856 -202856 -123882 -344306 188046 150159 -112252
9153 103254 -67889 -166342 -173247 122584 89111 -6617 65701 150967 -506863 275371 157808
9142 157808 -40002 -217242 -343831 -316904 -122592 39829 -186869 64911 -71374 -117794 70566
9130 173275 108246 -235517 -148592 -70438 176413 -108639 81623 -501284 -164398 -338 -400914
9119 -400914 148532 -260438 -72644 -220431 -210982 -175466 95336 166397 -16081 111105 -119784
9107 81803 137267 -138445 -20529 -23308 -44390 -364465 166828 -52890 -123775 49390 270031
$$ packed form
9191b06706k5975b8041j364k38987H9541c7707f113C6441M7348B8702b76102a37046
9178C53c30455j8169P8719B25053a2204j37442j01469M9561E7062p670L6780c15889
9165C4095a58563A95648j1275q9526a85856j7000P8974k20424A88046l7887a12252
9153A03254f7889r8453o905A22584l3473f617F5701Q5266e06863B75371j17563
9142A57808d0002j77240j26589K6927a22592C9829a86869F4911g1374m6420G0566
9130A73275o5029b35517Q6925g0438A76413a08639H1623e01284a64398c38m00576
9119d00914A48532b60438g2644j47787R449L5516I5336P1061a6081A11105a19784
9107H1803N5464a38445b0529k779k1082l20075A66828e2890p0885D9390K20641
$$ plain form
9096 270031 165285 -79093 13434 -45580 273017 -371283 -61973 133854 138824 84004 130683
9085 130683 -170620 -253562 -116876 -58749 -148940 -157618 39922 85718 -125332 -165775 55477
9073 -17868 -141890 -36734 -171918 314672 -230027 -167224 -96442 33968 -244924 -231493 -197540
9062 -197540 222650 -78561 -231717 -97818 -226075 3038 -107419 46321 -104215 124385 -60352
9050 89037 -137957 -67547 -181863 -228686 -112807 -116329 369348 242259 -148431 94034 -55124
9038 -66832 185390 18259 -170515 125915 54598 -50080 -288977 -85181 -39573 33294 -137071
9026 212354 144730 -314426 -51908 -287330 -185561 -78397 73643 -140366 -236455 -106467 147007
9014 -92623 -137265 40794 11335 -32571 -160846 112867 260357 27771 -75039 85994 54456
$$ packed form
9096B70031j04746g9093A3434d5580B73017c71283f1973A33854M970n4820M6679
9085A30683a70620q2942a16876N8127r0191q678C9922M5796a25332m0443E5477
9073a7868j24022c6734j35184C14672b30027O2803P0782C3968b44924J3431L3953
9062a97540B22650g8561j53156i7818j28257C038a07419D6321a04215A24385f0352
9050H9037a37957f7547j14316m6823a12807l522C69348j27089a48431I4034e5124
9038f6832A85390A8259a70515A25915E4598e0080k38897h5181c9573C3294a37071
9026B12354o7624c14426e1908k35422J01769g8397G3643a40366r6089a06467A47007
9014i2623m4642D0794A1335c2571j28275A12867J47490B7771g5039H5994l1538
$$ plain form
9003 54456 84974 147235 -372504 31064 -182340 27790 67823 -135319 -39866 -88163 -158658
8992 -158658 2953 -124499 -171678 175009 -34233 -152968 92260 64963 -169218 12539 -100954
8980 -122480 -85208 -142138 27635 -464119 23398 -262342 -167076 2411 -121858 152878 305716
8969 305716 127839 -152455 -334751 165892 72972 -131946 24358 -126289 -369017 -25106
8958 7842 17742 -255699 105356 -462097 -50263 -240450 -338461 -496172 41782 -49532 -159044
8947 -159044 -126672 -46950 -51975 156700 0 -249331 -115756 240477 289435 -221288 237606
8935 81629 535003 275075 228171 78482 131685 110305 8730 157740 47512 155727 706739
8924 706739 925834 3835920 11668180 13268450 3805405 1225343 737884 511788 290877
$$ packed form
9003E4456L0518O2261c72504C1064a82340B7790M0033a35319c9866m8297p0495
8992a58658B953a24499m7179A75009c4233j18735I2260k7297a69218A2539a00954
8980a22480L7272n6930B7635d64119B3398b62342R5266B411a21858A52878J52838
8969C05716A27839a52455j82296A65892G2972a31946B4358a26289k42728b5106
8958G842R900b55699A05356d62097e0263j90187r8011j57711D1782d9532j09512
8947a59044L2372d6950n025A56700@b49331a15756B40477M8958b21288B37606
8935H1629M53374k59928m6904G8482N3203k1380H730J49010D7512J08215N51012
8924G06739K19095K910086P832260J600270C805405A225343m87459k26096k20911
$$ plain form
8915 290877 581616 -9349 -137701 -76982 45072 -26503 178327 190337 156980 175725 -50047
8903 -102542 97689 -22700 -110681 -182670 78603 41516 71777 -122723 -132329 437790 -160866
8891 291758 5710 193908 77984 -12286 -288706 22172 -187850 65253 -6334 134412 -566079
8879 -159823 -264931 126550 -150425 97519 -4219 -472690 -123988 -93801 13195 -93465 47220
8867 -266980 -86254 -78728 -43210 33131 -40194 -174561 -466631 -116823 51822 173257 -30312
$$ packed form
8915B90877K90739i349j28352O0719D5072b6503A78327J2010l3357J8745e0047
8903a02542I7689b2700q7981p1989G8603l7087L0261a22723r606D37790a60866
8891B91758E710J88198G7984a2286k76420B2172a87850F5253f334A34412e66079
8879a59823j05108A26550a50425I7519d219m68471a23988L0187A3195i3465D7220
8867b66980h6254P526L5518C3131d0194j34367k92070a16823E1822J21435c0312
$$ [...]
##END NTUPLES=NMR SPECTRUM
##END=
