##TITLE=AC1572_ROEFFECT0022_8271028_qFFJKTAUVB
##JCAMPDX= 6.0         $$ Bruker NMR JCAMP-DX V2.0
##DATA TYPE= NMR SPECTRUM
##DATA CLASS= NTUPLES
##ORIGIN= BRUKER
##OWNER= Administrator
$$ 1.72 TOPSPIN		Version 2.1
$$ 2013-10-18 19:33:07.416 -0700  Administrator@X
$$ Compression mode = diff/dup
##.OBSERVE FREQUENCY= 400.02188249412
##.OBSERVE NUCLEUS= ^1H
##.ACQUISITION MODE= SIMULTANEOUS (DQD)
##.ACQUISITION SCHEME= undefined
##.AVERAGES= 64
##.DIGITISER RES= 22
##SPECTROMETER/DATA SYSTEM= spect
##.PULSE SEQUENCE= noesygpps1d.comp
##.SOLVENT NAME= COFFEE_meoh
##.SHIFT REFERENCE= INTERNAL, COFFEE_meoh, 1, 14.96092
##AUDIT TRAIL= $$ (NUMBER, WHEN, WHO, WHERE, PROCESS, VERSION, WHAT)
$$ ##TITLE= Audit trail, TOPSPIN		Version 2.1
$$ ##JCAMPDX= 5.01
$$ ##ORIGIN= Bruker BioSpin GmbH
$$ ##OWNER= Administrator
$$ $$ E:\/data/COFFEE/nmr/AC1572_ROEFFECT0022_8271028_qFFJKTAUVB/12/pdata/1/auditp.txt
$$ ##AUDIT TRAIL=  $$ (NUMBER, WHEN, WHO, WHERE, PROCESS, VERSION, WHAT)
(   1,<2013-10-18 19:33:02.119 -0700>,<Administrator>,<X>,<go>,<TOPSPIN 2.1>,
      <created by zg
	started at 2013-10-18 19:21:32.164 -0700,
	POWCHK enabled, PULCHK disabled,
       configuration hash MD5:
       C8 4E 4E 5D D3 5C D8 9E 9F 52 82 E0 59 8A DE 15
       data hash MD5: 64K
       DE 8E 32 30 C1 9D AE B5 32 28 AC 5B 34 14 74 82>)
(   2,<2013-10-18 19:33:05.260 -0700>,<Administrator>,<X>,<proc1d>,<TOPSPIN 2.1>,
      <Start of raw data processing
       efp LB = 0.3 FT_mod = 6 PKNL = 1 PHC0 = 0 PHC1 = 0 SI = 128K 
       data hash MD5: 128K
       6F 84 2C 77 47 01 62 49 82 25 C9 12 73 47 FA 31>)
(   3,<2013-10-18 19:33:06.275 -0700>,<Administrator>,<X>,<proc1d>,<TOPSPIN 2.1>,
      <pk PHC0 = -82.72705 PHC1 = 0 
       data hash MD5: 128K
       37 F4 74 7E AA 71 E5 0C 8C 4C 2B B6 67 FA BA AE>)
(   4,<2013-10-18 19:33:06.775 -0700>,<Administrator>,<X>,<proc1d>,<TOPSPIN 2.1>,
      <abs ABSG = 1 
       data hash MD5: 128K
       5D 55 DF EE EC 2F FB EB 8A 33 86 B8 B8 E4 BA 17>)
(   5,<2013-10-18 19:33:06.916 -0700>,<Administrator>,<X>,<proc1d>,<TOPSPIN 2.1>,
      <abs ABSG = 2 
       data hash MD5: 128K
       4E 20 2B 1E AE DC BB EF 9D FF 75 02 6B 45 44 F2>)
(   6,<2013-10-18 19:33:06.994 -0700>,<Administrator>,<X>,<proc1d>,<TOPSPIN 2.1>,
      <abs ABSG = 3 
       data hash MD5: 128K
       A9 56 19 DE 0D 85 29 18 AC 8A 59 6E AF 0D D0 E9>)
(   7,<2013-10-18 19:33:07.072 -0700>,<Administrator>,<X>,<proc1d>,<TOPSPIN 2.1>,
      <abs ABSG = 4 
       data hash MD5: 128K
       AE C7 51 BA D4 E9 8A E8 9F 24 14 EB D6 6B 39 58>)
(   8,<2013-10-18 19:33:07.181 -0700>,<Administrator>,<X>,<proc1d>,<TOPSPIN 2.1>,
      <abs ABSG = 5 
       data hash MD5: 128K
       95 CB DF 83 03 89 D1 EF 24 42 50 BD 5B 05 C1 1C>)
$$ ##END=
$$ 
$$ $$ hash MD5
$$ $$ D2 27 5B B4 11 25 D5 26 54 5A 1F BC 5C 42 ED 1B
##$RELAX= 
##$RELAX= 
##$RELAX= 
##$RELAX= 
##$RELAX= 
##$RELAX= 
##$RELAX= 
##$RELAX= 
$$ Bruker specific parameters
$$ --------------------------
##$DU= <E:\>
##$EXPNO= 12
$$ [...]
##$TP07= 0
##$TPNAME0= <>
##$TPNAME1= <>
##$TPNAME2= <>
##$TPNAME3= <>
##$TPNAME4= <>
##$TPNAME5= <>
##$TPNAME6= <>
##$TPNAME7= <>
##$TPOAL= (0..7)
0.5 0.5 0.5 0.5 0.5 0.5 0.5 0.5
##$TPOFFS= (0..7)
0 0 0 0 0 0 0 0
##$TUNHIN= 0
##$TUNHOUT= 0
##$TUNXOUT= 0
##$USERA1= <user>
##$USERA2= <user>
##$USERA3= <user>
##$USERA4= <user>
##$USERA5= <user>
##$V9= 5
##$VALIST= <valist>
##$VCLIST= <CCCCCCCCCCCCCCC>
##$VD= 0
##$VDLIST= <DDDDDDDDDDDDDDD>
##$VPLIST= <PPPPPPPPPPPPPPP>
##$VTLIST= <TTTTTTTTTTTTTTT>
##$WBST= 1024
##$WBSW= 4
##$XGAIN= (0..3)
0 0 0 0
##$XL= 0
##$YL= 0
##$YMAX_a= 6446094
##$YMIN_a= -12666119
##$ZGOPTNS= <>
##$ZL1= 120
##$ZL2= 120
##$ZL3= 120
##$ZL4= 120
##$ABSF1= 14.96092
##$ABSF2= -5.597261
##$ABSG= 5
##$ABSL= 3
##$ALPHA= 0
##$AQORDER= 0
##$ASSFAC= 0
##$ASSFACI= 0
##$ASSFACX= 0
##$ASSWID= 0
##$AUNMP= <proc_prof1d_extract.lims>
##$AXLEFT= 0
##$AXNAME= <>
##$AXNUC= <1H>
##$AXRIGHT= 0
##$AXTYPE= 0
##$AXUNIT= <>
##$AZFE= 0.1
##$AZFW= 0.1
##$BCFW= 0
##$BC_mod= 0
##$BYTORDP= 0
##$COROFFS= 0
##$CY= 15
##$DATMOD= 1
##$DC= 0
##$DFILT= <>
##$DTYPP= 0
##$F1P= 0
##$F2P= 0
##$FCOR= 0.5
##$FTSIZE= 131072
##$FT_mod= 6
##$GAMMA= 0
##$GB= 0
##$INTBC= 1
##$INTSCL= 1
##$ISEN= 128
##$LB= 0.3
##$LEV0= 0
##$LPBIN= 0
##$MAXI= 10000
##$MC2= 0
##$MEAN= 0
##$ME_mod= 0
##$MI= 0
##$NCOEF= 0
##$NC_proc= -2
##$NLEV= 6
##$NOISF1= 0
##$NOISF2= 0
##$NSP= 0
##$NTH_PI= 0
##$NZP= 0
##$OFFSET= 14.96092
##$PC= 1
##$PHC0= -82.72705
##$PHC1= 0
##$PH_mod= 1
##$PKNL= yes
##$PPARMOD= 0
##$PPDIAG= 0
##$PPIPTYP= 0
##$PPMPNUM= 2147483647
##$PPRESOL= 1
##$PSCAL= 4
##$PSIGN= 0
##$PYNMP= <proc.py>
##$REVERSE= no
##$SF= 400.020009668105
##$SI= 131072
##$SIGF1= 0
##$SIGF2= 0
##$SINO= 400
##$SIOLD= 131072
##$SPECTYP= <>
##$SREGLST= <1H.CDCl3>
##$SSB= 0
##$STSI= 131072
##$STSR= 0
##$SW_p= 8223.68421052631
##$SYMM= 0
##$S_DEV= 0
##$TDeff= 65536
##$TDoff= 0
##$TI= <>
##$TILT= no
##$TM1= 0
##$TM2= 0
##$TOPLEV= 0
##$USERP1= <user>
##$USERP2= <user>
##$USERP3= <user>
##$USERP4= <user>
##$USERP5= <user>
##$WDW= 1
##$XDIM= 131072
##$YMAX_p= 436651320
##$YMIN_p= -11919
##$CURPLOT= <Network HP LaserJet P1505>
##$CURPRIN= <$Network HP LaserJet P1505>
##$DFORMAT= <normdp>
##$LAYOUT= <+/1D_H.xwp>
##$LFORMAT= <normlp>
##$PFORMAT= <normpl>
##$SURQMSG= 1
$$ End of Bruker specific parameters
$$ ---------------------------------
##NTUPLES= NMR SPECTRUM
##VAR_NAME=  FREQUENCY,     SPECTRUM/REAL,   SPECTRUM/IMAG
##SYMBOL=    X,             R,               I
##VAR_TYPE=  INDEPENDENT,   DEPENDENT,       DEPENDENT
##VAR_FORM=  AFFN,          ASDF,            ASDF
##VAR_DIM=   131072,        131072,          131072
##UNITS=     HZ,            ARBITRARY UNITS, ARBITRARY UNITS
##FACTOR=    0.0627417313425164, 1,          1
##FIRST=     8223.62146879497, 561,          -66578
##LAST=      0,             2419,            -67417
##MIN=       0,             -11919,          0
##MAX=       8223.62146879497, 436651320,    0
$$ Real data points
##PAGE= N=1
##DATA TABLE= (X++(R..R)), XYDATA
$$ [...]
67902 83126 81339 79699 78615 78106 77880 77921 78491 79534 80543 81097 81178 80964 80659 80460 80324 79847 78794 77624
67884 77624 77008 76942 76882 76707 76866 77492 78023 77975 77520 77052 76701 76633 77342 79067 81184 82700 83366 83860 84793
67865 84793 85845 86129 85320 84066 83126 82350 80970 78869 76998 76265 76457 76679 76443 75816 74871 73655 72569
67848 72569 72041 71842 71312 70271 69167 68315 67650 67286 67616 68568 69397 69516 69149 68885 69024 69621 70757 72410
67830 72410 74369 76576 79296 82705 86532 90245 93436 95976 98077 100164 102346 104085 104909 105350 106423
67815 106423 108071 108973 108293 106816 105755 105109 103952 101882 99363 96855 94364 91831 89328 86871 84436
67800 84436 82165 80202 78421 76682 75194 74218 73544 72725 71711 70775 69900 68758 67319 66015 65205 64873
67784 64873 64822 64741 64100 62562 60752 60065 61330 63912 66427 68097 69120 69925 70573 70970 71316 72080 73510
67767 73510 75362 77193 78866 80575 82338 83706 84201 83915 83425 83215 83401 83924 84664 85322 85499 85073 84304
67750 84304 83473 82609 81656 80665 79705 78778 77982 77549 77515 77544 77313 76889 76500 76077 75408 74667 74318 74394 74269 73378
67730 73378 71850 70211 68721 67359 66254 65649 65415 64981 63904 62365 61042 60574 61052 61815 61831 60665
67714 60665 59069 58273 58653 59464 59937 60154 60603 61381 62207 62863 63196 62982 62227 61441 61134 61218 61304 61372 61625 61860
67694 61860 61601 60862 60176 59812 59555 59393 59813 61083 62677 63797 64170 64078 63896 63883 64193 64789 65469 66119 66780
67675 66780 67378 67663 67603 67550 67787 68132 68224 68016 67790 67849 68393 69473 70849 72057 72823 73261 73518 73451 72942 72318
67655 72318 72105 72412 72844 73038 73014 72978 72997 73033 73117 73360 73748 74063 74111 73996 73988 74074 73806 72779 71148 69479 68244
67634 68244 67663 67795 68404 68840 68550 67778 67369 67795 68702 69451 69747 69692 69608 69938 70894 72100 72945 73395 73964
67615 73964 74753 75100 74494 73373 72621 72663 73377 74516 75753 76620 76851 76683 76548 76687 77217 78159 79153 79560
67597 79560 79255 78843 78689 78256 77062 75772 75439 75853 75592 73820 71280 69249 68168 67591 67016 66365 65865
67580 65865 65711 65757 65510 64622 63401 62600 62681 63436 64249 64499 63841 62485 61200 60707 61034 61643 62137 62542 62980
67561 62980 63402 63705 63773 63442 62687 61846 61349 61210 61064 60676 60151 59717 59580 59976 60936 62014 62629 62748 62895
67542 62895 63406 64016 64287 64136 63797 63499 63286 63063 62746 62498 62674 63322 63902 63901 63565 63554 63913 63919 63076 61723
67522 61723 60477 59485 58500 57343 56007 54564 53192 52153 51592 51502 51876 52632 53414 53876 54200 54867 55803
67505 55803 56254 55744 54667 53628 52673 51616 50749 50660 51489 52748 53820 54377 54484 54581 55149 56095 56670 56333
67487 56333 55470 54939 55107 55755 56650 57604 58129 57727 56653 55835 55783 56057 56035 55755 55622 55642 55468 55045 54784 55051
67467 55051 55782 56656 57403 57887 58078 58052 57936 57764 57483 57133 56918 57015 57293 57313 56700 55582 54649 54620 55579 56868
67447 56868 57739 58019 58064 58217 58508 58817 59035 59059 58930 59042 59877 61344 62674 63246 63274 63423 63985 64809 65754
67428 65754 66689 67178 66797 65807 64928 64316 63372 61825 60391 59892 60144 60266 59809 59044 58256 57322 55995 54259
67410 54259 52331 50573 49391 49016 49381 50289 51548 52853 53813 54404 55115 56322 57683 58518 58565 57996 56867
67393 56867 55137 53179 51758 51372 51936 53124 54645 56111 57032 57131 56490 55353 53996 52788 52080 51957
67377 51957 52294 53026 54140 55453 56673 57653 58362 58673 58521 58178 57989 57889 57559 57052 56847 57176 57706 57999
67359 57999 57972 57816 57737 57893 58296 58672 58633 58099 57409 57006 57154 57795 58389 58147 56852 55362 54858 55624 56975
67340 56975 58232 59226 59873 59993 59709 59512 59678 60047 60491 61155 62139 63355 64792 66403 67739 68269 68153
67323 68153 68088 68256 68167 67682 67366 67413 67069 65708 63868 62609 62317 62647 63143 63380 63012 62285 62078 62795 63645
67304 63645 63658 62975 62488 62584 62982 63519 64261 65035 65583 66053 66647 66979 66559 65788 65618 66250 66991 67504 68317 69722
67284 69722 70914 70769 69137 67014 65600 65364 65783 65968 65720 65857 67109 68858 69623 68865 67661 67383 68224
67267 68224 69313 69795 69464 68723 68310 68827 70161 71501 72151 72134 71845 71423 70783 70025 69368 68694 67605 66058
67249 66058 64764 64645 65835 67373 68045 67525 66554 66017 66154 66734 67579 68511 69067 68853 68233 68146 69018 70196
67231 70196 70738 70559 70493 71227 72412 72947 72145 70501 69211 69046 69883 71176 72393 72929 72231 70496 68873
67214 68873 68413 69019 69831 70362 70745 71150 71647 72470 73722 74847 75135 74786 74726 75226 75496 74896 73818 72965
67196 72965 72489 72310 72652 73597 74581 74998 74959 74877 74649 73950 73106 72879 73473 74402 75363 76479 77573 77987 77564
67177 77564 77189 77813 79267 80587 81310 81855 82658 83513 84023 84242 84564 85182 86027 87058 88216 89080 89014 87866
67159 87866 86232 84844 83934 83445 83542 84441 85823 86892 87153 86830 86389 85938 85279 84334 83324 82631 82600 83394
67141 83394 84885 86724 88524 90004 90982 91418 91469 91369 91220 91016 90849 90887 91139 91428 91643 91859 92172 92679
67123 92679 93649 95435 97969 100557 102413 103323 103637 103689 103508 103057 102482 101989 101580 101150 100817 100960 101787 103004
67105 103004 104142 105194 106616 108577 110504 111660 112007 112210 112862 113943 115015 115639 115646 115248 114944 115134 115771
67088 115771 116526 117215 117869 118505 119126 119934 121176 122712 124027 124796 125213 125656 126272 126965 127597 128069 128386 128762
67070 128762 129511 130733 132213 133676 135066 136597 138603 141221 143994 145959 146514 146193 146192 147087 148395 149518
67054 149518 150653 152445 155044 157850 160131 161602 162458 163010 163428 163843 164661 166437 169199 172111 174203
67039 174203 175389 176363 177567 178805 179956 181459 183747 186604 189445 191929 194002 195626 196844 197991
67025 197991 199505 201543 203867 206022 207640 208800 210149 212368 215405 218569 221443 224329 227609 231098
67011 231098 234254 236730 238567 240227 242600 246372 251082 255302 258202 260505 263455 267369 271752 276272
66997 276272 280824 284979 288348 291416 295145 299679 304188 308139 311992 316377 321241 326195 331162 336191
66983 336191 340990 345172 348845 352596 356873 361599 366427 371233 376306 382007 388253 394517 400505 406601
66969 406601 413425 421069 429123 437303 445618 453932 461872 469274 476377 483402 490338 497248 504458 512196
66955 512196 520346 528768 537602 546998 556778 566683 576825 587632 599376 611931 624953 638147 651357
66942 651357 664505 677468 690108 702531 715270 728949 743709 759144 774898 791115 808180
66931 808180 826224 845061 864508 884580 905394 926952 948945 970762 991939 1012729 1034018
66920 1034018 1056507 1080129 1104474 1129569 1155867 1183490 1211936 1240737 1270138 1300829 1333056
66909 1333056 1366304 1399919 1433817 1468407 1503933 1540200 1576985 1614442 1652892 1692310 1732275
66898 1732275 1772408 1812747 1853671 1895619 1938800 1982886 2026897 2069642 2110557 2150136 2189392
66887 2189392 2228952 2268675 2308009 2346484 2383894 2420210 2455392 2489120 2520653 2549206 2574649
66876 2574649 2597711 2619164 2638856 2655819 2669381 2679876 2688086 2694287 2698075 2698926 2696580 2691003 2682306
66863 2682306 2670681 2656171 2638547 2617768 2594463 2569541 2543245 2514982 2484205 2451109 2416301
66852 2416301 2380144 2342698 2304040 2264380 2224038 2183479 2143107 2102848 2062190 2020888 1979409
66841 1979409 1938458 1898267 1858570 1819070 1779646 1740315 1701273 1662799 1624941 1587447 1550174
66830 1550174 1513254 1476725 1440403 1404419 1369482 1336180 1304355 1273570 1243860 1215501 1188405
66819 1188405 1162296 1137197 1113102 1089373 1065169 1040365 1015448 990669 966001 941855 919023
66808 919023 897821 877931 859038 840942 823088 804929 786909 770193 755092 740586 725749
66797 725749 710795 696300 682255 668547 655577 643534 631638 619006 605932 593505 582180
66786 582180 571478 560872 550250 539597 528959 518713 509260 500405 491557 482572 473842 465522 457197
66773 457197 448514 439796 431859 425396 420436 416093 410970 404267 396490 388750 381487 374371 367337 361010
66759 361010 355895 351651 347514 343100 338562 334202 330114 326071 321675 316852 312182 308387 305453 302662
66745 302662 299574 296449 293454 290063 285793 281159 277267 274534 272379 270153 267776 265277 262338 258749
66731 258749 254986 251757 249027 246012 242258 238245 234631 231280 227550 223389 219624 217049 215678 215073
66717 215073 214958 215182 215342 214836 213239 210465 206765 202791 199394 196955 195041 193026 190944 189319 188324
66702 188324 187572 186733 185855 184984 183938 182625 181176 179561 177469 174883 172416 170716 169683 168648 167160
66687 167160 165325 163444 161663 160019 158619 157616 157071 156787 156297 155209 153673 152332 151657 151429 151067 150280
66671 150280 149155 147749 145945 143730 141292 138766 136225 134026 132831 132945 133738 134085 133410 132079 130711
66656 130711 129375 127698 125557 123342 121506 120117 118956 117879 116909 116141 115711 115772 116303 116973 117389 117432 117242
66639 117242 116889 116304 115501 114677 114037 113652 113463 113227 112605 111554 110617 110423 110855 111132 110823 110301 109982 109663
66621 109663 109058 108504 108400 108208 106885 104372 101932 100695 100443 100240 99773 99543 99941 100665 101090 100902 100331
66604 100331 99901 99976 100454 100961 101337 101732 102128 102085 101213 99693 98040 96502 94970 93346 91696 90110 88742
66587 88742 87899 87734 87922 87982 87913 88047 88319 88227 87727 87556 88206 88970 88613 86892 84887 83792 83813 84365 84942
66568 84942 85423 85738 85677 85237 84884 85132 85849 86298 86035 85427 84977 84447 83223 81424 79932 79200 78702 77947
66550 77947 77381 77715 78796 79827 80445 80908 81361 81605 81598 81583 81604 81445 81125 80929 80835 80457 79720 79106 78961 79041
66530 79041 78995 78845 78674 78260 77475 76736 76597 77051 77591 77755 77294 76030 74026 71848 70255 69578 69610 70084
66512 70084 70959 72251 73787 75146 75778 75294 73861 72229 71174 70899 71048 71171 71082 70891 70872 71210 71776 72227
66494 72227 72347 72128 71519 70476 69367 68891 69336 70197 70781 70858 70471 69651 68714 68380 68919 69507 69109 67820
66476 67820 66693 66410 66829 67715 68994 70248 70806 70644 70492 70755 71009 70869 70632 70576 70276 69233 67762 66580
66458 66580 65903 65537 65554 66173 67138 67858 68177 68429 68711 68662 68111 67461 67189 67275 67364 67299 67249 67404 67722 67990 68067
66437 68067 67998 67882 67722 67601 67866 68782 69938 70458 70031 69356 69212 69498 69666 69718 70116 70831 71262 71140 70876
66418 70876 70766 70428 69402 67867 66392 65267 64422 63825 63582 63751 64273 64991 65584 65639 65008 64013 63127 62593
66400 62593 62420 62548 62787 62806 62452 62041 62095 62878 64359 66444 68907 71129 72283 72023 70833 69587 68844
66383 68844 68581 68484 68331 68121 67939 67843 67956 68592 70031 72043 73787 74378 73590 71959 70348 69477 69644 70627
66365 70627 71854 72833 73436 73707 73566 72921 71953 71000 70173 69255 67981 66275 64313 62631 62002 62831 64609
66348 64609 66282 67196 67425 67189 66444 65201 63812 62685 61976 61750 62080 62786 63420 63795 64177 64704 65055 65084
66330 65084 65284 66014 66660 66337 65276 64667 65089 65858 66130 65904 65621 65360 64925 64283 63506 62572 61642 61256 61846
66311 61846 63177 64575 65578 66169 66582 67096 67834 68499 68515 67656 66402 65492 65339 65961 67107 68215 68660
66294 68660 68409 68131 68311 68656 68752 68857 69427 70236 70701 70879 71287 71808 71642 70530 69249 68579 68416 68291 68205
66275 68205 68470 69115 69853 70411 70615 70444 70192 70259 70514 70277 69306 68397 68540 69669 70760 71058 70809 70775 71382
66256 71382 72368 73061 72957 72188 71329 70721 70194 69605 69326 69816 70880 71750 71907 71513 71056 70825 70804 70854 70890 70951
66236 70951 71101 71277 71383 71584 72240 73333 74210 74248 73697 73519 74282 75467 75944 75071 73267 71572 70610 70099
66218 70099 69427 68529 67838 67479 67125 66784 67103 68397 69925 70685 70615 70405 70417 70420 70254 70075 70028 70257 71126 72752
66198 72752 74317 74619 73448 71813 70700 70213 70018 69890 69547 68715 67739 67461 68085 68789 68963 69183 70336
66181 70336 72319 74239 75508 76059 75952 75540 75674 76860 78365 78958 78457 77776 77495 77272 76792 76364 76244
66164 76244 76091 75616 75240 75590 76654 77813 78488 78510 78123 77886 78263 79073 79604 79484 79073 78759 78344 77584 76954
66145 76954 77249 78509 79894 80634 80682 80418 80138 80027 80244 80737 81138 81060 80486 79762 79239 78976 78809 78671 78825
66126 78825 79629 81025 82375 82969 82671 81965 81373 80988 80594 80124 79862 80208 81258 82661 83864 84476 84401 83798
66108 83798 83085 82877 83574 84873 85886 85964 85299 84634 84514 84980 85813 86788 87674 88238 88356 88109 87717 87384 87174
66089 87174 87080 87248 87971 89254 90506 91010 90741 90329 90162 90081 90164 91115 93259 95582 96630 96209 95432 95076
66071 95076 94725 93800 92623 91940 91917 92204 92655 93350 94063 94263 93771 93045 92668 92734 92842 92556 91812 90927 90253
66052 90253 89900 89810 89975 90377 90785 90924 90914 91225 92046 92961 93392 93156 92459 91654 91191 91505 92626 94023 95062
66033 95062 95487 95393 95022 94794 95146 96049 96963 97560 98098 98805 99432 99994 101372 104213 107511 109362 109238 108577
66015 108577 108842 109960 111105 112172 113648 115523 117131 117945 117992 117605 117184 117080 117352 117750 118220 119202 121088
65998 121088 123624 126257 128887 131839 135220 138799 142399 146018 149567 152958 156373 160050 163762 166930
65984 166930 169248 170838 171745 171760 170848 169382 167802 166315 164994 163788 162389 160438 157954 155170 151957
65969 151957 147939 143357 139149 135865 133045 130119 127372 125409 124102 122812 121438 120491 120231 120443 121066
65954 121066 122268 123766 124808 125168 125587 126774 128479 130000 131167 132308 133561 134869 136487 138855 141855
65939 141855 144716 146855 148488 150261 152559 155289 158104 160620 162578 163970 164946 165550 165696 165479 165278
65924 165278 165405 165856 166594 167903 170155 173280 176810 180423 184128 187825 191094 193800 196649 200583 205551
65909 205551 210374 214124 217237 220788 224861 228233 229797 229806 229456 229594 230154 230594 230541 230123 229943 230583 231861
65892 231861 232726 232257 230609 228566 226280 223025 218304 212637 206997 201877 197206 192796 188486 184128 179824
65877 179824 175996 172850 169980 166872 163641 160809 158450 156111 153634 151538 150316 149739 149177 148385 147608
65862 147608 147017 146362 145276 143794 142465 141916 142246 142867 143049 142628 142093 141926 142031 141911 141306 140495 140026 140277
65844 140277 141200 142368 143210 143366 142948 142463 142428 142968 143846 144845 146055 147701 149800 152134 154510 156833 158972
65827 158972 160838 162691 165051 168108 171501 174943 178703 183094 187777 192235 196832 202628 209858 217157
65813 217157 222750 226068 227776 228583 228534 227387 225104 221901 218161 214442 211272 208746 206478 203977 201025
65798 201025 197692 194265 191196 188842 187130 185645 184198 183085 182565 182339 181881 181227 181035 181825 183530 185959
65782 185959 189277 193698 198974 204702 211053 218678 227753 237563 247270 256805 266737 277509 289007 300572
65768 300572 311053 319063 323642 324735 322813 318177 310980 301710 291111 279508 266753 253068 239606
65755 239606 227905 218968 213030 209927 209367 210947 214221 218834 224620 231694 240423 251115 263703 277917
65741 277917 293752 311335 330186 348961 366269 381538 394798 405917 414486 420307 423443 423569
65729 423569 419691 410889 397372 380641 362590 344454 326532 308736 291154 274132 258072 243333
65717 243333 230179 218584 208174 198602 189917 182340 175745 169725 164129 159166 154970 151444 148605
65704 148605 146592 145166 143643 141643 139546 137934 136904 136209 135740 135521 135497 135666 136142 136818 137241 137165 136946
65687 136946 137080 137733 139068 141454 144668 147376 148367 148174 148608 150691 153889 157489 161714 167019 173140
65672 173140 179576 186539 194723 204393 215311 227422 241020 256205 272671 290253 309331 330373
65660 330373 353055 375999 397497 416535 433086 447508 459871 469943 477572 482783 485653 486440
65648 486440 485825 484697 483676 483045 483077 484052 485887 488027 489825 490825 490693 489135 485913 480650 472682 461421
65632 461421 446918 429746 410312 388713 365329 341152 317400 295084 274929 257119 241042
65621 241042 225844 211614 199496 190272 183293 177222 171397 165976 161165 156995 153659 151350 149727
65608 149727 148029 145851 143450 141238 139274 137366 135395 133422 131630 130214 129285 128957 129508 131178 133603
65593 133603 135798 137049 137600 138105 138631 138729 138330 137964 138047 138507 139291 140760 143287 146790 150936 155580 160804
65576 160804 166751 173618 181603 190675 200642 211688 224611 240119 257932 276911 296026 314937
65564 314937 333585 351627 368526 383931 397575 408796 416529 419962 419084 414479 406676 395892 382277
65551 382277 366215 348377 329594 310668 292152 274331 257497 242147 228698 217107 207038
65540 207038 198337 191030 184839 179128 173506 168254 163996 161186 159964 160192 161412 163063 164891 166895
65526 166895 168746 169667 169201 167761 166071 164351 162365 159933 156907 153011 148319 143734 140376 138463 137295
65511 137295 136265 135316 134385 133122 131428 129763 128576 127801 127251 127204 128202 130370 133151 135669 137277 137879
65495 137879 137847 137552 137011 136165 135418 135533 136884 139105 141645 144417 147681 151541 155770 160072 164340 168692
65479 168692 173232 177664 181195 183098 183419 182927 182338 181876 181487 180995 179900 177502 173627 168916 164118 159396
65463 159396 154658 150233 146692 144137 142138 140352 138770 137300 135585 133465 131344 129812 129026 128682 128516
65448 128516 128586 128920 129128 128670 127657 127060 127818 129821 132128 134098 135885 137793 139687 141375 143110 145247
65432 145247 147659 149971 152208 154740 157634 160490 162962 165046 166762 167890 168142 167335 165344 162155 158091
65417 158091 153781 149802 146518 144240 143206 143286 143968 144832 145847 147107 148508 149846 151033 151982 152545 152808
65401 152808 153260 154268 155443 155929 155436 154740 154963 156547 159122 162174 165495 168941 172092 174457 175975
65386 175975 177071 178103 178845 178655 177151 174670 172071 170058 168643 167273 165537 163650 162072 160750 159123
65371 159123 157034 155292 155000 156500 159292 162762 166530 170175 173181 175405 177293 179450 182216 185692
65357 185692 189856 194542 199686 205702 213159 221869 230766 239108 247295 255953 264575 271843 277125 280909
65343 280909 283727 285452 285843 285080 283326 280336 275992 270834 265558 260250 254561 248401 241946 235090 227480
65328 227480 219207 211015 203652 197236 191433 186069 181382 177684 174886 172517 170277 168449 167420 166877
65314 166877 165942 164276 162528 161342 160435 159191 157752 156743 156157 155294 153798 151946 149904 147568 145353
65299 145353 144215 144405 144968 145113 145426 146957 149608 152317 154611 157088 160351 164187 167922 170981 172958
65284 172958 173634 173154 171877 169966 167464 164737 162350 160404 158441 156240 154256 153028 152491 152171 151831
65269 151831 151608 151675 152029 152548 153070 153456 153676 153751 153601 153118 152406 151813 151627 151893 152528 153399 154321 155226 156374
65250 156374 158046 159940 161252 161561 161323 161187 161110 160441 158730 156114 153052 149955 147067 144486 142342 141043
65234 141043 141070 142247 143455 143612 142941 142789 143982 145769 146744 146545 146112 146265 146600 146208 145133 144442 144811
65217 144811 145656 146086 146154 146572 147457 148144 148258 148167 148123 147699 146564 145291 144730 144910 145181 145264 145496 146029 146397
65198 146397 146089 145163 144069 143106 142210 141103 139548 137594 135675 134454 134487 135917 138308 140748 142483 143660
65182 143660 145142 147306 149373 150379 150533 150984 152314 153887 154746 154647 154070 153717 154159 155458 156839 157162
65166 157162 156024 154146 152526 151588 151319 151736 152852 154513 156602 159015 161173 162164 161985 162162 164244 167886
65150 167886 171317 173677 175963 179379 183679 187817 191664 196311 202845 211389 221311 231858 242539 253294
65136 253294 264384 275865 287167 297541 306961 316189 325710 334938 342769 348751 353337 357045 359798
65123 359798 361192 361144 360046 358460 356827 355313 353649 351162 347163 341413 334144 325691 316333 306424 296370
65108 296370 286338 276177 265831 255662 246187 237607 229787 222589 215941 209640 203420 197316 191764
65095 191764 187150 183443 180410 178003 176246 174782 172872 170089 166928 164520 163649 164130 165115 165916 166434
65080 166434 166951 167696 168636 169483 169841 169461 168461 167218 165942 164435 162402 159929 157565 155944 155436 156034
65064 156034 157369 158832 159852 160181 159917 159346 158814 158630 158930 159666 160810 162440 164437 166307 167644 168633
65048 168633 169660 170477 170318 169028 167488 166570 166127 165469 164441 163420 162476 161266 159800 158674 158355 158588
65032 158588 158707 158240 157133 155717 154515 153803 153252 152329 151068 150058 149570 149180 148448 147485 146544 145521 144272
65015 144272 143092 142366 141969 141480 140855 140513 140835 141951 143875 146464 149304 152035 154785 157974 161765 165980
64999 165980 170390 174695 178342 180907 182627 184121 185548 186530 186883 186918 186928 186907 186933 187275 187902 188370 188472 188639
64981 188639 189439 191107 193736 197349 201405 204822 207008 208445 209706 210359 209557 207406 204861 202391 199557
64966 199557 195995 192056 188201 184421 180624 177071 174089 171699 169866 168697 168021 167088 165216 162629 160294
64951 160294 158986 158774 159298 160154 160989 161522 161617 161265 160502 159518 158697 158312 158162 157804 157166 156658 156583 156736 156846
64932 156846 157106 157954 159433 161134 162727 164137 165114 165091 163804 161740 159635 157755 156110 155085 155178 156037
64916 156037 156475 155836 154887 154841 155819 156845 157216 157249 157583 158307 159147 160153 161775 164279 167384 170628 173932
64899 173932 177663 182089 186994 192009 197273 203427 210846 219117 227524 235767 243927 251908 259365 266131
64885 266131 272312 277891 282636 286539 289997 293341 296409 298743 299952 299758 297973 294750 290694 286385
64871 286385 281856 276817 271303 265837 260905 256521 252401 248362 244450 240835 237693 235121 233062 231380
64857 231380 230024 228982 227949 226193 222997 218312 212819 207294 202049 197087 192566 188805 185812 183122
64843 183122 180254 177229 174523 172552 171278 170254 168992 167358 165701 164546 164139 164376 165142 166524 168522
64828 168522 170695 172317 172945 172763 172373 172297 172620 173119 173704 174662 176332 178702 181554 184879 188708 192517
64812 192517 195434 197389 199593 203355 208732 214864 221361 228711 237362 247048 257075 266740 275328 282166
64798 282166 286934 289633 290205 288579 285133 280636 275573 269910 263678 257256 250869 244342 237682 231516
64784 231516 226509 222729 219927 218068 217091 216488 215733 214970 214745 215159 215825 216653 218092 220453 223461 226740
64768 226740 230397 234846 240216 246209 252524 259266 266862 275551 284983 294454 303517 312148 320216 327223
64754 327223 332914 337880 343008 348359 353116 356696 359449 362030 364506 366422 367492 367872 367813 367281 365847
64739 365847 362774 357360 349532 340120 330261 320467 310473 300145 290275 282136 276238 271812 267669 263397
64725 263397 259554 256851 255391 254643 253896 252696 251096 249602 248755 248770 249727 251940 255757 260884 266376 271509
64709 271509 276369 281282 285997 289786 292195 293330 293516 292988 291738 289361 285185 278956 271327 263367 255678
64694 255678 248341 241528 235601 230582 226062 221762 217753 214089 210721 207981 206552 206545 207050 207100 206839 207275
64678 207275 209028 211778 214874 218061 221547 225691 230793 236976 244181 252283 261182 270671 280355 289921
64664 289921 299354 308564 316798 322749 325457 324943 321885 316855 310142 302167 293718 285576 278046 271027
64650 271027 264589 259275 255660 253680 252658 252047 251954 252776 254515 256785 259479 263057 267990 274139 280971
64635 280971 288292 296464 305867 316409 327656 339231 350959 362799 374809 386977 398786 409035
64623 409035 416423 420329 420856 418197 412369 403642 392746 380417 366974 352619 337873 323446 309904
64610 309904 297741 287490 279337 272713 266718 260893 255262 249823 244513 239674 235938 233415 231465 229540
64596 229540 227924 227253 227522 227999 228079 228002 228705 231041 235100 240205 245563 250855 256140 261418 266638 272070
64580 272070 278195 285083 292243 299328 306656 314713 323319 331595 338696 344446 349283 353678 357499 359965
64566 359965 360428 359094 356621 353047 347673 340111 330878 320682 309819 298726 288438 279672 271817
64553 271817 263690 255115 246991 239918 233672 228091 223544 220214 217717 215911 215398 216662 219180 222032
64539 222032 224979 228328 231977 235329 238085 240421 242275 243008 242164 240161 237836 235482 232702 229190 225311
64524 225311 221732 218744 216190 213946 212084 210519 208926 207271 206092 205827 206083 206093 205800 205890 206655 207513
64508 207513 207970 208511 210026 212699 216015 219644 223768 228593 234065 240124 246809 254055 261727 269935 278992
64493 278992 288924 299290 309494 318925 326707 331781 333606 332577 329544 325140 319868 314516 309957 306454
64479 306454 303501 300541 297616 295172 293431 292139 290836 289151 286835 283750 279940 275688 271437 267673
64465 267673 264865 263321 262925 263130 263465 264050 265360 267450 269731 271646 273286 275018 276768 278126 279075
64450 279075 280079 281298 282124 281772 280134 277841 275730 274527 274747 276477 279198 282196 285283 288963 293865
64435 293865 300196 307804 316573 326634 338313 352007 368051 386593 407602 431088 457317 486879
64423 486879 520647 559641 604874 657287 717902 787916 868374 959540 1060618 1169995 1285396
64412 1285396 1403660 1520754 1632686 1736697 1831455 1916083 1989184 2048773 2092764 2119316
64402 2119316 2127101 2115880 2086975 2042868 1986005 1917798 1838584 1748371 1647760 1538607 1424157
64391 1424157 1308548 1195920 1089601 991674 902888 822979 751346 687718 632187 584683 544549
64380 544549 510643 481671 456471 434343 415343 399986 388282 379142 370986 362868 354807 347136
64368 347136 339934 333090 326501 319999 313335 306453 299635 293184 287057 281022 275100 269632 264830 260409
64354 260409 255869 251238 247398 245440 245583 246989 248780 250994 254231 258626 263712 269198 275230 281551
64340 281551 286978 290206 290943 289888 287770 284758 280681 275466 269404 263243 257944 254040 251253 248956
64326 248956 246958 245616 245288 245941 247236 248712 249917 250666 251197 251793 252237 251979 250935 249896 249959 251627
64310 251627 254429 257276 259235 260143 260462 260397 259416 256937 253271 249317 245355 240791 235306 229654 224922
64295 224922 221370 218406 215452 212400 209402 206633 204269 202532 201713 202149 203857 206190 208254 209934 212041
64280 212041 215114 218589 221737 225023 229683 236058 243121 249812 256130 262669 269739 277362 285594 294264
64266 294264 302606 309643 314892 318400 320239 320395 319066 316757 313977 311126 308703 307309 307210 308023 308957
64251 308957 309304 308608 306496 302614 296872 289665 281685 273452 265079 256549 248178 240680 234728 230504 227650
64236 227650 225607 223962 222580 221513 220821 220484 220468 220841 221743 223154 224719 225903 226379 226251 225812 225178 224255
64219 224255 223098 222040 221313 220706 219857 218800 217931 217440 217049 216387 215303 213734 211643 209312 207395 206279
64203 206279 205670 205136 204877 205433 206761 208118 208931 209329 209687 210151 210902 212508 215549 220034 225507 231666
64187 231666 238610 246563 255638 265903 277450 290296 304333 319320 334670 349179 361221 369484
64175 369484 373530 373523 369603 361867 351031 338654 326326 314676 303518 292821 283060 274530 266831
64162 266831 259364 252059 245268 239204 233861 229273 225413 221958 218585 215459 212985 211174 209770 208960
64148 208960 209365 211188 213915 217108 220952 225658 230819 235815 240512 245089 249446 253286 256560 259307
64134 259307 261186 261726 261060 259888 258636 257108 255059 252679 250282 247941 245725 244044 243418 244030 245755
64119 245755 248481 252149 256544 261331 266313 271480 276805 282246 288021 294723 302959 312877 324047 335716
64105 335716 347083 357503 366634 374436 380941 385997 389459 391653 393457 395759 398950 403142 408712 416205
64091 416205 425579 435825 445584 453994 460712 465244 466725 464642 459546 452590 444273 434030 421398
64078 421398 407350 393842 381969 371137 360306 349538 339796 331619 324711 318685 313473 308929 304783
64065 304783 301228 298910 297937 297458 296686 295863 295701 296252 297029 297999 299697 302269 305001 307058 308383 309723
64049 309723 312029 315928 321539 328583 336670 345478 354699 364092 373788 384288 395857 408101 420516
64036 420516 433195 446486 460013 472585 483078 490906 495595 496587 493856 488263 480890 472339 462953
64023 462953 453415 444631 437196 431261 426795 423678 421733 420941 421387 422572 422951 420766 415468 407976 399479
64008 399479 390472 381086 371819 363419 356170 349755 343842 338527 334101 330610 327785 325234 322606 319675
63994 319675 316485 313433 311083 309819 309695 310555 312197 314413 316992 319845 323084 326865 331108 335471 339722
63979 339722 344149 349442 356028 363518 371040 378187 385431 393419 402082 410811 419405 428344 438006 448098
63965 448098 458214 468646 480222 493484 508420 524813 542485 561299 581405 603545 628684
63954 628684 657316 689527 725853 767600 816142 872320 936848 1010896 1095902 1193092 1303591
63943 1303591 1428673 1569260 1725117 1894939 2077243 2270726 2473690 2683582 2897367
63934 2897367 3111956 3323972 3529247 3722869 3899696 4054770 4183683 4283126 4351262 4387358
63924 4387358 4390966 4361657 4299546 4205909 4083236 3934990 3765438 3579486 3382299 3178895
63914 3178895 2973903 2771317 2574161 2384441 2203655 2033366 1875170 1730290 1599370
63905 1599370 1482530 1379255 1288279 1208031 1137397 1075853 1022882 977657 939446 907825 882082
63894 882082 860756 842248 825796 811452 799247 788804 779619 771137 762480 752698 741590 729929
63882 729929 718606 707875 697736 688674 681560 676907 674632 674587 677003 682340 690900 702730 717786
63869 717786 736044 757426 781615 807975 835694 864031 892477 920758 948851 976884 1004740
63858 1004740 1031670 1056511 1078401 1097092 1112444 1123987 1131327 1134794 1135154 1132651 1126701 1116706 1102839
63845 1102839 1085795 1066014 1043413 1017798 989302 958422 925845 892186 857701 822225 785639
63834 785639 748564 712404 678428 646811 616799 587819 560229 534818 511816 490680 470800
63823 470800 452062 434586 418228 402703 388107 374910 363283 352708 342557 332891 324371 317342
63811 317342 311361 305764 300417 295580 291259 287124 283078 279531 276849 274835 272985 271119 269462 268141
63797 268141 266832 264977 262250 258801 255123 251691 248692 246079 243817 241879 240063 238082 235987 234232
63783 234232 233086 232210 231086 229618 228002 226213 224168 222291 221300 221244 221264 220553 219245 218062 217474 217474 217833
63766 217833 218158 217940 217057 216111 215902 216567 217559 218442 219302 220361 221651 223176 224969 226726 227727 227485 226301
63749 226301 224861 223466 222050 220853 220510 221303 222739 224153 225402 226685 227967 229098 230393 232472 235355
63734 235355 238166 240012 240878 241384 242008 242935 244432 246816 250002 253522 257083 260806 264769 268675 272260
63719 272260 275861 280243 285800 292029 297904 302728 306553 309710 312048 312921 312033 310010 307818 305807 303684
63704 303684 301314 299037 297091 295169 292828 290121 287588 285748 284755 284439 284559 285105 286413 288799 292077
63689 292077 295649 299111 302468 305655 308276 310139 311739 313765 316214 318384 319708 320276 320460 320363 319850
63674 319850 318998 318295 318307 319181 320493 321681 322614 323691 325368 327683 330211 332317 333433 333303 332146 330434
63658 330434 328401 325847 322480 318306 313570 308532 303494 298875 294994 291781 288876 286016 283250 280860
63644 280860 279222 278657 279207 280472 281819 282806 283501 284430 286188 288976 292483 296318 300479 305167 310144
63629 310144 314659 318236 321347 325044 330073 336499 343971 352022 360187 368188 376127 384428 393584 404014
63615 404014 416046 429795 445025 461285 478274 496121 515387 536737 560421 586030 612941
63604 612941 641059 670826 702333 734611 765962 794777 819801 839877 853912 861373 862821 859958
63592 859958 854995 849563 843988 837762 830683 823156 815228 805801 793284 776787 756399 732688 706485
63579 706485 678962 651351 624530 599174 576107 555961 538579 523269 509721 498156 488589 480544
63567 480544 473795 468970 467058 468488 472763 478756 485250 491542 497797 504723 512837 522154 532402 543175
63553 543175 553934 564433 575440 588564 605021 624772 647174 672205 700692 733486 770824
63542 770824 812382 857321 903729 948058 985683 1012741 1027869 1032257 1028127 1017538 1002717 986706
63530 986706 972537 961549 953034 945717 938927 932072 923641 911573 894538 872392 845535 814406
63518 814406 779743 742866 705365 668565 633401 600584 570610 543597 519309 497469 477975
63507 477975 460740 445408 431454 418581 406832 396295 386935 378785 371963 366221 360809 355141 349448
63494 349448 344441 340519 337694 336020 335500 335596 335441 334709 333798 333088 332510 331992 331790 332133 332991 334455 336869
63477 336869 340280 344159 348106 352452 357720 363684 369376 373874 376795 378207 378396 377625 375885 372971 368973
63462 368973 364421 359828 355408 351395 348157 345605 342964 339732 336549 334527 333907 333997 334281 334891 336075
63447 336075 337919 340686 344740 349823 355022 359763 364445 369826 376303 384232 394543 408357 425998
63434 425998 446807 470066 495941 525490 559647 597826 637156 673306 702601 723653 737123
63423 737123 744359 746764 746271 745532 747001 751973 760817 773929 792002 815434 843941 876806 913035
63410 913035 950984 988236 1022298 1051366 1074250 1089944 1097897 1098770 1094448 1087073 1078232 1068959 1059959
63397 1059959 1051393 1042633 1032525 1019829 1003373 982086 955284 923038 886308 846836 806805 768171
63385 768171 731965 698264 666873 637833 611281 587219 565722 547038 531208 517775 506209
63374 506209 496531 489249 484831 483394 484681 488048 492724 498439 505660 514896 526010 538663 553174
63361 553174 570298 590136 611951 635280 660641 688797 719738 752740 787146 822641 858950
63350 858950 895678 932335 968065 1001278 1029900 1052174 1067183 1074723 1075197 1069875 1060877 1050315
63338 1050315 1039353 1028361 1017791 1008229 999230 988664 973906 953691 928436 899024 866036 830353
63326 830353 793737 758190 724881 694040 665744 640538 619399 603280 592510 586400 583536 582450
63314 582450 581675 579051 571693 557422 536367 510948 484398 459360 437286 418440 402394 388841
63302 388841 377867 369279 362129 355504 349591 345281 342739 340987 338986 336554 334088 331831 329604 326942
63288 326942 323419 319218 315368 312891 311601 310242 307903 304803 301547 298335 295277 292883 291605 291152
63274 291152 290814 290296 289892 289956 290564 291565 292682 293697 294769 296374 298665 301098 303092 304876 307239 310445
63258 310445 313780 316287 317663 318371 319152 320539 322710 325589 329049 333017 337475 342436 347921 353831 359864
63243 359864 365740 371550 377691 384442 391865 400145 409605 420189 431336 442782 455148 469252 484958
63230 484958 501261 517539 534271 552328 571899 592254 612353 631511 649731 667600 685756
63219 685756 704298 722786 740917 759074 778008 797991 818335 837758 855138 869987 882314
63208 882314 892142 899156 902723 902155 897001 887233 873276 855870 835862 814188 791973 770404 750349
63195 750349 732204 716223 702824 692400 685022 680664 679695 682712 689755 700028 712671 727631 745462
63182 745462 766417 790031 815559 842505 870662 899980 930563 962546 995692 1029201 1062102
63171 1062102 1093751 1123887 1152418 1179446 1205288 1230011 1252821 1272173 1286527 1294801 1296180 1289949
63159 1289949 1275750 1253819 1224856 1189887 1150194 1106921 1060581 1011471 960825 911077 864410
63148 864410 821354 781227 743630 708930 677528 649413 624443 602452 582998 565557 550090
63137 550090 536950 526101 516916 508844 501776 495600 489920 484544 479807 476118 473492 471740 470736 470297
63123 470297 470235 470814 472784 476544 481545 486822 491803 496343 500353 503853 507104 510236 513017 515353 517740
63108 517740 520685 523867 526434 528020 528984 529730 530336 530900 531704 532820 533902 534572 534803 534862 535113 535882 537258
63091 537258 538952 540552 541934 543182 544195 544686 544602 544172 543476 542254 540303 537844 535431 533725 533399 534888
63075 534888 538039 542183 546777 551794 557379 563346 569276 575024 580955 587723 595901 605732 617059 629449
63061 629449 642462 655871 669807 684827 701683 720763 741773 764334 788958 816942 848914
63050 848914 883790 919737 956131 994070 1034839 1078374 1123575 1169615 1216302 1263339 1310013
63039 1310013 1355969 1401725 1447945 1494536 1540974 1587313 1634225 1681964 1729803 1776580 1821284
63028 1821284 1862810 1899570 1929719 1951598 1963846 1965519 1956531 1937744 1910296 1875005 1832683 1784715
63016 1784715 1732904 1678996 1624781 1572406 1523883 1480299 1442065 1409982 1385429 1369268 1361136
63005 1361136 1360186 1366125 1379043 1398580 1423890 1454525 1490833 1533168 1580899 1632564 1686995 1743897
62993 1743897 1803071 1863393 1923254 1982072 2040735 2100140 2159745 2218024 2273908 2326963 2376286
62982 2376286 2420085 2456484 2484034 2501157 2505809 2496245 2471838 2432914 2380248 2315154 2239694 2156221
62970 2156221 2066820 1973474 1878493 1784255 1692630 1604962 1522421 1445869 1375438 1310736 1251508
62959 1251508 1197733 1149044 1104544 1063373 1025167 989841 957297 927501 900468 875819 852611
62948 852611 829966 807749 786350 765924 746222 727091 708746 691406 675000 659429 644866
62937 644866 631580 619585 608664 598630 589359 580666 572477 565033 558675 553410 548950 545170 542209
62924 542209 540023 538238 536581 535168 534099 533125 531966 530686 529320 527440 524628 521263 518247 515893
62910 515893 513599 510734 507362 503893 500524 497410 494948 493371 492154 490270 487104 482950 478698 475237
62896 475237 472986 471679 470602 469347 468374 468574 470201 472461 474267 475183 475489 475533 475379 475087 474966 475240 475611
62879 475611 475466 474629 473687 473415 473970 474788 475169 474807 473905 473045 472867 473500 474185 473768 471779 468962 466499 464809
62861 464809 463280 461215 458840 457166 456828 457312 457568 457322 457343 458310 459856 461115 461861 462503 463121 463244 462716
62844 462716 462159 462248 462970 463854 464481 464436 463225 460804 457959 455649 454110 452926 451795 450739 449745 448724
62828 448724 447787 447089 446433 445556 444810 444960 446140 447585 448675 449758 451523 454018 456772 459556 462424 465175
62812 465175 467382 469022 470587 472464 474675 477325 480755 484963 489309 493301 497403 502535 508868 515651
62798 515651 522324 529306 537475 547154 557867 568869 579705 590403 601368 613047 625683 639540
62786 639540 655371 674261 696736 722420 750967 783063 819997 862367 909747 961573 1017810
62775 1017810 1078575 1143602 1212328 1284088 1357842 1431902 1504210 1572807 1635928 1691837 1738817
62764 1738817 1775302 1800025 1812225 1811730 1798680 1773254 1736063 1688823 1634097 1574079 1509936 1442504
62752 1442504 1373153 1303634 1235437 1169705 1107341 1048712 993602 942015 894713 852319 814098
62741 814098 778504 744991 714518 687991 664947 644162 625071 608042 593580 581738 572138 564202
62729 564202 557415 551686 547311 544354 542250 540397 539046 539129 541121 544438 548196 552279 557372 564086 572455
62714 572455 582391 594242 608509 625109 643324 662702 683817 707913 735903 767928 803831 843793
62702 843793 888373 938034 992804 1052493 1117345 1188392 1266929 1353447 1447187 1546748 1650839
62691 1650839 1758216 1867279 1976249 2083619 2187715 2285557 2372729 2444847 2499077 2534031
62681 2534031 2548663 2541958 2513832 2465829 2400551 2320517 2227907 2125381 2016667 1905861 1796001
62670 1796001 1688543 1584251 1484234 1389793 1301620 1219711 1144088 1075052 1012557 955812 903922
62659 903922 856613 813976 775697 741057 709618 681411 656322 633745 613149 594660 578674
62648 578674 564908 552277 539850 527681 516492 506694 497983 489781 481812 474226 467483 462165 458510
62635 458510 455924 453241 449851 446424 444159 443455 443614 443693 443102 441425 438365 434230 430067 426833 424534
62620 424534 422478 420222 418025 416487 416060 416819 418418 420222 421672 422663 423564 425018 427733 432249 438563
62605 438563 445989 453581 460786 467699 474838 482845 492278 503442 516369 531067 547853 567364 590193
62592 590193 616433 645508 676495 708806 742485 777591 813253 847751 879654 908494 934064
62581 934064 955500 971557 981456 984917 981648 971575 955543 934996 910736 882673 851104 817580
62569 817580 784054 751589 720424 690813 663108 637228 612833 590054 569504 551463 535570
62558 535570 521451 509184 498858 490123 482475 475745 469928 464829 460271 456495 453847 451988 449896
62545 449896 446859 443249 440130 438314 437987 438962 440918 443445 446274 449554 453631 458446 463305 467355 470126
62530 470126 471634 472358 473319 475763 480315 486603 494052 502896 513968 527719 544073 563222 585801
62517 585801 611976 641025 672348 706462 744472 786872 833425 883946 938466 996640 1057584
62506 1057584 1120334 1183896 1246678 1306437 1361068 1409072 1449060 1479330 1498406 1505815 1502006 1487724
62494 1487724 1463874 1431973 1394333 1353639 1312261 1271846 1233478 1198242 1167596 1142907 1124623
62483 1124623 1112245 1105299 1103996 1108712 1119212 1134824 1155103 1179697 1207543 1236663 1264848 1290194
62471 1290194 1310981 1325569 1332862 1332781 1325994 1313083 1293934 1267829 1234141 1193090 1145964 1094677
62459 1094677 1041148 987028 933648 881941 832491 785866 742803 703855 669108 638550 612472
62448 612472 591034 573535 558747 546092 535996 528901 524422 521741 520413 520440 521885 524791 529190
62435 529190 534840 541117 547449 553601 559275 563745 566313 566900 565742 562732 557636 550841 543246 535299
62421 535299 526618 516768 505969 494846 483865 473304 463459 454538 446539 439481 433590 428944 425047
62408 425047 421109 416805 412627 409396 407492 406523 405618 404086 401879 399487 397379 395637 394182 393192 393081
62393 393081 394038 395778 397859 400116 402646 405396 407995 410144 412058 414278 417027 419924 422503 424874
62379 424874 427700 431566 436587 442622 449580 457271 465115 472368 478876 485487 493407 503027 513540 523907
62365 523907 534139 545399 558866 574775 592737 612694 635210 660878 689814 721910 757480
62354 757480 797418 842561 892815 946911 1003207 1060733 1119193 1177693 1233654 1283466 1324418
62343 1324418 1355843 1378384 1392527 1398150 1395288 1384779 1367957 1345896 1319124 1287836 1252144 1212250
62331 1212250 1168870 1123691 1079125 1037271 999084 964586 933563 905782 880841 858396 838495
62320 838495 821144 805419 789587 772411 753945 734750 714858 694011 672522 651191 630465
62309 630465 610328 591030 573315 557664 543787 531120 519621 509764 501882 495660 490286 485123
62297 485123 480284 476390 473623 471279 468610 465906 464246 464205 465302 466814 468580 470795 473438 476229 478906
62282 478906 481312 483470 485716 488516 491974 495757 499604 503538 507474 511120 514561 518469 523210 528127
62268 528127 532321 536007 540492 546842 555147 565085 576655 590130 605818 624243 646262 672579 703250
62255 703250 738011 777079 821308 871346 926758 986119 1047892 1110931 1174023 1235236 1292115
62244 1292115 1342492 1384796 1417689 1440114 1452114 1455141 1450849 1439570 1420363 1392441 1355965 1311533
62232 1311533 1259746 1201878 1140487 1078620 1018405 960800 906554 856721 812006 772169 736560
62221 736560 704958 677405 653380 631790 611939 594088 578865 566468 556659 549099 543264 538357
62209 538357 533796 529717 526648 524809 524166 524912 527295 530977 535251 540015 545932 553388 561889 570793 580067
62194 580067 589927 600170 610368 620292 629644 637793 644422 650197 656111 662297 668123 673328 678320 683294
62180 683294 687790 691424 694481 697426 700190 702258 703203 702907 701560 699732 698324 698278 700420 705581 714575
62165 714575 727959 746064 769250 797770 831226 868554 908777 951389 995685 1040066 1082407
62154 1082407 1120871 1154018 1180472 1199158 1209973 1213796 1211673 1204268 1192016 1175268 1154063 1128107
62142 1128107 1097386 1062766 1025772 987969 950706 915278 882873 854245 829630 809030 792364
62131 792364 779234 768815 760319 753538 748665 745489 743090 740545 737850 735834 735180 735799 737311 739896
62117 739896 744328 751088 759641 768657 776763 782923 786364 786658 784138 780003 775631 771738 768244 764777
62103 764777 761013 756548 750791 743237 733836 723183 712467 703121 696175 691794 689575 689280 691022 694753
62089 694753 699951 705953 712316 718761 725173 731907 739684 748819 758852 769384 781017 794965 811818
62076 811818 831086 851855 873509 895900 919272 943978 969842 995818 1020699 1044168 1066727
62065 1066727 1088678 1109773 1130054 1150430 1172083 1195629 1221059 1248116 1276413 1305386 1334334
62054 1334334 1362270 1387711 1409083 1425611 1437462 1444748 1446861 1443152 1433848 1419702 1400932 1377036
62042 1377036 1347533 1312416 1271951 1226649 1177599 1126413 1074619 1023284 973250 925380 880399
62031 880399 838712 800493 765744 734137 705076 678216 653875 632664 614716 599448 586071
62020 586071 574119 563265 552898 542289 531321 520737 511412 503493 496477 489883 483520 477233 470881
62007 470881 464676 459142 454627 451184 449023 448612 450057 452725 455855 459348 463702 469271 475715 481934
61993 481934 486472 488496 488738 489075 490674 492800 493832 493138 491346 489035 485946 481576 475914 469367 462382
61978 462382 455338 448507 442026 436171 431578 428697 427084 425807 424657 424371 425376 426902 427823 427921 427812
61963 427812 427920 428086 428095 428048 428090 428086 427744 426971 426059 425479 425417 425544 425437 425197 425360 426192 427467 429064 431335 434619
61943 434619 438824 443897 450364 458862 469317 480996 493324 506259 520008 534770 550641 567338
61931 567338 584057 599972 614827 628732 641607 653331 664277 675035 685503 694759 701893 706446
61919 706446 708104 706728 702908 697759 691888 685227 678213 672262 668411 666239 664987 665148 667926 673503
61905 673503 681032 690268 701854 715632 729750 742168 752348 760803 767592 771995 773362 771534 766552
61892 766552 758583 748123 735884 722428 708229 693932 680095 666738 653590 640827 629126 618869
61880 618869 609657 600802 592003 583280 574498 565284 555410 545077 534814 525160 516421 508640 501797 496012
61866 496012 491523 488456 486672 485872 485846 486639 488511 491660 495968 501137 507191 514727 524502 536773 551203
61851 551203 567343 585065 604512 625858 649140 674104 700128 726475 752788 779199 805747
61840 805747 831701 855632 876228 892951 905819 914723 919238 919239 915419 908929 900570 890674 879823
61827 879823 869340 860874 855715 854575 857608 864303 873613 884609 896881 910048 923071 934453 942955
61814 942955 947639 947420 941249 928924 911259 889366 864203 836847 808525 780009 751443 723145
61802 723145 696176 671746 650368 631954 616251 602685 590150 577685 565353 553895 543648
61791 543648 534356 526006 519049 513526 508627 503617 498789 494926 492074 489390 486212 482779 479766 477507
61777 477507 475864 474539 473169 471380 469159 467126 466011 465785 465662 465027 464018 463052 462308 462010 462743 464793
61761 464793 467402 469365 470344 470997 471870 472934 474339 476795 480690 485382 489845 493559 496372 498034 498420
61746 498420 497862 496689 494809 492290 489876 488166 486551 483869 479997 475971 472488 469227 465910 463196
61732 463196 461956 462151 462910 463444 463545 463504 463861 465093 467235 469858 472424 474516 475839 476469 477121 478677
61716 478677 481200 483850 485937 487654 489546 491725 493935 495926 497333 497594 496509 494671 492840 490963
61702 490963 488230 484096 478961 473942 470131 467837 466243 464054 460826 457475 455131 453765 452371 450268
61688 450268 447563 444497 441059 437403 434056 431395 429311 427588 426201 425015 423615 421737 419611 417601
61674 417601 415768 414072 412684 411696 410784 409549 408100 406810 405592 403943 401819 399990 399191 399227 399221 398637
61658 398637 397741 397089 396800 396398 395316 393614 392263 392501 394634 397549 399645 400280 400089 400035 400596 401935 404232
61641 404232 407375 410606 413079 414779 416498 418854 421672 424330 426307 427214 426664 424479 420973 416893 413075
61626 413075 410120 408142 406720 405263 403556 401833 400254 398532 396215 393203 389904 386950 384793 383347
61612 383347 381968 380011 377512 375076 373039 371042 368601 365690 362457 358732 354304 349511 345084 341398
61598 341398 338202 335085 331920 328864 326182 324000 321998 319451 315918 311800 307928 304711 302058 299899
61584 299899 298247 296731 294732 292200 289805 288043 286619 285040 283378 282037 281058 280116 279084 278186 277644
61569 277644 277440 277400 277327 277187 277323 278248 279978 281778 282914 283484 284095 284876 285324 285184 284943 285219 285968 286611
61551 286611 286791 286737 286938 287627 288645 289721 290801 291958 293042 293688 293912 294406 295810 297777 299290 299963
61535 299963 300488 301556 302844 303544 303540 303514 304051 305131 306452 307725 308581 308689 308141 307346 306383 304833 302473
61518 302473 299813 297640 296294 295699 295796 296501 297388 297908 297998 298119 298634 299440 300257 300872 300998 300326 299001 297782
61500 297782 297393 297746 298032 297522 296189 294641 293609 293350 293428 293239 292898 293332 295208 297941 300146 301027 300951
61483 300951 300680 300502 300291 300045 299984 300234 300711 301363 302383 304055 306343 308659 310225 310827 311079 311718 312766
61466 312766 313648 314023 314018 313680 312855 311889 311852 313392 315665 317039 316790 315597 314430 313581 312945 312611 312788 313418
61448 313418 314256 315155 316082 317030 318083 319348 320574 321162 320906 320523 321047 322784 325225 327879 330692 333593
61432 333593 336175 338169 339887 341813 343889 345559 346448 346708 346730 346792 347088 347859 349256 351103 352920 354299
61416 354299 355307 356491 358358 360817 363241 365139 366575 367788 368580 368428 367236 365619 364257 363152 361756
61401 361756 359719 357314 355136 353604 352815 352648 352852 353113 353216 353174 353142 353200 353309 353485 353860 354503 355306 356117
61383 356117 356894 357577 357958 357903 357657 357597 357670 357467 357039 357263 358972 361868 364682 366374 366914 366990 367331 368318 369842
61364 369842 371356 372360 372907 373457 374197 374857 375259 375676 376468 377744 379596 382281 385852 390002 394635 400236
61348 400236 407191 414979 422590 429560 436065 442106 447348 451835 456151 460597 464731 468157 471359 475248
61334 475248 480055 485066 489384 492659 495147 497302 499300 500822 501300 500469 498575 496059 493254 490527 488414
61319 488414 487322 487215 487777 488807 490259 492125 494497 497658 501864 507132 513411 520811 529358 538615 547910
61304 547910 557084 566803 578088 591553 606927 623010 638117 650856 660604 667287 670953 671838 670607
61291 670607 668004 664218 658953 652184 644454 636286 627691 618496 608824 599012 589311 579928 571144 563143
61277 563143 555916 549592 544590 541109 538647 536451 534416 533181 533320 534736 536903 539422 542157 544985
61263 544985 547521 549170 549700 549948 551667 556174 563141 571054 578766 586139 593206 599485 604543 608709 612651
61248 612651 616486 619841 622572 624823 626430 626931 626312 625265 624369 623420 621911 619897 617998 616651 615740
61233 615740 614950 614105 613134 612015 611035 610923 612408 615567 619773 624400 629453 635387 642393 650063 657797
61218 657797 665342 672828 680488 688503 696952 705644 714031 721609 728466 735227 742313 749374 755486 759845
61204 759845 762310 763491 764358 765558 767120 769006 771839 776632 783642 792012 800898 810606 822157 835983
61190 835983 851564 868170 885255 901980 916935 928789 937121 942545 946173 948960 951196 952433 952129
61177 952129 950484 948375 946360 944055 940731 936239 930967 925070 918208 910090 900974 891361 881321 870305
61163 870305 857734 843689 828841 813703 798246 782464 766969 752477 738789 724943 710594
61152 710594 696707 684545 674413 665822 658495 652626 648382 645617 643963 642732 640869 637547 632735
61139 632735 626777 619578 610952 601739 593746 588166 584599 582020 580242 579889 581334 584271 588240 593091
61125 593091 598903 605848 614198 624168 635700 648651 663209 679873 698966 720387 743942 769648
61113 769648 797485 826965 857298 888045 919385 951507 983917 1015624 1046001 1075108 1103075
61102 1103075 1129522 1153838 1175703 1194889 1210738 1222276 1228846 1230279 1226579 1217955 1205123 1189040
61090 1189040 1170202 1148706 1125037 1100111 1074266 1046957 1017986 988490 959977 932788 906225
61079 906225 879975 854608 830702 808242 787047 767116 748357 730550 713935 699338 687284
61068 687284 677317 668559 660699 654011 648659 644550 641832 640952 641926 643925 645969 647885 650276 653733 658485
61053 658485 664720 672596 681663 690877 699717 708931 719617 731918 745345 760110 777145 796781 818410
61040 818410 841672 866963 894309 922849 952159 983174 1016878 1052819 1089963 1128370 1168888
61029 1168888 1211673 1256280 1302941 1352414 1404512 1457911 1511443 1564711 1617627 1670658 1725619
61018 1725619 1785050 1850651 1923347 2004610 2096188 2198536 2311307 2435882 2575961 2735788
61008 2735788 2920499 3139503 3407514 3741073 4155945 4668775 5298050 6061500 6976578
60999 6976578 8067718 9369475 10914608 12715129 14750653 16957716 19205025 21274209
60991 21274209 22899282 23880633 24201197 24042902 23685360 23375804 23263027 23394229 23712244
60982 23712244 24037133 24090358 23602542 22448884 20706468 18593640 16355116 14181494 12191134
60973 12191134 10443735 8955028 7709756 6677598 5826278 5125826 4548383 4069859 3671718
60964 3671718 3339252 3058928 2818817 2610355 2427774 2266280 2122029 1992927 1877744
60955 1877744 1774717 1682196 1599998 1528684 1467661 1415143 1369603 1330062 1295182 1263321 1233405
60944 1233405 1204748 1176339 1147584 1119665 1094753 1073619 1055059 1037738 1021383 1005903 990674
60933 990674 975420 960840 947662 935751 924696 914545 905344 896592 887886 879682 872784 867429 863459
60920 863459 860965 860035 860117 860366 860645 861558 863408 865623 867456 868877 870527 872966 876218 879980 884056 888488
60904 888488 893415 898896 904826 910803 916097 920077 922821 925054 927283 929315 930853 932106 933271 933679
60890 933679 932189 928406 922942 916459 909089 900820 891763 881820 870785 859050 847607 836932 826438
60877 826438 815463 804263 793496 783196 772988 763001 753784 745395 737228 728804 720222 711785 703727
60864 703727 696418 690280 685232 680565 675631 670437 665406 660836 656779 653202 649897 646347 641972 636628
60850 636628 630741 624924 619602 614968 611088 607782 604425 600120 594340 587409 580164 573102 565972 558266
60836 558266 549913 541313 532812 524414 516019 507655 499397 491247 483340 476149 470209 465561 461684 458151
60822 458151 455190 453405 452971 453324 453648 453463 452712 451544 450148 448612 446825 444696 442620 441397 441364 441795
60806 441795 441561 440344 438832 437791 437343 437176 437036 436782 436362 436051 436417 437694 439256 440075 439752 438863 438170
60789 438170 437681 436697 434705 431946 428963 425896 422616 419449 417141 415877 414802 412978 410515 408278 406724
60774 406724 405519 404171 402440 400126 397059 393488 390114 387610 386422 386885 388926 391590 393540 394331 394626
60759 394626 394937 394807 393712 392189 391389 391788 392914 394161 395347 396528 397779 399195 400809 402519 404361
60744 404361 406726 409972 413878 417680 420628 422326 422711 421925 420123 417243 413133 408033 402667 397636 393041
60729 393041 388906 385565 383166 381113 378611 375599 372626 369962 367377 364750 362256 359913 357505 355111
60715 355111 353211 352015 351062 349742 347945 346038 344449 343382 342710 342026 341023 339852 338871 338072 337104 335902
60699 335902 334877 334309 333921 333325 332613 332254 332582 333564 334876 336039 336690 336918 337195 337840 338711 339570 340489 341687
60681 341687 343185 344896 346929 349526 352759 356525 360765 365469 370472 375446 380124 384411 388334 391998
60667 391998 395510 398802 401647 403995 406133 408145 409307 408554 405844 402609 400469 399655 399193 398504 398174
60652 398174 398968 400619 402103 402820 402999 403098 403310 403725 404538 405835 407389 408753 409385 408709 406436 402941 399032
60635 399032 395177 391235 387051 382936 379314 376158 373122 370086 367384 365528 364785 364837 364899 364528 364245 364797
60619 364797 365725 365530 363668 361562 360834 361204 361129 360073 358988 358680 358943 359546 360874 363019 365080 366070 366039
60602 366039 365742 365606 365549 365457 365359 365323 365534 366240 367344 368390 369281 370647 373081 376283 379445 382138 384325
60585 384325 385718 385861 384892 383612 382567 381436 379588 376969 374252 372277 371583 372310 374238 376829 379513
60570 379513 382222 385701 390994 398421 407202 416343 425837 436613 449265 463145 476752 488659 497917
60557 497917 504017 506911 506937 504411 499374 491992 483128 474206 466511 460742 457135 455731 456383 458650 461823
60542 461823 465223 468625 472448 477442 484186 492928 503744 516479 530455 544541 557753 569632 579953
60529 579953 588311 594206 597338 597679 595456 591280 586077 580636 575312 570240 565629 561593 557894 554161
60515 554161 550333 546735 543822 541949 541200 541247 541541 541804 542231 543101 544517 546720 550304 555820 563417 573220
60499 573220 585822 601970 621979 645910 674121 707071 744650 786182 830975 878218 926218
60488 926218 972471 1014777 1051716 1081661 1101943 1109828 1104375 1086866 1059471 1023915 981551 934234
60476 934234 884558 835126 787721 743202 701989 664429 630719 600829 574669 552204 533203
60465 533203 517051 503049 490873 480452 471476 463337 455595 448231 441344 434909 428972 423806 419618
60452 419618 416185 412997 409660 406058 402237 398299 394370 390576 387091 384241 382384 381517 381183 380955 380928
60437 380928 381426 382288 382792 382406 381364 380279 379394 378470 377336 376210 375412 374942 374438 373486 371986 370387 369571
60420 369571 370229 372206 374603 376688 378474 380259 381926 383050 383538 383665 383531 382949 382076 381631 382280 384031
60404 384031 386448 389094 391529 393252 394105 394543 395119 395781 396137 396259 396715 397706 398723 399337 399968 401443 403958
60387 403958 406856 409452 411696 413879 415966 417595 418679 419701 421240 423391 425784 428059 430112 432053
60373 432053 434123 436554 439212 441530 443178 444713 447018 450027 452541 453590 453527 453413 453710 454058 454091 453963
60357 453963 454139 455053 456941 459693 462886 466199 469725 473767 478527 484179 490931 498602 506433 513786 520758
60342 520758 527508 533222 536512 536921 535267 532297 527775 521352 513706 506106 499135 492474 485878 479778
60328 479778 474756 470777 467237 463640 460086 457054 454794 452995 451090 448750 446005 443042 440166 437927
60314 437927 436905 437193 438294 439715 441521 444217 448175 453375 459703 467412 477223 489869 505516 523769
60300 523769 544258 566833 590729 613802 633234 647170 655289 657730 654125 644114 628440 609046
60288 609046 588203 567811 549262 533401 520475 510325 502678 497117 492960 489470 486234 483165 480145
60275 480145 476884 473108 468755 464022 459352 455269 452046 449495 447247 445133 443155 441196 439082 436872
60261 436872 434784 432779 430540 427986 425495 423500 422106 421280 421071 421327 421485 421157 420817 421376 423003 424865
60245 424865 426236 427378 428961 431021 433015 434668 436128 437386 438202 438768 439778 441422 442750 442558 440805
60230 440805 438735 437618 437719 438529 439720 441599 444621 448553 452363 455165 457188 459459 462505 465796 468733
60215 468733 471743 475947 481891 488954 495953 502133 507704 513673 521024 529810 539160 548276 557131 565952
60201 565952 574476 582210 589176 595861 602549 609164 615574 621582 626794 631034 634674 637955 640206 640574
60187 640574 639414 637995 636689 634509 630810 626472 622704 619351 615212 609625 603022 596208 589719 583762
60173 583762 578260 573010 568098 563913 560495 557262 553786 550464 547857 545731 543402 540848 538743 537455
60159 537455 536636 535861 535116 534579 534376 534653 535441 536414 537173 537807 538701 539798 540624 541147 542011 543635 545618 547445
60141 547445 549319 551822 555061 558659 562443 566623 571342 576431 581655 586904 592109 597200 602141 606801
60127 606801 610883 614269 617320 620419 623252 625057 625748 626239 627333 628848 630351 632280 635460 639674 643657
60112 643657 646708 649451 652600 655708 657800 658719 659117 659434 659593 659510 659134 658057 655794 652527 648940 645313
60096 645313 641356 637000 632582 628126 623241 618138 613953 611494 610212 609085 608043 607802 608494 609347 609772
60081 609772 610194 611469 613757 616204 617676 617785 617115 616378 615404 613301 609536 604413 598378 591491 583937
60066 583937 576446 569591 563019 555971 548419 541069 534423 528430 522979 518176 514051 510446 507210 504181
60052 504181 501096 497921 495223 493690 493354 493760 494848 497067 500551 504794 509319 514117 519215 524383 529639
60037 529639 535543 542478 549937 556968 563127 568542 573168 576459 577854 577301 575236 572281 569001 565677
60023 565677 562082 557520 551315 543399 534450 525409 516806 508548 500311 492087 484342 477745 472721 469108
60009 469108 466163 463029 459402 455669 452354 449517 446798 443880 440758 437690 435050 433163 432085 431573
59995 431573 431401 431627 432468 434001 436082 438459 440900 443436 446557 450848 456170 461456 465665 468782 471559
59980 471559 474465 477249 479433 480821 481487 481514 480826 479175 476392 472713 468635 464362 459761 455095 451269
59965 451269 448858 447308 445696 444006 442943 442747 442985 443467 444544 446373 448618 450987 453368 455278 455963
59950 455963 455424 454691 454651 455161 455734 456586 458433 461593 465734 470227 474412 477769 480218 482021 483138 483070
59934 483070 481681 479733 478057 476488 474172 470844 467315 464725 463669 463976 464962 465879 466422 466860 467599 468754
59918 468754 470300 472383 475220 478842 483188 488232 493753 499228 504304 509124 513822 517926 520799 522500
59904 522500 523638 524392 524258 522926 520817 518525 516237 514017 512249 511324 511124 511295 511912 513476 516196 519674
59888 519674 523415 527338 531588 536137 540872 545942 551605 557685 563525 568663 573281 577805 582236 586245
59874 586245 589736 592964 596049 598682 600361 600662 599157 595418 589356 581525 572923 564518 556917 550333
59860 550333 544696 539827 535551 531733 528390 525899 524898 525714 527943 530887 534359 538745 544348 551091
59846 551091 558936 568154 578859 590450 601615 610709 616280 617801 616285 613856 612367 612460 613879 616202
59832 616202 618859 620814 620813 618040 612521 605114 597285 590524 585472 581638 578104 574358 570251 565530 559884
59817 559884 553336 546215 538893 531918 526184 522343 520035 518200 516273 514611 513614 512963 512099 510990 509911
59802 509911 508665 506674 503923 501294 499588 498489 496866 494047 490473 487073 484378 482413 481167 480714
59788 480714 480872 481005 480331 478440 475615 472747 470744 469846 469503 469061 468350 467507 466525 465404 464481 464103 464020
59771 464020 463561 462467 461124 460025 459519 460083 462136 465370 468766 471584 473870 475867 477507 478820 480283
59756 480283 482312 484861 487891 491744 496528 501599 506264 510685 515522 521017 527031 533603 540679 547420
59742 547420 552625 555998 558398 560715 563017 564911 566217 567042 567570 568012 568549 569197 569884 570654 571547 572355
59726 572355 572804 572999 573412 574342 575584 576583 576799 576125 575211 575113 576192 577480 577619 576314 574405 572637 571028
59709 571028 569555 568758 569246 570958 573219 575307 576797 577669 578353 579472 581244 583221 584825 586051 587502
59694 587502 589740 592728 595954 599050 602129 605338 608147 609555 609168 607692 606039 604363 602495 600971
59680 600971 600795 602118 603788 604427 603519 601359 598460 595236 591821 587919 583110 577466 571558 565773 560027
59665 560027 554312 549032 544517 540583 536935 533744 531490 530438 530519 531486 532929 534399 535879 537985 541307
59650 541307 545636 550092 554022 557453 560701 563777 566300 567872 568419 568145 567178 565346 562470 558810 554987
59635 554987 551389 547897 544303 540772 537635 534899 532269 529634 527254 525390 523934 522526 520907 518965
59621 518965 516489 513201 509244 505431 502586 500552 498177 494503 489775 485110 481460 479101 477875 477511
59607 477511 477792 478729 480540 483238 486365 489373 492064 494310 495575 495234 493350 490686 487945 485391 483169
59592 483169 481461 480244 479361 478926 479158 479744 479911 479378 478702 478370 478051 477203 475987 474998 474280 473193 471313
59575 471313 469019 467055 465769 464934 464150 463258 462329 461358 460185 458806 457627 457094 457050 456694 455350 453259
59559 453259 451618 451765 454049 457265 459431 459516 458310 457332 457162 457326 457561 458355 460098 462443 464884 467493
59543 467493 470700 474726 479543 485120 491547 499256 509244 522521 539076 557872 578063 599319 620271
59530 620271 637346 646469 646234 638944 628588 618338 609789 603536 599705 598093 598349 600150 603152 606883
59516 606883 610795 614463 617612 619910 620688 619003 614193 606496 596997 586922 576999 567386 557881 548179
59502 548179 538216 528469 519716 512354 506157 500828 496547 493645 491883 490335 488063 484919 481730 479664
59488 479664 479235 479921 480840 481678 482678 483931 485194 486477 488230 490746 493841 497391 501714 507024 512925
59473 512925 518872 524894 531422 538526 545654 552034 557063 560500 562546 563678 564255 564436 564491 564888 565902
59458 565902 567511 569836 573307 578146 584132 591124 599364 608872 618978 628990 638965 649330 660039
59445 660039 670652 680948 690814 699562 705914 708659 707101 701180 691629 679828 666977 653554 639944
59432 639944 627160 616251 607252 599450 592585 587013 582791 579492 577078 576190 577280 580160 584706 591404
59418 591404 600820 613000 627670 644580 663322 683365 704623 727536 752203 777951 804045 829949
59406 829949 853828 871266 877051 869087 850238 826104 801506 779333 761673 750505 746832 749763
59394 749763 756780 764373 768178 763639 748210 723465 694382 665964 640622 618569 599728 584442
59382 584442 572763 563922 556771 550480 544922 540669 538506 538572 540053 541963 544127 547053 550952 555263
59368 555263 559138 562166 564674 567543 571602 576924 582786 588482 593939 599375 604881 610789 617980 626981
59354 626981 636895 646146 654479 663518 674953 688750 703482 718045 732592 748028 765026 783495
59342 783495 802739 821974 840694 858588 875264 890213 902924 912886 919608 922833 922623 919015 911890
59329 911890 901414 888357 873578 857449 840170 822323 804517 786683 768398 749843 731858
59318 731858 715165 700193 687514 677507 669432 661734 653656 645915 639506 634567 630782 628102 626489
59305 626489 625612 625504 627072 631212 637748 645902 655531 667179 681022 696376 712006 726177 736354
59292 736354 739793 735062 722975 705962 686832 668013 651214 637105 625277 614879 605486 597375
59280 597375 591059 586768 584475 584212 586057 589750 594623 600185 606697 614873 625077 637051 650327 664527
59266 664527 679236 694037 708820 723626 737885 750185 759189 764630 767057 766718 763161 755960 745525
59253 745525 732975 719389 705347 691133 677175 664118 652473 642358 633697 626532 620967 616936
59241 616936 614284 613127 613842 616609 621108 626691 632649 638327 643268 647490 651448 655555 659808 663919
59227 663919 667650 670817 673081 673944 673086 670599 666804 661793 655299 647214 638176 629346 621510 614647 608504
59212 608504 603229 599167 596378 594766 594451 595411 596839 597352 596033 593027 589173 585406 582381 580227 578554
59197 578554 576974 575573 574558 573690 572584 571477 570997 571137 571086 570330 569391 569208 570262 572464 575370 578226
59181 578226 580270 581400 582275 583541 585309 587502 590179 593232 596298 599403 603233 608251 613943 619503
59167 619503 625011 631360 639165 648259 658233 668954 680399 692231 703717 713991 722425 728778 732989
59154 732989 734902 734405 731785 727550 721803 714139 704378 693087 681274 669800 659188 649557 640444
59141 640444 631110 621365 611891 603468 596105 589151 582012 574550 567125 560485 555330 551627 548574 545466
59127 545466 542380 539853 538249 537680 538148 539408 541005 542822 545321 548997 553915 560073 567738 576942 587036
59112 587036 597302 607727 618583 629522 639744 648941 657433 665353 672342 678188 683227 687881 692147
59099 692147 695716 698324 699879 700472 700432 700206 700018 699670 698627 696368 692863 688874 685602 683736 682925 682292
59083 682292 681280 679732 677408 673860 668904 662938 656653 650470 644263 637589 630217 622397 614539 606772
59069 606772 599083 591784 585402 580047 575300 570861 566878 563503 560563 557937 555794 554144 552540 550502
59055 550502 547890 544649 540746 536704 533619 532108 531581 531064 530351 529847 529761 530066 530827 531848 532311 531562 530108
59038 530108 529044 528615 528098 527044 525852 525018 524600 524623 525276 526359 527147 527313 527639 529332 532818 537592 543204
59021 543204 550022 558814 569630 581354 592575 602852 612780 622777 632205 639922 645317 648493 649763
59008 649763 649444 648003 646033 644076 642558 641682 641274 641165 641858 644315 648814 654571 660882 667956 676041
58993 676041 684403 691998 698731 705147 711251 716543 720939 724658 727312 728133 727139 725112 722381 718577 713858
58978 713858 709426 706390 704860 704553 705651 708520 713087 718970 726026 734449 744526 756427 769956 784477
58964 784477 799302 814188 829154 843972 858275 871962 884942 896584 906119 913473 918956 922072
58952 922072 921491 916494 907716 896159 882144 865650 847137 827611 808174 789691 772368 755535
58940 755535 738449 721648 706932 695659 687512 681257 676096 671828 668234 665003 661999 659157 656344
58927 656344 653757 652126 651986 652845 653531 653343 652567 651891 651608 651442 651054 650586 650566 651136 651597 651121 649853 648816
58909 648816 648753 649564 651052 653599 657748 663463 670220 677656 685912 695510 706987 720407 735124 750296
58895 750296 765680 781589 797998 814186 829510 844176 859009 874783 892023 911112 932232
58884 932232 955294 979992 1005667 1031058 1054584 1075114 1092214 1105604 1114808 1119558 1120149 1117023
58872 1117023 1110241 1099615 1085178 1067397 1047200 1025979 1005204 985708 967452 950136 933804
58861 933804 918716 904920 892213 880351 869048 857892 846448 834475 822066 809624 797607
58850 797607 786152 775037 764170 753838 744180 734738 725031 715337 706298 697891 689477 680849 672508
58837 672508 664820 657581 650593 644012 637886 631967 626253 621117 616650 612479 608539 605384 603301 601688
58823 601688 599887 598241 597812 599304 602618 607195 612387 617652 622758 627794 632920 638253 643899 649739
58809 649739 655225 659894 664084 668497 672939 676174 677342 676857 675601 673862 671523 668705 665537 661641
58795 661641 656500 650182 643264 636169 628940 621585 614361 607701 601969 597138 592776 588663 585375 583854
58781 583854 584328 586103 588455 591211 594414 598056 602324 607464 613048 617911 621068 622243 621345 618165 612921
58766 612921 606497 599675 592599 585295 578164 571599 565653 560462 556392 553344 550466 547141 543795 541282
58752 541282 539904 539509 540090 541711 544169 547242 550971 555320 559857 564185 568386 572774 577526 582830 588958
58737 588958 595839 602962 609939 616726 623098 628537 633036 637415 642368 647720 653050 658502 664374 670348
58723 670348 675725 680189 683908 687145 690089 692868 695500 698114 701265 705569 711025 717232 724275 732549
58709 732549 741609 750157 757406 763499 768253 770617 770019 767196 762951 756961 748580 737934 725356 710517
58695 710517 693126 673982 654491 635606 617821 601584 587004 573763 561976 552441 545327 539380
58683 539380 533258 526983 521282 516261 511652 507646 504431 501482 498257 495152 492835 491126 489403 487677
58669 487677 486553 486658 488720 493435 500490 508566 517054 526822 538392 550468 561432 571138 579757 585944
58655 585944 587995 586250 582653 578418 573689 568943 564856 560945 556058 550241 544742 540273 536550 533281
58641 533281 530236 526671 522257 518326 516580 516735 517058 517061 517905 520149 523009 526061 529918 534700 539402 543266
58625 543266 546399 548684 549541 549219 548911 549082 549022 548501 548530 549919 552378 555635 560218 566428 573617 581142
58609 581142 589160 597882 606822 615185 622214 627002 628989 628941 628441 628205 627805 627027 626106 624515 621067 615779
58593 615779 610242 605607 601532 597747 595177 594605 595441 596890 599333 603526 609271 615875 623307 632030 642131
58578 642131 653262 664937 676380 686688 695641 703841 711692 718867 725111 730826 736545 742604 749729
58565 749729 759104 771407 786467 804229 825178 849325 875604 902829 930580 958673 986350 1012447
58553 1012447 1035749 1054913 1068782 1077149 1080687 1079985 1075375 1067802 1058939 1050138 1042006 1035055 1029726
58540 1029726 1025451 1020566 1013514 1003382 989390 971070 949237 925618 901208 876069 850956 827786
58528 827786 807908 791082 776714 764902 755704 748536 743055 739617 738203 737853 737791 738150 738961 739446 738971
58513 738971 737771 736103 733608 730167 726465 723084 719824 716458 713247 710217 706874 703175 699851 697276
58499 697276 694946 692565 690601 689260 687960 686368 684950 684030 683420 683326 684351 686112 687284 687715 689086
58484 689086 692675 697841 703631 710494 719284 729755 741238 753787 767594 782225 797458 813956
58472 813956 831937 849857 865315 876683 883329 885230 883129 878145 870617 860318 848258 836918
58460 836918 827931 820869 815156 811652 811246 813262 816641 821641 829129 839134 851149 864823 879217
58447 879217 892322 902400 909005 911930 910380 904205 894719 883249 870046 855603 841718 829947
58435 829947 820206 812079 806217 803197 802224 802383 803968 807245 811211 815116 820043 827312 836381 845918 855938
58420 855938 867193 879261 890763 900750 908571 913280 914598 913555 910881 905768 897590 887678 877861
58407 877861 868443 859148 850804 844165 838138 831191 823768 817487 812721 808827 805936 804567 804039 803218 802442
58392 802442 803002 805138 808085 811596 815782 819926 823034 825247 827381 829550 831418 833089 834551 835070 834412
58377 834412 833722 833907 834253 834085 834622 837472 842347 847937 854085 861403 869789 879014 889699 901952 914201
58362 914201 925217 936205 948997 963339 977899 992697 1008352 1024083 1038735 1052765 1066934
58351 1066934 1079937 1089602 1095609 1098932 1099704 1097965 1095503 1094435 1094750 1095513 1097485 1102092 1108736 1115696
58337 1115696 1122936 1131593 1141651 1152626 1165524 1181394 1198861 1215880 1233053 1252282 1272947 1292430
58325 1292430 1309785 1325855 1340282 1351590 1359978 1367107 1373282 1377518 1380099 1382408 1384660 1386404 1388745
58312 1388745 1393301 1399598 1406244 1413950 1424434 1437063 1449759 1462588 1477221 1493372 1509094 1524233
58300 1524233 1540317 1557404 1574222 1591004 1608917 1627162 1644029 1660421 1678894 1699596 1720568
58289 1720568 1741649 1764539 1789377 1814857 1841378 1870482 1901463 1932146 1962680 1994963 2028854
58278 2028854 2062738 2097298 2134758 2174840 2215470 2256898 2300944 2346658 2391117 2434107 2477737
58267 2477737 2521949 2565014 2607971 2653772 2702408 2751749 2802779 2858880 2920191 2983854 3049623
58256 3049623 3119875 3194209 3269466 3345010 3422492 3500713 3576656 3651607 3730260 3813636 3898977
58245 3898977 3986649 4080764 4182774 4290836 4405737 4530789 4665610 4806745 4954617 5113021
58235 5113021 5281847 5457787 5642185 5840273 6052502 6274994 6508840 6760228 7030936
58226 7030936 7317828 7622543 7952250 8309926 8693488 9105409 9553232 10039954 10564526
58217 10564526 11132647 11755858 12439478 13183611 13996799 14895707 15890888 16987566 18201955
58208 18201955 19561734 21089442 22802674 24733305 26929931 29441236 32318824 35641416
58200 35641416 39518774 44075666 49463887 55900195 63670598 73096303 84522638 98333746
58192 98333746 114930706 134690504 157990188 185239718 216735237 252323742 291117564
58185 291117564 331359965 370256445 403812850 427281765 436651320 430469473 410538887
58178 410538887 380844295 345670028 308370251 271253536 235949951 203606651 174879132
58171 174879132 149964653 128731517 110846028 95868369 83342201 72855735 64050263
58164 64050263 56612601 50285551 44873008 40219280 36191150 32683269 29620754 26941489
58156 26941489 24583832 22496175 20643781 18996977 17522846 16194429 14996556 13915724
58148 13915724 12934081 12038735 11226574 10493809 9829598 9224705 8676972 8183151 7734139
58139 7734139 7323062 6949497 6610819 6297410 6001121 5720990 5456562 5203434 4959878
58130 4959878 4730429 4518207 4320114 4133429 3960238 3801245 3651903 3508963 3374698
58121 3374698 3250607 3132961 3018717 2910082 2809209 2713774 2621695 2534877 2454431 2377274
58111 2377274 2301292 2229092 2162902 2100298 2038476 1978328 1920985 1864752 1808728 1755075 1704473
58100 1704473 1653606 1600369 1547504 1498151 1452179 1409879 1374608 1347948 1326153 1304977 1284484
58089 1284484 1265950 1247889 1228733 1209949 1192956 1176042 1157536 1138970 1121999 1105276 1087358
58078 1087358 1069564 1052905 1035358 1015364 995129 977196 960489 942905 925167 908904 893337
58067 893337 877041 860853 846127 832174 818074 804931 793803 783571 773255 764133 757069 750077
58055 750077 741105 730975 721082 710516 698182 685559 674547 664558 654378 644936 637567 631372 624950
58042 624950 618983 614556 610625 605670 600228 595311 589983 582985 575247 568428 562345 556068 549922 544179
58028 544179 537368 528286 518236 509047 500352 491048 481870 474115 467185 459763 452242 445794 440210 434761
58014 434761 429934 426295 422917 418983 415604 413873 412525 409742 406051 403143 401007 398612 396415 395837
58000 395837 396848 398136 399100 399924 400477 400730 401391 402560 402805 401083 398392 395926 392943 388298 382785 377955
57984 377955 373764 369362 365095 361714 358579 354662 350473 347177 344694 342489 341187 341434 342066 341352 339355
57969 339355 337307 335532 333722 332285 331581 330728 329067 327922 329052 332063 335178 337704 339981 341728 342384
57954 342384 342377 342344 341798 340193 338382 337274 336060 333662 330964 329625 329558 329642 330094 331969 334981 338029 341403
57937 341403 346375 353013 360385 368544 378359 389701 401563 413566 425532 436145 443970 449430 453870
57924 453870 457106 457820 455930 452597 448213 442458 436034 430237 424819 418262 410209 401787 393522 384875
57910 384875 375997 368101 361743 356302 351405 347422 344367 341700 339341 337573 335859 333079 329091 324872
57896 324872 321099 317694 314674 312285 310343 308502 307088 306695 307271 308544 310876 314567 318847 322768 326480
57881 326480 330419 333912 336027 337161 338211 338752 337699 335265 332575 329767 326271 322597 319971 318348
57867 318348 316539 314264 312362 311038 309579 307782 306075 304273 301875 299618 299054 300413 302381 304135
57853 304135 306113 308659 311385 314094 316956 319610 321321 322155 322763 323023 322169 320277 318391 317104 316135
57838 316135 315186 314045 312007 308420 303760 299127 294995 291452 289038 288003 287347 286138 285175 285727 287280
57823 287280 288375 289045 290356 292031 292887 293434 295558 299446 303188 305825 308568 312352 316258 319045 320355
57808 320355 319715 316166 309801 302198 294608 287095 279950 274372 271010 269117 267789 266808 265923 264592 262946
57793 262946 261726 260988 260129 259357 259608 260759 261534 261524 261676 262430 263035 263238 263965 265748 268004 270447 273626
57776 273626 277493 281041 284032 287511 291949 296447 300387 304246 307991 310348 310608 309622 308131 305646 301955
57761 301955 298207 295304 292577 289144 285357 281807 278178 274285 271149 269797 269867 270449 271469 273280 275711
57746 275711 278452 281673 285441 289211 292461 295092 296762 296806 295315 293230 290965 288084 284758 282106 280408
57731 280408 278452 275444 272233 269776 267779 265844 264550 264279 264298 264124 264532 265980 267247 266992 265589 264066
57715 264066 262274 259565 256374 253639 251325 248887 246557 244791 243025 240277 236576 232644 228638 224375
57701 224375 220348 217308 215107 212964 210620 208391 206472 205033 204559 205231 206347 207066 207295 207140 206153 204050
57685 204050 201633 200088 199726 200159 201212 202892 205021 207749 212021 218772 228123 240029 255167 274460
57671 274460 298323 327215 362369 405041 455426 512917 576700 644853 712743 772831 816156
57660 816156 834661 824127 786613 729920 663753 596060 532242 475782 428100 388559 355901
57649 355901 329470 308586 291761 277639 266006 256898 249451 242745 237070 233196 230889 229257 228010
57636 228010 227279 226614 225324 223519 221852 220585 219788 219881 220987 222189 222559 222494 222955 223775 223916 223116 222088
57619 222088 221194 219983 218091 215667 212985 210384 208457 207527 207068 206325 205252 204205 203105 201723 200441
57604 200441 199828 199675 199206 198032 196251 193964 191442 189394 188279 187641 186718 185323 183469 180747 176924
57589 176924 172622 168553 164553 160219 155913 152191 148776 145185 141817 139371 137630 135971 134630 134239
57575 134239 134458 134311 133598 132772 131658 129578 126687 123968 121851 119895 117796 115713 113670 111635 110096
57560 110096 109511 109314 108558 107464 107183 107978 108813 108898 108655 108927 110122 112267 115072 117791 119765 121115 122235
57543 122235 122814 122252 120851 119542 118566 117468 116428 116432 117977 120518 123311 125825 127307 127044 125393 123617
57527 123617 122453 121612 120779 120154 119789 119311 118636 118188 118226 118698 119836 121994 124677 126723 127776 128772 130586
57510 130586 132891 134734 135614 135662 135379 135429 136151 137103 137617 137824 138368 139044 138607 136268 132622 128739 125006
57493 125006 121315 117783 114717 112189 110046 108184 106622 105417 104496 103466 101855 99890 98682 99040 100329
57478 100329 101116 100783 99886 99145 98797 98773 98729 97969 96123 93839 92093 90911 89552 87787 86078 84545 82795
57461 82795 80925 79763 79776 80429 80846 80526 79329 77444 75492 74092 73324 73119 73867 75781 77882 78695 77999
57444 77999 76923 76287 75914 75636 75752 76117 75893 74821 73857 73962 74932 75880 76336 76426 76498 76908 77726 78513 78844
57425 78844 79080 79918 81165 81761 81192 80027 78818 77326 75246 72954 71095 69965 69578 69769 70088 70153 70310
57408 70310 71266 72925 74328 74925 75119 75331 75316 74820 74162 73717 73383 72924 72394 71986 71892 72394 73560 74851
57390 74851 75695 76438 77984 80506 83327 86054 88821 91382 93210 94777 97491 101749 106081 108880 110058
57375 110058 110372 110070 109027 107480 105756 103763 101406 99052 96963 94779 92107 89209 86575 84274 82192
57360 82192 80483 79313 78619 78475 79192 80621 81915 82552 83116 84556 87042 89991 92849 95380 97454 98919
57344 98919 99544 99010 97366 95472 94328 93811 92781 90688 88335 86689 85710 84832 83953 83319 82939 82668 82491
57327 82491 82279 81650 80486 79283 78668 78789 79291 79478 78549 76350 74017 73113 73857 74920 75194 74949 74918 75135
57309 75135 75233 75184 75164 75222 75508 76264 77246 77780 77715 77627 77762 77630 77094 76907 77539 78322 78532 78566 79210 80344 81297
57288 81297 82016 83036 84582 86424 88441 90631 92768 94508 95752 96603 97181 97700 98311 98783 98857 99035 100202
57271 100202 102148 103354 102767 101070 99653 99134 99469 100666 102519 104264 105346 106086 106932 107590 107589 107142 106651
57254 106651 105858 104356 102563 101371 101115 101638 103041 105623 109220 113280 117442 121509 125094 127861 129987
57239 129987 131931 133927 136086 138661 141742 144895 147541 149482 150882 152066 153579 156035 159620 164109
57225 164109 169441 175662 182264 188442 194314 200988 209015 217693 226358 235369 245155 255324 265477 275999
57211 275999 287049 297643 306786 314849 322855 331125 339689 349414 361447 375921 392324 410729 431464
57198 431464 453684 475432 495242 513008 529439 545354 561271 576848 590831 602247 611558 620107
57186 620107 628772 637776 647383 657955 669565 682274 696542 712681 730164 748084 765999 783792
57174 783792 801134 817762 833876 849627 864659 878798 892579 906320 919273 930607 940671
57163 940671 950395 959962 969190 978775 989987 1003278 1018148 1034217 1051509 1069878 1089068 1109178
57151 1109178 1130364 1152328 1174755 1197802 1221363 1244491 1266552 1288451 1311567 1335925 1360566
57140 1360566 1385303 1410809 1437310 1464569 1493015 1523500 1555955 1589589 1624442 1661446 1700814
57129 1700814 1741625 1783181 1825628 1868987 1912774 1956934 2002015 2048022 2094019 2139329 2184316
57118 2184316 2229689 2275959 2324078 2375889 2433441 2498310 2571851 2655510 2750588 2858037 2978596
57107 2978596 3112805 3261100 3424733 3606966 3813171 4050120 4325926 4650984 5038858
57098 5038858 5506885 6076922 6775693 7633994 8685369 9965018 11507789 13344041 15494811
57089 15494811 17968817 20761709 23856411 27223999 30824537 34606435 38504115 42435179
57081 42435179 46295891 49952319 53232540 55935583 57866676 58885376 58938671 58062798
57073 58062798 56360660 53971890 51047306 47732596 44162476 40461835 36746511 33119484
57065 33119484 29665113 26445623 23500526 20847985 18488311 16409188 14590564 13008011
57057 13008011 11635453 10447420 9419818 8529739 7756324 7082189 6493052 5975827 5518256
57048 5518256 5110496 4745536 4417571 4121130 3852130 3608276 3387557 3187330 3005289
57039 3005289 2840073 2690281 2554091 2430529 2319910 2222241 2136287 2060935 1996342 1942961
57029 1942961 1900645 1869693 1851595 1847432 1856275 1875967 1904049 1935885 1962086 1969795 1948145 1893576
57017 1893576 1811250 1712207 1608245 1507696 1414678 1331139 1258384 1196564 1144243 1099566 1061353
57006 1061353 1028499 999216 971845 945986 922072 900171 879731 860088 840661 820984 800966
56995 800966 780725 760071 738789 717682 698409 681878 667585 655024 644795 637693 633541 631658
56983 631658 631753 633559 636146 638164 638123 633990 623593 606518 585092 562705 541526 522296 505325
56970 505325 490614 477633 466105 456798 450693 447689 446876 447853 451072 457112 466234 478384 493103
56957 493103 509602 527256 545509 562938 576946 584959 585592 578529 564203 544315 521838 499584
56945 499584 478995 460686 445350 433324 424023 416750 411726 409628 410657 414800 422489 434157 449561
56932 449561 468299 490471 515916 542987 568699 589671 602500 604220 593835 573397 546784 517476
56920 517476 487860 459802 434574 412281 392368 374747 359855 347766 337993 330070 323703 318425
56908 318425 313690 309206 304811 300333 296013 292663 290759 289720 288660 287521 286888 287097 288241 290676 294740
56893 294740 300219 306761 314576 324104 335294 347868 362038 378226 396224 415130 433718 450218
56881 450218 462199 467619 466058 458505 446361 431294 415574 401377 389613 380071 372683 368018 366653
56868 366653 368824 374817 385151 400220 420086 444739 474403 509631 550971 597966 648088 697006
56856 697006 740051 773048 792022 793773 778053 748727 711878 672859 635280 601558 573145 550550
56844 550550 534215 525190 524269 531045 544792 565926 595655 634563 682545 739726 806143 880339
56832 880339 958937 1037179 1108736 1165261 1197983 1201174 1174529 1122820 1054007 977113 900100 828340
56820 828340 764687 710589 666736 633042 608932 593906 587576 589410 599055 616739 642872 677367
56808 677367 719665 768899 823189 878819 930545 972444 998333 1002633 982717 940942 883818 818971
56796 818971 752830 690060 633562 584563 543383 510294 485291 467394 455074 447449 444624 447034
56784 447034 455028 468816 488114 511891 538904 568024 597218 622510 638975 643068 633820 612377
56772 612377 581278 544002 504167 464752 428091 396011 369208 346839 327517 310609 296042
56761 296042 283387 272000 261792 252975 245268 238194 231902 226847 222789 218946 214997 211195 207645
56748 207645 204288 201412 199423 198170 197157 196240 195487 194670 193561 192407 191435 190301 188760 187403 186859
56733 186859 186736 186264 185468 184780 184040 183035 182469 183083 184177 184419 183851 183684 184246 184696 184846 185695 187741 189999
56715 189999 191259 191444 191348 191799 193242 195397 197139 197426 196422 195142 194255 193940 194538 196265 198515 200395
56699 200395 201776 202861 203171 202172 200554 199505 198905 197706 195970 194963 195118 195394 194938 194034 193086 191971
56683 191971 190820 190299 190727 191840 193530 195804 197999 199272 199880 200682 201399 200854 199138 197942 198273 199291
56667 199291 199915 200279 200949 201907 202925 203973 204822 205172 205423 206304 207588 208400 208850 209930 211580 212471 212194
56650 212194 212027 212934 214268 215259 216279 217772 219204 219985 220336 220496 220166 219498 219393 220034 220302 219481 218425
56633 218425 218161 218466 218761 219311 220544 222067 223347 224561 225932 227011 227368 227232 226822 225929 224704 223812
56617 223812 223188 221769 219207 216656 214966 213335 210805 208025 206329 205869 205824 205694 205423 204905 204316 204255 204766
56600 204766 204970 204453 204026 204261 204273 203123 201502 200738 200818 200696 200081 199640 199694 199776 199378 198443 197307 196682 197221
56581 197221 198644 199858 200475 201464 203677 206557 208992 210704 211990 212798 212967 212806 212718 212782 213270 214882 217853
56564 217853 221567 225660 230661 236967 244112 251716 260176 269655 279451 289133 299104 309021 316831 320716
56550 320716 321131 319839 317801 315228 312720 310838 309162 307071 304899 303132 301136 298016 294214 290895
56536 290895 288153 285141 281600 278043 274633 271133 267792 265214 263393 261741 259950 258140 256449 255075
56522 255075 254323 253998 253309 251970 250707 250038 249391 248201 246918 245987 244795 242772 240689 239617 239325 238956
56506 238956 238545 238548 238513 237596 235936 234281 232759 231225 230239 230380 231041 231174 230789 230525 230231 229347 228235 227756
56488 227756 227804 227541 226835 226260 225983 225812 226048 227111 228625 229924 231065 232292 233117 233128 233090 233911 235141 235910
56470 235910 236712 238546 240827 242028 242200 242969 244941 246907 247882 248300 248739 248910 248476 247776 247227 246858 246693
56453 246693 246848 247099 247068 246850 246777 246750 246572 246620 247336 248371 249125 249776 250772 251736 251989 251795 251936 252392 252569 252496
56433 252496 252594 252626 252100 251411 251291 251390 250628 248771 246531 244468 242945 242702 244087 246064 247381 248372 250240
56416 250240 252932 255271 256897 258410 259723 259964 259087 258146 257796 257818 258081 258742 259556 260198 261074 262578 263939
56399 263939 264222 264066 264826 266326 267162 267029 266993 267594 268429 269523 271290 273085 273621 272948 272412 272603 272995 273536
56381 273536 274747 276218 276919 277108 278002 279409 279774 278906 278576 279916 282151 284444 286964 289449 290713 290559
56365 290559 290488 291577 293107 294064 294569 295084 295602 296260 297439 298712 299103 298799 299085 300211 301007 301050 301420 302657
56347 302657 303844 304459 305347 306963 308433 309325 310641 312984 315428 317318 319527 322718 325875 327997 329868
56332 329868 332713 336244 339493 342610 346351 350484 354009 356542 358556 360690 363434 366904 370364 372598
56318 372598 373193 372819 372106 371216 370561 370629 370799 369765 367609 366031 366000 366671 367225 368221 370310 373046 375913
56301 375913 379230 383154 387029 390612 394795 400202 406143 411691 416720 421329 425471 429740 435069 441009
56287 441009 445753 448711 451620 456262 462545 469709 477777 486642 495196 502775 510436 519585 530247 541646
56273 541646 553438 565475 577482 589960 604318 621130 639219 657305 675536 694711 715232
56262 715232 737690 763257 792489 824819 860001 898930 942326 989930 1041921 1099865 1165429
56251 1165429 1239353 1322486 1416403 1522029 1638934 1766854 1906487 2057862 2219243 2388587
56241 2388587 2564623 2745474 2927592 3107050 3280462 3443761 3591670 3719600 3824680
56232 3824680 3904023 3953736 3971127 3956583 3912188 3840047 3743196 3626417 3494430 3350339 3196986
56221 3196986 3038293 2877867 2717681 2559554 2406497 2261107 2123895 1994623 1873971
56212 1873971 1762477 1659213 1563137 1474597 1394086 1320703 1253312 1192020 1137133 1087746 1042676
56201 1042676 1001667 964472 930029 897752 868346 842252 818757 797660 780012 765836 752926
56190 752926 739441 726046 714036 703203 693161 684818 678582 672859 666301 659913 655044 651026 646879
56177 646879 643596 642421 642386 641896 641430 642288 643892 644687 644663 644894 645636 646907 649721 654606 660016 664286 668036
56160 668036 672683 677957 683023 688794 696715 706276 715959 725711 736484 748379 761270 776170 794095
56147 794095 814723 837900 864974 896755 932032 970328 1014350 1067199 1128794 1197547 1273682
56136 1273682 1357800 1447598 1539026 1629444 1716723 1796743 1865365 1922384 1970755 2012832 2050061
56125 2050061 2084930 2119458 2151910 2177889 2194525 2201453 2198839 2187491 2170208 2149944 2126684 2098119
56113 2098119 2062394 2017895 1961836 1892368 1811643 1724415 1634626 1545716 1462498 1389131 1325929
56102 1325929 1271062 1224406 1186778 1156679 1131351 1110297 1094538 1083194 1074088 1066948 1062772 1060774
56090 1060774 1059186 1058294 1059435 1061785 1063421 1064778 1067761 1072274 1076922 1082261 1089827 1098776 1106932 1114392
56076 1114392 1122663 1131222 1138552 1145735 1155308 1167271 1179723 1192582 1207085 1222560 1237395 1252190
56064 1252190 1268356 1284821 1299947 1315300 1333401 1353111 1371604 1389494 1409408 1430819 1451146
56053 1451146 1470808 1492101 1514096 1533825 1551720 1570722 1590827 1609796 1628484 1649980 1674101
56042 1674101 1698152 1722459 1749526 1778416 1805901 1832748 1862892 1896704 1931117 1966121 2004805
56031 2004805 2046881 2088349 2127753 2166864 2205311 2240798 2274588 2310460 2348383 2385632 2423756
56020 2423756 2467517 2517050 2568204 2620550 2677708 2739766 2803086 2867802 2937695 3012375 3087629
56009 3087629 3163867 3245873 3333785 3423036 3513816 3611472 3716567 3823965 3933084 4049650
55999 4049650 4175707 4307421 4444382 4591319 4748838 4912441 5082652 5265959 5463754
55990 5463754 5670866 5887033 6118941 6368846 6632601 6911291 7213006 7540621 7890087
55981 7890087 8263374 8670267 9114775 9593394 10109648 10675861 11297516 11971480 12703465
55972 12703465 13511146 14406263 15391233 16478123 17692886 19056491 20582327 22298542
55964 22298542 24252858 26491101 29056149 32017272 35478864 39558302 44389871 50165135
55956 50165135 57142900 65612324 75879322 88290722 103219262 121008998 141985491
55949 141985491 166509227 194873188 226990104 262103849 298672216 334234931 365213490
55942 365213490 387171149 396064367 390008254 370223075 340379455 304968259 267935394
55935 267935394 232147628 199398522 170559601 145800935 124880241 107377672 92801888
55928 92801888 80646585 70461823 61891080 54644082 48469636 43168651 38599843 34648997
55920 34648997 31208074 28190925 25542562 23216660 21160523 19330987 17705064 16262885
55912 16262885 14975756 13819985 12786160 11864866 11037138 10287256 9611120 9003668 8450848
55903 8450848 7941679 7475881 7052068 6660168 6292784 5952703 5641804 5353091 5080714
55894 5080714 4827706 4596730 4382624 4180932 3994770 3826535 3671249 3524472 3388754
55885 3388754 3266107 3151947 3042616 2941397 2851004 2767101 2684889 2605188 2528457 2449728
55875 2449728 2365456 2279331 2195910 2114447 2034065 1958587 1890506 1825878 1760787 1697647 1639802
55864 1639802 1585147 1530553 1477757 1429404 1383666 1338002 1294212 1254868 1218694 1184187 1153940
55853 1153940 1130568 1111783 1093887 1076781 1061426 1045893 1028164 1009618 991765 972750 950896
55842 950896 928519 908416 889655 870429 851858 835282 818979 801310 784163 769640 756203
55831 756203 741658 727111 714411 702509 689937 678192 669079 661104 652030 642588 634292 625935 615655
55818 615655 604370 593936 583941 573318 563040 554318 546217 537791 530377 525076 520272 514485 509298
55805 509298 506613 505311 503554 502121 502510 503900 504980 506730 510466 515096 519078 523036 527710 531481
55791 531481 532781 532851 533230 532685 529574 525143 521409 517823 513176 508768 506288 504205 499497 491509 481118
55776 481118 467944 451753 435159 421462 410879 401901 395059 392155 392899 395508 399599 405341 410664
55763 410664 412558 410690 406950 402054 395349 387362 379783 373226 367281 362134 357880 352941 345542 336145
55749 336145 326417 316675 306527 296897 288963 281987 274596 267336 261609 257030 252380 248311 246507 246778
55735 246778 247416 247793 248286 248326 246999 244970 243481 242125 239802 237041 234843 232108 226966 220161 214364
55720 214364 210467 207185 204000 201813 200677 199530 198327 198244 199588 201574 204123 207838 212260 216233 219954
55705 219954 224642 230163 234901 237927 239445 239242 236674 232150 226824 220879 213881 206574 200482 195877
55691 195877 191896 188356 185662 183309 180548 178219 177844 179090 180253 181099 183003 186294 189689 192579 195766
55676 195766 199597 203306 206566 209872 213056 215101 215749 215686 215009 213208 210808 209261 208890 208593 207890 207660
55660 207660 208541 210031 211540 213019 214373 215473 216750 218492 219758 219438 218229 217934 218996 220297 221154
55645 221154 221765 221807 220598 218721 217611 217319 216406 214150 211004 206827 200715 192955 185196 178205 171339
55630 171339 164648 159581 156827 155254 153721 152397 151535 150547 149128 147907 147186 146293 144875 143522 142403
55615 142403 140638 137794 134880 133021 132121 131426 130470 128973 126813 124626 123400 123022 122194 120280 118225
55600 118225 117163 117039 117046 116564 115314 113427 111641 110709 110472 110331 110417 111189 112064 111829 110501 109363 109088 109198
55582 109198 109477 110306 111369 111708 111556 112430 114814 117272 118619 119486 120970 123125 125692 129014 133193 137415
55566 137415 141105 144771 148832 152465 154514 154843 154025 152430 150301 147995 145487 142239 138088 133700 129766
55551 129766 126418 123696 121751 120304 118821 117479 117032 117411 117547 116959 116404 116479 116693 116547 116436 116799 117360
55534 117360 117952 119177 121448 124165 126569 128770 131208 133665 135438 136092 135670 134585 133474 132644 131629
55519 131629 129954 128146 126995 125951 123639 120035 116612 114017 111220 107536 103945 101464 99593 97489
55505 97489 95526 94543 94456 94668 95055 95571 95624 94845 93837 93253 92706 91438 89538 87724 86477 85985 86356 87182
55487 87182 87530 87078 86664 87061 87805 87972 87556 87370 88005 89435 91240 92743 93396 93425 93619 94253 94878 95365
55469 95365 96176 97253 97652 96852 95459 94060 92374 90310 88764 88444 88680 88406 87628 86998 86524 85681 84409
55452 84409 83219 82581 82769 83845 85352 86567 87445 88640 90196 91183 91146 90958 91443 92075 91935 91098 90187
55435 90187 89254 88074 86902 86090 85497 85061 85254 86168 86910 86807 86434 86488 86440 85495 84222 83925 84784 85859
55417 85859 86632 87397 88282 89001 89568 90354 91431 92565 93730 94949 95839 95967 95458 94677 93641 92341 91236
55400 91236 90703 90382 89779 89113 88875 88956 88967 89042 89438 89748 89400 88720 88629 89389 90357 90849 90686 90106 89606 89603 89832
55379 89832 89595 89025 89313 90970 92688 92910 91856 90874 90434 90041 89670 89827 90291 90195 89451 88934 89010 88960 88178
55360 88178 87063 86362 86310 86687 87203 87625 87955 88503 89362 89958 89657 88692 87899 87660 87709 87879 88331 89047 89650
55341 89650 89852 89689 89393 89355 89952 91060 91989 92360 92670 93512 94702 95725 96571 97379 97733 97165 96044 95128
55323 95128 94454 93499 92228 91129 90381 89776 89350 89282 89305 89005 88608 88676 89136 89348 89099 88780 88673 88775 89255
55304 89255 90303 91447 91754 90810 89096 87470 86680 87098 88358 89517 90095 90567 91306 91673 91031 90057 89881
55287 89881 90324 90291 89691 89645 90693 92051 92870 93167 93217 93041 92857 93111 93718 93989 93637 93131 92818 92346 91279
55268 91279 89729 88219 87386 87764 89228 90676 90975 90258 89625 89637 89924 90203 90698 91458 92123 92633 93349 94290
55250 94290 94951 95047 94706 93930 92617 91242 90607 90796 91205 91634 92382 93135 92942 91693 90570 90513 91073 91236
55232 91236 90553 89125 87435 86625 87881 90788 93188 93477 92345 91510 91507 91604 91268 90705 90239 90084 90563 91767
55214 91767 93070 93598 93181 92385 91739 91385 91354 91698 92309 92949 93492 93940 94279 94495 94625 94665 94550 94344 94283 94562
55194 94562 95185 96035 96880 97388 97419 97307 97495 97871 97830 97032 95810 94798 94475 94948 95812 96324 96097 95522 95069
55175 95069 94513 93440 92289 91967 92516 93044 93043 92866 92721 92233 91344 90784 91119 92061 93185 94610 96468 98302
55157 98302 99610 100481 101184 101602 101563 101302 101101 100808 100169 99284 98386 97548 96936 96927 97566 98311 98669 98713 98680 98580
55137 98580 98546 99050 100284 101708 102645 102945 102750 102131 101390 101139 101529 101843 101487 100908 100887 101279 101289 100752 100316
55118 100316 100373 100557 100458 100247 100359 100915 101655 102225 102440 102395 102374 102573 103003 103690 104650 105548 105727 105029 104330 104789
55098 104789 106554 108552 109612 109568 109157 109092 109467 109995 110598 111412 112246 112467 111762 110760 110427 110983 111884 112747
55080 112747 113672 114574 114891 114253 113027 111957 111576 112091 113335 114618 115096 114590 113760 113281 113223 113358 113566 113692
55062 113692 113458 112897 112484 112506 112665 112651 112777 113613 115195 116945 118259 118940 119166 119246 119305 119135 118483 117482 116542
55043 116542 115824 115129 114292 113352 112369 111498 111189 111763 112752 113237 112960 112503 112248 111822 110865 109717 108978 108828
55025 108828 109136 109777 110533 111060 111267 111373 111436 111238 110760 110292 109921 109457 108985 108915 109258 109527 109583 109893 110602 111096
55005 111096 110917 110441 110162 109937 109526 109318 109828 110877 111782 112106 111844 111241 110774 110855 111254 111299 110899 110768 111292
54986 111292 111899 112000 111838 111870 112011 112080 112326 112832 113068 112756 112550 113073 113877 114237 114399 115057 115976 116224 115596
54967 115596 114874 114742 115235 116181 117426 118677 119769 121020 122692 124256 124889 124648 124449 124880 125631 126134 126195
54950 126195 125860 125066 123642 121553 119201 117404 116697 116580 116010 114865 114176 114565 115260 115275 114845 114868 115543 116420
54932 116420 117301 118199 118878 119306 120150 121852 123582 124167 123898 124387 126764 130809 135706 140731 145344 149593
54916 149593 154419 160758 168341 176032 183092 189355 194503 198185 200622 201985 201393 197701 191292 183926
54902 183926 176719 169517 162367 156229 151665 147988 144356 140839 137835 135284 133089 131566 130798 130119 128903
54887 128903 127462 126613 126710 127535 128805 130325 131950 133769 136168 139402 143219 147052 150514 153756 157530
54872 157530 162685 169206 175994 181985 187236 192267 196629 198966 198495 195646 191288 186108 180720 175474
54858 175474 169993 163784 157401 152086 148123 144568 140941 138049 136568 135784 134514 132511 130292 128193
54844 128193 126389 125206 124647 124002 122664 121011 119848 119328 119078 119057 119542 120459 121394 122198 122992 123598 123540 122714
54826 122714 121646 120925 120637 120454 120072 119461 118803 118255 117825 117480 117263 117125 116829 116272 115833 115998 116663 117153
54808 117153 117037 116631 116634 117479 119029 120635 121599 121901 122318 123442 124782 125357 124965 124166 123200 121791 120101
54791 120101 118944 118710 118852 118816 118833 119358 120342 121452 122504 123264 123373 122937 122758 123511 125016 126649 128072
54774 128072 129240 130107 130753 131541 132845 134860 137764 141606 145965 150253 154572 159594 165385 171096 176228
54759 176228 181415 187314 193443 198890 203566 207822 211113 212027 209682 204501 197651 190283 183246 176891
54745 176891 170995 165271 159946 155556 152223 149487 146827 144043 141209 138604 136644 135582 135258 135315 135609
54730 135609 136253 137358 138885 140671 142460 144016 145327 146613 148110 150027 152675 156345 161022 166467
54716 166467 172549 179073 185321 190298 193557 195331 195778 194748 192472 189726 186886 183411 178750 173276
54702 173276 167831 162802 158225 154343 151399 149135 147111 145349 144091 143088 141704 139749 137758 136392
54688 136392 135832 135749 135649 135255 134676 134135 133578 132826 132033 131533 131149 130247 128754 127465 126976 126905 126643 126249 125982
54669 125982 125460 124115 122238 120840 120525 121042 121776 122158 121802 120829 120010 120062 120866 121805 122652 123609 124591 125119
54651 125119 124918 124144 123023 121733 120688 120408 121022 122207 123590 124818 125284 124396 122323 120114 118790 118497
54635 118497 118714 119093 119823 121172 122884 124238 124798 124924 125281 125960 126445 126424 126179 126057 126008 125899 125879 126135 126600
54616 126600 127171 127872 128570 128906 128819 128801 129277 130052 130723 131294 132002 132759 133183 133019 132280 131182 130195 129872 130343
54597 130343 131202 132041 132809 133540 134157 134759 135576 136421 136688 136188 135466 134944 134369 133517 132803 132642 132734 132571 132188
54578 132188 131854 131505 131035 130672 130503 130107 129247 128362 127848 127453 127002 127005 127800 128757 129234 129604 130359 130903 130444
54559 130444 129561 129536 130462 131325 131711 132064 132326 131832 130699 130029 130354 130974 131175 131104 131191 131616 132599 134267 135990
54540 135990 136837 136979 137677 139548 141794 143517 144815 146069 147084 147595 147916 148415 148886 148927 148480 147620 146335
54523 146335 144870 143757 143148 142599 141771 140787 139704 138297 136707 135604 135346 135606 136089 136936 137977 138429
54507 138429 137918 137239 137419 138428 139378 139615 139134 138252 137350 136693 136159 135445 134705 134548 135129 135784 135901 135661
54489 135661 135556 135655 135760 135881 136135 136484 136871 137263 137400 136987 136323 136144 136564 136892 136840 137145 138425 140166 141520
54470 141520 142498 143578 144666 145317 145624 146005 146319 146075 145453 145332 146164 147418 148300 148637 148882 149538 150627
54453 150627 151584 151774 151175 150311 149423 148183 146536 145309 145410 146677 148058 148755 148779 148541 148373 148356 148213 147497
54435 147497 146223 145163 145078 145765 146276 146041 145405 145059 145239 145587 145630 145337 145209 145630 146168 145858 144380 142606
54417 142606 141721 142026 142828 143270 143081 142717 142907 143823 144669 144491 143434 142656 142861 143542 143943 144071 144318 144709
54399 144709 145095 145578 146175 146579 146772 147356 148672 150136 151127 152014 153442 155142 156450 157618 159433 161617
54383 161617 162811 162343 161022 159891 159057 158124 157023 155934 154983 154467 154908 156392 158133 159110 159032 158476 158292
54366 158292 159004 160532 162282 163578 164134 164101 163809 163683 164214 165614 167481 169177 170562 172045 173919 176005
54350 176005 178033 180069 182435 185427 189086 193076 196798 199873 202493 205062 207566 209518 210378 209779 207576
54335 207576 204082 200105 196317 192685 188895 185149 182002 179532 177305 175166 173422 172169 171081 170086
54321 170086 169614 169820 170107 169834 169108 168454 167999 167380 166331 165020 163893 163385 163660 164424 165073 165110 164337 162716
54303 162716 160421 158111 156736 156724 157585 158524 159179 159542 159513 158970 158157 157558 157324 157095 156471 155420 154225 153245
54285 153245 152847 153422 155217 158085 161387 164198 165712 165690 164596 163246 162158 161256 160255 159250 158718 158881
54269 158881 159384 159822 160277 160940 161399 160988 159907 159296 159807 160637 160529 159430 158568 159020 160750 162993 165052
54252 165052 166633 167831 168975 170242 171323 171659 171028 169694 168063 166463 165223 164623 164644 164963 165216 165137
54236 165137 164569 163616 162680 162035 161461 160636 159768 159398 159610 159946 160151 160498 161188 161889 162146 161941 161603 161471 161872
54217 161872 163067 164882 166565 167395 167369 167105 167156 167618 168268 168805 168988 168724 168111 167328 166523 165822 165306 164882
54199 164882 164283 163406 162560 162238 162555 163079 163304 163228 163345 164015 164980 165613 165551 164917 164016 163108 162498 162487 162983 163440
54179 163440 163406 162951 162411 161967 161713 161796 162118 162166 161611 160850 160494 160479 160285 159886 159758 159869 159468 158195 156820
54160 156820 156343 156802 157465 157916 158359 158984 159543 159739 159639 159557 159641 159756 159730 159591 159500 159456 159260 158864 158615 158938
54140 158938 159849 161042 162402 164031 165742 166884 166919 165957 164595 163435 162887 163167 164142 165298 166109 166445
54124 166445 166536 166594 166639 166622 166546 166414 166212 166035 166206 167098 168680 170299 171245 171653 172527 174516 176886 178179 177868
54105 177868 176889 176456 176818 177415 177730 177582 176830 175398 173625 172256 171936 172767 174301 175808 176642 176689 176569
54088 176569 177203 178950 181202 182910 183455 182935 181731 180089 178272 176871 176618 177833 180168 182882 185260
54073 185260 186914 187995 189142 190920 193170 195120 196210 196532 196478 196378 196660 197881 200291 203704 208046
54058 208046 213591 220257 227225 233891 240838 249110 258696 268325 276609 282654 285738 285387 282057 277055
54044 277055 271520 265976 261001 257514 256019 256075 256978 258585 261163 264840 269604 275461 282249 289564 297141
54029 297141 304993 312953 320479 327182 333116 338209 341920 343959 344980 346050 347646 349583 351550 353106
54015 353106 353428 351844 348620 344685 340550 336038 331022 325767 320342 314302 307391 300154 293462 287605
54001 287605 282263 277186 272520 268453 264882 261577 258482 255670 253081 250487 247705 244743 241756 238967
53987 238967 236672 235142 234395 234085 233669 232621 230564 227473 223948 221077 219725 219874 220748 221450 221402 220497
53971 220497 219151 218087 217701 217722 217729 217878 218732 220471 222706 225073 227590 230425 233621 237100 240629 243898
53955 243898 247027 250790 255700 260948 264960 267101 268111 268792 269116 268993 268954 269379 269761 269582 269508 270823 273898
53938 273898 277954 282203 286460 290665 294617 298411 302587 307491 312799 317854 322259 325997 329244 332291
53924 332291 335586 339685 345046 351762 359431 367445 375456 383510 391767 400430 409972 420995 433642 447495
53910 447495 462321 478511 496345 515181 533930 552187 570373 588759 606734 622966 635781
53899 635781 643366 644217 637828 625041 607671 587806 567171 546736 526771 507331 488636 470934
53887 470934 454237 438437 423516 409442 396031 383214 371245 360351 350290 340637 331386 322945
53875 322945 315550 309060 303287 298260 294073 290656 287702 284745 281446 277971 274836 272153 269336 265882
53861 265882 262165 258973 256446 254023 251352 248705 246428 244541 242991 241858 241075 240267 239021 237192 234968
53846 234968 232922 231855 232093 232862 232835 231461 229442 227816 226993 226779 226817 226699 226067 224989 224028 223625 223585 223420
53828 223420 222980 222459 222003 221668 221633 222080 222848 223535 224002 224562 225558 226962 228524 230162 231971 233898 235686
53811 235686 237320 239288 242084 245478 248682 251402 254380 258604 264238 270683 277464 284571 291966 299252
53797 299252 306083 312574 319108 325893 332788 339369 345058 349410 352486 354851 357075 359253 361072 362226
53783 362226 362745 362944 363046 362832 361753 359468 356081 351675 345854 338159 328926 319333 310523 302917 296364
53768 296364 290544 285114 279873 274991 270825 267342 264120 261150 259137 258503 258349 257109 254279 250907 248175
53753 248175 246016 243592 240740 238282 236815 235766 234018 231188 227917 225021 222808 221273 220504 220560 221127
53738 221127 221593 221522 220901 219997 219140 218646 218810 219858 221826 224398 226899 228622 229302 229288 229280 229916 231428 233423
53720 233423 235072 235885 236378 237582 239784 242143 243819 245038 246663 249019 251661 254117 256327 258315 259883
53705 259883 260786 261060 261187 262051 264510 268699 273832 278899 283471 287612 291349 294609 297450 299895 301646
53690 301646 302482 302858 303605 305030 306747 308365 309766 310669 310571 309373 307630 305932 304413 302997 301706 300513
53674 300513 299293 298197 297670 297845 298246 298381 298267 298080 297646 296774 295841 295516 295890 296271 295943 294908 293812
53657 293812 293246 293184 293061 292397 291299 290224 289383 288616 287842 287250 286887 286478 285931 285749 286539 288219 290040 291382
53639 291382 292202 292742 293108 293354 293806 294975 296990 299251 300938 301929 303021 305054 308027 311304 314432 317334
53623 317334 319891 321993 324075 326951 330770 334627 337663 340176 343157 346992 351183 355235 359223 363381
53609 363381 367639 371803 375907 380111 384435 388834 393423 398379 403556 408387 412288 415164 417512 420073
53595 420073 423377 427489 431944 435906 438607 439878 440248 440416 440596 440445 439507 437599 434801 431275 427132
53580 427132 422414 417187 411697 406382 401624 397573 394247 391647 389576 387538 385147 382571 380323 378582
53566 378582 377029 375433 374120 373671 374212 375132 375560 375124 374226 373488 372989 372323 371492 371271 372380 374569 376953
53549 376953 379050 381007 382935 384613 385952 387304 389104 391503 394414 397740 401472 405795 410960 416766
53535 416766 422327 426843 430580 434623 439668 445653 452611 461116 471487 483031 494668 506064 517752
53522 517752 530230 543321 556479 569556 583206 598430 615610 634060 652734 671266 690059
53511 690059 709582 730005 751449 774023 797589 821925 847153 873500 900584 927500 953695
53500 953695 979212 1004000 1027644 1049998 1071462 1092371 1112738 1132793 1153049 1173403 1192924
53489 1192924 1211072 1228468 1245880 1263147 1279917 1296839 1315040 1334595 1354436 1373685 1392354
53478 1392354 1410720 1428723 1446045 1462179 1476313 1487675 1496128 1502070 1505701 1506805 1505271 1501356
53466 1501356 1495271 1486796 1475500 1461297 1444811 1427311 1410060 1393497 1377158 1360526 1343640 1326602
53454 1326602 1308908 1289827 1269259 1247749 1225796 1203668 1181814 1160839 1140941 1121745 1102780
53443 1102780 1083887 1065224 1047287 1030883 1016710 1004853 994942 986750 980283 975317 971218 967383
53431 967383 963681 960483 958461 958267 960104 963629 968463 974653 982384 991437 1001310 1011873 1023587 1037080
53417 1037080 1052667 1070217 1089310 1109700 1131751 1156117 1182786 1210930 1240013 1270516 1303000
53406 1303000 1337032 1371940 1408217 1447072 1488648 1531839 1576077 1622158 1670870 1721720 1773739
53395 1773739 1826809 1881405 1937511 1994571 2052238 2110440 2168763 2226435 2283010 2338645 2393591
53384 2393591 2447712 2500545 2551564 2600294 2646351 2689521 2729637 2766252 2798552 2825795 2847945
53373 2847945 2865689 2879562 2889067 2892994 2890690 2882579 2869138 2849817 2823588 2790345 2751074 2706708
53361 2706708 2657599 2604346 2548360 2491150 2433497 2375810 2318860 2263488 2209819 2157394 2106141
53350 2106141 2056654 2009394 1963990 1919651 1875941 1832815 1790025 1747015 1703588 1660399 1618444
53339 1618444 1578153 1539354 1502068 1466901 1434394 1404423 1376556 1350735 1327147 1305649 1285811
53328 1285811 1267468 1250715 1235229 1220056 1204328 1187969 1171600 1155928 1141310 1127632 1114515
53317 1114515 1101864 1090282 1080715 1073592 1068522 1064909 1062604 1061792 1062464 1064262 1066823 1070164 1074718 1080995
53303 1080995 1089186 1099083 1110444 1123372 1138257 1155415 1174820 1196044 1218457 1241730 1266243 1292674
53291 1292674 1320965 1350044 1378880 1407500 1436456 1465614 1494074 1521131 1546653 1570528 1592370
53280 1592370 1611896 1629008 1643378 1654474 1662237 1667210 1669703 1669228 1665071 1657120 1645852 1631825 1615544
53267 1615544 1597557 1578286 1557744 1535568 1511437 1485444 1458207 1430531 1402825 1374893 1346438
53256 1346438 1317606 1288782 1260063 1231342 1202826 1174941 1147757 1120930 1094200 1067505 1040639
53245 1040639 1013402 986131 959505 933688 908239 883018 858536 835096 812239 789460 767022
53234 767022 745694 726070 708507 693250 680158 668571 657853 647823 638430 629362 620259 610964
53222 610964 601254 590750 579370 567453 555075 541787 527496 513048 499280 485957 472442 459136
53210 459136 447312 437530 428989 420688 412584 405302 399179 393881 388754 383311 377513 371649 365907 360155
53196 360155 354319 348771 343986 339838 335578 330631 325204 320106 316070 313193 310808 307999 304500 301036
53182 301036 298550 297170 296174 294844 293031 290932 288741 286683 285049 283934 283052 282025 280846 279952 279808
53167 279808 280438 281376 282058 282200 281783 280818 279379 277751 276270 274949 273571 272192 271227 270840 270617 270139 269608
53150 269608 269532 269918 270090 269294 267316 264606 261968 260082 259153 259010 259480 260431 261465 262013 261918 261644 261680 262054
53132 262054 262631 263472 264555 265470 265843 265839 265821 265770 265506 265277 265562 266347 267129 267689 268345 269333 270325 270814 270761 270720
53112 270720 271387 273035 275232 277188 278528 279534 280475 280857 279812 277218 274090 271743 270698 270414 269918
53097 269918 268691 267050 265643 264606 263467 261900 260171 258588 257017 255371 254177 254022 254671 255376 255892
53082 255892 256538 257325 257839 258105 258776 260120 261436 261925 261685 261430 261619 262286 263370 264703 265794 266142 265798
53065 265798 265297 265021 264859 264535 264061 263748 263876 264416 265068 265527 265662 265481 265042 264501 264071 263733 263174 262245 261365
53046 261365 261057 261108 260658 259326 257822 257159 257532 258299 258850 259064 258992 258532 257567 256152 254452 252673 251154
53029 251154 250279 250059 249962 249475 248806 248696 249419 250306 250541 250212 250184 251029 252457 253811 254666 254837 254328 253618 253681
53010 253681 255209 257839 260443 262089 262596 262339 261855 261571 261578 261657 261711 262079 263154 264715 265952 266224 265618 264705
52992 264705 263965 263519 263241 262957 262501 261715 260556 259352 258799 259472 261291 263670 266141 268529 270568 271894
52976 271894 272650 273582 275105 276609 277220 277015 277006 278028 280035 282458 284814 286960 289040 291217 293344 295015
52960 295015 296116 297013 297931 298483 298220 297353 296448 295660 294755 293681 292468 290779 288253 285244 282520 280204
52944 280204 277708 274806 272009 269685 267515 265199 263028 261315 259868 258554 257935 258651 260328 261754 262129
52929 262129 261671 260918 259928 258475 256815 255768 255853 256580 256963 256709 256480 256789 257167 256830 255785 254713 253958
52912 253958 253400 253174 253724 254870 255526 254777 252940 251246 250715 251464 252833 253970 254559 255052 256032 257384 258479
52895 258479 259016 259161 258868 257793 256120 254848 254816 255821 257003 257717 257794 257374 256854 256647 256697 256496 255816 255075
52877 255075 254720 254694 254811 255226 256150 257406 258639 259637 260188 260063 259579 259755 261337 263917 266510 268740 270898
52860 270898 273048 274716 275523 275653 275579 275624 275810 275872 275429 274352 272950 271576 270188 268422 265954 262662 258664
52843 258664 254428 250623 247620 245302 243428 241889 240480 238925 237478 237011 237973 239602 240723 241037 241110
52828 241110 241415 242023 242990 244260 245212 245050 243815 242464 241788 241700 241715 241602 241374 241037 240632 240321 240267 240588 241374
52809 241374 242527 243693 244642 245618 246938 248415 249627 250658 251913 253186 253551 252419 250194 247709 245501
52794 245501 243878 243120 243191 243527 243510 242941 241907 240581 239431 239127 239792 240644 240901 240823 241356 242814 244411 245178
52776 245178 245020 244732 245178 246540 248256 249632 250519 251249 251963 252320 252060 251524 251155 250702 249420 247072 244293
52759 244293 241817 239797 238047 236570 235492 234708 234058 233774 234334 235738 237278 238267 238786 239393 240156 240422
52743 240422 239780 239004 239560 242084 245682 248978 251588 254150 257029 259586 261016 261535 262231 263828 266044
52728 266044 268212 270069 271738 273259 274550 275678 276806 277831 278319 277884 276540 274695 272931 271669 270842
52713 270842 269916 268437 266544 264718 263083 261259 259018 256745 255073 254250 254050 254163 254478 255055 255926 256858
52697 256858 257327 256914 255837 254943 255003 256105 257750 259370 260642 261504 262087 262565 262963 263257 263657 264547 265971
52680 265971 267446 268478 269056 269367 269243 268286 266495 264459 262861 262014 261859 262201 262825 263508 264018 264162 263976
52663 263976 263812 264022 264440 264437 263704 262711 262114 261945 261791 261622 261946 263141 265065 267443 270271 273554 276866
52646 276866 279433 280588 280093 278228 275692 273304 271595 270607 270060 269664 269305 269093 269243 269836 270642 271271 271561
52629 271561 271797 272576 274455 277578 281479 285312 288406 290553 291680 291450 289492 285960 281608 277294 273662
52614 273662 271208 270174 270201 270426 270221 269651 269070 268571 268135 268052 268654 269629 270099 269606 268736 268449 268991 269822 270491
52595 270491 271163 272132 273213 273950 274231 274346 274465 274427 274200 274222 275016 276548 278235 279582 280655 281851 283339
52578 283339 284819 285783 285942 285454 284791 284423 284501 284730 284608 283920 283062 282686 282993 283498 283524 282769 281390 279832
52560 279832 278732 278651 279552 280727 281487 281747 281680 281190 280193 279014 277866 276243 273712 271177 270249 271131 272193
52543 272193 272098 271433 271543 272598 273768 274666 275511 276125 275882 274735 273476 272773 272636 272954 273931 275691 277884
52526 277884 279909 281280 281725 281315 280592 280194 280274 280543 280842 281236 281523 281221 280244 279200 278756 279031 279844 281311
52508 281311 283869 287824 293054 299034 305062 310510 314895 317675 318211 316330 312888 309377 306739 304777
52494 304777 302785 300456 297992 295638 293407 291218 289106 287289 286042 285447 285243 285062 284813 284766 285216 286176
52478 286176 287400 288587 289581 290464 291450 292603 293769 294901 296310 298361 300943 303447 305302 306442 307314
52463 307314 308535 310473 312992 315654 318142 320318 321960 322849 323222 323627 323989 323307 320761 316788 312543
52448 312543 308658 305120 301999 299500 297389 295170 292841 290782 288858 286457 283565 281093 279791 279426
52434 279426 279352 279335 279469 279736 280063 280446 280785 280909 280997 281538 282644 283802 284536 284898 285077 285067 284998 285292 286041 286717
52414 286717 287030 287717 289845 293550 297976 302383 306856 311989 318259 325735 334138 343199 353056 364070
52400 364070 375966 387281 395933 400274 399610 394186 385199 374604 364353 355538 348286 342260 337057
52387 337057 332366 328194 324946 323013 322279 322262 322659 323523 324912 326620 328334 329936 331593 333554 335843
52372 335843 338180 340367 342749 346062 350698 356291 362113 367672 372797 377330 380985 383419 384378 383885 382318
52357 382318 380163 377732 375292 373342 372315 371947 371424 370367 369304 368990 369654 371187 373601 376885 380680
52342 380680 384496 388127 391553 394713 397695 400962 405006 409882 415358 421406 428244 436054 444892 454779
52328 454779 465688 477569 490512 504707 520102 536392 553493 571660 590857 610452 629895
52317 629895 649401 669424 689735 709477 728048 745445 761851 777355 792141 806586 821084
52306 821084 835908 851140 866535 881592 895983 909783 923115 935810 947670 958743 969017
52295 969017 978084 985507 991221 995189 996966 996163 993112 988476 982346 974347 964628 954168 944045 934840
52281 934840 926787 919973 914305 909804 906996 906513 908183 911117 914939 920361 928102 937636 947640 957607
52267 957607 968461 981357 996165 1011470 1025987 1039603 1052828 1065661 1077598 1088686 1099832
52256 1099832 1111684 1123835 1135606 1147069 1158639 1170108 1180970 1191521 1202596 1214024 1224190
52245 1224190 1231584 1236186 1238867 1239922 1238752 1234836 1228558 1221052 1213441 1206209 1199227 1192338 1185801 1179990
52231 1179990 1174864 1170094 1165740 1162357 1160284 1159146 1158269 1157334 1156453 1155806 1155454 1155452 1155977 1157315 1159681 1162991
52215 1162991 1166923 1171322 1176435 1182591 1189755 1197649 1206139 1215190 1224495 1233514 1241988 1250162 1258506 1267302
52201 1267302 1276398 1285148 1292778 1299103 1304715 1310202 1315437 1320093 1324520 1329492 1335188 1341157 1347286 1354040
52187 1354040 1361465 1368677 1374674 1379210 1382528 1384715 1385662 1385200 1382873 1377948 1370173 1360280 1349322 1337728
52173 1337728 1325396 1312561 1300066 1288725 1278682 1269547 1261027 1253379 1247231 1242972 1240462 1239420 1239878
52160 1239878 1241858 1244755 1247643 1250253 1253147 1256654 1260173 1262880 1264658 1265829 1266341 1265822 1264347 1262570
52146 1262570 1261026 1259696 1258343 1256939 1255541 1253969 1251886 1249206 1246274 1243496 1240782 1237541 1233410 1228894
52132 1228894 1225114 1222986 1222813 1224545 1228036 1233016 1239214 1246766 1256376 1268910 1284839 1304009 1325795
52119 1325795 1349551 1375094 1402643 1432051 1462305 1492152 1521031 1548888 1575312 1599612 1621800
52108 1621800 1642634 1662313 1679784 1693849 1704475 1712599 1719116 1724518 1729097 1732895 1735741 1737807 1739888
52095 1739888 1742612 1745537 1747493 1747628 1745701 1741598 1735171 1726547 1716114 1704087 1690432 1675241 1659001
52082 1659001 1642552 1626979 1613369 1602369 1594037 1588268 1585119 1584487 1585833 1588704 1593324 1600173 1609179
52069 1609179 1619799 1631778 1645248 1660059 1675617 1691448 1707446 1723402 1738714 1752759 1765225
52058 1765225 1775945 1784818 1792065 1798231 1803601 1807846 1810490 1811570 1811472 1810208 1807162 1801676 1793655 1783417
52044 1783417 1771100 1756489 1739494 1720504 1700060 1678447 1655977 1633410 1611531 1590400 1569655
52033 1569655 1549666 1531646 1516354 1503346 1491915 1482011 1473618 1465928 1458083 1450282 1443172 1436427 1428944
52020 1428944 1420356 1411295 1402090 1392272 1381657 1370901 1360503 1350099 1339288 1328423 1317944 1307449
52008 1307449 1296062 1283269 1268855 1252474 1234037 1214258 1194130 1173887 1152972 1130930 1107842
51997 1107842 1084009 1059730 1035458 1011778 989159 967915 948351 930677 914904 901033 889133
51986 889133 878881 869243 859062 847915 836098 823956 811666 799387 786949 773433 757810 740245
51974 740245 722237 705161 689184 673897 659496 646784 636269 627844 621274 616533 613670 612698 613790
51961 613790 617246 623052 630557 638779 647055 655303 663609 671536 677913 681418 681427 678270 672736 665488 656966
51946 656966 647653 638242 629571 622472 617645 615605 616740 621224 628713 638243 648760 659863 671777
51933 671777 684581 697796 710760 722889 733309 740737 744257 743949 740295 733235 722431 708264 691967
51920 691967 674718 657177 639870 623333 607692 592784 578905 566906 557272 549659 543711 539703
51908 539703 537935 538039 539517 542579 547836 555517 565537 577978 592759 608970 625248 640653 654522
51895 654522 665737 673092 676455 676616 673734 666719 654532 637443 616747 594048 571279 550623 533436
51882 533436 519527 508095 499116 493235 490594 490523 492294 495541 499934 505138 511246 518699 527435 536426
51868 536426 544344 550563 555325 559035 561588 562358 560753 556720 550741 543440 535408 527356 520118 514340
51854 514340 510384 508609 509400 512616 517304 522329 527122 531494 535033 537209 537940 537469 535644 531870 525971
51839 525971 518690 511143 504025 497479 491287 485048 478508 472076 466776 463476 462350 463183 465765 469621
51825 469621 473733 477146 479729 481838 483296 483307 481545 478719 475666 472289 467879 462349 456685 452175 449520
51810 449520 448705 449376 451144 453706 456876 460441 463996 467004 469009 469646 468534 465539 461243 456815 453205
51795 453205 450705 449361 449363 450551 451868 451918 450139 447060 443483 439884 436606 434091 432601 431984 431930 432271
51779 432271 432914 433677 434334 434655 434368 433347 431943 430852 430524 430892 431756 433174 435392 438711 443579 450471
51763 450471 459416 469802 480819 491878 502464 511924 519677 525451 529117 530425 529067 524810 517542
51750 517542 507611 496300 485502 476450 468992 462385 456452 451602 448080 445804 444753 444907 445856 447043
51736 447043 448481 450835 454724 460358 467815 477162 488022 499258 509322 516907 521469 523479 524189 524775
51722 524775 525583 526326 526829 527065 526420 523587 517702 509462 500800 493539 488483 485473 483851 482783 481475
51707 481475 479389 476361 472543 468386 464665 462295 461804 462999 465316 468476 472400 476340 478732 478561 476672
51692 476672 475019 474610 474908 475278 476106 477908 480060 481194 480529 478158 474315 469127 463021 456814 451304
51677 451304 447065 444462 443424 443405 444022 445593 448529 452480 456713 461156 466294 472101 477923 483576 489721
51662 489721 496777 504100 510649 515889 519538 520894 519064 513899 506362 498040 490453 484669 481372 481223
51648 481223 484927 492586 502940 513644 522505 528263 530341 528461 522826 514352 504315 493815 483580
51635 483580 473969 465042 456815 449533 443469 438518 434351 430924 428356 426313 424151 421832 420163 419816
51621 419816 420577 421789 422950 423535 422856 420724 417918 415459 413621 412031 410394 408634 406635 404437 402581
51606 402581 401772 402230 403685 405812 408318 410865 413414 416498 420644 425653 430983 436715 443566 451875 461241
51591 461241 471247 481924 493055 503402 511051 514521 513455 508556 501108 492443 483565 475215 468248
51578 468248 463753 462579 464794 469777 476913 486128 497729 511731 527506 544184 561356 579263 598377
51565 598377 619047 641477 665555 690500 715066 738655 762182 787605 816736 850739 890351
51554 890351 935668 985337 1036261 1084473 1126324 1159054 1180829 1190742 1188730 1175329 1151570 1119100
51542 1119100 1080034 1036321 989374 940521 891563 844435 800335 759616 722600 689947 661912
51531 661912 637696 616129 596845 580180 565942 552969 540268 528111 517510 508871 501633 495058
51519 495058 488845 482886 476954 470852 464716 459018 454369 451252 449714 449252 449204 449277 449565 450164 451003 451924
51503 451924 452654 452830 452502 452477 453629 455794 457915 459332 460362 461319 461619 460448 457898 454922 452342 450432
51487 450432 449334 449297 450334 451897 453014 452744 450652 447017 442499 437527 432171 426623 421397 416764 412371
51472 412371 407769 403117 398975 395554 392578 389709 386752 383551 380145 376947 374348 372171 369942 367681
51458 367681 365934 364901 364043 362862 361744 361623 362965 365383 368180 371004 373972 377426 381674 386856 392941
51443 392941 399961 408352 418944 432360 448329 465696 483115 499473 513603 524030 529579 530269
51431 530269 527379 522662 517639 513290 509725 506047 501013 494040 485319 475137 463769 452187 442098
51418 442098 434741 429962 426783 424423 422445 420477 418443 416821 416183 416707 418437 421550 425755 429941 433173
51403 433173 435859 439189 443523 448059 452042 455510 458709 461532 463866 466000 468381 471244 474673 478709
51389 478709 483342 488733 495516 504505 515977 529601 545208 563364 585104 611418 643034 680396
51377 680396 723719 773223 829106 890980 957537 1027183 1098587 1169578 1235524 1290096 1328522
51366 1328522 1349862 1355845 1348249 1327993 1295979 1253645 1202639 1144698 1082002 1017136 952457 889636
51354 889636 829753 773596 721980 676044 636981 605104 579256 557567 538770 522468 508325
51343 508325 495698 484198 473992 465195 457399 450169 443597 437865 432561 427124 421918 418176 416563
51330 416563 416281 415917 414794 413037 410680 407421 403291 398970 395208 392246 389989 388364 387273 386445 385614
51315 385614 384692 383641 382459 381479 381346 382352 384047 385820 387629 389748 391999 393708 394415 394273 393868 394017
51299 394017 395636 399219 404249 409398 413460 415947 416941 416758 415772 414155 411712 408308 404427 400901 398011
51284 398011 395320 392607 390537 390073 391471 394097 397090 400030 403174 407166 412239 417485 421140 421917 420091
51269 420091 417164 414603 413008 412224 411912 411948 412485 413828 416286 419985 424541 428814 431317 431286 429259 426349
51253 426349 423124 419573 415920 412729 410051 407161 403513 399551 396140 393604 391730 390402 389714 389577 389746
51238 389746 390177 390949 391832 392313 392176 391764 391513 391467 391435 391382 391399 391347 390773 389332 387233 385147 383693 383049 382991
51219 382991 383109 382976 382298 381126 379832 378824 378342 378518 379388 380685 381893 382777 383627 384802 386324 388246
51203 388246 390970 394620 398373 401204 403292 405896 409746 414236 418436 422124 425409 427976 429365 429532
51189 429532 428593 426368 422831 418778 415370 413041 411330 409790 408526 407805 407588 407622 407731 407875 408096 408489
51173 408489 409056 409490 409262 408007 405864 403482 401743 401273 402021 403294 404354 405016 405753 407289 410061 413859
51157 413859 417906 421479 424541 427558 430601 432857 433211 431165 427166 422296 417818 414630 412777 411527
51143 411527 410156 408635 407444 406920 406966 407273 407611 408011 408808 410312 412239 413579 413272 411014 407377 403316
51127 403316 399643 396783 394836 393917 394291 395853 397571 398074 397105 395955 396133 397984 400903 404341 408029
51112 408029 411656 415017 418339 421814 424968 427133 428448 429757 431492 433305 434861 436377 438225 440554
51098 440554 443478 447012 450624 453435 455218 456687 458347 459592 459519 458289 456958 456032 454913 452926 450450
51083 450450 448633 448251 449054 450104 450537 450003 448631 446787 444918 443553 443196 444013 445622 447389 448984 450639
51067 450639 452848 455975 460226 465736 472432 479878 487603 495791 505411 517487 532362 549652 568487
51054 568487 587354 604109 617001 625987 632727 639261 647143 657761 672402 691113 711813 731412
51042 731412 747993 761517 772430 780157 783242 780743 773217 762507 750777 739639 729773 720727 710784
51029 710784 697464 679048 656114 631308 607440 586033 567718 553193 542977 536542 532515 529857
51017 529857 528369 528095 528837 530416 532958 536638 541444 547299 554180 561965 570438 579442 588795 598037 606691
51002 606691 614948 623727 633764 644823 656040 666910 677690 688888 700580 712317 723627 734434
50990 734434 744890 754927 764289 773004 781349 789052 795050 798635 800578 802456 804972 807721 810631 814698
50976 814698 820832 828605 836794 844760 852756 861184 870321 880763 893638 910112 930863 956038 985451
50963 985451 1018823 1056044 1097241 1142468 1191386 1243360 1297792 1354169 1411881 1470228 1528556
50952 1528556 1586174 1642208 1695802 1746520 1794323 1839138 1880722 1919057 1954640 1988231 2020544
50941 2020544 2052388 2084940 2119395 2156115 2194052 2231009 2264484 2292596 2314667 2331127 2342700
50930 2342700 2349514 2350991 2346516 2335913 2319133 2295799 2265426 2227924 2183491 2132059 2073267 2007177
50918 2007177 1934789 1857816 1778301 1698498 1620609 1546145 1475643 1409303 1347780 1292048 1242543
50907 1242543 1198696 1159394 1123750 1091478 1062669 1037223 1014519 993683 974148 955747 938345
50896 938345 921798 906416 892982 881915 872691 864463 857035 850794 845899 842092 839205 837305 836248
50883 836248 835553 834929 834601 834975 836227 838293 841014 844192 847738 851878 857024 863307 870357 877656 885031
50868 885031 892834 901706 912150 924218 937676 952436 968647 986386 1005652 1026866 1050942 1078516
50856 1078516 1109520 1143906 1182270 1225114 1271969 1322260 1376866 1437793 1506238 1581952 1664714
50845 1664714 1755208 1853795 1959372 2070402 2186572 2308508 2436085 2567741 2701291 2834614
50835 2834614 2965510 3091426 3209598 3317311 3412290 3493429 3561276 3617476 3663711 3701420
50825 3701420 3732485 3759705 3786299 3815113 3848372 3887955 3935460 3991699 4056028 4126209 4198936
50814 4198936 4270274 4335370 4388236 4422707 4434196 4420415 4380480 4313954 4221142 4103792 3964861
50803 3964861 3807660 3635596 3452589 3263251 3072591 2885578 2706595 2538692 2383361
50794 2383361 2241337 2113520 2000727 1902752 1818234 1745590 1683705 1631684 1588437 1552824 1523935
50783 1523935 1501000 1483158 1469424 1458694 1449692 1441172 1432437 1423560 1414916 1406542 1397930 1388331 1377117
50770 1377117 1364010 1349149 1332954 1315806 1297760 1278627 1258305 1237048 1215379 1193743 1172300
50759 1172300 1151111 1130523 1111194 1093692 1078134 1064329 1052210 1041973 1033856 1027901 1024005 1022189
50747 1022189 1022766 1026233 1032898 1042553 1054565 1068382 1084027 1102155 1123677 1149290 1179236 1213504
50735 1213504 1252272 1296033 1345124 1399140 1457027 1517735 1580597 1645115 1710683 1776715 1842804
50724 1842804 1908520 1973175 2035977 2096399 2154314 2209798 2262751 2312556 2357994 2397564 2429899
50713 2429899 2453830 2468398 2473395 2470129 2461334 2450071 2438851 2429828 2425328 2427695 2438585 2458440
50701 2458440 2486396 2520555 2558697 2599012 2639987 2679477 2714223 2740482 2754754 2753743 2734421
50690 2734421 2695045 2636114 2559976 2469757 2369121 2262542 2154657 2049021 1947921 1853284
50680 1853284 1767014 1690293 1623362 1566322 1519594 1483160 1455975 1436744 1424968 1420709 1423593 1432642
50668 1432642 1446948 1465935 1488786 1513981 1539624 1564107 1586469 1606285 1623397 1637805 1649842
50657 1649842 1660364 1670487 1680970 1691917 1703136 1714599 1726453 1738854 1752027 1766278 1781735
50646 1781735 1798286 1816173 1836579 1861178 1890990 1925924 1965508 2009651 2058452 2111482 2167711
50635 2167711 2226169 2286426 2348220 2410719 2472346 2531513 2587600 2641161 2693148 2743913 2792894
50624 2792894 2838808 2879440 2910902 2927562 2923842 2897209 2850124 2789341 2723124 2658445 2599756
50613 2599756 2549312 2508083 2476361 2453906 2439935 2433107 2431616 2433384 2436356 2438767 2439096 2435681 2426412
50600 2426412 2408935 2381292 2342507 2292782 2233353 2166114 2093115 2016205 1937151 1858060 1781394
50589 1781394 1709285 1642794 1581863 1525979 1474849 1428581 1387371 1351097 1319186 1290940 1265935
50578 1265935 1243973 1224633 1207172 1191013 1176121 1162754 1151126 1141608 1134947 1131780 1131968 1134768
50566 1134768 1139618 1146387 1154968 1165086 1176657 1189899 1204965 1221844 1240709 1261912 1285456 1310868
50554 1310868 1337830 1366489 1396877 1428455 1460575 1492927 1525041 1555713 1583620 1608385 1630579
50543 1630579 1650847 1669737 1688352 1708407 1731289 1757419 1786794 1819777 1857147 1899782 1948584
50532 1948584 2004404 2067598 2137873 2214954 2299320 2391901 2493085 2602395 2719088 2842604
50522 2842604 2972202 3106491 3243598 3381549 3518165 3650788 3776500 3892575 3996380
50513 3996380 4084974 4155340 4205250 4233591 4239781 4223422 4184900 4125935 4049053 3956817 3852070
50502 3852070 3738671 3621271 3504285 3391502 3286604 3193295 3114608 3052534 3008495 2983641
50492 2983641 2978254 2991151 3019956 3061672 3112654 3168280 3223025 3270844 3305508 3321133 3313142 3279162
50480 3279162 3219287 3135787 3032543 2914191 2785344 2650414 2513748 2379218 2249411 2125676
50470 2125676 2009198 1901533 1803825 1716032 1637389 1567240 1505053 1450146 1402004 1360541 1325412
50459 1325412 1295362 1268948 1245811 1226653 1212101 1202143 1196565 1195254 1197945 1204182 1213629 1226012
50447 1226012 1240665 1256542 1272747 1288776 1304270 1318995 1333050 1346689 1359874 1372271 1383581
50436 1383581 1393436 1401124 1406022 1408412 1409343 1409594 1409249 1408399 1407657 1407678 1408664 1410694 1414181 1419594 1426974 1436117
50420 1436117 1447156 1460667 1477223 1497050 1520180 1546872 1577775 1613500 1653993 1698568 1746773
50409 1746773 1799018 1855976 1917528 1982604 2049890 2118156 2185978 2251722 2314020 2371946 2424661
50398 2424661 2471245 2510879 2542748 2565741 2578620 2580519 2570812 2548563 2512890 2464160 2404258 2335402
50386 2335402 2259294 2177888 2094410 2012877 1936738 1868390 1809597 1761614 1724808 1698751 1682965
50375 1682965 1677344 1681658 1694776 1714602 1738787 1765397 1792616 1817703 1836615 1845252 1841352 1825065
50363 1825065 1797771 1760816 1715409 1663163 1606202 1546811 1487109 1428754 1372600 1318778 1267331
50352 1267331 1218687 1173322 1131173 1091708 1054662 1020569 990457 964895 943333 924578 908113
50341 908113 894713 885419 880137 877807 877903 881034 887831 897860 910080 923982 939857 958180 979117
50328 979117 1002438 1027594 1053832 1080207 1105218 1126528 1141715 1149693 1151179 1147721 1140893 1132519
50316 1132519 1124653 1118381 1112992 1107155 1100694 1094515 1089081 1083901 1078665 1074052 1070923 1069152 1067652 1065441
50302 1065441 1062464 1059525 1057591 1057137 1058107 1060385 1064038 1069038 1075119 1082181 1090646 1101036 1113379 1127318
50288 1127318 1142649 1159369 1177380 1196587 1217285 1240068 1265275 1292480 1320041 1344630 1361665
50277 1361665 1367294 1360578 1343774 1320687 1295090 1270149 1248090 1229789 1215027 1203394 1194591 1187947
50265 1187947 1182479 1177721 1173815 1170362 1165982 1159734 1152416 1145572 1139566 1133566 1127241 1121433 1116934 1113481
50251 1113481 1110359 1107381 1104891 1103314 1103138 1104884 1108635 1113968 1120776 1129735 1141459 1155606 1171513
50238 1171513 1189397 1210071 1233457 1258214 1282988 1307275 1330833 1352976 1372914 1390289 1405023
50227 1405023 1417169 1427302 1436436 1444913 1451773 1455767 1456461 1453622 1446079 1432344 1412299 1387312 1358662
50214 1358662 1326889 1292943 1258909 1226943 1198088 1172690 1151373 1134936 1123525 1116361 1111967 1108154
50202 1108154 1102164 1091614 1075632 1054925 1030926 1005084 978773 953351 930016 909525 891990
50191 891990 876932 863766 852248 842197 832901 823324 813097 802843 793159 783738 773960 763980 754586
50178 754586 746099 738010 729892 722156 715574 710256 705441 700400 695304 690932 687603 684832 682209 680112
50164 680112 679050 678667 678139 677401 677200 677929 679289 681257 684454 689159 694805 701050 708585 718138 729306
50149 729306 741050 752796 764194 774358 782361 788347 793212 797211 799623 799778 797763 794202 790069
50136 790069 786628 784809 784557 785402 787612 792137 799453 809258 821421 836347 854106 873971 895258
50123 895258 918079 942904 969912 999273 1031606 1067545 1106909 1148584 1191106 1233257 1274488
50112 1274488 1315113 1355893 1397177 1438573 1479561 1520015 1559737 1597565 1631292 1658429 1676920
50101 1676920 1685376 1683179 1670637 1648942 1619749 1584688 1545158 1502438 1457817 1412653 1368456 1326995
50089 1326995 1290007 1258441 1232064 1210163 1192559 1179487 1170506 1164255 1159605 1156472 1155042 1154750 1154557
50076 1154557 1153884 1152763 1151424 1150258 1149712 1149556 1148630 1146056 1142394 1138725 1134875 1129554 1122141 1113323 1103849
50061 1103849 1093719 1082913 1071978 1061385 1050946 1040289 1029346 1018139 1006813 996274 988029
50050 988029 982852 980085 978740 978701 980338 983521 987793 993233 1000435 1009663 1020522 1032389 1044837 1057652
50036 1057652 1070713 1083859 1096821 1109436 1121873 1134201 1145682 1155104 1162128 1167767 1173090 1177857
50024 1177857 1180894 1181504 1180006 1177163 1173545 1169269 1163961 1157048 1148391 1138513 1127974 1116882 1105259
50011 1105259 1093497 1081995 1070697 1059567 1049300 1040970 1034986 1030920 1028407 1027823 1030044 1035869 1045743
49998 1045743 1059791 1077996 1100364 1126762 1156513 1188410 1221333 1254568 1287343 1318483 1347025
49987 1347025 1372892 1396414 1417185 1433750 1444322 1447451 1442166 1428002 1405012 1373532 1334081 1287939
49975 1287939 1237674 1186520 1137008 1090409 1047327 1008259 973451 942726 915856 892818 873432
49964 873432 856961 842385 829034 816740 805428 794809 784629 775193 767416 762135 759314 758175
49952 758175 758181 759713 763627 770318 779483 790553 802993 816265 829879 843584 857152 869851 880446
49939 880446 888081 893072 896598 899508 901520 901595 898897 893153 884126 871171 853730 832246 808299 783766
49925 783766 760037 737955 718145 701102 687041 675741 666563 658849 652647 648872 648194 649732 651469
49912 651469 652177 652370 653099 654490 656072 657982 660953 665338 670855 677306 684868 693707 703924 715942
49898 715942 730337 747003 765005 783429 801935 820179 837074 851061 860969 866504 868141 866810
49886 866810 863441 858445 851602 842509 831054 817410 801831 784701 766629 748263 729981 711930
49874 711930 694334 677656 662456 649164 637889 628385 620264 613430 608271 605311 604561 605350 606881
49861 606881 608852 611474 615037 619696 625647 633160 642237 652497 663618 675693 688915 703097 717853
49848 717853 733091 748786 764231 777995 788879 796680 801892 805012 806314 806018 804267 800958 795673
49835 795673 787777 776778 762961 747737 732947 719699 708094 698025 689724 683356 678624 675146
49823 675146 672865 671837 672003 673476 676646 681696 688405 696742 707132 719652 733434 747505 761823
49810 761823 776773 791858 805726 817502 827471 836372 844529 851768 857644 861615 863268 862505 859357
49797 859357 853772 845902 836364 825745 814032 801024 787133 773140 759208 744812 729844 715274
49785 715274 702521 692453 684961 679096 673658 668161 663257 659727 657094 653892 649414 644542 640633 638223
49771 638223 637166 637439 639284 642888 648357 655727 664656 674405 684447 694898 705974 717238 727731
49758 727731 736734 744113 750066 754789 758357 760665 761399 760048 755964 748536 737667 724134 709323 694522
49744 694522 680582 668116 657512 648715 641348 635255 630588 627238 624536 621792 618929 616424 614837
49731 614837 614506 615406 617131 619175 621386 623941 626858 629867 632862 636140 640065 644911 651176 659620 670592
49716 670592 683592 697776 712626 727908 743222 757884 770942 781075 786884 787843 784896 779761
49704 779761 773679 767038 759887 752307 744314 735872 727218 719040 712173 707054 703305 699760 695120 688828
49690 688828 681322 673533 666329 660458 656562 654916 655247 657024 659855 663616 668533 675198 684113 695032
49676 695032 707176 720317 735118 752014 770296 788851 807299 825488 842065 854617 861642 863810
49664 863810 863059 860963 858427 856451 856370 859055 864190 870626 877378 883865 888933 889959 883747 868762 846343
49649 846343 819592 791478 764147 739283 718090 700849 687093 676353 668372 662677 658547 655567
49637 655567 653846 653576 654686 656869 659436 661136 660793 658400 655100 651841 648469 644397 639536 634106 628009
49622 628009 621083 613734 606698 600284 594398 589213 585171 582294 580121 578460 577587 577450 577261 576418 575373
49607 575373 575020 575455 575968 576160 576417 577189 578404 579841 581502 583181 584119 583718 582490 581716 582121 583288 584432
49590 584432 585246 585872 586492 587345 588819 591075 593668 595867 597350 598339 599130 599817 600552 601725 603620 605997
49574 605997 608240 609998 611595 613759 616908 620796 624992 629744 636189 645425 657376 670741 684116
49561 684116 696941 709217 720582 730126 737112 741478 743437 742883 739603 733880 726540 718430 710245 702780
49547 702780 696807 692517 689483 687390 686411 686603 687460 688464 689694 691408 693382 695220 697050 699196 701427
49532 701427 703319 705266 708371 713292 719993 728633 739726 753176 768103 784114 801922 822120 844064
49519 844064 866532 888671 909498 927321 940905 950898 959040 966161 971983 976801 982166 989613 999599
49506 999599 1011900 1026021 1040682 1053596 1062439 1065723 1062551 1052304 1035305 1013387 989087 964188
49494 964188 939400 915182 892331 871744 854010 839304 827370 817506 808766 800451 792489 785371
49482 785371 779718 775814 773437 772053 771147 770434 769999 770289 771688 773919 776168 778061 780154 783001 786080
49467 786080 788367 789900 791945 795415 799874 804343 808430 812203 815649 818887 822430 826423 829844 831159
49453 831159 829825 826690 822989 819368 815681 811179 804893 796499 786989 778078 770746 764622 758835 753057
49439 753057 747605 742983 739642 737943 738009 739639 742409 745811 749446 753448 758742 766480 777035 789811
49425 789811 804077 819650 836748 855744 877354 902418 930929 961603 992876 1023747 1052665
49414 1052665 1075845 1088232 1087179 1075000 1057490 1040205 1026324 1017231 1013726 1016253 1024599 1038067
49402 1038067 1055849 1076932 1099822 1122798 1144659 1165006 1183739 1200586 1215393 1228681 1241380
49391 1241380 1253768 1264949 1273680 1279514 1282808 1283755 1281888 1276625 1267920 1256154 1241786 1225365 1207673
49378 1207673 1189439 1170963 1152336 1134044 1117120 1102622 1091073 1082402 1076234 1072179 1069919 1069101
49366 1069101 1069223 1069761 1070456 1071271 1071974 1071896 1070294 1066820 1061478 1054311 1045404 1035108 1023944 1012333 1000580
49351 1000580 989045 978056 967704 958051 949449 942361 936868 932631 929365 926974 925246 923782 922298
49338 922298 920658 918557 915602 911833 907749 903595 899022 893693 887899 882270 877135 872475 868316 864910
49324 864910 862647 861884 862633 864299 866155 868256 871437 876083 881432 886579 891723 897668 904416 911051 916988
49309 916988 922545 928177 933861 939598 945905 953335 961830 970915 980370 990436 1001513 1013935 1027850
49296 1027850 1043073 1059105 1075536 1092386 1109906 1128044 1146118 1162811 1176297 1184591 1186325 1181670
49284 1181670 1172532 1161694 1151494 1143053 1136360 1130671 1124862 1117964 1109966 1102043 1095503 1090520 1086298
49271 1086298 1082497 1079845 1079114 1080097 1082105 1084915 1088662 1093128 1097863 1102812 1108109 1113349 1117764 1121187
49257 1121187 1124276 1127705 1131724 1136594 1142962 1151753 1164132 1181344 1203660 1229320 1255416 1280042
49245 1280042 1302562 1321296 1332247 1331532 1318749 1296977 1269753 1239073 1206181 1172932 1141645 1114061
49233 1114061 1090852 1071797 1056323 1044247 1036151 1032674 1033316 1036388 1040348 1044806 1050073 1056243 1063157
49220 1063157 1070810 1079211 1087911 1096153 1103556 1110398 1117210 1124381 1132202 1140968 1150808 1161453 1172284
49207 1172284 1182705 1192566 1202276 1212567 1224145 1237533 1252979 1270204 1288258 1306066 1323330 1340591
49195 1340591 1358157 1375266 1390728 1404224 1416433 1427934 1438563 1448069 1456821 1465414 1473865 1481733
49183 1481733 1488942 1496064 1503788 1512515 1522593 1534640 1549419 1567545 1589427 1615375 1645619 1680337
49171 1680337 1719771 1764322 1814503 1870679 1932501 1998043 2063139 2121617 2166634 2192690 2197679
49160 2197679 2184061 2158149 2127434 2097750 2072383 2052982 2040316 2033951 2032153 2032915 2034936 2037317
49148 2037317 2038899 2038735 2037091 2035221 2034070 2033753 2034363 2036643 2041542 2049490 2060297 2073340 2087642 2102186
49134 2102186 2116558 2131090 2146225 2162085 2178850 2197049 2216938 2237897 2259012 2280126 2301742
49123 2301742 2323956 2346167 2368010 2389957 2412603 2435896 2459578 2484030 2509983 2537465 2565800
49112 2565800 2594883 2625966 2660919 2701221 2748109 2803333 2869125 2947516 3040005 3147304 3267921
49101 3267921 3396257 3523084 3639869 3744085 3840347 3935000 4027348 4104749 4147261 4140213 4085091
49090 4085091 3998881 3901935 3805155 3707157 3601457 3485044 3361362 3237966 3122781 3021448
49080 3021448 2936305 2866907 2811420 2767668 2733376 2706327 2684835 2667831 2654260 2642655 2631537
49069 2631537 2619983 2607634 2594546 2581280 2568756 2557559 2547462 2537939 2528929 2520774 2513601 2507196
49057 2507196 2501389 2496223 2491728 2487866 2484704 2482321 2480507 2478903 2477494 2476716 2476805 2477242 2477114 2476079 2474856
49042 2474856 2474751 2476713 2480906 2487060 2495118 2505438 2518490 2534466 2553030 2573187 2593288 2611404
49030 2611404 2625921 2635865 2640890 2641280 2637972 2632174 2624625 2615334 2604219 2591810 2579068 2566641 2554689
49017 2554689 2543418 2533488 2525648 2520092 2516359 2513846 2512356 2512099 2513217 2515459 2518426 2522075 2526706 2532402
49003 2532402 2538652 2544769 2550517 2556144 2561800 2567187 2571842 2575546 2578286 2579968 2580385 2579444 2577167 2573450
48989 2573450 2568077 2561232 2553791 2546727 2540204 2533561 2526272 2518644 2511495 2505520 2501173 2498769 2498238 2498955
48975 2498955 2500263 2502131 2504973 2508911 2513556 2518472 2523434 2528225 2532592 2536532 2540304 2544034 2547557 2550708
48961 2550708 2553565 2556371 2559485 2563383 2568324 2573981 2579791 2585770 2592686 2601251 2611524 2623200 2636123
48948 2636123 2650302 2665766 2682707 2701574 2722769 2746347 2772076 2799590 2828452 2858366 2889399
48937 2889399 2921762 2955370 2990057 3026277 3065128 3107482 3153468 3202892 3255620 3311293 3369243
48926 3369243 3429110 3491086 3555186 3620696 3686857 3753641 3821377 3889942 3958920 4028238 4097946
48915 4097946 4167466 4235620 4301307 4363686 4421840 4474955 4523006 4566981 4608315 4648163 4686847
48904 4686847 4723583 4757045 4786740 4813663 4839142 4863263 4885064 4904065 4920841 4936068 4949812
48893 4949812 4961909 4972326 4980818 4986864 4990368 4991952 4992138 4990549 4986314 4978922 4968313 4954353 4936647
48880 4936647 4914859 4889076 4860048 4829168 4797911 4766879 4735442 4702361 4666542 4627056 4582851
48869 4582851 4533092 4477819 4418014 4354940 4289649 4223120 4156468 4090760 4026646 3964403 3904286
48858 3904286 3846656 3791748 3739553 3690143 3643983 3601648 3563245 3528368 3496597 3467712 3441387
48847 3441387 3417101 3394670 3374590 3357590 3344013 3333845 3327048 3323507 3322892 3324975 3329975 3338191 3349365
48834 3349365 3362756 3377739 3393991 3411255 3429400 3448726 3469697 3492190 3515327 3538206 3560542
48823 3560542 3582533 3604351 3625918 3647053 3667766 3688423 3709471 3730902 3752181 3772924 3793387
48812 3793387 3813998 3834654 3854846 3874248 3892828 3910682 3928319 3946808 3966956 3988390 4010101
48801 4010101 4031833 4054247 4077802 4102298 4127651 4154268 4182262 4210995 4239764 4268305 4296192
48790 4296192 4322304 4345443 4365134 4381590 4395437 4407732 4419571 4430979 4440633 4447113 4449986 4449078
48778 4449078 4443324 4431210 4412152 4386664 4355304 4318232 4275894 4229418 4180053 4128563 4075320
48767 4075320 4020681 3965149 3909358 3853891 3798982 3744567 3690857 3638549 3588138 3539280 3491409
48756 3491409 3444906 3401098 3361058 3324877 3292166 3262746 3236648 3213807 3194033 3177124 3162845
$$ [...]
##END NTUPLES=NMR SPECTRUM
##END=
