##TITLE=AC1573_ROEFFECT0022_8271116_8PyWePruJo
##JCAMPDX= 6.0         $$ Bruker NMR JCAMP-DX V2.0
##DATA TYPE= NMR SPECTRUM
##DATA CLASS= NTUPLES
##ORIGIN= BRUKER
##OWNER= Administrator
$$ 1.72 TOPSPIN		Version 2.1
$$ 2013-10-12 16:13:52.521 -0700  Administrator@X
$$ Compression mode = diff/dup
##.OBSERVE FREQUENCY= 400.02188249412
##.OBSERVE NUCLEUS= ^1H
##.ACQUISITION MODE= SIMULTANEOUS (DQD)
##.ACQUISITION SCHEME= undefined
##.AVERAGES= 8
##.DIGITISER RES= 22
##SPECTROMETER/DATA SYSTEM= spect
##.PULSE SEQUENCE= zg30
##.SOLVENT NAME= COFFEE_meoh
##.SHIFT REFERENCE= INTERNAL, COFFEE_meoh, 1, 14.98509
##AUDIT TRAIL= $$ (NUMBER, WHEN, WHO, WHERE, PROCESS, VERSION, WHAT)
$$ ##TITLE= Audit trail, TOPSPIN		Version 2.1
$$ ##JCAMPDX= 5.01
$$ ##ORIGIN= Bruker BioSpin GmbH
$$ ##OWNER= Administrator
$$ $$ E:\/data/COFFEE/nmr/AC1573_ROEFFECT0022_8271116_8PyWePruJo/10/pdata/1/auditp.txt
$$ ##AUDIT TRAIL=  $$ (NUMBER, WHEN, WHO, WHERE, PROCESS, VERSION, WHAT)
(   1,<2013-10-12 16:13:45.724 -0700>,<Administrator>,<X>,<go>,<TOPSPIN 2.1>,
      <created by zg
	started at 2013-10-12 16:12:40.260 -0700,
	POWCHK enabled, PULCHK disabled,
       configuration hash MD5:
       C8 4E 4E 5D D3 5C D8 9E 9F 52 82 E0 59 8A DE 15
       data hash MD5: 64K
       C0 B2 9D EA 10 CE 70 72 C5 F7 48 8C EC 4E 42 D0>)
(   2,<2013-10-12 16:13:48.693 -0700>,<Administrator>,<X>,<proc1d>,<TOPSPIN 2.1>,
      <Start of raw data processing
       efp LB = 0 FT_mod = 6 PKNL = 1 PHC0 = 0 PHC1 = 0 SI = 32K 
       data hash MD5: 32K
       29 DF 94 CA 5A 0D F3 C9 A7 87 9F 5D 5F D4 12 78>)
(   3,<2013-10-12 16:13:49.052 -0700>,<Administrator>,<X>,<proc1d>,<TOPSPIN 2.1>,
      <pk PHC0 = 97.80579 PHC1 = 0 
       data hash MD5: 32K
       75 A9 1C 00 BD 38 17 52 8E 70 73 B5 FD BB 37 D2>)
(   4,<2013-10-12 16:13:49.193 -0700>,<Administrator>,<X>,<proc1d>,<TOPSPIN 2.1>,
      <abs ABSG = 1 
       data hash MD5: 32K
       5B 1D AA 5E 00 CE 81 DF 1D 4D 6D 6A 48 E2 D8 48>)
(   5,<2013-10-12 16:13:49.271 -0700>,<Administrator>,<X>,<proc1d>,<TOPSPIN 2.1>,
      <abs ABSG = 2 
       data hash MD5: 32K
       5F 08 81 4C 1C 2C FF 7F 2C 0F 67 CB FC 86 42 69>)
(   6,<2013-10-12 16:13:49.380 -0700>,<Administrator>,<X>,<proc1d>,<TOPSPIN 2.1>,
      <abs ABSG = 3 
       data hash MD5: 32K
       B0 A3 A3 3A E8 8B 41 A7 F5 20 7B 33 AB 1F 11 1D>)
(   7,<2013-10-12 16:13:49.474 -0700>,<Administrator>,<X>,<proc1d>,<TOPSPIN 2.1>,
      <abs ABSG = 4 
       data hash MD5: 32K
       64 57 81 73 15 49 50 A5 DB F1 75 5F 7E F0 44 35>)
(   8,<2013-10-12 16:13:49.521 -0700>,<Administrator>,<X>,<proc1d>,<TOPSPIN 2.1>,
      <abs ABSG = 5 
       data hash MD5: 32K
       FA FC 13 6D 7C D1 89 44 F1 BE 52 C2 7A B8 88 FB>)
$$ ##END=
$$ 
$$ $$ hash MD5
$$ $$ 99 2F EB 1D 8B C6 4E 68 7F DB B0 1E 66 96 0E 5A
##$RELAX= 
##$RELAX= 
##$RELAX= 
##$RELAX= 
##$RELAX= 
##$RELAX= 
##$RELAX= 
$$ Bruker specific parameters
$$ --------------------------
##$DU= <E:\>
##$EXPNO= 10
$$ [...]
##$TP= (0..7)
150 150 150 150 150 150 150 150
##$TP07= 0
##$TPNAME0= <>
##$TPNAME1= <>
##$TPNAME2= <>
##$TPNAME3= <>
##$TPNAME4= <>
##$TPNAME5= <>
##$TPNAME6= <>
##$TPNAME7= <>
##$TPOAL= (0..7)
0.5 0.5 0.5 0.5 0.5 0.5 0.5 0.5
##$TPOFFS= (0..7)
0 0 0 0 0 0 0 0
##$TUNHIN= 0
##$TUNHOUT= 0
##$TUNXOUT= 0
##$USERA1= <user>
##$USERA2= <user>
##$USERA3= <user>
##$USERA4= <user>
##$USERA5= <user>
##$V9= 5
##$VALIST= <valist>
##$VCLIST= <CCCCCCCCCCCCCCC>
##$VD= 0
##$VDLIST= <DDDDDDDDDDDDDDD>
##$VPLIST= <PPPPPPPPPPPPPPP>
##$VTLIST= <TTTTTTTTTTTTTTT>
##$WBST= 1024
##$WBSW= 4
##$XGAIN= (0..3)
0 0 0 0
##$XL= 0
##$YL= 0
##$YMAX_a= 645346
##$YMIN_a= -549691
##$ZGOPTNS= <>
##$ZL1= 120
##$ZL2= 120
##$ZL3= 120
##$ZL4= 120
##$ABSF1= 14.98509
##$ABSF2= -5.573092
##$ABSG= 5
##$ABSL= 3
##$ALPHA= 0
##$AQORDER= 0
##$ASSFAC= 0
##$ASSFACI= 0
##$ASSFACX= 0
##$ASSWID= 0
##$AUNMP= <proc_prof1d_extract_pilot.lims>
##$AXLEFT= 0
##$AXNAME= <>
##$AXNUC= <1H>
##$AXRIGHT= 0
##$AXTYPE= 0
##$AXUNIT= <>
##$AZFE= 0.1
##$AZFW= 0.1
##$BCFW= 0
##$BC_mod= 0
##$BYTORDP= 0
##$COROFFS= 0
##$CY= 15
##$DATMOD= 1
##$DC= 0
##$DFILT= <>
##$DTYPP= 0
##$F1P= 0
##$F2P= 0
##$FCOR= 0.5
##$FTSIZE= 32768
##$FT_mod= 6
##$GAMMA= 0
##$GB= 0
##$INTBC= 1
##$INTSCL= 1
##$ISEN= 128
##$LB= 0
##$LEV0= 0
##$LPBIN= 0
##$MAXI= 10000
##$MC2= 0
##$MEAN= 0
##$ME_mod= 0
##$MI= 0
##$NCOEF= 0
##$NC_proc= -8
##$NLEV= 6
##$NOISF1= 0
##$NOISF2= 0
##$NSP= 0
##$NTH_PI= 0
##$NZP= 0
##$OFFSET= 14.98509
##$PC= 1
##$PHC0= 97.80579
##$PHC1= 0
##$PH_mod= 1
##$PKNL= yes
##$PPARMOD= 0
##$PPDIAG= 0
##$PPIPTYP= 0
##$PPMPNUM= 2147483647
##$PPRESOL= 1
##$PSCAL= 4
##$PSIGN= 0
##$PYNMP= <proc.py>
##$REVERSE= no
##$SF= 400.02
##$SI= 32768
##$SIGF1= 0
##$SIGF2= 0
##$SINO= 400
##$SIOLD= 32768
##$SPECTYP= <>
##$SREGLST= <1H.CDCl3>
##$SSB= 0
##$STSI= 32768
##$STSR= 0
##$SW_p= 8223.68421052631
##$SYMM= 0
##$S_DEV= 0
##$TDeff= 65536
##$TDoff= 0
##$TI= <>
##$TILT= no
##$TM1= 0
##$TM2= 0
##$TOPLEV= 0
##$USERP1= <user>
##$USERP2= <user>
##$USERP3= <user>
##$USERP4= <user>
##$USERP5= <user>
##$WDW= 1
##$XDIM= 32768
##$YMAX_p= 449074747
##$YMIN_p= -801886
##$CURPLOT= <Network HP LaserJet P1505>
##$CURPRIN= <$Network HP LaserJet P1505>
##$DFORMAT= <normdp>
##$LAYOUT= <+/1D_H.xwp>
##$LFORMAT= <normlp>
##$PFORMAT= <normpl>
##$SURQMSG= 1
$$ End of Bruker specific parameters
$$ ---------------------------------
##NTUPLES= NMR SPECTRUM
##VAR_NAME=  FREQUENCY,     SPECTRUM/REAL,   SPECTRUM/IMAG
##SYMBOL=    X,             R,               I
##VAR_TYPE=  INDEPENDENT,   DEPENDENT,       DEPENDENT
##VAR_FORM=  AFFN,          ASDF,            ASDF
##VAR_DIM=   32768,         32768,           32768
##UNITS=     HZ,            ARBITRARY UNITS, ARBITRARY UNITS
##FACTOR=    0.250966925370066, 1,           1
##FIRST=     8223.43324360094, 26324,        39712
##LAST=      0,             125258,          -89743
##MIN=       0,             -801886,         0
##MAX=       8223.43324360094, 449074747,    0
$$ Real data points
##PAGE= N=1
##DATA TABLE= (X++(R..R)), XYDATA
$$ [...]
19574b78815J4021O0118i1586C0618i5892j43533J7939N0989B5705K62449F9164
$$ -278815 -264794 -204676 -91586 30618 -95892 -239425 -221486 -170497 25705 288154 69164
19562a79790E6346c79393A62618c9918I3880N1298a94446j15535a36131G2077
$$ -179790 56346 -379393 162618 -39918 93880 145178 -194446 -309981 -136131 72077
19551a80446A48188i8135G9313j0337h1995m8359k0297l37581a58297e7415a6878
$$ -180446 148188 -98135 79313 68976 -81995 -130354 -150651 -488232 -158297 -57415 -16878
19539I0234N8655c1664B0192K85807f8148j99169J29907A25933b57053F3646J1007
$$ 90234 148889 -31664 20192 305999 -68148 -267317 -137410 125933 -257053 63646 74653
19528G4653a66939L4128j4431I4952c45933e1010A89582A1143J7995K09422I0765
$$ 74653 -166939 -132811 -147242 94952 -345933 -51010 189582 11143 29138 238560 90765
19516A39896L2897k8086a44430d757j21388d3512o3213K7378E1190J11917A0176
$$ 139896 172793 144707 -144430 -4757 -126145 -43512 -106725 -79347 51190 163107 10176
19504h8727j96349m7740e4526r4427I4015a01883b5196k3571A24006b9124A47251
$$ -88727 -285076 -332816 -54526 -148953 94015 -101883 -25196 -48767 124006 -29124 147251
19492f4667A17989b89345m7545I7623d09718A74554b71270A24791a20299G0331
$$ -64667 117989 -289345 -336890 97623 -409718 174554 -271270 124791 -120299 70331
19481i0964A8421f6669l3674j56913R1262P8578G1034a82984f9700k60627i3446
$$ -90964 18421 -66669 -100343 -257256 -165994 -87416 71034 -182984 -69700 -330327 -93446
19469a05466b9222l61923B9367g6689D40322E6761P6180h9771j33091O4942A73872
$$ -105466 -29222 -391145 29367 -76689 440322 56761 132941 -89771 -222862 -157920 173872
19457B3019a50189K8714l4841G1089L7137c06788a44962A5802b159l24636Q5503
$$ 23019 -150189 -121475 -156316 71089 108226 -306788 -144962 15802 -2159 -326795 -241292
19446b41292B90195A02132a09503B33313H2003c1315k22796a10943j9264M5802
$$ -241292 290195 102132 -109503 233313 82003 -31315 -254111 -110943 -130207 -84405
19436h4405E0147a00157C42708B4580c05127C09896b27789A85936h5936j09508
$$ -84405 50147 -100157 342708 24580 -305127 309896 -227789 185936 -85936 -195444
19426a95444B10870C3621P4668d05618i3312F5547c12361c8831D0886J4310a97594
$$ -195444 210870 33621 108289 -405618 -93312 65547 -312361 -38831 40886 55196 -197594
19414a83898A93223c69270e0169E7770J54032c1449G9182B7990f606j98176n6445
$$ -183898 193223 -369270 -50169 57770 211802 -31449 79182 27990 -6606 -204782 -261227
19403b61227K2542O2676P7478l20245c4005A5359b7760n7404j82969d6316m0887
$$ -261227 -238685 -176009 -98531 -418776 -34005 15359 -27760 -85164 -268133 -46316 -87203
19392h7203A79545J00177a7632j29853a0716A18496b05769K0572j4167P4635F0714
$$ -87203 179545 279722 -17632 -147485 -10716 118496 -205769 -185197 -199364 -124729 60714
19380c48015f0462A08149D6394c20599J25590A10658D9826b87008i4424l9504
$$ -348015 -60462 108149 46394 -320599 -195009 110658 49826 -287008 -94424 -133928
19370a33928k04672A31818b09296D0944b56770a05196B2298J25213a07580E4651
$$ -133928 -338600 131818 -209296 40944 -256770 -105196 22298 147511 -107580 54651
19359F0799h7103A67939c19567l9428a14684o7069d1725j13765Q296m5313L5915
$$ 60799 -87103 167939 -319567 -358995 -114684 -181753 -41725 -155490 -147194 -192507 -156592
19348a56592A91J9006e2740j84033J04296H4135d82564A72027a84856H9595D3200
$$ -156592 191 19197 -52740 -236773 -132477 84135 -482564 172027 -184856 89595 43200
19336a91011j67333C67507h8837F8596g9214L3364p0030B03635a51723N6317A50236
$$ -191011 -358344 367507 -88837 68596 -79214 -45850 -115880 203635 -151723 -95406 150236
19324a87936q9346J13207b0392A89769a35706A37666C0124L8842J1814f1013k70669
$$ -187936 -277282 -164075 -20392 189769 -135706 137666 30124 68966 80780 -61013 -331682
19313c31682a12448J1388G0496N8794c34701M6604A18788i0564J7903r3576C55006
$$ -331682 -112448 -101060 70496 129290 -334701 -288097 118788 -90564 -72661 -166237 355006
19301D2180c23389f9703j07086j12790B77311b34848a02746c5490B2064b86518
$$ 42180 -323389 -69703 -176789 -289579 277311 -234848 -102746 -35490 22064 -286518
19290A11494a570l61428A4134b1717F1263b43104D7375e7869D01264i1813A71921
$$ 111494 -1570 -362998 14134 -21717 61263 -243104 47375 -57869 401264 -91813 171921
19278c57508A17839B3609e0122r6161k5711A87718A3288R3061k3400a23258j08864
$$ -357508 117839 23609 -50122 -146283 -171994 187718 13288 106349 82949 -123258 -232122
19267b32122P1829g4475N682Q616b9672o8129F2159b21582a03239l78185c8088
$$ -232122 -160293 -74475 -68793 -60177 -29672 -97801 62159 -221582 -103239 -481424 -38088
19255A48914a69785I8472B6704J0022O8811c5609J1546A47857d3299m262C66929
$$ 148914 -169785 98472 26704 36726 105537 -35609 -24063 147857 -43299 -47561 366929
19243a89611d6684k16532a06877A30416a30511A24690h9034E0430B2869g2480
$$ -189611 -46684 -263216 -106877 130416 -130511 124690 -89034 50430 22869 -72480
19232e1632e822j42875f6549a6419K193A14868C652f414k54833J22343l4464A26002
$$ -51632 -5822 -148697 -66549 -16419 -14226 114868 3652 -6414 -261247 -138904 -173368 126002
19219c2471j15535c0240j05547c394p521n8003a9970B2583e57273f4256d52k55370
$$ -32471 -148006 -30240 -135787 -3394 -10915 -68918 -19970 22583 -557273 -64256 -452 -255822
19207b55822A09230l3521J01829g6271k39524F1972c32412j72339G3445b09974
$$ -255822 109230 75709 177538 -76271 -315795 61972 -332412 -504751 73445 -209974
19196a42328o1612b4590l78539J29749A74888c88539C20274M7774f9491J2435
$$ -142328 -203940 -24590 -403129 -273380 174888 -388539 320274 368048 -69491 -57056
19186e7056k39582B80660A2333b3517q2832d0308r1701A5236e04130a21896D1195
$$ -57056 -296638 280660 12333 -23517 -106349 -40308 -132009 15236 -504130 -121896 41195
19174c5380j85615E0757i9461n1193c1270m1366A9872K6671a62575A30734J22763
$$ -35380 -220995 50757 -99461 -150654 -31270 -72636 19872 46543 -162575 130734 253497
19163B53497G1249b95917d5421k2563c257A52068C0682a74147j60419A68553b47187
$$ 253497 71249 -295917 -45421 -67984 -3257 152068 30682 -174147 -334566 168553 -247187
19151A68217n2152l9055J21361i8238j0003B00460M250d17004A09402N6216n3866
$$ 168217 116065 77010 198371 -98238 -108241 200460 204710 -417004 109402 165618 111752
19140A11752e2262k9646A43323J2204D4963h0575B24988J4348a8625r237G0197
$$ 111752 -52262 -81908 143323 155527 44963 -80575 224988 239336 -18625 -27862 70197
19128A78675a67995B80070d5085k94043k80312b08884J2855L1815A27554J5340
$$ 178675 -167995 280070 -45085 -339128 -619440 -208884 -196029 -164214 127554 142894
19118A42894c08370A43608i7597B32037i7050L3367j01205A35699d423k13280
$$ 142894 -308370 143608 -97597 232037 -97050 -63683 -164888 135699 -4423 -217703
19108b17703f0547I4105B8621O2311b45431H669K5856M3982a7474B10496a67515
$$ -217703 -60547 94105 28621 90932 -245431 8669 34525 78507 -17474 210496 -167515
19096A38134a8174j47824g6930L2247l7050k7389A68677h7425j42434C7216A3607
$$ 138134 -18174 -165998 -76930 -44683 -81733 -109122 168677 -87425 -229859 37216 13607
19084D7157N8640a1936r2064k01536O3027A11773d855B31850a1755n8760A20682
$$ 47157 105797 -11936 -104000 -305536 -242509 111773 -4855 231850 -11755 -70515 120682
19072a58535f2625j39771d7187j86396l2016B83671g6814B8000a31437k3424F9988
$$ -158535 -62625 -202396 -47187 -233583 -265599 283671 -76814 28000 -131437 -154861 69988
19060F9233f217l7693B23084D5164a35535b2642B2850a43343j70642f5526A71773
$$ 69233 -6217 -43910 223084 45164 -135535 -22642 22850 -143343 -313985 -65526 171773
19048E4872a29989k29493a39400j74007g7747A6649a00295A58157a02115C8287
$$ 54872 -129989 -359482 -139400 -313407 -77747 16649 -100295 158157 -102115 38287
19037c31843G8155B3190d6836A01159L0625K449h9222j55927B3676K30886j23284
$$ -331843 78155 23190 -46836 101159 131784 134233 -89222 -245149 23676 254562 131278
19026A31278f1466B35576a8193m3127E0950a57352I4435N1339P6698a05249r536
$$ 131278 -61466 235576 -18193 -61320 50950 -157352 94435 145774 222472 -105249 -114785
19015a14785I4551b8781j04923M7697F1717b40622E7102c4817A14256b0052A31839
$$ -114785 94551 -28781 -133704 -86007 61717 -240622 57102 -34817 114256 -20052 131839
19003a24609r4752A27596g5106A10605L8103b76217i3534l38879C40158I848a07067
$$ -124609 -219361 127596 -75106 110605 148708 -276217 -93534 -432413 340158 9848 -107067
18991f9214c4273B2830R8319B0418a36581B63813b89027Q9802B44388f7952j13928
$$ -69214 -34273 22830 121149 20418 -136581 263813 -289027 -199225 244388 -67952 -181880
18980a81880j418P9600b3846B4960Q9719a00632A35683c2131l2174j28908d1296
$$ -181880 -183298 -103698 -23846 24960 114679 -100632 135683 -32131 -64305 -193213 -41296
18968A43307n6278L8838a78510H0821b96746A32336m9141c12362I1812J16305
$$ 143307 87029 125867 -178510 80821 -296746 132336 83195 -312362 91812 208117
18958B08117d9315N612F270K92037a03382K1479r5243m1956A09698b604F5287
$$ 208117 -49315 -43703 6270 298307 -103382 -81903 -177146 -219102 109698 -2604 65287
18946e351j38028A11673a27470E15716c14687a17379A2685K58806g9783C51661
$$ -5351 -143379 111673 -127470 515716 -314687 -117379 12685 271491 -79783 351661
18935b28150A32596c0277k87877J28686A8538a2411j22431p215B497a98370d6867
$$ -228150 132596 -30277 -318154 -189468 18538 -12411 -134842 -142057 2497 -198370 -46867
18923g866A5333a17243C89404a50478c7595A05352a54060F3883a15513E1329J06443
$$ -7866 15333 -117243 389404 -150478 -37595 105352 -154060 63883 -115513 51329 157772
18912A57772K1185b76809e1194k60647B15524a32942n4299A96865b8637B3078
$$ 157772 178957 -276809 -51194 -311841 215524 -132942 -187241 196865 -28637 23078
18901a92984j16455A16241d41011a90430f6091n7309D5153a06635A40366J36907
$$ -192984 -309439 116241 -441011 -190430 -66091 -123400 45153 -106635 140366 277273
18891B77273D1817b41593B19313P3549a95131e4653m562E3105a06647C6108d5364
$$ 277273 41817 -241593 219313 292862 -195131 -54653 -59215 53105 -106647 36108 -45364
18879c32013a22269d7363M516l2489A80P1786J01504D7196c21127i6970B10065
$$ -332013 -122269 -47363 -42847 -75336 180 71966 173470 47196 -321127 -96970 210065
18867F7065D669a1107H3917a20439B54366a51916E6560J2933c53260H269L2544
$$ 67065 4669 -11107 83917 -120439 254366 -151916 56560 69493 -353260 8269 40813
18856D0813a40324j56953G4738J26990J84332A67502b71684B01005N7580G0251
$$ 40813 -140324 -297277 74738 201728 386060 167502 -271684 201005 258585 70251
18845I3517b17190O886A55677a06753l06031B12986C5091L0132a64660o2227J07329
$$ 93517 -217190 -210304 155677 -106753 -412784 212986 35091 65223 -164660 -226887 -119558
18834a19558A00820a60329j50306d0847j01564A19296l492N7066d6891K0897a102
$$ -119558 100820 -160329 -310635 -40847 -142411 119296 115804 172870 -46891 -25994 -1102
18822a56009q7397J07702A0430P8673f49B50765G1884i4707B25269Q1418j39966
$$ -156009 -243406 -135704 10430 89103 -649 250765 71884 -94707 225269 306687 166721
18811A66721K7484K58661a01509b4174B10684g1384D21688f3190l54228C9100
$$ 166721 194205 452866 -101509 -24174 210684 -71384 421688 -63190 -417418 39100
18800f7756j41302k12400J75861n3184H9093a458B2843b90732H3512i1351j9470
$$ -67756 -209058 -421458 -245597 -298781 89093 -1458 22843 -290732 83512 -91351 -110821
18789a10821o1025A87747a80451B53297c58926J12733d7166B046a2870B6779F406
$$ -110821 -171846 187747 -180451 253297 -358926 -246193 -47166 2046 -12870 26779 6406
18777f0423k47294a3741B11448C4802J14549i1544B0647i0288l2720A09849a33403
$$ -60423 -307717 -13741 211448 34802 149351 -91544 20647 -90288 -123008 109849 -133403
18765b67557M4751h1451C6675d68213f676k64I2105j7730k1702a39976l8256h8818
$$ -267557 -222806 -81451 36675 -468213 -6676 -6940 92105 74375 52673 -139976 -178232 -88818
18752A69459a2413l094B88714c73539c3039k33668B29987c16817O5091e2099H2849
$$ 169459 -12413 -15507 288714 -373539 -33039 -266707 229987 -316817 -251726 -52099 82849
18740B14080a08868m8473B24737b30249B99591c30503a03341j22872l6612I166
$$ 214080 -108868 -157341 224737 -230249 299591 -330503 -103341 -226213 -262825 9166
18729F7611a58723F3358J35476r436i1553q0077Q4002l14741a06714G1753c836
$$ 67611 -158723 63358 198834 189398 -91553 -171630 -87628 -402369 -106714 71753 -3836
18717D3807P7852b23651A39250m7351a1713j11399A31687b06054B26842f9223
$$ 43807 121659 -223651 139250 91899 -11713 -123112 131687 -206054 226842 -69223
18706b71112G1494B9578b19803o8938A01892b00910F0029a17095p6080B32373
$$ -271112 71494 29578 -219803 -288741 101892 -200910 60029 -117095 -193175 232373
18695A62305b56288q0105a46988A0386c9542j89752D6866J23409a11899k5999
$$ 162305 -256288 -336393 -146988 10386 -39542 -229294 46866 170275 -111899 -137898
18685a37898j30109p3780g3505J7784k72592B24971e907j8569j97477I1389a0021
$$ -137898 -268007 -341787 -73505 -55721 -328313 224971 -5907 -24476 -221953 91389 -10021
18673A35092i7499C4008Q7051b25959R8771o1721d4333m51568c2192p9374F4641
$$ 135092 -97499 34008 121059 -225959 -127188 -188909 -44333 -495901 -32192 -111566 64641
18661a24240j47813A43360E7659c637k3563j86683B81100o2955b20326g6317j93472
$$ -124240 -272053 143360 57659 -3637 -27200 -213883 281100 218145 -220326 -76317 -269789
18650b69789O2894A62125C9476J942i649C96351p5173j17203b08216N5488n5022
$$ -269789 -206895 162125 39476 41418 -9649 396351 321178 203975 -208216 -152728 -207750
18639b07750n8628q4019f3961l24427B95723c08695B29325g1215A0203c2145B9742
$$ -207750 -266378 -350397 -63961 -388388 295723 -308695 229325 -71215 10203 -32145 29742
18627a16869m7841d4606O795j17905k33190F9189J44719h3731A39420M9886Q880
$$ -116869 -164710 -44606 -37811 -155716 -388906 69189 213908 -83731 139420 189306 198186
18616A98186H997b20577B52609i3480b161j09512A05338J2464N4346J3304c87696
$$ 198186 8997 -220577 252609 -93480 -2161 -111673 105338 117802 172148 185452 -387696
18604a77034K1866A09924m3509a23125H9880h3740B2376a72816p5020p0517F0247
$$ -177034 -155168 109924 66415 -123125 89880 -83740 22376 -172816 -247836 -318353 60247
18592B75954i8986D0091c46761D3448N5895a58696J5238D7475a40684c5617B71260
$$ 275954 -98986 40091 -346761 43448 99343 -158696 -143458 47475 -140684 -35617 271260
18580A49750a5090C5739J47350a25927n5864A8732K04103d8815m8471G6309O9166
$$ 149750 -15090 35739 183089 -125927 -181791 18732 222835 -48815 -97286 76309 145475
18569A45475F4782a3988j98588o4796F6837c11209H9359a11616A1445Q459K05192
$$ 145475 64782 -13988 -212576 -277372 66837 -311209 89359 -111616 11445 19904 225096
18558B25096J95365b13516e3838a0011j47774B98616a52298g4784B1846H00d20895
$$ 225096 420461 -213516 -53838 -10011 -157785 298616 -152298 -74784 21846 800 -420895
18546C084i1063A33616d05128D8568a38944K6439n9191f7382j06772M2601M5363
$$ 3084 -91063 133616 -405128 48568 -138944 -112505 -171696 -67382 -174154 -131553 -86190
18535h6190j5457D47240I4196a46168k013o4427E4000j1073K2926a42232C2604
$$ -86190 -101647 447240 94196 -146168 -148181 -212608 54000 42927 65853 -142232 32604
18523A52907a29072j49265a07849k0089A70465a93581c0760k22860h4113b7977
$$ 152907 -129072 -278337 -107849 -127938 170465 -193581 -30760 -253620 -84113 -27977
18512A5189K4276J31888E6941a60505N4381A87748a78062P8490G2218k3108E99
$$ 15189 39465 171353 56941 -160505 -106124 187748 -178062 -99572 72218 49110 599
18500f5364k48157h0194K8791j5462j40981A2754b34850G564J86292l6319a15231
$$ -65364 -313521 -80194 -51403 -66865 -207846 12754 -234850 7564 193856 157537 -115231
18488B12701a04869j65266C4266g27B62470a14160H0600f0501n0332K723B36037
$$ 212701 -104869 -270135 34266 -727 262470 -114160 80600 -60501 -110833 -108110 236037
18476d1733m1974m03575G2578a93670R5858A59155c61528D42683B20882b28509
$$ -41733 -83707 -487282 72578 -193670 -97812 159155 -361528 442683 220882 -228509
18465a46145l7983r8268a10064P658A16402b22695A69990a27895G6402J9576m1921
$$ -146145 -184128 -282396 -110064 -102406 116402 -222695 169990 -127895 76402 95978 54057
18454E4057P0059C070i830A15019J50297c36315F1167a41888d8616A72433c7216
$$ 54057 124116 3070 -9830 115019 265316 -336315 61167 -141888 -48616 172433 -37216
18442A58645a72180C43828K823a89189b2044l44617a78217M4492j98905J28669
$$ 158645 -172180 343828 346651 -189189 -22044 -366661 -178217 -133725 -332630 -203961
18432b03961C0759a41140G240a4799k8018j7435b3212j27803I8392e2371C63017
$$ -203961 30759 -141140 7240 -14799 -42817 -60252 -23212 -151015 98392 -52371 363017
18420B8441N2369K5885P2104c699n8096J4476J3689j35437E4662J87695i6185
$$ 28441 80810 106695 178799 -3699 -61795 -47319 -33630 -169067 54662 242357 -96185
18408I6645c49953O4203l3259A37065M8555q8912m4681d9083j54668A72435F520
$$ 96645 -349953 -285750 -319009 137065 185620 96708 52027 -49083 -203751 172435 6520
18396C52931j17647F8331g9768A77617b60908N9078A08227a52357c4501D0316
$$ 352931 235284 68331 -79768 177617 -260908 -201830 108227 -152357 -34501 40316
18385a31542f1582D5644K8985a54177L8268b5252k03150A48508K20742b57482
$$ -131542 -61582 45644 74629 -154177 -115909 -25252 -228402 148508 369250 -257482
18374H7731a10758j02474h376o7227A55870D5882c30560A19050M4759C2759J857
$$ 87731 -110758 -213232 -8376 -75603 155870 45882 -330560 119050 163809 32759 34616
18363C4616i0197j07706M8168P468B33902K50341I624J19491a90421I4894B4362
$$ 34616 -90197 -197903 -149735 -142267 233902 484243 9624 129115 -190421 94894 24362
18351D409c22237i9420A40567J19861a45989j04142P6208k04758J34553d7669
$$ 4409 -322237 -99420 140567 260428 -145989 -250131 -173923 -378681 -244128 -47669
18340i6522j45058Q1758I7424l8805n508a85468O0204j12018j29253a33235r9166
$$ -96522 -241580 -159822 97424 58619 53111 -185468 -125264 -237282 -366535 -133235 -232401
18329b32401d9845m4742E8859K5628B308c9289j81268A26237a68132L1687F2697
$$ -232401 -49845 -94587 58859 84487 2308 -39289 -220557 126237 -168132 -136445 62697
18317A54486r520B7413b62309b570j9697A00419a04566c670l11969a4987p0163
$$ 154486 144966 27413 -262309 -2570 -22267 100419 -104566 -3670 -315639 -14987 -85150
18306h5150q6106k5819g4877A0045L19636E2179M7814h4409j02432A76686E4345
$$ -85150 -171256 -197075 -74877 10045 329681 52179 99993 -84409 -186841 176686 54345
18294b21676J510c957j63055O0310p1721Q8960j39856A24351a73438O7749k06096
$$ -221676 -220166 -3957 -167012 -106702 -178423 -89463 -229319 124351 -173438 -105689 -311785
18283c11785a3045B80798I4817h3329I2795j6040b445B06340b59159G1655J59187
$$ -311785 -13045 280798 94817 -83329 92795 76755 -2445 206340 -259159 71655 230842
18272B30842F8158g1573j64313c7405A35783E4984a50915b4284j02674A58800
$$ 230842 68158 -71573 -235886 -37405 135783 54984 -150915 -24284 -126958 158800
18261d13277B84998B2004h6624B21645a82177A1046N18L9010d8948a3141j09025
$$ -413277 284998 22004 -86624 221645 -182177 11046 11564 50574 -48948 -13141 -122166
18250a22166k66298J71461B48440b17770Q9077m848k7662G7432b79501a14410
$$ -122166 -388464 -217003 248440 -217770 -128693 -133541 -161203 77432 -279501 -114410
18239F6459a54388d0573A278P0481a45523A17396g1292k67932a05070A04186J8894
$$ 66459 -154388 -40573 1278 71759 -145523 117396 -71292 -339224 -105070 104186 123080
18228A23080b44128l1714A70584a74544c022C3951c4233o3969g1j84672g8158
$$ 123080 -244128 -275842 170584 -174544 -3022 33951 -34233 -98202 -71 -184743 -78158
18216b91848k1893a49250c1100A69834B2947b70963I1270b48790B24503d3786
$$ -291848 -313741 -149250 -31100 169834 22947 -270963 91270 -248790 224503 -43786
18205c07171f5705G5212a37586B76916c08951B23328c1933B90439c76535C18009
$$ -307171 -65705 75212 -137586 276916 -308951 223328 -31933 290439 -376535 318009
18194f1304j30197A40907b34608c6k39695J09665A98532P0690b32531l5670B09205
$$ -61304 -191501 140907 -234608 -36 -239731 -130066 198532 269222 -232531 -268201 209205
18182g2508K2878H3984g7223G775a87332A352N7504d0367G1731b8919l81020a47199
$$ -72508 -49630 83984 -77223 7775 -187332 1352 58856 -40367 71731 -28919 -409939 -147199
18169d64169A44389a10432e4813J656J8005j6638E9541d9206A13758b35266c1645
$$ -464169 144389 -110432 -54813 -53157 -35152 -51790 59541 -49206 113758 -235266 -31645
18157c81505F8030K35265A24277d08807E7632f5161A3932R481b65340G3576b03
$$ -381505 68030 303295 124277 -408807 57632 -65161 13932 23413 -265340 73576 -203
18145a59904D79073a71032h4813B0145b04797R8328k78770J32667j433B78446
$$ -159904 479073 -171032 -84813 20145 -204797 -106469 -385239 -252572 -254005 278446
18134C1206d49788K6812A116J18962d680r1707n174A94596i8535A48525B2661
$$ 31206 -449788 -422976 1116 120078 -4680 -96387 -101561 194596 -98535 148525 22661
18122a17737E3071e813p6504B46331d0219p5595d5341j69251E2415a73194f1536
$$ -117737 53071 -5813 -82317 246331 -40219 -115814 -45341 -214592 52415 -173194 -61536
18110f4125b1001C36743F6338C700J51363F46c6987A11245a5200D0343a20335
$$ -64125 -21001 336743 66338 3700 155063 646 -36987 111245 -15200 40343 -120335
18098B2751h1873A63961O5155m2874F7930a18920B54190b48408g9879A27703B5582
$$ 22751 -81873 163961 229116 186242 67930 -118920 254190 -248408 -79879 127703 25582
18086A52727D5837J13320m9676l6810c04726D79737e741j20733B9858a88638j32635
$$ 152727 45837 159157 109481 72671 -304726 479737 -5741 -126474 29858 -188638 -321273
18075c21273k3156G6083c84809A83038B6390J48978m4518Q7122C0242a61674J9597
$$ -321273 -344429 76083 -384809 183038 26390 175368 130850 217972 30242 -161674 -142077
18064a42077p7767C70508o4204b33943P8485A98129a5315A73773a3346r9573C03218
$$ -142077 -219844 370508 306304 -233943 -155458 198129 -15315 173773 -13346 -112919 303218
18052a33395m12B79715j19895k4764b96582B61284k3156K0710Q0406G1719a91036
$$ -133395 -133807 279715 159820 135056 -296582 261284 238128 258838 339244 71719 -191036
18040A98344I4569c67123A34590a12928k0245D9333b27253a2956C4320a5361B80385
$$ 198344 94569 -367123 134590 -112928 -133173 49333 -227253 -12956 34320 -15361 280385
18028d67253a68015A07416a19494M9614k50517j5305a0888j39663G5268a81722
$$ -467253 -168015 107416 -119494 -69880 -320397 -335702 -10888 -150551 75268 -181722
18017B17338P7242g5221A07754M0107f9820m3855B31118a84734d2719E1054g8446
$$ 217338 294580 -75221 107754 147861 -69820 -113675 231118 -184734 -42719 51054 -78446
18005b08178A78868c61151B9362M2390c8511j26642I6300d7297l24817a21456
$$ -208178 178868 -361151 29362 71752 -38511 -165153 96300 -47297 -372114 -121456
17994B96749j17044b04985C9439b3956a351j84017C2615J83631F2724k0815b77828
$$ 296749 179705 -204985 39439 -23956 -1351 -185368 32615 216246 62724 41909 -277828
17982B56248a04797n5223F5878a90650C32617g9822A48113f2093f626l2094j18519
$$ 256248 -104797 -160020 65878 -190650 332617 -79822 148113 -62093 -6626 -38720 -157239
17971a57239A33501F2308b53259F2268a8230j48456l0785D185a93042C22004A01785
$$ -157239 133501 62308 -253259 62268 -18230 -166686 -197471 4185 -193042 322004 101785
17959b74693H5134J3583a17533L0660G9166e8625j82976B62044f6678j93379a5250
$$ -274693 85134 98717 -117533 -86873 79166 -58625 -241601 262044 -66678 -260057 -15250
17947c7420A115a41279A76831o6360c87466a45465M97A56304a28081A79951J92865
$$ -37420 1115 -141279 176831 110471 -387466 -145465 -144968 156304 -128081 179951 372816
17936C72816j49574a33556H4078M9143E4079L6889a03268A28107a56870j11187
$$ 372816 223242 -133556 84078 133221 54079 90968 -103268 128107 -156870 -268057
17926b68057i4675r1277i846F5699a74344A9815M047a5670A52510L08432B9979
$$ -268057 -94675 -185952 -9846 65699 -174344 19815 23862 -15670 152510 460942 29979
17914B61946A21742a04624A18836c8845j73876a4218A37191h2776F0058N9044
$$ 261946 121742 -104624 118836 -38845 -212721 -14218 137191 -82776 60058 119102
17904A19102i6621K5845A6623J53095K65520A53596A4547a66621k7582d5816F9607
$$ 119102 -96621 -70776 16623 169718 435238 153596 14547 -166621 -194203 -45816 69607
17892C9760R2668J30186B127o04K61680b28483c9825D9916a75712H1409K67300
$$ 39760 132428 262614 2127 1523 263203 -228483 -39825 49916 -175712 81409 348709
17881C48709A48654B9792K06507a84660B09284a01886b6992q3355c8550j72257
$$ 348709 148654 29792 236299 -184660 209284 -101886 -26992 -110347 -38550 -210807
17871b10807D1888e7111Q566n608E8721e8636B1J62221a53758n5396h3508K8013
$$ -210807 41888 -57111 -48545 -54153 58721 -58636 21 162242 -153758 -209154 -83508 -55495
17859e5495g880A65814i6236k67065A34545g7888B02557a25623k67M3797d0519
$$ -55495 -7880 165814 -96236 -363301 134545 -77888 202557 -125623 -125890 -82093 -40519
17847D53762e5291F6387b80866e2096A40987a57A63127n2350c8703p2332A78090
$$ 453762 -55291 66387 -280866 -52096 140987 -157 163127 110777 -38703 -111035 178090
17835h8309r958L7186B99614b08477d4579B55059L8197I1316c66589f6451I6995
$$ -88309 -98267 -61081 299614 -208477 -44579 255059 293256 91316 -366589 -66451 96995
17823A67396e382j41730O1507C6335R3308i4546M527j10583R1973m5103A83541
$$ 167396 -5382 -147112 -85605 36335 129643 -94546 -90019 -200602 -108629 -153732 183541
17811b57204A90039p0611a83060I6596a68966A2871J04037k6162h4395k1650a7173
$$ -257204 190039 119428 -183060 96596 -168966 12871 116908 90746 -84395 -106045 -17173
17799i3329j76692A39927f1824l6794a0948k34885e5803A8580K64211a16552A54379
$$ -93329 -270021 139927 -61824 -98618 -10948 -245833 -55803 18580 282791 -116552 154379
17787f5112j01543D9359J65628b09803o0133o0848I6169f5960N537D19b84882
$$ -65112 -166655 49359 214987 -209803 -269936 -330784 96169 -65960 -60423 419 -284882
17775A234J33561A9248a06983k15504f0418j93349B96505j00286b8307o0068K0775
$$ 1234 134795 19248 -106983 -322487 -60418 -253767 296505 196219 -28307 -88375 -67600
17764f7600G2144M7377l732N3851j418b01057R6709K4112B07443M7984m3867b58256
$$ -67600 72144 119521 115789 169640 168222 -201057 -104348 -80236 207443 255427 211560 -258256
17751B40803m0252m1758a03203C872f9304A32720a83787B6615a00473j02611l1213
$$ 240803 200551 158793 -103203 3872 -69304 132720 -183787 26615 -100473 -203084 -234297
17740b34297N7942C91344j19530c42354E4888e31235A9936K50489n3751i373k49842
$$ -234297 -176355 391344 271814 -342354 54888 -531235 19936 270425 216674 -9373 -259215
17729b59215e0461D7537L6359a21685k61902A50645b3496C65107d77610a26541
$$ -259215 -50461 47537 83896 -121685 -383587 150645 -23496 365107 -477610 -126541
17718B10925C5540e08151G0403a07728M5877B17214F7859Q0371d7926k3383j3790
$$ 210925 35540 -508151 70403 -107728 -61851 217214 67859 148230 -47926 -71309 -85099
17707h5099A0112g4684D4572J33944d6239k10442A07422C4103N3606i3253e319
$$ -85099 10112 -74684 44572 178516 -46239 -256681 107422 34103 87709 -93253 -5319
17695h2753C06690P5795a28581B16114A8021L38358b90143K9084A69690e1779
$$ -82753 306690 382485 -128581 216114 18021 356379 -290143 -261059 169690 -51779
17684a49628g1834B7522d35399A46912a72800j8644j89C29789A47457c20444B57389
$$ -149628 -71834 27522 -435399 146912 -172800 -191444 -191633 329789 147457 -320444 257389
17672a64147B77405I6678C6677K61034a8659A859L191K35666A11369M6204a49412
$$ -164147 277405 96678 36677 297711 -18659 1859 5050 240716 111369 157573 -149412
17660F6398b09635j1652A60722f4585j82053A55939J84344c90823Q1161C9513
$$ 66398 -209635 -221287 160722 -64585 -246638 155939 340283 -390823 -309662 39513
17649C30225i5697m0246D62235A19083K9907K5516B736J84913D8846J49857B8677
$$ 330225 -95697 -135943 462235 119083 148990 174506 2736 187649 48846 198703 28677
17637b11725D6830j8088e3248E342g2264A69703K52398b92C53641A00767L628
$$ -211725 46830 28742 -53248 5342 -72264 169703 422101 -292 353641 100767 104395
17626A04395a97299D7700c92127A30408E5063L55167C7599C657f1136j13243a0065
$$ 104395 -197299 47700 -392127 130408 55063 410230 37599 3657 -61136 -174379 -10065
17614c8512D43304M5498B16294I7992K72a42280H3284b66259E9425B2657b88488
$$ -38512 443304 488802 216294 97992 98264 -142280 83284 -266259 59425 22657 -288488
17602D2810b12490H2105J0381K67648h3858A20340c03911B68657A4906a57884
$$ 42810 -212490 82105 92486 360134 -83858 120340 -303911 268657 14906 -157884
17591B98243a63535B2472J70764i9756A68676f9639G0369c16728A86582J25638
$$ 298243 -163535 22472 193236 -99756 168676 -69639 70369 -316728 186582 312220
17581C12220I5863c3171A50686e9515k70407G5970R3386o4387l2183L370K3273
$$ 312220 95863 -33171 150686 -59515 -329922 75970 169356 104969 72786 76156 99429
17570I9429a51873C32300C7402a61807B06366a15857c8764C59522A03207H506
$$ 99429 -151873 332300 37402 -161807 206366 -115857 -38764 359522 103207 8506
17559a29146D1093L25325A5914K9280Q6875L3006J43296C769L5079R799j2797
$$ -129146 41093 366418 15914 45194 132069 165075 308371 3769 38848 48647 35850
17548C5850i8054A06312D7194K39966K4270A0786L80189b8835E4254L6940j3311
$$ 35850 -98054 106312 47194 287160 311430 10786 390975 -28835 54254 91194 77883
17537G7883J79552h5002B5819R3857g9759E2168J58151k8111d0475B8656J87707
$$ 77883 257435 -85002 25819 119676 -79759 52168 210319 182208 -40475 28656 216363
17526B16363A0618J00846M6207b25663C19092A39738D6056m142a18288F9415J16037
$$ 216363 10618 111464 157671 -225663 319092 139738 46056 41914 -118288 69415 185452
17515A85452J08992h0139r0010J0185A97415d1812r5652A91365m455a82662A35383
$$ 185452 294444 -80139 -170149 -159964 197415 -41812 -137464 191365 186910 -182662 135383
17503b21445I3280J22399c8684j269G2187K69791K18109C0936a25256D6806N7927
$$ -221445 93280 215679 -38684 -39953 72187 341978 560087 30936 -125256 46806 104733
17492A04733m4412h7476E2090a81713B4269C18K41572m6640R8375F9120P3979
$$ 104733 60321 -87476 52090 -181713 24269 318 241890 195250 293625 69120 143099
17481A43099J63335G4757b31822D4987J28096d5425B68737r9538a69216A12746
$$ 143099 306434 74757 -231822 44987 173083 -45425 268737 169199 -169216 112746
17470B0511a38607n4579A4592Q6251c0604A23968J01338O6533A26197J72872F3147
$$ 20511 -138607 -193186 14592 100843 -30604 123968 225306 291839 126197 299069 63147
17458B1771J90211J20827q6173j3106H9296K70853p4137j7355j20180j3808a42230
$$ 21771 211982 332809 246636 233530 89296 360149 286012 268657 148477 134669 -142230
17446A60583K60004J4015j09041j56449f6860B24014j11033K7765J35945c2922
$$ 160583 420587 434602 325561 169112 -66860 224014 112981 140746 276691 -32922
17435A53952n870K19945Q1736O651A49083K08396j60769r0315b3153A18837J76886
$$ 153952 148082 368027 449763 456414 149083 357479 196710 106395 -23153 118837 295723
17424B95723J97951j73750A59637J46052f4363E99857I2673M36134o4751E7505
$$ 295723 493674 319924 159637 305689 -64363 599857 92673 528807 464056 57505
17413D44767A64011M18059j06615B25741l2765m3356Q9886I6799K71324A04243
$$ 444767 164011 582070 475455 225741 192976 149620 239506 96799 368123 104243
17402E14591k48325b80247g9470A16884b04178b9200B5740e298B15302p4697i7882
$$ 514591 266266 -280247 -79470 116884 -204178 -29200 25740 -5298 215302 140605 -97882
17390A06858A4119K28968o312I9543b28745B63678g7556a5255F4429a679B68925
$$ 106858 14119 243087 236775 99543 -228745 263678 -77556 -15255 64429 -1679 268925
17378b03783B81404e1806C16200c3984C30559o8176L7549A01150b16994C75566
$$ -203783 281404 -51806 316200 -33984 330559 262383 299932 101150 -216994 375566
17367A03010n0491a88091B48853J69799a42739D35870A30807a84936A21135a60720
$$ 103010 52519 -188091 248853 418652 -142739 435870 130807 -184936 121135 -160720
17356A54663J46190f0163A33950f9763A99872Q0594b40592A23960A4000L56143
$$ 154663 300853 -60163 133950 -69763 199872 280466 -240592 123960 14000 370143
17346C70143H5531B8189M58602a14301A20694n6790J455r61P8426J32816K74213
$$ 370143 85531 28189 486791 -114301 120694 63904 65359 64398 142824 275640 549853
17335E49853c2762B3903J30291R5495R1625j45I5748J40083f9318A87316q1000
$$ 549853 -32762 23903 154194 249689 341314 341169 95748 235831 -69318 187316 106316
17324A06316d4809A48593K79794B00604c1393I1738N3048Q8999j11179N4469K8919
$$ 106316 -44809 148593 428387 200604 -31393 91738 144786 233785 122606 177075 205994
17313B05994R6303A18411L00955A71921p3169O5147a5552A56136C8028J5939J80635
$$ 205994 302297 118411 419366 171921 98752 163899 -15552 156136 38028 53967 234602
17302B34602n7502O0051K4018a7765A86721l6419K1003F6667a18072A99001R9567
$$ 234602 177100 237151 261169 -17765 186721 150302 171305 66667 -118072 199001 298568
17291B98568P8298p1567l2727r2013m1859J20159G2360J44391b3166l2931J0136
$$ 298568 376866 305299 272572 180559 138700 258859 72360 216751 -23166 -56097 -45961
17280d5961A61654J07692k1474A03707r329J2300L09352j21518i6199E4339a41651
$$ -45961 161654 269346 247872 103707 94378 106678 416030 294512 -96199 54339 -141651
17268B29541O7626B1795M84814e6258B95047A15818J84035f820B46977A00783
$$ 229541 297167 21795 506609 -56258 295047 115818 299853 -6820 246977 100783
17257F9853L0581N00488k97249j38436K62132a05340E81336b530q7262I5622L26548
$$ 69853 100434 600922 303673 165237 427369 -105340 581336 -2530 -89792 95622 422170
17246D22170j40570A054J87554j1457E4591B2689L11222A32708M47011a59688
$$ 422170 281600 1054 188608 177151 54591 22689 333911 132708 579719 -159688
17235C45995G7241J91937K4213A11086j2116J18173H0355a14504I8323K27760
$$ 345995 77241 269178 293391 111086 98970 217143 80355 -114504 98323 326083
17225C26083j19901H9949H767M9169K30372J08924j62727D5519K8693K00697D0419
$$ 326083 206182 89949 8767 57936 288308 397232 234505 45519 74212 274909 40419
17213B50393n4766J05471K60574j60629E0929b06335A33613J99712A0751K32886
$$ 250393 195627 301098 561672 401043 50929 -206335 133613 333325 10751 243637
17203B43637J6219F2929K79392d18435c4158A05883L6642J13542n6994r0723J10131
$$ 243637 259856 62929 342321 -418435 -34158 105883 142525 256067 199073 108350 218481
17192B18481J4656m4366a6984B06419j6826J91653A37253O3382K00195A13441
$$ 218481 233137 188771 -16984 206419 189593 381246 137253 200635 400830 113441
17181H1659O1892L46268B35371J37766r0815p7986K67556q8947j45176a03829
$$ 81659 143551 489819 235371 373137 282322 204336 471892 382945 237769 -103829
17170B19945Q5809G3370K1661K87606j22343A26633J61013L09796G0640K20529
$$ 219945 305754 73370 95031 382637 260294 126633 287646 597442 70640 291169
17160B91169I4229a8878B67807r2596K33760m893D3905J17408J81276G1827K24827
$$ 291169 94229 -18878 267807 175211 408971 404078 43905 161313 342589 71827 296654
17149B96654A19949K89036J45608k02242l24m3154m9744L7822o4478N5297o2531
$$ 296654 119949 408985 554593 352351 352027 308873 259129 296951 232473 287770 225239
17138B25239J81435J45597j96911J704K5918j11099L44048j00507B4025J33793
$$ 225239 406674 552271 355360 357064 382982 271883 615931 515424 24025 157818
17128A57818o4519M25186a02212E22089B19131K96496k37414r3860E0752M47015
$$ 157818 93299 518485 -102212 522089 219131 515627 278213 184353 50752 497767
17118D97767A56149j0124P3641J72037J28846A98353K78535j28781A34289J79175
$$ 497767 156149 146025 219666 391703 520549 198353 476888 348107 134289 313464
17108C13464m9162P2505C5783L34258J74426r4021A13553N11207k33559k5131
$$ 313464 264302 336807 35783 370041 544467 450446 113553 624760 391201 366070
17098C66070L0745A89727K11161p2438J02837L77496B38504K2563K50221O3702
$$ 366070 396815 189727 400888 328450 431287 808783 238504 261067 511288 574990
17088E74990k25603o983Q0183j35556J20584L140A47234J27717b8743C41694J78526
$$ 574990 349387 342404 422587 287031 407615 410755 147234 274951 -28743 341694 520220
17077E20220j40242l0616A13002K31574q6051J74760j5359K82391k21892j49328
$$ 520220 379978 349362 113002 344576 258525 433285 417926 700317 478425 329097
17067C29097J46001p5020R78r7692L03006K0036B71467K82916B50445Q4592J08393
$$ 329097 475098 400078 401056 303364 606370 626406 271467 554383 250445 335037 443430
17056D43430j28671L65779q6034j7122r7591M3500j66607Q4510j9185J36539k18921
$$ 443430 314759 680538 594504 577382 479791 523291 356684 441194 422009 558548 339627
17045C39627M79179l39338j43256L21740k59540J9583l5747N21385l00541q4183
$$ 339627 818806 479468 336212 657952 398412 417995 382248 903633 603092 518909
17035E18909j76247J73754J68856k04582j04323J62767o4568J56220r3957j99056
$$ 518909 342662 516416 685272 480690 376367 539134 474566 630786 536829 337773
17025C37773M14830K88962m94096J06760k35698P4421P4050O3952K5556k33961
$$ 337773 752603 1041565 547469 654229 418531 492952 567002 630954 656510 422549
17015D22549J51581r0206l7725K82296k31122N9982j27722O5580J00345j84361
$$ 422549 574130 483924 446199 728495 497373 557355 429633 495213 595558 411197
17005D11197j028K09039J75458K24640l01142M6247q4058j09114K96016C96827
$$ 411197 410169 619208 794666 1019306 718164 764411 680353 571239 867255 396827
16994D13858K31022l862K11005j47861N5167K7431k51713J62458j74634J23576
$$ 413858 644880 641018 852023 704162 759329 786760 535047 697505 522871 646447
16984F46447J36482k13316M26551j06566k29255R6561J01739m6162K748K71696
$$ 646447 782929 569613 996164 889598 660343 756904 858643 812481 815229 1086925
16974A086925l64125J90237j75680l44784L34633K3957O9056j56858K69254K43355
$$ 1086925 722800 913037 737357 392573 727206 751163 820219 663361 932615 1175970
16964A175970j70829k91642P7374K72134j50244O2797J82620k0974l9469p643
$$ 1175970 1005141 713499 790873 1063007 912763 975560 1158180 1137206 1097737 1090094
16954A090094q4267k52079J65476K6277j22542Q5792Q3128j91346M49608l15325
$$ 1090094 1005827 753748 919224 945501 822959 908751 991879 800533 1250141 934816
16944I34816j78661J68964K293j00800N64935o49484N59385n94563j9834K77778
$$ 934816 756155 925119 927412 826612 1391547 742063 1301448 706885 687051 964829
16934I64829J78139R0056j56688J13899n3973j52208L37930k59168Q1390L00515
$$ 964829 1142968 1233024 1076336 1190235 1136262 984054 1321984 1062816 1144206 1444721
16924A444721J8563j45098n3499k18187M11683l61347J27529K43735j36327k88609
$$ 1444721 1463284 1318186 1264687 1046500 1458183 1096836 1224365 1468100 1331773 1043164
16914A043164L68759P1676l01925j00617K17471K79250q3362j66570L86252j24303
$$ 1043164 1411923 1483599 1181674 1081057 1298528 1577778 1494416 1327846 1714098 1589795
16904A589795R6609m23583L23750J25741m08264J01032M73914k26582m9619P7882
$$ 1589795 1686404 1262821 1586571 1712312 1304048 1405080 1878994 1652412 1602793 1680675
16894A680675j00848O6475q7987N9789L8191N9800q1776r9441M9984L48797K02984
$$ 1680675 1579827 1646302 1558315 1618104 1656295 1716095 1634319 1534878 1584862 1933659 2136643
16883B136643l44309O1766J32007q054j94329M00477k62782k20153L41507j58787
$$ 2136643 1792334 1854100 1986107 1978053 1783724 2184201 1921419 1701266 2042773 1883986
16873A883986O4586Q1635k7239L11514k19941j90625O18370k98742J54791K06280
$$ 1883986 1948572 2030207 2002968 2314482 2094541 1903916 2522286 2223544 2378335 2584615
16863B584615k64617q4064J77127O8106R4854m45658O17126m02166M61375j35625
$$ 2584615 2319998 2235934 2413061 2481167 2576021 2130363 2747489 2345323 2806698 2671073
16853B671073M1514j26879K65886j38329L47083j68159J5124K94382k4849j07535
$$ 2671073 2712587 2585708 2851594 2713265 3060348 2892189 2907313 3201695 3176846 3069311
16843C069311N9266j83261L77873o9035m9014L42026k43234K91140P4125J2182
$$ 3069311 3128577 2945316 3323189 3254154 3205140 3547166 3303932 3595072 3669197 3681379
16833C681379j0253M39721l52807J91780J16487J40115Q8367o4691j78426M82505
$$ 3681379 3671126 4110847 3758040 3949820 4066307 4206422 4294789 4230098 4051672 4534177
16823D534177j32897J17329L11879p7458j40353K54964L53772l5214L3420K67743
$$ 4534177 4401280 4518609 4830488 4753030 4612677 4867641 5221413 5186199 5219619 5487362
16813E487362j62448L12376k48892N27846M0930J21971m5111J10653r1600L44798
$$ 5487362 5324914 5637290 5388398 5916244 5957174 6079145 6034034 6144687 6053087 6397885
16803F397885n6962N35458K31922p4999L31705j28034O36573m18661O07845J05200
$$ 6397885 6340923 6876381 7108303 7033304 7365009 7236975 7873548 7454887 8062732 8167932
16793H167932K04287J38692K53948L2887N89746l7958L09592J20686L90050K32093
$$ 8167932 8372219 8510911 8764859 8797746 9387492 9349534 9659126 9779812 10169862 10401955
16783A0401955L24560l2092O39473N10813K94616J31881M98263L59570L78870
$$ 10401955 10726515 10694423 11333896 11844709 12139325 12271206 12769469 13129039 13507909
16774A3507909L31047N83339M90372P14784M1296P58104R30947q214O76012N66636
$$ 13507909 13838956 14422295 14912667 15627451 15668747 16426851 17357798 17349584 18025596 18592232
16764A8592232J361328K44123J079762P55801Q86899J286018Q22455R68558J076974
$$ 18592232 19953560 20197683 21277445 22033246 22920145 24206163 25028618 25997176 27074150
16755B7074150J407322J261212J356376J438954J672866J164816J975962K029491
$$ 27074150 28481472 29742684 31099060 32538014 34210880 35375696 37351658 39381149
16747C9381149J724151K566583K510182K375146K410893L051621L373465L136868
$$ 39381149 41105300 43671883 46182065 48557211 50968104 54019725 57393190 60530058
16739F0530058L719590M068039M368348M282718N114926N825377N565742N899268
$$ 60530058 64249648 68317687 72686035 76968753 82083679 87909056 93474798 99374066
16731I9374066O793862O667117P779568Q190012Q403138Q338418Q968421Q808606
$$ 99374066 106167928 112835045 120614613 128804625 137207763 145546181 154514602 163323208
16723A63323208Q873932Q778535P856214P116578O494559M572505L505261K065163
$$ 163323208 172197140 180975675 188831889 195948467 202443026 207015531 210520792 212585955
16715B12585955l49033k035466l183048m785811o376988p346528p852208r157737
$$ 212585955 212236922 210201456 207018408 202232597 195855609 188509081 180656873 171499136
16707A71499136r054535r012597r020088r006523q561283p889519p767854p589500
$$ 171499136 162444601 153432004 144411916 135405393 126844110 118954591 111186737 103597237
16699A03597237o536367o335733o263717m962454n446055m180264m653289l903860
$$ 103597237 97060870 90725137 84461420 79498966 74052911 69872647 65219358 61315498
16691F1315498l100053l785380l275374k856898k225781k592855k587688k140298
$$ 61315498 58215445 54430065 51154691 48297793 46072012 43479157 40891469 38751171
16683C8751171k091973j624847j933819j812838j382064j161715j111416j405139
$$ 38751171 36659198 35034351 33100532 31287694 29905630 28743915 27632499 26227360
16675B6227360r47435j513263r02619q63945j104252o49005r22222q87918l55247
$$ 26227360 25279925 23766662 22864043 22000098 20895846 20246841 19324619 18436701 18081454
16666A8081454j089471n94050l89894n09963q18507n39366o3306m59094r76419
$$ 18081454 16991983 16397933 16008039 15498076 14679569 14140203 14076897 13617803 12641384
16657A2641384k31270l96432k24092n89868l63634k70219j97769m22270m42108
$$ 12641384 12410114 12013682 11789590 11199722 10836088 10565869 10368100 9945830 9503722
16648I503722Q7121m47928n66984R7011j93482k86801l10318l28007j76177Q3035
$$ 9503722 9590843 9142915 8575931 8672942 8479460 8192659 7882341 7554334 7378157 7461192
16638G461192k94155m21150j68089k78015K00336q53232M22884j69045k7542R3538
$$ 7461192 7167037 6745887 6577798 6299783 6500119 5646887 6069771 5900726 5873184 5966722
16628E966722l58767m08097j41430R5020l8668k63133M84355p75479J06313l0345
$$ 5966722 5607955 5199858 5058428 5153448 5114780 4851647 5336002 4560523 4666836 4636491
16618D636491j31777j80799o3040k69654K23783m04443k9641k6516K91650l30838
$$ 4636491 4504714 4323915 4260875 3991221 4215004 3810561 3780920 3754404 4046054 3715216
16608C715216p1495l89213k75574J93791K1543j11529Q9891K3501j65566o4000
$$ 3715216 3643721 3254508 2978934 3172725 3194268 3082739 3172630 3196131 3030565 2966565
16598B966565J43484j60417L1051k45858J20671J39087k88153k11482j16547J55168
$$ 2966565 3110049 2949632 2980683 2734825 2855496 2994583 2706430 2494948 2378401 2533569
16588B533569P8305p6662m2518K34203k36475l86724K43967J40309J09902m96909
$$ 2533569 2611874 2535212 2492694 2726897 2490422 2103698 2347665 2487974 2597876 2100967
16578B100967M0912K28991K1421l37822M9531o8192J45544P009m55162j646n8950
$$ 2100967 2141879 2370870 2392291 2054469 2104000 2035808 2181352 2188361 1733199 1731553 1672603
16567A672603K89114k94131N0304Q6873k19824j5191O5690l6483q211O3877j12233
$$ 1672603 1961717 1667586 1717890 1804763 1584939 1569748 1635438 1598955 1590744 1654621 1542388
16556A542388k66523J82888Q7947k6270p4329P4533O9303l86661M42852l27066
$$ 1542388 1275865 1458753 1546700 1520430 1446101 1520634 1589937 1203276 1646128 1319062
16546A319062O7410l52480K05710m3281M40050l89094l60526K21588K07021j89586
$$ 1319062 1386472 1033992 1239702 1196421 1636471 1247377 886851 1108439 1315460 1125874
16536A125874O9273o0647J7536M20438l75589j11774l5110N5673r3675j61096
$$ 1125874 1195147 1134500 1152036 1572474 1196885 1085111 1050001 1105674 1011999 850903
16526H50903K80906k08172K46416p0534o8303j55750Q8248J35859j52131P6765
$$ 850903 1131809 923637 1170053 1099519 1031216 875466 963714 1099573 947442 1024207
16516A024207k5084l50073R1679J66450k80768L80317o4419j12476k13191K12
$$ 1024207 999123 649050 740729 907179 626411 1006728 942309 829833 616642 616854
16506F16854L51510k93738K0108J73777j53516L3509j24433J53257q102k97269
$$ 616854 968364 674626 694734 868511 714995 748504 624071 777328 769226 471957
16496D71957N77361l44570l7613q217j6071K98313l50823p83L50348j31005Q781
$$ 471957 1049318 704748 667135 658918 642847 941160 590337 589554 939902 808897 817678
16485H17678C98188L66995N909k03410J94757k66142P5214j86935K58499k57515
$$ 817678 398188 765183 771092 567682 762439 496297 571511 384576 643075 385560
16475C85560M25304k67510p3395M42569j50052l07287J59673B04652M36169J80385
$$ 385560 810864 543354 469959 912528 762476 455189 614862 204652 640821 821206
16465H21206B56676M63229J27982j70580k83617L1897n4465J46703k5194j42431
$$ 821206 256676 719905 847887 677307 393690 425587 371122 517825 492631 350200
16455C50200L22722k19952m6880j71168Q4198M93306l27320k07894K00663k85
$$ 350200 672922 452970 406090 234922 319120 812426 485106 277212 477875 477590
16445D77590j170k01610J62256j41703J60095j8398M1396k20034J29318J27925
$$ 477590 476420 274810 437066 295363 455458 437060 478456 258422 387740 515665
16435E15665m7887J80878j83391j31647K83243k54553j07882k3369M86334k44860
$$ 515665 467778 648656 465265 333618 616861 362308 254426 231057 717391 472531
16425D72531k03099j09667R5942J84108K08221k21717j22961J06818j30917J46405
$$ 472531 269432 159765 255707 439815 648036 426319 303358 410176 279259 425664
16415D25664j4491R2203A03547J21680P1139k6567M1739J98780k7494h1040D08861
$$ 425664 411173 503376 103547 225227 296366 269799 311538 510318 482824 -81040 408861
16403B23031J78289J9141A96613E3626L35534j15571m471k1795L04805k40721
$$ 223031 401320 420461 196613 53626 389160 273589 269118 247323 552128 311407
16393C11407j40986n2495K85382A63191l2874J58145o7874K3243J2197C4851l55
$$ 311407 170421 117926 403308 163191 130317 288462 220588 243831 256028 34851 34496
16382C4496L03433a14016B93369h520B71768k3479G9935M11983A91294a0847C03921
$$ 34496 337929 -114016 293369 -8520 271768 248289 79935 491918 191294 -10847 303921
16370A69986a86444A68039K72100A33391a11395C51067D1696L72421a27185B05286
$$ 169986 -186444 168039 440139 133391 -111395 351067 41696 414117 -127185 205286
16359B92853Q152j14662g8045C19906I9785K54762r2263k1085G3462J85729j6447
$$ 292853 301005 186343 -78045 319906 99785 354547 262284 241199 73462 259191 242744
16348B42744I3995K13326I8330K29290E4665d3939h043C29188h4573D57942b32538
$$ 242744 93995 307321 98330 327620 54665 -43939 -8043 329188 -84573 457942 -232538
16336A75706L1286J37163P3394b16413b8658C00891j08792G5073b22525A87822
$$ 175706 206992 344155 417549 -216413 -28658 300891 192099 75073 -222525 187822
16325B40652j9622B0256J52398J03086M4177j10660H3999L2002J40153j2318D05
$$ 240652 221030 20256 172654 275740 319917 209257 83999 116001 256154 243836 405
16313A74406J5794i9636A57018L8845K22148A92913e0475C27481A56844n2738
$$ 174406 190200 -99636 157018 195863 418011 192913 -50475 327481 156844 104106
16303A04106J71213O6264j12051G9302L5481B7939J08954c0508B08314j4151J16618
$$ 104106 275319 341583 229532 79302 114783 27939 136893 -30508 208314 194163 310781
16292C10781f8396E4689j0554j2279J51292a5679p2181I1471J5021i835l7331
$$ 310781 -68396 54689 44135 31856 183148 -15679 -87860 91471 106492 -9835 -47166
16281d7166D92009a75281D3378K15124A21023h4785I4402N3981a19001M4499I6570
$$ -47166 492009 -175281 43378 258502 121023 -84785 94402 148383 -119001 -74502 96570
16269B25172r1239O6529a72670K4190H6277k4722d0697L176C8161M54234A58960
$$ 225172 133933 200462 -172670 -148480 86277 61555 -40697 -37521 38161 492395 158960
16257A03235c3560A61599d6607m165B00798n8332b99668E9589b34567C1065J02071
$$ 103235 -33560 161599 -46607 -50772 200798 142466 -299668 59589 -234567 31065 133136
16246A33136j2387K90185A12777c6612J7971B53211r3332b11280R9175b424H6120
$$ 133136 120749 410934 112777 -36612 -18641 253211 159879 -211280 -112105 -2424 86120
16234C5792R2489E6939e8639l3043b6512D1795K25425q6285D046a04199A77940
$$ 35792 128281 56939 -58639 -91682 -26512 41795 267220 180935 4046 -104199 177940
16222B55097j23429m3047C3606H706a01085B64067a24836G1278d9955B46078J26051
$$ 255097 131668 88621 33606 8706 -101085 264067 -124836 71278 -49955 246078 372129
16211C72129G4590c5818l19697a30987A99223a50855H3563O0045N5074f4783I4005
$$ 372129 74590 -35818 -355515 -130987 199223 -150855 83563 143608 198682 -64783 94005
16199A03548R8741j00137k2617j2101j4293K55666m1509j4017b9391I9421a67554
$$ 103548 202289 102152 79535 67434 53141 308807 267298 253281 -29391 99421 -167554
16187G3361J58000d8225n6426n5392b9420B88674o0259k4567c2501G7170a14987
$$ 73361 231361 -48225 -104651 -160043 -29420 288674 228415 203848 -32501 77170 -114987
16175H7543a26555f1250A02230B9916J22108I674c57430A3823a82998F1100b95871
$$ 87543 -126555 -61250 102230 29916 152024 9674 -357430 13823 -182998 61100 -295871
16163A51430Q27B7970d3397j67874e5402I0063R365b01672A29390n429J13284
$$ 151430 152257 27970 -43397 -211271 -55402 90063 99428 -201672 129390 123961 237245
16152B37245a70926j53992B51310e7137C982Q8603e364l58394B71311E3818N8825
$$ 237245 -170926 -324918 251310 -57137 3982 92585 -5364 -363758 271311 53818 112643
16141A12643c07292C33130E8097c5302A91448a59946C4100L8989k7967M360b64642
$$ 112643 -307292 333130 58097 -35302 191448 -159946 34100 73089 45122 49482 -264642
16129C69009I8483O127j2676b8317A13574C9926b13377p4716A28165c24413A83706
$$ 369009 98483 104610 91934 -28317 113574 39926 -213377 -288093 128165 -324413 183706
16117d7608B9563a32827E4585a59816A63381J03004B4464a7864k14202A24208
$$ -47608 29563 -132827 54585 -159816 163381 266385 24464 -17864 -232066 124208
16106B1470J55574D3822M69155a55577F7106a66888C1296r746P3002A4336b20331
$$ 21470 177044 43822 512977 -155577 67106 -166888 31296 21550 94552 14336 -220331
16094A864J66651O21317h8279r543M6504b66A9670b96160Q7788D35910q2152b18816
$$ 1864 168515 789832 -88279 -97822 -51318 -266 19670 -296160 -208372 435910 353758 -218816
16081b65969A29872b4574l63558B32053m4790p5500L7246a25077A60984a15338
$$ -265969 129872 -24574 -388132 232053 187263 111763 149009 -125077 160984 -115338
16070c6432B26827c6363m4856H8630q211b47393a8783C7539b14576E5714N7727
$$ -36432 226827 -36363 -81219 88630 80419 -247393 -18783 37539 -214576 55714 113441
16059A13441b1504j51093B9729b37689d483k34813A6809J85082J23567e6498k26695
$$ 113441 -21504 -172597 29729 -237689 -4483 -239296 16809 201891 325458 -56498 -283193
16048b83193g0379L0672m9544d1230F2253h7301j01629C02495a55272M7438j22080
$$ -283193 -70379 -39707 -89251 -41230 62253 -87301 -188930 302495 -155272 -107834 -229914
16037b29914b9624D4009J27913h2792A03099a68528P0494n0985D8046J91882d4798
$$ -229914 -29624 44009 171922 -82792 103099 -168528 -98034 -149019 48046 239928 -44798
16025b6225j24917H4052c93425a9738k2922A08c4719A21725i2334G684e4029m0108
$$ -26225 -151142 84052 -393425 -19738 -42660 108 -34719 121725 -92334 7684 -54029 -94137
16013i4137A38493h2123F8556P3452j5672b6789C54053A45621E6016A0283b24683
$$ -94137 138493 -82123 68556 142008 126336 -26789 354053 145621 56016 10283 -224683
16001C65868a60297o4847D7548e47255K47376A35853b8087l23969a64223A22465
$$ 365868 -160297 -225144 47548 -547255 -299879 135853 -28087 -352056 -164223 122465
15990a34201A27645N5471F6211a62964A49399B0520J55225C6630M8568A0286P7564
$$ -134201 127645 183116 66211 -162964 149399 20520 175745 36630 85198 10286 87850
15979H7850K4173A7203J15642b27944D2968b19960j1691d3950A46076C7841i5990
$$ 87850 112023 17203 132845 -227944 42968 -219960 -231651 -43950 146076 37841 -95990
15967c07262H7951a07956A18031a9017I7608a25775k12526R2779h1166k47797
$$ -307262 87951 -107956 118031 -19017 97608 -125775 -338301 -245522 -81166 -328963
15957c28963a3041r0311B21234a89489A62171D5636b87247A24899P0691c6023
$$ -328963 -13041 -103352 221234 -189489 162171 45636 -287247 124899 195590 -36023
15946a38347B19223a01365j92763a44225A03328d21927a15037n6374A14565B1141
$$ -138347 219223 -101365 -294128 -144225 103328 -421927 -115037 -171411 114565 21141
15935D19548e5322k7547E960i9692A94072H4975a66857A52926h333k58871k1257
$$ 419548 -55322 -82869 5960 -99692 194072 84975 -166857 152926 -8333 -267204 -288461
15924b88461i5554k03461i4374A39563g7727j93495G1221d16986D1209e866r2628
$$ -288461 -95554 -299015 -94374 139563 -77727 -271222 71221 -416986 41209 -5866 -98494
15913i8494B31825c9521a6727n3131j58280A13819d8613l781j16948f2801q4618
$$ -98494 231825 -39521 -16727 -69858 -228138 113819 -48613 -52394 -169342 -62801 -147419
15902a47419m3004g0441k69824c6716F5661a77609B50476A8819c0551q7168H6680
$$ -147419 -190423 -70441 -340265 -36716 65661 -177609 250476 18819 -30551 -117719 86680
15890A25678d1714D4687e3259G0151M2157a52713J6335K0108q8247o068a0712
$$ 125678 -41714 44687 -53259 70151 112308 -152713 -136378 -116270 -204517 -210585 -10712
15878a06874D7084a11086B15825l2623h9667K7424K843k73379b6154B19234a4546
$$ -106874 47084 -111086 215825 183202 -89667 -62243 -59400 -332779 -26154 219234 -14546
15866b68878J25506j52227P0286B8955a68664j7827K9047A48872m9051a1643B1587
$$ -268878 -143372 -295599 -225313 28955 -168664 -186491 -157444 148872 99821 -11643 21587
15854B38226A05659K22084h742k44783A53000F8484l2213A294b91487B66192r7497
$$ 238226 105659 327743 -8742 -253525 153000 68484 36271 1294 -291487 266192 168695
15843A68695D273a53485g2893I8934c81599f3379C31713b70323g8919D5628b29243
$$ 168695 4273 -153485 -72893 98934 -381599 -63379 331713 -270323 -78919 45628 -229243
15831a13654A03283A8295f1769I9508m9229b65617J13559b8019k32295L4636C40403
$$ -113654 103283 18295 -61769 99508 50279 -265617 -152058 -28019 -260314 -225678 340403
15819a37809k2923c7247j99986j21578a63089D2625O6645f197r7221A7450a42936
$$ -137809 -160732 -37247 -237233 -358811 -163089 42625 109270 -6197 -103418 17450 -142936
15807B31014a05295a8663G0508g8047B94271G7405b62961a8145k7444j51376h3223
$$ 231014 -105295 -18663 70508 -78047 294271 77405 -262961 -18145 -45589 -196965 -83223
15795A98685b0693j00023F7470a40812A31393b21484C0245a26513p2039K5505
$$ 198685 -20693 -120716 67470 -140812 131393 -221484 30245 -126513 -198552 -173047
15785a73047p1677A88071c62001f3802E0914a07840A96864b06553B76215a8083
$$ -173047 -244724 188071 -362001 -63802 50914 -107840 196864 -206553 276215 -18083
15774b281F1925e0466r7637B74693a46907e1185a5530p9566O997A60906E1122
$$ -2281 61925 -50466 -148103 274693 -146907 -51185 -15530 -95096 -88099 160906 51122
15762C4921b11977K674k6870F0165B2313a70895A4400J39110L9196i6730A148
$$ 34921 -211977 -209303 -236173 60165 22313 -170895 14400 153510 192706 -96730 1148
15750e2281k51734B19638E2746f1660r2363A36077A2488b55265b8001C6935d48
$$ -52281 -304015 219638 52746 -61660 -154023 136077 12488 -255265 -28001 36935 -448
15738e7746K220q7540B02566a38160q9228g0616B09806c9935j21761b2970m2893
$$ -57746 -55526 -143066 202566 -138160 -227388 -70616 209806 -39935 -161696 -22970 -65863
15727f5863J0468l7499j10117A71925g0046j02385A7192Q0009c8272I695K00081
$$ -65863 -55395 -92894 -203011 171925 -70046 -172431 17192 97201 -38272 9695 209776
15716B09776a31889r9755c5975k44361J16700L6795H5409A7163c552n9634b4475
$$ 209776 -131889 -231644 -35975 -280336 -163636 -126841 85409 17163 -3552 -63186 -24475
15704A18809J2003a39871j87531A39372E3914h6344k35301A17088a51446f5712
$$ 118809 130812 -139871 -327402 139372 53914 -86344 -321645 117088 -151446 -65712
15693a42893l16500d7988B69925j12872J12464p191D0549a1610A29957b59058
$$ -142893 -459393 -47988 269925 157053 269517 262326 40549 -11610 129957 -259058
15682b68889O8540A6811J76213b71166E1453K1366d4702A07253M2892J72454a20384
$$ -268889 -200349 16811 193024 -271166 51453 72819 -44702 107253 150145 322599 -120384
15670A17643a09691B33962J14988h9376A56132C8997b99368A84541k1268b39699
$$ 117643 -109691 233962 348950 -89376 156132 38997 -299368 184541 163273 -239699
15659A10414K3657b95435A48096j4718A3360J33960b33711e7610A34097c9191
$$ 110414 134071 -295435 148096 133378 13360 147320 -233711 -57610 134097 -39191
15648A76996a99373n8544D4242J04187e8199m2472o2624k52790C4176a53619k08729
$$ 176996 -199373 -257917 44242 148429 -58199 -100671 -163295 -416085 34176 -153619 -362348
15637c62348A15777f6723O520B29590d2081A09837C3884L3946a86833L5194B34802
$$ -362348 115777 -66723 -60203 229590 -42081 109837 33884 67830 -186833 -151639 234802
15625A31218B6090R9234k292i2000j5809E057b79283j89821D97237B01056c00834
$$ 131218 26090 125324 123032 -92000 -107809 5057 -279283 -469104 497237 201056 -300834
15613b8467j89049P8079A32249B6871J3795b40276e2648Q94b1597B4757c53596
$$ -28467 -217516 -139437 132249 26871 40666 -240276 -52648 -51754 -21597 24757 -353596
15601D0139e8299j50222D7800c0768j77175A8808b77018i1805A06709b33736e5543
$$ 40139 -58299 -208521 47800 -30768 -207943 18808 -277018 -91805 106709 -233736 -55543
15589a87859q5342J34089a5000j86888A50753a03744A22666M415l8513g8695G7212
$$ -187859 -273201 -139112 -15000 -201888 150753 -103744 122666 127081 88568 -78695 77212
15577d04715A38535J14539d70497K15771g3088A20068c02375E9277B8897Q2644
$$ -404715 138535 253074 -470497 -254726 -73088 120068 -302375 59277 28897 111541
15567A11541N1760b05693G646b2600j19557A24389a80547l7173A91140M9465L7703
$$ 111541 163301 -205693 7646 -22600 -142157 124389 -180547 -217720 191140 240605 278308
15556B78308a68206A10600P0545D2024g3505j6615l41839B060a05770A20933h3559
$$ 278308 -168206 110600 181145 42024 -73505 -90120 -431959 2060 -105770 120933 -83559
15544a22418A16572h3538E9604N861a75248P7005M3825l5569B24332B1986b6077
$$ -122418 116572 -83538 59604 65465 -175248 -98243 -54418 -89987 224332 21986 -26077
15532C3092a66401M2067G3776P2305F4362g6994E2492J11140m0430N9403a7132
$$ 33092 -166401 -124334 73776 146081 64362 -76994 52492 163632 123202 182605 -17132
15520g552E06J14683b51512A01692K8333M7691O5509b68780f2729B12048r3355
$$ -7552 506 115189 -251512 101692 130025 177716 243225 -268780 -62729 212048 118693
15509A18693b89641A03100K09654a7000D4720e4910A39139j6681l7786P7763c42122
$$ 118693 -289641 103100 312754 -17000 44720 -54910 139139 122458 84672 162435 -342122
15497G5882M8571K77994A16040B2269a96658A66231h2473L0960G4820a9963j63940
$$ 75882 124453 402447 116040 22269 -196658 166231 -82473 -51513 74820 -19963 -183903
15486a83903B80040a64156D42228A84686a72113A95803i4802A75829e0831C20566
$$ -183903 280040 -164156 442228 184686 -172113 195803 -94802 175829 -50831 320566
15475c1092A9221b03314O6479j3771e1262C5750b06995O9938H7823G820a43086
$$ -31092 19221 -203314 -136835 -150606 -51262 35750 -206995 -137057 87823 7820 -143086
15463A72435a2251j33598A29840i7322L963a7316j8986B25540H887O3332b44844
$$ 172435 -12251 -145849 129840 -97322 -93359 -17316 -36302 225540 8887 72219 -244844
15451B46177D5232i7499k27644J54415A40591a98029A28842l3142J04696E3441
$$ 246177 45232 -97499 -325143 -170728 140591 -198029 128842 95700 200396 53441
15440c03957B4099d21680A20035E9707A8040b15602A71731b62164k186I7152j1313
$$ -303957 24099 -421680 120035 59707 18040 -215602 171731 -262164 -264350 97152 85839
15429H5839i8358B7057N0793J07996a24496A86124d5800n2970k30273h0415j7341
$$ 85839 -98358 27057 77850 185846 -124496 186124 -45800 -98770 -329043 -80415 -97756
15418i7756A2648b1019q3028c3986k5499Q09B10203E4696g3497E0359c1161k78597
$$ -97756 12648 -21019 -104047 -33986 -59485 -58676 210203 54696 -73497 50359 -31161 -309758
15406c09758d1106l7615A54773g3478m4405B52193p9872l6154N2430J52392H1187
$$ -309758 -41106 -78721 154773 -73478 -117883 252193 172321 136167 188597 340989 81187
15394a10298I97P7972e9517A00011j9626a83767F4944b79p2994K2516b0693C90920
$$ -110298 997 78969 -59517 100011 80385 -183767 64944 -279 -73273 -50757 -20693 390920
15381e9375G972O4963J48568b5236G4272R4796J14020b23923j50115A20423D9964
$$ -59375 7972 72935 221503 -25236 74272 169068 283088 -223923 -374038 120423 49964
15369h658k3165j09611A18019K55092a5053j43587B37320a29102q3276f2232L0195
$$ -8658 -31823 -141434 118019 373111 -15053 -158640 237320 -129102 -212378 -62232 -32037
15358c2037j88994A70788a15317f921B09315h1553K2599C52799j11566A7962a30962
$$ -32037 -221031 170788 -115317 -6921 209315 -81553 -58954 352799 241233 17962 -130962
15346B16847c20814B3947h9363A3472J2651M8715a36519F579a6331j1914k1156
$$ 216847 -320814 23947 -89363 13472 26123 74838 -136519 6579 -16331 -28245 -49401
15335d9401G458J10668E5561c2816B664f0978B76628e6837K1395n1778A76326
$$ -49401 7458 118126 55561 -32816 2664 -60978 276628 -56837 -35442 -87220 176326
15323A13625J33469l9780g4583b6519j82083a9100D7037j6113K02726a32750O3091
$$ 113625 247094 207314 -74583 -26519 -208602 -19100 47037 30924 233650 -132750 -69659
15312f9659A51686a0515B47021b82896G6743a26683d206p1045I8364N6979m4507
$$ -69659 151686 -10515 247021 -282896 76743 -126683 -4206 -75251 98364 155343 110836
15301A10836N0785f1371A2815b384j7970m80E2376d5982C28999h7921I8226J82792
$$ 110836 161621 -61371 12815 -2384 -20354 -20834 52376 -45982 328999 -87921 98226 281018
15289B81018A14063A6328L8703P4103h1038A98293b3630C2787K67002A39065b25389
$$ 281018 114063 16328 55031 129134 -81038 198293 -23630 32787 299789 139065 -225389
15277a74717A61115i092B8482J06946i3908B89691a40839C60724a46051C9576
$$ -174717 161115 -9092 28482 135428 -93908 289691 -140839 360724 -146051 39576
15266F986a03021B46630j8219o7918g9806H4442h8817b6608A52311K06510A03775
$$ 6986 -103021 246630 228411 160493 -79806 84442 -88817 -26608 152311 358821 103775
15254B41554d0660j64287E6861M9220J39270L45170P66492j39572L2228K27674
$$ 241554 -40660 -204947 56861 106081 245351 590521 1357013 1217441 1249669 1477343
15244A477343o83361A97486I143M5499h6586K1974A90258N2726E5774c0306l08483
$$ 1477343 793982 197486 9143 54642 -86586 -64612 190258 242984 55774 -30306 -338789
15233c38789B1845a31804b4759A51659h7495A54565a448A3224J43031b02110A11706
$$ -338789 21845 -131804 -24759 151659 -87495 154565 -1448 13224 156255 -202110 111706
15221A27213K56492C3415K68366C4247e7827C17668j49335F8095K62322H7581
$$ 127213 383705 33415 301781 34247 -57827 317668 168333 68095 330417 87581
15210g8926j0041A04080b8946A61831E8138a68627C71393I2583J17801D847J60790
$$ -78926 -88967 104080 -28946 161831 58138 -168627 371393 92583 210384 4847 165637
15199A65637G6199J66418D9224Q647a40893B00308a74677C67584A64422Q5418
$$ 165637 76199 242617 49224 57871 -140893 200308 -174677 367584 164422 249840
15189B49840a49889G2475O0901a96C74217A21754n7293J8368R9735L3309B2378
$$ 249840 -149889 72475 133376 -196 374217 121754 64461 82829 182564 215873 22378
15177B49345A04309a88903A28672n1873e789B62111B3751L7763J79723J23022
$$ 249345 104309 -188903 128672 76799 -5789 262111 23751 61514 241237 364259
15167C64259D9374L23941A65507c1865C33053m4578o1950f616j86163c6663Q256
$$ 364259 49374 373315 165507 -31865 333053 288475 226525 -6616 -192779 -36663 -28407
15156b8407j2934j4400m6979C20718m9156C4069K55820F0234M22813D6319J61441
$$ -28407 -41341 -55741 -102720 320718 271562 34069 289889 60234 483047 46319 207760
15145B07760B5396K67708I6655O3750i6819A60507K5520L4616F38b8026l341q2009
$$ 207760 25396 293104 96655 160405 -96819 160507 186027 220643 638 -28026 -31367 -113376
15133a13376B8977N38226c8487B3522a47281A8742J57620b87529B82504f6071
$$ -113376 28977 567203 -38487 23522 -147281 18742 176362 -287529 282504 -66071
15122f5087j09642D00888M6280I205a2215n9565F4154a53924D09689A71722J09579
$$ -65087 -174729 400888 447168 9205 -12215 -71780 64154 -153924 409689 171722 281301
15111B81301j6745F0488R2505J03545A00323a8880A91163o800a00511L6960A34816
$$ 281301 264556 60488 152993 256538 100323 -18880 191163 184363 -100511 -63551 134816
15099A64439b4873F1785A5828N2298K65442D117K3377a9107A86633C9285P4472
$$ 164439 -24873 61785 15828 68126 333568 4117 27494 -19107 186633 39285 113757
15088A13757c0709A44376K65955A52727K15274H7262J47621B834K50696j25167
$$ 113757 -30709 144376 410331 152727 368001 87262 234883 2834 253530 128363
15078A28363n7905J94112m8387J79192L7292a012B94607A10315J30611f4615B62918
$$ 128363 70458 264570 216183 395375 432667 -1012 294607 110315 240926 -64615 262918
15066a79019D97547c0090E0791j2802N4637M20477B44571q6263J52623a04625
$$ -179019 497547 -30090 50791 37989 92626 513103 244571 158308 310931 -104625
15055C65474q6069A26234K51201p6950H3582K96690i6603A60308f4910I973M07252
$$ 365474 279405 126234 377435 300485 83582 380272 -96603 160308 -64910 9973 417225
15044D17225o0011G9997J73696I6600K12148j51095B8480J58794p387B691f383
$$ 417225 357214 79997 253693 96600 308748 157653 28480 187274 179887 2691 -6383
15032A58640J67739j07317Q0539j24479R22o7335h671C14596F0744M39691b0896
$$ 158640 326379 219062 299601 175122 176044 108709 -8671 314596 60744 500435 -20896
15020A2120e7398A78975J85716K44419l04397G2993J39018d9329A55350J51142
$$ 12120 -57398 178975 364691 609110 304713 72993 212011 -49329 155350 306492
15010C06492j37124J08199A33168J00929J4251J06400j28676J79538F0819d0936
$$ 306492 169368 277567 133168 234097 248348 354748 226072 405610 60819 -40936
14999h1725F4315J42474a55191A47673j2555l3830d6765A58319K58027K03079
$$ -81725 64315 206789 -155191 147673 135118 101288 -46765 158319 416346 619425
14989F19425a37941E7467a4612D83118q4704J37590A98521c10262B31121L66083
$$ 619425 -137941 57467 -14612 483118 398414 536004 198521 -310262 231121 597204
14979E97204I7071m899L91406c6193A47792d7054B31729I6796M32332c6203D23701
$$ 597204 97071 92172 483578 -36193 147792 -47054 231729 96796 529128 -36203 423701
14967C90062j30814j7518i4729B51452L2812K53820B55687n5995M3966a58622
$$ 390062 259248 241730 -94729 251452 284264 538084 255687 199692 243658 -158622
14956E94e0953C86155j34232M74594P8814l90232j71168K63815j01647J32102
$$ 594 -50953 386155 251923 726517 805331 415099 243931 507746 406099 538201
14946E38201n8327j93949j00167J17151p7380J68426M1337B06149a2067B16105
$$ 538201 479874 285925 185758 302909 225529 393955 435292 206149 -12067 216105
14935A70974K78218j55216L09680j97369M5820j22838M5044F8648J77612K81125
$$ 170974 449192 293976 603656 406287 452107 329269 374313 68648 246260 527385
14925E27385A58276J79332k3508j16602M32354k5052B42885P2827N9072A71919
$$ 527385 158276 337608 314100 197498 629852 604800 242885 315712 374784 171919
14914A08398K18512j7361J24785B08070K25140A68418J19789o869r1633Q8493
$$ 108398 326910 309549 434334 208070 433210 168418 288207 281338 189705 278198
14904B78198L74816A89946K00934A25740K06522J23891p1939k0297M9514B8508
$$ 278198 653014 189946 390880 125740 332262 456153 384214 363917 413431 28508
14893D22799A68109L96848k44454n3804J16676A86825M70698l17281F1104J27001
$$ 422799 168109 564957 320503 266699 383375 186825 657523 340242 61104 188105
14883A88105R070R7771J47308N2813k3656m9790k06420K13416n7506p9544j2808
$$ 188105 197175 294946 442254 495067 471411 421621 215201 428617 371111 291567 278759
14872B78759K13978k14814r8185K8732j9151M3755K20323l8692r1636J06028J2089
$$ 278759 492737 277923 179738 208470 189319 233074 453397 414705 323069 429097 441186
14861D41186E6011O21022j58749j46953A14685J93726L80222q8798j56889j36226
$$ 441186 56011 677033 518284 371331 114685 308411 688633 599835 442946 306720
14851C06720L26886A88292L68160j99584M4422J3739m2469m8867N6552J03615
$$ 306720 633606 188292 556452 356868 401290 415029 372560 323693 380245 483860
14841D83860o1988l2746J96584K34739A99435K31668q1860J01415N2782L1306
$$ 483860 421872 389126 585710 820449 199435 431103 349243 450658 503440 534746
14831E34746q2331p4665q2663K28352j87941L47926j71176j4473l2237j6208K84706
$$ 534746 452415 377750 295087 523439 335498 683424 512248 497775 465538 449330 734036
14820G34036j95195m1290l0854J17723k85105J77915A77853O35023l17798K10382
$$ 734036 538841 497551 466697 584420 299315 477230 177853 812876 495078 705460
14810G05460P8545l66455m4383M11575l0428k80827P3253k7344J26017j08565
$$ 705460 784005 417550 373167 784742 754314 473487 546740 519396 645413 536848
14800E36848r5310K34976M2051k36868j15281L69751k87979l9744K63643k42079
$$ 536848 441538 676514 718565 481697 366416 736167 448188 408444 672087 430008
14790D30008J87495j49540L51095l18234M0750J37392j15238K54946k64474k30359
$$ 430008 617503 467963 819058 500824 541574 678966 563728 818674 554200 323841
14780C23841N75350j98531j35585j11019M24784j24392N3802k24423K3619J00777
$$ 323841 899191 700660 565075 454056 878840 754448 808250 583827 607446 708223
14770G08223J49799k63838q5784J86507P791l08386r0687K42567K29312B91905
$$ 708223 858022 594184 508400 694907 702698 394312 303625 546192 775504 291905
14759F99841n1535q8988l3377J31299J51139k97910j234l0867J89391J92190j56696
$$ 699841 648306 559318 525941 657240 808379 510469 509235 478368 667759 859949 703253
14748G03253J92799n1862k41655J01968n4408J47989C68956L72349p943j09098
$$ 703253 896052 844190 602535 704503 650095 798084 368956 741305 733362 624264
14738F24264J51264J90295j18138j69021J18044k87388L43023k8139j05475M0181
$$ 624264 775528 965823 847685 678664 796708 509320 852343 824204 718729 758910
14728G58910q8356J97217n6740k03464m3271r553O24314k10390D32308K47076
$$ 758910 670554 867771 811031 607567 564296 554743 1179057 968667 432308 679384
14718F79384O42429n14185l14433K10536j13221K34849P7774J00802l83718K78341
$$ 679384 1321813 807628 493195 703731 590510 825359 903133 1003935 620217 898558
14708H98558k9852L612J26575j65483j30364J74501j20454j52807K73446K1098
$$ 898558 868706 872318 998893 833410 703046 877547 757093 604286 877732 898830
14698H98830o3378L18113L0010l07522m3161l26632J28504P0574L07182J49955
$$ 898830 835452 1153565 1183575 876053 832892 506260 634764 705338 1012520 1162475
14688A162475R638j98007k15344K29869M47524G02579L66668Q2943l98350N29047
$$ 1162475 1172113 974106 758762 988631 1436155 702579 1069247 1152190 753840 1282887
14678A282887N4819n00810M35510m27405K43437q0899L05403k66863k53631K68100
$$ 1282887 1337706 836896 1272406 845001 1088438 1007539 1312942 1046079 792448 1060548
14668A060548J44021k82341q1998K39100J31950k72996K3278J32394K65096j70916
$$ 1060548 1204569 922228 840230 1079330 1211280 938284 961562 1093956 1359052 1188136
14658A188136l08970K32426p0474K00652J34189j82284J06932K04970l19864r4405
$$ 1188136 879166 1111592 1041118 1241770 1375959 1193675 1300607 1505577 1185713 1091308
14648A091308j25073L02390K3349r8280K9410m4321J63744k3226J30566l62060
$$ 1091308 966235 1268625 1291974 1193694 1223104 1178783 1342527 1319301 1449867 1087807
14638A087807m4068J68532K37518k0122j78793Q3044K17983j42991j06747L92535
$$ 1087807 1043739 1212271 1449789 1429667 1250874 1333918 1551901 1408910 1302163 1694698
14628A694698J03866l55274j83518M3613K3080k67985N07319k35022p596J42227
$$ 1694698 1798564 1443290 1259772 1303385 1326465 1058480 1565799 1330777 1323181 1465408
14618A465408K29151p8712J96118l87699J35879l79125K26676Q0940k03807N31386
$$ 1465408 1694559 1615847 1811965 1424266 1560145 1181020 1407696 1488636 1284829 1816215
14608A816215j12836l25003O45217q6851l80626j94500K95863J6391K01098m3210
$$ 1816215 1703379 1378376 2023593 1936742 1556116 1361616 1657479 1673870 1874968 1831758
14598A831758j50140J4307j39136K57307L2297N527J03978J60360n34092J46316
$$ 1831758 1681618 1695925 1556789 1814096 1846393 1851920 1955898 2116258 1582166 1728482
14588A728482L3968J00803q3055K53716k72906M89591k45076k6431K63077l02012
$$ 1728482 1762450 1863253 1780198 2033914 1761008 2250599 2005523 1979092 2242169 1940157
14578A940157J52104M8817J51807k66408J66112j14398j97746L23281O5131p0487
$$ 1940157 2092261 2141078 2292885 2026477 2192589 2078191 1880445 2203726 2268857 2198370
14568B198370m1914J34447L39716p4906m7979k75921M53350J05419o0876j69135
$$ 2198370 2156456 2290903 2630619 2555713 2507734 2231813 2685163 2790582 2729706 2560571
14558B560571J64250L52621K65144Q2175K41952K32933L40229N89679P94962K078656
$$ 2560571 2724821 3077442 3342586 3424761 3666713 3899646 4239875 4829554 5624516 7703172
14548G703172M348214J0034605J7790947K793598k0417422I663530m685754k277616
$$ 7703172 12051386 22085991 39876938 42670536 22253114 9663530 4977776 2700160
14540B700160P8576m84918l26733m997J68378J07855k1375j37317L63458l33192
$$ 2700160 2778736 2293818 1967085 1962088 2130466 2238321 2216946 2079629 2443087 2109895
14530B109895o6537J19455J02854O7843J21460l59095L48904J88938n78937M04709
$$ 2109895 2043358 2162813 2265667 2333510 2454970 2095875 2444779 2633717 2054780 2459489
14520B459489m6608K11362j12590K6579j95189K08538J95190P5799j96488J66043
$$ 2459489 2412881 2624243 2511653 2538232 2343043 2551581 2746771 2822570 2626082 2792125
14510B792125K02797l16449L39266k11869K78224n8469L98647j98974Q9394M8596
$$ 2792125 2994922 2678473 3017739 2805870 3084094 3025625 3424272 3225298 3314692 3363288
14500C363288j79590K52451j89171l92875Q0690K64150K53562l11508L62701n8607
$$ 3363288 3183698 3436149 3246978 2854103 2934793 3198943 3452505 3140997 3503698 3445091
14490C445091L04507l5359q6J9865K05816q1298O7039j11855M63475q11409O86035
$$ 3445091 3749598 3714239 3714153 3734018 3939834 3858536 3925575 3813720 4277195 3465786 4151821
14479D151821l58238j34642M04139j30464M0192K01961K13071l16302O71303k97929
$$ 4151821 3793583 3658941 4063080 3932616 3972808 4174769 4387840 4071538 4742841 4444912
14469D444912p7004O8093k9516m9339J23068o013J0999N02867m17233J5497M71079
$$ 4444912 4367908 4436001 4406485 4357146 4480214 4474201 4485200 4988067 4570834 4586331 5057410
14458E057410k64741J48640K20595J79505o0756q3778K57277j9399M641R5402
$$ 5057410 4792669 4941309 5161904 5341409 5280653 5196875 5454152 5434753 5439394 5534796
14448E534796q7707M6981K49642k97836M04632J23163l8682K12677J0524J7857
$$ 5534796 5447089 5494070 5743712 5445876 5850508 5973671 5934989 6147666 6158190 6176047
14438F176047K99923P6854J07135O911m20191O58826k18495J99382K47575J27787
$$ 6176047 6475970 6552824 6659959 6666870 6246679 6905505 6687010 6886392 7133967 7261754
14428G261754m08984L53795K44768o3353K49656m9905K24261K6530R8399m61M85231
$$ 7261754 6852770 7206565 7451333 7387980 7637636 7587731 7811992 7838522 7936921 7936460 8421691
14417H421691k8179J0260K39387j65813J79281Q24108k90778L78237m07220J11612
$$ 8421691 8393512 8403772 8643159 8477346 8656627 9480735 9189957 9568194 9160974 9272586
14407I272586K59509K12857j5699K86387L08604l5364J62972J36039K15299J67244
$$ 9272586 9532095 9744952 9729253 10015640 10324244 10288880 10451852 10587891 10803190 10970434
14397A0970434K64178K19614J83753j69348N67328L53429P8575K57531J16677
$$ 10970434 11234612 11454226 11637979 11468631 12035959 12389388 12467963 12725494 12842171
14388A2842171L98897j00171M86156j3623K25341L95001L40365K78575j4107L88053
$$ 12842171 13241068 13140897 13627053 13613430 13838771 14233772 14574137 14852712 14838605 15226658
14378A5226658N41038m8509K71564K58261O03949J13693L36752M54996K89200
$$ 15226658 15767696 15719187 15990751 16249012 16852961 16966654 17303406 17758402 18047602
14369A8047602M48399J31202K91153L73983M82332P06689N09588N0201M90979
$$ 18047602 18496001 18627203 18918356 19292339 19774671 20481360 20990948 21041149 21532128
14360B1532128O76251N12296L24472Q96613K94411M61358N05729P68409M98148
$$ 21532128 22208379 22720675 23045147 23941760 24236171 24697529 25203258 25971667 26469815
14351B6469815P40122M88574Q74704N04542J035599L70380N41060J013078R97646
$$ 26469815 27209937 27698511 28573215 29077757 30113356 30483736 31024796 32037874 33035520
14342C3035520J025110P58335P48265J266880J166926J056252J016896J016555
$$ 33035520 34060630 34818965 35567230 36834110 38001036 39057288 40074184 41090739
14334D1090739R32145J742981J197539J022921J536707J474991J522563J298413
$$ 41090739 42022884 43765865 44963404 45986325 47523032 48998023 50520586 51818999
14326E1818999J921688J723555J873634K213495J740221K136925K262536K240548
$$ 51818999 53740687 55464242 57337876 59551371 61291592 63428517 65691053 67931601
14318F7931601K641462K324610K758809K953970L167958K710485L446494L662583
$$ 67931601 70573063 72897673 75656482 78610452 81778410 84488895 87935389 91597972
14310I1597972L720014L781987M448296M344576N032795M455753N099714N413380
$$ 91597972 95317986 99099973 103548269 107892845 112925640 117381393 122481107 127894487
14302A27894487N635457O384018O623710O794994P212029P864140Q042794Q876730
$$ 127894487 133529944 139913962 146537672 153332666 160544695 168408835 176451629 185328359
14294A85328359R018925R753976R824640J0953653J1151693J1534221J2137597
$$ 185328359 194347284 204101260 213925900 224879553 236031246 247565467 259703064
14287B59703064J2885631J3061667J3625955J4032159J4269701J4201271J4414871
$$ 259703064 272588695 285650362 299276317 313308476 327578177 341779448 356194319
14280C56194319J4288396J3493606J3242454J2446716J1178402J0639972Q492255
$$ 356194319 370482715 383976321 397218775 409665491 420843893 431483865 439976120
14273D39976120O147500K481257K82959J86911j155333j159329k444027n660129
$$ 439976120 446123620 448604877 448887836 449074747 447919414 446760085 444316058 438655929
14265D38655929p974985r296658j0675211j1968122j3338787j3877746j4759566
$$ 438655929 430680944 421384286 410709075 398740953 385402166 371524420 356764854
14258C56764854j4997380j4717796j4851536j4246285j3362364j3426595j2767784
$$ 356764854 341767474 327049678 312198142 297951857 284589493 271162898 258395114
14251B58395114j2395213j2256800j1274137j0758826j0295353r675584r038224
$$ 258395114 245999901 233743101 222468964 211710138 201414785 191739201 182700977
14244A82700977q419349q014838p861190p031472p048913o433032n787672n831534
$$ 182700977 174281628 166266790 158405600 151374128 144325215 137892183 132104511 126272977
14236A26272977n514664n227902m501752n001283l986643l632207m166902l547982
$$ 126272977 120758313 115530411 111028659 106027376 102040733 98408526 94241624 90693642
14228I0693642l326915m043195k671380l154059k727597k883461k156999k537284
$$ 90693642 87366727 83323532 80652152 77498093 74770496 71887035 69730036 67192752
14220F7192752k388594j772822k377916k128996j773868k017313j599253j089211
$$ 67192752 64804158 63031336 60653420 58524424 56750556 54733243 53133990 52044779
14212E2044779k209215j550009j202768j309946j438047j082261j004433j635559
$$ 52044779 49835564 48285555 47082787 45772841 44334794 43252533 42248100 40612541
14204D0612541j102154j254855o80290r06597o11464j201166o92030j245795p32480
$$ 40612541 39510387 38255532 37575242 36668645 36057181 34856015 34163985 32918190 32185710
14195C2185710j077920o89816q40009m01107p33327q72467o45933n22839q48756
$$ 32185710 31107790 30417974 29577965 29176858 28443531 27571064 26925131 26402292 25553536
14186B5553536o75959l68749n60260o56767j30393n56239p55970l30979n40858
$$ 25553536 24877577 24508828 23948568 23291801 23161408 22605169 21849199 21518220 20977362
14177B0977362l29996n30216l31005o72597J89317n14623m51306l71113l33448
$$ 20977362 20647366 20117150 19786145 19113548 19302865 18788242 18336936 17965823 17632375
14168A7632375n61351k26746k45139k02778m22772m94398L61343p22437L5729
$$ 17632375 17071024 16844278 16599139 16396361 15973589 15479191 15840534 15118097 15153826
14159A5153826n19307k72160j76790J00493q08019j01956l33452o1163l82335
$$ 15153826 14634519 14362359 14185569 14286062 13478043 13376087 13042635 12981472 12599137
14150A2599137R7818m27631r6651j00166k92621j30022j39172n19050J26620l64407
$$ 12599137 12696955 12269324 12172673 12072507 11779886 11649864 11510692 10991642 11118262 10753855
14140A0753855r2197j9559l11506J15390l75393J29566j86318j5911n19053p7092
$$ 10753855 10661658 10642099 10330593 10445983 10070590 10200156 10013838 9997927 9478874 9401782
14130I401782j5590j42692M5841m49398J92869q818n61121j95950N7877j76910
$$ 9401782 9386192 9243500 9289341 8839943 9032812 9023994 8462873 8266923 8324800 8147890
14120H147890j45761q4718N3676L9530j23021k66996j48523Q9368k12314m1457
$$ 8147890 8002129 7917411 7971087 8010617 7887596 7620600 7472077 7561445 7349131 7307674
14110G307674j68561m6913k07260M946R2797m91240K06726j95856n9246J76837
$$ 7307674 7139113 7092200 6884940 6889886 6982683 6491443 6698169 6502313 6443067 6619904
14100F619904l29204k74538j11505l0708m941M3892J45018j19076j42225k09546
$$ 6619904 6290700 6016162 5904657 5873949 5869008 5912900 6057918 5938842 5796617 5587071
14090E587071J43784n6521k31128l06383K26003o7709p8449K96775m36767o1432
$$ 5587071 5730855 5674334 5443206 5136823 5362826 5295117 5216668 5513443 5076676 5015244
14080E015244l77844J19971K16701p0835L4469j84332J01122J57703l54677K90058
$$ 5015244 4637400 4757371 4974072 4903237 4937706 4753374 4854496 5012199 4657522 4947580
14070D947580o37297J98304P393j44286K61654l75618n2410J66318l85175K40581
$$ 4947580 4310283 4508587 4515980 4371694 4633348 4257730 4205320 4371638 3986463 4227044
14060D227044j40932P5068k52644L31941m6065k71180K34516m62143L26317l18749
$$ 4227044 4086112 4161180 3908536 4240477 4194412 3923232 4157748 3695605 4021922 3703173
14050C703173m87075R40672n57776q7052j44434J48164q6955J33715M3168o7958
$$ 3703173 3216098 4156770 3598994 3511942 3367508 3515672 3428717 3562432 3605600 3537642
14040C537642J10504k02189k01356J16487j3963J00951j00018l37414J99844O9570
$$ 3537642 3648146 3445957 3244601 3361088 3347125 3448076 3348058 3010644 3210488 3280058
14030C280058j0559k73866R6030n1681j83235L88323m36991M41768m55842M20460
$$ 3280058 3269499 2995633 3091663 3039982 2856747 3245070 2808079 3249847 2794005 3214465
14020C214465m34373M6137j51940K1410Q6577j62981n0487j45219j59152N71854
$$ 3214465 2780092 2826229 2674289 2695699 2782276 2619295 2568808 2423589 2264437 2836291
14010B836291m54515J01731k45824L44154J9674k62111j18696q4179L92084l39862
$$ 2836291 2381776 2483507 2237683 2581837 2601511 2339400 2220704 2136525 2528609 2188747
14000B188747P6168j69878o1135K56870j6895N6695k66162o0233M02653m6144
$$ 2188747 2264915 2095037 2033902 2290772 2273877 2330572 2064410 2004177 2406830 2360686
13990B360686K29658J390099K809234Q379146J8844616J0310958j8469167j2686835
$$ 2360686 2590344 3980443 6789677 15168823 34013439 44324397 25855230 13168395
13982A3168395n127478j983896j422559m64492j95611m53968k77068p7236o57073
$$ 13168395 8040917 6057021 4634462 4169970 3974359 3520391 3243323 3166087 2509014
13973B509014M48497j96184m5984J7633m0238m65026K82791l42251L3098P2824
$$ 2509014 2957511 2761327 2715343 2732976 2692738 2227712 2510503 2168252 2201350 2274174
13963B274174j17540O146K53783l24787J3532K59088l94147J54008l05069J82408
$$ 2274174 2156634 2162780 2416563 2091776 2105308 2364396 1970249 2124257 1819188 2001596
13953B001596K0846R1274j69278L72405j07388j46774l02579p2358L48177n36302
$$ 2001596 2022442 2113716 1944438 2316843 2209455 2062681 1760102 1687744 2035921 1499619
13943A499619M15462k15004R6766R8485j25180J67336l34824l8868L93110j02761
$$ 1499619 1915081 1700077 1796843 1895328 1770148 1937484 1602660 1563792 1956902 1854141
13933A854141J73975r9721k88711p4971O0327J0048Q2764k4804Q4485o3175R695
$$ 1854141 2028116 1928395 1639684 1564713 1625040 1635088 1717852 1693048 1777533 1714358 1724053
13922A724053k02657J31952m09883K42542M5735J03822P9963o7715M3645P4722
$$ 1724053 1521396 1653348 1243465 1486007 1531742 1635564 1715527 1647812 1691457 1766179
13912A766179k86144Q9556k33795K4740J7879p8384L34779m31214K57686N210
$$ 1766179 1480035 1569591 1335796 1360536 1378415 1300031 1634810 1203596 1461282 1466492
13902A466492n9171N9928k36518k57299N14160J98350J85561o01570m4267N7945
$$ 1466492 1407321 1467249 1230731 973432 1487592 1685942 1871503 1269933 1225666 1283611
13892A283611J80823R5635k76194K48917k16696n5957J58922l74523K02289j09427
$$ 1283611 1464434 1560069 1283875 1532792 1316096 1260139 1419061 1044538 1246827 1137400
13882A137400K15127k92464K66929l27995L45992m5515n2445l52862J66980J66527
$$ 1137400 1352527 1060063 1326992 998997 1344989 1299474 1247029 894167 1061147 1227674
13872A227674n7617l6597p0337J3124l35970P57032l99455j51091K77582M1929
$$ 1227674 1170057 1133460 1063123 1076247 740277 1497309 1097854 946763 1224345 1266274
13862A266274j60867j1134j09040K15822j06588K6360l14959L10515J36862l28935
$$ 1266274 1105407 1094273 985233 1201055 1094467 1120827 805868 1116383 1253245 924310
13852I24310L79697l80962J19013j9661l8971j50685K80026J9249k4826K10120
$$ 924310 1304007 923045 1042058 1022397 983426 832741 1112767 1132016 1107190 1317310
13842A317310l06609k43510q1559K62685L64769l06087j97077J29476l04531L69184
$$ 1317310 1010701 767191 685632 948317 1313086 1006999 809922 939398 634867 1004051
13832A004051l59744L25022K15640q5922r1018j9389k85688L50047j60058L49758
$$ 1004051 644307 969329 1184969 1099047 1008029 988640 702952 1052999 892941 1242699
13822A242699k93268J52182k52618j53026p6700J38878L16282j42103j13905N4161
$$ 1242699 949431 1101613 848995 695969 619269 758147 1074429 932326 818421 872582
13812H72582J20891j89776J50197o4178j27141j48801L4468O20704m32706K05775
$$ 872582 993473 803697 953894 889716 762575 613774 648242 1268946 836240 1042015
13802A042015j44364k76620J080O8845J96472j93540p9198J03481N1445q9384
$$ 1042015 897651 621031 622111 690956 887428 693888 614690 718171 769616 680232
13792F80232r3181k21351M31839k90494L46832R7619m58970M4597K20726J48567
$$ 680232 587051 365700 797539 507045 853877 951496 492526 537123 757849 906416
13782I06416Q9405m11558R0126K10081j17223n7987n5935B31718O21745j54092
$$ 906416 995821 584263 674389 884470 767247 709260 653325 231718 853463 699371
13772F99371j2914K12382o4352m07861J99039J94265j61010L63211l00913k20769
$$ 699371 686457 898839 834487 426626 625665 819930 658920 1022131 721218 500449
13762E00449L98830J6110l14827j58924J99312j14649K52647j08946K6310r4583
$$ 500449 899279 915389 600562 441638 640950 526301 778948 670002 696312 601729
13752F01729R233R1288K3035j37351K64797k04669L17623D09636L18564J00405
$$ 601729 610962 702250 725285 587934 852731 648062 965685 409636 728200 828605
13742H28605k69306k7334J55872J858j59312K73801r6930k52844K51625M6133
$$ 828605 559299 531965 687837 689695 530383 804184 707254 454410 706035 752168
13732G52168j21430J15969k46733J64124j34139J50017q4695K07430C76367L07440
$$ 752168 630738 746707 499974 664098 529959 679976 595281 802711 376367 683807
13722F83807J59429C47211L37649q183k82923J75325J71201j15984k05756M49371
$$ 683807 843236 347211 684860 676677 393754 569079 740280 624296 418540 867911
13712H67911m03571j59590N20375k2195N5573k61600k3004j61905J01768L1052
$$ 867911 464340 304750 825125 802930 858503 596903 573899 411994 513762 544814
13702E44814B01223K49570J10452j92614Q1400J02828k13373M22124l77177j27609
$$ 544814 201223 450793 561245 368631 450031 552859 339486 761610 384433 256824
13692B56824J35298q5792J31378J69026Q6297j83488j51020A62553K55787j36016
$$ 256824 392122 306330 437708 606734 693031 509543 358523 162553 418340 282324
13682B82324M77775j66800k01744M56166C55749L28693k07564R8934j91072k2021
$$ 282324 760099 593299 391555 847721 355749 684442 476878 575812 384740 362719
13672C62719j25752M11332j71853K6330J23070k0835j27733K69346B49971J67023
$$ 362719 236967 648299 476446 502776 625846 605011 477278 746624 249971 416994
13662D16994j95667N97707l66774k07953L27007K7936k5729j7089k10383P1504
$$ 416994 221327 819034 452260 244307 571314 599250 573521 556432 346049 417553
13652D17553m423J37413k07900K76626k4207J96195j60025K33486C98980j04966
$$ 417553 413130 550543 342643 619269 595062 791257 631232 864718 398980 294014
13642B94014A29211N2373P0760J86008J7216A07833M05786k466n6555B15736J05810
$$ 294014 129211 181584 252344 438352 455568 107833 513619 511153 454598 215736 321546
13631C21546J78396J45337A84733l5845L31219j32630j01496K59220j32204K52625
$$ 321546 499942 645279 184733 148888 480107 347477 245981 505201 372997 625622
13621F25622j16165j03642m0732L6688Q4918m853r1964n8428l1197J00686J51519
$$ 625622 509457 405815 365083 401771 486689 481836 389872 331444 300247 400933 552452
13610E52452A82909j882K52242j76333K960K56601k08208q223O5501B6545J15595
$$ 552452 182909 181027 433269 256936 259896 516497 308289 300066 365567 26545 142140
13599A42140J80902J19711l6353p8813M14895k55594J24915B83160K17380j1078
$$ 142140 323042 442753 406400 327587 742482 486888 611803 283160 500540 489462
13589D89462l2498k338l6217E1979L08363A32347J93048j0008j25556A0673N91885
$$ 489462 456964 454626 418409 51979 360342 132347 325395 315387 189831 10673 602558
13578F02558B49625J98309A72559l8063L0407K08092E9576O13728l9243o0032
$$ 602558 249625 447934 172559 134496 164903 372995 59576 673304 634061 574029
13568E74029E2489L45364j57932R1162J02278j54966F0715K87364J04746L3883
$$ 574029 52489 397853 239921 331083 433361 278395 60715 348079 452825 486708
13558D86708L6082p8797A99735J55729M0542J8605G5974J5836K43745D6372K06382
$$ 486708 522790 443993 199735 355464 396006 414611 75974 91810 335555 46372 252754
13547B52754J1520c7625C60146l0491p8543N7337p9694K85539B56414N3667j33609
$$ 252754 264274 -37625 360146 329655 251112 308449 228755 514294 256414 310081 176472
13536A76472J00771K223O1172a872C99513r6875A29373K25382J3645l9022J52591
$$ 176472 277243 279466 340638 -1872 399513 302638 129373 354755 368400 329378 481969
13525D81969B10425k7390L06747l4211j39722L02818c841B89328A09877o464M14206
$$ 481969 210425 183035 489782 455571 315849 618667 -3841 289328 109877 103413 517619
13514E17619j76156k3245j8100M2336R5218j69419J34638J86880c971C4335J16085
$$ 517619 341463 318218 300118 342454 437672 268253 402891 589771 -3971 34335 150420
13503A50420J53926J17001A25529J72019C6852i9902B74602J10898A89821K07371
$$ 150420 304346 421347 125529 297548 36852 -99902 274602 385500 189821 397192
13493C97192j47877q2670K12634J17118k38562N2997j02703K96081k46065K21761
$$ 397192 249315 166645 379279 496397 257835 310832 208129 504210 258145 479906
13483D79906k05807j12265k0580Q2618n6544n7695j2935J72559K21967H3682K31680
$$ 479906 274099 161834 141254 223872 167328 109633 96698 269257 491224 83682 315362
13472C15362h6316E89532j11076j42320p2022f8090F2761L33468j55832G9472
$$ 315362 -86316 589532 478456 336136 264114 -68090 62761 396229 240397 79472
13461B16633m752a53776A68297b8499A32921L4767E6920O2106p780N2986o8086
$$ 216633 211881 -153776 168297 -28499 132921 167688 56920 119026 111246 164232 96146
13450I6146J71177A23046F0345L94855j61291r72H6857N5416Q6172q7247K54211
$$ 96146 267323 123046 60345 455200 293909 292937 86857 142273 228445 141198 395409
13439C95409K1759E9540K36989J16075n3076K63871a15036C88390A25382J41687
$$ 395409 417168 59540 296529 412604 359528 623399 -115036 388390 125382 267069
13429B67069J2390L6732H4535E290L35246R4244A23016P0086J1964J93256a06471
$$ 267069 279459 316191 84535 5290 340536 434780 123016 193102 205066 398322 -106471
13417D72835A68494a99782D8336R6901d0825G3731B6219K67826r7217n7158J24333
$$ 472835 168494 -199782 48336 145237 -40825 73731 26219 294045 196828 139670 264003
13406B64003l7933a22063C06311D0953L17336l3684J72199A67934m4165J12443
$$ 264003 226070 -122063 306311 40953 358289 324605 496804 167934 123769 236212
13396B36212q8468r656b72504A51523J95257A41330O9806j05480L23412B06207
$$ 236212 147744 138088 -272504 151523 346780 141330 211136 105656 429068 206207
13385I0512J15140B4291J74654J82649a11447B00945M5888Q6869n1118i1681A47682
$$ 90512 205652 24291 198945 381594 -111447 200945 246833 333702 282584 -91681 147682
13373B23514J5266K35335A32296M84115G8591K60602J56747I9354M21007j77989
$$ 223514 238780 474115 132296 616411 78591 339193 495940 99354 520361 342372
13363C42372k5979d8135D42178h164B21671j6565k4274K70536j94649O2793j20730
$$ 342372 316393 -48135 442178 -8164 221671 205106 180832 451368 256719 319512 198782
13352A98782b9859k24206A91884J68632A37357A1381K68028Q9057r021r6009F4472
$$ 198782 -29859 -254065 191884 360516 137357 11381 279409 368466 359445 263436 64472
13340D34916q2060j11766A16142N5892K70370p9107A45099j2000J9092K69828
$$ 434916 352856 241090 116142 172034 442404 363297 145099 133099 152191 422019
13330D22019p2540J37970A31727K60564A13462g2054C02137P2450q3905m4652
$$ 422019 349479 487449 131727 392291 113462 -72054 302137 374587 290682 246030
13320B46030J04902G8051O6682J93348M7220i3297B31326J80981E4617J33084
$$ 246030 350932 78051 144733 338081 385301 -93297 231326 412307 54617 187701
13310A87701r2757a22866a79A45583J27118E9981e1345B52987M8834g1891k71853
$$ 187701 94944 -122866 -179 145583 272701 59981 -51345 252987 301821 -71891 -343744
13299c43744B22115m0401K34962N0914k12907j6171K60114k05992J16964D1531
$$ -343744 222115 181714 416676 467590 254683 238512 498626 292634 409598 41531
13288B25316m5823J02639J0725A38749J54983a2A61328M85862B66164b4187A74404
$$ 225316 179493 282132 292857 138749 293732 -12 161328 647190 266164 -24187 174404
13276A72215L35815a83155A88463L03160A69990N8306a22244e6110K2792l766
$$ 172215 508030 -183155 188463 491623 169990 228296 -122244 -56110 -33318 -37084
13266c7084A9590J33986F4125J29436k1373J9593E1473J50163j7645p1057j9948
$$ -37084 19590 153576 64125 193561 172188 191781 51473 201636 183991 112934 92986
13255I2986a3638N723B02187A522L8698K49263j03346q7602e1938j79219A07860
$$ 92986 -13638 -7915 202187 1522 40220 289483 186137 98535 -51938 -231157 107860
13243C81142l6514Q4850O4735A99835a29901H5666B2719K48786A12644N9918d7108
$$ 381142 344628 429478 494213 199835 -129901 85666 22719 271505 112644 172562 -47108
13231D0689b8175j11711b0575E9706j6092b41955f6933J7570B92209E8971L3901
$$ 40689 -28175 -139886 -20575 59706 43614 -241955 -66933 -49363 292209 58971 92872
13220I2872q430f4980B77142a98475A64364N398a02418r8843A58632a16752A16230
$$ 92872 84442 -64980 277142 -198475 164364 169762 -102418 -201261 158632 -116752 116230
13208a4244E5023J25999m0211a69479I7618J00664q1029J436m7001K03964j09434
$$ -14244 55023 181022 140811 -169479 97618 198282 117253 118689 71688 275652 166218
13197A66218h3612H2886a58774A99166J14032A39617o686c74899O6574B01125
$$ 166218 -83612 82886 -158774 199166 313198 139617 132931 -374899 -308325 201125
13186A63704j4765K3986j482a0626C0245F050K07760K34165C8605J03526R5182
$$ 163704 148939 172925 171443 -10626 30245 6050 213810 447975 38605 142131 237313
13175B37313m192j070n720A12139d5315A86917C3373a29262B27045a70664d1754
$$ 237313 233121 232051 226331 112139 -45315 186917 33373 -129262 227045 -170664 -41754
13163a10953K7323o075A43781R9233a98121a3051A18450L2442l3915d546I4378
$$ -110953 -83630 -89705 143781 243014 -198121 -13051 118450 150892 116977 -4546 94378
13151A70379M9466J0063D6538f1054A41427B8859R3134a32566A96645J09944g1853
$$ 170379 219845 229908 46538 -61054 141427 28859 121993 -132566 196645 306589 -71853
13139B21209l1849q9675j4456N8526n559i5530L8928k03068A82815c89335h5962
$$ 221209 189360 99685 85229 143755 138196 -95530 -56602 -259670 182815 -389335 -85962
13127a10321B92131a36601A21456L4706a60151A97354h5332K9762C25307B7660
$$ -110321 292131 -136601 121456 156162 -160151 197354 -85332 -55570 325307 27660
13116a3622H4630p82K13017a07901I5732J71855m726F4710J31023E8635d0365
$$ -13622 84630 83848 296865 -107901 95732 267587 262861 64710 195733 58635 -40365
13104A64780K1723g9457G2659J28031g1474b0481j23074r2212h6789C2957b60947
$$ 164780 186503 -79457 72659 200690 -71474 -20481 -143555 -235767 -86789 32957 -260947
13092C38843a43038f9081B38651q7704K09690A6188b97657B02947f0337A64251
$$ 338843 -143038 -69081 238651 150947 360637 16188 -297657 202947 -60337 164251
13081B93107l6606m4648A4145L00199E7638L586Q8056K25343p5575M6037l0009
$$ 293107 256501 211853 14145 314344 57638 61224 149280 374623 299048 345085 315076
13070C15076a82681B49087l466A19519a95521A35292a41959B26407k737R7835
$$ 315076 -182681 249087 245621 119519 -195521 135292 -141959 226407 223670 321505
13060C21505A28777L3555k2028c33820b7682C82084C894b8237m508F9519c28474
$$ 321505 128777 162332 140304 -333820 -27682 382084 3894 -28237 -32745 69519 -328474
13048B23394a0207m4596D55892B8654J53553p8097J15708C8250a84630B92713
$$ 223394 -10207 -54803 455892 28654 182207 104110 219818 38250 -184630 292713
13037C13823D6825J17635l2914K55007j44947E9903J60052D8058J5571k743b99128
$$ 313823 46825 164460 131546 386553 241606 59903 219955 48058 63629 60886 -299128
13025A93616m1408F2246K13436A28814n6542c9229C4306J50752m7110b1922D05570
$$ 193616 152208 62246 275682 128814 72272 -39229 34306 185058 137948 -21922 405570
13013A03008g8969n56A29999B7543K09153A06391F427f914l9773K0822C89183
$$ 103008 -78969 -79525 129999 27543 236696 106391 6427 -6914 -46687 -25865 389183
13001B23664D4346L16086K1193M027C6844j1131a18850B41700k5374m3348k9772
$$ 223664 44346 360432 381625 385652 36844 25713 -118850 241700 216326 172978 143206
12990A43206e9502C40044a83772f2571A19539b956j68149I6205k6606J2289l8126
$$ 143206 -59502 340044 -183772 -62571 119539 -2956 -171105 96205 69599 81888 43762
12979D3762a11622e459m2736A82580e3085A84881B4889K00543a16299C6645c700
$$ 43762 -111622 -5459 -48195 182580 -53085 184881 24889 225432 -116299 36645 -3700
12967D19783A35015J20252H6225C7592L52314g9704l6280h802p9738A68248H1134
$$ 419783 135015 255267 86225 37592 389906 -79704 -115984 -8802 -88540 168248 81134
12955a27679j1995a6037k39966d5352l25519a24045B69311a43850B59338I4159
$$ -127679 -139674 -16037 -256003 -45352 -370871 -124045 269311 -143850 259338 94159
12944I5756K2140E8056J04821J5556J05213g8683B27920J83608F8317A8722J71656
$$ 95756 117896 58056 162877 178433 283646 -78683 227920 411528 68317 18722 190378
12933A90378E7747K51917a2898m820C29516J7337l8120B8965c23303A57208e4996
$$ 190378 57747 309664 -12898 -17718 329516 346853 308733 28965 -323303 157208 -54996
12921A13055P4797a68631e225k37485k19278H6991J07095J35801j01019p0352
$$ 113055 187852 -168631 -5225 -242710 -461988 86991 194086 329887 228868 158516
12911A58516i6766j70457d7603E0701J05919O9764c5469D0940L2397g4665D6787
$$ 158516 -96766 -267223 -47603 50701 156620 226384 -35469 40940 73337 -74665 46787
12899A48881l1385O0200b1524j00171E4603A4462d647A03277O7268p7406a39476
$$ 148881 117496 177696 -21524 -121695 54603 14462 -4647 103277 170545 93139 -139476
12887B36599A17427K11551a90536j41180C19148E323J57367a43424B59213d28373
$$ 236599 117427 328978 -190536 -331716 319148 5323 162690 -143424 259213 -428373
12876b45049m002C6948K7115M316J12299g7965A47407a30265J2180A83263a3008
$$ -245049 -249051 36948 64063 68379 180678 -77965 147407 -130265 -118085 183263 -13008
12864I662a99899g0887j37007o2646C2043J58764J5795k6473b6000B10869H5306
$$ 9662 -199899 -70887 -207894 -270540 32043 190807 206602 180129 -26000 210869 85306
12852f5725B51557j21642J98084N7581j37475d6159B69584n1545q4106c8036L573
$$ -65725 251557 129915 327999 385580 248105 -46159 269584 218039 133933 -38036 -34463
12841c4463j36916A61331m6195J56743p2531a4696G4749J42126b30650H9269Q8792
$$ -34463 -171379 161331 115136 271879 199348 -14696 74749 216875 -230650 89269 178061
12830A78061a84381B79570b30782e4400j88478C13276B7506b6033P330l13013
$$ 178061 -184381 279570 -230782 -54400 -242878 313276 27506 -26033 -18703 -331716
12820c31716J46652j12826A06694l4895J81505E4793J17204c98137f7002E488
$$ -331716 -185064 -297890 106694 71799 253304 54793 171997 -398137 -67002 5488
12809F001N1069a83661B08648j5081g2372B73459D125J43619A299J76443J27762
$$ 6001 57070 -183661 208648 193567 -72372 273459 4125 147744 1299 177742 305504
12798C05504j47510E461a32308A25550C5689R2463n5556a74417j09177A70840
$$ 305504 157994 5461 -132308 125550 35689 128152 72596 -174417 -283594 170840
12787H7160J47861a59085q6965A04438L02102b57914Q3774c1250F7368d7547E9168
$$ 87160 235021 -159085 -246050 104438 406540 -257914 -174140 -31250 67368 -47547 59168
12775a18499I3747g789B79281l4975m5173b66902A12285d684k36269B12137m329
$$ -118499 93747 -7789 279281 244306 199133 -266902 112285 -4684 -240953 212137 207808
12764B07808A8150a07579L3602b5844m534B73896A26830l107g1729B89340c62345
$$ 207808 18150 -107579 -73977 -25844 -30378 273896 126830 123723 -71729 289340 -362345
12752b19291j36104p524G8117c5950k51051D0272J89032N4883q8477p7703F740
$$ -219291 -355395 -362919 78117 -35950 -287001 40272 229304 284187 195710 118007 6740
12740B41399b8683C8594a50541L9188B93647A36732J83731C8010N6452b23260
$$ 241399 -28683 38594 -150541 -111353 293647 136732 320463 38010 94462 -223260
12729a8686A80307L1928b36630a14756B11229j5438A2596Q6398O3431a23120e4696
$$ -18686 180307 212235 -236630 -114756 211229 195791 12596 98994 162425 -123120 -54696
12717e8675D8669a65073A28798O1694G7132j5290J23010D0854L0132b2726B30047
$$ -58675 48669 -165073 128798 190492 77132 61842 184852 40854 70986 -22726 230047
12705b1329A18761C9257M74898A01057Q4171J34037I4570h303n1163B27338a07537
$$ -21329 118761 39257 514155 101057 185228 319265 94570 -8303 -59466 227338 -107537
12693A43928n4837J96113b3012C48103b16062A5395K2545L16567c05684J08547
$$ 143928 89091 285204 -23012 348103 -216062 15395 37940 354507 -305684 -197137
12683a97137A86136b59722P9297B60600C5340e5736A56126J54604D0045M8036
$$ -197137 186136 -259722 -180425 260600 35340 -55736 156126 310730 40045 88081
12673H8081k8176K41820h0995F4053R3100a55298a3774H021b16301N3995H1013
$$ 88081 59905 301725 -80995 64053 157153 -155298 -13774 8021 -216301 -162306 81013
12661B32251m8003o3014M4746a15318A09011M957J04681b42320B30833L4720F5075
$$ 232251 184248 121234 165980 -115318 109011 113968 218649 -242320 230833 265553 65075
12649A54578d3383A25475a65586A11605H65L1892L30673A7307b84424C79299A51902
$$ 154578 -43383 125475 -165586 111605 865 32757 363430 17307 -284424 379299 151902
12637f3640A09000O5354n4598a68715b6704A71586k4983F6561K40793f9685D86094
$$ -63640 109000 174354 119756 -168715 -26704 171586 146603 66561 307354 -69685 486094
12625B94879C0685L32874B5709O4573g1311C39773J22236c19155g9420A08646
$$ 294879 30685 363559 25709 90282 -71311 339773 462009 -319155 -79420 108646
12614a61332H1354a16285A12777a25361E4511K4636F644i1605C0557g995E9959
$$ -161332 81354 -116285 112777 -125361 54511 79147 6644 -91605 30557 -7995 59959
12602a32531j89746d7110A6925J87383R1980J63883H0932J68764g3827A70465
$$ -132531 -322277 -47110 16925 204308 296288 460171 80932 249696 -73827 170465
12591a41175A0289a57060B09478m5917F5896a84013B45957D6076A3169O8520g3358
$$ -141175 10289 -157060 209478 163561 65896 -184013 245957 46076 13169 81689 -73358
12579h8581j67566A80379O738P549c3126q6288I0282a40895p8099c1351j10880
$$ -88581 -256147 180379 187117 194666 -33126 -119414 90282 -140895 -218994 -31351 -142231
12568a42231b7927A45937k6111b97926J17902a0641C28047j23756r4234J52927
$$ -142231 -27927 145937 119826 -297926 -180024 -10641 328047 204291 110057 262984
12558B62984k5394H5953K90076a10568J1829D1900N1340R0987A2947J5713b9529
$$ 262984 237590 85953 376029 -110568 -98739 41900 93240 184227 12947 28660 -29529
12546a6536o0978j79519A86241E6014b70159l4335B37015E8078J73209H5927J1627
$$ -16536 -77514 -257033 186241 56014 -270159 -304494 237015 58078 231287 85927 97554
12535I7554K60783F0186b16865J02314r1783C1297d493B19588K39835C738d2751
$$ 97554 358337 60186 -216865 -114551 -206334 31297 -4493 219588 459423 3738 -42751
12523I6209P1330C0087K87596r0185q4368b9397k10704M2790B24476m0949A0296
$$ 96209 167539 30087 317683 227498 143130 -29397 -240101 -197311 224476 183527 10296
12511B04181N9233J75924A40633a9253b330I6088g2938J3568R939n0312k5908
$$ 204181 263414 439338 140633 -19253 -2330 96088 -72938 -59370 -49431 -99743 -125651
12500a25651C9797L78330A55962C558a01547K6302C05994a43784A43451b18507
$$ -125651 39797 418127 155962 3558 -101547 -75245 305994 -143784 143451 -218507
12489G938b6558j29164A21177k1343O0176K20150b6006B69305c67694C9212a1990
$$ 7938 -26558 -155722 121177 99834 160010 380160 -26006 269305 -367694 39212 -11990
12477A21850c2115B29704a85042a3828l3588E9215b95295D2008m961c37213A52626
$$ 121850 -32115 229704 -185042 -13828 -47416 59215 -295295 42008 37047 -337213 152626
12465A18568B1787J77014k8536b7935k10159d9798A76648F4900a188k34536I5862
$$ 118568 21787 198801 170265 -27935 -238094 -49798 176648 64900 -1188 -235724 95862
12453F1023b68771f1023A47103h5846B1141R5932b00446E2243q05P8009h0935
$$ 61023 -268771 -61023 147103 -85846 21141 117073 -200446 52243 51438 129447 -80935
12441b0018k6304C81298g0940n704C18586A5902f15495a15979A85138c5897B26580
$$ -20018 -46322 381298 -70940 -76644 318586 15902 -615495 -115979 185138 -35897 226580
12429a60583j09538k40545A13740n2187o243G966a28380j29844a07144A25181
$$ -160583 -270121 -510666 113740 61553 55310 7966 -128380 -258224 -107144 125181
12418b58117F7968A6151i3858A00402J7964k2081c7009B15268C4220b23891B40824
$$ -258117 67968 16151 -93858 100402 118366 96285 -37009 215268 34220 -223891 240824
12406F1724K70418C0589Q2524g3930K6169q5033C48479a33293h250l4587H3893
$$ 61724 332142 30589 113113 -73930 -47761 -132794 348479 -133293 -8250 -42837 83893
12394A31109B7128R1804n191c21097J16293j25583D4807a20717C11759B3790b71001
$$ 131109 27128 118932 113741 -321097 -204804 -330387 44807 -120717 311759 23790 -271001
12382a24170K0628B6407b90298L1457r5903B23035e49237D09971a96446A08473
$$ -124170 -103542 26407 -290298 -258841 -354744 223035 -549237 409971 -196446 108473
12371e0370A70541N5690n4839a66346K7022A93273a23080L1725b3152E0176f6858
$$ -50370 170541 226231 171392 -166346 -139324 193273 -123080 -91355 -23152 50176 -66858
12359h9599A33603l639f2458o5042l8823J7857A50567H599h0019A3153J63555
$$ -89599 133603 129964 -62458 -127500 -166323 -148466 150567 8599 -80019 13153 176708
12348A76708p1672a04935B69655A14510N7582F1518h3481B79409b15678A84730
$$ 176708 105036 -104935 269655 114510 172092 61518 -83481 279409 -215678 184730
12337B5450J34906n50G3200a48005L4469E5250J23501o2112e1254j4990a0801
$$ 25450 160356 159806 73200 -148005 -113536 55250 178751 116639 -51254 -66244 -10801
12325a76316j9032A21998B5042a39195E1681e3800m8783j64294J07424B84431
$$ -176316 -195348 121998 25042 -139195 51681 -53800 -102583 -266877 -159453 284431
12314e3894C28661f5466n4820K7457c1981C7867L342J22541D3992Q0189c63324
$$ -53894 328661 -65466 -120286 -92829 -31981 37867 41209 163750 43992 124181 -363324
12302A20227J9879n6392a11088n0573A91625K13854b05574j24139a4427A74667
$$ 120227 140106 83714 -111088 -161661 191625 405479 -205574 -329713 -14427 174667
12291C30326R927n4375j31153a48651B67163j01536p4033a14097q7356A886K10794
$$ 330326 340253 285878 154725 -148651 267163 165627 91594 -114097 -201453 1886 212680
12280B12680r0089l7681J29748h0041c1298B40646J7063J3715M8070B6235P24
$$ 212680 122591 84910 214658 -80041 -31298 240646 257709 271424 319494 26235 26959
12269B6959R1834m4934r540B4735g8777E9086J23255l897e8177A15506K8708D3543
$$ 26959 118793 73859 64319 24735 -78777 59086 182341 178444 -58177 115506 144214 43543
12256A20982J3954K0485i9357C59224G2179h2768A01662k2730R2994j9828g5806
$$ 120982 134936 155421 -99357 359224 72179 -82768 101662 78932 171926 152098 -75806
12244A53747P6942k0067c2067B17891C0071Q8278c09377c3983H0878Q988L06679
$$ 153747 230689 210622 -32067 217891 30071 118349 -309377 -33983 80878 89866 396545
12233C96545A61864b36478o4901I0243d7843A32966o2857a18646E0507R9308j99
$$ 396545 161864 -236478 -301379 90243 -47843 132966 70109 -118646 50507 149815 149616
12222A49616K53256B8495M1420J17321c8363C48700j29937C7051a06412C17540
$$ 149616 402872 28495 69915 187236 -38363 348700 218763 37051 -106412 317540
12211A41332a0331l7371m5936e846b789j93542E7422L8117J66084M1426q4200
$$ 141332 -10331 -47702 -93638 -5846 -2789 -196331 57422 95539 261623 303049 218849
12200B18849a69115Q2103B8094J22668b2295D2649K1153N2464f2649B08898g2920
$$ 218849 -169115 -87012 28094 150762 -22295 42649 63802 116266 -62649 208898 -72920
12188a3429C20770a74747F6938J74304G0884a46900q170n1029I0407J36151H5108
$$ -13429 320770 -174747 66938 241242 70884 -146900 -155070 -206099 90407 226558 85108
12176A22800K8341j8021n3365K94332J98922a64549D90883a36352N8214B52372
$$ 122800 151141 133120 79755 374087 573009 -164549 490883 -136352 -78138 252372
12165A05121m3984J40711R9738j17479a94918B75127H6735a94941c3327A53788
$$ 105121 61137 201848 301586 184107 -194918 275127 86735 -194941 -33327 153788
12154b09716A88609a51060A40611a20527j48522c1565C0354K7271i832A29165
$$ -209716 188609 -151060 140611 -120527 -269049 -31565 30354 57625 -9832 129165
12143E59361D6932O2486e7470J2283B73861i7407L5064G1605H001h6202j82189
$$ 559361 46932 109418 -57470 -45187 273861 -97407 -62343 71605 8001 -86202 -268391
12132b68391A04942c84280a08083B63931i6108n6020C56465A62602d9110l8125
$$ -268391 104942 -384280 -108083 263931 -96108 -152128 356465 162602 -49110 -87235
12122h7235j17893F0718R6807i2219B67758j33840k8933J27075A06379a20633
$$ -87235 -205128 60718 157525 -92219 267758 133918 104985 232060 106379 -120633
12111b47150a07351p5190B3130J44353a4857E8741J11083M7891Q5876a53746C1624
$$ -247150 -107351 -182541 23130 167483 -14857 58741 169824 217715 303591 -153746 31624
12099C12066a15081p6260p0894O2315r7969P4813C45761B2981b5972p1230B90584
$$ 312066 -115081 -191341 -262235 -199920 -297889 -223076 345761 22981 -25972 -97202 290584
12087a60975c9947p3057H4847a85413b5892r4502B00330b32002B96375a13753
$$ -160975 -39947 -113004 84847 -185413 -25892 -120394 200330 -232002 296375 -113753
12076D6955b8841A0489h4853B40352M0182b2364E72420O92013L58822G53907j5
$$ 46955 -28841 10489 -84853 240352 280534 -22364 572420 1264433 1623255 753907 753892
12065G53892C03522K2817j59379G0615e6438K5532A34253J54269A18012Q777J38755
$$ 753892 303522 326339 166960 70615 -56438 -30906 134253 288522 118012 126789 265544
12054B65544e1794J6216l274j14362A50805a30623c3490m68472b06420Q6233k9132
$$ 265544 -51794 -35578 -38852 -153214 150805 -130623 -33490 -501962 -206420 -120187 -149319
12043a49319d718o4591A27456b70535G93a46861f262j3755m7541c1511d801A84081
$$ -149319 -4718 -69309 127456 -270535 793 -146861 -6262 -20017 -67558 -31511 -4801 184081
12030b37785i2443j1410A41593P7982i6529A36767N3638J18356P2869d6926A08949
$$ -237785 -92443 -103853 141593 219575 -96529 136767 190405 308761 381630 -46926 108949
12018b64971a18632L0023C41750C033N607a71922m5784c1702j85130H2144N5809
$$ -264971 -118632 -88609 341750 3033 8640 -171922 -217706 -31702 -216832 82144 137953
12007A37953a98613A9761K35567N4216g0689A03770A3112a20555G7050a29420
$$ 137953 -198613 19761 255328 309544 -70689 103770 13112 -120555 77050 -129420
11996a67274g5227A31859b58758A06233g0692B40250G3442R1380b8909H3566a30535
$$ -167274 -75227 131859 -258758 106233 -70692 240250 73442 164822 -28909 83566 -130535
11984B29716p8529O5430H865j935a19596e5856c729C5832d6109b0064j09792C3324
$$ 229716 151187 216617 8865 6930 -119596 -55856 -3729 35832 -46109 -20064 -129856 33324
11971I089J2797h600k90129P5840B62416b07108p7078B60293H6325g779C6109
$$ 9089 21886 -8600 -298729 -222889 262416 -207108 -284186 260293 86325 -7779 36109
11959i4879J4875A80392g990j71414H5484l0628f1737C3234b76563h1529D5447
$$ -94879 -80004 180392 -7990 -179404 85484 54856 -61737 33234 -276563 -81529 45447
11947B79571a85795F9755L1198k2919a1548r4496A25543b68277A39939i2753l8620
$$ 279571 -185795 69755 100953 78034 -11548 -106044 125543 -268277 139939 -92753 -131373
11936a31373j0401A05209c4510k91450E6775K36947C7968g0949A78266M6880q9564
$$ -131373 -141774 105209 -34510 -325960 56775 293722 37968 -70949 178266 225146 135582
11925A35582e9463K8875F4208N7518a4875j21904p8194i4686A44358h5232j00440
$$ 135582 -59463 -30588 64208 121726 -14875 -136779 -214973 -94686 144358 -85232 -185672
11914a85672F3865a22293m6350k9894C1711b8368A49047h9729K2159A29308J42215
$$ -185672 63865 -122293 -168643 -198537 31711 -28368 149047 -89729 -67570 129308 271523
11903B71523a94528j24676g1480G4407a64328B28092n5740G9485D195d530G0579
$$ 271523 -194528 -319204 -71480 74407 -164328 228092 172352 79485 4195 -4530 70579
11891a11005I8953K69204A228a04546E9279a28814L5314A74356j5974C3684e6439
$$ -111005 98953 368157 1228 -104546 59279 -128814 -93500 174356 158382 33684 -56439
11879a6009r4133A40636K21034E7932i5641I3173a84273K2473b5407C3021c30561
$$ -16009 -110142 140636 361670 57932 -95641 93173 -184273 -161800 -25407 33021 -330561
11867b64207G1667a86704k2786A09658a9435r3235r9352E4462R9957f1357A1622
$$ -264207 71667 -186704 -209490 109658 -19435 -112670 -212022 54462 154419 -61357 11622
11855G5329K16791b47482c2749j66897g2261c5302B68344G4869b26795M0937j09019
$$ 75329 292120 -247482 -32749 -199646 -72261 -35302 268344 74869 -226795 -185858 -294877
11844b94877J16840A11456D0483J33750h1954o2294D9801a36590A32518a2614
$$ -294877 -178037 111456 40483 174233 -81954 -144248 49801 -136590 132518 -12614
11833d00868h2561B27535a47193j50889G8204a79821b9645j55711D4295b35225
$$ -400868 -82561 227535 -147193 -298082 78204 -179821 -29645 -185356 44295 -235225
11822a69134B95543d3128j7407k9433r4681j58255G392l597J84339A5771a21566
$$ -169134 295543 -43128 -60535 -89968 -184649 -342904 7392 3795 188134 15771 -121566
11810C4828a52697B45085c49832D7277A0168J38557k9181a31047I4748L807a99379
$$ 34828 -152697 245085 -349832 47277 10168 148725 119544 -131047 94748 98555 -199379
11798I9737B5943J26316a34986A87361J1080c26927P5060a6834D3614R241j6838
$$ 99737 25943 152259 -134986 187361 198441 -326927 -251867 -16834 43614 52855 36017
11787C6017K4060f9469A64159G8965D224J42143n8518L49108b18326q4717g4554
$$ 36017 60077 -69469 164159 78965 4224 146367 87849 436957 -218326 -303043 -74554
11775b33266l0029E263h2768K5421k19407R6103n1947A05936b64380J15600l8142
$$ -233266 -263295 5263 -82768 -57347 -276754 -180651 -232598 105936 -264380 -148780 -186922
11764a86922j20311A94663a06679A86958F0220b4103R525B78357b57752c3925
$$ -186922 -307233 194663 -106679 186958 60220 -24103 -14578 278357 -257752 -33925
11753b01752h986I3086A8110g104G8938a37257b3053k33684A76982h057A74085
$$ -201752 -8986 93086 18110 -7104 78938 -137257 -23053 -256737 176982 -8057 174085
11741A7964L7759A7189K10786J64572p2601A40343c83107d9239B2942b2022D8322
$$ 17964 55723 17189 227975 392547 319946 140343 -383107 -49239 22942 -22022 48322
11729H9327B0837a29784j30259f3191I1956a59082a1300k1153E2348e2385p908
$$ 89327 20837 -129784 -260043 -63191 91956 -159082 -11300 -32453 52348 -52385 -60293
11718f0293B47711D6372K13647E0988J26867c6981j12159k67365B37970a83685
$$ -60293 247711 46372 260019 50988 177855 -36981 -149140 -416505 237970 -183685
11707a86749e5990j7455C3701J69975J48253B8931a59450B03910j0668r0610M3181
$$ -186749 -55990 -73445 33701 203676 351929 28931 -159450 203910 193242 102632 145813
11696A45813o3698e6656B67975a65828b9229E9862b3445j06957f4893j59439h9199
$$ 145813 82115 -56656 267975 -165828 -29229 59862 -23445 -130402 -64893 -224332 -89199
11684E4926L95282c4784J6490B70647c38939H3947a04107e1819C4106J91671j1026
$$ 54926 450208 -34784 -18294 270647 -338939 83947 -104107 -51819 34106 225777 214751
11673B14751a82623B37733M7225r8777L0999i9872o1652B83440m1432b5220j33294
$$ 214751 -182623 237733 284958 186181 217180 -99872 -161524 283440 242008 -25220 -158514
11662a58514B3112a52351b7387A12243a11724c1703Q22j16166j03883B91919a05027
$$ -158514 23112 -152351 -27387 112243 -111724 -31703 -30881 -147047 -250930 291919 -105027
11650h1500A25933K7777f1766A24113i3767F7364a39450B00184F5595B1229h0276
$$ -81500 125933 153710 -61766 124113 -93767 67364 -139450 200184 65595 21229 -80276
11638b10680b3029C2981R777a93144d3325A99677a29938N4035I5243d2164A26827
$$ -210680 -23029 32981 42758 -193144 -43325 199677 -129938 -75903 95243 -42164 126827
11626A21711M500K61183k6246A15477O2086B3923L2301a57481f3831a2806k21738
$$ 121711 126211 387394 361148 115477 177563 23923 56224 -157481 -63831 -12806 -234544
11615b34544G1049a75474E7398k4585J9189J1196k4528J05463C7191K56335F1854
$$ -234544 71049 -175474 57398 32813 52002 63198 38670 144133 37191 293526 61854
11603a13866N109c0855j17157j5253C46560f2344c318k02921d7666C11677j5525
$$ -113866 -108757 -30855 -148012 -163265 346560 -62344 -3318 -206239 -47666 311677 296152
11592B96152a69159J2119k0257j28770A28953K00447A37770C9231K9939f04p0826
$$ 296152 -169159 -157040 -177297 -306067 128953 329400 137770 39231 69170 -604 -71430
11581g1430c2822E9710i5224A27407d0363m0507A00443B5221Q5188J51101J3750
$$ -71430 -32822 59710 -95224 127407 -40363 -80870 100443 25221 110409 261510 275260
11570B75260b61792a5788A69244a3005j47749A44066l8865e1101B07150D2707
$$ 275260 -261792 -15788 169244 -13005 -160754 144066 105201 -51101 207150 42707
11559f538B41119d4270k3923A6584b59280g5375A25576a501p7818k75371A14418
$$ -6538 241119 -44270 -68193 16584 -259280 -75375 125576 -1501 -79319 -354690 114418
11547B87387o4349A7285f0513E0008i5491L0031G0005b02251A89136N5370D8480
$$ 287387 223038 17285 -60513 50008 -95491 -65460 70005 -202251 189136 244506 48480
11535C46027H4997b8968B45659B0878O7141O6301m6394b83144a09531A11793b3710
$$ 346027 84997 -28968 245659 20878 88019 154320 107926 -283144 -109531 111793 -23710
11523f0437A9916c5897C6627J69883i9557F8056a48346A60271i9817C9601n473
$$ -60437 19916 -35897 36627 206510 -99557 68056 -148346 160271 -99817 39601 34128
11512C4128M1320l13c8458H3388B9799i0176b6345E8555a14075b7878j10452B33363
$$ 34128 75448 75135 -38458 83388 29799 -90176 -26345 58555 -114075 -27878 -138330 233363
11499A98994K42726D5375c42833A50175k4803f7212B23078a89011A01889L7183
$$ 198994 441720 45375 -342833 150175 125372 -67212 223078 -189011 101889 139072
11489A39072m2660a06597A30068c5328B288i838A32394K06459a05351A43300C2493
$$ 139072 96412 -106597 130068 -35328 2288 -9838 132394 338853 -105351 143300 32493
11477B11431i2673E1311N574a54590D0730J48159g7741A82848C1296R5188J08016
$$ 211431 -92673 51311 56885 -154590 40730 188889 -77741 182848 31296 126484 234500
11466B34500g4355A90698a9741B08446J1432p8218M1478K2161d9418B02579Q9770
$$ 234500 -74355 190698 -19741 208446 219878 141660 183138 205299 -49418 202579 292349
11455B92349a54922C79057j39705J54490c51B72603a81823A26506K63707G7339
$$ 292349 -154922 379057 239352 393842 -351 272603 -181823 126506 390213 77339
11444d0991A49412m64P1012a93935M9021K8582E8169O2842B1455e9522A22583
$$ -40991 149412 148948 219960 -193935 -144914 -116332 58169 121011 21455 -59522 122583
11432b9115m4853A77549i2838G7019b6406A23677a37428d5103j42815f9415C08389
$$ -29115 -73968 177549 -92838 77019 -26406 123677 -137428 -45103 -187918 -69415 308389
11420A72332A9400N8136b50026A86501F5288c14416J19520A57018B8167K34409
$$ 172332 19400 77536 -250026 186501 65288 -314416 -194896 157018 28167 262576
11410B62576d331N77n2958F2346J31166E6598h5125C707K08321o7175f4974B3534
$$ 262576 -4331 -3754 -56712 62346 193512 56598 -85125 3707 212028 144853 -64974 23534
11397F5018j1469a1163B58302i2010B80567f5573B6996b20715G575h619B34396
$$ 65018 53549 -11163 258302 -92010 280567 -65573 26996 -220715 7575 -8619 234396
11385D8081J11598b87658D9376m065N8394b4437k30375a12453B27240J88288E3095
$$ 48081 159679 -287658 49376 45311 103705 -24437 -254812 -112453 227240 415528 53095
11373A19255A3760J17062J5362b973k1132j55410o3739J1272M3748D2539J10112
$$ 119255 13760 130822 146184 -2973 -24105 -179515 -243254 -231982 -188234 42539 152651
11362A52651a23877d9510A98374a6029k20983A01386P6016G8504J57514a82099
$$ 152651 -123877 -49510 198374 -16029 -237012 101386 177402 78504 236018 -182099
11351E71366a72490e8601A85074i0176C68670a48326E4419Q5677a97736f9224
$$ 571366 -172490 -58601 185074 -90176 368670 -148326 54419 140096 -197736 -69224
11340a10144m6442r0700A47466Q6025m1549B3537d7932r786n2207M0080H7551
$$ -110144 -156586 -247286 147466 233491 191942 23537 -47932 -57718 -109925 -69845 87551
11328a55405J9437n6426B5734a99258B0242e2956B03273H2941b32895f9086n5204
$$ -155405 -135968 -192394 25734 -199258 20242 -52956 203273 82941 -232895 -69086 -124290
11317a24290a4119B14416k5606i2624B87484a31183H721P6513b0764A06326f6860
$$ -124290 -14119 214416 188810 -92624 287484 -131183 8721 85234 -20764 106326 -66860
11305A60645m2790d1521B21936b37000l21c7699j59226a3481n7647j97940a5510
$$ 160645 117855 -41521 221936 -237000 -237321 -37699 -196925 -13481 -71128 -269068 -15510
11293I4093K63555b2316A89535f2399j46598A84072N698a15751A44245a35717
$$ 94093 357648 -22316 189535 -62399 -208997 184072 189770 -115751 144245 -135717
11282a39580B35162c03977i5569K1633a6291k84665g0735o6292E26581d0732C76264
$$ -139580 235162 -303977 -95569 -73936 -16291 -300956 -70735 -137027 526581 -40732 376264
11270b2216j4243J7904j15766A221f5238o2455C26736O1626E2950a8548K482k5830
$$ -22216 -36459 -18555 -134321 1221 -65238 -127693 326736 388362 52950 -18548 -16066 -41896
11258d1896A47429a61305E2332a24223C6731c03154h7663b5173A51339h1360b3015
$$ -41896 147429 -161305 52332 -124223 36731 -303154 -87663 -25173 151339 -81360 -23015
11246b60153A9425i2018A38647d70703a13766l06078J25632f0401k7141B68491
$$ -260153 19425 -92018 138647 -470703 -113766 -419844 -294212 -60401 -87542 268491
11235a92584e441j64664P0116A63830g8367k33951j78677A59762a45657P0878
$$ -192584 -5441 -170105 -99989 163830 -78367 -312318 -490995 159762 -145657 -74779
11225g4779A38190a03043B0357K28212B1619b91595J20410k00856J8225f9704
$$ -74779 138190 -103043 20357 248569 21619 -291595 -171185 -372041 -353816 -69704
11214A75970a87315J7370P299c1426H9002k4486K29178b23014h5119E3081A2062
$$ 175970 -187315 -169945 -162646 -31426 89002 64516 293694 -223014 -85119 53081 12062
11202f3522A46807d3742j21249B0042J45660F9623c08427f4542D8989J17728i337
$$ -63522 146807 -43742 -164991 20042 165702 69623 -308427 -64542 48989 166717 -9337
11190A65164c79019A82031p172a53619k80137B20658a97747j53937F1752b01990
$$ 165164 -379019 182031 174859 -153619 -433756 220658 -197747 -351684 61752 -201990
11179g2257A98826f8640j42777A06329J95117g6411F9819K4003J51979a79430
$$ -72257 198826 -68640 -211417 106329 301446 -76411 69819 93822 245801 -179430
11168d3522k29721M7381A04291d15700a28845e0080A66842m1266e2103j32630
$$ -43522 -273243 -225862 104291 -415700 -128845 -50080 166842 125576 -52103 -184733
11158a84733I7255P8189B0891a14887o4443b848A43784C3952R1525A5867b71104
$$ -184733 97255 175444 20891 -114887 -179330 -2848 143784 33952 125477 15867 -271104
11146C5164a35667e8738k51112H2148K0289a790n5237j16970a3696A15555a14715
$$ 35164 -135667 -58738 -309850 82148 102437 -1790 -57027 -173997 -13696 115555 -114715
11134f0757A83242h007j87916P4294m9315B65637j17306j0596J91489j1567A0664
$$ -60757 183242 -8007 -195923 -121629 -170944 265637 148331 137735 329224 317657 10664
11122F6352k8182K95786A00572g1767B35004e0252I0390c07416A99217J62929
$$ 66352 38170 333956 100572 -71767 235004 -50252 90390 -307416 199217 362146
11112C62146F9108c52457a46745o2352B12711f9962A93668b22314c1862A25752
$$ 362146 69108 -352457 -146745 -209097 212711 -69962 193668 -222314 -31862 125752
11101e9652F1064K07228P2841f1855A21285D3109J83989J66803H6336K33290A16377
$$ -59652 61064 268292 341133 -61855 121285 43109 227098 393901 86336 319626 116377
11089A85592J6933I4241l5144M33424j94655j05478J82485j85165K01970A63592
$$ 185592 202525 94241 59097 492521 297866 192388 374873 189708 391678 163592
11078B50487j8077J5120l5923J39842j2639A46436K16232d2967C64507J37118
$$ 250487 232410 247530 211607 351449 338810 146436 362668 -42967 364507 501625
11068E01625A54637L69838k11307K18416k27388J06853p7850K19371k27316K96596
$$ 501625 154637 524475 313168 531584 304196 411049 333199 552570 325254 621850
11058F21850K31027k14878n9021j45257J69536n3274J98204j70578M2861l280
$$ 621850 852877 637999 578978 433721 603257 549983 748187 577609 620470 617190
11048F17190k41065J22601K46201K34818D33937Q4712L1178L56258k29805L6178
$$ 617190 376125 498726 744927 979745 433937 518649 549827 906085 676280 712458
11038G12458K54013m25248R1098J6676n8265k38927L18519l3855B26822L93327
$$ 712458 966471 541223 632321 648997 590732 351805 670324 636469 226822 620149
11028F20149K47655C98286K82218j75963J84342L0924r5596j7866M93408k17237
$$ 620149 867804 398286 680504 504541 688883 719807 624211 606345 1099753 882516
11018H82516k92298o561j40358m3017n8081K87108J2289j04122k26432P81234
$$ 882516 590218 583657 443299 400282 342201 629309 641598 537476 311044 1092278
11008A092278m81629K7306l14273L41316r5020r811J98609B12527M96628j29004
$$ 1092278 610649 637955 323682 664998 569978 560167 758776 212527 709155 580151
10998E80151j46209J11575K79267D11105L14615J5809r1820j57604J19922j30791
$$ 580151 433942 545517 824784 411105 725720 741529 649709 492105 612027 481236
10988D81236M17377O6778j13156J51651q9749J8163J43507k5502j7660M33554
$$ 481236 898613 965391 852235 1003886 914137 932300 1075807 1050305 1032645 1466199
10978A466199q0541M63330j1186K12623M04129J76102j33176P4872K49600l13566
$$ 1466199 1385658 1848988 1837802 2050425 2454554 2630656 2497480 2572352 2821952 2508386
10968B508386l51236L77355n91759J12355m32601K32087k01110N51873l42463
$$ 2508386 2157150 2534505 1942746 2055101 1622500 1854587 1653477 2205350 1862887
10959A862887N6929L95556k13538k94974Q611R295l84993j96079k57743p832o4131
$$ 1862887 1919816 2315372 2101834 1806860 1815471 1824766 1439773 1243694 985951 978119 913988
10948I13988l29189j08264K4715K17424k37980A19453J29391I6167K74425o7508
$$ 913988 584799 476535 501250 718674 480694 119453 248844 96167 370592 303084
10938C03084R437J00405j81291R1451D2151J02311O7078a19043E6678J25619l3124
$$ 303084 312521 412926 231635 323086 42151 144462 211540 -119043 56678 182297 149173
10927A49173c893j10737B7462K22995a26115d6922D434J4722a55429k7916A5899
$$ 149173 -3893 -114630 27462 250457 -126115 -46922 4434 19156 -155429 -183345 15899
10915H3300K1833e8152A81728a56317A475J6020M8395k5401a18080m2230o1090
$$ 83300 105133 -58152 181728 -156317 1475 17495 65890 40489 -118080 -160310 -221400
10904b21400h29A33367j8664M8298j1195A675P1558P3921O6431b4286j51059K8169
$$ -221400 -829 133367 114703 163001 151806 1675 73233 147154 213585 -24286 -175345 -147176
10892a47176D7256a68383J8356N0390C9229a21954b7671j12265I0767c10053c1470
$$ -147176 47256 -168383 -150027 -99637 39229 -121954 -27671 -139936 90767 -310053 -31470
10880e7355k86041a44106O0273C8172b86124A8534c93844E63a1165A25581Q9788
$$ -57355 -343396 -144106 -83833 38172 -286124 18534 -393844 563 -11165 125581 215369
10869B15369D7861P4917g3595C3260a7224C3961L4454g327j80368l0934b6024
$$ 215369 47861 122778 -73595 33260 -17224 33961 68415 -7327 -187695 -218629 -26024
10857g4428o1610E8742k6590b1879A62917a18281D221L33409q3407e87439a82738
$$ -74428 -136038 58742 32152 -21879 162917 -118281 4221 337630 254223 -587439 -182738
10845e3833n9868k09611A21780c24207A66064o5401J14168F0046Q1930M3026k7336
$$ -53833 -113701 -323312 121780 -324207 166064 100663 214831 60046 141976 185002 157666
10834A57666a22293a498j7986p220E0449a03335C2412a82268B55625O4603j32510
$$ 157666 -122293 -1498 -19484 -26704 50449 -103335 32412 -182268 255625 320228 187718
10823A87718b27815A98965r7489f9503o7544J6635k97327R4458J27607C0939J65541
$$ 187718 -227815 198965 101476 -69503 -137047 -120412 -417739 -323281 -195674 30939 196480
10812A96480D0562b36222P4272C00733H1318c6007B33611b1364j87772R7629e4662
$$ 196480 40562 -236222 -161950 300733 81318 -36007 233611 -21364 -209136 -111507 -54662
10800A5036o370O0002b05119A22513Q3808G6786O102g0167k26910A44034j5444
$$ 15036 8666 68668 -205119 122513 206321 76786 82888 -70167 -297077 144034 128590
10789A28590b42721d7944m4656C6683c14603d6959k78091a51859K4844G1714c06
$$ 128590 -242721 -47944 -92600 36683 -314603 -46959 -325050 -151859 -127015 71714 -306
10777A33147b9691A15015a03136B67144E8240J60257A3444b49838Q6027P857C2943
$$ 133147 -29691 115015 -103136 267144 58240 218497 13444 -249838 -163811 -155954 32943
10765F6179J75014b57589j09490a50887C17399o4019a37715k92818C00907b0497
$$ 66179 241193 -257589 -367079 -150887 317399 253380 -137715 -430533 300907 -20497
10754c4730a1308j94819D2099N3794N4110c11532A50532n3647k1378K31049f4118
$$ -34730 -11308 -206127 42099 95893 150003 -311532 150532 96885 75507 306556 -64118
10742G983J85111a90814B10251c96793A68216a28410A32042l4429i3288q7878
$$ 7983 193094 -190814 210251 -396793 168216 -128410 132042 97613 -93288 -181166
10732a81166b6970n475E9522N1066q922c23564A46217j8702b32922e4414A9656
$$ -181166 -26970 -32445 59522 110588 101666 -323564 146217 127515 -232922 -54414 19656
10720b5906A6835b99318A39445b77929D3023K7815B9371a08420A31025b0992j30979
$$ -25906 16835 -299318 139445 -277929 43023 70838 29371 -108420 131025 -20992 -151971
10709a51971j10693d7600k15420R6251l4993m0776h5165k32963o6167b3210A21703
$$ -151971 -262664 -47600 -263020 -166769 -201762 -242538 -85165 -318128 -384295 -23210 121703
10697C2275b08623A14215a79299j89449e2580a0779B05515c8210A4574O1514a66835
$$ 32275 -208623 114215 -179299 -368748 -52580 -10779 205515 -38210 14574 76088 -166835
10685d39221J97008b3765j20536f0884m00095b17593J1892R3615r9595c1929A15617
$$ -439221 -242213 -23765 -144301 -60884 -460979 -217593 -205701 -112086 -211681 -31929 115617
10673a69642B20909g1306I4128e8606k6274A69528A130K5138b5309A1588f8240
$$ -169642 220909 -71306 94128 -58606 -84880 169528 1130 26268 -25309 11588 -68240
10661b46657J08500o0529M7533j25086B78176A12173b85640Q5133M3338a3735
$$ -246657 -138157 -198686 -151153 -276239 278176 112173 -285640 -200507 -157169 -13735
10650f9279K1681j63219I348J01901a65180A01328l7620b27282a01685k18548
$$ -69279 -47598 -210817 9348 111249 -165180 101328 63708 -227282 -101685 -320233
10640c20233G3444c05056J03175B19862c3772j12358d2163j57116k5591A49981
$$ -320233 73444 -305056 -201881 219862 -33772 -146130 -42163 -199279 -224870 149981
10629b7464A37662d69359B06518d87233A17702h8849r4535Q5713l2002L0297j02329
$$ -27464 137662 -469359 206518 -487233 117702 -88849 -183384 -97671 -129673 -99376 -201705
10618b01705K3351M4073A27801a06796r701A8897J57900a18433l934H1225c11810
$$ -201705 -178354 -134281 127801 -106796 -116497 18897 176797 -118433 -122367 81225 -311810
10606C09316A50655k0557M1696g3833m9211a8930B79301C2064A3755b46596g2942
$$ 309316 150655 130098 171794 -73833 -123044 -18930 279301 32064 13755 -246596 -72942
10594a65451A60374b06336c0381H0933j8139a87078A30939K38848A06583a40423
$$ -165451 160374 -206336 -30381 80933 62794 -187078 130939 369787 106583 -140423
10583B43414b17278R2229A01987a04463E5613J16174H3401i2906d1989r6049C00831
$$ 243414 -217278 -125049 101987 -104463 55613 171787 83401 -92906 -41989 -138038 300831
10571h0349B04234d00050o2726d455q6990H1076C3912b14292C0192K70436m7774
$$ -80349 204234 -400050 -462776 -4455 -91445 81076 33912 -214292 30192 300628 252854
10560B52854L5n7701b79019i7295q6720k33732A20890g1950K3571A71220b42424
$$ 252854 252889 195188 -279019 -97295 -184015 -417747 120890 -71950 -48379 171220 -242424
10548C72592A7811b945o64841B2426a3207H8044j9732k7899i8432k22651a3438
$$ 372592 17811 -2945 -667786 22426 -13207 88044 68312 40413 -98432 -321083 -13438
10536a41903j9744a3336e858p2456A82066e34773K38774B21410C0926f5629l9735
$$ -141903 -161647 -13336 -5858 -78314 182066 -534773 -295999 221410 30926 -65629 -105364
10525a05364F0941Q5141K9672l6788b41863a10680l15673J16225H7511J6030L19567
$$ -105364 60941 146082 175754 138966 -241863 -110680 -426353 -310128 87511 103541 423108
10514D23108a28771D0897e68585F317J10503b03428m7728d5296q4576j40936a3892
$$ 423108 -128771 40897 -568585 6317 116820 -203428 -251156 -45296 -129872 -270808 -13892
10502f8009B13810B6438a09723m3456R293j2587F8495O9399h1200n8690o1642
$$ -68009 213810 26438 -109723 -153179 -143886 -156473 68495 137894 -81200 -139890 -201532
10491b01532e2237o8599c0839j84550e9879n8123j11635B67558M3508p6436a1326
$$ -201532 -52237 -120836 -30839 -215389 -59879 -118002 -229637 267558 311066 234630 -11326
10479A66851H3017A7544J38705a64124r2353A11506B7912i8614H6769A4027g469
$$ 166851 83017 17544 156249 -164124 -256477 111506 27912 -98614 86769 14027 -7469
10467c04874i40j9399A87394k5128F2943i9106k67955a34642C4829K31646a296
$$ -304874 -940 -20339 187394 162266 62943 -99106 -367061 -134642 34829 266475 -1296
10455A56815e4669l3340A10133f4881k45787k58093A3755b6832C9398a42812e5376
$$ 156815 -54669 -88009 110133 -64881 -310668 -568761 13755 -26832 39398 -142812 -55376
10443a47353p9887J09525d8915k6655B52276C713K2859a04401C67998m2575b86719
$$ -147353 -227240 -117715 -48915 -75570 252276 3713 26572 -104401 367998 325423 -286719
10431C4232J3693j6925i5780A13248d24678J69033P5695A61681a62110A72401
$$ 34232 47925 31000 -95780 113248 -424678 -255645 -179950 161681 -162110 172401
10420d0253A91718H640b9932q3652d2532A06780E130M112e1478B4427b590j04876
$$ -40253 191718 8640 -29932 -113584 -42532 106780 5130 9242 -51478 24427 -2590 -107466
10408a07466i776I8464K66651C6086qi0206n051C7965K59245a9237A40305J46322
$$ -107466 -9776 98464 365115 36086 36078 -90206 -95257 37965 297210 -19237 140305 286627
10396B86627i6381B44015j8511d6767J4805C03291d9159j76817e1728A45341m5296
$$ 286627 -96381 244015 225504 -46767 -31962 303291 -49159 -225976 -51728 145341 100045
10385A00045f3794j74045A4549c59728A5594m182L22069p7425M4913k4065r2171
$$ 100045 -63794 -237839 14549 -359728 15594 11412 333481 256056 300969 276904 184733
10374A84733E647R5315A2976K94222J42642J73881j07849R7006j55971M7031j51338
$$ 184733 5647 100962 12976 307198 449840 623721 515872 612878 456907 503938 352600
10363C52600j23572a75322E53412A77670i6422d6778C591K15379o5633a1366B15949
$$ 352600 229028 -175322 553412 177670 -96422 -46778 3591 218970 153337 -11366 215949
10351D97767O7440J49965C25048M01918C45874j52070m2685M44547k54015j36732
$$ 497767 565207 715172 325048 726966 345874 193804 151119 595666 341651 204919
10341B04919E8635n383K92729j01166J08767a10915M5914j54985A65154P5306
$$ 204919 58635 53252 345981 244815 353582 -110915 -65001 -219986 165154 240460
10331B40460b7582m7191B20454b39042A10853a95220A74801G8062C3528N4645
$$ 240460 -27582 -74773 220454 -239042 110853 -195220 174801 78062 33528 88173
10321H8173L40467E582b8142c545C35930o3716C7764K64258a23143O0459k03896
$$ 88173 428640 5582 -28142 -3545 335930 272214 37764 302022 -123143 -62684 -266580
10310b66580B62677a19543I3205h0862k87482A73653n6835l3236f0445B65132
$$ -266580 262677 -119543 93205 -80862 -368344 173653 116818 83582 -60445 265132
10299c06956i3292j38150E7245a77241N9804L3802n9700c0609F9843J5214c1008
$$ -306956 -93292 -231442 57245 -177241 -117437 -83635 -143335 -30609 69843 85057 -31008
10287a5663A82788a32747d421A8693c7749B31342d9688B7267J2311f1310C44542
$$ -15663 182788 -132747 -4421 18693 -37749 231342 -49688 27267 39578 -61310 344542
10275I5465C5398M1073K444j3907A1946b46133B32378c7539A5315P5031h2613
$$ 95465 35398 76471 78915 65008 11946 -246133 232378 -37539 15315 90346 -82613
10263B49120h5192A73565K75315A49851J25672L24783A56520J90903C845J51644
$$ 249120 -85192 173565 448880 149851 275523 600306 156520 347423 3845 155489
10253A55489b3587j6359j31965D79165B8556Q6499K4500Q4148H6255a60031g274
$$ 155489 -23587 -39946 -171911 479165 28556 115055 139555 223703 86255 -160031 -7274
10241C47014e031k01103C139g9290B62029j05673c97708a23572b6017A6844N1306
$$ 347014 -5031 -206134 3139 -79290 262029 156356 -397708 -123572 -26017 16844 68150
10230F8150i3594C08027b04061g899j28528j35316L172P4259F2553a43413F8269
$$ 68150 -93594 308027 -204061 -7899 -136427 -271743 -268571 -194312 62553 -143413 68269
10218b53834C08767F6809c8978a336n5786k8584C4158a98462P0471j78407B0236
$$ -253834 308767 66809 -38978 -1336 -57122 -85706 34158 -198462 -127991 -306398 20236
10206B64732j11573b89140d4874j00152p7038J04437N5524a2140A00826a32013
$$ 264732 153159 -289140 -44874 -145026 -222064 -117627 -62103 -12140 100826 -132013
10195B92629E5622a43202k17596J28863P6143B78603F7155J00572O647a47587
$$ 292629 55622 -143202 -360798 -231935 -155792 278603 67155 167727 174374 -147587
10184a65717K2557r39Q691q1517j1004B03164i3374j22257i8535I4186d9729A32534
$$ -165717 -143160 -144099 -135408 -216925 -227929 203164 -93374 -215631 -98535 94186 -49729 132534
10171a2611E9167b1947l6283d793H10d2888A71660d2717j51152j2917K3774d0402
$$ -12611 59167 -21947 -58230 -4793 810 -42888 171660 -42717 -193869 -206786 -183012 -40402
10158b19373A47221a17529A50683n8203a9999p9865o1306k07697a39370b7313
$$ -219373 147221 -117529 150683 92480 -19999 -99864 -161170 -368867 -139370 -27313
10147A9575b8243E972K36051b71912L298j27660J92840j99217a62554j51054i4339
$$ 19575 -28243 5972 242023 -271912 -268614 -396274 -203434 -402651 -162554 -313608 -94339
10135b16598B64884A1613a1837q2280j57635e9484K5591r0069L6636k09589a26147
$$ -216598 264884 11613 -11837 -94117 -251752 -59484 -33893 -123962 -87326 -296915 -126147
10123H5226a32208J2290c6910j78855A71249a0027k15998g349B29622b55694J01460
$$ 85226 -132208 -119918 -36910 -215765 171249 -10027 -226025 -7349 229622 -255694 -154234
10112a54234r5066l7742A41828k70h3381B6727b41499B66219b69250A14370a13967
$$ -154234 -249300 -287042 141828 141558 -83381 26727 -241499 266219 -269250 114370 -113967
10100b61323c0893q6238j14065j51013A55230P7050b8731l64364A35125a00165
$$ -261323 -30893 -117131 -231196 -382209 155230 232280 -28731 -393095 135125 -100165
10089d30660C22541B4167b3611D5760d7018B44960A602O5964a63609j17675d1028
$$ -430660 322541 24167 -23611 45760 -47018 244960 1602 67566 -163609 -281284 -41028
10077I0963a90571Q4126j07035j04684C7446J01771n9386b35965C5779c05767
$$ 90963 -190571 -106445 -213480 -318164 37446 139217 79831 -235965 35779 -305767
10066a9579l73485b3434I5841a1620A79198J65024c61553h4728r298q4388a4859
$$ -19579 -393064 -23434 95841 -11620 179198 344222 -361553 -84728 -94026 -178414 -14859
10054C2106b90131A32476g9797J5301b4167j02851J2612A41194K15899c1548k4610
$$ 32106 -290131 132476 -79797 -64496 -24167 -127018 -114406 141194 357093 -31548 -56158
10043e6158n5608A07228a18856N8842k80607D7523b72707B2893K23033b16550
$$ -56158 -111766 107228 -118856 -60014 -340621 47523 -272707 22893 245926 -216550
10032E2950E092a58220n9906f8985C25948b27296A82949c16164L1041C7681K1196
$$ 52950 5092 -158220 -218126 -68985 325948 -227296 182949 -316164 -285123 37681 58877
10021E8877b76062I464a21938K0314L3628G3687L28242G1595b15089E7289a07426
$$ 58877 -276062 9464 -121938 -101624 -67996 73687 401929 71595 -215089 57289 -107426
10009G0507a20983j77288a7336n5811R48j4245N117H9294K52766D9777i6615F4901
$$ 70507 -120983 -298271 -17336 -73147 -72199 -86444 -81327 89294 342060 49777 -96615 64901
9996h6379B4663J73616c69390q380A39670n900e3852l0396m216D7949a43836j05622
$$ -86379 24663 198279 -369390 -377770 139670 133770 -53852 -84248 -88464 47949 -143836 -249458
9984b49458P8084G1988J62218b46763A20052j5514d07994a30469c6738n2166A2716
$$ -249458 -171374 71988 234206 -246763 120052 104538 -407994 -130469 -36738 -88904 12716
9972b81125N7237k8499e0522k91190G5728d25927D9266J67389h7255r1906A24955
$$ -281125 -223888 -252387 -50522 -341712 75728 -425927 49266 216655 -87255 -179161 124955
9960d96768J48417B8191J08389b75873a9590l27602N142n9290i1581J1827A15362
$$ -496768 -348351 28191 136580 -275873 -19590 -347192 -342050 -401340 -91581 -79754 115362
9948a22237I693a59205f970j72661G3032o94c07803d2116k21771a19836N6607
$$ -122237 9693 -159205 -6970 -179631 73032 72338 -307803 -42116 -263887 -119836 -63229
9937f3229A8683J84022e7714k49107g9675A83079A4463K17352b8007C13584a12598
$$ -63229 18683 202705 -57714 -306821 -79675 183079 14463 231815 -28007 313584 -112598
9925a62872r8897B92651a45764k04701J13826a3246G0796k5931a47300B0958K87895
$$ -162872 -261769 292651 -145764 -350465 -236639 -13246 70796 44865 -147300 20958 308853
9914C08853J24238E4487a15904C3222L7554e41861a87103a4915o7458j21209A38858
$$ 308853 433091 54487 -115904 33222 70776 -541861 -187103 -14915 -82373 -203582 138858
9902a24101B2328J17798c45032a13269L6811b4194A43212j0614m9622f5744F7375
$$ -124101 22328 140126 -345032 -113269 -76458 -24194 143212 132598 82976 -65744 67375
9890a8030k53775k7576a10979m4012j68074B9946K13596b44385B3415c43270c4968
$$ -18030 -271805 -299381 -110979 -154991 -323065 29946 243542 -244385 23415 -343270 -34968
9878d2273j74165J956p4821m608B16659B0395a81480j15752J07147L0734g8390
$$ -42273 -216438 -214482 -289303 -293911 216659 20395 -181480 -297232 -190085 -159351 -78390
9866b34050L0966l062m0916A4717d20617a19115n9066L2304M1761k80603C8446
$$ -234050 -203084 -206146 -247062 14717 -420617 -119115 -178181 -145877 -104116 -384719 38446
9854c00624G7609R3421F5351J40658a39530j02251n7085E9665b95765E1350f0400
$$ -300624 77609 171030 65351 206009 -139530 -241781 -298866 59665 -295765 51350 -60400
9842H817e928E9502b26805K9443A22468b85148A69506k731D594R4256b02154A00610
$$ 8817 -5928 59502 -226805 -197362 122468 -285148 169506 166775 4594 98850 -202154 100610
9829c64180a65983a5179D6034b08808C20958D6079e7854o0547e6701q3289d0203
$$ -364180 -165983 -15179 46034 -208808 320958 46079 -57854 -118401 -56701 -139990 -40203
9817b7475G105d7078p1970E41222b13705B25634b18355D8460K89369B020a39408
$$ -27475 7105 -47078 -119048 541222 -213705 225634 -218355 48460 337829 2020 -139408
9805a01869n4178q5596B7325J01761D3339a78244q1996A36504a2681C5203h7609
$$ -101869 -156047 -241643 27325 129086 43339 -178244 -260240 136504 -12681 35203 -87609
9793A16262L8763c56394F2531g035A72838o143P0120b00005n3268L4376K7833
$$ 116262 155025 -356394 62531 -7035 172838 166695 236815 -200005 -253273 -218897 -191064
9782a91064e3458A07303e9146b7130B08117j00424c9543G611b42455a6317l3498
$$ -191064 -53458 107303 -59146 -27130 208117 107693 -39543 7611 -242455 -16317 -49815
9771d9815k5019g528p9359k99308A11777l5109e3107j4143k95661a59124J0417
$$ -49815 -74834 -7528 -86887 -386195 111777 76668 -53107 -67250 -362911 -159124 -148707
9760a48707A77765b3702k90720a10216I8444a71255j03503j16142g1605l1411
$$ -148707 177765 -23702 -314422 -110216 98444 -171255 -274758 -390900 -71605 -103016
9750a03016p9036B0805d15574J98979c2710q1809A2947a56950O4825J7249j31177
$$ -103016 -182052 20805 -415574 -216595 -32710 -114519 12947 -156950 -92125 -74876 -206053
9739b06053k2144h3821D6473e05823B61064a30034N3750l7078j6268f872k06227
$$ -206053 -228197 -83821 46473 -505823 261064 -130034 -76284 -113362 -129630 -6872 -213099
9728b13099A6019b94077K5465j67185E4118A2532J56968p9186m1288g8145K9590
$$ -213099 16019 -294077 -268612 -435797 54118 12532 169500 90314 49026 -78145 -48555
9717d8555j98392B28471a1806M14j76898N0899l6997h621n1261A33505c21935
$$ -48555 -246947 228471 -11806 -11392 -188290 -137391 -174388 -8621 -59882 133505 -321935
9705c92904a17339j08668n5999b1863p3318H9792b42985H9072g2624b0290j12232
$$ -392904 -117339 -226007 -282006 -21863 -95181 89792 -242985 89072 -72624 -20290 -132522
9694a32522A11680e635j6544q4807M957j58536a10124J4157b9892l6217E6777
$$ -132522 111680 -5635 -22179 -106986 -102029 -260565 -110124 -95967 -29892 -66109 56777
9682A41259M6948j738a57758A96905b33706H6388c02252a17128q6301k83675a13920
$$ 141259 188207 186469 -157758 196905 -233706 86388 -302252 -117128 -203429 -487104 -113920
9670a8541A4536a7044r6878l37725F0370a872B76271m4913q6320D6177a89172
$$ -18541 14536 -17044 -113922 -451647 60370 -1872 276271 231358 145038 46177 -189172
9658c43782A12372a44058o5851k6835I1889i6920G4650a65554B03664c31663P4410
$$ -343782 112372 -144058 -209909 -236744 91889 -96920 74650 -165554 203664 -331663 -257253
9647b57253A62293a00020J2643A97907c66879g0388m4681B2362N4136a96137B57188
$$ -257253 162293 -100020 -87377 197907 -366879 -70388 -115069 22362 76498 -196137 257188
9635C7183j4148a49793C43162A62652b71200A07917b49195B7143b06647O8747
$$ 37183 23035 -149793 343162 162652 -271200 107917 -249195 27143 -206647 -137900
9625a37900q1489e7420A58458f707k17963H7545b50286A63419g4093n2652M9644
$$ -137900 -219389 -57420 158458 -6707 -224670 87545 -250286 163419 -74093 -126745 -77101
9614g7101A20679A4667e726k44863Q3158m6237l22616A28975c50765g7232K1469
$$ -77101 120679 14667 -5726 -250589 -167431 -213668 -536284 128975 -350765 -77232 -55763
9603e5763A62707c57564A67296c58349B42059i5887j72611A47675c9359A63935
$$ -55763 162707 -357564 167296 -358349 242059 -95887 -268498 147675 -39359 163935
9592B43736e7099A03358c4458C311b43280F6571b03469F4051a60593A24022J7792
$$ 243736 -57099 103358 -34458 3311 -243280 66571 -203469 64051 -160593 124022 141814
9581A41814J4858O1924b1143j49704C0526a52923a6929I8207l4209b02309B6224
$$ 141814 156672 218596 -21143 -170847 30526 -152923 -16929 98207 63998 -202309 26224
9569C66111a2680k03324E49a32373m1057P5839B7642K2318a41571o068B0644a5323
$$ 366111 -12680 -216004 549 -132373 -173430 -97591 27642 49960 -141571 -147639 20644 -15323
9556a3407A13723E1204a09231D9859c14740J07074A08783f1048m2639a4900p2768
$$ -13407 113723 51204 -109231 49859 -314740 -207666 108783 -61048 -103687 -14900 -87668
9545h7668P912k294B69a32823I3603b25875J1643A31917b61979A02042A9573d52923
$$ -87668 -79756 -82050 269 -132823 93603 -225875 -214232 131917 -261979 102042 19573 -452923
9532a04956j77671B39338a290B71000a90137A55161a47678F042K83711b5317F5288
$$ -104956 -282627 239338 -1290 271000 -190137 155161 -147678 6042 289753 -25317 65288
9520B310b46532i9713A39226l1647a50436C9476Q4646g7527k7284j8393C43502
$$ 2310 -246532 -99713 139226 107579 -150436 39476 124122 -77527 -104811 -123204 343502
9508d15486f4972H0248e4662B4883a95603p3798C2504b18904r9366a20063k0493
$$ -415486 -64972 80248 -54662 24883 -195603 -269401 32504 -218904 -318270 -120063 -140556
9497a40556A13487b02223f5262C73545A19569a50040m00622A85761P8472C2441
$$ -140556 113487 -202223 -65262 373545 119569 -150040 -550662 185761 264233 32441
9486a94225d6570A2099a77666e7210A59110J92577b58362A0052c96328e4018j81752
$$ -194225 -46570 12099 -177666 -57210 159110 351687 -258362 10052 -396328 -54018 -235770
9475b35770A72145b68643I417b45564D3590a50728H2546O2813e6j50491j85378
$$ -235770 172145 -268643 9417 -245564 43590 -150728 82546 145359 -56 -150547 -335925
9464c35925B70065a99700K1563k5009A61895a71424q8081a03962C38780i3417
$$ -335925 270065 -199700 -178137 -203146 161895 -171424 -259505 -103962 338780 -93417
9453b85691a19018B27963D7143J77669C12h596k1738k97955K024F8391J29831
$$ -285691 -119018 227963 47143 224812 312 -8596 -30334 -328289 -326265 68391 198222
9442A98222a80145e8827B30429G1664J83850a48347O0982K6713F3847b13867K9410
$$ 198222 -180145 -58827 230429 71664 255514 -148347 -87365 -60652 63847 -213867 -184457
9431a84457n2516M1150i6165a4353f747A69116b52570H0267k6328f2114C78041
$$ -184457 -236973 -195823 -96165 -14353 -6747 169116 -252570 80267 53939 -62114 378041
9419F3911O1163a08608B31483G0703J41690H5709b40775a01617j35029a17020
$$ 63911 125074 -108608 231483 70703 212393 85709 -240775 -101617 -236646 -117020
9408b6872j90074K883c1586j0727B62748j14570b18856A31975h8455B45321i8420
$$ -26872 -216946 -214063 -31586 -42313 262748 148178 -218856 131975 -88455 245321 -98420
9396A13479k8105c28431a17519j59522Q8049D0136b53963b7614C7625d8376j31643
$$ 113479 85374 -328431 -117519 -277041 -188992 40136 -253963 -27614 37625 -48376 -180019
9385a80019f6901k00319A74789c47925C4833i1885q2220I4914c13548A26997J08073
$$ -180019 -66901 -267220 174789 -347925 34833 -91885 -174105 94914 -313548 126997 235070
9374B35070A6879a97226e4030I0025a66963j00793a28621A53734e9061k59451
$$ 235070 16879 -197226 -54030 90025 -166963 -267756 -128621 153734 -59061 -318512
9364c18512H2792a3677m26716J04159b6502p7636k34102B2165b97413A11332c9517
$$ -318512 82792 -13677 -440393 -336234 -26502 -104138 -338240 22165 -297413 111332 -39517
9352f574j60979P4483r6770j75878n0948D3810L1337J22185a08414B16364b5557
$$ -6574 -167553 -93070 -189840 -365718 -416666 43810 75147 197332 -108414 216364 -25557
9340C62599A08318a10684K4205j58166O000C8567c56819a07297n5206q5193A10463
$$ 362599 108318 -110684 -86479 -244645 -238645 38567 -356819 -107297 -162503 -247696 110463
9328a54405L0909M5009F0416f1449k95667O3515a32015k07949C9733b48338A36492
$$ -154405 -123496 -78487 60416 -61449 -357116 -293601 -132015 -339964 39733 -248338 136492
9316b52239B1279a43480L5982c5311j76521j02960a08893j05506B95295a78183
$$ -252239 21279 -143480 -107498 -35311 -211832 -314792 -108893 -214399 295295 -178183
9305a50606E3239B835a16792o2342L4276C11500D1178a32696G8357k9114N36g5942
$$ -150606 53239 2835 -116792 -179134 -144858 311500 41178 -132696 78357 49243 49779 -75942
9292E7467Q8616P1094b75021A04967b9785J40F7704a71492k09231A8053J25572
$$ 57467 146083 217177 -275021 104967 -29785 -29645 67704 -171492 -380723 18053 143625
9281A43625b65170i5908G0336A785e2839l6416r7159i867m41213a41604L2690
$$ 143625 -265170 -95908 70336 1785 -52839 -89255 -186414 -9867 -451080 -141604 -108914
9270a08914o3567J57j5541A5901b42909L5601h0108A50143b39424F403a70747
$$ -108914 -172481 -172324 -187865 15901 -242909 -207308 -80108 150143 -239424 6403 -170747
9258c65D2555c18861A08096a69267A11004a08349q9012A60547p2565J15902e9244
$$ -365 42555 -318861 108096 -169267 111004 -108349 -197361 160547 87982 203884 -59244
9246i2536f934k24278g9361B2401d40719e0077H2109c7032k10721e3979q0735
$$ -92536 -6934 -231212 -79361 22401 -440719 -50077 82109 -37032 -247753 -53979 -134714
9235a34714l128j1056C13012g1606k2733j55203J04697j2962A21330c19528A01912
$$ -134714 -137842 -148898 313012 -71606 -94339 -249542 -144845 -157807 121330 -319528 101912
9223c89902J64685B846a93662O8869o4743j86183e7551p1968A70485c707l07892
$$ -389902 -225217 2846 -193662 -124793 -189536 -375719 -57551 -129519 170485 -3707 -311599
9212c11599e2503A19845a20370k28429M3870b6411k28721Q1351J0621A13820f6537
$$ -311599 -52503 119845 -120370 -348799 -304929 -26411 -255132 -173781 -163160 113820 -66537
9200a45284K6134m041j39160f9412I5778b47776N4680A9803J7903f6022l2729
$$ -145284 -119150 -123191 -262351 -69412 95778 -247776 -193096 19803 37706 -66022 -98751
9189i8751A50814a30511A80596j0156a69245j00334D6231a72314d4487H9049a63913
$$ -98751 150814 -130511 180596 170440 -169245 -269579 46231 -172314 -44487 89049 -163913
9177D32860d29591A6569c33639C4294f593F9031b30113A22062b01553N0495k3998
$$ 432860 -429591 16569 -333639 34294 -6593 69031 -230113 122062 -201553 -151058 -175056
9166a75056B08471c60514A93757a6111j58332E3017c24926A42095J69995c79643
$$ -175056 208471 -360514 193757 -16111 -174443 53017 -324926 142095 312090 -379643
9155a9459F0976O2205k3978I599J14571b80393A75298L607D2607K32598h4855
$$ -19459 60976 123181 99203 9599 124170 -280393 175298 178905 42607 275205 -84855
9143A64187A7238J33197a69029j93032f424C81098d3865j42202R2100q0163k27066
$$ 164187 17238 150435 -169029 -362061 -6424 381098 -43865 -186067 -93967 -174130 -401196
9132d01196a4054k2188A65812a81216B70688j16509r486c49182J42891A30830
$$ -401196 -14054 -36242 165812 -181216 270688 154179 144693 -349182 -206291 130830
9121b12997C74602q2588a99516l9881n6221a13828M287c1249A49504a2552k97361
$$ -212997 374602 292014 -199516 -239397 -295618 -113828 -109541 -31249 149504 -12552 -309913
9110c09913k4694F8487b4513J73A90084B8346K6070N7155b7134E8456d06316M2284
$$ -309913 -334607 68487 -24513 -24340 190084 28346 54416 111571 -27134 58456 -406316 -364032
9098c64032a43624L7182p2489E0188J30610a88522j13444O1201j6926b7614F751
$$ -364032 -143624 -106442 -178931 50188 180798 -188522 -301966 -240765 -257691 -27614 6751
9086I9691a70169C2878a87305F8696f6166A11209b9547k80281f5839A63788c9562
$$ 99691 -170169 32878 -187305 68696 -66166 111209 -29547 -309828 -65839 163788 -39562
9074a28646A19458a63318N8949d437l92996J39325B4720h4713l4193k16284A08461
$$ -128646 119458 -163318 -104369 -4437 -397433 -258108 24720 -84713 -118906 -335190 108461
9062b6120l75197J47097A09360h5817A6135a87014B43244I0491a9503o3161B04922
$$ -26120 -401317 -254220 109360 -85817 16135 -187014 243244 90491 -19503 -82664 204922
9050c14327i4779F138c53594R4668L648a06434a3792l6581n2850K9254J9244A85858
$$ -314327 -94779 6138 -353594 -258926 -255278 -106434 -13792 -50373 -103223 -73969 -54725 185858
9037a82846C4621h4637D176K9369J50286C3435f2363l8849c0516j90445A07275
$$ -182846 34621 -84637 4176 33545 183831 33435 -62363 -101212 -30516 -220961 107275
9025i6331j18903f8326A27573h7192A63084c0439j65520N2907J9024B91477c02278
$$ -96331 -215234 -68326 127573 -87192 163084 -30439 -195959 -143052 -124028 291477 -302278
9013d70121A6340a20885c3301A02521B6984P1120a09002B52272a52134j22239
$$ -470121 16340 -120885 -33301 102521 26984 98104 -109002 252272 -152134 -274373
9003b74373d6883n781B28220f3463C6120M4230b87699A70841k091b07058h3875
$$ -274373 -46883 -52664 228220 -63463 36120 80350 -287699 170841 168750 -207058 -83875
8991b27394B90746b09152C68224A50241c93085B06242o9788c31484A67195a06113
$$ -227394 290746 -209152 368224 150241 -393085 206242 136454 -331484 167195 -106113
8980b31565a14844N1156A86102D5759a0467k76873k1254J52100B24568C0423a5327
$$ -231565 -114844 -63688 186102 45759 -10467 -287340 -308594 -156494 224568 30423 -15327
8968G1137J30042a11272N0086J9958A18108a05158d0413l08335a45712L2457B6936
$$ 71137 201179 -111272 -61186 -41228 118108 -105158 -40413 -348748 -145712 -113255 26936
8956a43487g1003L2300j02389D6627a14634D7791b12229I9663d3242p6393E1325
$$ -143487 -71003 -38703 -141092 46627 -114634 47791 -212229 99663 -43242 -119635 51325
8944f6023j23972n3914J14257A14320a7876A29728d8464A67690n3586M3755N5790
$$ -66023 -189995 -243909 -129652 114320 -17876 129728 -48464 167690 114104 157859 213649
8933B13649d0348m1848C3364b17674i2888A66236K01934j28349L89681M69479
$$ 213649 -40348 -82196 33364 -217674 -92888 166236 368170 239821 629502 1098981
8923A098981L084372R027730l390055B378096I08182l53915j56794A75133E8181
$$ 1098981 4183353 13211083 9821028 2378096 908182 554267 397473 175133 58181
8913C1720N3279K1344a77669A8012J41279K07034b80234D7530J64107a97157A16630
$$ 31720 84999 106343 -177669 18012 159291 366325 -280234 47530 211637 -197157 116630
8901G6748g7253m5947j61357k7303R4459d7683j88310A93931f9487A96066F5909
$$ 76748 -77253 -123200 -284557 -311860 -217401 -47683 -235993 193931 -69487 196066 65909
8889a56718j4572D0230a67069e9703k19545J33706r0190D8451d9155A28689F4195
$$ -156718 -171290 40230 -167069 -59703 -279248 -145542 -235732 48451 -49155 128689 64195
8877b4843A13053b08683J4184M8973G4539d0975C2733k958J1379i9118A71242
$$ -24843 113053 -208683 -194499 -145526 74539 -40975 32733 29775 41154 -99118 171242
8865A09680M766a2918p9643j66864A50321C8022J35127i5414H464a36277b9297
$$ 109680 114446 -12918 -92561 -259425 150321 38022 173149 -95414 8464 -136277 -29297
$$ [...]
##END NTUPLES=NMR SPECTRUM
##END=
