##TITLE=AC1574_ROEFFECT0022_8270984_cmcJopuIm6
##JCAMPDX= 6.0         $$ Bruker NMR JCAMP-DX V2.0
##DATA TYPE= NMR SPECTRUM
##DATA CLASS= NTUPLES
##ORIGIN= BRUKER
##OWNER= Administrator
$$ 1.72 TOPSPIN		Version 2.1
$$ 2013-10-18 19:54:18.541 -0700  Administrator@X
$$ Compression mode = diff/dup
##.OBSERVE FREQUENCY= 400.02188249412
##.OBSERVE NUCLEUS= ^1H
##.ACQUISITION MODE= SIMULTANEOUS (DQD)
##.ACQUISITION SCHEME= undefined
##.AVERAGES= 8
##.DIGITISER RES= 22
##SPECTROMETER/DATA SYSTEM= spect
##.PULSE SEQUENCE= zg30
##.SOLVENT NAME= COFFEE_meoh
##.SHIFT REFERENCE= INTERNAL, COFFEE_meoh, 1, 14.98509
##AUDIT TRAIL= $$ (NUMBER, WHEN, WHO, WHERE, PROCESS, VERSION, WHAT)
$$ ##TITLE= Audit trail, TOPSPIN		Version 2.1
$$ ##JCAMPDX= 5.01
$$ ##ORIGIN= Bruker BioSpin GmbH
$$ ##OWNER= Administrator
$$ $$ E:\/data/COFFEE/nmr/AC1574_ROEFFECT0022_8270984_cmcJopuIm6/10/pdata/1/auditp.txt
$$ ##AUDIT TRAIL=  $$ (NUMBER, WHEN, WHO, WHERE, PROCESS, VERSION, WHAT)
(   1,<2013-10-18 19:54:11.728 -0700>,<Administrator>,<X>,<go>,<TOPSPIN 2.1>,
      <created by zg
	started at 2013-10-18 19:53:06.088 -0700,
	POWCHK enabled, PULCHK disabled,
       configuration hash MD5:
       C8 4E 4E 5D D3 5C D8 9E 9F 52 82 E0 59 8A DE 15
       data hash MD5: 64K
       63 8D 37 65 61 19 17 EA 26 E8 7F DB 59 A9 FB F4>)
(   2,<2013-10-18 19:54:14.635 -0700>,<Administrator>,<X>,<proc1d>,<TOPSPIN 2.1>,
      <Start of raw data processing
       efp LB = 0 FT_mod = 6 PKNL = 1 PHC0 = 0 PHC1 = 0 SI = 32K 
       data hash MD5: 32K
       72 23 33 69 AF 26 37 85 A5 04 B0 BA 65 64 EF B9>)
(   3,<2013-10-18 19:54:14.931 -0700>,<Administrator>,<X>,<proc1d>,<TOPSPIN 2.1>,
      <pk PHC0 = 94.9823 PHC1 = 0 
       data hash MD5: 32K
       AB 8B 9F 70 4F 4E D3 B0 B1 C0 33 33 81 85 D3 21>)
(   4,<2013-10-18 19:54:15.103 -0700>,<Administrator>,<X>,<proc1d>,<TOPSPIN 2.1>,
      <abs ABSG = 1 
       data hash MD5: 32K
       6B DF 90 44 CE 55 FF 7B 18 A2 B9 7F 49 12 50 C3>)
(   5,<2013-10-18 19:54:15.275 -0700>,<Administrator>,<X>,<proc1d>,<TOPSPIN 2.1>,
      <abs ABSG = 2 
       data hash MD5: 32K
       04 DF 41 3F 68 A6 4B FF 15 47 1B E0 F8 64 10 40>)
(   6,<2013-10-18 19:54:15.322 -0700>,<Administrator>,<X>,<proc1d>,<TOPSPIN 2.1>,
      <abs ABSG = 3 
       data hash MD5: 32K
       2C 4E 13 DE F7 7E 11 51 CC 57 4D 19 4C AB 91 5C>)
(   7,<2013-10-18 19:54:15.447 -0700>,<Administrator>,<X>,<proc1d>,<TOPSPIN 2.1>,
      <abs ABSG = 4 
       data hash MD5: 32K
       D5 C7 5C BD E1 26 93 02 E0 25 FF 0C AF E6 47 C2>)
(   8,<2013-10-18 19:54:15.494 -0700>,<Administrator>,<X>,<proc1d>,<TOPSPIN 2.1>,
      <abs ABSG = 5 
       data hash MD5: 32K
       6A 66 89 60 87 29 09 92 93 11 CA 88 F3 88 64 B3>)
$$ ##END=
$$ 
$$ $$ hash MD5
$$ $$ 52 61 93 B4 51 43 46 62 3D FD F2 65 71 20 5B A7
##$RELAX= 
##$RELAX= 
##$RELAX= 
##$RELAX= 
##$RELAX= 
##$RELAX= 
##$RELAX= 
$$ Bruker specific parameters
$$ --------------------------
##$DU= <E:\>
##$EXPNO= 10
##$NAME= <AC1574_ROEFFECT0022_8270984_cmcJopuIm6>
$$ [...]
##$TP= (0..7)
150 150 150 150 150 150 150 150
##$TP07= 0
##$TPNAME0= <>
##$TPNAME1= <>
##$TPNAME2= <>
##$TPNAME3= <>
##$TPNAME4= <>
##$TPNAME5= <>
##$TPNAME6= <>
##$TPNAME7= <>
##$TPOAL= (0..7)
0.5 0.5 0.5 0.5 0.5 0.5 0.5 0.5
##$TPOFFS= (0..7)
0 0 0 0 0 0 0 0
##$TUNHIN= 0
##$TUNHOUT= 0
##$TUNXOUT= 0
##$USERA1= <user>
##$USERA2= <user>
##$USERA3= <user>
##$USERA4= <user>
##$USERA5= <user>
##$V9= 5
##$VALIST= <valist>
##$VCLIST= <CCCCCCCCCCCCCCC>
##$VD= 0
##$VDLIST= <DDDDDDDDDDDDDDD>
##$VPLIST= <PPPPPPPPPPPPPPP>
##$VTLIST= <TTTTTTTTTTTTTTT>
##$WBST= 1024
##$WBSW= 4
##$XGAIN= (0..3)
0 0 0 0
##$XL= 0
##$YL= 0
##$YMAX_a= 635037
##$YMIN_a= -540489
##$ZGOPTNS= <>
##$ZL1= 120
##$ZL2= 120
##$ZL3= 120
##$ZL4= 120
##$ABSF1= 14.98509
##$ABSF2= -5.573092
##$ABSG= 5
##$ABSL= 3
##$ALPHA= 0
##$AQORDER= 0
##$ASSFAC= 0
##$ASSFACI= 0
##$ASSFACX= 0
##$ASSWID= 0
##$AUNMP= <proc_prof1d_extract_pilot.lims>
##$AXLEFT= 0
##$AXNAME= <>
##$AXNUC= <1H>
##$AXRIGHT= 0
##$AXTYPE= 0
##$AXUNIT= <>
##$AZFE= 0.1
##$AZFW= 0.1
##$BCFW= 0
##$BC_mod= 0
##$BYTORDP= 0
##$COROFFS= 0
##$CY= 15
##$DATMOD= 1
##$DC= 0
##$DFILT= <>
##$DTYPP= 0
##$F1P= 0
##$F2P= 0
##$FCOR= 0.5
##$FTSIZE= 32768
##$FT_mod= 6
##$GAMMA= 0
##$GB= 0
##$INTBC= 1
##$INTSCL= 1
##$ISEN= 128
##$LB= 0
##$LEV0= 0
##$LPBIN= 0
##$MAXI= 10000
##$MC2= 0
##$MEAN= 0
##$ME_mod= 0
##$MI= 0
##$NCOEF= 0
##$NC_proc= -8
##$NLEV= 6
##$NOISF1= 0
##$NOISF2= 0
##$NSP= 0
##$NTH_PI= 0
##$NZP= 0
##$OFFSET= 14.98509
##$PC= 1
##$PHC0= 94.9823
##$PHC1= 0
##$PH_mod= 1
##$PKNL= yes
##$PPARMOD= 0
##$PPDIAG= 0
##$PPIPTYP= 0
##$PPMPNUM= 2147483647
##$PPRESOL= 1
##$PSCAL= 4
##$PSIGN= 0
##$PYNMP= <proc.py>
##$REVERSE= no
##$SF= 400.02
##$SI= 32768
##$SIGF1= 0
##$SIGF2= 0
##$SINO= 400
##$SIOLD= 32768
##$SPECTYP= <>
##$SREGLST= <1H.CDCl3>
##$SSB= 0
##$STSI= 32768
##$STSR= 0
##$SW_p= 8223.68421052631
##$SYMM= 0
##$S_DEV= 0
##$TDeff= 65536
##$TDoff= 0
##$TI= <>
##$TILT= no
##$TM1= 0
##$TM2= 0
##$TOPLEV= 0
##$USERP1= <user>
##$USERP2= <user>
##$USERP3= <user>
##$USERP4= <user>
##$USERP5= <user>
##$WDW= 1
##$XDIM= 32768
##$YMAX_p= 458959856
##$YMIN_p= -788486
##$CURPLOT= <Network HP LaserJet P1505>
##$CURPRIN= <$Network HP LaserJet P1505>
##$DFORMAT= <normdp>
##$LAYOUT= <+/1D_H.xwp>
##$LFORMAT= <normlp>
##$PFORMAT= <normpl>
##$SURQMSG= 1
$$ End of Bruker specific parameters
$$ ---------------------------------
##NTUPLES= NMR SPECTRUM
##VAR_NAME=  FREQUENCY,     SPECTRUM/REAL,   SPECTRUM/IMAG
##SYMBOL=    X,             R,               I
##VAR_TYPE=  INDEPENDENT,   DEPENDENT,       DEPENDENT
##VAR_FORM=  AFFN,          ASDF,            ASDF
##VAR_DIM=   32768,         32768,           32768
##UNITS=     HZ,            ARBITRARY UNITS, ARBITRARY UNITS
##FACTOR=    0.250966925370066, 1,           1
##FIRST=     8223.43324360094, -248534,      -276888
##LAST=      0,             104803,          -30250
##MIN=       0,             -788486,         0
##MAX=       8223.43324360094, 458959856,    0
$$ Real data points
##PAGE= N=1
##DATA TABLE= (X++(R..R)), XYDATA
$$ [...]
19543b47951J01495A29809E5498c07589e6344k38830H385a08232A4495J27609
$$ -247951 -146456 129809 55498 -307589 -56344 -295174 8385 -108232 14495 142104
19533A42104b54670M1170D00801b9196B24853B7695a61176A55600e0265k02483
$$ 142104 -254670 -213500 400801 -29196 224853 27695 -161176 155600 -50265 -252748
19523b52748p5753g797n5604B86512a7345j88117B04963A9301L4558i30o368j17713
$$ -252748 -328501 -7797 -63401 286512 -17345 -205462 204963 19301 53859 -930 -7298 -125011
19511a25011L6192o8436I4365C7502A0979R9699b63237a27800K3605a8127j61997
$$ -125011 -88819 -157255 94365 37502 10979 110678 -263237 -127800 -104195 -18127 -180124
19500a80124A19997E733c46407R9117g4821q4818F5011b25688J02211j28773f6562
$$ -180124 119997 5733 -346407 -247290 -74821 -159639 65011 -225688 -123477 -252250 -66562
19488a93792B65360q1687d7618k22031l9358f66A35849b5205j82049B3736J56647
$$ -193792 265360 183673 -47618 -269649 -309007 -666 135849 -25205 -207254 23736 180383
19477A80383i8440K086k12527K4665a04176B93140A24924b66439A34180a19218
$$ 180383 -98440 -96354 -308881 -284216 -104176 293140 124924 -266439 134180 -119218
19466i3685b7635D758c35604A21993j3593a64406i491k69411e3161a3876A66305
$$ -93685 -27635 4758 -335604 121993 108400 -164406 -9491 -278902 -53161 -13876 166305
19454A95247A0305i5458m0835O1024B59514c260E0652a99149K7019A11602a521
$$ 195247 10305 -95458 -136293 -75269 259514 -3260 50652 -199149 -172130 111602 -1521
19442A18293a16485j68231B40807a02992o8829m430E602b69457a33359M8122j56553
$$ 118293 -116485 -284716 240807 -102992 -171821 -176251 5602 -269457 -133359 -85237 -241790
19431b41790C6494O6818b36839e1953B51725b60748R088b1711A03952i5982K2417
$$ -241790 36494 103312 -236839 -51953 251725 -260748 -251660 -21711 103952 -95982 -73565
19420g3565B03202g4533A36437J1868a51402K167c7576H9388d252q1956K6131
$$ -73565 203202 -74533 136437 148305 -151402 -149235 -37576 89388 -4252 -86208 -60077
19409f0077E0061O4368a24836j79787P8484B59376a58712q6852G5015g5360j33853
$$ -60077 50061 114429 -124836 -304623 -226139 259376 -158712 -245564 75015 -75360 -209213
19398b09213A05577a29717L6075n0770p8605B40351a2460C83400a55734d5479
$$ -209213 105577 -129717 -93642 -144412 -223017 240351 -12460 383400 -155734 -45479
19387a34182A251h5636B05745H9649D2671c6990B09498d52683C3419b64362g1921
$$ -134182 1251 -85636 205745 89649 42671 -36990 209498 -452683 33419 -264362 -71921
19375a75665A08457m7135M8848q085c01096C03045j07383a83067F4478J91423
$$ -175665 108457 61322 110170 102085 -301096 303045 195662 -183067 64478 255901
19365B55901n6192D0101f2667k6512J3177r6641L7667B83548a00467j84559B74494
$$ 255901 199709 40101 -62667 -89179 -76002 -172643 -134976 283548 -100467 -285026 274494
19353D4489g7551p9682O5177L3921p1896N483k8535I6870B5036i5539a0282C36030
$$ 44489 -77551 -157233 -92056 -58135 -130031 -124548 -153083 96870 25036 -95539 -10282 336030
19340B7337M5476K08584h7804O840k18090O2414A283K8836J38531b1770l1230
$$ 27337 72813 281397 -87804 -80964 -299054 -236640 1283 30119 168650 -21770 -53000
19329e3000A1694b18729r7204d1476j01243d939j36718O074O6I9790b19030L8422
$$ -53000 11694 -218729 -315933 -41476 -142719 -4939 -141657 -135583 -135517 99790 -219030 -180608
19317a80608M2498A87249g037D17808b28871J04300B7359c55616G0801a97685
$$ -180608 -138110 187249 -7037 417808 -228871 -124571 27359 -355616 70801 -197685
19306a19135l121k5695m6203D2685b6608l3824A16318a91787Q6866j64154m82
$$ -119135 -122256 -147951 -194154 42685 -26608 -60432 116318 -191787 -104921 -269075 -269557
19295b69557A95959c05241g4032n8739C7724c0903A46810J58953g3431n4248H7251
$$ -269557 195959 -305241 -74032 -132771 37724 -30903 146810 305763 -73431 -127679 87251
19283D3565K32929E8265c65528a29001B3078K2168a17442c0807a3929I7590C6329
$$ 43565 276494 58265 -365528 -129001 23078 45246 -117442 -30807 -13929 97590 36329
19271f5651H5084J83662B222i6722K6788B1425a33074A15887f6579G1998J23055
$$ -65651 85084 268746 2222 -96722 -69934 21425 -133074 115887 -66579 71998 195053
19260A95053c87265J11764a24891F8088Q6968a25591o7835L6421K7176N64c2048
$$ 195053 -387265 -275501 -124891 68088 155056 -125591 -193426 -157005 -129829 -129265 -32048
19248d75846A0076b20418R6994b4225j84754c9894H5367J13698b42182e823k04146
$$ -475846 10076 -220418 -123424 -24225 -208979 -39894 85367 199065 -242182 -5823 -209969
19237b09969C324a35873J7614B4434N0811d7890B39998g4861j18246b006k6440
$$ -209969 3324 -135873 -118259 24434 75245 -47890 239998 -74861 -193107 -2006 -28446
19226b8446q5258k1611B66337c54166a59627d4850m2605a3410B03625a07731j44049
$$ -28446 -113704 -135315 266337 -354166 -159627 -44850 -87455 -13410 203625 -107731 -251780
19215b51780Q3874F2244a61154k2798B650f948j02051B5347H3J13190O552g3305
$$ -251780 -167906 62244 -161154 -183952 2650 -6948 -108999 25347 83 113273 119825 -73305
19202a0438A6050M5067b95705N0704d3041I087c5456l596A17895b68887a16221
$$ -10438 16050 61117 -295705 -245001 -43041 9087 -35456 -39052 117895 -268887 -116221
19190c8293A38388B0917c40535J29356C5216a82182d9576r2188a8260C694a98738
$$ -38293 138388 20917 -340535 -211179 35216 -182182 -49576 -141764 -18260 3694 -198738
19178I8674O273a25298L0132K0027F9189b1881E2335l935c19137a22380E7962
$$ 98674 104947 -125298 -95166 -75139 69189 -21881 52335 48400 -319137 -122380 57962
19166A19157c2195j01425A2647b24826h2100j58806G6574d1283h569I5084c08684
$$ 119157 -32195 -133620 12647 -224826 -82100 -240906 76574 -41283 -8569 95084 -308684
19154H2828c5515k591l07884J13768a10728I5423a12722j24814C5336O7590b87100
$$ 82828 -35515 -38106 -345990 -232222 -110728 95423 -112722 -237536 35336 102926 -287100
19142i2660j08409l4146o9991i4011b6941k02643B1459O0605J36206r0922l5722
$$ -92660 -201069 -235215 -305206 -94011 -26941 -229584 21459 82064 218270 127348 91626
19131I1626a97962j13120i9554B8231O3165j0276f4393j68229B53013b6755A92484
$$ 91626 -197962 -311082 -99554 28231 91396 81120 -64393 -232622 253013 -26755 192484
19119a34651M0344B24688G7190J11272f1239j09401l3161e9003k65208d4024j25294
$$ -134651 -94307 224688 77190 188462 -61239 -170640 -203801 -59003 -324211 -44024 -169318
19108a69318E8410a66433N5565k04224E9713e9162k44618d7802B47051j4479c91617
$$ -169318 58410 -166433 -110868 -315092 59713 -59162 -303780 -47802 247051 232572 -391617
19096B29725f1727E6950M6317a62853j7130a1218F777J42796D372f782k35867
$$ 229725 -61727 56950 103267 -162853 -179983 -11218 6777 149573 4372 -6782 -242649
19085b42649e1566d702C16493C9413a2709m0575a6777j50729d481H3510J91554
$$ -242649 -51566 -4702 316493 39413 -12709 -53284 -16777 -167506 -4481 83510 275064
19074B75064j17955O3909b55667A46034e4325B5024a93145B50110B7987a10462
$$ 275064 157109 221018 -255667 146034 -54325 25024 -193145 250110 27987 -110462
19063b60092Q0603P0748m9329L9804d2986C7184M122L1038E255b42197K2033K7152
$$ -260092 -179489 -108741 -158070 -118266 -42986 37184 41306 72344 5255 -242197 -220164 -193012
19051a93012f9336A7893b3275j69521i0082B62715B7062h371A19195a35892G0101
$$ -193012 -69336 17893 -23275 -192796 -90082 262715 27062 -8371 119195 -135892 70101
19039d38552f0709a6682B38300b54345A6354L7832A9269Q0354P0576R0552f7986
$$ -438552 -60709 -16682 238300 -254345 16354 54186 19269 99623 170199 260751 -67986
19027B3866c0882F6404h9902n1961G1547a0935m2889p0682C2613P5310I459e7898
$$ 23866 -30882 66404 -89902 -141863 71547 -10935 -53824 -124506 32613 107923 9459 -57898
19014A16150a68942B89289F1060J52581j04471f6956l35416A7944a42265K3573
$$ 116150 -168942 289289 61060 213641 109170 -66956 -402372 17944 -142265 -118692
19004a18692j5062p9509K1702C59277c37489H4145c44675C0618b16263b122q4236
$$ -118692 -133754 -213263 -191561 359277 -337489 84145 -344675 30618 -216263 -2122 -86358
18993h6358q804n5902j39239g218A59531c7660k51686e0844p3607J6791j30889
$$ -86358 -95162 -151064 -290303 -7218 159531 -37660 -289346 -50844 -124451 -107660 -238549
18982b38549R8925b624D6167R7365m1554J86949j25484b8560G1482a9521B02989
$$ -238549 -139624 -2624 46167 143532 101978 288927 163443 -28560 71482 -19521 202989
18970g176q1931j29095L8862F6097a83999A45624a2076o9746A93479e3742B73292
$$ -7176 -89107 -218202 -179340 66097 -183999 145624 -12076 -81822 193479 -53742 273292
18958D18430A41i2105q5488B11860J5801c73553a38375O7714j01841B22862b7188
$$ 418430 141 -92105 -177593 211860 227661 -373553 -138375 -70661 -172502 222862 -27188
18946c2143r3241j295b2422D7326a60475d4254F7444a39441B35898L4823c3485
$$ -32143 -125384 -126679 -22422 47326 -160475 -44254 67444 -139441 235898 270721 -33485
18934B3839b67157A45504L3673a68192I8374b64785a7331A0639a08734E9088b18170
$$ 23839 -267157 145504 179177 -168192 98374 -264785 -17331 10639 -108734 59088 -218170
18922B37794b52295I7166J35611c6501p9360j26400A03443J06199i2315k1518
$$ 237794 -252295 97166 232777 -36501 -115861 -242261 103443 209642 -92315 -113833
18912a13833A43179h7274C49061e7757l7875j6276j05832n4628B58033l8492j06531
$$ -113833 143179 -87274 349061 -57757 -95632 -111908 -217740 -272368 258033 219541 113010
18901A13010a18753P96j06070k6234a9158m2626G4750J6083a02011B35576a79255
$$ 113010 -118753 -117957 -224027 -250261 -19158 -61784 74750 90833 -102011 235576 -179255
18889d0120m8031A31074F723J28525c13492J00040J01788j49366B01105o0775
$$ -40120 -88151 131074 6723 135248 -313492 -213452 -111664 -261030 201105 140330
18879A40330E1064b8773A46484M6302b06311h8878A48793F4225b72252h0142A27422
$$ 140330 51064 -28773 146484 192786 -206311 -88878 148793 64225 -272252 -80142 127422
18867A43536i7016j5656A66701b80706J13904l1224H7080h5160j7945A28390a09788
$$ 143536 -97016 -112672 166701 -280706 -166802 -198026 87080 -85160 -103105 128390 -109788
18855G2279a03070A82308i6876F1686b02430h6587k49956c6075F8754c8312H2847
$$ 72279 -103070 182308 -96876 61686 -202430 -86587 -336543 -36075 68754 -38312 82847
18843a60172P2828r7566A65685J35638d80932J38203c1700k28863a2159j64444
$$ -160172 -87344 -184910 165685 301323 -480932 -342729 -31700 -260563 -12159 -176603
18833a76603A09321h4297A5575J27877o4697b91208G8435J00921c22359i0179
$$ -176603 109321 -84297 15575 143452 78755 -291208 78435 179356 -322359 -90179
18822b1164B61354a05079b7046n9998H4216a68165k4770H9809l5811J25619a20655
$$ -21164 261354 -105079 -27046 -87044 84216 -168165 -192935 89809 53998 179617 -120655
18810B72289F3857Q4471D7474q244J04376p725J2384D6979a14432k57103A8224
$$ 272289 63857 148328 47474 39230 143606 135881 148265 46979 -114432 -371535 18224
18798e7214q2280O5591k32628a15660f612j41040F1319a35944c878l7378o7510
$$ -57214 -139494 -73903 -306531 -115660 -6612 -147652 61319 -135944 -3878 -41256 -108766
18787a08766l70733a11044n8275A79493b4457q3729J301l34674A76109a40244
$$ -108766 -479499 -111044 -169319 179493 -24457 -108186 -106885 -441559 176109 -140244
18776a64592J3890f5531j24773A09127P6228b88055A16591J67607e9943C40955
$$ -164592 -150702 -65531 -190304 109127 185355 -288055 116591 284198 -59943 340955
18765b61032b5564l86956A2738h6714q7912A29422a29541A37035c40043I0450
$$ -261032 -25564 -412520 12738 -86714 -174626 129422 -129541 137035 -340043 90450
18754d9731K3625A25780a0759C14321b85241I978J39049K201b328o1723j00477
$$ -49731 -26106 125780 -10759 314321 -285241 9978 149027 151228 -2328 -64051 -164528
18743a64528j78002N9624k8125H5232b5643A91822E8627b01079F1422R2583b24549
$$ -164528 -342530 -282906 -311031 85232 -25643 191822 58627 -201079 61422 154005 -224549
18731c9342B0207a3054j22951E7922b58652a21165j19379A04999e7871A3727g2172
$$ -39342 20207 -13054 -136005 57922 -258652 -121165 -240544 104999 -57871 13727 -72172
18719c14373b2370A82957a7414j10794j03305F3063b52990e0099j43662M2334
$$ -314373 -22370 182957 -17414 -128208 -231513 63063 -252990 -50099 -193761 -151427
18709a51427G5336J58306p8877J78515c09313a14156j49788C15795p5356c1004
$$ -151427 75336 233642 154765 333280 -309313 -114156 -263944 315795 240439 -31004
18698B7792M3419a77423e112j60594K931A11147b07956M3621a5250o0838j55344
$$ 27792 71211 -177423 -5112 -165706 -162775 111147 -207956 -164335 -15250 -76088 -231432
18687b31432h5093m04754e1160D6590J1095M6885a26603M6803A70874a54881n5170
$$ -231432 -85093 -489847 -51160 46590 57685 104570 -126603 -79800 170874 -154881 -210051
18676b10051B1652K19151E7674b2716B58445A4505a68109r8392o9027a01744A92581
$$ -210051 21652 240803 57674 -22716 258445 14505 -168109 -266501 -335528 -101744 192581
18664a34496A5099L68507c00353a0204m035B64996b44733K9214O2182R871K4167
$$ -134496 15099 383606 -300353 -10204 -14239 264996 -244733 -215519 -153337 -143466 -119299
18653a19299K3945G9447f0446B24111f0070H9058a01916r8729A04200f7881C0272
$$ -119299 -95354 79447 -60446 224111 -60070 89058 -101916 -200645 104200 -67881 30272
18641g035j54840N4363c8308j24886M9755m0123P3785D52612A08002a73552b6186
$$ -7035 -161875 -107512 -38308 -163194 -113439 -153562 -79777 452612 108002 -173552 -26186
18629c1742A14695b55155M5786C8454e5840d162r5425H6690c80349H4842b83428
$$ -31742 114695 -255155 -209369 38454 -55840 -4162 -99587 86690 -380349 84842 -283428
18617a20119r6395f0118P76A48797a23768F8979d10759F3669K61547f6167K023
$$ -120119 -216514 -60118 -59342 148797 -123768 68979 -410759 63669 325216 -66167 -64144
18606f4144k9276K2592b5651A85675D5823b79899H8903a42665C2189d4376j95626
$$ -64144 -93420 -70828 -25651 185675 45823 -279899 88903 -142665 32189 -44376 -240002
18595b40002B16879g3217B87789b48807j11333i2080H1259h1830n4832F3573J86565
$$ -240002 216879 -73217 287789 -248807 -360140 -92080 81259 -81830 -136662 63573 250138
18584B50138c69194g8347a166k8001o722k85453c5598A21303J13649A15920g4473
$$ 250138 -369194 -78347 -1166 -29167 -35889 -321342 -35598 121303 234952 115920 -74473
18572C42493f6659n7766k81248a32434j9322j45175L1954k4999a37762j38822
$$ 342493 -66659 -124425 -405673 -132434 -151756 -296931 -264977 -289976 -137762 -276584
18562b76584f3481A5213K25142f9803j00395A15125b48613H1451d4906C51253
$$ -276584 -63481 15213 240355 -69803 -170198 115125 -248613 81451 -44906 351253
18551C51775G7035a5k02841N5722e9651H7935b38284A39312d03547a06606m1171
$$ 351775 77035 -15 -202856 -147134 -59651 87935 -238284 139312 -403547 -106606 -147777
18540a47777A18469d9912A84456h6507K3247p25226g1109p6246k29984c8944A44277
$$ -147777 118469 -49912 184456 -86507 -63260 -788486 -71109 -147355 -377339 -38944 144277
18528a56491O983c5488B11997p5717a65888m0068A94853b76132A34639a39937
$$ -156491 -149508 -35488 211997 136280 -165888 -205956 194853 -276132 134639 -139937
18517A24974Q2704e3851B50357e4181j1049K4765m55231E4833c24663A49639a31880
$$ 124974 207678 -53851 250357 -54181 -65230 -40465 -495696 54833 -324663 149639 -131880
18505i9032d2990I9773c0425F9763J7443J87505B3794b31796g3586r8563J3428
$$ -99032 -42990 99773 -30425 69763 87206 274711 23794 -231796 -73586 -172149 -158721
18494a58721I4344D3713a07200j80449e0151A05607a07919B11399B3332b04274
$$ -158721 94344 43713 -107200 -287649 -50151 105607 -107919 211399 23332 -204274
18483b27793m0807i7996B2861b18765k25564D146b78734f8877k75288B49275q7509
$$ -227793 -268600 -97996 22861 -218765 -444329 4146 -278734 -68877 -344165 249275 161766
18472A61766c5197q9252G4430P809j5901a12326L406o022D8209e9075j58119G7606
$$ 161766 -35197 -124449 74430 82239 66338 -112326 -108920 -114942 48209 -59075 -217194 77606
18459F4409a45050j81716C4826J46693A6697a76397g8069K2482a0648n00400f4165
$$ 64409 -145050 -326766 34826 181519 16697 -176397 -78069 -55587 -10648 -511048 -64165
18447B68468H8656a37878B28623i8310j98806C19162b16345I139K4863e92477
$$ 268468 88656 -137878 228623 -98310 -297116 319162 -216345 9139 34002 -592477
18436a14388A20888a15195B30070b0211B156a35789O7569B3060c77686E4246M2655
$$ -114388 120888 -115195 230070 -20211 2156 -135789 -68220 23060 -377686 54246 96901
18425I6901g9140c0697R465I7148a43830o0979Q0211b6472A25954c6323A91158
$$ 96901 -79140 -30697 -21232 97148 -143830 -204809 -124598 -26472 125954 -36323 191158
18413b68530g0354j38919j28352B90264b4525G0538L7335d6633M436C45388A970
$$ -268530 -70354 -209273 -337625 290264 -24525 70538 107873 -46633 -42197 345388 1970
18401c26375B36464B3864N3524K1170K5382f113G3659k718a82008k40864a54225
$$ -326375 236464 23864 77388 98558 123940 -6113 73659 70941 -182008 -422872 -154225
18389b29599K6824P3115D7602e2251q7415A94535b45078B2030a11811B4027a42083
$$ -229599 -202775 -129660 47602 -52251 -139666 194535 -245078 22030 -111811 24027 -142083
18377a35239g639n277k47302d289l75490F9589R3788J08399a74907B07168b62501
$$ -135239 -7639 -12916 -260218 -4289 -379779 69589 163377 271776 -174907 207168 -262501
18365g1378k07662K2167A0322e8049l5598m6691H3446c33497C8648F312J37768
$$ -71378 -279040 -256873 10322 -58049 -93647 -140338 83446 -333497 38648 6312 144080
18354A44080b82629B53497d86994a4568n411A91133J19353H5763b78647D184a1979
$$ 144080 -282629 253497 -486994 -14568 -19979 191133 310486 85763 -278647 4184 -11979
18342b69127D72416i7818j20485O1647E9456g477k27630A7472c03055g9804L0289
$$ -269127 472416 -97818 -218303 -156656 59456 -7477 -235107 17472 -303055 -79804 -49515
18331d9515I9165e544k08850b5342m0380E4052j2634d8043j37775E7883k1021
$$ -49515 99165 -5544 -214394 -25342 -65722 54052 41418 -48043 -185818 57883 36862
18320C6862h9675j07494Q6791N0566J1397D5922a22036l29329e3542N398j27447
$$ 36862 -89675 -197169 -110378 -59812 -48415 45922 -122036 -451365 -53542 -48144 -175591
18309a75591B79050h4791A33869j8295a48310k16584B79951b60156J2747A25510
$$ -175591 279050 -84791 133869 115574 -148310 -364894 279951 -260156 -247409 125510
18298a9322k61919k63051f2033E0167j9441a60239A14378n297d5546A34641F627
$$ -19322 -281241 -544292 -62033 50167 30726 -160239 114378 109081 -45546 134641 6627
18286A25390J9747D4232b04664A92454i1658k85315G8178K5382a43945N6148A00534
$$ 125390 145137 44232 -204664 192454 -91658 -376973 78178 103560 -143945 -87797 100534
18274C6196j4976g6847P345b1798H8901m2275c15946c41A84005p8819a1755j47183
$$ 36196 21220 -76847 -69502 -21798 88901 46626 -315946 -341 184005 105186 -11755 -158938
18262a58938B8693K8380i4419j59452J21392B07840i8029d3277A17555b83271
$$ -158938 28693 57073 -94419 -253871 -132479 207840 -98029 -43277 117555 -283271
18251b8518A70446K7825a19352A05954J8992g6637l2206C23265b66702i6920o5139
$$ -28518 170446 198271 -119352 105954 124946 -76637 -108843 323265 -266702 -96920 -162059
18240a62059A16934a72358A6417c9130A534J6246b46644A48367G2140a69050d1398
$$ -162059 116934 -172358 16417 -39130 1534 17780 -246644 148367 72140 -169050 -41398
18228A6403J28701f5522A17399e6550m00520D7886G605O400a66938r3983D10J116
$$ 16403 145104 -65522 117399 -56550 -457070 47886 7605 14005 -166938 -260921 410 1526
18216A526R7148R3765g8929f705j19465k747A21144b36894J06878k74677J77240
$$ 1526 98674 192439 -78929 -6705 -126170 -128917 121144 -236894 -130016 -404693 -227453
18205b27453h5657k6198B134b65752D6974i6654A85703G1348L4924J99739B5340
$$ -227453 -85657 -111855 2134 -265752 46974 -96654 185703 71348 106272 306011 25340
18193a28742A07974a38779C2531O6535j06J6233d075j6083B35961a01730j12997
$$ -128742 107974 -138779 32531 99066 98960 115193 -4075 -20158 235961 -101730 -214727
18182b14727A4081b05583l9918q3952M1832C487a76953c6658G4379J08565J36
$$ -214727 14081 -205583 -245501 -329453 -287621 3487 -176953 -36658 74379 182944 183080
18171A83080a74529A69135a65510e4307n3665F928d4802g35j47888J5132B0141
$$ 183080 -174529 169135 -165510 -54307 -107972 6928 -44802 -735 -148623 -133491 20141
18159b09249I7695a00493A51675b34518i359D0860Q4710L6826n8603J25426f0616
$$ -209249 97695 -100493 151675 -234518 -9359 40860 125570 162396 103793 229219 -60616
18147i1786A73807a21768j7072a8352j0668j01383A484J29205n5141k160P9679
$$ -91786 173807 -121768 -138840 -18352 -29020 -130403 1484 130689 75548 73388 153067
18136A53067a10333A64106J9474O2906e5732B60419a90872A34948L0382e1641
$$ 153067 -110333 164106 183580 246486 -55732 260419 -190872 134948 165330 -51641
18125b24982c5194B75898b79539B32555C3617A5079b05496G2379b6607B2225J01352
$$ -224982 -35194 275898 -279539 232555 33617 15079 -205496 72379 -26607 22225 123577
18114A23577B1414b21828C8923f3724r0892j04645C8377J35141D6440c5061k72905
$$ 123577 21414 -221828 38923 -63724 -154616 -259261 38377 173518 46440 -35061 -307966
18103c07966a19705A0544f474p4789F1906J61891b01411j9879E6817a17229A13580
$$ -307966 -119705 10544 -6474 -81263 61906 223797 -201411 -221290 56817 -117229 113580
18091a55681q1647m2971E47353G5848j405f8090a558j80103A97707G0151A7230
$$ -155681 -237328 -280299 547353 75848 74443 -68090 -1558 -181661 197707 70151 17230
18079A94006H1689J47680c80448J39718N5858j1889k18251B99776a09645o2913
$$ 194006 81689 229369 -380448 -240730 -184872 -196761 -415012 299776 -109645 -172558
18069a72558A702a19250L6876K8596j37915J234A6960B835a06140b3982j20525
$$ -172558 1702 -119250 -82374 -53778 -191693 -190459 16960 2835 -106140 -23982 -144507
18058a44507f2749j7497q1896k0013n0762c4968n3911j58415A29474c1406A43237
$$ -144507 -62749 -80246 -162142 -182155 -232917 -34968 -88879 -247294 129474 -31406 143237
18046A90776b85285a3581B2625L3388L13623A71184n6356a33175C9926L96157
$$ 190776 -285285 -13581 22625 56013 369636 171184 114828 -133175 39926 436083
18036D36083b54881G1535a43524A24366J00305r5166b6771p6540H8234J78456
$$ 436083 -254881 71535 -143524 124366 224671 129505 -26771 -103311 88234 266690
18026B66690A0411N4916K18191a23286d1229l52058g2510o9660j70908a07602
$$ 266690 10411 65327 283518 -123286 -41229 -393287 -72510 -142170 -313078 -107602
18015a1715k9084C22047E1957R5059a39849O350A50404a07005C9264Q5991a63250
$$ -11715 -40799 322047 51957 147016 -139849 -133499 150404 -107005 39264 125255 -163250
18003A29367a394E8108A5898J7348g3188H3232J5203J61308a23598n660A02515
$$ 129367 -1394 58108 15898 33246 -73188 83232 98435 259743 -123598 -129258 102515
17991c06603d2235k74503I127O0600J06413a3683f825j85588A12739C5671a51613
$$ -306603 -42235 -316738 9127 69727 176140 -13683 -6825 -192413 112739 35671 -151613
17979a46728k8235C5384J59269a14847G6697K03342B0791a25475B30907b96681
$$ -146728 -174963 35384 194653 -114847 76697 280039 20791 -125475 230907 -296681
17968c7753j11052F2805J51183J24829j14545b960k75261H6286a064j06898j05779
$$ -37753 -148805 62805 213988 338817 224272 -2960 -278221 86286 -1064 -107962 -213741
17957b13741P366H0932c22435a03941j6224A52640h173j37289f7193r6359a0455
$$ -213741 -206375 80932 -322435 -103941 -120165 152640 -8173 -145462 -67193 -163552 -10455
17945b3402q8057H1993c84530I9218O2491p9832B3901K06087F6858J00497b81301
$$ -23402 -111459 81993 -384530 99218 161709 81877 23901 229988 66858 167355 -281301
17933E2636c4016A92631b30020B9299a55501k3284C0642b2073B7423R5347c25251
$$ 52636 -34016 192631 -230020 29299 -155501 -178785 30642 -22073 27423 122770 -325251
17921a0231j8192F7659a55968A70693a62238m3184c0717l02516A91600a71110
$$ -10231 -28423 67659 -155968 170693 -162238 -205422 -30717 -333233 191600 -171110
17910C08860b58976O7943C06016c844j60847f8711a4950k70157b9497l19j25513
$$ 308860 -258976 -191033 306016 -3844 -164691 -68711 -14950 -285107 -29497 -29816 -155329
17899a55329B1571K46222q2242b6583k50874F5633O2680a0243I4975a24538C4626
$$ -155329 21571 267793 185551 -26583 -277457 65633 128313 -10243 94975 -124538 34626
17887A05848b21918H7922C9538Q9762E9549Q0700K102n6747i935H8536N3436K75046
$$ 105848 -221918 87922 39538 129300 59549 140249 142351 85604 -9935 88536 141972 417018
17875D17018A4758O7994b11138A26433a69538a9039j36468G4315l5242b25297
$$ 417018 14758 82752 -211138 126433 -169538 -19039 -155507 74315 39073 -225297
17864b02197j6118Q7281E0219a06335G1100a92825l6210b2474k90030b4097l0727
$$ -202197 -218315 -131034 50219 -106335 71100 -192825 -229035 -22474 -312504 -24097 -54824
17853e4824j1854A16883J19028f8407a2370k03628e9319l55050c4097j68387R0082
$$ -54824 -66678 116883 235911 -68407 -12370 -215998 -59319 -414369 -34097 -202484 -112402
17842a12402F2192J26055c9146j7679A18232a21122M3581A47568g8501j08183
$$ -112402 62192 188247 -39146 -56825 118232 -121122 -77541 147568 -78501 -186684
17832a86684b6916j95878A38750b30206B37874c70227D2943E512K753P4490L22709
$$ -186684 -26916 -222794 138750 -230206 237874 -370227 42943 5512 8265 82755 405464
17821D05464D341J39877K02056c2390B24463b59180B5365J62121a27920M2365
$$ 405464 4341 144218 346274 -32390 224463 -259180 25365 187486 -127920 -85555
17811h5555c6999B32293m3483b0597G2220c007j55567C1577A4014b42429a0452
$$ -85555 -36999 232293 188810 -20597 72220 -3007 -158574 31577 14014 -242429 -10452
17799I302K05025a62480A27822b520k37818J18804E8836b34566L4283G6785P9259
$$ 9302 214327 -162480 127822 -2520 -240338 -121534 58836 -234566 -200283 76785 156044
17788A56044D6744f344A4763a77866N824C77522i3133A09154a88930J5235f9812
$$ 156044 46744 -6344 14763 -177866 -172042 377522 -93133 109154 -188930 -173695 -69812
17776A95516c50637A27899K24662b04465R0108A06408K62934a3417k44006M5727
$$ 195516 -350637 127899 352561 -204465 -114357 106408 369342 -13417 -257423 -211696
17766b11696M4825j92851P8792j1295a37133A06104K37899A65310B9626c70288
$$ -211696 -166871 -359722 -280930 -292225 -137133 106104 344003 165310 29626 -370288
17755a46776m3599F6914O6222O4162C0580O1914O2326E5046d08757A84528a11532
$$ -146776 -190375 66914 133136 197298 30580 92494 154820 55046 -408757 184528 -111532
17743A53196D1986a88165F3308h3925e837A03018c0235I1110i1928d644n676H2740
$$ 153196 41986 -188165 63308 -83925 -5837 103018 -30235 91110 -91928 -4644 -10320 82740
17730a05891A62066g7720A32584m4016a9928B26135e3820j62614C2852J23039
$$ -105891 162066 -77720 132584 88568 -19928 226135 -53820 -216434 32852 155891
17720A55891i4098A43355P1866b18904B50291A00111d1315j49685C47227A32610
$$ 155891 -94098 143355 215221 -218904 250291 100111 -41315 -191000 347227 132610
17709d9335B20827F7917L1430C3942a18549L2024k70464J69728j82102J28868
$$ -49335 220827 67917 99347 33942 -118549 -86525 -356989 -187261 -369363 -240495
17699b40495G9499J96100F0771a65993e4221B6910b97750E3562g7290C07293A3531
$$ -240495 79499 275599 60771 -165993 -54221 26910 -297750 53562 -77290 307293 13531
17687D6863J35442K42602a8232j55410m2763G5740l5773c19494J46726e9265j1502
$$ 46863 182305 424907 -18232 -173642 -216405 75740 39967 -319494 -172768 -59265 -70767
17676g0767m9251A0685M4410K5302P9921m6993R4814a96328C33599A59973A6890
$$ -70767 -120018 10685 55095 80397 160318 113325 208139 -196328 333599 159973 16890
17664A32797F5989K65665a22808A39213a65893C40266A16807R9431i3879A15689
$$ 132797 65989 331654 -122808 139213 -165893 340266 116807 216238 -93879 115689
17653B04896q6307k2504a10482j896N650m9327C37953G3061e9640A47104L2790
$$ 204896 118589 96085 -110482 -112378 -106728 -156055 337953 73061 -59640 147104 179894
17642A79894b22659A35196L7051a49345B05402G2399b11889a6527j97417j17201
$$ 179894 -222659 135196 172247 -149345 205402 72399 -211889 -16527 -213944 -331145
17632c31145D251O9158J39030b00292F4226N216J45946D135K2344L77471o5341
$$ -331145 4251 73409 212439 -200292 64226 69442 215388 4135 26479 403950 338609
17621C38609b7947B17252a31024F8562a85368P3758A02670a18523A32296b26462
$$ 338609 -27947 217252 -131024 68562 -185368 -111610 102670 -118523 132296 -226462
17610b95141b7491j32117A33889k3371K5567a47952F1349b39614A77116F7301
$$ -295141 -27491 -159608 133889 110518 136085 -147952 61349 -239614 177116 67301
17599a55931B37091b37426N6862o1492d7588B08982G0614J38903b1696j88767
$$ -155931 237091 -237426 -180564 -242056 -47588 208982 70614 209517 -21696 -210463
17589b10463l9382A10085b14416F0621O8959K5185m5679a86468B76340O3976a16770
$$ -210463 -249845 110085 -214416 60621 129580 154765 109086 -186468 276340 340316 -116770
17577A44440d704k4529E4541J23851q0625b1130A70223L67460g9529j93366O7223
$$ 144440 -4704 -29233 54541 178392 97767 -21130 170223 537683 -79529 -272895 -205672
17566b05672e9468A23761c28211e9047B7146K19683d7559C735e357A61550J01784
$$ -205672 -59468 123761 -328211 -59047 27146 246829 -47559 3735 -5357 161550 263334
17555B63334F5510b7325B1083c6892G92e786A54500a85527j26402A900O6763A3912
$$ 263334 65510 -27325 21083 -36892 792 -5786 154500 -185527 -311929 1900 68663 13912
17542A3221J87410O4887H9719J15205l3537b5493B11670A8170K857a63020I5000
$$ 13221 200631 265518 89719 204924 171387 -25493 211670 18170 21027 -163020 95000
17530H8230a98808B04649a18278I8600m043O227E555L34181B9675M70037b29337
$$ 88230 -198808 204649 -118278 98600 94557 100784 5555 339736 29675 499712 -229337
17518H3666P7148r544Q767j9792L17508k20330B5636A0616b1564E7226M2390A8955
$$ 83666 160814 151270 160037 140245 457753 237423 25636 10616 -21564 57226 99616 18955
17505A76240d6237m6694A54776M9522p1579k9550L86815I2108J37678a24035A98338
$$ 176240 -46237 -92931 154776 204298 132719 103169 489984 92108 229786 -124035 198338
17493a97535E1111g7762j12633f0675A73473K762p323L914c9278B63133C291a14335
$$ -197535 51111 -77762 -190395 -60675 173473 176235 168912 172826 -39278 263133 3291 -114335
17480a44701A33196a15703a1127p1703A88549K82950E9114P6177M9875d5161B98565
$$ -144701 133196 -115703 -11127 -82830 188549 471499 59114 135291 185166 -45161 298565
17468I1573B1121K20996q0382g7053L2251B29190I0197J064P4829L9272L6125
$$ 91573 21121 242117 161735 -77053 -44802 229190 90197 91261 166090 205362 241487
17457B41487j15628J76619K26335a57927B53504j6044n5925G6420a72571E56999
$$ 241487 125859 302478 528813 -157927 253504 237460 181535 76420 -172571 556999
17446C87645r6965K27334A93020L87512I1508K66229A39515g6560A67018P2455
$$ 387645 290680 518014 193020 580532 91508 357737 139515 -76560 167018 239473
17436B39473m6550D2044d2797A63271C7254a22748j0027A93487C4598c2715C00713
$$ 239473 192923 42044 -42797 163271 37254 -122748 -132775 193487 34598 -32715 300713
17424D39000L0410c9883C37596n1842A6213J78935J11552b6767C53057r161O6128
$$ 439000 469410 -39883 337596 285754 16213 195148 306700 -26767 353057 343896 410024
17413D10024H2492J38870k1209m959E0327i6800A74376m7996K09507a75950C74169
$$ 410024 82492 221362 200153 195194 50327 -96800 174376 126380 335887 -175950 374169
17401C82120A54726D085L2835i280H6575J38784J32845C7879L1003a391B55290
$$ 382120 154726 4085 36920 -9280 86575 225359 358204 37879 68882 -1391 255290
17389C0750L3952L7957J69960K108J0251K34462A97100k9935a22857D1958J13227
$$ 30750 64702 102659 272619 274727 284978 519440 197100 167165 -122857 41958 155185
17378A55185J7992N0031A01713a3145B22186o6226n855A0199L84505a35820D24603
$$ 155185 173177 223208 101713 -13145 222186 155960 150105 10199 394704 -135820 424603
17366B95290a32397c4006A31306J94599i9894E859J59393g3421B62375p1101E5371
$$ 295290 -132397 -34006 131306 325905 -99894 5859 165252 -73421 262375 191274 55371
17354d7435a8899B16062j7268I04M84390A96066K00481h6084A50451a69893A60685
$$ -47435 -18899 216062 198794 904 485294 196066 396547 -86084 150451 -169893 160685
17342C24579r0648F0594K22245O7252n6618A7159h978j81425D24892A47071l2242
$$ 324579 233931 60594 282839 350091 293473 17159 -8978 -190403 424892 147071 114829
17331A14829J84124a566B13250R8059d0173B55733D9092P1565B5907K29228b40853
$$ 114829 298953 -1566 213250 311309 -40173 255733 49092 120657 25907 255135 -240853
17319C05125E4990b55049F8303J49539k1544J48240j21231a22600A05293L40337
$$ 305125 54990 -255049 68303 217842 196298 344538 223307 -122600 105293 445630
17309D45630k22307g2389G6159J32117q1506J84708A48972K5805l4971o7668a35418
$$ 445630 223323 -72389 76159 208276 126770 311478 148972 174777 139806 72138 -135418
17297D60773D6142L41700A28108e88697B76921j1568A21619k9430i139m035A26376
$$ 460773 46142 387842 128108 -588697 276921 265353 121619 92189 -9139 -13174 126376
17285A96967C1029c3822H0211J07114N17643k60496b0398j80503b7010G6055J18840
$$ 196967 31029 -33822 80211 187325 704968 444472 -20398 -200901 -27010 76055 194895
17274A94895m9749j7739E7851I465K44585J27366o2915J39205j62640K7252m3131
$$ 194895 145146 127407 57851 9465 254050 381416 318501 457706 295066 322318 279187
17263B79187l6374h0355B70781k9181A30K88696f260B20836b07987A97660j0016
$$ 279187 242813 -80355 270781 241600 130 288826 -6260 220836 -207987 197660 187644
17252A87644Q9256K07027A59408M209Q5278J50020m2476I656J78111E9793J39450
$$ 187644 276900 483927 159408 163617 248895 398915 356439 9656 187767 59793 199243
17241A99243L2485J01033b03727C85250f745p1413B28263i5358D41597j97306
$$ 199243 231728 332761 -203727 385250 -6745 -78158 228263 -95358 441597 244291
17231B44291J33272n7374d3530B25962P9896f6100D5313L23166j6730E3513K57182
$$ 244291 377563 320189 -43530 225962 305858 -66100 45313 368479 351749 53513 310695
17220C10695f4980N042B09073o1263P9337j11064M14161H7685h3962D04948m8613
$$ 310695 -64980 -59938 209073 147810 227147 116083 530244 87685 -83962 404948 356335
17209C56335J45967A87959K0350J21375C1915L32460A50271I700K00129l5950
$$ 356335 502302 187959 208309 329684 31915 364375 150271 9700 209829 173879
17199A73879K8478h0121B07948I0624Q5549m4485K65206A98381Q9450m0172j03573
$$ 173879 202357 -80121 207948 90624 176173 131688 396894 198381 287831 247659 144086
17188A44086E4074J4851P7837J98636A49055M2387b53235C13516n609l5964R0539
$$ 144086 54074 68925 146762 345398 149055 191442 -253235 313516 307907 271943 362482
17177C62482E5320N24449g9756B99593a12037C41874O1840J81143r9272B08419
$$ 362482 55320 579769 -79756 299593 -112037 341874 403714 584857 485585 208419
17166F9194c0827B77002P8814L9902m5691q614j05198j0375q8500J22722M0950
$$ 69194 -30827 277002 355816 395718 350027 341413 236215 225840 137340 260062 301012
17155C01012A40897K71811P0157R9721j94822l2694j49310L35229k19863j35942
$$ 301012 140897 412708 482865 582586 387764 355070 205760 540989 321126 185184
17145A85184K32215j19453K22383a6810I6228a17159D39723q0203A38352M07991
$$ 185184 417399 297946 520329 -16810 96228 -117159 439723 359520 138352 546343
17135E46343B66727Q4750K0388j28158J43288A4487L87803o8929K96559A68961
$$ 546343 266727 351477 371865 243707 386995 14487 402290 333361 629920 168961
17124C38825A24374N83808B60598L8863K6296K31973k07678l0041K65827A8412
$$ 338825 124374 708182 260598 299461 325757 557730 350052 320011 585838 18412
17113A75832F8706K91975r7235j2870K59483j16126o0876J16669C2216J87384
$$ 175832 68706 360681 263446 250576 510059 393933 333057 449726 32216 219600
17103B19600L04230j90300K50243B22402L35297r4566k02941J01988K83525j74808
$$ 219600 523830 333530 583773 222402 557699 463133 260192 362180 645705 470897
17093D70897l4608k2186H478J08998L06766L13150C59505J92710j81442A3172
$$ 470897 436289 414103 8478 117476 424242 737392 359505 552215 370773 13172
17082E03537j47272P5492J21324j26823q2602K43685A42070K84590R8566J54323
$$ 503537 356265 431757 553081 426258 343656 587341 142070 426660 525226 679549
17072F79549j70153k23695g0469C35925J6185r0908M58809B32650M6773j37656
$$ 679549 509396 285701 -70469 335925 352110 261202 720011 232650 279423 141767
17062A41767M25417n9423j96043P1172d968F98240C40564j61515J05336M10827
$$ 141767 567184 507761 311718 382890 -4968 698240 340564 179049 284385 695212
17052F95212o7217A06141J50803K01686j19308R4985j21296M02291M2602j06202
$$ 695212 627995 106141 256944 458630 339322 434307 313011 715302 757904 651702
17042F51702j60207B39506K42752M74055m57022J43417k83524L67286m5505k24404
$$ 651702 491495 239506 482258 956313 499291 642708 359184 726470 680965 456561
17032D56561M5609J38500k16131O7123n1508J64255j96217m5709L96467k48974
$$ 456561 502170 640670 424539 491662 440154 604409 408192 362483 758950 509976
17022E09976L13585l16272O6894o2780j26492K18693J9788j49465p5903K68266
$$ 509976 823561 507289 574183 511403 384911 603604 623392 473927 398024 666290
17012F66290K64880p1199J8930C22030M29475j94568J57225j27896R2960k42044
$$ 666290 931170 859971 878901 322030 751505 556937 714162 586266 679226 437182
17002D37182J83103M016R9508k92385M5340L03384J15394k7755l18586K55012
$$ 437182 620285 624301 723809 431424 476764 780148 895542 867787 549201 804213
16992H04213B23211M12652J85329j05129C00993N12545l58329K13745m7761J28622
$$ 804213 223211 635863 821192 716063 300993 813538 455209 668954 621193 749815
16982G49815J66922Q2145l4558l60015J02551J97772K7456j92163K54006B25439
$$ 749815 916737 998882 964324 604309 706860 904632 932088 739925 993931 225439
16971G15643Q7619L77035n81150J71811L15290m33640J83478L59309n54761K70463
$$ 715643 803262 1180297 599147 770958 1086248 652608 836086 1195395 640634 911097
16961I11097J96253k55168K19397J42026j70497k20314K22384j23937M4018j94739
$$ 911097 1107350 852182 1071579 1213605 1043108 822794 1045178 921241 965259 770520
16951G70520L35617m89389K38272J68918K668n9282R0076m0058k6130n7527J05890
$$ 770520 1106137 616748 855020 1023938 1026606 967324 1057400 1017342 991212 933685 1039575
16940A039575Q2304m287O8249K3837k91944K01864L64279l48039J49358k10053
$$ 1039575 1121879 1117592 1185841 1209678 917734 1119598 1483877 1135838 1285196 1075143
16930A075143K72683m73359K88459n9212O8471L16306o17976M05935Q661j04717
$$ 1075143 1347826 874467 1162926 1103714 1172185 1488491 870515 1276450 1285111 1180394
16920A180394L4577Q8288m12340M62563j91985K00043Q6114m10083j2012O6146
$$ 1180394 1214971 1303259 890919 1353482 1161497 1361540 1447654 1037571 1025559 1091705
16910A091705M67603j94659K60055r1194N4352l84300K94939j70213L33190k99987
$$ 1091705 1559308 1364649 1624704 1533510 1587862 1203562 1498501 1328288 1661478 1361491
16900A361491j27034L12212O4499L72630o47677K62964j41918j6845J80343j26962
$$ 1361491 1234457 1546669 1611168 1983798 1336121 1599085 1457167 1440322 1620665 1493703
16890A493703J43614J96524o5026q5381O5251J85064l4182q3139J67800j23599
$$ 1493703 1637317 1833841 1768815 1683434 1748685 1933749 1899567 1816428 1984228 1860629
16880A860629K37089n21870L35149K4142K11028k05115J95227K00316L5896k92667
$$ 1860629 2097718 1575848 1910997 1935139 2146167 1941052 2136279 2336595 2372491 2079824
16870B079824r8085L51146J71927m76663L315J06485L00963k5523j13668J70718
$$ 2079824 1981739 2332885 2504812 2028149 2031464 2137949 2438912 2413389 2299721 2470439
16860B470439K20467j28030J0423Q9304L7585j37811j66354K64914k3337K5962
$$ 2470439 2690906 2562876 2573299 2662603 2700188 2562377 2396023 2660937 2637600 2663562
16850B663562J72537R4990l6809R9195J25585K1668J10160r3194m4222K91901
$$ 2663562 2836099 2931089 2894280 2993475 3119060 3140728 3250888 3157694 3113472 3405373
16840C405373k95920L68127m6213J25716J31266k24570J54526K85478m45532M31048
$$ 3405373 3109453 3477580 3431367 3557083 3688349 3463779 3618305 3903783 3458251 3889299
16830C889299k0019K14818K9510n2423J59978K01076P9780o16204N06141J16944
$$ 3889299 3869280 4084098 4113608 4061185 4221163 4422239 4502019 3885815 4391956 4508900
16820D508900Q1009L52748j43398L23597j19992J11514K45997m08618J030845
$$ 4508900 4589909 4942657 4799259 5122856 5002864 5114378 5360375 4951757 5982602
16811E982602n40938P4135K74517R7655p5985M58490K66943K24661l7041N1633
$$ 5982602 5441664 5515799 5790316 5887971 5811986 6270476 6537419 6762080 6725039 6776672
16801F776672j6254L70289J06872J83827K88691k9463L3690N17588L07464l68449
$$ 6776672 6760418 7130707 7237579 7421406 7710097 7680634 7714324 8231912 8539376 8170927
16791H170927N40206K36815K38462O3938L83632M27467K42419M55317j3490K73518
$$ 8170927 8711133 8947948 9186410 9250348 9633980 10061447 10303866 10759183 10745693 11019211
16781A1019211M33472K23777L85357M47210L14016O18345J50029O04998N15268
$$ 11019211 11452683 11676460 12061817 12509027 12823043 13441388 13591417 14196415 14711683
16772A4711683N50804M20249N34616N51107K82730J024688P85607L51451Q91905
$$ 14711683 15262487 15682736 16217352 16768459 17051189 18075877 18861484 19212935 20104840
16763B0104840P89987P93642M92663Q03518J378773J234899R21553R30409J524087
$$ 20104840 20894827 21688469 22181132 22984650 24363423 25598322 26519875 27450284 28974371
16754B8974371R35073J579099J142828J952483J565129K081418J640742K223803
$$ 28974371 29909444 31488543 32631371 34583854 36148983 38230401 39871143 42094946
16746D2094946K701266K117858K544406K707591L191282K969746L618610L778722
$$ 42094946 44796212 46914070 49458476 52166067 55357349 58327095 61945705 65724427
16738F5724427L885901M470191M463654N391322N029480O188184N963877O723295
$$ 65724427 69610328 74080519 78544173 83935495 88964975 95153159 101117036 107840331
16730A07840331P370148P575175P432154Q617297Q200221Q880552Q239667Q810253
$$ 107840331 115210479 122785654 130217808 138835105 147035326 155915878 164155545 172965798
16722A72965798P902957P400216O450635N203631M348287K791463R48432l72305
$$ 172965798 180868755 188268971 194719606 199923237 204271524 207062987 208011419 207639114
16714B07639114k490736l395966n295388o544214p303485p891624q637913q853931
$$ 207639114 205148378 201752412 196457024 189912810 182609325 174717701 166079788 157225857
16706A57225857q917910q731495q471647q397042p884515p113142p186649o477982
$$ 157225857 148307947 139576452 131104805 122707763 114823248 107710106 100523457 94045475
16698I4045475o172976n580361m912975m870947m764413m225017l650581k991712
$$ 94045475 87872499 82292138 77379163 72508216 67743803 63518786 59868205 56876493
16690E6876493l683976k816153k702754k574957k654127k401869j762237j964195
$$ 56876493 53192517 50376364 47673610 45098653 42444526 40042657 38280420 36316225
16682C6316225j858614j919170j316631j005019k030601q61102j674428o29547
$$ 36316225 34457611 32538441 31221810 30216791 28186190 27325088 25650660 25021113
16674B5021113j245175j131703r35350n92361j263973m68717q47675p31602p57738
$$ 25021113 23775938 22644235 21708885 21116524 19852551 19383834 18536159 17804557 17046819
16665A7046819o63373m07401p16063n01677m11685q39240m36324p8018j87974
$$ 17046819 16383446 15976045 15259982 14758305 14346620 13507380 13071056 12993038 12805064
16656A2805064j037992j30046j73137p97697P4735k21648n48407l80410Q4947
$$ 12805064 11767072 11637026 11463889 10666192 10740927 10519279 9970872 9590462 9675409
16647I675409m57618n22271k20503j48144j56239N8583n87824j22140n6930k82143
$$ 9675409 9217791 8695520 8475017 8326873 8170634 8229217 7641393 7519253 7462323 7180180
16637G180180j01321k77987j59139k59793O366k02580q1711j82375l80976J90339
$$ 7180180 7078859 6800872 6641733 6381940 6388306 6185726 6104015 5921640 5540664 5731003
16627E731003R3927o18096k23966K17315j31775l90901K27918k59079K1701j96952
$$ 5731003 5824930 5206834 4982868 5200183 5068408 4677507 4905425 4646346 4668047 4471095
16617D471095j29315l09191N5014P0146J08273l30279R311q7228k42381k88762
$$ 4471095 4341780 4032589 4087603 4157749 4266022 3935743 3945054 3857826 3615445 3326683
16607C326683N48423m81435j34126K15864j28658l9169j30359q5858L1575Q555
$$ 3326683 3875106 3393671 3259545 3475409 3346751 3307582 3177223 3091365 3122940 3131495
16597C131495l79536J8321K94900m40204N5859R2361M3508n17251K67766K8196
$$ 3131495 2751959 2770280 3065180 2624976 2680835 2773196 2816704 2299453 2567219 2595415
16587B595415k54960j6559N8690p6923k40262L56516l91405J75437J00378Q1816
$$ 2595415 2340455 2323896 2382586 2305663 2065401 2421917 2030512 2205949 2306327 2388143
16577B388143l47434L47590o33171L58176R6152j78842K9442J95412n45684r2192
$$ 2388143 2040709 2388299 1755128 2113304 2209456 2030614 2060056 2255468 1709784 1617592
16567A617592J91704j11638J39847Q1950p1368l03079K72988j18949j36194J47790
$$ 1617592 1809296 1697658 1837505 1919455 1848087 1545008 1817996 1699047 1562853 1710643
16557A710643j71037P5882l31063L33771k01061j03922K94591m06114L68928k70683
$$ 1710643 1539606 1615488 1284425 1618196 1417135 1313213 1607804 1201690 1570618 1299935
16547A299935k18520K18971j11996L54198k17231n2345q5061J05233n9088p0260
$$ 1299935 1081415 1300386 1188390 1542588 1325357 1273012 1187951 1293184 1234096 1163836
16537A163836R1041J56300k82704K22221j17871q2478j48927p034J07656J77718
$$ 1163836 1254877 1411177 1128473 1350694 1232823 1150345 1001418 994384 1102040 1279758
16527A279758k41367O1002l4418j55344K60446j65875O146k08855J70763P8925
$$ 1279758 1038391 1099393 1064975 909631 1170077 1004202 1010348 801493 972256 1051181
16517A051181J0796j54241j44185m1077N76562o03061K51572k65064p1340L48006
$$ 1051181 1061977 907736 763551 722474 1299036 695975 947547 682483 611143 959149
16507I59149l75880K38003j0281r724k47894K01860O7990p6507J74506j68520
$$ 959149 583269 821272 810991 801267 553373 755233 823223 746716 921222 752702
16497G52702l21591N43461k93036k77560L75499R8663j83164J16306l72762r7103
$$ 752702 431111 974572 681536 403976 779475 878138 694974 811280 438518 341415
16487C41415M50277J15680D07210J69149J29590j18571J10899l11627L35484j28733
$$ 341415 791692 907372 407210 576359 705949 587378 698277 386650 722134 593401
16477E93401n4789n5140N45551D47356p2097P00055C60033Q7979O1258K96951
$$ 593401 538612 483472 1029023 447356 375259 1075314 360033 448012 509270 806221
16467H06221j38795k0241j01630k13316K03292m4519j08663K45478K54376M4226
$$ 806221 667426 647185 545555 332239 535531 491012 382349 627827 882203 926429
16457I26429m62614J82898O9328j78003j62090q5428R2537K56740k65245M10274
$$ 926429 463815 646713 716041 538038 375948 290520 383057 639797 374552 784826
16447G84826C38924K3077j37373m3167F5075K58356L22571J42947k98973k36018
$$ 784826 338924 362001 224628 181461 65075 323431 646002 788949 489976 253958
16437B53958J50528m0298R5388j61172L07962j8427d0249D52839K95964D7598
$$ 253958 404486 364188 459576 298404 606366 587939 -40249 452839 748803 47598
16426C79971j04431p7030N02009M1063C15953B9226O34534K8641G0540L82803
$$ 379971 275540 198510 700519 741582 315953 29226 663760 692401 70540 453343
16416D53343r1822n8292K05754A23160a22451k0987E60299F2824L02496A30143
$$ 453343 361521 303229 508983 123160 -122451 -143438 560299 62824 365320 130143
16405F02857q1631o9514A75445O0745M9939A34272L45315r7689A33150J81513
$$ 602857 521226 451712 175445 236190 286129 134272 479587 381898 133150 314663
16395C14663A17885J25460o6876O161M40390B75443j3022M26692k16641n034M7211
$$ 314663 117885 243345 176469 182630 623020 275443 262421 689113 472472 467438 514649
16384E14649B36765k0525O1397q5218K65409A59029J30338K72355j96336N2086
$$ 514649 236765 216240 277637 192419 457828 159029 289367 561722 365386 417472
16374D17472j53928i486l4230B30681j07525b27261A67432J87566b8904B58029
$$ 417472 263544 -9486 -43716 230681 123156 -227261 167432 354998 -28904 258029
16363B04078K55413k25784K1861K5752f2844C15738A06586K83016j43952J17791
$$ 204078 459491 233707 255568 281320 -62844 315738 106586 389602 245650 363441
16353C63441J65825k08627l6633J24165A87529M6813o9251L41490I0114J10008
$$ 363441 529266 320639 284006 408171 187529 234342 165091 506581 90114 200122
16343B00122E2915J19094o5523K1878A7300J67017L4438O9740K397L2277O2824
$$ 200122 52915 172009 106486 128364 17300 184317 218755 288495 290892 323169 385993
16332C85993q0113A34031B0817L41913A73293D0139J92277M502K89182A18320
$$ 385993 305880 134031 20817 362730 173293 40139 232416 236918 526100 118320
16321C46319j46899D030Q8298J37954C0141N4986C4769K9589f6256A14150i4915
$$ 346319 199420 4030 92328 230282 30141 85127 34769 64358 -66256 114150 -94915
16309A50641a58047A72887p1996M35127H9485O5314g9680B55583a06943D76112
$$ 150641 -158047 172887 100891 536018 89485 154799 -79680 255583 -106943 476112
16298B44699K38250b0729A08337M19198G2087J77525O4771j31139b49609b0065
$$ 244699 482949 -20729 108337 527535 72087 249612 314383 183244 -249609 -20065
16287a87207B5472L16467e6012A23440G749J71362F1707J08563c3436D17510A77662
$$ -187207 25472 341939 -56012 123440 7749 179111 61707 170270 -33436 417510 177662
16275E44522a67841I4166J25938g6233I725a8812A07996C8825J76500P7610A41416
$$ 544522 -167841 94166 220104 -76233 9725 -18812 107996 38825 215325 292935 141416
16263a57764k61136a07562C2724K8269L18419A5270a09200c7311A75579i6155
$$ -157764 -418900 -107562 32724 60993 379412 15270 -109200 -37311 175579 -96155
16252C67857j31225j9590g9965F9099N6366M1062a47699j41225B80965a23252
$$ 367857 236632 217042 -79965 69099 125465 166527 -147699 -288924 280965 -123252
16241a59707B34213c3756B61400J0612b8772G9760R3879a01400c3403D86586B01825
$$ -159707 234213 -33756 261400 272012 -28772 79760 173639 -101400 -33403 486586 201825
16229B54083j3082a604F9489M91231f4547a6544A7298a07096j58763D01310A60321
$$ 254083 241001 -1604 69489 560720 -64547 -16544 17298 -107096 -265859 401310 160321
16217C07900j19343a59287A07876l8512b28519A57411b498C31772a90262K6234
$$ 307900 188557 -159287 107876 69364 -228519 157411 -2498 331772 -190262 -164028
16207a64028A23228K1527a54958M2755B88306j453b89880O4429k17736D1464j1206
$$ -164028 123228 144755 -154958 -112203 288306 286853 -289880 -225451 -443187 41464 30258
16196C0258f8722o5630A4669c16628L033a04152B9246Q7J14603f3207B49711b84932
$$ 30258 -68722 -134352 14669 -316628 -313595 -104152 29246 29333 143936 -63207 249711 -284932
16183a66501j49348H9217O6958J59952A01802k2596b00668N653O5835j9010k7336
$$ -166501 -315849 89217 156175 316127 101802 79206 -200668 -195015 -129180 -148190 -175526
16172a75526j4593I2514B9716e1161k4446C17786a27953A07212b2243D45411a79024
$$ -175526 -190119 92514 29716 -51161 -75607 317786 -127953 107212 -22243 445411 -179024
16160I9052J47027J5223b11598B16381K0562f4001E9017c4173A47177A6498a03031
$$ 99052 246079 261302 -211598 216381 236943 -64001 59017 -34173 147177 16498 -103031
16148a21429j92300g0648j84501C0539O497J48901f7483m6776A31226b17703p133
$$ -121429 -313729 -70648 -255149 30539 37036 185937 -67483 -114259 131226 -217703 -224836
16137b24836J06181K1281b1593j40375J0932P1299I9457J09099H8390a25136A54685
$$ -224836 -118655 -97374 -21593 -161968 -151036 -79737 99457 208556 88390 -125136 154685
16125a31006m1061m7960A76047a95571i5935A0716a99640B73N34610b7863B31053
$$ -131006 -172067 -220027 176047 -195571 -95935 10716 -199640 273 534883 -27863 231053
16113a9344A40453F7406d0220m9681A54659J55819C1182N4467C3355J49191F4546
$$ -19344 140453 67406 -40220 -89901 154659 310478 31182 85649 33355 182546 64546
16101A74641C3192c2191I8868M20747b6703A91570a4756j55154A11558J1578J40563
$$ 174641 33192 -32191 98868 519615 -26703 191570 -14756 -169910 111558 123136 263699
16090B63699i3059H9313O7567a22876D336P4199g1248j9046M2542A58879c15928
$$ 263699 -93059 89313 156880 -122876 4336 78535 -71248 -90294 -47752 158879 -315928
16078b34506a3551J515j26683C7049j0229O9967j9048c24125J16866B24726a8171
$$ -234506 -13551 -12036 -138719 37049 26820 96787 77739 -324125 -207259 224726 -18171
16066G7010g6845j65667a19216d228A8032c4613B8007i0284k2375L1271A48107
$$ 77010 -76845 -242512 -119216 -4228 18032 -34613 28007 -90284 -112659 -81388 148107
16054a62252e2544A96473d05119J36313a10331j19841j19059A0679a15844C1791
$$ -162252 -52544 196473 -405119 -268806 -110331 -230172 -349231 10679 -115844 31791
16043A49091c73716K3608a37762b8158C5579L01470A19561A1936c52411A85803
$$ 149091 -373716 -350108 -137762 -28158 35579 337049 119561 11936 -352411 185803
16032d95717F580J6042c6588A82841g4868o7622A83517o0450L4636C538a77148
$$ -495717 6580 22622 -36588 182841 -74868 -142490 183517 123067 157703 3538 -177148
16020F943b54498A13167A0501b1486A32620a80609j10152G4663b2329F6075k1098
$$ 6943 -254498 113167 10501 -21486 132620 -180609 -290761 74663 -22329 66075 44977
16009D4977d7235j98501O5158C17979k7525C2884b9770m6448B61329a79526h212
$$ 44977 -47235 -245736 -180578 317979 290454 32884 -29770 -76218 261329 -179526 -8212
15997A6721L70055A17325a38174a7657B00867a77874o4723A06719J58393G4195
$$ 16721 386776 117325 -138174 -17657 200867 -177874 -242597 106719 265112 74195
15986b9551j38298j12081c4759F3855M2758J04397R374r7625a52137H2514L2804
$$ -29551 -167849 -279930 -34759 63855 106613 211010 220384 122759 -152137 82514 115318
15975A15318A0100J22853b06374O9801q4868a09077B61968F260J41491c53195
$$ 115318 10100 132953 -206374 -136573 -221441 -109077 261968 6260 147751 -353195
15964A41912D2500J82483O6477a862A88139c32626i2223j37372c2825j64904O9711
$$ 141912 42500 224983 291460 -1862 188139 -332626 -92223 -229595 -32825 -197729 -128018
15953a28018e912j52213M9353F1842f125k14262p4719b9087A78059a40635A82913
$$ -128018 -5912 -158125 -108772 61842 -6125 -220387 -295106 -29087 178059 -140635 182913
15941a71171A34490m0918a07501B1220L4999b54512h4933E7696H417M95A836J16499
$$ -171171 134490 93572 -107501 21220 56219 -254512 -84933 57696 8417 8912 1836 118335
15929A18335J05527a02801B1455J13162J60730j24757d5879B2491c68247C73958
$$ 118335 223862 -102801 21455 134617 295347 170590 -45879 22491 -368247 373958
15918b8981j51682I0663e033B37069a83191E9960k4547a28711D9344b36700A24469
$$ -28981 -180663 90663 -5033 237069 -183191 59960 35413 -128711 49344 -236700 124469
15906G6339K77133a79870B26616B4896a02016a4215n51643e0515A99834L2077
$$ 76339 353472 -179870 226616 24896 -102016 -14215 -565858 -50515 199834 231911
15896B31911a93046l5943G6588b90911b544j67209P944j25421c9529A09006Q0983
$$ 231911 -193046 -228989 76588 -290911 -2544 -169753 -161809 -287230 -39529 109006 189989
15885A89989j2390a68086I7175k6727a01382A08080g7865a2154j67031o7823J0858
$$ 189989 177599 -168086 97175 70448 -101382 108080 -77865 -12154 -179185 -247008 -236150
15874b36150A48084a18350L7174J8444E0522d6801G7813k136L2278B0403c1609
$$ -236150 148084 -118350 -81176 -62732 50522 -46801 77813 75677 107955 20403 -31609
15862f5045p3483q3245A55287a14723c0751B3644a37427A52400b39770B51176
$$ -65045 -138528 -221773 155287 -114723 -30751 23644 -137427 152400 -239770 251176
15851a51770B12445f0801B36074f0003D1237b3326A16984b06918A67642R7725
$$ -151770 212445 -60801 236074 -60003 41237 -23326 116984 -206918 167642 265367
15841B65367b16379M9441n504B18553G7048a44290A20002c78899D42d93837g25
$$ 265367 -216379 -166938 -172442 218553 77048 -144290 120002 -378899 442 -493837 -725
15829b2022p1399m6322a7208I2649J7802b04982A47342n5829d45584g7005K8645
$$ -22022 -93421 -139743 -17208 92649 110451 -204982 147342 91513 -445584 -77005 -48360
15818d8360M38D2125P8950f6360j36305a4404H8299A2038Q4369b5187r5164M467
$$ -48360 -47922 42125 121075 -66360 -202665 -14404 88299 12038 96407 -25187 -120351 -115884
15806a15884d3853m9062B17421D44a16222b743B4782a6066j02380j01772k40215
$$ -115884 -43853 -92915 217421 444 -116222 -2743 24782 -16066 -118446 -220218 -460433
15795d60433H4624j4230K77623G032B888J43551J6818g0446A0966a92552B03156
$$ -460433 84624 70394 348017 7032 2888 146439 163257 -70446 10966 -192552 203156
15783a13060C071J29879g9674n7399j46368a40176B8084o417b09193e8468C58619
$$ -113060 3071 132950 -79674 -137073 -283441 -140176 28084 21667 -209193 -58468 358619
15771h0705A48706P3412a11631L2478B98888c26640C12967a23639e9817j10902
$$ -80705 148706 222118 -111631 -79153 298888 -326640 312967 -123639 -59817 -170719
15761a70719L0481G4625J43d1236j18015j338A35833b50086i1564G3698c04088
$$ -170719 -140238 74625 74768 -41236 -159251 -160589 135833 -250086 -91564 73698 -304088
15749b5628k33858H331N01899A23801O2890a85962B77068a44064k0411f207n7480
$$ -25628 -259486 8331 510230 123801 186691 -185962 277068 -144064 -164475 -6207 -63687
15738f3687A17700P4392a52722A89156a51595F2984b2252A65991d3509k1708j62365
$$ -63687 117700 192092 -152722 189156 -151595 62984 -22252 165991 -43509 -65217 -227582
15727b27582j12320a01223k53313k0232A73590a85647C683Q8453a18859j86343
$$ -227582 -339902 -101223 -354536 -374768 173590 -185647 3683 92136 -118859 -305202
15717c05202d0275G2004b9438j42949B8360Q9934a39019B2073c17715a44770j7805
$$ -305202 -40275 72004 -29438 -172387 28360 118294 -139019 22073 -317715 -144770 -162575
15706a62575j11104A08346b40868A49317b56234B5240b45439G2949d7417d816
$$ -162575 -273679 108346 -240868 149317 -256234 25240 -245439 72949 -47417 -4816
15695F2262J18404i8690A50938F087Q5131g0450A78707f2086J4289D1487J13384
$$ 62262 180666 -98690 150938 6087 91218 -70450 178707 -62086 -47797 41487 154871
15684A54871c01254a05128A41716p509a92814A2835d2652j46485O3053D9215L37482
$$ 154871 -301254 -105128 141716 134207 -192814 12835 -42652 -189137 -126084 49215 386697
15673C86697b5157A14978i0478F6282K00498R206a13418B54785F4443c14992J52228
$$ 386697 -25157 114978 -90478 66282 266780 275986 -113418 254785 64443 -314992 -162764
15662a62764M9422C34032A08271c2890l68107F9821Q692R666b54472d5352A47995
$$ -162764 -113342 334032 108271 -32890 -400997 69821 78513 88179 -254472 -45352 147995
15650b02013F7228b22234c5991A06598A7034c58897P7136G4139j2519K38363b0940
$$ -202013 67228 -222234 -35991 106598 17034 -358897 -281761 74139 61620 299983 -20940
15638C51798b8274k5326o3528f428k27734l8574f41k006B76532A10100J3737d2773
$$ 351798 -28274 -53600 -117128 -6428 -234162 -272736 -641 -2647 276532 110100 123837 -42773
15625A1179c67699A64502C6679L79146a39656F1769k3699a1582I2253i6372m8146
$$ 11179 -367699 164502 36679 415825 -139656 61769 38070 -11582 92253 -96372 -144518
15614a44518n2037p1773k0945n455i845D3057L86277j95931K6107d27977B77058
$$ -144518 -196555 -268328 -289273 -294728 -9845 43057 429334 233403 259510 -427977 277058
15602A37801b23745F9698j6420e2440E0051K9278O3732b6097A61981d33783D3295
$$ 137801 -223745 69698 53278 -52440 50051 79329 143061 -26097 161981 -433783 43295
15590B10864H1295J79716a04404b4990j25343a2233A78250G2078B5468c6184k5694
$$ 210864 81295 261011 -104404 -24990 -150333 -12233 178250 72078 25468 -36184 -61878
15579f1878m7965C01187q4766G7545A0731a93144e4268C1102e6089F3837d11292
$$ -61878 -109843 301187 216421 77545 10731 -193144 -54268 31102 -56089 63837 -411292
15567h7270G2233J40291E5831a50715E6180K98613e5023D40403A02080D488K04691
$$ -87270 72233 212524 55831 -150715 56180 354793 -55023 440403 102080 4488 209179
15556B09179b30797n5005R0993f7023l2696A02967a5013O169A25687B9082J7207
$$ 209179 -230797 -285802 -194809 -67023 -99719 102967 -15013 -8844 125687 29082 46289
15545D6289d9648j46921n120B40496D7961K56355b3379b420A45683b3974j02421
$$ 46289 -49648 -196569 -201689 240496 47961 304316 -23379 -2420 145683 -23974 -126395
15534a26395j003j6401A76556D3040r195J9072g3889A17126a46232D6489J89090
$$ -126395 -127398 -143799 176556 43040 33845 52917 -73889 117126 -146232 46489 235579
15523B35579F8873b51659J04321J1897A92862d9251j72216H3804O8752n2594a1081
$$ 235579 68873 -251659 -147338 -135441 192862 -49251 -221467 83804 152556 99962 -11081
15511E1412M0848a29160P912j80709K0170a13153b4269F1039B7544J51650E5291
$$ 51412 92260 -129160 -121248 -301957 -281787 -113153 -24269 61039 27544 179194 55291
15499c54997h7297m1316c047A7613P0916a05174c5191a4474j63743A03650j63
$$ -354997 -87297 -128613 -3047 17613 88529 -105174 -35191 -14474 -178217 103650 103487
15488A03487J452K92126d7812p6135B30167G3818m330a27534r6793p609H6710
$$ 103487 104939 397065 -47812 -123947 230167 73818 69488 -127534 -224327 -231936 86710
15476A22719j6533d7171J8203A77305a26523a0216q4710b6944r7087B24160A01443
$$ 122719 106186 -47171 -28968 177305 -126523 -10216 -94926 -26944 -124031 224160 101443
15464F6779r811e5475A09466A6998b70472A40988b22372f6185l33057A25210m4130
$$ 66779 56968 -55475 109466 16998 -270472 140988 -222372 -66185 -399242 125210 81080
15453H1080b05173N6195B17440c3537J526C55117A30599J86373p6558A0332f601
$$ 81080 -205173 -148978 217440 -33537 -32011 355117 130599 316972 240414 10332 -6601
15441G5090b9665A14956C6563K52013q6624o4041a25441F6745h5070I3135m2538
$$ 75090 -29665 114956 36563 288576 201952 137911 -125441 66745 -85070 93135 50597
15430E0597a09924c6201H9764i1209B41055J40617A30321O0068J8202c29346k1085
$$ 50597 -109924 -36201 89764 -91209 241055 381672 130321 190389 208591 -329346 -350431
15419c50431a21871j28139N4813a741j43926M1019j02955F8443c82529a09142
$$ -350431 -121871 -250010 -195197 -1741 -145667 -104648 -207603 68443 -382529 -109142
15408d3493j73208A42926l0161M9981a40197j78416C14085A01963a69545n9548
$$ -43493 -216701 142926 112765 162746 -140197 -318613 314085 101963 -169545 -229093
15398b29093A08123K96974d4038j40955A96773o0470F737O174h8360l07844A45378
$$ -229093 108123 405097 -44038 -184993 196773 136303 6737 12911 -88360 -396204 145378
15386C22219b2977k6469j38879A76309a63731j383A85994G7290b21563J04381
$$ 322219 -22977 -49446 -188325 176309 -163731 -165114 185994 77290 -221563 -117182
15376a17182B88917b1626p3949B6225l037L72436b22702J02576l42492A15616
$$ -117182 288917 -21626 -95575 26225 23188 395624 -222702 -120126 -462618 115616
15365h0627m4288I2h8372a8515j53939I6438C1377a00639a4772o6476L2267B5802
$$ -80627 -124915 92 -88372 -18515 -172454 96438 31377 -100639 -14772 -81248 -48981 25802
15352b36860C71964r6452A06721K50113a22771N6962B66434b22375F7291a08006
$$ -236860 371964 275512 106721 356834 -122771 -65809 266434 -222375 67291 -108006
15341a04601e2013J7419r9498l13566A86860J68490A25996E46P4939h1046k20425
$$ -104601 -52013 -34594 -134092 -447658 186860 355350 125996 546 75485 -81046 -301471
15330c01471B31134J10361A6608b2462k36399G5443i3359B09302q3767J2543n4606
$$ -301471 231134 341495 16608 -22462 -258861 75443 -93359 209302 125535 138078 83472
15319H3472a42077G3710P3046a43786B44238h6250a5054k14481B52225f6949p7847
$$ 83472 -142077 73710 146756 -143786 244238 -86250 -15054 -229535 252225 -66949 -144796
15308a44796f7718j15a2131A56254b48448G8744a81914g1518c0115A06877a02503
$$ -144796 -67718 -67833 -12131 156254 -248448 78744 -181914 -71518 -30115 106877 -102503
15296b5953B10135a13384b0572B88493E6012K4248f010E4242b03551d2467B73376
$$ -25953 210135 -113384 -20572 288493 56012 80260 -6010 54242 -203551 -42467 273376
15284I5665J18393f2155J1163B09651l5403g4809A93724G3831j9399C902K03908
$$ 95665 214058 -62155 -50992 209651 174248 -74809 193724 73831 54432 3902 207810
15273B07810H4897h4091b5125o3081A19869K17426a86298Q1438j27805B52562
$$ 207810 84897 -84091 -25125 -88206 119869 337295 -186298 -104860 -232665 252562
15262A23308a18833e377A34571a24009A8474J47465c6729D77507A98448J77214
$$ 123308 -118833 -5377 134571 -124009 18474 165939 -36729 477507 198448 375662
15252C75662O7760A54071L37952O94746M41332o63139K98104n3669n16608B48358
$$ 375662 443422 154071 492023 1186769 1628101 964962 1263066 1209397 692789 248358
15241B0671K14252q0354D2135a74767C72421q0660j32978h042C35321F2394P5423
$$ 20671 234923 154569 42135 -174767 372421 291761 158783 -8042 335321 62394 137817
15230A37817e4325p9704j35543a11945b249A71054c251k04371e2978B69030C1339
$$ 137817 -54325 -134029 -269572 -111945 -2249 171054 -3251 -207622 -52978 269030 31339
15218f3215n8g680k49529B14160d8876A6787a00268E4064i3729a2810A9317Q5743
$$ -63215 -63273 -7680 -257209 214160 -48876 16787 -100268 54064 -93729 -12810 19317 105060
15206A05060J06123a85324B67646F4984j175a98348A18935h4118a4264H2634J6577
$$ 105060 211183 -185324 267646 64984 63809 -198348 118935 -84118 -14264 82634 99211
15195I9211d4073p3252l7358C75609c64389a3943B39003K30676A59544P5746n5971
$$ 99211 -44073 -117325 -154683 375609 -364389 -13943 239003 469679 159544 235290 179319
15184A79319m4431q562j5237a95583I0045g518k87282B4377a76146p7690C3935
$$ 179319 134888 126326 111089 -195583 90045 -7518 -294800 24377 -176146 -253836 33935
15172C2043K29333m8664a04961B96363G6022K0196K9155h0155B71606I8891K49581
$$ 32043 261376 212712 -104961 296363 76022 96218 125373 -80155 271606 98891 348472
15161C48472a49107e7627C26521p8304J01482j13407J16479n0633o3687a98802
$$ 348472 -149107 -57627 326521 248217 349699 236292 352771 302138 238451 -198802
15150g8782B17965o0851A9440B389a32899f0251a2324o5918D24886J67464F2964
$$ -78782 217965 157114 19440 2389 -132899 -60251 -12324 -78242 424886 592350 62964
15138D9686J56762g5039D3952M96322A06408J09925K7656J75252j85824L8911
$$ 49686 206448 -75039 43952 540274 106408 216333 243989 419241 233417 272328
15128B72328k4220H1753J0176J24792D9215J40358O1986a52800C42848d8886k74096
$$ 272328 248108 81753 91929 216721 49215 189573 251559 -152800 342848 -48886 -322982
15117c22982i6466a9091D84377H6497O2154O2357J58298j20143j1036A6726a45800
$$ -322982 -96466 -19091 484377 86497 148651 211008 369306 249163 238127 16726 -145800
15105I7785K46677c6162q025A71438K96355b00862D07537r6529L6314d5460I9836
$$ 97785 344462 -36162 -44187 171438 467793 -200862 407537 311008 347322 -45460 99836
15093B91942q3432J01490L04A1478a14820B43924K02437f7161B00176p2618J24809
$$ 291942 208510 310000 310304 11478 -114820 243924 446361 -67161 200176 127558 252367
15082B52367q8440K1906F0862g1066B84533A40497n1051K33868A18399C8253K94383
$$ 252367 163927 185833 60862 -71066 284533 140497 89446 323314 118399 38253 332636
15071C32636e8840I0402K27253C7358J90867a47045A15255l2075K89598B3158
$$ 332636 -58840 90402 317655 37358 228225 -147045 115255 83180 372778 23158
15060A54294r741J40902b5275B82988a90213C99218q4478I4879d9623D43125a60535
$$ 154294 144553 285455 -25275 282988 -190213 399218 314740 94879 -49623 443125 -160535
15048D51125j74105i7362L3373A09237f9883E76056a38C60688c8886r400G5275
$$ 451125 277020 -97362 -63989 109237 -69883 576056 -138 360688 -38886 -48286 75275
15036E0239J09671o0061L36860A35683F5645P7910J07316k0005K5977a4254j3004
$$ 50239 159910 99849 436709 135683 65645 143555 250871 230866 256843 -14254 -27258
15025b7258B80476A38014R842K71646A65710C0111P5935J28396M1497A06060J84744
$$ -27258 280476 138014 147856 419502 165710 30111 106046 234442 275939 106060 290804
15014B90804A38100B2976K14806J29823p7189J87107B27891I9375P39L53707A49927
$$ 290804 138100 22976 237782 367605 290416 477523 227891 99375 100114 453821 149927
15002C83765L0497q6224p7610N0513E8949M1522L04265A29402J6591l3510n5774
$$ 383765 414262 328038 250428 300941 58949 100471 404736 129402 145993 112483 56709
14991E6709K21789L8905A35282K53615F4275k2606M63143B21998F5174L97663
$$ 56709 278498 317403 135282 388897 64275 41669 504812 221998 65174 462837
14981D62837I6188B5122L66204o4434o3693q1193J83457E7290c12826C57437K14330
$$ 462837 96188 25122 391326 326892 263199 182006 365463 57290 -312826 357437 571767
14970E71767F5272e9389A20407M93504j02174K01406B18271l484a4021C8927M27986
$$ 571767 65272 -59389 120407 613911 511737 713143 218271 214787 -14021 38927 466913
14959D66913h1764D89483k24342F7935h1964E0710a196B2287L20174A21299L22577
$$ 466913 -81764 489483 265141 67935 -81964 50710 -1196 22287 342461 121299 443876
14948D43876j0915A58929L04060j59756q9137Q3826j20065J97547A07522L54234
$$ 443876 432961 158929 462989 303233 214096 297922 177857 375404 107522 461756
14938D61756j66298J67420A08485L72276A49371M86954n572B70550o6181J41517
$$ 461756 295458 462878 108485 480761 149371 636325 630753 270550 204369 345886
14928C45886A50654J13490j28173M8000L17605A00604L77983p3733H126K93686
$$ 345886 150654 264144 135971 183971 501576 100604 478587 404854 8126 301812
14918C01812j07973K91267B07321R0259r627M3817J65443B20948P1001J0070K2725
$$ 301812 193839 485106 207321 297580 287953 331770 497213 220948 291949 302019 324744
14907C24744j29730J13281L4622A19913N9988L06267B09045J73322J98675B42859
$$ 324744 195014 308295 342917 119913 179901 486168 209045 382367 581042 242859
14896B80259J38064A41790M5375K42743L1606n8354j58519M4616L26872B67973
$$ 280259 418323 141790 187165 429908 461514 403160 244641 289257 616129 267973
14885B79675O3225J3689A3588N43635l0420o1695E8108K33775J17899m2635n4900
$$ 279675 342900 356589 13588 557223 526803 465108 58108 291883 409782 367147 312247
14874C12247J97066f3656C04669j12432L61052A43217K90094R659r5471J02949
$$ 312247 509313 -63656 304669 192237 553289 143217 433311 442970 347499 450448
14864D50448p1316J71446A41755L18315j01157L43713j18375j91966H5443M28770
$$ 450448 379132 550578 141755 460070 358913 702626 584251 392285 85443 514213
14854E14213k36843N59613B43293L3918M29837k25491n5205B01672N00582C01189
$$ 514213 277370 836983 243293 277211 707048 481557 426352 201672 702254 301189
14843A42906J92248J50963j73685q7584L26581j10735k4486Q6076k6855j39013
$$ 142906 335154 486117 312432 224848 551429 440694 416208 502284 475429 336416
14833C36416J47477k14948J47509K1145p3644K43850J48654B95504J73209R60
$$ 336416 483893 268945 416454 437599 363955 607805 756459 295504 468713 469673
14823D69673M1556J14576q1340m7451J76899r9078P7792L6230k21580n6690K22677
$$ 469673 511229 625805 544465 497014 673913 574835 652627 688857 467277 410587 633264
14812F33264L15957p5281k17021r0432J13924k69803n358j12515J16013L40155
$$ 633264 949221 873940 656919 566487 680411 410608 405250 292735 408748 748903
14802G48903k04919K37065q7982j5256l2549r9142j86170J98916J0100B58799
$$ 748903 543984 781049 693067 677811 645262 546120 359950 558866 568966 258799
14791C95310M87080m23787A27449N61473l25968K48996B36909J96998J35424j73297
$$ 395310 882390 458603 127449 688922 362954 611950 236909 433907 569331 396034
14781C96034K31253k93255N1188M06587l33011J36167k1589r9025O5757M3207
$$ 396034 627287 334032 385220 791807 458796 594963 573374 474349 540106 583313
14771E83313J13778j21444B55093P1690K07238J19354L230L0040p2827k15181
$$ 583313 697091 575647 255093 326783 534021 653375 656605 686645 613818 398637
14761C98637L91196l43801P1250j18680L37526l48948J22677R4705k71858L90031
$$ 398637 789833 446032 517282 398602 736128 387180 509857 604562 332704 722735
14751G22735k61517M8163M11047k81527J63528m6383m9563k18546A86360P33856
$$ 722735 461218 509381 920428 638901 802429 756046 706483 487937 186360 920216
14741I20216k12403J09788C60577L64213l10547P8300P2472M00826D01736P09993
$$ 920216 707813 817601 360577 724790 414243 492543 565015 965841 401736 1111729
14731A111729k57739D19037L90061K2491J51025j86127l3748N2915M4934N0010
$$ 1111729 853990 419037 809098 831589 982614 796487 762739 815654 860588 910598
14721I10598j24011k40488K54813J25328k62843o3260O4229K1290Q3499K64928
$$ 910598 786587 546099 800912 926240 663397 600137 664366 685656 769155 1034083
14711A034083q5460q7444o0885j48082M20151l13762J93371m43773L25378p3888
$$ 1034083 948623 861179 800294 652212 1072363 758601 951972 508199 833577 759689
14701G59689R2124j55939K43339m0458J95229m0510k84022j500O1939r1650Q0768
$$ 759689 851813 695874 939213 898755 1093984 1053474 769452 767952 829891 738241 819009
14690H19009O4646j52816J15067P7440j00883j6482L49258k79676M1964J77463
$$ 819009 883655 730839 845906 923346 822463 805981 1155239 875563 917527 1094990
14680A094990j03747l84060k9276M67408J73750k12976K12346j20694m00268K45965
$$ 1094990 991243 607183 577907 1045315 1219065 1006089 1218435 1097741 697473 943438
14670I43438L18359k08880k82375N73042l80344K51727l11421J67553m6188k89803
$$ 943438 1261797 1052917 770542 1343584 963240 1214967 903546 1071099 1024911 735108
14660G35108O89120l64055J6533j16295k1614M26955j97421J509l8323j41226
$$ 735108 1424228 1060173 1076706 960411 938797 1365752 1168331 1169840 1131517 990291
14650I90291j903l08146L23744K45524o6078p228j34159R3997R104o7465k00720
$$ 990291 988388 680242 1003986 1249510 1183432 1176204 1042045 1136042 1145146 1077681 876961
14639H76961K85566J51475K89075m26418l9110L20187l4253J62132k94070p3676
$$ 876961 1162527 1314002 1603077 1176659 1137549 1457736 1423483 1585615 1291545 1217869
14629A217869l71509N11107j98715J61426q0245K03403j58097k48363J90258J01707
$$ 1217869 846360 1357467 1158752 1320178 1239933 1443336 1285239 1036876 1227134 1328841
14619A328841J68363K77641l60333J16530j4284K5270J56751j9206k40089Q3183
$$ 1328841 1497204 1774845 1414512 1531042 1516758 1542028 1698779 1679573 1439484 1522667
14609A522667J51394L1785J27988j26522j97657m9506K71455m0330P0545k33764
$$ 1522667 1674061 1705846 1833834 1707312 1509655 1460149 1731604 1691274 1761819 1528055
14599A528055R659N0688K97079K92j3750k114k37216N3297n809K80954k15704
$$ 1528055 1537714 1588402 1885481 1885773 1872023 1869909 1632693 1685990 1680181 1961135 1745431
14588A745431P4343K9503j92530J96643J35871r058P172K5818k12424L5686L99719
$$ 1745431 1819774 1849277 1656747 1853390 1989261 1980203 1987375 2013193 1800769 1836455 2236174
14577B236174l40840k3415J75671L48449j64262j35107m0206M3288Q2437J04551
$$ 2236174 1895334 1871919 2047590 2396039 2231777 2096670 2056464 2099752 2182189 2286740
14567B286740K86435r73m19912L91895r3241O2509J92641J41061l39652M41312
$$ 2286740 2573175 2572202 2152290 2544185 2450944 2513453 2706094 2847155 2507503 2948815
14557B948815n3536L84708O2273L28462k21241P42265Q58202J041748K446728
$$ 2948815 2895279 3279987 3342260 3670722 3449481 4191746 5049948 6091696 8538424
14548H538424N823305R400021J5089746Q19702j9159402H597101D133601j304711
$$ 8538424 14361729 23761750 38851496 39671198 20511796 8597101 4133601 2828890
14540B828890l98173o44413o0100N55332l55732J8693L847n9946M14161m20939
$$ 2828890 2430717 1786304 1726204 2281536 1925804 1944497 1948344 1888398 2302559 1881620
14530A881620K57815K2803q0100p8782K86483l10402K43387K4443J84043j27997
$$ 1881620 2139435 2162238 2082138 2003356 2289839 1979437 2222824 2247267 2431310 2303313
14520B303313L76558j33064q1467Q1370N2583o3978M0046o1410O7431L32035j50877
$$ 2303313 2679871 2546807 2465340 2546710 2599293 2535315 2575361 2513951 2581382 2913417 2762540
14509B762540j34835L0278J38970m074L42621j38411j01179K61820j32316K8543
$$ 2762540 2627705 2657983 2796953 2792879 3135500 2997089 2895910 3157730 3025414 3053957
14499C053957r2710K09512J40643q4680K21092j47075J86230k58408J32025J3944
$$ 3053957 2961247 3170759 3311402 3226722 3447814 3300739 3486969 3228561 3360586 3374530
14489C374530M35288l60840J70277o2151K10717J03556l92615J82183j96783M36248
$$ 3374530 3809818 3448978 3619255 3557104 3767821 3871377 3478762 3660945 3464162 3900410
14479C900410R9425k36969L78941K34105k89855O124q8918Q6012l5734J55274
$$ 3900410 3999835 3762866 4141807 4375912 4086057 4092181 4003263 4089275 4053541 4208815
14469D208815n0879K74629j80932K65050k523l227K82829j34732L25050q5113
$$ 4208815 4157936 4432565 4251633 4516683 4514160 4510933 4793762 4659030 4984080 4898967
14459D898967m96741N0620K05339J92869K64841k43790O27822q6472O3764k17168
$$ 4898967 4402226 4452846 4658185 4851054 5115895 4872105 5499927 5413455 5477219 5260051
14449E260051J91555k14271K94446k71768K54045l9170K80609K32515M3807j97559
$$ 5260051 5451606 5237335 5531781 5260013 5514058 5474888 5755497 5988012 6031819 5834260
14439E834260K40075L64626k2905R2144j12624j15033K94396P6416J26766L25803
$$ 5834260 6074335 6438961 6416056 6508200 6395576 6280543 6574939 6651355 6778121 7103924
14429G103924j93781J42889P8732k5497L1946q3226L67093j98257N92353K01514
$$ 7103924 6910143 7053032 7131764 7106267 7138213 7054987 7422080 7223823 7816176 8017690
14419H017690k65866K89227O6688K09845P1617K23447k39584K37395k5939L84333
$$ 8017690 7751824 8041051 8107739 8317584 8389201 8612648 8373064 8610459 8584520 8968853
14409H968853K30792J76172N10040p4489j87519M75921l9633J03526K35888k46700
$$ 8968853 9199645 9375817 9885857 9811368 9623849 10099770 10060137 10163663 10399551 10152851
14399A0152851L29779M34442K38139K03499j53000K25594M65455L3814L24669
$$ 10152851 10482630 10917072 11155211 11358710 11205710 11431304 11896759 11930573 12255242
14390A2255242M5772K39702M02420O9813j22943J96879O37853J00601L85027p1625
$$ 12255242 12301014 12540716 12943136 13012949 12890006 13086885 13724738 13825339 14210366 14138741
14380A4138741L30313K21632L91504P46216K4918J65728M42524M33633j516L64444
$$ 14138741 14469054 14690686 15082190 15828406 15853324 16019052 16461576 16895209 16893693 17258137
14370A7258137M56441N73062J98812K95832O78131L01555J2590P26886J31801
$$ 17258137 17714578 18287640 18486452 18782284 19460415 19761970 19774560 20501446 20633247
14361B0633247M32564R51598K48785M24421P13007J11782O59972P50065O18163
$$ 20633247 21065811 22017409 22266194 22690615 23403622 23515404 24175376 24925441 25543604
14352B5543604O24904P02140K15570P51545P13990Q82653M45686J147734R32863
$$ 25543604 26168508 26870648 27086218 27837763 28551753 29434406 29880092 31027826 31960689
14343C1960689O17842O30862J047285J242209J128574O44583Q28206J619097Q16094
$$ 31960689 32578531 33209393 34256678 35498887 36627461 37272044 38100250 39719347 40535441
14334D0535441J357844J368703J133878J052161K015878P53378K336581J175809
$$ 40535441 41893285 43261988 44395866 45448027 47463905 48217283 50553864 51729673
14326E1729673J550392J998268J867683K240807J914930J898093K642599J714972
$$ 51729673 53280065 55278333 57146016 59386823 61301753 63199846 65842445 67557417
14318F7557417K895181K881401K589601K918857K984975L418451L443704L857045
$$ 67557417 70452598 73333999 75923600 78842457 81827432 85245883 88689587 92546632
14310I2546632L812177M102972M214068M843517M470097N257278N730913N288014
$$ 92546632 96358809 100461781 104675849 109519366 113989463 119246741 124977654 130265668
14302A30265668O268600O255689O866301P617162P585795Q206002Q719250Q978917
$$ 130265668 136534268 142789957 149656258 157273420 164859215 173065217 181784467 190763384
14294A90763384R687828J0606930J0367683J1947721J1973940J2633534J3366053
$$ 190763384 200451212 211058142 221425825 233373546 245347486 257981020 271347073
14287B71347073J3356250J4377364J4756489J4990527J5295194J4917494J5119416
$$ 271347073 284703323 299080687 313837176 328827703 344122897 359040391 374159807
14280C74159807J4530464J3710700J3120306J1893550J0869774R233855P194541
$$ 374159807 388690271 402400971 415521277 427414827 438284601 447518456 454712997
14273D54712997M246859m45904k068753n81530j777260j48632m967759p598895
$$ 454712997 458959856 458513952 456445199 455863669 454086409 453937777 448970018 441371123
14265D41371123r628249j1635918j3505476j4462415j5131403j5675787j5927876
$$ 441371123 431742874 420106956 406601480 392139065 377007662 361331875 345403999
14258C45403999j5349884j5824318j5071152j4267002j3767102j3083998j3311847
$$ 345403999 330054115 314229797 299158645 284891643 271124541 258040543 244728696
14251B44728696j2198646j1608498j1316425j0114463j0230642r059647q619280
$$ 244728696 232530050 220921552 209605127 199490664 189260022 180200375 171581095
14244A71581095q356965p450819p554420o837165o310807n920692n932256m839546
$$ 171581095 163224130 155773311 148218891 141381726 135070919 129150227 123217971 118378425
14236A18378425n423132m884131m697903m383217l721477l695568l511859l704364
$$ 118378425 112955293 108071162 103373259 98990042 95268565 91572997 88061138 84356774
14228H4356774l163319l260353l049893k510488k798033k300303k343436k269250
$$ 84356774 81193455 77933102 74883209 72372721 69574688 67274385 64930949 62661699
14220F2661699j940023k223689j646583k095774k022482j258894j507677j436598
$$ 62661699 60721676 58497987 56851404 54755630 52733148 51474254 49966577 48529979
14212D8529979j513877j307178j301126j670651q25000q00845j307068j068690
$$ 48529979 47016102 45708924 44407798 42737147 41912147 41111302 39804234 38735544
14204C8735544j419748r82548j240017q22447m90797j017338o82712r25762q68483
$$ 38735544 37315796 36333248 35093231 34270784 33779987 32762649 32079937 31154175 30285692
14195C0285692o75808j200145l03357r62593n23571o88100k66213r27874N1563
$$ 30285692 29609884 28409739 28106382 27143789 26620218 25932118 25665905 24738031 24789594
14186B4789594j091789o69968k2071o56694p36242m56835k62621l82126n99734
$$ 24789594 23697805 23027837 23005766 22349072 21612830 21155995 20893374 20511248 19911514
14177A9911514n41836j47996n52441m39564l05149l70595j98917o16343l0307
$$ 19911514 19369678 19221682 18669241 18229677 17924528 17553933 17355016 16738673 16708366
14168A6708366l64819J35715p11627k56886m76034k71370m22347j52883j78795
$$ 16708366 16343547 16479262 15767635 15510749 15034715 14763345 14340998 14188115 14009320
14159A4009320m91534M3660j95800l39660l5368k80406j95730p32897J76227l7431
$$ 14009320 13517786 13561446 13365646 13025986 12990618 12710212 12514482 11781585 11957812 11920381
14149A1920381l54572N7184l96292j16423l36175J26028m49979M5375j62838m28166
$$ 11920381 11565809 11622993 11226701 11110278 10774103 10900131 10450152 10495527 10332689 9904523
14139I904523J11973m08045K82055l6657o11825J62098m39521O4731r5605n16418
$$ 9904523 10016496 9608451 9890506 9853849 9242024 9404122 8964601 9029332 8933727 8417309
14129H417309L08502l67442O5845J6809k73833j57679o838j49843r9864K36166
$$ 8417309 8725811 8358369 8424214 8441023 8167190 8009511 8002673 7852830 7752966 7989132
14119G989132n59963j47661k9353p5694J73087m02007k15040J42192k00477j13060
$$ 7989132 7429169 7281508 7252155 7176461 7349548 6947541 6732501 6874693 6674216 6561156
14109F561156o3073J65882k32491l56747M71469l78907j43238N7355l06163M8881
$$ 6561156 6498083 6663965 6431474 6074727 6546196 6167289 6024051 6081406 5775243 5824124
14099E824124j7048Q4030l04709K34835j67067l60394L22778J52068o12144J70856
$$ 5824124 5807076 5891106 5586397 5821232 5654165 5293771 5616549 5768617 5156473 5327329
14089E327329m9137R6419o5374k97605j75245n0548m1347j59257M85944l67017
$$ 5327329 5278192 5374611 5309237 5011632 4836387 4785839 4744492 4585235 5071179 4704162
14079D704162Q8778k49232k1785M04122m95970n5299J60440o3987l02486K31843
$$ 4704162 4792940 4543708 4521923 4926045 4430075 4374776 4535216 4471229 4168743 4400586
14069D400586l43486J98285J1060l0526k35393N5453j24845J8381J23133K1315
$$ 4400586 4057100 4255385 4266445 4235919 4000526 4055979 3931134 3949515 4072648 4093963
14059D093963j54582j07812K85680l5462m05315L1918k30460M18110n14301L04335
$$ 4093963 3939381 3831569 4117249 4081787 3676472 3708390 3477930 3896040 3381739 3686074
14049C686074j47139k40170N9151J19502k78040K57254q6846R3689j56080j40408
$$ 3686074 3538935 3298765 3357916 3477418 3199378 3456632 3369786 3463475 3307395 3166987
14039C166987j62158j92186M99506m28917L56585j41455O7763j23844p7775q6642
$$ 3166987 3004829 2812643 3312149 2883232 3239817 3098362 3166125 3042281 2964506 2877864
14029B877864L06469o1373l27648o7079J37379m81412J20953L37299l6795L7955
$$ 2877864 3184333 3122960 2795312 2728233 2865612 2384200 2505153 2842452 2805657 2843612
14019B843612k67005k2542J63949k44555j44312K68695k86514J62520j85299L48888
$$ 2843612 2576607 2554065 2718014 2473459 2329147 2597842 2311328 2473848 2288549 2637437
14009B637437J2675k30726j60763j70843K27102p9913J7159j2963r8871j49847
$$ 2637437 2650112 2419386 2258623 2087780 2314882 2234969 2252128 2239165 2140294 1990447
13999A990447j223K82976j52568j45505j503J22892j83719K70859N17430P1585
$$ 1990447 1989224 2272200 2119632 1974127 1972624 2095516 1911797 2182656 2700086 2771671
13989B771671J633946M463378Q671079J6143734O338647j6071784j1687307m982850
$$ 2771671 4405617 8868995 17540074 33683808 40022455 23950671 12263364 7280514
13981G280514j504185j410284p75546J6623N3603q20886r1415J90839k21899J29551
$$ 7280514 5776329 4366045 3590499 3607122 3660725 2839839 2748424 2939263 2717364 2846915
13971B846915l82119j31289p6228j04378J52708J08582n5746k46295K01880l73594
$$ 2846915 2464796 2333507 2257279 2152901 2305609 2414191 2358445 2112150 2314030 1940436
13961A940436L14376j36087k69403K72285j95894J32562m1173K0764R6002K3768
$$ 1940436 2254812 2118725 1849322 2121607 1925713 2058275 2017102 2037866 2133868 2157636
13951B157636m31219L77761k76926J68892J19236m79014M75481m00822l7481K99711
$$ 2157636 1726417 2104178 1827252 1996144 2115380 1636366 2111847 1711025 1673544 1973255
13941A973255l67658K64498m61998K12032n3215m0681J94232o5076k37753K83676
$$ 1973255 1605597 1870095 1408097 1620129 1566914 1526233 1720465 1655389 1417636 1701312
13931A701312P4166m72279L14165j48406J45550j39709p4318L27795m22505J59605
$$ 1701312 1775478 1303199 1617364 1468958 1614508 1474799 1400481 1728276 1305771 1465376
13921A465376K13504K2281m09235K86545m15821m3268K40871j07163K94960r2649
$$ 1465376 1678880 1701161 1291926 1578471 1162650 1119382 1360253 1253090 1548050 1455401
13911A455401K38726o0189l61525K57117k93004R7353q5738L44506J59980k91039
$$ 1455401 1694127 1633938 1272413 1529530 1236526 1333879 1248141 1592647 1752627 1461588
13901A461588j67357J15741l42423K36248K44106k18087l23012K13666K21246
$$ 1461588 1294231 1409972 1067549 1303797 1547903 1329816 1006804 1220470 1441716
13892A441716j08381j9850j01579j54774L23427l38671J04785j55750K98997j87681
$$ 1441716 1333335 1313485 1211906 1057132 1380559 1041888 1146673 990923 1289920 1102239
13882A102239M38106m62750r817L45199n63616L55801j85882J37574J85527n30204
$$ 1102239 1540345 1077595 1067778 1412977 849361 1205162 1019280 1156854 1342381 812177
13872H12177N66038l48641n1228L14672j04923l19626J44788J18597o908j79391
$$ 812177 1378215 1029574 978346 1293018 1188095 868469 1013257 1131854 1124946 945555
13862I45555j20794K94516K84612m73114J41853K57349n41753J59273J33223n2427
$$ 945555 824761 1119277 1403889 930775 1072628 1329977 788224 947497 1080720 1028293
13852A028293l62652M06711J34805m42979M813M08522m4993J0800l82131J10786
$$ 1028293 665641 1072352 1207157 764178 768991 1177513 1132520 1143320 761189 871975
13842H71975Q470k134K26716o1031l50401J37962J3212M7137k09006K11025K24
$$ 871975 880445 878311 1105027 1043996 693595 831557 844769 891906 682900 893925 894149
13831H94149j3916q2796K37610q8999j25171o12M7308n5151J66230j59332C81314
$$ 894149 880233 797437 1035047 946048 820877 820265 867573 812422 978652 819320 381314
13819G28313K7517o2570N01633l62650q3761M3897K59420C87946N88727j87534
$$ 728313 755830 693260 1194893 832243 748482 792379 1051799 387946 976673 789139
13809G89139j16094k47904R3932K7686J75614l7718P2232J41714k35144L63301
$$ 789139 673045 425141 519073 546759 722373 684655 756887 898601 663457 1026758
13799A026758D92398K04056J29574K660k24248J50795j14718j34870K65403N9689
$$ 1026758 492398 696454 826028 828688 604440 755235 640517 505647 771050 830739
13789H30739m8933k58111K31754N8304l73160L38676J39165O1927D74669J7954
$$ 830739 781806 523695 755449 813753 440593 779269 918434 980361 474669 492623
13779D92623N51087D13778M94839k52125O2227o3333K66489m10490R1054J50238
$$ 492623 1043710 413778 908617 656492 718719 655386 921875 511385 602439 752677
13769G52677k41052M0851J13954j10664r1430J61622J27668m0717k12408J08636
$$ 752677 511625 552476 666430 555766 464336 625958 753626 712909 500501 609137
13759F09137J07236k30528J51918o4328K28955l37306R4780L2706n1303J71858
$$ 609137 716373 485845 637763 573435 802390 465084 559864 592570 541267 713125
13749G13125j94334N9366J20340K18910l82223j21453J35443l9782o7971L50744
$$ 713125 518791 578157 698497 917407 535184 413731 549174 509392 441421 792165
13739G92165l05819J48887J87771r6863C18144L72382o5831C10434K40150p5475
$$ 792165 486346 635233 823004 726141 318144 690526 624695 310434 550584 475109
13729D75109R1919O9340J80560C55336K87217j07682j4j84977J92358n8720K75790
$$ 475109 567028 636368 816928 355336 642553 534871 534857 349880 542238 483518 759308
13718G59308C54417K05702j66128K52122A20053M10741L50453D08051O7763K3449
$$ 759308 354417 560119 393991 646113 120053 530794 881247 408051 475814 499263
13708D99263A47949M49093N2494l24671K55272J69583l68889L73751B91341K07716
$$ 499263 147949 597042 649536 324865 580137 749720 380831 754582 291341 499057
13698D99057J1982L63241C19835l958M16910l24105K06975O6406Q5025C03907
$$ 499057 511039 874280 319835 315877 732787 408682 615657 682063 767088 303907
13687C80825k2593l936n2024M07418j84461Q6139J19381l61996j53334K31025
$$ 380825 358232 354296 302272 709690 525229 611368 730749 368753 215419 446444
13677D46444O6782p4076k253K9653J23991r7229k42416J09530K09363j2423k23608
$$ 446444 513226 439150 436897 466550 590541 493312 250896 360426 569789 557366 333758
13666C33758J28668j16552j19940L83353k82006N9935K37177A30952M35463q3515
$$ 333758 462426 345874 225934 609287 327281 387216 624393 130952 566415 482900
13656D82900R5983J16322j24125r0990Q3866A1793K57867K28124O5066B66554
$$ 482900 578883 695205 571080 480090 563956 11793 269660 497784 562850 266554
13645A56041J92659M5699j90918O8216J37674j21892o7346J09798p1329r809L70140
$$ 156041 348700 394399 203481 271697 409371 287479 220133 329931 258602 248793 618933
13634F18933k01026o6111J08381B28787K55866B17569J31338L7426o551I6260
$$ 618933 417907 351796 460177 228787 484653 217569 348907 386333 379782 96260
13623C71180k0749M6677k8716j03316M25986B94410J82020k3074J03534j34800
$$ 371180 350431 397108 368392 265076 691062 294410 476430 453356 556890 422090
13613D22090A85850J71112m3981J26242L36201B77658n0508p8660L550P0174K86464
$$ 422090 185850 356962 312981 439223 775424 277658 227150 148490 152040 222214 508678
13602E08678k06562L51985A81343K80668A85169Q5334k3625L65541k15251A62760
$$ 508678 302116 654101 181343 462011 185169 270503 246878 612419 397168 162760
13591B77507J59811j19153M7144j73303J99551J35032j44727O8795A12778j3213
$$ 277507 437318 318165 365309 192006 391557 526589 381862 450657 112778 99565
13581I9565C9302N01985A80164J63671Q6444q9491R6495F05L89316j60551R8112
$$ 99565 39302 541287 180164 343835 430279 340788 437283 605 389921 229370 327482
13570C27482l6284p9985p0885J76785k6311o5689J48343A27609J41415P0353N6537
$$ 327482 291198 211213 140328 317113 290802 225113 373456 127609 269024 339377 395914
13559C95914L1257l09N6335A79848J99619A72827k6591J83401A12109K48577A60670
$$ 395914 427171 426862 483197 179848 379467 172827 146236 329637 112109 360686 160670
13547B75261m4462K0129a86974B48292m6217g6984B01775H2879L89568C9314J898
$$ 275261 230799 250928 -186974 248292 202075 -76984 201775 82879 472447 39314 41212
13536D1212J39176K15024J98303E308K38550N3042K85845k82897O3809r43C0582
$$ 41212 180388 395412 593715 5308 243858 296900 582745 299848 363657 362714 30582
13524C67450R6946j53078J61014C1698M88271I861M8292K1280K64752d1928C97923
$$ 367450 464396 311318 472332 31698 519969 9861 58153 79433 344185 -41928 397923
13512C26984j09111J78782j21644J84103j78366p289J11347c1301D43212J27998
$$ 326984 217873 396655 275011 459114 280748 273459 384806 -31301 443212 571210
13502E71210B14151J09327A07332J65583j06415L90413A30O9738L93522B05731
$$ 571210 214151 323478 107332 272915 166500 556913 130 69868 463390 205731
13491A15291A3034R4341J14591J68892C9811O22060B95253j15005f9162D08900
$$ 115291 13034 107375 221966 390858 39811 661871 295253 180248 -69162 408900
13480a6410A58342n0316O8661p5249J74937M1490K1397D299N4304q656a3332C57117
$$ -16410 158342 108026 176687 101438 276375 317865 339262 4299 58603 49947 -13332 357117
13467D09401j46818A0782L97728o8778j44669J36033j06891a27336H1376K56236
$$ 409401 262583 10782 408510 339732 195063 331096 224205 -127336 81376 337612
13457C37612A49349K82345j13848c83954A87987d985A67818q3805N5209o1084
$$ 337612 149349 431694 317846 -383954 187987 -4985 167818 84013 139222 78138
13447G8138A1209O8663j2989j4098K83423e4359C79876j30112J31736i4759c2625
$$ 78138 11209 79872 66883 52785 336208 -54359 379876 249764 381500 -94759 -32625
13435A78864M04792j33153j61089j2484k4463r0310L1093l8282N2727d9437D82417
$$ 178864 583656 450503 289414 276930 252467 162157 193250 154968 207695 -49437 482417
13423B47427A6104N42687B38859K95929k36504r8812n8106J35840J94962e2851
$$ 247427 16104 558791 238859 534788 298284 199472 141366 277206 472168 -52851
13412h9530D31705A18453K85275c2693B1035K35359d6177B56483o2318J87395
$$ -89530 431705 118453 403728 -32693 21035 256394 -46177 256483 194165 381560
13402C81560I6693L21610f2194D08278K4580j14586L2694A09179L80140b53662
$$ 381560 96693 418303 -62194 408278 432858 318272 350966 109179 489319 -253662
13391A01077R8221o5093p498D1518J0304N0193D368J64395L3151D4090K18469
$$ 101077 199298 134205 126707 41518 51822 102015 4368 168763 201914 44090 262559
13380B62559k1128J28806j31908p1750a50064B74807E0156K46159G781J40214
$$ 262559 241431 370237 238329 166579 -150064 274807 50156 296315 7781 147995
13370A47995J67476j21893R1030p3999f5101B53124l8830C7644J9339B761L8532
$$ 147995 315471 193578 284608 210609 -65101 253124 214294 37644 56983 2761 41293
13359D1293J43026o9762O4104J9701H929L97880A50981h6688I8807B958a58826
$$ 41293 184319 114557 178661 198362 8929 406809 150981 -86688 98807 2958 -158826
13347B43725B4623K19691P7036P596N1130j81618p9168E6805L50080j37736r3503
$$ 243725 24623 244314 321350 328946 380076 198458 119290 56805 406885 269149 175646
13336A75646o6753L16987A48286k8248n8660K03673K60981j90374J78560A16633
$$ 175646 108893 425880 148286 120038 61378 265051 526032 335658 514218 116633
13325d6541F16609r4745k37730m2334e9022B45424K01569j22619q1225q5366P6732
$$ -46541 616609 521864 284134 241800 -59022 245424 446993 324374 243149 157783 234515
13314B34515P1218l226l8167j05743o0275a5873C53756J38870f3968A24204a37759
$$ 234515 305733 302507 264340 158597 98322 -15873 353756 492626 -63968 124204 -137759
13302b73145H1030L8792K0209J0272A4982K54063h8454C48462C9503J16117K17310
$$ -273145 81030 119822 140031 150303 14982 269045 -88454 348462 39503 155620 372930
13291C72930D2653K62729r9012E8317a46575a3339A77036J48756q4396K98964
$$ 372930 42653 305382 206370 58317 -146575 -13339 177036 325792 241396 540360
13281E40360A35177C4108P1718l7684J63700J82728F7821J56479l6082b035G2059
$$ 540360 135177 34108 105826 68142 231842 414570 67821 224300 188218 -2035 72059
13269H7455R1178O5179g7831B59353r3648G7394N7521i5134A90120D6619e6238
$$ 87455 178633 243812 -77831 259353 165705 77394 134915 -95134 190120 46619 -56238
13257B89728g3192B30769D6917P694g4425b9748A0135J3507J36565a81669k7921
$$ 289728 -73192 230769 46917 54611 -74425 -29748 10135 23642 160207 -181669 -209590
13246b09590c6337J5687A63710b21743D62846B1329L25149j33151Q3682c3187
$$ -209590 -36337 -20650 163710 -221743 462846 21329 346478 213327 297009 -33187
13235d9862B25144b10901c5058B18413a34140E0744N8604a31759b2342B23919
$$ -49862 225144 -210901 -35058 218413 -134140 50744 109348 -131759 -22342 223919
13224B58963j3559O7163K2958a13282a3446j5331o0064g384o6847j94867A40074
$$ 258963 245404 312567 335525 -113282 -13446 -28777 -88841 -7384 -74231 -269098 140074
13212a57485L5726A49116A3877K73000a36121c7515C82875i0553C58392a63024
$$ -157485 -121759 149116 13877 286877 -136121 -37515 382875 -90553 358392 -163024
13201C37726l1406h2696K5261I6767C3916N4671b10937b3226B44120J45212o5831
$$ 337726 306320 -82696 -57435 96767 33916 88587 -210937 -23226 244120 389332 323501
13190C23501A06570C7233b0318A8153J16657j9153A5686h830F4893a54594a9374
$$ 323501 106570 37233 -20318 18153 134810 115657 15686 -8830 64893 -154594 -19374
13178A96045j7690B0936b34431A93955J34192H8149J30602H3739b94158p8795
$$ 196045 178355 20936 -234431 193955 328147 88149 218751 83739 -294158 -372953
13168c72953i8411A3736c59818B85326G2691J83506K3392L1507h1239D55637A79384
$$ -372953 -98411 13736 -359818 285326 72691 256197 279589 311096 -81239 455637 179384
13156C23981d0880j08359j1110B86297f6456k7367F6438J44616J98760F7092N5732
$$ 323981 -40880 -149239 -160349 286297 -66456 -93823 66438 211054 409814 67092 122824
13145A22824a15402j42098h7672n8116f2284b7901E43878j63736j71354F5847
$$ 122824 -115402 -257500 -87672 -145788 -62284 -27901 543878 380142 208788 65847
13134a44600E2388a16850A74625e7315j27802A64496o777p7383R5705M7250Q8816
$$ -144600 52388 -116850 174625 -57315 -185117 164496 157719 80336 176041 223291 312107
13123C12107I8876b3447A65752K36274p2826B4375L25523c20107A65829a15398
$$ 312107 98876 -23447 165752 402026 329200 24375 349898 -320107 165829 -115398
13112b63650A04812k9618O7309a85151I5333a15135k93483C17550f2449F1257
$$ -263650 104812 75194 142503 -185151 95333 -115135 -408618 317550 -62449 61257
13101B673a7726j582Q736G6284R6350f5612B31150b2897A96707k615d8359C7534
$$ 2673 -17726 -19308 -10572 76284 172634 -65612 231150 -22897 196707 194092 -48359 37534
13088b7595G2386a41666h879j24410e0321E9318J87896G2313h5609K6155A02619
$$ -27595 72386 -141666 -8879 -133289 -50321 59318 247214 72313 -85609 -59454 102619
13076C5855b13221A92115G3573J50847I6107K20616J55218B08445d3839o850k455
$$ 35855 -213221 192115 73573 224420 96107 316723 471941 208445 -43839 -50689 -53144
13065e3144b5122A57140N5342J23480H1623J17048K5690q9368F6911K04165E9973
$$ -53144 -25122 157140 212482 335962 81623 198671 224361 134993 66911 271076 59973
13053D9875k567K21415F7018l2751J12044d3509C57171j5053d38482b3586D8930
$$ 49875 47308 268723 67018 34267 146311 -43509 357171 342118 -438482 -23586 48930
13041B88785j03083o3667J53025q6816l4702C9248J76852r8048L36729j61507
$$ 288785 185702 122035 275060 188244 153542 39248 216100 118052 454781 293274
13031B93274q5679K0633b30805A58780J45738B293O50126A8352i448D8127P7601
$$ 293274 207595 228228 -230805 158780 304518 2293 652419 18352 -9448 48127 125728
13020A25728a20899H0171b31186I9179A6040N337J10456O0113J53757j09874H0256
$$ 125728 -120899 80171 -231186 99179 16040 21377 131833 191946 345703 235829 80256
13008A57501c24504C31644I8019l796R3280Q4619j5446d6642B15582I3727i2943
$$ 157501 -324504 331644 98019 94223 187503 272122 256676 -46642 215582 93727 -92943
12996A22903a3601I6463a33903B54193l2258H0594p137A9154a54523D08427e9038
$$ 122903 -13601 96463 -133903 254193 221935 80594 73457 19154 -154523 408427 -59038
12984a85911R0222B53684j06831n238b1713D6694J159c7660a1056j35175C19842
$$ -185911 -95689 253684 146853 141615 -21713 46694 47853 -37660 -11056 -146231 319842
12972b75787a29522D59896E3372Q871M2856N0409L7438b05593R6137d7883A52053
$$ -275787 -129522 459896 53372 62243 105099 155508 192946 -205593 -109456 -47883 152053
12960b71028h0509M853A16367j5154j6855M98683h4214G5402P7089R6531I408
$$ -271028 -80509 -75656 116367 101213 84358 583041 -84214 75402 152491 249022 9408
12948D8686Q7424b2873A91882q1608Q501b05977G6521g1434r8845k952Q4693A86279
$$ 48686 136110 -22873 191882 110274 118775 -205977 76521 -71434 -170279 -173231 -88538 186279
12935B65086o7730b19728G8231g6198j70075B0985a60752c4861A47073b15079
$$ 265086 197356 -219728 78231 -76198 -246273 20985 -160752 -34861 147073 -215079
12924A0305R5915a93258B44063p7184h6381f939j30721G0675a26100a84B13507
$$ 10305 106220 -193258 244063 166879 -86381 -6939 -137660 70675 -126100 -184 213507
12912a49801H0466A1067h9043j50844B67239r9590p0692b0042B50894k7291Q8130
$$ -149801 80466 11067 -89043 -239887 267239 167649 96957 -20042 250894 223603 311733
12901C11733D5214b14551h2449A91159E0023c379A93692a62520B04631A8583b4796
$$ 311733 45214 -214551 -82449 191159 50023 -3379 193692 -162520 204631 18583 -24796
12889F5863k0428B0986a32708b7481A34925F3885b5118H3216b96338J10959H1433
$$ 65863 45435 20986 -132708 -27481 134925 63885 -25118 83216 -296338 -185379 81433
12877C9547A021J46865J53034d192B45834A6459K5262f476A93735h5763n8225
$$ 39547 1021 147886 300920 -4192 245834 16459 41721 -6476 193735 -85763 -143988
12866a43988f0714C96212o5214g0660l0794A76109e5599k85063G7437J03767a84430
$$ -143988 -60714 396212 330998 -70660 -101454 176109 -55599 -340662 77437 181204 -184430
12854C5671a8891B56733Q7138c87186G1396a52127f6701A2554M50279b61476D3225
$$ 35671 -18891 256733 343871 -387186 71396 -152127 -66701 12554 462833 -261476 43225
12842c34935A96669M1564H2492r228K71214N1507H3530l6671a49887A15738J3896
$$ -334935 196669 238233 82492 73264 344478 395985 83530 46859 -149887 115738 129634
12831A29634D6476J39897K69869a39180G7412K07329b72264E9993Q8523L56029
$$ 129634 46476 186373 456242 -139180 77412 284741 -272264 59993 148516 504545
12821E04545H1182r570l5575Q6207h2850G8500K69556a7756A9216d9908H254c64201
$$ 504545 81182 71612 36037 122244 -82850 78500 348056 -17756 19216 -49908 8254 -364201
12808a18913C6107h018n5820c0935C9969e934j73573g6447E3406g0420a8445F8560
$$ -118913 36107 -8018 -63838 -30935 39969 -5934 -179507 -76447 53406 -70420 -18445 68560
12795a13779H03a40234A42266b99737A99713i4174d2253B42183J06891m5762D7766
$$ -113779 803 -140234 142266 -299737 199713 -94174 -42253 242183 349074 303312 47766
12783a85968P4484K2061j32215C12728H2838K0563K0793O0398G0288L33570H1557
$$ -185968 -111484 -89423 -221638 312728 82838 103401 124194 184592 70288 403858 81557
12771B56030A9316J26290c64968A10040a22289J2263A8459g7885j61063f3362
$$ 256030 19316 145606 -364968 110040 -122289 -110026 18459 -77885 -238948 -63362
12760B18135F77e8996F0489J07605i4890C0328R2881c04203B50414C3567b5997
$$ 218135 677 -58996 60489 168094 -94890 30328 123209 -304203 250414 33567 -25997
12748b58807e9028A77198C4699g0199B19649A2733M3772J46074Q2098F8471Q3187
$$ -258807 -59028 177198 34699 -70199 219649 12733 56505 202579 284677 68471 151658
12737A51658a41768B7084J02775a1918B30521o5873a4757I8938J62580f1809H2682
$$ 151658 -141768 27084 129859 -11918 230521 164648 -14757 98938 261518 -61809 82682
12725d14313B56990a13252F0022Q4953A3999d3011E2187P399i3537C09894p1780
$$ -414313 256990 -113252 60022 144975 13999 -43011 52187 59586 -93537 309894 238114
12714B38114a0550B69717I313c54874A47810a71972B37487J6094j2996H5679k645
$$ 238114 -10550 269717 9313 -354874 147810 -171972 237487 253581 240585 85679 83034
12703H3034J6391R8565L08709k16693q321H0714A0844d7799I5921k4501Q0069
$$ 83034 99425 197990 506699 290006 281685 80714 10844 -47799 95921 71420 151489
12692A51489a20641J3844A5029C179R6421j5106h5268o9004N9727E1653K18325
$$ 151489 -120641 -106797 15029 3179 99600 84494 -85268 -154272 -94545 51653 269978
12681B69978A03649B6475Q8577D9072N89992j41005q9105j55683j13210O2342
$$ 269978 103649 26475 115052 49072 639064 498059 408954 253271 140061 202403
12671B02403c72518B59965A18178B7699K29977A09114a01748j35848A82372a75202
$$ 202403 -372518 259965 118178 27699 257676 109114 -101748 -237596 182372 -175202
12660A4626N8725J84864f5127A00771b224F6476L31665e1917C17367b33566c948
$$ 14626 73351 258215 -65127 100771 -2224 66476 398141 -51917 317367 -233566 -3948
12648a64354A45281a35977B02411a56912b6126k04391f6518A27404J08152H0504
$$ -164354 145281 -135977 202411 -156912 -26126 -230517 -66518 127404 235556 80504
12637F2076a2152A5450N7422l0251O9866b0600E22268R0408B99509q7355h0810
$$ 62076 -12152 15450 72872 42621 112487 -20600 522268 612676 299509 212154 -80810
12625B34660a4953k44766A23336K49230a4375B38389Q3060a02969H3933K3667
$$ 234660 -14953 -259719 123336 372566 -14375 238389 321449 -102969 83933 107600
12615A07600J12256a25351B07960a1351B2993K6384b11395I799Q5366N3105c17955
$$ 107600 219856 -125351 207960 -11351 22993 49377 -211395 9799 95165 148270 -317955
12603A14152a47085A90730N6014j06412A5849K85034K27155a05834B5502F3a5095
$$ 114152 -147085 190730 246744 140332 15849 300883 528038 -105834 25502 63 -15095
12591b82859A71986G1884d5940C87583a14869k49523i230H939b24680P4286A50113
$$ -282859 171986 71884 -45940 387583 -114869 -364392 -9230 8939 -224680 -150394 150113
12579C08523A1656J78735a15958f641k02986n8263J29979k5781b6118A82360j9230
$$ 308523 11656 190391 -115958 -6641 -209627 -267890 -137911 -163692 -26118 182360 163130
12568A63130a30246B51369P1176m3548H6738e5767a3274L791q7326j53764B67371
$$ 163130 -130246 251369 322545 278997 86738 -55767 -13274 -9483 -96809 -250573 267371
12556a99647D8283N6903l8165J55895b76351C60480r3612p2057K0765a47057F8109
$$ -199647 48283 105186 67021 222916 -276351 360480 266868 194811 215576 -147057 68109
12544A82585D9024m184a24944e6541D4817J56899c2602j602j77854j32017a07290
$$ 182585 49024 44840 -124944 -56541 44817 201716 -32602 -34204 -212058 -344075 -107290
12532A53302f0960p5185B6054a60056o67b8429A27505A1530b39235b2351A2600
$$ 153302 -60960 -136145 26054 -160056 -160723 -28429 127505 11530 -239235 -22351 12600
12520c02571C4430a14662L9872a4797D3899J42950k9323J3038P9081B9659L23905
$$ -302571 34430 -114662 -74790 -14797 43899 186849 157526 170564 249645 29659 353564
12509C53564j39896a44083d6260q949N675j49136o4909C2395a15245J5425M2301
$$ 353564 213668 -144083 -46260 -55209 -49534 -198670 -263579 32395 -115245 -99820 -57519
12498e7519C31866a8030C86874c87856O8374B25434a00463l14515B6957d6551
$$ -57519 331866 -18030 386874 -387856 -319482 225434 -100463 -414978 26957 -46551
12487B4475b33057a5732m8175E7205a49586F6649e534A95784A7908K02876r5132
$$ 24475 -233057 -15732 -63907 57205 -149586 66649 -5534 195784 17908 220784 125652
12476A25652a93847g6984K551n8573g677l04618g642j39333B05076c97095J43125
$$ 125652 -193847 -76984 -74433 -133006 -7677 -312295 -7642 -146975 205076 -397095 -253970
12465b53970a15823o5584B38360q6147E2175a38172I34g6310H2370j8895b58009
$$ -253970 -115823 -181407 238360 152213 52175 -138172 934 -76310 82370 63475 -258009
12453b56986A16563b16104C840A760K28021n683i3227I8621a57005k4255a552
$$ -256986 116563 -216104 3840 1760 229781 224098 -93227 98621 -157005 -181260 -1552
12441a33055e8278C04528A19287h5423p9A61409a40789d6498r2949j62925b9021
$$ -133055 -58278 304528 119287 -85423 -85502 161409 -140789 -46498 -139447 -302372 -29021
12429b38515B18745I4103J66851A27125a44291r8674M426D8013a83198J9031A93646
$$ -238515 218745 94103 260954 127125 -144291 -242965 -238539 48013 -183198 -164167 193646
12417B82955k5851o6721m4348o3072P1619O9260i1267j27927H2472a01944j6352
$$ 282955 257104 190383 146035 82963 154582 223842 -91267 -219194 82472 -101944 -118296
12406a18296A84621J59559E3413m521a533A34856F5605A6140e7161o1752B32648
$$ -118296 184621 344180 53413 48892 -1533 134856 65605 16140 -57161 -118913 232648
12394a06050A56416b3017k54768A60918F0426c65950A41277B3714B047h7946n0671
$$ -106050 156416 -23017 -277785 160918 60426 -365950 141277 23714 2047 -87946 -138617
12383a38617B99924b62816K5895N331o8496D8762A546a37657D2716M9220a13558
$$ -138617 299924 -262816 -236921 -231590 -300086 48762 1546 -137657 42716 91936 -113558
12371B21836a69150I6912O0737O7407F4271a53211f3316A40339D9802K34556A17711
$$ 221836 -169150 96912 157649 225056 64271 -153211 -63316 140339 49802 284358 117711
12359A6316b41821L3311A6704B785O4127O3346h2019J64c7852A17144g6511k06133
$$ 16316 -241821 -208510 16704 2785 66912 130258 -82019 -81855 -37852 117144 -76511 -282644
12347b82644a37990G8896J24439c06646A70508a46800f8364A689M6853b11997
$$ -282644 -137990 78896 203335 -306646 170508 -146800 -68364 1689 48542 -211997
12336d2718j5641A88092a54330l3474Q1418A56524b30699f9086G9001O5766M1385
$$ -42718 -58359 188092 -154330 -187804 -106386 156524 -230699 -69086 79001 144767 186152
12325A86152b46238B963M687J47640a37926O4334m00j0398B83913a01345B13737
$$ 186152 -246238 2963 7650 155290 -137926 -73592 -73992 -84390 283913 -101345 213737
12313C43865a37957j64868d8426J6263k14061B98077I6639J89058p2064F692J59543
$$ 343865 -137957 -302825 -48426 -32163 -246224 298077 96639 285697 213633 6692 166235
12302A66235E8678m821M50681a9089A75455e7741B80874j29217a68748B0404b08873
$$ 166235 58678 53857 504538 -19089 175455 -57741 280874 151657 -168748 20404 -208873
12290B39203D7969P9571a45166A44476m385C4288h9285l6155B7759J30098K5381
$$ 239203 47969 127540 -145166 144476 140091 34288 -89285 -125440 27759 157857 183238
12279A83238Q8280j2396e6863A89813H0821K12597F4955K4557n475l6096b80030
$$ 183238 271518 259122 -56863 189813 80821 293418 64955 89512 84037 47941 -280030
12267A22643c1938r8672f0977C7852f0095A26064d299B2199K63561H9806a00543
$$ 122643 -31938 -130610 -60977 37852 -60095 126064 -4299 22199 285760 89806 -100543
12255f123m3726k783a163A48605h1828C3090d0221P998j87252e9504A43281j1616
$$ -6123 -49849 -52632 -1163 148605 -81828 33090 -40221 -32223 -219475 -59504 143281 131665
12243A31665H27O3872J50188D8078k675f3880A18723m633j5513J15065J7614k506
$$ 131665 827 64699 214887 48078 45403 -63880 118723 114090 98577 213642 231256 228750
12231B28750e0397A35305J04251J75658I9288l531K6158J04511M0067K84944r0091
$$ 228750 -50397 135305 239556 415214 99288 95757 121915 226426 266493 551437 461346
12220D61346A80482J65253O7239D7255K89745D2546J32324a9919A03702E1699
$$ 461346 180482 345735 412974 47255 337000 42546 174870 -19919 103702 51699
12209B61430P7546A62159a96748c1424E4997B5599J89167B295L79763D9837J29622
$$ 261430 338976 162159 -196748 -31424 54997 25599 214766 2295 382058 49837 179459
12198A79459J30833a7751B19683K20204k05373P3048M5867A63473o3354D5831
$$ 179459 310292 -17751 219683 439887 234514 307562 353429 163473 100119 45831
12187I0432g3900A07368L3952j7834e4995o2995A5016M05862e5780G6738M3029
$$ 90432 -73900 107368 141320 123486 -54995 -117990 15016 420878 -55780 76738 119767
12176A19767n9069J5939e993C85072I9927a63714B70746E12R8221a45315O6321
$$ 119767 60698 76637 -5993 385072 99927 -163714 270746 512 98733 -145315 -78994
12165g8994A01380J86349P5675A54688D3159M6144a08853j46869A99410d7491
$$ -78994 101380 287729 363404 154688 43159 89303 -108853 -255722 199410 -47491
12154a02476a5205D1930g6355p1467F8047R3577k8191J15257c45034G7297i511
$$ -102476 -15205 41930 -76355 -147822 68047 161624 133433 248690 -345034 77297 -9511
12142b15481B25069c1819C85106E0516J78803E5303c074D2559K5377C3111c27870
$$ -215481 225069 -31819 385106 50516 229319 55303 -3074 42559 67936 33111 -327870
12130G9143b16394A2793b85735A29844R2537J34280a59192K4084r1102I5574D5328
$$ 79143 -216394 12793 -285735 129844 222381 356661 -159192 -135108 -226210 95574 45328
12118h9243B1297b81535C5773a53969N7143G2398d86414B6621J36222d3898j17078
$$ -89243 21297 -281535 35773 -153969 -96826 72398 -486414 26621 162843 -43898 -160976
12107a60976b3630k16778c0494B92529a65129A1320b17370D87105g5424j55998
$$ -160976 -23630 -240408 -30494 292529 -165129 11320 -217370 487105 -75424 -231422
12097b31422a3277j75795D8354Q878b0211q1189C35915j52876k2059B1392a80673
$$ -231422 -13277 -189072 48354 57232 -20211 -101400 335915 183039 160980 21392 -180673
12085a24936q8779A14473a25056C82217a39111L7292A58377C3160g8209c3624
$$ -124936 -213715 114473 -125056 382217 -139111 -101819 158377 33160 -78209 -33624
12074D45609h4969c997B39486j2826P16064N84516k76469C97931k17j54833J36727
$$ 445609 -84969 -3997 239486 226660 942724 1527240 1250771 397931 397714 242881 379608
12063C79608b24044m818P9868D8304R1459F0720J91651r2480c05608h9955D1702
$$ 379608 -224044 -228862 -148994 48304 139763 60720 252371 159891 -305608 -89955 41702
12051b99535C72272G0822K22262b83579j22711b966D38841A35299E2065J31733
$$ -299535 372272 70822 293084 -283579 -406290 -2966 438841 135299 52065 183798
12041A83798G883J12510a6325p4344m5047A742b00255d7565r5694C11989a68186
$$ 183798 7883 120393 -16325 -90669 -135716 1742 -200255 -47565 -143259 311989 -168186
12029c33464B55006B1238a16734F1862K14396j31310n7548Q1723c8913a9130A87386
$$ -333464 255006 21238 -116734 61862 276258 144948 87400 169123 -38913 -19130 187386
12017h2863c6257j30006J6510g661A1044L55213A25620M5327a14297A11911G92
$$ -82863 -36257 -166263 -149753 -7661 11044 366257 125620 170947 -114297 111911 792
12005b06774C1692a55237L3186e9708E2131b655j72011D2208f735m9113k30278
$$ -206774 31692 -155237 -122051 -59708 52131 -2655 -174666 42208 -6735 -55848 -286126
11994b86126P9689J3327f1022k23693a00297r9240C7108A3490b52926c6613r9363
$$ -286126 -206437 -193110 -61022 -284715 -100297 -199537 37108 13490 -252926 -36613 -135976
11983a35976b2455A42898o8515a4173l0206B06101J56218j17801F25J55313B0584
$$ -135976 -22455 142898 74383 -14173 -44379 206101 362319 244518 625 155938 20584
11971F4078e2186A63130H0763c28387F3634a6557B7040J77899a28480A19261J4110
$$ 64078 -52186 163130 80763 -328387 63634 -16557 27040 204939 -128480 119261 133371
11960A33371b06832c8285A81206b28447f5546k48927a03335G6066a65980e7906
$$ 133371 -206832 -38285 181206 -228447 -65546 -314473 -103335 76066 -165980 -57906
11949a56537l4888k1748e3991Q137A20911a51026a9833j24787A49502c9789k27660
$$ -156537 -191425 -213173 -53991 -45854 120911 -151026 -19833 -144620 149502 -39789 -267449
11938b67449D8i3125d5944A18738B1381b2729A90250a68588o1928J11498E8760
$$ -267449 48 -93125 -45944 118738 21381 -22729 190250 -168588 -230516 -119018 58760
11926e606B03330i1072b2580H2291c943D3185a34051j22375n7885h0518F7614
$$ -5606 203330 -91072 -22580 82291 -3943 43185 -134051 -256426 -314311 -80518 67614
11914a5257I2904b06666k23677J34145c9063A73228E6085g3347k8508m7799A41551
$$ -15257 92904 -206666 -430343 -296198 -39063 173228 56085 -73347 -101855 -149654 141551
11902a57916o2337r1378A30070J596D5164Q0598O6509E0487K55686a19747j41518
$$ -157916 -220253 -311631 130070 131666 45164 125762 192271 50487 306173 -119747 -261265
11891b61265A61927P0691q4667a14268k60561A45610a38859D5287Q7365b51852
$$ -261265 161927 232618 147951 -114268 -374829 145610 -138859 45287 132652 -251852
11880a26652B54187a45179A59901N4894b70134A65972d4976r5396A28306b87713
$$ -126652 254187 -145179 159901 214795 -270134 165972 -44976 -140372 128306 -287713
11869c47462i1759B89436j29837R2025n3302P6176A5089L01714j00781c13480
$$ -347462 -91759 289436 159599 251624 198322 274498 15089 316803 216022 -313480
11858i8810k13066C84902h8064n5124k66292a98196H9235a28088d7682o047A32652
$$ -98810 -311876 384902 -88064 -143188 -409480 -198196 89235 -128088 -47682 -53729 132652
11846b66363p343a24834C38393E442a43138j56478K6180C84843A61675L0363b63639
$$ -266363 -273706 -124834 338393 5442 -143138 -299616 -273436 384843 161675 192038 -263639
11834b06406e8379A47020k9354k2727a45699M2238A65131f1729G3178i6164j15154
$$ -206406 -58379 147020 117666 94939 -145699 -103461 165131 -61729 73178 -96164 -211318
11823b11318j35639c7000d628A6675c93493A18197P9660H3673a97938a7711B7118
$$ -211318 -346957 -37000 -4628 16675 -393493 118197 197857 83673 -197938 -17711 27118
11811a95236G588J59103F7181g9305K9938A06606b3219C85816b99495C1040a67793
$$ -195236 7588 166691 67181 -79305 -49367 106606 -23219 385816 -299495 31040 -167793
11799A61059a92608E720d45362A63919J32992A5167a42717d5014a5342j19257
$$ 161059 -192608 5720 -445362 163919 296911 15167 -142717 -45014 -15342 -134599
11789a34599j24438l5949h0274m696c0752o2048M860l19406a23530j2225k00799
$$ -134599 -259037 -294986 -80274 -84970 -30752 -92800 -87940 -407346 -123530 -135755 -336554
11778c36554A70345a23888K4260a8017B12999K2789G5714J65210r6022j8735P24
$$ -336554 170345 -123888 -99628 -18017 212999 235788 75714 240924 144902 126167 126891
11767A26891a35246E9421R1047h1616b3986A25969b8154p439L454B47314r6455
$$ 126891 -135246 59421 150468 -81616 -23986 125969 -28154 -35593 -32139 247314 150859
11756A50859n7580M2563L6062o0074c90711B08441e7651D5973a89396A16357J1709
$$ 150859 93279 135842 171904 111830 -390711 208441 -57651 45973 -189396 116357 128066
11745A28066j174b8850m6246J1042A65885c2269K909k9655q7722G8826B0385O8690
$$ 128066 126892 -28850 -75096 -64054 165885 -32269 -29360 -59015 -146737 78826 20385 89075
11733H9075a96681B14246g4570j36697A7282h8205j37152A95029a51797f5119
$$ 89075 -196681 214246 -74570 -211267 17282 -88205 -225357 195029 -151797 -65119
11722A17083m1289a07231I1815m4415M4242m225J38447G8302l6466a43148G6161
$$ 117083 75794 -107231 91815 47400 91642 87417 225864 78302 41836 -143148 76161
11710a36465I125J40340a14112A01362J39069E3371a22005B0295K5217K06372
$$ -136465 9125 149465 -114112 101362 240431 53371 -122005 20295 45512 251884
11700B51884J6217a24577j54747B47806j09838A7908R0404K23575G7988M616J67539
$$ 251884 268101 -124577 -279324 247806 137968 17908 108312 331887 77988 82604 250143
11689B50143M2198H0498a82777P8552B27875j5133b22937r0231C9793J70869a57336
$$ 250143 292341 80498 -182777 -104225 227875 212742 -222937 -313168 39793 210662 -157336
11677a14942C42956A01390J25446E5549a335B1384r792a63076m7974D46059d9035
$$ -114942 342956 101390 226836 55549 -1335 21384 11592 -163076 -211050 446059 -49035
11665h980A32891b6838l5137j42988o174c1286D272K22861H8999a89087K1811
$$ -8980 132891 -26838 -61975 -204963 -211137 -31286 4272 227133 88999 -189087 -167276
11654a67276P634f4718r5046B80886a70619H3463e7360j45095j07697J20277B17746
$$ -167276 -159642 -64718 -159764 280886 -170619 83463 -57360 -202455 -310152 -189875 217746
11642a11627B08379q8399J22254J55421m6550F416f308H5614h487j96891O215
$$ -111627 208379 119980 242234 397655 351105 6416 -6308 85614 -8487 -205378 -199163
11631a99163B79902a00511p9056j01814B73761m8211B0945O7892P6125n1767a49434
$$ -199163 279902 -100511 -179567 -281381 273761 225550 20945 88837 164962 113195 -149434
11619a28589A18631g7592H4110J78090J13213A76508n0161b7116C9415c1746B6503
$$ -128589 118631 -77592 84110 262200 375413 176508 126347 -27116 39415 -31746 26503
11607B6364h8541j976A18144m8394a25102B60292L7782j39708P7912d6589A41542
$$ 26364 -88541 -90517 118144 69750 -125102 260292 298074 158366 236278 -46589 141542
11595C6561P6340b629B24312R0994f6218j92019h0990B3555J81218b9650E259
$$ 36561 112901 -2629 224312 315306 -66218 -258237 -80990 23555 204773 -29650 5259
11583B78836B4635L12284j29142a35397A21617a52783a0485I5056Q4068R043c22347
$$ 278836 24635 336919 207777 -135397 121617 -152783 -10485 95056 179124 188167 -322347
11571C34173a4423D79075j93950a70613K1067G401J73160a27937B119d8747E1039
$$ 334173 -14423 479075 285125 -170613 -149546 7401 180561 -127937 2119 -48747 51039
11559c8420l90384E2897L52289D4126h4246C9804b97369A48645n2464a564o3971
$$ -38420 -428804 52897 405186 44126 -84246 39804 -297369 148645 96181 -1564 -65535
11548f5535A81268K78205A79245Q972H3758L94281k25226q9277M5889K3976O1508
$$ -65535 181268 459473 179245 188217 83758 478039 252813 163536 209425 233401 294909
11537B94909q7582E0990b42091C97266H0746j2949a6271C59825A47493C0245K04658
$$ 294909 207327 50990 -242091 397266 80746 67797 -16271 359825 147493 30245 234903
11526B34903j1220c10821M3424A90261B8386K4555O229R6716a9293B5934L3081
$$ 234903 223683 -310821 -267397 190261 28386 52941 59170 155886 -19293 25934 59015
11515E9015J16425L8441h6696D76788H0183K04225j02415K7454r737q0889K8853
$$ 59015 175440 213881 -86696 476788 80183 284408 181993 209447 199710 118821 147674
11504A47674f1544F9471K76320I3954J41251b70034B23726c83894E21077a0288
$$ 147674 -61544 69471 345791 93954 235205 -270034 223726 -383894 521077 -10288
11493a65761A54209Q1745I7927A5787J17516P2862a18879C34679A45903J14775
$$ -165761 154209 235954 97927 15787 133303 206165 -118879 334679 145903 260678
11483B60678j02092K02059A04667J079a22469C66058J1034A30175f4162m1174
$$ 260678 158586 360645 104667 105746 -122469 366058 377092 130175 -64162 -105336
11473a05336A36906K3974l336J55445j28689a5361D01114b34843G5863h2346B45347
$$ -105336 136906 160880 157544 312989 184300 -15361 401114 -234843 75863 -82346 245347
11461F7807a54629D4229a1094N042k9698q2315A28100J58181j11187C9665K1371
$$ 67807 -154629 44229 -11094 -6052 -35750 -118065 128100 286281 175094 39665 61036
11450F1036K16680c7168D6636j5253P4977a1106E3417E029b20703E3029a21893
$$ 61036 277716 -37168 46636 31383 106360 -11106 53417 5029 -220703 53029 -121893
11438a21003A54775p042a14273B05429a45777C8012A8891b74371B40277a33512
$$ -121003 154775 147733 -114273 205429 -145777 38012 18891 -274371 240277 -133512
11427B32269q9255K23608A17564J0182a15744A94036k4553f0370A51909c30729
$$ 232269 143014 366622 117564 127746 -115744 194036 169483 -60370 151909 -330729
11416b5913m84605f5562F02K57489d4618A89476K3450o235d6796j31183g4804
$$ -25913 -510518 -65562 602 258091 -44618 189476 212926 206691 -46796 -177979 -74804
11404D60421a2771k8407C51217H5299f7230j31314B22005b78943L5513a10756
$$ 460421 -12771 -41178 351217 85299 -67230 -198544 222005 -278943 -243430 -110756
11393i8493k25586a57383B45884F6506Q1481J9790K49945F2630K56140c2534j92166
$$ -98493 -324079 -157383 245884 66506 147987 167777 417722 62630 318770 -32534 -224700
11382b24700A97306b8561r3993A01100K57598A21198R7462o5315D3822N9330J6649
$$ -224700 197306 -28561 -122554 101100 358698 121198 218660 153345 43822 103152 119801
11371A19801d16460B3973P3865i4537j77914J22466A15304b01652C0583j4356
$$ 119801 -416460 23973 97838 -94537 -272451 -149985 115304 -201652 30583 16227
11361A6227a9862n4444j94211A31021a86893I1941b23367L6599M6688f0859j54066
$$ 16227 -19862 -74306 -268517 131021 -186893 91941 -223367 -186768 -140080 -60859 -214925
11350b14925E7118b72269F8820b2177A54858o06b36302J14248A09285a23530A0149
$$ -214925 57118 -272269 68820 -22177 154858 154252 -236302 -122054 109285 -123530 10149
11338A9129K06051K26497A05697h1006B6157J11604b74676d652p6329A17503g0681
$$ 19129 225180 451677 105697 -81006 26157 137761 -274676 -4652 -80981 117503 -70681
11326i3793B20262d4013A07585d49900E0541K38443a46453C37501f439A09135
$$ -93793 220262 -44013 107585 -449900 50541 288984 -146453 337501 -6439 109135
11315c39961Q1421M9596e1325H722d9797k7783J6623A43263J03827a71129A8046
$$ -339961 -258540 -208944 -51325 8722 -49797 -77580 -60957 143263 247090 -171129 18046
11303a66894k861e7223k7474j29223A58904b01632G8002c54380D1406b17218B27153
$$ -166894 -169755 -57223 -84697 -213920 158904 -201632 78002 -354380 41406 -217218 227153
11291E2602L2033d1197k39650b7256A2265c08374f9620A06000J34309d08390R6696
$$ 52602 84635 -41197 -280847 -27256 12265 -308374 -69620 106000 240309 -408390 -311694
11280c11694e0872A1410J90914p0931c25202D3518i5645A09256e583A1564b2353
$$ -311694 -50872 11410 202324 131393 -325202 43518 -95645 109256 -5583 11564 -22353
11268a02820j62195B44728a96868A9149b811j03764A53520a37335k84720d5993
$$ -102820 -265015 244728 -196868 19149 -2811 -106575 153520 -137335 -422055 -45993
11257i5858D5061a01841D64333A92803D0048a30681H2078c89313N0205A72573
$$ -95858 45061 -101841 464333 192803 40048 -130681 82078 -389313 -339108 172573
11246F9349Q4640c09250H2778e5926A52455b6212m3666j77735H9596K82529a02511
$$ 69349 153989 -309250 82778 -55926 152455 -26212 -69878 -247613 89596 372125 -102511
11234g7939A56865b62248J27382M6683d2796l8441A42349c73824i8068l44428
$$ -77939 156865 -262248 -134866 -88183 -42796 -81237 142349 -373824 -98068 -442496
11224d42496a79329M6701M3201p1552k76124h0473q1927n2437a9021A29436A7767
$$ -442496 -179329 -132628 -89427 -160979 -437103 -80473 -162400 -214837 -19021 129436 17767
11212A4257a96782J250P8662M5196G037a23833A22214m4904i660l4990j24469
$$ 14257 -196782 -195532 -116870 -71674 7037 -123833 122214 77310 -9660 -44650 -169119
11201a69119f136k62842A9722R910b06221h5106i188k5700n6666D8402i1584K88
$$ -169119 -6136 -268978 19722 29632 -206221 -85106 -9188 -34888 -91554 48402 -91584 -91296
11189i1296j42431l5740J22301k0138j43934B10407e4261j68327g0997C11413
$$ -91296 -233727 -269467 -147166 -167304 -311238 210407 -54261 -222588 -70997 311413
11178a87072b1427A93282e8642r5849l8544I4842b0960p2494G1991E453b1227
$$ -187072 -21427 193282 -58642 -154491 -193035 94842 -20960 -93454 71991 5453 -21227
11166G6722a43171F3917a76985B15121c4644B01652a32798A4621Q6107b5882j61169
$$ 76722 -143171 63917 -176985 215121 -34644 201652 -132798 14621 100728 -25882 -187051
11155a87051I0549P6092A1650a79597P6758L8087H7668b16333R6456A72424A9958
$$ -187051 90549 166641 11650 -179597 -102839 -64752 87668 -216333 -119877 172424 19958
11143A26377O7956I1856a18889B32259c43518E1192a54749B42209a64931A92212
$$ 126377 194333 91856 -118889 232259 -343518 51192 -154749 242209 -164931 192212
11132A36100k0318R8849E7849a35848B31150f4923k7079o0935H4684e9952A28106
$$ 136100 115782 214631 57849 -135848 231150 -64923 -92002 -152937 84684 -59952 128106
11120a00690A37163Q8987G028b53860B58760p4849g7881A09309a70736l6319G3800
$$ -100690 137163 226150 7028 -253860 258760 183911 -77881 109309 -170736 -207055 73800
11108A28213K24088A74767j1707J3676R6064I818K81952j12743K01355A64899
$$ 128213 352301 174767 163060 176736 272800 9818 291770 179027 380382 164899
11097G2890K00428n3692G2428J69475j10088a9097j57957A75117M3704J95019
$$ 72890 273318 219626 72428 241903 131815 -19097 -177054 175117 218821 413840
11087D13840K8089E4680J7750j7872B4398N882L7871J60743C1295K70863j48592
$$ 413840 441929 54680 72430 54558 24398 30280 68151 228894 31295 302158 153566
11076A53566o3540J93247L6794l2387P0818Q2770j25903M46843B63813m6730J62531
$$ 153566 90026 283273 320067 287680 358498 441268 315365 762208 263813 217083 379614
11065C79614A76893J82329q6571L60894J35628B22288L11234K07552l36447J37339
$$ 379614 176893 359222 272651 633545 769173 222288 533522 741074 404627 541966
11055E41966J2641p9005M32000D02061L11412J7169K03523k8561l92913M45686
$$ 541966 554607 475602 907602 402061 713473 730642 934165 905604 512691 958377
11045I58377l70365P3244j78342L66305l15080L01246k5388n4642C22383K87507
$$ 958377 588012 661256 482914 849219 534139 835385 809997 755355 322383 609890
11035F09890o6942J54440k7593j40217Q2336K39079m13752M87596r595j31652
$$ 609890 542948 697388 669795 529578 611914 850993 437241 924837 915242 783590
11025G83590C58832J20396K27373p4528L1751o0767r6904J11123J55812m7629
$$ 783590 358832 479228 706601 632073 663824 603057 506153 617276 773088 725459
11015G25459k54500J22283q8144J53075I220N53920k06064J62442R4132o4954
$$ 725459 470959 593242 505098 658173 9220 563140 357076 519518 613650 548696
11005E48696j30446J42785J2591J8574k633M2183r767A43327N75633k65319k3403
$$ 548696 418250 561035 573626 592200 589567 631750 621983 143327 718960 453641 430238
10994D30238n3340L36251J72431j09868j51581R1070J75461K1961m6792K01492
$$ 430238 376898 713149 885580 775712 624131 715201 890662 912623 865831 1067323
10984A067323k04769L04666Q6066k10043L31275j47061L97966o9541N38439J34703
$$ 1067323 862554 1167220 1253286 1043243 1374518 1227457 1625423 1555882 2094321 2229024
10974B229024J11953r565M24249K7007j58902J04307l60774j76876l52006r3802
$$ 2229024 2340977 2331412 2755661 2782668 2623766 2728073 2367299 2190423 1838417 1744615
10964A744615j2297Q9606L22995l99832L75941P4785j05101k18503l78868J17744
$$ 1744615 1732318 1821924 2144919 1745087 2121028 2195813 2090712 1872209 1493341 1611085
10954A611085q724n76832o4688M6469m89958L25060l69885k2355n2908d7589G0584
$$ 1611085 1602361 1025529 960841 1007310 517352 842412 472527 450172 397264 -47589 70584
10942B77166K24697G6909L7629n6651J91856q7539n2082K7127K83652A83069f6478
$$ 277166 501863 76909 114538 57887 249743 162204 110122 137249 420901 183069 -66478
10930f9952B30986C441K02645A1432a66032G6891F994M09343A14685N2340J33896
$$ -69952 230986 3441 206086 11432 -166032 76891 6994 416337 114685 167025 300921
10919C00921E307J09228E5902b26764A30619e6972j91969F377Q923d6300o1498
$$ 300921 5307 114535 55902 -226764 130619 -56972 -248941 6377 15300 -46300 -107798
10908a07798m1084B47607J34091A21947K94352k03024A05281J52143r4743J62910
$$ -107798 -148882 247607 381698 121947 416299 213275 105281 257424 162681 325591
10898C25591b9701H0590a04066E4865J23876a36736j86732a05841r7283A68766
$$ 325591 -29701 80590 -104066 54865 178741 -136736 -323468 -105841 -203124 168766
10887a30917p9182A67006b04922g4461D02563A12360a44397C4949b71398A62473
$$ -130917 -210099 167006 -204922 -74461 402563 112360 -144397 34949 -271398 162473
10876I496b6998p2041j2613k9398F5236K33626H8502N4840p328b53559A38204
$$ 9496 -26998 -99039 -111652 -141050 65236 298862 88502 143342 136014 -253559 138204
10864b9079q535A11386a64070A68412a34877N675f3998k5596k7420K3042K5403
$$ -29079 -37614 111386 -164070 168412 -134877 -129202 -63998 -89594 -117014 -93972 -68569
10853f8569G4328a2900C4348a28991i262A3097b06759C11439c42380d4209I9066
$$ -68569 74328 -12900 34348 -128991 -9262 13097 -206759 311439 -342380 -44209 99066
10841a10108m098B85286b98993A42578K4766g9549A69231C4202G044g702A08533
$$ -110108 -114206 285286 -298993 142578 167344 -79549 169231 34202 7044 -7702 108533
10829B23708b9834D3460P0961a60081e9316A24668g3195n3386B00411f0790B81542
$$ 223708 -29834 43460 114421 -160081 -59316 124668 -73195 -126581 200411 -60790 281542
10817a02619b1190F950K05980b06565C9885d0566j10656b4493j20105m6074G5239
$$ -102619 -21190 6950 212930 -206565 39885 -40566 -151222 -24493 -144598 -190672 75239
10805C73502a05609N2500r3832A20656K23214A04141b82126j2194b3825k31072
$$ 373502 -105609 -53109 -146941 120656 343870 104141 -282126 -294320 -23825 -254897
10795b54897a27204E28985a29725A90390p7938a24296q2799D7385a33785l9260
$$ -254897 -127204 528985 -129725 190390 112452 -124296 -207095 47385 -133785 -173045
10785a73045C548P6016Q7291e521A1991f6168A29223b67176o2587C22824A40802
$$ -173045 3548 79564 166855 -5521 11991 -66168 129223 -267176 -329763 322824 140802
10773b40692d09D0949A9452a09727B39481a67481B24640n1754a80576d5539k02992
$$ -240692 -409 40949 19452 -109727 239481 -167481 224640 172886 -180576 -45539 -248531
10762b48531A86526h5483A35299d1407A07148e12589A54690a43087K2333j25640
$$ -248531 186526 -85483 135299 -41407 107148 -512589 154690 -143087 -120754 -246394
10752b46394d7843a7752j62128j29335P1788a8678A47670o3289e0818a2956k41529
$$ -246394 -47843 -17752 -179880 -309215 -237427 -18678 147670 84381 -50818 -12956 -254485
10741b54485A88599i2098l94092D0625b49586c2964A14581c0901j6933j5606C37026
$$ -254485 188599 -92098 -486190 40625 -249586 -32964 114581 -30901 -47834 -63440 337026
10729b82727d8666l5736j9128G3470b33018a00211L1054b6584C1408f3878F5051
$$ -282727 -48666 -84402 -103530 73470 -233018 -100211 -69157 -26584 31408 -63878 65051
10717b18513O8666j27680a895k13420A26243a38662a5519D3089c02095A42630
$$ -218513 -149847 -277527 -1895 -215315 126243 -138662 -15519 43089 -302095 142630
10706a23579r4163L938M6680I2452d6743j2363E1308d8607a1541C40971C563c4183
$$ -123579 -217742 -213804 -167124 92452 -46743 -59106 51308 -48607 -11541 340971 3563 -34183
10693F8639a53965C5382c38920G7180a11330i886A33918g2627j72034E2437N22994
$$ 68639 -153965 35382 -338920 77180 -111330 -9886 133918 -72627 -244661 52437 575431
10682E75431j83570b12674h2423R059F4422a54816E9301a53738C93711a28543
$$ 575431 391861 -212674 -82423 -73364 64422 -154816 59301 -153738 393711 -128543
10671A19406b67076Q6071e7004n4121b9230A71949c35641c1746j7490A2493b85110
$$ 119406 -267076 -181005 -57004 -111125 -29230 171949 -335641 -31746 -49236 12493 -285110
10659e732A79082d7485D4295e0779k14262N4828d0599l53117A64165A9491K47261
$$ -5732 179082 -47485 44295 -50779 -265041 -210213 -40599 -393716 164165 19491 266752
10648B66752d03889c053j48388m086N7439r0128B37284a50524E6874P6946b49012
$$ 266752 -403889 -3053 -151441 -155527 -98088 -188216 237284 -150524 56874 133820 -249012
10636g5522I9206d8445j43192B44242p8444J59020a38449O3397K5193k09776D73201
$$ -75522 99206 -48445 -191637 244242 165798 324818 -138449 -75052 -49859 -259635 473201
10624a07063B46470f4005j41278M3447B28726B770b45217J00667B33117j11958
$$ -107063 246470 -64005 -205283 -161836 228726 2770 -245217 -144550 233117 121159
10614A21159J0358J72010n7762f892B42002b87804J20949P1528j06930q8299c4185
$$ 121159 131517 303527 245765 -6892 242002 -287804 -166855 -95327 -202257 -290556 -34185
10602E893h8834A61694j2738f5097I9879b44552a11695C87147b28073D2675i0745
$$ 5893 -88834 161694 148956 -65097 99879 -244552 -111695 387147 -228073 42675 -90745
10590b6864j71768q796d815j04989D698a28951l7322N1317J6110o0594B81617
$$ -26864 -198632 -207428 -4815 -109804 4698 -128951 -166273 -114956 -98846 -159440 281617
10578f610j48903C42486a85258a4219k44482c6696k60555a28117j91994J13696
$$ -6610 -155513 342486 -185258 -14219 -258701 -36696 -297251 -128117 -320111 -206415
10568b06415n5922i4552m4158C82508a00234H1126a54996A01677c2495j77264
$$ -206415 -262337 -94552 -138710 382508 -100234 81126 -154996 101677 -32495 -209759
10558b09759A70406d28986A10311K09540b4626k7194j5466A01318d8458A35556
$$ -209759 170406 -428986 110311 319851 -24626 -51820 -67286 101318 -48458 135556
10547a75573B78723q3378c28485I0269J28217b34158O0531r6126a33510M5945
$$ -175573 278723 195345 -328485 90269 218486 -234158 -173627 -269753 -133510 -87565
10537h7565F4136b10675B92640l8192j13074b46433A83443a51040b2604j4506
$$ -87565 64136 -210675 292640 254448 141374 -246433 183443 -151040 -22604 -37110
10527c7110q9553A71467a93393K6766F1063K0457g2792p3655j7587n4254C55978
$$ -37110 -126663 171467 -193393 -166627 61063 81520 -72792 -146447 -164034 -218288 355978
10515F5095j2785g1226j44892e8595m0500l3458d7359A3618a40209A64661G7082
$$ 65095 52310 -71226 -216118 -58595 -99095 -132553 -47359 13618 -140209 164661 77082
10503b70062J22099B29963K0789h4357l03077a13746E3667b32232A54142J19788
$$ -270062 -147963 229963 250752 -84357 -387434 -113746 53667 -232232 154142 273930
10493B73930D0666A9807a41126f3995c964A32911J40309e8302C4981J69731G3877
$$ 273930 40666 19807 -141126 -63995 -3964 132911 273220 -58302 34981 204712 73877
10481F04411B78273j22033n832J35593E3510J90719j01745c6503O323k55966P5023
$$ 604411 278273 156240 150408 286001 53510 244229 142484 -36503 -30180 -286146 -211123
10470b11123j12459J12478h6681b8134k30063f6856K2559B83632a34485j68424
$$ -211123 -323582 -211104 -86681 -28134 -258197 -66856 -44297 283632 -134485 -302909
10460c02909P7812C8666b72429a13298m9520N4614F0113B0351L02292i4336A2250
$$ -302909 -225097 38666 -272429 -113298 -162818 -108204 60113 20351 322643 -94336 12250
10448i308j9788A44221b03806E335a49568D7369b18189J00738A06700a75615c8028
$$ -9308 -29096 144221 -203806 5335 -149568 47369 -218189 -117451 106700 -175615 -38028
10436b52629c8100k57499l2616a121j12478k0988A21050N6835E9545J29785A2205
$$ -252629 -38100 -295599 -328215 -1121 -113599 -134587 121050 177885 59545 189330 12205
10424a49483d2109A19462h19F2183J07603n5457a94312p6662h9310b2239B10312
$$ -149483 -42109 119462 -819 62183 169786 114329 -194312 -270974 -89310 -22239 210312
10412g0834j59027j16151I7394a97778D2477K6136f1963j82139A61067f2143o5310
$$ -70834 -229861 -346012 97394 -197778 42477 68613 -61963 -244102 161067 -62143 -127453
10401a27453A4968a89438g6039m2257l241N2208L4593A02390A9571K23846C8765
$$ -127453 14968 -189438 -76039 -118296 -121537 -69329 -34736 102390 19571 243417 38765
10389a00746H3922k7682Q4023B6519N5706M2673K4908a04767H486K25799a4664
$$ -100746 83922 56240 140263 26519 82225 124898 149806 -104767 8486 234285 -14664
10377F23585j39262A88553K41492j33020p0745J86263j40059J02934i876A49831
$$ 623585 484323 188553 430045 297025 226280 412543 272484 375418 -9876 149831
10366B82991L5417q5451J15298H6307Q4695N05585l16114A40254m5385a7140B07544
$$ 282991 318408 232957 348255 86307 171002 676587 360473 140254 94869 -17140 207544
10354C62183l8415L611J8878A14054L33356J44709j68281N408j31567K48718j7926
$$ 362183 323768 327379 346257 114054 447410 592119 423838 429246 297679 546397 528471
10343E28471k2332J75630A53449E8731N8007K71988A80026q0687K25753c5097
$$ 528471 506139 681769 153449 58731 116738 388726 180026 99339 325092 -35097
10332G817J97544N2635q4911M5530b5013j16225A14774J76624b5354B89833j32832
$$ 7817 205361 257996 173085 218615 -25013 -141238 114774 291398 -25354 289833 157001
10321A57001R8626a03440B8203M39957A85519N1330N8754A30475R6346r7410m0326
$$ 157001 255627 -103440 28203 468160 185519 236849 295603 130475 226821 129411 89085
10310H9085j8905J68896d58863A21355e9257b303j80428r7285B07016f9747B39416
$$ 89085 70180 239076 -458863 121355 -59257 -2303 -182731 -280016 207016 -69747 239416
10298B2431b91736a35855H8524b25854A57345A7073J88867F4506a43366d9672
$$ 22431 -291736 -135855 88524 -225854 157345 17073 205940 64506 -143366 -49672
10287I4350J48479a94666d9595C487K68043b42723A99395F2613g697D6941J17751
$$ 94350 242829 -194666 -49595 3487 271530 -242723 199395 62613 -7697 46941 164692
10276A64692a54979A96370b99584M4890B53337d2215G3016K18303D0295A4834
$$ 164692 -154979 196370 -299584 -254694 253337 -42215 73016 291319 40295 14834
10265b64154A11524M6655L7882o8510K33764J51730B23717L09913k19528J2126
$$ -264154 111524 158179 196061 127551 361315 513045 223717 533630 314102 326228
10255C26228B9453b94072C72880a22572N8244b2275k93875B01176i4875M3247
$$ 326228 29453 -294072 372880 -122572 -64328 -22275 -316150 201176 -94875 -51628
10245e1628A60343g0974A96035H5333a35813j83032J22727A35810A1558Q8772
$$ -51628 160343 -70974 196035 85333 -135813 -318845 -196118 135810 11558 100330
10235A00330f6827H7495a73973j03738f7737A21180c5381A15537B2807a044l4681
$$ 100330 -66827 87495 -173973 -277711 -67737 121180 -35381 115537 22807 -1044 -35725
10224c5725l3712C08916b05713j86970C0022c85073I6135a49613m9212R6544F4356
$$ -35725 -69437 308916 -205713 -392683 30022 -385073 96135 -149613 -198825 -102281 64356
10212a72523A45986h5854l0801j08328O1999j5720A00351c71178J60318b8670
$$ -172523 145986 -85854 -116655 -224983 -162984 -178704 100351 -371178 -210860 -28670
10201G2306a02529A11200A0273i0558B1113a34618E9354h787p8860B06461e7417
$$ 72306 -102529 111200 10273 -90558 21113 -134618 59354 -8787 -87647 206461 -57417
10189a22841D53290c85087I9587b04323L6557Q3016m741b5757B06014B1067M7043
$$ -122841 453290 -385087 99587 -204323 -167766 -84750 -89491 -25757 206014 21067 68110
10178F8110a06992d9074o2301p5386K2719I5722a75533L6240j95924a30471k00438
$$ 68110 -106992 -49074 -111375 -186761 -164042 95722 -175533 -139293 -335217 -130471 -330909
10167c30909d0024p4743k07532F9919i8694j70404g8391p0342A38239b70929A90138
$$ -330909 -40024 -114767 -322299 69919 -98694 -269098 -78391 -148733 138239 -270929 190138
10155a40014j41452L6496j05638g3400B7849b32811A64053D0710b26796a7317
$$ -140014 -281466 -244970 -350608 -73400 27849 -232811 164053 40710 -226796 -17317
10144b30087G638b03536k58396a30842l2798l5821k19678J96334A8834a12558
$$ -230087 7638 -203536 -461932 -130842 -163640 -199461 -419139 -222805 18834 -112558
10133b54285A68396b54453h0894j51808D8225a73478F061b75380J17521d3483
$$ -254285 168396 -254453 -80894 -232702 48225 -173478 6061 -275380 -157859 -43483
10122D889c0009k10555N8472J2998A85853a21941G0720f2092A35160J5948c2756
$$ 4889 -30009 -240564 -182092 -169094 185853 -121941 70720 -62092 135160 151108 -32756
10110C38409d2111p7648k338l05479D9550a49409A84909b94464c22n1741C0841
$$ 338409 -42111 -119759 -122097 -427576 49550 -149409 184909 -294464 -322 -52063 30841
10098e8998A4526a37011A70118M2067m3568h5893J1930L2947a6429n7024n3954
$$ -58998 14526 -137011 170118 212185 168617 -85893 -73963 -41016 -16429 -73453 -127407
10087a27407j91828O7060O9792A12163d9462H9073L38603E4787k0703K4883Q7460
$$ -127407 -319235 -252175 -182383 112163 -49462 89073 427676 54787 34084 58967 146427
10076A46427L09192b79136k0045B11613c1073m1839k15123h9150J3397b7853j5658
$$ 146427 455619 -279136 -299181 211613 -31073 -72912 -288035 -89150 -75753 -27853 -43511
10065d3511r0499p5467j7986n0694A57188j2435b22596a0964o4970B56952c8421
$$ -43511 -134010 -209477 -227463 -278157 157188 144753 -222596 -10964 -75934 256952 -38421
10053a78058l6719j15399k6372a3965o5098G6827c7525q1846H6083a37674e3342
$$ -178058 -214777 -330176 -356548 -13965 -79063 76827 -37525 -119371 86083 -137674 -53342
10041a89549Q0529m794A24724b25854R0246A84147l9567i011j90947A06053b36377
$$ -189549 -109020 -113814 124724 -225854 -135608 184147 144580 -9011 -199958 106053 -236377
10029c20727A09132a46600A4477K2859a35709i601B00940a76472b6922k58153
$$ -320727 109132 -146600 14477 37336 -135709 -9601 200940 -176472 -26922 -285075
10019b85075C52054c40387H5606f0969j09054p4564H187a4386m41440A95153e4503
$$ -285075 352054 -340387 85606 -60969 -170023 -244587 8187 -14386 -455826 195153 -54503
10007d6318k20174B16656a96969A7386p443b06287P0382A77392a8346k60214O7926
$$ -46318 -266492 216656 -196969 17386 9943 -206287 -135905 177392 -18346 -278560 -210634
9996b10634G2968b28151o5186a06538J3690B6746a6080I438J10940K0631a09535
$$ -210634 72968 -228151 -293337 -106538 -92848 26746 -16080 9438 120378 141009 -109535
9984I134R7617b19356f7929j11758g3977a3416F9600a12573L6060j63804A12150
$$ 9134 106751 -219356 -67929 -179687 -73977 -13416 69600 -112573 -76513 -240317 112150
9972d0310r4516K0376I9420l355a26251q5931p937L9681B46163J34867a7472r5020
$$ -40310 -134826 -114450 99420 96065 -126251 -212182 -220119 -180438 246163 381030 -17472 -112492
9960a12492I795J8083J79616I8560K9616H304a84456g2666B60881J05775a04313
$$ -112492 9795 27878 207494 98560 128176 8304 -184456 -72666 260881 366656 -104313
9948a13697q3108l08345H8442b47585F680e9611j74478A64793B9638h0252C0761
$$ -113697 -196805 -505150 88442 -247585 6680 -59611 -234089 164793 29638 -80252 30761
9936H3761a70054l6522I1939a2184j68891K4083d4986k88150c2010n0180G052
$$ 83761 -170054 -206576 91939 -12184 -181075 -156992 -44986 -333136 -32010 -82190 7052
9924A19894b41414a2345r5210A13801K59358q3237o0661a87176j13447B13113
$$ 119894 -241414 -12345 -107555 113801 373159 289922 229261 -187176 -300623 213113
9913g9077j45267L8228j03310A19156E5619b15270e90n31569K13704A76756G9398
$$ -79077 -224344 -186116 -289426 119156 55619 -215270 -590 -532159 -318455 176756 79398
9901e85784B05936q9031c1750B06140a15025o42b3865J1478k07887m8641b5170
$$ -585784 205936 116905 -31750 206140 -115025 -115667 -23865 -12387 -220274 -268915 -25170
9889b63107R436J05352J0538j04616e272j72385O8518p5026A13641a17042A01324
$$ -263107 -253671 -148319 -137781 -242397 -5272 -177657 -109139 -184165 113641 -117042 101324
9877A79559a6779H9629b6676B03024B9684a26119D1163a0513A43625i7759J4203
$$ 179559 -16779 89629 -26676 203024 29684 -126119 41163 -10513 143625 -97759 -83556
9866h3556A34881a21172e4582j21560c4481k7999a0042m8978n7519m1164g4813
$$ -83556 134881 -121172 -54582 -176142 -34481 -62480 -10042 -59020 -116539 -157703 -74813
9854f40738b12632P2552j3200N764H8976c09836D6579K33571i2145p8355m08088
$$ -640738 -212632 -140080 -153280 -147516 88976 -309836 46579 280150 -92145 -170500 -578588
9843e78588K45321a30388k25236H0347g1552n8695A34323i5950n580j9381I4744
$$ -578588 -333267 -130388 -355624 80347 -71552 -130247 134323 -95950 -101530 -120911 94744
9831I9256B6110c44460E4421d84215b33005K7543K7339j08378a38978K0656A88211
$$ 99256 26110 -344460 54421 -484215 -233005 -205462 -178123 -286501 -138978 -118322 188211
9819C7758a24980r9597h6214a1594l08467a51501o9174j2977P2932k79342B1618
$$ 37758 -124980 -224577 -86214 -11594 -320061 -151501 -220675 -233652 -160720 -440062 21618
9807D6918A2945c62441e4137B15991b34780A7250g0278l1707q6418K8184m5628
$$ 46918 12945 -362441 -54137 215991 -234780 17250 -70278 -101985 -188403 -160219 -205847
9796b05847j7357c6774m29583O6671h3329k51473H2757d19836J30477C69181c68681
$$ -205847 -223204 -36774 -466357 -399686 -83329 -334802 82757 -419836 -289359 369181 -368681
9784a22644I4008b9647p7002C7691J78312j071d9684a1539k15102k3490F458J07401
$$ -122644 94008 -29647 -106649 37691 216003 214932 -49684 -11539 -226641 -250131 6458 113859
9772A13859A4065P1353c80671E3702A4467J49148d36844L7975I4370a84553A16225
$$ 113859 14065 85418 -380671 53702 14467 163615 -436844 -398869 94370 -184553 116225
9760i0766I3091a98469k33503J62748c9267k79329I8957a25950D0964J81868c0526
$$ -90766 93091 -198469 -431972 -269224 -39267 -318596 98957 -125950 40964 222832 -30526
9748D6796j6916I648Q3337a15979C74067b29051M1529B50243a8908j42602l14318
$$ 46796 29880 9648 92985 -115979 374067 -229051 -187522 250243 -18908 -161510 -475828
9737d75828A12251O900i6967k06896b0911j38838b3511A75647a36167J2147E0924
$$ -475828 112251 119151 -96967 -303863 -20911 -159749 -23511 175647 -136167 -124020 50924
9725a55903f3991A71922a66540A157L16375b56396J18014a7313C5052Q6570e6588
$$ -155903 -63991 171922 -166540 1157 317532 -256396 -138382 -17313 35052 121622 -56588
9713a1501j10674j64453A6865N2518O163O3820b71766a10673a9106A70534d6465
$$ -11501 -122175 -286628 16865 69383 75546 139366 -271766 -110673 -19106 170534 -46465
9701b29310B05461h0422k04981f2449K8776j75744A42236b20574k37366a11686
$$ -229310 205461 -80422 -285403 -62449 -33673 -209417 142236 -220574 -457940 -111686
9690A72217f8118A01467e1925j71904o845C26600a02929I4079K1043b29584K7337
$$ 172217 -68118 101467 -51925 -223829 -230674 326600 -102929 94079 115122 -229584 -202247
9679b02247e6769A0701K8589i2186j22594B80537d02699C62627b92859I5066h7761
$$ -202247 -56769 10701 39290 -92186 -214780 280537 -402699 362627 -292859 95066 -87761
9667G278J36172c21287A15357i921k87100c3162j77513R3631j11642J04054P803
$$ 7278 143450 -321287 115357 -9921 -297021 -33162 -210675 -117044 -228686 -124632 -116829
9656a16829B39740f8751j21682f5407D6534H102K2964R1714c11940J18517N4786
$$ -116829 239740 -68751 -190433 -65407 46534 8102 31066 122780 -311940 -193423 -138637
9645a38637m1724A48312c92345B391J63165f3971j31679g1033A7895b35150D838
$$ -138637 -180361 148312 -392345 2391 165556 -63971 -195650 -71033 17895 -235150 4838
9633g9713C1970K02503D3944b8867p9287e3903j0839k45460h4733C06072a66994
$$ -79713 31970 234473 43944 -28867 -108154 -53903 -64742 -310202 -84733 306072 -166994
9621A05012b59886a6328q028B2040a56612B50287c7596A45099b01179f6014j03919
$$ 105012 -259886 -16328 -24356 22040 -156612 250287 -37596 145099 -201179 -66014 -169933
9610a69933n3226H0705c005F8029k8224o084N0267a35316B26018d10520D069n66
$$ -169933 -223159 80705 -3005 68029 39805 33721 83988 -135316 226018 -410520 4069 3503
9598C503K11647I461a79948F9861a5850A02200j8268I790J6249b48670A02544
$$ 3503 215150 9461 -179948 69861 -15850 102200 83932 9790 26039 -248670 102544
9586b960j74524M4043A93568N3310b0693B39033A13307k1220J63438D5710c14262
$$ -2960 -177484 -133441 193568 246878 -20693 239033 113307 92087 255525 45710 -314262
9574A25283D3645E91a80568Q7804D46611b03240m3338L8812f250j98619g2933
$$ 125283 43645 591 -180568 -92764 446611 -203240 -246578 -207766 -6250 -204869 -72933
9562B38110c93041B9587a05942j06182C7732N1674K7587J8458J96100c1131q6183
$$ 238110 -393041 29587 -105942 -212124 37732 89406 116993 135451 331551 -31131 -117314
9551a17314q4746g2848K8159D28803b5360j31047A02823b37197i138B2421b19222
$$ -117314 -202060 -72848 -44689 428803 -25360 -156407 102823 -237197 -9138 22421 -219222
9539b75711R5202A52413G4677b64044A26341f9443r3216A43442K4222a37912m0037
$$ -275711 -180509 152413 74677 -264044 126341 -69443 -162659 143442 167664 -137912 -177949
9528a77949K9010r1628j42639B21653b3107n6565B43516A00337a67105K3937d6203
$$ -177949 -148939 -240567 -383206 221653 -23107 -79672 243516 100337 -167105 -143168 -46203
9516a53007B44761q9735n6379l8210A4113K24315a18736e9073A97331o8256N6184
$$ -153007 244761 155026 98647 60437 14113 238428 -118736 -59073 197331 129075 185259
9505A85259l306a31805A21314c3537l08945B37740h7017J416A5584b28186A97651
$$ 185259 181953 -131805 121314 -33537 -342482 237740 -87017 -85601 15584 -228186 197651
9493a88504j66924A51381E0681N2606C7302g2770k36025B0940b27081D6793b25539
$$ -188504 -355428 151381 50681 103287 37302 -72770 -308795 20940 -227081 46793 -225539
9481A69554F5380R7278b03100j35098I9873a54008k31194g1036j91653f6101f22
$$ 169554 65380 162658 -203100 -338198 99873 -154008 -385202 -71036 -262689 -66101 -622
9469B2851b14031h2547A70708c58422J76142c9162E9158f458G3431b61129G0077
$$ 22851 -214031 -82547 170708 -358422 -182280 -39162 59158 -6458 73431 -261129 70077
9457d8440B81099j2999F988c86519d5358q0347B32204i6446m981n0855K0581a9943
$$ -48440 281099 268100 6988 -386519 -45358 -125705 232204 -96446 -101427 -152282 -131701 -19943
9444a07988n6787d5972a771l16113a38442D7070A9621a78643k1566C00922a48599
$$ -107988 -164775 -45972 -1771 -317884 -138442 47070 19621 -178643 -200209 300922 -148599
9432A76006q0121m3950b42693d1859B17473f24276a40812H7207J14639D6829b9933
$$ 176006 95885 51935 -242693 -41859 217473 -624276 -140812 87207 201846 46829 -29933
9420H9875C3753b31949O6455C15230b37708B08540d04484L0381D9656c07997k65013
$$ 89875 33753 -231949 -165494 315230 -237708 208540 -404484 -374103 49656 -307997 -573010
9409e73010a24628A88259c76082i8985q7895L2721m9023R6305j20824C07242r1605
$$ -573010 -124628 188259 -376082 -98985 -186880 -154159 -203182 -106877 -227701 307242 215637
9398B15637a09663N1314a2901j91718f9504k7521j02368d4220A95611b2247l95652
$$ 215637 -109663 -58349 -12901 -204619 -69504 -97025 -199393 -44220 195611 -22247 -417899
9387d17899J68500h1349k1204b0167j2903B5081J98066A7751N7704M2708k295
$$ -417899 -249399 -81349 -102553 -20167 -33070 25081 223147 17751 75455 118163 115868
9376A15868a3290A01885b32475A84175C8424a8872m4149B715g0704j33683B3392
$$ 115868 -13290 101885 -232475 184175 38424 -18872 -63021 2715 -70704 -204387 23392
9364d3738n9573l252I102b24680i6792K6984l92074d2968I4283N6182G4647J02593
$$ -43738 -103311 -106563 9102 -224680 -96792 -69808 -461882 -42968 94283 150465 74647 177240
9352A77240b80776c6065A80489m9760m7918c31936c8553A82311f4934l5034c4126
$$ 177240 -280776 -36065 180489 130729 82811 -331936 -38553 182311 -64934 -99968 -34126
9340a01111D9345c02677B60536i2709B1904K27052a53242l36011A20313m3763
$$ -101111 49345 -302677 260536 -92709 21904 248956 -153242 -489253 120313 76550
9330G6550a48363d7590A19222J04181B6336b55156A841c80257A81702a21012d3735
$$ 76550 -148363 -47590 119222 223403 26336 -255156 1841 -380257 181702 -121012 -43735
9318h756A38724n8786a95703q6619j55836J74732B60883a88640j04307a05039
$$ -8756 138724 79938 -195703 -282322 -438158 -263426 260883 -188640 -292947 -105039
9307h8357G4006a76554m1797k1411e3087B6462K56527P3316L5596g5287A13648
$$ -88357 74006 -176554 -218351 -239762 -53087 26462 282989 356305 391901 -75287 113648
9295a25524B02033b04711Q6023K6021d6037j44076C0940K131a2407k08740k7451
$$ -125524 202033 -204711 -118688 -92667 -46037 -190113 30940 33071 -12407 -221147 -248598
9284b48598J039Q7432B5472c70700A85199b78407g6352A89011f0389j75906a7189
$$ -248598 -247559 -160127 25472 -370700 185199 -278407 -76352 189011 -60389 -236295 -17189
9272i4688j97812H281K10728a56148A90302C5827M4766a90123F174b94128i2784
$$ -94688 -292500 8281 219009 -156148 190302 35827 80593 -190123 6174 -294128 -92784
9260H633e2912A0899a72981G3830n233k8425a41807E7045M5619b1114m6454J1020
$$ 8633 -52912 10899 -172981 73830 68597 40172 -141807 57045 102664 -21114 -67568 -56548
9248e6548h91o3150G2751B9675J6909d5862k88823h9516L1219j4134k18755p5373
$$ -56548 -891 -64041 72751 29675 46584 -45862 -334685 -89516 -58297 -72431 -291186 -366559
9236c66559d3331F3829J59459B0283a95750B03949c02521a50813q1132C3449K30201
$$ -366559 -43331 63829 223288 20283 -195750 203949 -302521 -150813 -231945 33449 263650
9225B63650c32118J28968F0285K30832j35077K44723a84406B72051H3196I223
$$ 263650 -332118 -203150 60285 291117 156040 400763 -184406 272051 83196 9223
9214A20875K55228b58513h2975m143H5539a44333F5716B3916N2103e6587A12457
$$ 120875 376103 -258513 -82975 -87118 85539 -144333 65716 23916 76019 -56587 112457
9202a50276A185Q4701a48559G1866a7116j21886C47835a78450E0050b35019b4470
$$ -150276 1185 85886 -148559 71866 -17116 -139002 347835 -178450 50050 -235019 -24470
9190A24545J76480j44653J47788j21573a78617M363f6353A83991c08973J17563
$$ 124545 301025 156372 304160 182587 -178617 -174254 -66353 183991 -308973 -191410
9180a91410N1483B8708m849i1617K3585k54938R7148c6196J0861B71094b27618
$$ -191410 -139927 28708 23859 -91617 -68032 -322970 -225822 -36196 -25335 271094 -227618
9168c4489D6739c7292j5723k9799k69273R3324A06026c32142C8820M5066j5342
$$ -34489 46739 -37292 -53015 -82814 -352087 -258763 106026 -332142 38820 83886 68544
9157F8544O6677K46016N6993h3645L7841n0217A6289c39254K0822b7982E5266
$$ 68544 135221 381237 438230 -83645 -45804 -96021 16289 -339254 -318432 -27982 55266
9145d87027f389j79972k2302k1506f8364j1403k66932B37109R7207a43766d7608
$$ -487027 -6389 -186361 -208663 -230169 -68364 -79767 -346699 237109 334316 -143766 -47608
9133A3982a92164f9476c950j03840k22780h3384B36578a44804B51128G0270O2782
$$ 13982 -192164 -69476 -3950 -107790 -330570 -83384 236578 -144804 251128 70270 133052
9122A33052a32481M0299C7482d4632A09274c2042P19l10122a17223A24081b04588
$$ 133052 -132481 -92182 37482 -44632 109274 -32042 -31323 -341445 -117223 124081 -204588
9110b60432C27857C1248K03g7207k895k40528B69918M2591F350e3647k29169j5028
$$ -260432 327857 31248 31451 -77207 -80102 -320630 269918 312509 6350 -53647 -282816 -297844
9098b97844c2216A15721K10194a33374A54526a31897q3239b9903l31488M9836
$$ -297844 -32216 115721 325915 -133374 154526 -131897 -215136 -29903 -361391 -311555
9088c11555D02667b01010B38661a52316I063a49020L2124B8433h4194j80055m2
$$ -311555 402667 -201010 238661 -152316 9063 -149020 -116896 28433 -84194 -264249 -264291
9077b64291e0875B79263o8499d5740D07743c59343m1463A14766D9811b11544A38072
$$ -264291 -50875 279263 210764 -45740 407743 -359343 -400806 114766 49811 -211544 138072
9065A23125a08185B05338H5870d9645G0488a34719k13770b6872F2389b03658D0622
$$ 123125 -108185 205338 85870 -49645 70488 -134719 -348489 -26872 62389 -203658 40622
9053b06648f1139k64599e4447j50832Q6204A31970m7300a14211n6070P6814j78391
$$ -206648 -61139 -325738 -54447 -205279 -119075 131970 84670 -114211 -170281 -93467 -271858
9042b71858A43203a13281A54890o5934b74478F3713a95181A09039M044d7807A3490
$$ -271858 143203 -113281 154890 88956 -274478 63713 -195181 109039 113083 -47807 13490
9030G904a6087j86114B2005a49437a2738A85864B9913b3484E3971a55687G5035
$$ 7904 -16087 -202201 22005 -149437 -12738 185864 29913 -23484 53971 -155687 75035
9018a81807g2834I2842l5988k4268a41309B47437G5963c26939g3465j04583J6339
$$ -181807 -72834 92842 56854 32586 -141309 247437 75963 -326939 -73465 -178048 -161709
9007a61709d611j07295j7775E4576i8898k60961H571a21912d5497j61916A421
$$ -161709 -4611 -111906 -129681 54576 -98898 -359859 8571 -121912 -45497 -207413 1421
8995H5825P7244L42345i0504B72494D9083c254k11748C26904a55078O8353m68456
$$ 85825 163069 505414 -90504 272494 49083 -3254 -215002 326904 -155078 -86725 -555181
8984e55181a17364A75844G9157e3397Q499Q383k4353D01609a27911j75344M9725
$$ -555181 -117364 175844 79157 -53397 -44898 -36515 -60868 401609 -127911 -303255 -253530
8973b53530r2970A11018K18556f7925O689m3296E1549b4094l26341i2646j55617
$$ -253530 -346500 111018 329574 -67925 -61236 -104532 51549 -24094 -350435 -92646 -248263
8962b48263j74604B29608a12524k3506m661B5414d08531e7160r7143o6581A03467
$$ -248263 -422867 229608 -112524 -136030 -140691 25414 -408531 -57160 -154303 -220884 103467
8950c88315I1409b46087j6538A36925j4774J12295b14876G1077b1116j09676B6812
$$ -388315 91409 -246087 -262625 136925 122151 234446 -214876 71077 -21116 -130792 26812
8938a71974G2047L09937j13232A13185L3635K95309c8202o458l5840A07900J36299
$$ -171974 72047 381984 268752 113185 146820 442129 -38202 -44660 -80500 107900 244199
8927B44199J36192m3627R33439K094823M916671O379521F633268A493551C97198
$$ 244199 380391 336764 1270203 3365026 8281697 14661218 6633268 1493551 397198
8917C64881q1646d9231H0527j3726p449J6555C6890L06047L2880M698A18231a16610
$$ 364881 283235 -49231 80527 66801 59352 75907 36890 342937 375817 380515 118231 -116610
8904I0477J6072e2378B3216c15677e7774B18234b34456B96470a0473E7022a58528
$$ 90477 106549 -52378 23216 -315677 -57774 218234 -234456 296470 -10473 57022 -158528
8892a09744j07740L4144E0263c79360J43749n3886i4363k61823B8461a25209H5074
$$ -109744 -217484 -183340 50263 -379360 -235611 -289497 -94363 -356186 28461 -125209 85074
8880b2934R656k29947J0040B96212D3780a25560n3415A3244a32587c4189l455
$$ -22934 -13278 -243225 -233185 296212 43780 -125560 -178975 13244 -132587 -34189 -37644
8869c7644A1558b82025A15827C8010J0370b7065j33748k7081l1054K4755C7943
$$ -37644 11558 -282025 115827 38010 48380 -27065 -160813 -187894 -218948 -194193 37943
$$ [...]
##END NTUPLES=NMR SPECTRUM
##END=
