##TITLE=AC1574_ROEFFECT0022_8270984_cmcJopuIm6
##JCAMPDX= 6.0         $$ Bruker NMR JCAMP-DX V2.0
##DATA TYPE= NMR SPECTRUM
##DATA CLASS= NTUPLES
##ORIGIN= BRUKER
##OWNER= Administrator
$$ 1.72 TOPSPIN		Version 2.1
$$ 2013-10-18 20:07:17.636 -0700  Administrator@X
$$ Compression mode = diff/dup
##.OBSERVE FREQUENCY= 400.02188249412
##.OBSERVE NUCLEUS= ^1H
##.ACQUISITION MODE= SIMULTANEOUS (DQD)
##.ACQUISITION SCHEME= undefined
##.AVERAGES= 64
##.DIGITISER RES= 22
##SPECTROMETER/DATA SYSTEM= spect
##.PULSE SEQUENCE= noesygpps1d.comp
##.SOLVENT NAME= COFFEE_meoh
##.SHIFT REFERENCE= INTERNAL, COFFEE_meoh, 1, 14.96051
##AUDIT TRAIL= $$ (NUMBER, WHEN, WHO, WHERE, PROCESS, VERSION, WHAT)
$$ ##TITLE= Audit trail, TOPSPIN		Version 2.1
$$ ##JCAMPDX= 5.01
$$ ##ORIGIN= Bruker BioSpin GmbH
$$ ##OWNER= Administrator
$$ $$ E:\/data/COFFEE/nmr/AC1574_ROEFFECT0022_8270984_cmcJopuIm6/12/pdata/1/auditp.txt
$$ ##AUDIT TRAIL=  $$ (NUMBER, WHEN, WHO, WHERE, PROCESS, VERSION, WHAT)
(   1,<2013-10-18 20:07:12.402 -0700>,<Administrator>,<X>,<go>,<TOPSPIN 2.1>,
      <created by zg
	started at 2013-10-18 19:55:42.838 -0700,
	POWCHK enabled, PULCHK disabled,
       configuration hash MD5:
       C8 4E 4E 5D D3 5C D8 9E 9F 52 82 E0 59 8A DE 15
       data hash MD5: 64K
       4E 93 D7 FF 3A 69 D8 5E F6 19 00 2E AD DA E5 DB>)
(   2,<2013-10-18 20:07:15.527 -0700>,<Administrator>,<X>,<proc1d>,<TOPSPIN 2.1>,
      <Start of raw data processing
       efp LB = 0.3 FT_mod = 6 PKNL = 1 PHC0 = 0 PHC1 = 0 SI = 128K 
       data hash MD5: 128K
       22 FC F6 0F 13 5D 83 AC FC 05 D1 45 F6 E0 1D 71>)
(   3,<2013-10-18 20:07:16.527 -0700>,<Administrator>,<X>,<proc1d>,<TOPSPIN 2.1>,
      <pk PHC0 = -82.85339 PHC1 = 0 
       data hash MD5: 128K
       A6 ED B0 4E 34 5E 7C 99 8C 07 BB 17 99 C4 74 8C>)
(   4,<2013-10-18 20:07:16.996 -0700>,<Administrator>,<X>,<proc1d>,<TOPSPIN 2.1>,
      <abs ABSG = 1 
       data hash MD5: 128K
       74 8B A4 11 C0 8B B3 A1 33 01 29 C6 0B 2C 0F 4B>)
(   5,<2013-10-18 20:07:17.089 -0700>,<Administrator>,<X>,<proc1d>,<TOPSPIN 2.1>,
      <abs ABSG = 2 
       data hash MD5: 128K
       5F F1 82 38 A6 FC 8B E2 7D B4 36 82 EC B9 57 90>)
(   6,<2013-10-18 20:07:17.183 -0700>,<Administrator>,<X>,<proc1d>,<TOPSPIN 2.1>,
      <abs ABSG = 3 
       data hash MD5: 128K
       7F AE 4B 0B 00 D4 F1 02 C8 F3 B0 FC 98 56 1B DB>)
(   7,<2013-10-18 20:07:17.293 -0700>,<Administrator>,<X>,<proc1d>,<TOPSPIN 2.1>,
      <abs ABSG = 4 
       data hash MD5: 128K
       92 A4 CB 5A FE E5 2D 45 1E 24 6A E2 80 4A 48 23>)
(   8,<2013-10-18 20:07:17.402 -0700>,<Administrator>,<X>,<proc1d>,<TOPSPIN 2.1>,
      <abs ABSG = 5 
       data hash MD5: 128K
       32 A6 5E 38 0C 38 B0 27 7E 2B E1 E6 D0 24 BE E9>)
$$ ##END=
$$ 
$$ $$ hash MD5
$$ $$ D0 B0 F3 97 1C 4F A2 2D 6D A8 31 19 21 B4 6A 14
##$RELAX= 
##$RELAX= 
##$RELAX= 
##$RELAX= 
##$RELAX= 
##$RELAX= 
##$RELAX= 
##$RELAX= 
$$ Bruker specific parameters
$$ --------------------------
##$DU= <E:\>
##$EXPNO= 12
$$ [...]
##$TP07= 0
##$TPNAME0= <>
##$TPNAME1= <>
##$TPNAME2= <>
##$TPNAME3= <>
##$TPNAME4= <>
##$TPNAME5= <>
##$TPNAME6= <>
##$TPNAME7= <>
##$TPOAL= (0..7)
0.5 0.5 0.5 0.5 0.5 0.5 0.5 0.5
##$TPOFFS= (0..7)
0 0 0 0 0 0 0 0
##$TUNHIN= 0
##$TUNHOUT= 0
##$TUNXOUT= 0
##$USERA1= <user>
##$USERA2= <user>
##$USERA3= <user>
##$USERA4= <user>
##$USERA5= <user>
##$V9= 5
##$VALIST= <valist>
##$VCLIST= <CCCCCCCCCCCCCCC>
##$VD= 0
##$VDLIST= <DDDDDDDDDDDDDDD>
##$VPLIST= <PPPPPPPPPPPPPPP>
##$VTLIST= <TTTTTTTTTTTTTTT>
##$WBST= 1024
##$WBSW= 4
##$XGAIN= (0..3)
0 0 0 0
##$XL= 0
##$YL= 0
##$YMAX_a= 6323974
##$YMIN_a= -12583164
##$ZGOPTNS= <>
##$ZL1= 120
##$ZL2= 120
##$ZL3= 120
##$ZL4= 120
##$ABSF1= 14.96051
##$ABSF2= -5.597672
##$ABSG= 5
##$ABSL= 3
##$ALPHA= 0
##$AQORDER= 0
##$ASSFAC= 0
##$ASSFACI= 0
##$ASSFACX= 0
##$ASSWID= 0
##$AUNMP= <proc_prof1d_extract.lims>
##$AXLEFT= 0
##$AXNAME= <>
##$AXNUC= <1H>
##$AXRIGHT= 0
##$AXTYPE= 0
##$AXUNIT= <>
##$AZFE= 0.1
##$AZFW= 0.1
##$BCFW= 0
##$BC_mod= 0
##$BYTORDP= 0
##$COROFFS= 0
##$CY= 15
##$DATMOD= 1
##$DC= 0
##$DFILT= <>
##$DTYPP= 0
##$F1P= 0
##$F2P= 0
##$FCOR= 0.5
##$FTSIZE= 131072
##$FT_mod= 6
##$GAMMA= 0
##$GB= 0
##$INTBC= 1
##$INTSCL= 1
##$ISEN= 128
##$LB= 0.3
##$LEV0= 0
##$LPBIN= 0
##$MAXI= 10000
##$MC2= 0
##$MEAN= 0
##$ME_mod= 0
##$MI= 0
##$NCOEF= 0
##$NC_proc= -2
##$NLEV= 6
##$NOISF1= 0
##$NOISF2= 0
##$NSP= 0
##$NTH_PI= 0
##$NZP= 0
##$OFFSET= 14.96051
##$PC= 1
##$PHC0= -82.85339
##$PHC1= 0
##$PH_mod= 1
##$PKNL= yes
##$PPARMOD= 0
##$PPDIAG= 0
##$PPIPTYP= 0
##$PPMPNUM= 2147483647
##$PPRESOL= 1
##$PSCAL= 4
##$PSIGN= 0
##$PYNMP= <proc.py>
##$REVERSE= no
##$SF= 400.020009834763
##$SI= 131072
##$SIGF1= 0
##$SIGF2= 0
##$SINO= 400
##$SIOLD= 131072
##$SPECTYP= <>
##$SREGLST= <1H.CDCl3>
##$SSB= 0
##$STSI= 131072
##$STSR= 0
##$SW_p= 8223.68421052631
##$SYMM= 0
##$S_DEV= 0
##$TDeff= 65536
##$TDoff= 0
##$TI= <>
##$TILT= no
##$TM1= 0
##$TM2= 0
##$TOPLEV= 0
##$USERP1= <user>
##$USERP2= <user>
##$USERP3= <user>
##$USERP4= <user>
##$USERP5= <user>
##$WDW= 1
##$XDIM= 131072
##$YMAX_p= 397606451
##$YMIN_p= -13898
##$CURPLOT= <Network HP LaserJet P1505>
##$CURPRIN= <$Network HP LaserJet P1505>
##$DFORMAT= <normdp>
##$LAYOUT= <+/1D_H.xwp>
##$LFORMAT= <normlp>
##$PFORMAT= <normpl>
##$SURQMSG= 1
$$ End of Bruker specific parameters
$$ ---------------------------------
##NTUPLES= NMR SPECTRUM
##VAR_NAME=  FREQUENCY,     SPECTRUM/REAL,   SPECTRUM/IMAG
##SYMBOL=    X,             R,               I
##VAR_TYPE=  INDEPENDENT,   DEPENDENT,       DEPENDENT
##VAR_FORM=  AFFN,          ASDF,            ASDF
##VAR_DIM=   131072,        131072,          131072
##UNITS=     HZ,            ARBITRARY UNITS, ARBITRARY UNITS
##FACTOR=    0.0627417313425164, 1,          1
##FIRST=     8223.62146879497, 2130,         -63856
##LAST=      0,             3990,            -63462
##MIN=       0,             -13898,          0
##MAX=       8223.62146879497, 397606451,    0
$$ Real data points
##PAGE= N=1
##DATA TABLE= (X++(R..R)), XYDATA
$$ [...]
65223 145769 147374 148643 149181 149479 150044 150378 149531 147568 145742 144944 144672 144036 143188 143020 143678 144350 144661
65206 144661 145362 147116 149280 150672 151156 151587 152277 152412 151327 149623 148464 148164 148016 147336 146201 145164
65190 145164 144685 144850 145371 145767 145709 145290 144893 144902 145656 147500 150547 154359 158114 161155 163260 164499 165050
65173 165050 165212 165262 165193 164718 163683 162345 161149 160274 159505 158562 157546 157041 157684 159510 161840 163931 165669
65156 165669 167475 169724 172497 175791 179504 183148 185977 187726 189071 191116 194529 199316 205288 212464
65142 212464 220977 230764 241461 252599 263932 275454 287051 298264 308653 318377 328021 337693
65130 337693 346621 353981 359879 365067 369788 373394 375249 375602 375229 374477 373033 370547 367045 362678 357391
65115 357391 351101 343955 336149 327623 318257 308384 298758 289858 281423 272836 263779 254394 244987 235841
65101 235841 227223 219335 212170 205552 199334 193557 188475 184476 181791 180116 178661 176780 174508 172341
65087 172341 170659 169572 169160 169463 170296 171377 172594 173812 174479 173938 172246 170283 168845 167922 167026 165873
65071 165873 164457 162871 161414 160634 160861 161783 162757 163411 163652 163310 162295 161080 160566 161261 162863 164800
65055 164800 166874 169168 171547 173544 174754 175170 175095 174854 174599 174271 173613 172269 170035 167154 164310 162165
65039 162165 160895 160244 159961 159978 160079 159724 158496 156745 155504 155574 156596 157118 155759 152494 148765 146197
65023 146197 145186 144873 144370 143662 143191 143011 142724 142145 141686 141992 143378 145632 148204 150561 152466 153995
65007 153995 155317 156553 157881 159610 162019 165131 168729 172521 176183 179386 181976 184154 186338 188774
64993 188774 191278 193402 194870 195803 196475 196877 196768 196279 196144 196974 198450 199691 200398 201172 202667 204912
64977 204912 207565 210276 212548 213815 214032 213736 213148 211678 208785 204857 200655 196313 191619 187006 183422
64962 183422 181210 179840 178712 177605 176310 174529 172312 170101 168201 166702 165856 165848 166130 165760 164632 163653
64946 163653 163404 163338 162733 161740 160939 160461 160209 160450 161410 162575 163092 162761 162080 161443 160874 160416 160198 160124 159965
64927 159965 159720 159521 159227 158592 157779 157216 156969 156655 155976 154911 153518 152061 151333 152124 154130 155991 156788
64910 156788 157095 158173 160505 163550 166647 169598 172403 174894 176858 178418 180216 183192 187973 194275
64896 194275 201058 207479 213638 220236 227620 235424 243065 250258 256947 263037 268403 273066 277214 281156
64882 281156 285361 290296 295855 300989 304305 305230 304404 302739 300413 297024 292498 287337 282034 276666 271146
64867 271146 265507 259844 254349 249499 245829 243346 241521 240002 238846 237855 236318 233894 231197 228779
64853 228779 225988 221742 216215 210789 206248 201990 197278 192387 188019 184339 181218 178855 177427 176446
64839 176446 175173 173567 172225 171483 171135 170986 171176 171861 172976 174369 175852 177070 177732 177955 178092 178179 177965
64822 177965 177547 177478 178085 179050 179950 180871 182172 183961 186163 188921 192458 196617 201022 205742 211397 218415
64806 218415 226438 234760 243111 251734 260751 269730 277963 284906 290246 293721 295136 294536 292198 288421
64792 288421 283400 277301 270345 262829 255163 247858 241261 235269 229613 224605 221239 220126 220425 220405 219205
64777 219205 217608 216866 217253 218220 219582 221788 225031 228809 232671 236900 242031 248053 254550 261424 268972
64762 268972 277298 286085 294962 303726 312160 320041 327411 334459 340988 346396 350353 353161 355260 356787
64748 356787 357927 359221 361022 362946 364438 365611 366851 367664 366701 363159 357565 350943 343713 335770 327180
64733 327180 318268 309271 300337 291810 284188 277897 273222 270185 268207 266147 263195 259704 256772 255037
64719 255037 254261 254065 254562 256008 258169 260406 262320 264121 266386 269575 273773 278707 283894 288720 292479
64704 292479 294561 294765 293394 290930 287643 283591 278843 273523 267681 261347 254741 248265 242207 236560
64690 236560 231217 226279 222093 218930 216592 214451 212050 209700 208234 208055 208696 209524 210566 212244 214541
64675 214541 217041 219828 223763 229548 236878 244809 252710 260564 268587 276913 285527 294118 302012 308515
64661 308515 313411 316891 318985 319246 317186 312924 307250 300987 294380 287238 279690 272582 266862 262680
64647 262680 259395 256501 254257 253253 253680 255232 257513 260293 263610 267869 273685 281260 290059 299433
64633 299433 309386 320338 332259 344611 357241 370679 385148 399678 412673 423120 430770 435317
64621 435317 436007 432325 424705 414274 402017 388351 373417 357591 341660 326621 313216 301580
64609 301580 291273 281806 273166 265763 259772 254672 249702 244791 240725 238194 236877 235795 234489 233408
64595 233408 233139 233671 234659 236055 238101 240917 244399 248420 252762 256982 260743 264246 267967 272015 276142
64580 276142 280460 285603 291992 299357 307248 315564 324190 332509 339871 346319 352281 357641 361703 364146
64566 364146 365385 365775 364859 361713 355736 346905 335640 322768 309379 296372 284141 272891 262991
64553 262991 254776 248066 242230 236742 231584 227204 224186 222790 222609 222777 222696 222475 222583 223291 224635 226641
64537 226641 229229 232022 234558 236601 238040 238668 238385 237419 235913 233514 229917 225725 222138 219689 217851
64522 217851 216061 214542 213834 213974 214483 214817 214574 213691 212770 212833 214305 216468 218291 219530 220635 221873
64506 221873 223091 224238 225633 227688 230734 235020 240528 246858 253667 261190 269922 279736 289772 299281
64492 299281 308254 317094 325907 334198 341010 345346 346773 345775 343288 339899 335687 330827 325905 321501
64478 321501 317807 314789 312392 310293 307747 304054 299163 293645 288143 283004 278294 274011 270321 267688
64464 267688 266607 267063 268411 270015 271900 274558 278136 282064 285593 288470 290891 292859 293899 293571 292171
64449 292171 290605 289505 288745 288000 287546 288155 290281 293717 298047 303148 309135 316075 323894 332465 341755
64434 341755 352005 363691 377105 392077 408422 426613 447635 472204 500594 533324 571467
64423 571467 615991 667283 725765 792612 869302 956442 1053278 1158127 1268792 1382591 1496514
64412 1496514 1607697 1713847 1813203 1904187 1985037 2053702 2108137 2146624 2167731 2170193 2153434
64401 2153434 2118485 2067977 2004867 1931155 1847746 1755023 1653409 1544067 1429748 1314669
64391 1314669 1202941 1097103 998351 907611 825724 752900 688847 633432 586443 546727 512403
64380 512403 482248 456275 434665 416769 401497 388234 376875 367297 359118 351778 344614 337103
64368 337103 329285 321660 314519 307674 300999 294799 289317 284227 279029 273673 268429 263373 258434 253843
64354 253843 250127 247675 246528 246456 247031 247804 248769 250559 253863 258700 264472 270587 276659 282181 286428
64339 286428 288832 289237 287756 284570 279984 274485 268677 263174 258484 254829 252033 249681 247415 245161
64325 245161 243226 242207 242520 243859 245273 245977 245929 245570 245286 245357 246077 247519 249290 250889 252199 253391
64309 253391 254490 255317 255692 255357 253895 251193 247811 244431 241019 237043 232466 227895 223679 219502 215115
64294 215115 210957 207729 205728 204838 204803 205195 205513 205717 206365 207921 210163 212604 215216 218388 222361 227068
64278 227068 232297 237598 242239 245763 248656 252068 256861 263110 270447 278493 286870 295059 302398 308105
64264 308105 311486 312391 311456 309678 307787 306153 305052 304600 304602 304966 306159 308584 311403 312677 311069 306929
64248 306929 301337 294647 286572 277296 267703 258538 250034 242501 236591 232667 230279 228584 227073 225683
64234 225683 224527 223763 223568 223864 224152 223865 222865 221507 220327 219791 220108 220984 221668 221565 220799 219944 219290
64217 219290 218686 218012 217385 216831 216157 215318 214504 213627 212152 209812 207240 205422 204698 204667 204899 205224 205431 205369
64199 205369 205501 206752 209377 212400 214665 216248 218378 222053 227183 233145 239712 247161 255692 265061
64185 265061 274858 285002 295835 307698 320425 333273 345286 355637 363653 368749 370549 369044
64173 369044 364422 356793 346272 333493 319886 307130 296143 286589 277478 268245 259199 250969 243784
64160 243784 237478 232002 227571 224240 221627 219260 217068 215434 214806 215316 216657 218292 219871 221491 223477
64145 223477 225949 228817 232154 236179 240697 244970 248453 251439 254597 257986 260917 262664 262966 261868
64131 261868 259504 256174 252376 248594 245211 242575 240889 240020 239641 239663 240295 241727 244047 247486 252351
64116 252351 258569 265610 273057 280936 289309 297925 306649 315922 326326 337729 349262 360136 370120
64103 370120 379167 386934 392928 397056 399853 402142 404605 407722 412037 418132 426051 434856 443139 450070
64089 450070 455675 460013 462550 462620 460130 455414 448624 439687 428743 416246 402756 388990 375828
64076 375828 363779 352512 341462 330877 321702 314386 308422 303218 298774 295161 291960 288804 286047
64063 286047 284362 283902 284396 285799 288173 291038 293541 295459 297514 300406 303929 307357 310425 313640 317755
64048 317755 323227 330112 338176 347031 356363 366195 376920 388906 401974 415367 428341 440779 452984
64035 452984 464906 475794 484742 491284 495259 496359 494231 488935 481012 471194 460417 449988 441156
64022 441156 434319 429009 424799 421852 420343 419767 419272 418479 417506 416264 414131 410378 404642 397009 387995
64007 387995 378564 369814 362344 355951 350069 344393 339011 334085 329633 325588 321917 318625 315706 313104
63993 313104 310744 308710 307415 307443 309016 311683 314727 317897 321552 326082 331379 337028 342766 348566 354463
63978 354463 360585 367321 375164 384255 394223 404451 414402 423808 432856 442182 452401 463537 475244
63965 475244 487603 501296 516723 533329 550224 567357 585802 607031 632129 661433 694584
63954 694584 731165 771753 818204 872482 935423 1007245 1089108 1183271 1291416 1413495 1548582
63943 1548582 1696284 1856821 2030058 2214936 2409496 2611047 2816532 3023086 3227915
63934 3227915 3427224 3615684 3787658 3938907 4066636 4168206 4240766 4282319 4292482 4271779
63924 4271779 4220679 4139747 4030466 3895597 3738945 3565028 3378650 3184390 2986345 2788323
63914 2788323 2593886 2405985 2226740 2057908 1901310 1758382 1629364 1513423 1409656
63905 1409656 1317628 1236840 1166114 1103964 1049407 1002069 961598 927322 898546 874687 854929
63894 854929 838077 823160 809996 798731 788903 779474 769825 760230 751031 741766 731589 720421 709303
63881 709303 699604 692154 687139 684584 684767 688243 695413 706056 719459 735169 753455 774739 798696
63868 798696 824233 850408 877084 904643 933241 962414 991120 1018081 1042309 1063513 1081967
63857 1081967 1097890 1111021 1120800 1126803 1128916 1127174 1121663 1112602 1100409 1085479 1067846 1047226
63845 1047226 1023545 997267 968958 938733 906557 873026 839258 805825 772444 738989 706107
63834 706107 674316 643198 612356 582699 555694 531509 508984 487460 467538 449753 433600
63823 433600 418428 404382 391707 379823 367883 355826 344157 333090 322697 313599 306659 301935
63811 301935 298531 295497 292429 289272 286123 283312 281206 279791 278651 277336 275510 272936 269719 266469
63797 266469 263798 261689 259647 257366 254836 251942 248531 244938 241883 239720 238161 236856 235846 235277
63783 235277 235016 234704 233932 232313 229790 226981 224830 223664 222908 221910 220712 219751 219169 218834 218785 219252 220248
63766 220248 221463 222552 223280 223453 222992 222137 221350 220901 220672 220436 220179 219965 219606 218766 217530 216592 216574 217257
63748 217257 217814 217817 217610 217620 217787 217981 218514 219727 221351 222882 224494 226929 230404 234200 237540 240459 243513
63731 243513 246957 250494 253701 256495 259235 262428 266257 270411 274503 278487 282457 286284 289928 293846
63717 293846 298490 303389 307421 310154 312240 314203 315522 315310 313406 310277 306394 302244 298586 295984
63703 295984 294212 292625 290968 289394 287954 286579 285403 284567 283882 283265 283376 285131 288485 292309 295607
63688 295607 298440 301494 305214 309511 313901 317704 320443 322249 323575 324462 324529 323832 323220 323418 324129 324500
63672 324500 324324 324306 325146 326722 328313 329403 330123 330936 332012 332992 333356 332842 331396 328948 325576 321756
63656 321756 318040 314420 310377 305672 300720 296103 292130 289053 287176 286373 285867 284998 284035 283812 284676 286212
63640 286212 287876 289449 290936 292468 294383 297063 300589 304785 309529 314757 320247 325778 331466 337502
63626 337502 343623 349379 354991 361314 368755 376807 385005 393772 403822 415206 427564 441002 456024
63613 456024 472776 491026 510854 532710 556724 582498 609612 637826 666689 695579 724267
63602 724267 752814 780572 805877 827139 843821 855955 863292 865625 863652 858814 852265 844555 836230
63589 836230 828053 820355 812436 802796 789880 772800 751744 727777 702045 675219 647868 621055
63577 621055 595996 573141 552135 532776 515631 501551 490918 483462 478472 475131 473012 472426 473964
63564 473964 477668 482938 489193 496108 503231 510120 517166 525583 536102 548116 560632 573651 588096
63551 588096 604795 624080 646074 670708 697675 727004 759559 796285 836910 879828 922994
63540 922994 964150 1000236 1027652 1043907 1048955 1044828 1034389 1020544 1005913 992410 980891 971225
63528 971225 962589 953719 943309 930439 914476 894588 869832 840050 806349 770394 733411 696149
63516 696149 659470 624416 591724 561660 534376 510058 488603 469451 452013 436171 422212
63505 422212 410327 400290 391672 384245 378050 373046 368770 364488 359767 354825 350256 346451 343312 340519
63491 340519 337968 335906 334636 334137 334045 333957 333735 333599 334085 335818 339008 343043 346878 349990 352807 355977
63475 355977 359478 362747 365441 367666 369470 370568 370649 369677 367851 365500 362997 360452 357542 354003 350302
63460 350302 347367 345560 344336 343075 341839 341086 341024 341576 342605 343867 345029 346113 347696 350327 353949
63445 353949 358252 363325 369513 376771 384652 392999 402312 413370 426824 443145 462699 485738 512493
63432 512493 543156 577430 613967 650481 684512 714036 737566 754242 764234 768985 770862 772399
63420 772399 775645 781862 791655 805409 823628 846731 874505 905883 939313 973251 1006291 1036952
63408 1036952 1063521 1084283 1098127 1105070 1106154 1102738 1095925 1086609 1075789 1064492 1053334 1042196
63396 1042196 1030156 1015654 997035 973354 944797 912249 876658 838972 800401 762251 725471
63385 725471 690695 658572 629622 603757 580483 559706 541904 527353 515641 506277 499391 495402
63373 495402 494237 495244 497742 501318 505780 511244 518272 527552 539283 553115 568753 586432 606665
63360 606665 629653 655087 682491 711685 742849 776144 811337 847872 885195 922747 959581
63349 959581 994207 1024961 1050410 1069401 1081172 1085823 1084573 1079176 1071049 1061098 1050177 1039144
63337 1039144 1028258 1016817 1003621 987732 968690 946237 920147 890420 857596 822792 787386
63326 787386 752630 719508 688935 661878 639104 620839 606800 596538 589565 585118 581994 578719
63314 578719 573772 565703 553361 536412 515706 492968 470027 448277 428670 411826 397896 386421
63302 386421 376644 368054 360583 354221 348725 343814 339474 335736 332218 328324 324033 320142 317425 315742
63288 315742 314251 312360 310156 308010 306115 304426 302731 300715 298171 295287 292565 290471 289324 289421 290815
63273 290815 292896 294599 295390 295799 296743 298533 300841 303344 305985 308659 311114 313254 315233 317161 319023
63258 319023 320951 323260 326079 329217 332596 336482 340989 345565 349450 352660 356089 360479 365653 371019
63244 371019 376530 382725 389953 398063 406941 416839 427844 439438 451073 463100 476534 491831 508379
63231 508379 525401 542910 561330 580427 599193 616895 633889 651206 669516 688668 708081
63220 708081 727352 746462 765575 784795 804047 822946 840715 856433 869531 879888 887238 890760
63208 890760 889709 884359 875769 864515 850297 833016 813664 793619 773622 754029 735669 719564
63196 719564 705928 694271 684597 677829 674903 676036 681036 689686 701509 715773 732126 750828 772055
63183 772055 795428 820587 847673 876800 907467 938993 971142 1003740 1036066 1067362 1097704
63172 1097704 1127613 1156840 1184237 1208890 1230670 1249438 1264303 1273988 1277575 1274604 1264791 1247982
63160 1247982 1224252 1193884 1157443 1115984 1070959 1023809 975737 927881 881351 836977 795224
63149 795224 756415 720761 688100 657995 630296 605326 583317 563936 546686 531563 519025
63138 519025 509305 501955 496018 490562 485122 479798 474935 470772 467447 465185 464112 463911 464063 464540 465894
63123 465894 468424 471621 474777 477844 481252 485107 489008 492575 495745 498601 501373 504616 508831 513642
63109 513642 517790 520399 521995 523820 526209 528178 528796 528520 528765 530408 533157 536289 539350 541990 543756
63094 543756 544597 545215 546312 547653 548448 548574 548768 549552 550537 551020 550728 549749 548257 546703 545802 545910 546692
63077 546692 547778 549427 552156 556079 561064 567237 574729 583064 591392 599334 607161 615250 623855 633418
63063 633418 644548 657509 672135 688364 706498 726787 749085 773158 799107 827376 858427
63052 858427 892426 929043 967582 1007512 1048825 1091674 1135804 1180719 1226262 1272536 1319248
63041 1319248 1365698 1411613 1457471 1503768 1550446 1597314 1644464 1691747 1738101 1781994 1822398
63030 1822398 1858837 1890484 1915705 1932671 1940219 1938139 1926931 1907385 1880185 1845736 1804519 1757715
63018 1757715 1707362 1655807 1605025 1556537 1511794 1472311 1439207 1412795 1392927 1379759 1373898
63007 1373898 1375680 1384657 1400114 1421837 1449979 1484367 1524429 1569727 1619915 1673994 1730130 1786615
62995 1786615 1842749 1898620 1954399 2010132 2065812 2121166 2175543 2228333 2279226 2327586 2371713
62984 2371713 2409191 2437915 2456412 2463357 2457491 2438291 2406250 2362214 2306719 2240247 2163905 2079577
62972 2079577 1989565 1896377 1802692 1711074 1623387 1540463 1462366 1389069 1320946 1258714 1202877
62961 1202877 1153179 1108636 1068153 1031112 997348 966667 938523 912218 887261 863406 840405
62950 840405 818035 796404 775946 756854 738643 720658 702909 686026 670353 655514 641058
62939 641058 627098 613990 601811 590593 580814 573044 567091 562012 557078 552311 547990 544057 540323
62926 540323 536908 534101 531919 530128 528626 527525 526815 526111 524860 522821 520354 518218 516947 516317 515542
62911 515542 514035 511876 509467 506928 504108 501059 498158 495625 493133 490084 486248 482009 478017 474706
62897 474706 472132 470083 468289 466604 465191 464487 464837 466049 467456 468541 469431 470594 472071 473275 473616
62882 473616 473171 472578 472409 472867 473955 475581 477367 478631 478896 478328 477410 476264 474606 472469 470550 469479
62866 469479 468972 468119 466487 464543 462938 461848 461188 461016 461324 461744 461991 462433 463687 465638 467389 468286
62850 468286 468510 468457 468059 467149 466088 465486 465387 465219 464503 463292 461926 460764 460066 459689 458893 457030 454558
62833 454558 452798 452384 452498 452106 451373 451183 451644 452018 452039 452356 453434 454831 456047 457365 459247 461400 463216
62816 463216 464874 467240 470630 474336 477481 479929 482223 485030 488763 493360 498237 502743 506809 510976
62802 510976 515725 521103 527059 533799 541601 550544 560602 571721 583629 595821 607994 620403 633696
62789 633696 648658 666214 687258 712039 739896 769984 802316 837923 878077 923520 974281
62778 974281 1029936 1089991 1154059 1221624 1291618 1362489 1432730 1501027 1565821 1625180 1677411
62767 1677411 1721365 1755722 1778486 1787945 1784025 1768037 1741205 1704161 1657882 1604235 1545169 1481954
62755 1481954 1415648 1347776 1279980 1213276 1148201 1085563 1026599 972338 923029 878137 836737
62744 836737 798087 762155 729562 700838 675804 653844 634547 617774 603258 590613 579738
62733 579738 570811 563708 557815 552651 548451 545826 544972 545478 546860 549023 552077 555898 560086 564379 569026
62718 569026 574717 582183 591856 603827 617991 634194 652330 672453 694858 719990 748209 779691
62706 779691 814678 853855 898309 948956 1006000 1069035 1137699 1212146 1292897 1380307 1474095
62695 1474095 1573200 1676006 1780828 1886283 1991099 2093526 2191020 2280543 2359001 2423472
62685 2423472 2471365 2500728 2510412 2499957 2469567 2420387 2354557 2274715 2183553 2083967 1979187
62674 1979187 1872141 1764736 1658247 1554404 1455480 1363139 1277612 1198324 1124974 1057684
62664 1057684 996386 940538 889463 842763 800404 762501 729030 699604 673575 650323 629385
62653 629385 610384 593067 577387 563256 550210 537592 525208 513443 502613 492534 482966 474147
62641 474147 466523 460211 455053 450998 448020 445800 443912 442347 441451 441333 441589 441691 441362 440522 439091 436991
62625 436991 434255 431127 428116 425821 424485 423771 423213 422854 423123 424084 425150 425796 426373 427966 431387 436363
62609 436363 441808 446930 451956 457621 464116 471005 478318 487134 498523 512266 527326 543405 561281
62596 561281 581575 604032 628349 654929 684250 716034 749611 784582 820238 854627 885312
62585 885312 911295 933422 952463 967454 976460 978475 973825 962990 946013 923413 896927 868588
62573 868588 839200 808333 775884 743093 711699 682510 655262 629684 606081 584775 565501
62562 565501 547719 531281 516465 503535 492553 483484 476150 470071 464658 459704 455517 452491 450552
62549 450552 449025 446947 443723 439743 436318 434754 435303 437158 439438 442001 445283 449623 454827 460208
62535 460208 464952 468706 471942 475524 479767 484163 488289 492733 498775 507248 518092 530948 545723
62522 545723 562427 580919 601214 623937 650118 680515 715252 754159 797252 844734 896525
62511 896525 951927 1009835 1069259 1129457 1189521 1247975 1302968 1352756 1395822 1430659 1455860
62500 1455860 1470570 1474713 1468691 1453076 1428696 1396886 1359503 1318720 1276736 1235356 1195690 1158457
62488 1158457 1124702 1095913 1073233 1056814 1046280 1041623 1043260 1051286 1065145 1084102 1107664 1135313
62476 1135313 1166054 1198440 1230969 1262300 1291138 1315996 1335223 1347413 1351918 1348873 1338561 1320854
62464 1320854 1295405 1262228 1221913 1175449 1124256 1070326 1015801 962163 910013 859706 811921
62453 811921 767456 726806 690240 658099 630714 608024 589451 574198 561660 551655 544256 539289
62441 539289 536099 534057 533243 534267 537320 541756 546734 551835 556790 561039 563973 565365 565211 563344 559658
62426 559658 554509 548389 541291 532848 523084 512587 501929 491406 481419 472574 465048 458191 451134
62413 451134 443726 436664 430852 426749 424110 422063 419529 415900 411508 407397 404559 403292 403128 403254 403033
62398 403033 402238 401012 399721 398877 398944 400046 401865 403961 406144 408425 410712 412728 414269 415412 416500
62383 416500 417998 420276 423398 427153 431363 436030 441139 446577 452506 459533 468128 478038 488631 499663
62369 499663 511205 523012 534655 546414 559374 574375 591414 610404 631935 656835 685399
62358 685399 717544 753378 793131 836835 884558 936561 992473 1050454 1107888 1162925 1214698
62347 1214698 1262129 1303412 1336999 1362421 1379735 1388737 1389205 1381519 1366519 1344987 1317675 1285552
62335 1285552 1249523 1210178 1168276 1125277 1082766 1041519 1001802 964569 931476 903354 879353
62324 879353 858024 838718 821345 805291 789407 772959 755834 737797 718333 697503 676294
62313 676294 655661 635620 615708 596002 577202 559930 544427 530812 519119 509083 500330 492865
62301 492865 486988 482663 479323 476360 473501 470655 467853 465472 464026 463411 462800 461726 460907 461456 463428
62286 463428 465764 467628 469275 471470 474590 478533 483081 488008 493027 497958 502888 507988 513265 518614
62272 518614 523918 528983 533648 538239 543714 550983 560173 570849 582923 596962 613579 632930 655056
62259 655056 680432 709875 743963 782698 825703 872664 923632 978926 1038440 1100868 1163691
62248 1163691 1224154 1280179 1330292 1373037 1407013 1431544 1446918 1453740 1452208 1442108 1423296 1395987
62236 1395987 1360680 1318014 1268832 1214417 1156606 1097477 1038678 981137 925579 873132 825052
62225 825052 781912 743461 709272 679082 652443 628742 607886 590357 576137 564118 553245
62214 553245 543766 536474 530984 525816 520249 515079 511207 508438 506275 505148 505970 508903 513331 518848
62200 518848 525497 533119 541212 549622 558784 569046 580154 591583 603041 614424 625614 636578
62188 636578 647436 658203 668577 678156 686762 694412 701135 706981 712004 716069 718820 720120 720436 720476
62174 720476 720483 720191 719644 719793 722054 727410 736167 748485 764763 785376 810314 839319 872225 908828
62160 908828 948407 989617 1030938 1071018 1108462 1141525 1168319 1187524 1198976 1203640 1202867 1197351
62148 1197351 1186649 1169914 1147225 1120022 1090034 1058010 1023810 987635 950730 914829 881283
62137 881283 850939 824481 802441 784823 770987 760025 751188 744030 738337 734042 731120 729441 728693
62124 728693 728519 728747 729487 731041 733776 738028 743910 751054 758584 765493 771087 774969 776690 775798 772440
62109 772440 767778 763404 760204 757777 754953 750753 744852 737358 728451 718453 708151 698817 691644 687067
62095 687067 684720 683998 684580 686408 689426 693529 698708 705044 712541 721063 730456 740711 752022 764670
62081 764670 778755 794040 810185 827209 845577 865716 887588 910807 935016 959910 985075
62070 985075 1010113 1034925 1059600 1083930 1107319 1129338 1150298 1171164 1192990 1216460 1241804
62059 1241804 1268874 1297159 1325738 1353334 1378565 1400247 1417514 1429799 1436938 1439283 1437342 1431078
62047 1431078 1419717 1402466 1379240 1350428 1316234 1276727 1232536 1185024 1135623 1085345 1035063
62036 1035063 985852 938734 894310 852859 814585 779553 747553 718332 691912 668432 647697
62025 647697 629112 612066 596271 581776 568727 557058 546342 536037 525941 516311 507465 499433
62013 499433 492099 485461 479550 474264 469489 465292 461767 458881 456685 455503 455504 456215 456941 457730 459508 463000
61997 463000 467849 473024 477798 482001 485492 487860 488793 488514 487633 486528 484936 482240 478188 473223 467989
61982 467989 462606 456678 450012 443074 436616 431052 426350 422384 419138 416592 414581 412836 411172 409711
61968 409711 408875 408982 409797 410667 411189 411524 411960 412501 413187 414483 416838 419879 422516 423941 424273 424204 424422
61951 424422 425481 427745 431096 434855 438326 441394 444534 448436 453774 461021 470192 480809 492390 504883
61937 504883 518485 533142 548441 563884 579049 593633 607587 621132 634354 646840 657973
61926 657973 667569 675968 683507 690104 695320 698525 699094 696817 692254 686475 680405 674572 669322 664908
61912 664908 661441 659261 659334 662675 669128 677271 685854 694903 705067 716357 728018 739251 749424
61899 749424 757838 763853 767180 767576 764509 757744 748170 737297 725873 713558 700076 685982 672077
61886 672077 658734 646120 634460 623565 612656 601296 590215 580509 572191 564118 555293 545633
61874 545633 535495 525148 515034 505969 498537 492467 487053 482144 478437 476763 477283 479437 482520 486230
61860 486230 490734 496334 503118 510973 519924 530363 542841 557622 574459 592880 612663 634044
61848 634044 657451 683038 710358 738383 765846 791730 815567 837264 856602 873022 885942
61837 885942 895135 900598 902170 899623 893248 884144 873829 863686 854879 848424 844957 844464 846572 851170
61823 851170 858472 868400 880147 892589 904890 916389 925968 931915 932623 927391 916468 900600 880630
61810 880630 857382 831572 803823 774904 745938 718112 692155 668292 646704 627695 611198
61799 611198 596471 582706 569828 558335 548331 539130 529936 520601 511542 503141 495537 488872 483395
61786 483395 479225 476161 473800 471767 469857 468043 466470 465334 464626 464001 463034 461710 460532 460021 460170
61771 460170 460536 460805 461036 461341 461609 461677 461564 461418 461428 461953 463428 465782 468138 469484 469746 469912 471082 473503
61753 473503 476523 479271 481380 483165 485027 486684 487221 486128 483955 481619 479380 477027 474798 473345
61739 473345 472758 472299 471299 469742 467810 465524 463213 461750 461771 462922 464246 465062 465246 465073 465144 466087 467908
61722 467908 469913 471598 473219 475152 477195 479036 480912 483076 485044 486207 486972 488373 490502 492176
61708 492176 492271 490662 487687 483616 479034 475039 472366 470609 468761 466254 463205 459984 456945 454329 452042
61693 452042 449667 446960 444160 441570 439094 436516 434039 432107 430698 429188 427021 424324 421695 419504
61679 419504 417581 415633 413870 412871 412718 412581 411566 409796 408201 407278 406617 405742 404847 404326 404028 403376 401961
61662 401961 399727 396877 393963 391819 390993 391287 392104 393049 393961 394652 395007 395198 395435 395691 396015 396928 399029
61645 399029 402251 405902 409359 412305 414420 415472 415871 416556 418002 419644 420559 420483 419908 419396 419053 418638
61629 418638 417911 416833 415455 413636 410990 407306 402954 398629 394711 391151 387981 385526 383905 382673
61615 382673 381327 379937 378900 378134 376935 374755 371798 368630 365428 361894 357822 353405 348859 344114
61601 344114 339197 334739 331586 329822 328610 327135 325327 323377 321057 318057 314673 311529 308764 306128
61587 306128 303791 302213 301098 299350 296551 293677 291764 290448 288690 286503 284950 284543 284614 284464 284274
61572 284274 284469 284869 285040 285013 285055 284968 284176 282483 280348 278451 277260 276891 277043 277142 276956 277046 278221 280494
61554 280494 282973 284913 286443 287995 289424 290209 290363 290584 291381 292431 293069 293168 293267 293892 295067 296527 298136
61537 298136 299839 301321 302057 301908 301467 301512 302100 302495 302131 301372 301010 301200 301312 300859 300133 299705 299600 299309
61519 299309 298434 297057 295547 294317 293702 293752 294039 293956 293330 292586 292201 292193 292244 292179 292184 292635 293726 295090 295796 295090
61499 295090 293381 292168 292629 294392 295982 296364 295739 294979 294785 295402 296602 297709 298003 297420 296661 296406 296676
61482 296676 297156 297832 298882 300129 301076 301522 301846 302611 304118 306297 308746 310816 311969 312227 312152 312284 312689
61465 312689 313049 313021 312445 311398 310214 309374 309243 309883 311021 312114 312531 311917 310514 309021 308067 307869 308299
61448 308299 309128 310188 311488 313120 314906 316299 316962 317368 318406 320371 322771 325158 327572 329977 331876
61433 331876 332978 333753 334759 335770 336226 336279 336668 337589 338448 338827 339060 339643 340634 341932 343700 346086 348875
61416 348875 351679 354262 356424 357861 358527 358932 359735 361049 362331 362899 362427 361111 359490 358018 356696
61401 356696 355182 353325 351331 349353 347307 345307 343933 343646 344120 344510 344330 343753 343193 342962 343265 344170
61385 344170 345468 346844 348188 349499 350527 350884 350654 350584 351382 353001 354753 356082 356982 357712 358345 358836
61369 358836 359387 360416 361946 363297 363784 363643 363812 364725 365896 366880 368061 369989 372425 374793 377296 380737
61353 380737 385209 389765 393675 397367 401777 407259 413542 420274 427091 433430 438896 443750 448588 453478
61339 453478 457832 461316 464551 468578 473607 478575 482204 484431 486453 489272 492595 495475 497562 498951
61325 498951 499113 497069 492978 488607 485547 483651 481970 480617 480690 482562 485401 488536 492402 497710 504393
61310 504393 511807 519538 527599 536226 545904 557215 570184 583955 597497 610450 622929 634661
61298 634661 644787 652492 657445 659600 658955 655729 650497 643936 636434 628113 619183 610090 601198 592343
61284 592343 582965 572882 562820 553816 546089 538913 531736 525055 519853 516509 514674 513935 514058 514689
61270 514689 515451 516496 518428 521470 525073 528590 531933 535301 538618 541682 544682 548121 552285 557116
61256 557116 562541 568590 575150 581879 588384 594284 599125 602580 604818 606434 607929 609438 610987 612670
61242 612670 614392 615658 615926 615122 613667 612052 610520 609107 607860 607039 607043 608015 609472 610617 611237 612160
61226 612160 614580 618985 624923 631684 638904 646518 654509 662879 671634 680543 689054 696693 703588 710373
61212 710373 717486 724574 730706 735186 738172 740502 742939 745607 748162 750469 753027 756641 761613 767334
61198 767334 772836 777859 783214 789968 798425 808158 818877 830769 843846 857429 870553 882541 892848
61185 892848 900793 906051 909244 911462 913180 914153 914294 913997 913468 912394 910579 908304 905697 902269 897566
61170 897566 891867 885693 878982 871316 862674 853315 843193 832170 820619 809022 796959 783405 768238
61157 768238 752718 738081 724326 710819 697472 684710 672763 661708 652005 644307 638761 634959
61145 634959 632532 631281 630723 629935 628023 624483 619150 612208 604385 596742 590033 584352 579515 575675 573467
61130 573467 573597 576199 580517 585342 589957 594665 600363 607858 617740 630444 645916 663385 682073
61117 682073 702164 724534 749465 776126 803476 831197 859519 888581 918260 948244 977967
61106 977967 1006745 1034275 1060768 1086407 1110927 1133824 1154492 1171947 1184942 1192832 1195992 1195010
61094 1195010 1189909 1180632 1167762 1152033 1133475 1111875 1087947 1063142 1038224 1012769 986277 959065
61082 959065 931891 905342 879910 856044 833653 812053 790897 770805 752579 736089 720440
61071 720440 705137 690659 677952 667627 659589 653144 647526 642571 638855 636997 636928 638014 639802 642413
61057 642413 646256 651488 657758 664442 671241 678623 687488 698296 710673 723957 737905 752717 768651
61044 768651 785929 804893 825961 849375 875108 902958 932718 964409 998334 1034660 1072980
61033 1072980 1112718 1154128 1198370 1246256 1297381 1350896 1406622 1464673 1524295 1584032 1643318
61022 1643318 1703369 1766323 1834012 1907786 1989056 2079450 2180432 2293017 2418020 2556934
61012 2556934 2713085 2892359 3103170 3356239 3664769 4044413 4511943 5082963 5770352
61003 5770352 6584673 7536752 8641975 9924037 11412207 13125533 15044934 17086928
60995 17086928 19098852 20887033 22270958 23141530 23499203 23456857 23204881 22947919 22833401
60986 22833401 22898554 23058045 23137173 22935470 22295398 21153084 19555966 17642452 15592923
60977 15592923 13575093 11708065 10054602 8632978 7433963 6434436 5606379 4922076
60969 4922076 4356455 3887930 3498580 3173580 2900163 2667317 2466401 2291274 2137299
60960 2137299 2000665 1878778 1770349 1674361 1589368 1514239 1448795 1392775 1344638 1302215 1264242
60949 1264242 1230339 1199751 1171139 1143634 1117319 1092499 1069161 1047253 1026945 1008459 991985
60938 991985 977612 964902 952734 940247 927817 916411 906118 896125 886083 876541 867877 859768
60926 859768 852054 845202 839412 834123 829041 824954 822709 821889 821291 820415 819737 819782 820723 822780 826200 830668
60910 830668 835343 839771 844414 850029 856757 863953 870745 876700 882092 887617 893791 900538 907288 913298
60896 913298 917918 920933 922838 924492 926174 927191 926702 924688 921735 918056 913203 906781 898963 890259
60882 890259 881084 871645 861936 851716 840799 829477 818384 807792 797303 786463 775441 764855
60870 764855 755074 745949 737230 728919 721078 713530 705997 698555 691777 686268 682065 678558 674964 670782
60856 670782 665894 660440 654710 648929 643096 637123 631195 625722 620753 615752 610209 604312 598643 593341
60842 593341 587999 582337 576443 570239 563211 555076 546378 537985 530109 522211 513834 505152 496658 488665
60828 488665 481318 474854 469571 465568 462662 460522 458814 457258 455677 454004 452204 450254 448286 446625
60814 446625 445493 444726 443945 443063 442387 442159 442189 442129 441905 441679 441510 441352 441379 441943 443092 444350 445199 445568 445659
60795 445659 445435 444682 443570 442750 442598 442575 441718 439742 437288 435022 432897 430538 427955 425372 422596 419244
60779 419244 415621 412735 411135 410181 408809 406648 404089 401688 399944 399256 399495 399895 399912 399903 400346 400736 400094
60762 400094 398410 396611 395104 393409 391494 390328 390520 391293 391595 391493 391621 391864 391623 391110 391408 393205
60746 393205 396160 399497 402643 405278 407312 408854 409828 409809 408645 406937 405286 403355 400493 397025 393983
60731 393983 391531 388726 385048 381218 378057 375354 372386 368938 365285 361729 358682 356675 355729 355077 353972
60716 353972 352377 350481 348118 345266 342654 341026 340051 338690 336553 334209 332216 330561 329181 328432 328745
60701 328745 330130 332147 334143 335517 336039 335944 335563 334992 334346 334021 334258 334633 334559 334214 334461 335861 338264
60684 338264 341318 344739 348008 350587 352712 355405 359277 363764 367962 371745 375616 379791 383972 387819
60670 387819 391196 394093 396646 399076 401216 402310 401749 399969 398117 396872 396000 395068 394078 393236 392607 392293
60654 392293 392585 393546 394670 395357 395678 396357 397930 400176 402402 404077 405104 405637 405789 405438 404222 401762
60638 401762 397974 393148 387701 381961 376308 371382 367873 365985 365274 365096 365074 365072 364948 364653 364475 364836 365764
60621 365764 366780 367401 367576 367510 367256 366699 365825 364814 363870 363120 362672 362619 362932 363404 363824 364124 364325 364320 363865
60602 363865 362926 362025 362023 363339 365485 367565 369210 370833 372941 375476 377929 379897 381360 382554 383750
60587 383750 385020 386076 386421 385778 384326 382473 380554 378804 377435 376572 376315 377005 379153 382839 387403
60572 387403 392122 397062 402887 409949 418014 426854 436574 447175 458176 468847 478558 486834 493395
60559 493395 498273 501534 502788 501385 497294 491408 484749 477814 470967 464892 460189 456922 455120 455357
60545 455357 458165 463100 469112 475737 483288 491977 501625 512284 524297 537491 550895 563433 574250
60532 574250 582320 586706 587676 586712 584822 581634 576811 571405 566715 562428 557262 551187 545672 541677 538645
60517 538645 535814 533343 531599 530330 529288 528953 529895 531937 534531 537492 540769 544076 547600 552699 561038
60502 561038 573172 588680 607450 629971 656362 686057 718720 754741 794412 837013 880986
60491 880986 924556 965903 1003101 1034314 1057934 1072356 1075956 1067678 1047705 1017500 979322 935643
60479 935643 888719 840470 792735 747411 705966 668780 635366 605300 578640 555397 535197
60468 535197 517660 502665 489936 478788 468683 459690 451943 444988 438140 431259 424685 418600 413019
60455 413019 408277 404844 402504 400272 397328 393690 389859 386220 383007 380436 378507 376901 375358 374009
60441 374009 373166 372890 372977 373176 373249 372955 372269 371574 371385 371783 372239 372014 370701 368439 365713 362954 360345 358024
60423 358024 356377 355936 356880 358828 361257 363995 367094 370303 372920 374277 374278 373418 372409 371784 371716 372005 372256
60406 372256 372228 372116 372443 373534 375131 376658 377924 379379 381508 384140 386619 388634 390546 392763 395126
60391 395126 397153 398692 399993 401209 402239 403162 404475 406599 409290 411874 413993 415864 417728 419400
60377 419400 420586 421416 422383 423808 425690 428012 430806 433787 436298 437899 438881 439933 441446 443304 445181
60362 445181 446759 447824 448500 449300 450651 452414 454230 456265 459147 463123 467727 472444 477293 482562 488373
60347 488373 494770 501839 509328 516400 522132 526110 528256 528415 526548 523099 518651 513287 506816 499563
60333 499563 492376 485715 479334 473116 467706 463833 461255 458863 455857 452537 449820 448127 446875 445102
60319 445102 442562 440058 438527 438018 437871 437869 438711 441204 445354 450609 456700 463913 472674 483256 495911
60304 495911 510913 528290 547517 567545 587119 605163 620883 633455 641668 644161 640229 630335
60292 630335 615788 598135 578899 559500 541019 524180 509747 498637 491218 486730 483869 481838
60280 481838 480354 478842 476476 473275 470369 468674 467738 466425 464323 461884 459394 456490 452742 448234
60266 448234 443495 439166 435765 433390 431630 430038 428679 427845 427325 426520 425364 424556 424586 425047 425270 425163
60250 425163 424913 424266 422883 421284 420738 421999 424598 427476 429892 431574 432499 432891 433154 433505 433844 434156
60234 434156 434768 435904 437212 438129 438609 439129 439995 441014 441988 443264 445463 448709 452226 454905 456365 457444
60218 457444 459431 462813 466983 471302 476043 481964 489176 496972 504665 512071 519094 525421 531036 536666
60204 536666 543235 550938 559131 567073 574522 581670 588755 595789 602500 608518 613693 618157 621989 625006
60190 625006 627134 628810 630584 632306 633104 632337 630245 627449 624112 619955 614908 609277 603267 596803 590045
60175 590045 583700 578418 573984 569499 564403 559006 553949 549524 545770 542875 540959 539526 537726 535368
60161 535368 533264 532265 532187 532088 531398 530332 529257 528147 526884 525765 525405 526208 528062 530453 532773 534698
60145 534698 536418 538385 540675 542754 544154 545256 547091 550308 554600 559265 564049 569198 574851 580731
60131 580731 586426 591691 596339 600118 602937 605122 607177 609286 611248 612910 614487 616359 618756 621757
60117 621757 625345 629232 632799 635621 638066 641013 644801 648690 651599 653242 654306 655534 656881 657653
60103 657653 657317 655979 654017 651437 647837 643110 637965 633442 629952 627041 624108 621030 617974 614942
60089 614942 611889 609122 607215 606489 606747 607451 607937 607630 606462 605128 604550 604889 605314 604913 603601 601965
60073 601965 600399 598648 596024 591897 586147 579415 572785 566850 561131 554771 547801 541298 536075 531638
60059 531638 526837 521257 515481 510097 505078 500350 496354 493548 491651 489971 488439 487753 488420 490154 492487
60044 492487 495440 499187 503403 507555 511714 516508 522185 528207 533943 539404 544962 550622 555885 560243
60030 560243 563526 565772 566924 566796 565317 562776 559608 555841 550927 544408 536640 528485 520333 511903
60016 511903 503126 494653 487153 480563 474534 469300 465438 462773 460070 456103 450806 445304 440908 438080
60002 438080 436195 434297 432137 430333 429437 429239 429233 429430 430149 431258 432298 433372 435224 438245 441919 445519
59986 445519 448911 452362 455980 459722 463657 467804 471840 475238 477539 478356 477425 475017 472052 469383 467018
59971 467018 464345 461014 457278 453588 450192 447184 444653 442665 441208 440209 439497 438869 438302 438070 438514 439774
59955 439774 441800 444453 447423 450227 452529 454399 456123 457831 459508 461214 463071 465154 467549 470331
59941 470331 473195 475345 476152 475919 475634 475945 476596 476787 475837 473587 470561 467761 465940 465005 464369 463834 463802
59924 463802 464639 466260 468374 470640 472520 473550 474120 475559 478946 483982 489337 493968 497839 501545 505570
59909 505570 509817 513606 516133 517157 517170 516816 516333 515728 515190 514880 514495 513556 512210 511251 511226 511876 512732 513888
59891 513888 515794 518511 521641 524919 528421 532121 535791 539602 544344 550466 557152 562974 567484 571559
59877 571559 576045 580724 584904 588342 591012 592508 592488 591391 589876 587623 583607 577614 570654 563661 556692
59862 556692 549825 543924 539724 536787 534227 532125 531324 532043 533565 535373 537828 541561 546811 553590 561903
59847 561903 571490 581642 591462 600019 606306 609669 610623 610716 611150 611817 612010 611650 611278 611077 610489 608791
59831 608791 605525 600436 593565 585694 578255 572374 568087 564610 561169 557389 553181 548658 544121 539803
59817 539803 535594 531240 526795 522587 518750 515151 511890 509490 508240 507653 506916 505739 504354 502840 501008
59802 501008 498974 497265 496051 494721 492581 489701 486695 483937 481462 479408 477945 476792 475386 473745
59788 473745 472636 472563 472960 472819 471871 470679 469680 468672 467334 465775 464295 462911 461453 460001 458900 458355
59772 458355 458288 458545 459030 459648 460317 461054 461798 462177 461852 461188 461163 462336 464219 466035 467813 470256 473672
59755 473672 477595 481462 485195 489028 493195 497980 503686 510263 517208 524005 530483 536662 542481 547810
59741 547810 552459 556071 558332 559479 560326 561587 563360 565380 567397 569083 569987 569967 569459 568965 568523 567961
59725 567961 567351 566823 566208 565388 564713 564518 564414 563776 562902 562889 564132 565635 566205 565860 565545 565785 566240 566475
59707 566475 566651 567268 568496 569998 571299 572221 572948 573767 574809 576032 577433 579196 581644 584988 589035
59692 589035 593149 596686 599504 601906 603981 605272 605319 604336 603069 602059 601323 600642 599808 598583 596840 594848
59676 594848 593102 591587 589409 585421 579229 571480 563280 555501 548662 543080 538780 535287 531952 528731
59662 528731 526356 525298 524838 523800 522177 521365 522548 525427 528919 532458 536107 539835 543408 546770 549953
59647 549953 552814 555323 557892 560802 563445 564711 564057 561750 558231 553911 549397 545220 541340 537533
59633 537533 534183 531946 530643 529304 527416 525338 523346 521110 518455 515803 513443 511080 508558 506313
59619 506313 504515 502358 498881 494101 488825 483730 479141 475291 472258 469897 468301 467956 469046 470987
59605 470987 473135 475504 478236 480824 482587 483615 484551 485604 486429 486801 486710 485934 484267 482188 480616 479897
59589 479897 479572 479215 478944 478919 478867 478378 477371 476097 474816 473544 471956 469651 466751 464041 462165 460825
59573 460825 459236 457203 455290 453982 453205 452701 452297 451779 450996 450273 450221 450928 451712 451890 451465 450921 450669 450885
59555 450885 451574 452565 453599 454537 455379 456136 456931 458174 460209 462813 465528 468536 472714 478627 485959 494251
59539 494251 503697 514810 527658 541936 557523 574309 591295 606246 616556 620633 618783 613044
59527 613044 606046 599648 594362 589994 586611 584738 584737 586404 589261 593071 597794 603081 607962 611208 611996
59512 611996 610286 606661 601847 596276 589871 582170 572792 561910 550299 539004 528951 520671 514082
59499 514082 508523 503279 498139 493306 488936 485215 482745 482097 482698 482871 481574 479658 478764 479355 480508
59484 480508 481401 482205 483539 485801 489163 493608 498725 504000 509523 515953 523583 531782 539518 546068 551118
59469 551118 554667 557133 559214 561302 563178 564450 565066 565289 565446 565893 566978 568876 571637 575476 580793
59454 580793 587752 596063 605296 615255 625935 637282 649059 660860 672287 683214 693647 703000
59442 703000 709715 712122 709756 703459 694296 682970 670369 657867 646551 636453 626911 617477 608219
59429 608219 599402 591244 583988 578040 574029 572510 573427 576110 580223 586525 596079 608838 623731 640169
59415 640169 658549 679110 701252 724502 749217 775426 801464 824450 841762 851535 852492 844565
59403 844565 829713 811339 792695 776164 763607 756286 754165 755745 758661 760018 756519 745510 726665
59390 726665 702324 675882 649964 626065 605027 587181 572322 560148 550728 544195 540025 537050
59378 537050 534321 531763 529887 529107 529517 531153 534073 538061 542502 546773 550668 554326 557919 561658 565911
59363 565911 570938 576562 582391 588304 594346 600299 605900 611533 618112 626167 635554 646156 658183 671455
59349 671455 685140 698745 712877 728413 745297 762686 779945 796980 813917 830970 848268
59338 848268 865187 880175 891886 900248 905786 908309 907130 902337 894799 884876 872132 856584 839332
59325 839332 821516 803396 784955 766801 749841 734416 720266 707097 694783 683224 672452
59314 672452 662770 654502 647616 641817 636961 633253 631119 630927 632722 636150 640736 646236 652675 660224
59300 660224 669245 680205 692990 706201 717496 724732 726597 722432 712282 697434 680289 663183
59288 663183 647417 633498 621775 612363 604822 598515 593273 589429 587233 586556 587082 588573 590983 594508
59274 594508 599558 606467 615279 625856 638034 651473 665476 679255 692446 705182 717574 729215
59262 729215 739264 746976 752058 754506 754213 750962 744837 736423 726387 715010 702415 689137 676140
59249 676140 664193 653514 644080 635988 629319 623932 619635 616451 614442 613402 612999 613305 614928 618352
59235 618352 623158 628223 632869 637613 643397 650156 656609 661527 664699 666434 666732 665459 662883 659331
59221 659331 654602 648400 641191 633870 626669 619175 611456 604299 598129 592580 587563 583958 582521 582661
59207 582661 582978 582653 581716 580245 578127 575593 573333 571843 570953 570098 568919 567600 566755 566867 567705 568488
59191 568488 568780 568914 569284 569602 569339 568730 568752 570059 572323 574721 576777 578575 580361 582106 583507 584472
59175 584472 585592 587776 591278 595349 599231 603178 608068 614181 620997 628186 636184 645509 655959 666864
59161 666864 677813 688700 699155 708366 715581 720633 723843 725465 725330 723043 718495 712107 704524 696132
59147 696132 686941 676913 666298 655665 645693 636906 629405 622761 616192 609028 601107 592775 584567
59134 584567 576881 569959 564003 559061 554745 550430 546032 542465 540874 541346 542771 544120 545543 547940
59120 547940 551791 556839 562716 569411 576996 585256 593783 602307 610820 619407 628015 636313 643864 650509
59106 650509 656476 661989 666845 670628 673347 675607 678045 680779 683470 685696 687052 687125 685770 683543 681503
59091 681503 680328 679681 678649 676757 674370 672204 670673 669737 668978 667645 665013 661078 656702 652611 648312
59076 648312 642505 634695 625979 617960 611150 604765 597962 590854 584180 578285 572786 567281 562077 557871
59062 557871 554833 552367 549906 547532 545600 544104 542790 541553 540291 538563 535979 532839 529873 527432
59048 527432 525463 524215 524229 525453 526966 527859 527885 527048 525219 522629 520191 518732 518158 517811 517392 517094 517064
59031 517064 517206 517482 518102 519502 522220 526558 532193 538499 545390 553312 562134 570741 578398 585973 594875
59016 594875 605012 614620 622156 627598 631810 635391 638432 640780 642154 642328 641513 640401 639707 639839 641013
59001 641013 643292 646386 649799 653407 657724 663360 670295 677761 684798 690983 696694 702555 708518 713739
58987 713739 717513 720036 721863 722898 722469 720324 717038 713436 710105 707495 706010 705844 707063 709846 714270
58972 714270 719996 726719 734904 745357 757947 771438 784930 798735 813367 828289 842284 854708
58960 854708 865724 875593 884339 891932 898150 902231 903184 900499 894268 884764 872410 858072 842781
58947 842781 826963 810407 793133 775842 759266 743459 728120 713353 699777 688021 678462 671248
58935 671248 666147 662373 658997 655660 652626 650079 647741 645416 643548 642804 643206 644054 644703 645120 645578 646132
58919 646132 646529 646512 646094 645589 645340 645294 644959 644098 643344 643698 645390 647781 650581 654581 660765 669107 678761
58902 678761 689156 700357 712527 725615 739527 754116 768958 783554 797790 811884 825937
58891 825937 839941 854204 869337 885766 903638 923137 944379 966886 989635 1011766 1032823
58880 1032823 1052192 1068844 1081947 1091335 1097097 1099085 1097094 1091181 1081539 1068420 1052483 1034781
58868 1034781 1016047 996383 976121 956553 939086 923827 909689 895894 882721 870653 859422
58857 859422 848296 836838 825045 812974 800705 788550 776898 765724 754467 742563 730111
58846 730111 717973 707176 698108 690222 682595 674787 667102 660014 653528 647238 640860 634445 628074 621639
58832 621639 615149 609117 604340 601188 599238 597697 596142 594783 594136 594510 595814 597752 600164 603164 607016
58817 607016 611888 617655 623837 629689 634637 638739 642562 646381 649759 652318 654608 657546 660881 663044
58803 663044 662900 661075 658946 656816 653841 649525 644425 639306 634286 629037 623293 616932 609974 602837
58789 602837 596251 590681 586070 582317 579649 578310 578184 579139 581434 585326 590276 595077 599005 602605 606985
58774 606985 612328 617346 620320 620518 618351 614434 609024 602468 595534 588826 582200 575338 568639 562915
58760 562915 558255 553876 549253 544859 541489 539295 537862 536987 537003 538348 541000 544321 547492 550228 553049
58745 553049 556594 560762 564827 568423 572039 576484 582199 589203 597266 605882 614309 621938 628516 634021
58731 634021 638588 642703 647011 651701 656283 660234 663661 667078 670751 674506 678055 681291 684325 687358
58717 687358 690450 693434 696277 699518 704017 710078 717125 724375 731547 738659 745342 750678 753664 753778
58703 753778 751225 746657 740445 732222 721498 708691 695023 681239 666994 651818 636156 620860
58691 620860 606101 591442 576937 563553 552432 544005 537739 532473 527099 521340 515868 511441 507951
58678 507951 504555 500631 496349 492457 489756 488667 488938 489857 491003 492683 495377 499002 503240 508377 515160
58663 515160 523701 533079 542281 551050 559478 567116 572946 576135 576528 574525 570810 566215 561458 556816
58649 556816 552101 547062 541800 536760 532370 528715 525466 522091 518249 514124 510423 507898 506853 507129
58635 507129 508486 510779 513729 516875 519974 523244 526936 530776 534083 536321 537325 537202 536408 535752 535894
58620 535894 536832 538220 540062 542611 545699 548830 552095 556357 562213 569265 576726 584220 591554 598097
58606 598097 603024 606111 607895 609057 609870 610231 610028 609362 608410 607022 604702 601292 597529 594412 592096
58591 592096 589979 587898 586515 586286 586846 587907 590125 594397 600733 608436 617053 626490 636457 646507
58577 646507 656576 666851 677071 686423 694226 700471 705782 711167 717715 726166 736677 749056 763065
58564 763065 778465 795150 813463 834048 857045 881738 907267 933223 959186 984117 1006751
58553 1006751 1026270 1042085 1053370 1059462 1060555 1057495 1051167 1042653 1033594 1025543 1018894 1012971 1006999
58540 1006999 1000383 992274 981654 967991 951326 931850 910055 887116 864315 842039 820060 798835
58528 798835 779664 763419 749925 738859 730408 724612 720787 718206 716847 716874 717767 718494 718364 717271
58514 717271 715329 712701 709680 706539 703310 699961 696681 693735 691101 688533 686002 683858 682388 681294
58500 681294 679776 677266 674051 671031 668863 667510 666620 665949 665273 664338 663323 663071 664369 667105 670562
58485 670562 674384 678763 683813 689378 695621 703283 713083 725089 738838 753792 769529 785667 801808
58472 801808 817498 832128 844878 854782 860947 862956 861125 856226 848959 839947 830133 820637 812085
58459 812085 804648 798967 796251 796993 800284 805062 811500 820332 831303 843169 854899 865908 875343
58446 875343 882131 885735 886005 882397 874407 862905 850067 837668 826108 815260 805394 796898 789866
58433 789866 784420 780946 779630 780171 782178 785473 789859 795113 801362 809043 818267 828596 839495 850530
58419 850530 861096 870429 877990 883430 886231 885908 882547 876698 868843 859539 849806 840542 831633 822474
58405 822474 813288 804997 797793 790986 784474 779216 775795 773550 771723 770619 770976 772861 775781 779322
58391 779322 783165 786967 790642 794249 797321 799010 799288 799299 800028 801305 802579 803960 805806 807910 809866
58376 809866 811863 814486 817954 822054 826517 831150 835941 841317 847889 855605 863725 871915 880718 890586
58362 890586 901112 911839 923201 936001 950339 965700 981681 997987 1013923 1028490 1040915
58351 1040915 1050826 1058175 1063322 1066850 1069007 1069626 1068880 1067725 1067247 1067926 1069817 1073107 1078172 1085316 1094586
58336 1094586 1105542 1117209 1128824 1140697 1153790 1168411 1184010 1200263 1217411 1235286 1252928
58325 1252928 1269543 1284931 1298582 1309349 1316710 1321594 1325290 1328246 1330487 1332418 1334427 1336393 1338393
58312 1338393 1341382 1346384 1353379 1361603 1370609 1380485 1391407 1403466 1416713 1431001 1446082 1461964
58300 1461964 1478655 1495553 1511860 1527776 1544422 1562345 1580953 1599671 1618564 1637532 1656031
58289 1656031 1674160 1692917 1712848 1733466 1754567 1776915 1800907 1825737 1850717 1876366 1903351
58278 1903351 1931527 1960983 1992942 2028564 2067692 2109719 2154722 2202787 2253177 2305184 2358974
58267 2358974 2414651 2471382 2528364 2585799 2644187 2703688 2764922 2829162 2896806 2966890 3038956
58256 3038956 3113917 3192035 3271652 3351285 3431491 3513244 3595988 3679038 3763629 3851814 3944486
58245 3944486 4042065 4145875 4257038 4375092 4499460 4631254 4771992 4921781 5080523 5249718
58235 5249718 5431157 5624979 5830793 6049638 6283015 6531339 6795328 7077709 7381608
58226 7381608 7708480 8059502 8437619 8846182 9287071 9762294 10276010 10833057 11437297
58217 11437297 12093659 12809918 13594259 14453396 15395790 16434625 17585157 18862134 20283309
58208 20283309 21873383 23661936 25681369 27971631 30585473 33587963 37058374 41101666
58200 41101666 45859940 51515212 58292918 66470252 76367302 88305060 102556595 119330297
58192 119330297 138788150 161077411 186355776 214755199 246178902 279905992 314208357
58185 314208357 346315422 372875912 390723154 397606451 392676463 376656565 351653860
58178 351653860 320613218 286598884 252216049 219362160 189245479 162499534 139304846
58171 139304846 119520577 102821619 88806984 77065679 67215987 58928007 51926800
58164 51926800 45983820 40911495 36561272 32815904 29578438 26767665 24318302 22177260
58156 22177260 20297711 18638472 17166444 15854833 14679405 13619547 12661312 11795305
58148 11795305 11011916 10301293 9656412 9072368 8543095 8061765 7623702 7225752 6863145
58139 6863145 6529617 6220233 5931611 5659894 5401158 5153780 4918307 4695174 4484293
58130 4484293 4286216 4101506 3929199 3767671 3616505 3475743 3343949 3219016 3100454
58121 3100454 2988960 2884140 2784559 2689732 2600151 2515549 2434994 2358559 2287096 2220301 2156616
58110 2156616 2095131 2036110 1979609 1924998 1872047 1821253 1772943 1727018 1683504 1642364 1602941
58099 1602941 1564573 1527516 1492273 1458439 1425429 1393994 1365651 1340702 1318060 1296888 1277121
58088 1277121 1258382 1239712 1220641 1201502 1182446 1163099 1143362 1123674 1104220 1084600 1064514
58077 1064514 1044207 1024152 1004795 986484 969134 952052 934719 917632 901799 887567 874490
58066 874490 862100 850147 838245 826063 813877 802452 792413 784008 777129 771007 764275 755961
58054 755961 746292 736043 725456 714338 702908 691848 681759 672987 665669 659359 653050 646223 639527
58041 639527 633777 628636 623024 616587 610006 603951 598398 592943 587273 581292 575034 568339 560612 551406
58027 551406 541410 532095 524011 516209 507797 499174 491074 483360 475735 468845 463511 459441 455764 452373
58013 452373 449630 447159 444122 440424 436621 432882 429185 426255 425004 424975 424513 422697 420191 417990 416224
57998 416224 414499 412602 410500 408140 405525 402720 399756 396808 394259 392250 390478 388875 388031 388256 388679
57983 388679 388106 386510 384845 383603 382420 381031 379700 378644 377716 376718 375578 374252 372935 372093 371798
57968 371798 371338 370086 368343 366757 365445 364463 364529 366164 368531 370312 371485 373030 375037 376397 376463 375788
57952 375788 374971 373872 372250 370242 367877 364991 361981 359893 359409 360368 362533 366142 371401 377956 385120
57937 385120 392342 399539 407351 416766 427804 438864 448239 456042 463653 471429 478111 482537 484728 484962
57923 484962 482985 478686 472742 466008 458853 451473 444210 437193 430143 422845 415434 408152 401291 395333
57909 395333 390562 386541 382602 378701 375146 371691 367851 363979 360967 358826 356594 353793 351007 348882
57895 348882 347552 347104 347468 347714 346739 345007 344381 345765 348059 349906 351241 352533 353750 354931 356664
57880 356664 359064 361138 362090 362459 363100 363778 363658 362540 360766 358511 355934 353467 351129 348180 344213
57865 344213 340022 336604 333957 331671 330093 329947 331238 333402 336076 338899 341083 342243 343276 345359
57851 345359 348295 350813 352365 353631 355270 357017 358139 358112 356813 354579 352074 349663 347062 344064 341251
57836 341251 339347 338120 336630 334410 331780 329196 327021 325763 325713 326317 326609 326376 326263 326726 327506 328246
57820 328246 328990 329877 330912 332253 334278 337148 340601 344256 347721 350244 350726 348501 344031 338596 333241
57805 333241 328066 322564 316646 311140 307113 304821 303654 302995 302620 302370 302158 302459 304021 306661 309036
57790 309036 310123 310312 310512 310831 310832 310567 310470 310662 311154 312425 314919 318224 321594 325114 329410 334328 338861
57773 338861 342472 345631 348820 351720 353666 354331 353794 352396 350643 348775 346422 343124 339094 334938 330763
57758 330763 326371 322273 319606 318786 318963 319119 319092 319282 320001 321421 323519 325667 326880 326935 326805 327564 329229
57741 329229 330988 332089 332109 330884 328814 326907 325914 325495 324754 323442 322176 321501 321263 321023 320699 320569 320794
57724 320794 321114 321010 320155 318717 317215 316030 315046 313767 311722 308820 305466 302306 299690 297341 294705
57709 294705 291592 288275 284916 281240 276971 272421 268403 265577 263979 263154 262604 262178 262138 262860 264418 266390
57693 266390 268064 268819 268397 266915 264721 262267 260092 258785 258678 259525 260641 261606 262792 265147 269504
57678 269504 276211 285342 297144 312291 331772 356459 386697 422315 463053 508868 559709 614854
57666 614854 672080 727085 773852 806230 819838 812919 786182 742740 688176 629428 572394 520319
57654 520319 474352 434936 402110 375125 352798 334367 319557 307932 298740 291330 285301 280301
57642 280301 276140 273008 271056 269870 268881 268244 268641 270212 272284 274334 276524 278983 281158 282316 282367
57627 282367 281751 280733 279257 277366 275404 273701 272247 270743 268961 267051 265401 264151 262945 261299
57613 261299 259114 256631 254020 251302 248661 246551 245334 244939 244911 244736 244213 243619 243348 243301 242846 241562 239775
57596 239775 238089 236581 234763 232101 228256 223091 216931 210695 205352 201252 198233 196019 194145 191942
57582 191942 189315 187284 186918 187816 188462 188059 187147 186303 185238 183578 181649 179893 178179 176291 174566 173366
57566 173366 172378 171148 169961 169453 169463 169080 167953 166923 167040 168272 169562 170023 169844 169995 171236 173533
57550 173533 176361 179257 181903 183896 184820 184566 183404 181744 180063 178896 178526 178667 178855 179138 180023 181733
57534 181733 183876 185914 187501 188344 188252 187528 186838 186443 185977 185213 184628 184890 186142 188080 190374 192635 194365
57517 194365 195406 196292 197711 199744 201885 203660 204915 205642 205899 205963 206262 207054 208166 208971 208662 206817
57501 206817 203812 200473 197251 193956 190414 187008 184299 182374 180827 179261 177607 176101 175106 174758 174630
57486 174630 174000 172639 171088 169983 169408 169135 169152 169504 169841 169623 168742 167620 166671 165983 165474 165005 164240 162750
57468 162750 160503 158144 156529 155912 155716 155226 154380 153672 153347 153079 152629 152381 152742 153318 153271 152404 151299 150340
57450 150340 149280 147981 147008 147045 148095 149573 150926 151962 152856 154043 155797 157706 158909 159039 158582 158157
57434 158157 157898 157804 158162 159097 160111 160593 160586 160624 160959 161385 161705 161991 162398 162979 163632 164137 164411 164832 165976
57415 165976 167849 169713 170902 171466 171819 172168 172575 173128 173685 173885 173740 173739 173985 173828 172958 172199 172368 172794
57397 172794 172044 170001 168169 167795 168569 169511 170359 171680 174071 177659 182077 186620 190659 194121 197395
57382 197395 200722 203859 206359 207939 208593 208622 208530 208658 208925 209123 209285 209457 209308 208427 206898 205127 203208
57365 203208 201024 198904 197552 197191 197327 197517 197913 198794 200020 201222 202201 202930 203420 203792 204266 205010 206205
57348 206205 208208 211208 214610 217278 218637 219190 219694 220203 220269 219798 219324 219494 220525 222096 223668 224980
57332 224980 226261 227773 229258 230221 230853 232096 234440 237048 238649 239091 239411 240355 241478 242031 242315 243507
57316 243507 246155 249357 251793 253260 254758 257097 259951 262470 264357 265974 267646 269347 270980 272543
57302 272543 274019 275445 277131 279486 282520 285803 288940 291904 294845 297900 301223 304884 308597 311840
57288 311840 314453 316980 320199 324306 328707 332554 335505 338007 340832 344334 348210 352011 355707 359582
57274 359582 363788 368168 372438 376331 379674 382598 385591 389103 393173 397635 402531 408068 414326 421234
57260 421234 428676 436333 443623 450254 456740 464005 472521 482077 492179 502280 511967 521466 531825
57247 531825 543930 557470 571451 585535 599959 614207 626834 637044 645566 653557 661454 669446
57235 669446 678225 688368 699422 710479 721415 732853 745086 757742 770415 782963 795186 806850
57223 806850 818125 829536 841361 853482 865796 878263 890472 901730 911827 921322 930785 940200
57211 940200 949422 958839 968991 979632 989733 998554 1006410 1014230 1022657 1031806 1041593 1051897 1062433
57198 1062433 1072765 1082623 1092137 1101830 1112429 1124472 1137763 1151280 1164027 1176043 1188247 1201290
57186 1201290 1215039 1229255 1244153 1259946 1276353 1293046 1310193 1328066 1346562 1365662 1385974
57175 1385974 1408059 1431524 1455663 1480801 1507994 1537209 1566795 1595193 1622486 1649790 1677735
57164 1677735 1706139 1734802 1763901 1793622 1823754 1853804 1883479 1913124 1943609 1975556 2008743
57153 2008743 2042627 2077411 2114211 2154148 2197663 2244779 2295594 2350362 2409390 2472739 2539542
57142 2539542 2607659 2674739 2739853 2803777 2867706 2932304 2997887 3064580 3131930 3199193 3266526
57131 3266526 3335321 3406922 3481654 3559552 3641277 3727567 3818274 3912788 4011172 4114134 4221957
57120 4221957 4333909 4448596 4564508 4680505 4796519 4914042 5035817 5165022 5304499
57111 5304499 5456132 5620537 5797614 5987705 6192147 6412974 6653158 6917926 7215594
57102 7215594 7556827 7953589 8419391 8970259 9625047 10405046 11333342 12433554 13727710
57093 13727710 15233858 16963863 18921460 21101683 23493228 26082266 28853863 31789866
57085 31789866 34866271 38052299 41310411 44597214 47865439 51060419 54101075 56850625
57077 56850625 59105431 60628613 61219391 60775863 59315163 56951112 53855133 50222400
57069 50222400 46248901 42116482 37983119 33977041 30193945 26697482 23522856 20682012
57061 20682012 18168915 15964899 14044005 12377089 10934127 9685903 8605795 7670579
57053 7670579 6859808 6155313 5541752 5006734 4539512 4129936 3769165 3450595 3169043
57044 3169043 2919310 2696336 2496487 2317706 2158393 2016726 1890947 1779605 1681448 1595628
57034 1595628 1522010 1460773 1411660 1374041 1347679 1333018 1330729 1341111 1363267 1393610 1424583
57023 1424583 1445556 1446151 1419975 1366577 1291033 1201818 1107997 1016870 932948 858133 792502 735228
57011 735228 685397 642306 605186 572954 544524 519186 496457 475713 456272 437801 420381
57000 420381 404223 389436 375952 363502 351854 341204 332087 324673 318426 312791 307954 304552 302916
56987 302916 303063 305254 309890 316823 325227 334165 342754 349684 353220 352158 346610 337653 326471 314058
56973 314058 301439 289663 279449 270983 264137 258853 255338 253959 254997 258519 264413 272373 281806
56960 281806 292067 303107 315709 330570 346958 362503 374417 380787 380844 374648 363056 347743
56948 347743 330699 313472 296987 281966 269204 259328 252527 248609 247188 247790 250055 254148 260847
56935 260847 270942 284519 301011 319848 340636 362392 382818 398680 407129 406740 397637 381091
56923 381091 359117 334165 308633 284320 262085 242000 223888 207818 194079 182721 173295 165147
56911 165147 157880 151463 146009 141614 138272 135729 133477 131075 128538 126262 124644 123831 123768 124318 125393
56896 125393 127109 129766 133604 138746 145538 154618 166343 180333 195964 213109 231930 252017 272133
56883 272133 290701 306076 316529 320797 319041 312850 304141 294421 285107 277771 273545 272663 274954 280504
56869 280504 289525 301954 317633 336641 359199 385527 416080 451491 491765 535582 580568 623837
56857 623837 661962 690946 707136 708514 695237 669492 635279 597688 561258 528620 500901 479160
56845 479160 464787 458646 460566 470040 487046 512004 545304 587043 636943 694413 758654 828467
56833 828467 901303 972253 1034327 1080137 1103793 1102131 1075366 1027219 964050 893150 821133 753117
56821 753117 692542 641293 600073 568878 547286 534712 530742 535207 547729 567523 593998 627350
56809 627350 667862 714513 764573 814262 859035 893288 911137 908762 886204 846831 795384 736674
56797 736674 675306 615484 560562 512778 473230 441862 417754 399913 387898 381654 380974 385433
56785 385433 394687 408449 426229 447372 471232 496735 521483 541572 552793 552381 539971 517247
56773 517247 486917 451888 414924 378481 344422 313781 286876 263582 243454 225837 210262
56762 210262 196788 185646 176439 168106 159960 152498 146775 143086 140496 137679 133925 129398 124803 120952
56748 120952 118418 117265 116989 116783 116022 114647 113186 112337 112431 113238 114187 114679 114313 113114 111623 110516 109974
56731 109974 109600 109063 108578 108468 108532 108251 107582 107166 107650 109071 110991 113025 115075 117197 119399 121484 123035
56714 123035 123663 123345 122552 121971 122093 122944 124108 125027 125454 125595 125775 126007 126072 125968 126023 126502 127301 128117 128772
56695 128772 129259 129647 130087 130731 131487 131912 131550 130419 129096 128326 128550 129627 130938 131838 132197 132481 133225
56678 133225 134495 135953 137311 138484 139327 139522 138925 137981 137585 138380 140147 141980 143166 143840 144669 145925
56662 145925 147138 147723 147678 147499 147673 148474 150049 152336 154960 157497 159793 161808 163320 164198 164895 166152
56646 166152 168092 169998 171129 171399 171095 170385 169392 168450 167882 167664 167502 167108 166262 164901 163376 162333 162075
56629 162075 162285 162611 163152 163963 164424 163711 161869 159883 158690 158438 158646 158645 157887 156354 154799 154230 154972 156363
56611 156363 157380 157338 156144 154337 152912 152651 153395 154198 154261 153535 152488 151651 151414 151875 152758 153716 154697 155689
56593 155689 156209 155631 154097 152654 152227 152823 153792 154491 154601 154301 154301 155231 156847 158330 159462 160852 162773
56576 162773 164592 165813 166893 168281 169339 169213 168455 168725 170868 174171 177613 181064 184970 189637 195348
56561 195348 202673 212016 222904 234160 244839 254703 263686 271154 276064 277929 277351 275369 272529 268995
56547 268995 265284 262179 259733 257093 253709 250162 247322 245196 243160 240869 238235 234883 230555 225965
56533 225965 222375 220147 218425 216451 214543 213363 212731 211678 209578 206869 204650 203695 203768 203802 202812 200635
56517 200635 197852 195169 193066 191798 191399 191578 191820 191601 190534 188567 186234 184457 183760 183788 183827 183642 183600
56500 183600 184129 185358 187039 188576 189384 189565 189942 191063 192423 193089 192756 191741 190299 188649 187375 187057
56484 187057 187592 188485 189617 190988 191918 191524 190060 188923 189062 190162 191552 193061 194644 195975 196953 198005
56468 198005 199399 200768 201677 202169 202398 202262 201815 201491 201472 201342 200816 200303 200239 200353 200209 200070 200549 201639
56450 201639 202712 203374 203792 204311 205159 206415 207853 208956 209484 209880 210727 211961 212991 213481 213623 213744 214018
56433 214018 214470 214978 215301 215363 215340 215282 214918 214142 213383 213105 213198 213333 213604 214261 215029 215368 215379 215758 216742 217695
56413 217695 218024 217998 218339 219305 220488 221310 221476 221106 220643 220526 220837 221341 221900 222661 223707 224772 225527 226103
56395 226103 227050 228677 230647 232398 233888 235610 237750 239670 240628 240885 241587 243411 245766 247544 248318
56380 248318 248425 248260 248019 247993 248524 249525 250437 250934 251383 252423 254158 255986 257114 257183 256446 255501 254863 254712
56362 254712 254989 255661 256786 258299 259853 261028 261726 262253 262913 263656 264298 264995 266178 267902 269556 270490
56346 270490 270834 271433 273040 275673 278726 281517 283750 285580 287223 288625 289698 290865 292889 295980 299451
56331 299451 302558 305305 308083 310950 313839 317077 320974 325029 328270 330382 331900 333344 334738 335984
56317 335984 337073 337859 338222 338471 339068 339933 340606 341009 341409 341748 341874 342391 344264 347379 350484 352922 355461
56300 355461 358990 363290 367693 372124 376821 381698 386636 391778 396949 401450 405056 408677 413294 418761
56286 418761 424314 429800 435720 442503 450352 459408 469414 479576 489314 498834 508587 518743 529636
56273 529636 541975 555950 570838 586278 603200 622560 643838 665938 689003 714146 741709
56262 741709 771114 802424 836907 875939 920202 970007 1025598 1087116 1155012 1230492 1314870
56251 1314870 1408684 1512131 1626021 1751315 1887806 2034190 2189280 2352133 2521048 2693480
56241 2693480 2866949 3038916 3205614 3362082 3503692 3626864 3728229 3804287 3852425 3871557
56231 3871557 3861541 3822877 3757387 3668324 3559233 3433246 3293748 3144879 2990686 2834167
56221 2834167 2677512 2522849 2372416 2228257 2091871 1963794 1843601 1730883 1626169
56212 1626169 1530246 1442720 1362202 1287966 1220347 1159259 1103413 1051579 1003723 960272 921038
56201 921038 885529 853615 825180 799642 776501 755921 738123 722591 708517 695678 684232
56190 684232 673912 664081 654520 645701 638252 632489 628376 625639 623821 622308 620373 617461 613788 610490
56176 610490 608711 608494 608977 609583 610417 611590 612872 614240 616108 618799 622284 626561 631663 637200 642658
56161 642658 648372 655345 663696 672088 679338 686014 693884 704229 717226 732527 749833 769169 791037
56148 791037 816138 844775 876965 913371 955554 1004967 1062223 1127629 1201628 1283874 1372259
56137 1372259 1463571 1554947 1644104 1728438 1804807 1870662 1925418 1970832 2010085 2046078 2079916
56126 2079916 2110657 2136371 2155371 2166765 2170446 2166849 2156568 2140138 2118234 2091607 2060127 2021928
56114 2021928 1974295 1915656 1846483 1768586 1684579 1598139 1513612 1434454 1362300 1297764 1241556
56103 1241556 1194371 1156127 1125689 1101207 1080766 1063259 1048724 1037430 1028762 1021666 1016055 1012749
56091 1012749 1011966 1012876 1014895 1018284 1023032 1028208 1033092 1038063 1043690 1049730 1055721 1061889 1068722 1076204
56077 1076204 1084125 1092600 1101724 1111210 1120956 1131444 1143011 1155188 1167313 1179433 1192204 1206268
56065 1206268 1221927 1238859 1256063 1272811 1289813 1308517 1329051 1349962 1370347 1390946 1412435
56054 1412435 1433965 1454502 1474538 1495153 1516050 1535797 1553723 1570500 1587136 1604298 1622412
56043 1622412 1641625 1661649 1682105 1702973 1724544 1747404 1772644 1801466 1834207 1870287 1909249
56032 1909249 1951134 1995716 2042324 2090665 2140789 2191927 2242539 2292045 2341463 2391884 2443464
56021 2443464 2496379 2551445 2609116 2669079 2731391 2796729 2864901 2934634 3005688 3079745 3158379
56010 3158379 3241542 3328872 3420761 3517156 3617029 3720338 3828915 3944135 4065347 4191967
56000 4191967 4325373 4467141 4617025 4774421 4940400 5116695 5304007 5502894 5714854
55991 5714854 5941108 6181882 6438325 6713311 7008767 7324305 7660267 8020028 8407411
55982 8407411 8824250 9272793 9758148 10285749 10858749 11480704 12158600 12900425 13712224
55973 13712224 14600905 15577931 16657329 17852842 19180912 20664642 22332014 24213752
55965 24213752 26347938 28785645 31590600 34839752 38632602 43101770 48416659 54787717
55957 54787717 62474845 71780382 83011834 96436166 112259182 130634879 151692801
55950 151692801 175572495 202410929 232166768 264233623 297023420 327857097 353357200
55943 353357200 370212514 375998211 369786993 352398709 326196426 294449641 260497486
55936 260497486 227069421 195989467 168224401 144092616 123492274 106094821 91484465
55929 91484465 79237350 68958726 60303640 52986310 46773744 41473070 36926037 33007518
55921 33007518 29618262 26675464 24110002 21866994 19901679 18173854 16648112 15296586
55913 15296586 14097079 13029319 12075536 11222525 10459344 9773805 9153783 8590541 8077977
55904 8077977 7609773 7179746 6783704 6418389 6079640 5763821 5469790 5197138 4943649
55895 4943649 4706695 4485799 4281352 4091822 3914652 3748989 3595177 3452314 3318587
55886 3318587 3193492 3077620 2970717 2871759 2780156 2694817 2612583 2529714 2444795 2358647 2272082
55875 2272082 2185673 2101221 2021235 1946682 1876660 1810161 1746808 1686157 1627837 1572352 1520450
55864 1520450 1471844 1425681 1382100 1342116 1306221 1274098 1245341 1219326 1194843 1171112 1148815
55853 1148815 1128969 1111116 1093787 1076260 1058526 1039990 1019757 998074 976115 954284 931965
55842 931965 908963 886023 863874 842746 822899 804600 787513 770969 754810 739269 724261
55831 724261 709661 696041 684113 673661 663964 655063 647505 640963 634189 626398 617721 608279 597867
55818 597867 586654 575251 563890 552412 541177 531124 522613 514916 507141 499174 491555 484959 479905
55805 479905 476525 474483 473439 473456 474652 476736 479383 482757 487052 491759 496007 499441 502183 504211 505416
55790 505416 506021 506250 505846 504546 502774 501058 499060 495954 491532 486046 479183 470204 459105 446754
55776 446754 433867 420724 408024 397139 389237 384671 383272 384585 387661 391223 394245 395986 395572
55763 395572 392199 385877 377564 368497 359669 351653 344454 337691 331273 325567 320414 314615 307217 298829
55749 298829 290687 282876 274621 266040 258232 251623 245571 239848 235254 232277 230247 228386 226849 226140
55735 226140 226205 226606 226984 226935 226052 224445 222651 220746 218189 214852 211417 208332 205078 201067 196668 192751
55719 192751 189724 187562 186304 185897 185916 186088 186832 188735 191646 194815 197849 201082 204952 209276 213143
55704 213143 215470 215760 214487 212611 210670 208471 205581 201845 197449 192810 188401 184314 180048 175203
55690 175203 170368 166762 164917 164319 164428 165319 166990 168825 170317 171814 173946 176746 179956 183797 188597
55675 188597 193739 197742 199608 199671 198964 198172 197409 196612 195756 194815 193890 193357 193569 194304 194847 194940 195358 197039
55657 197039 199676 201831 202647 202833 203545 204853 205955 206461 206607 206382 205331 203394 201241 199555 198392 197364
55641 197364 195985 193802 190729 187341 184229 181018 176646 170842 164638 159079 154086 149058 144048 139689
55627 139689 136289 133597 131299 129267 127390 125617 124130 123098 122260 121043 119202 117115 115342 113986
55613 113986 112636 110962 109271 108187 107757 107169 105654 103404 101290 99854 99040 98692 98708 98723 98282 97505 97087
55596 97087 97401 97998 98126 97405 95929 94145 92766 92312 92585 92985 93444 94476 96132 97574 98106 98143 98681
55579 98681 100175 102348 104769 107182 109498 111845 114536 117761 121479 125724 130613 135826 140493 143951
55565 143951 146244 147602 147856 146829 144960 142945 140894 138330 134908 130745 126123 121329 116754 112803
55551 112803 109620 107087 105052 103428 102209 101571 101769 102722 103818 104351 104042 103048 101723 100619 100450 101695
55535 101695 104266 107652 111174 114052 115709 116386 117048 118235 119277 119161 117957 116752 116192 115698 114270
55520 114270 111641 108391 105209 102301 99475 96659 94239 92755 92165 91635 90296 88086 85648 83486 81580
55505 81580 79779 78224 77191 76662 76244 75587 74872 74750 75578 76733 77005 75842 74018 72878 73078 74219
55489 74219 75444 76120 76083 75585 75032 74605 74138 73503 73018 73265 74484 76201 77483 77620 76766 75902 75911 76629 77035
55470 77035 76504 75486 74805 74629 74439 73749 72504 70963 69585 68909 69175 70018 70784 71120 71129 71068 71118 71399 71902
55451 71902 72362 72334 71466 69785 67811 66372 66034 66587 67265 67517 67364 67065 66790 66718 67028 67575 67953 68051 68170
55432 68170 68374 68263 67768 67631 68528 70034 71072 71174 70783 70450 70327 70366 70545 70847 71355 72250 73455 74547
55414 74547 75409 76623 78655 80914 82314 82606 82416 82003 80846 78611 75850 73446 71912 71387 71719 72258
55398 72258 72178 71397 70726 70785 71227 71339 70891 69955 68476 66679 65540 66002 67754 69475 70354 70795 71432 72111
55380 72111 72307 72166 72428 73341 74147 73991 73012 72185 72084 72220 71774 70755 70104 70664 72220 73626 73766 72414
55362 72414 70273 68327 67154 66766 66943 67520 68372 69316 70165 70789 71130 71268 71486 72059 72897 73607 73945 73949 73555
55343 73555 72444 70530 68309 66444 65237 64742 65067 66119 67319 68026 68212 68309 68505 68575 68313 67704 66766
55326 66766 65649 64830 64731 65124 65415 65486 65748 66312 66703 66676 66752 67559 68986 70352 71167 71347 70934 70013 68881
55307 68881 67978 67569 67597 67857 68218 68673 69243 69846 70293 70421 70162 69550 68887 68878 70190 72479 74303 74556 73817
55288 73817 73676 74791 76301 77184 77405 77466 77516 77466 77466 77701 77964 77916 77561 77053 76211 74711 72690 70814 69717
55269 69717 69589 70188 71017 71625 72014 72633 73736 74915 75585 75761 75990 76585 77376 78221 79330 80802 82137
55252 82137 82476 81324 79002 76435 74558 73763 73818 74252 74742 75151 75366 75326 75169 75200 75654 76535 77611 78484
55234 78484 78833 78724 78592 78705 78806 78489 77853 77380 77185 76799 75839 74580 73566 72978 72712 72862 73635 74788
55216 74788 75646 75836 75651 75470 75201 74621 73993 73840 74184 74494 74465 74449 74919 75847 76849 77705 78458 79170 79830
55197 79830 80440 80965 81279 81333 81307 81455 81866 82430 82933 83085 82682 81868 81061 80460 79878 79243 78958 79436 80551
55178 80551 81888 83322 84854 86096 86477 85928 84860 83519 81931 80489 79881 80179 80577 80422 80051 80170
55162 80170 80788 81304 81439 81550 82052 82947 83966 84874 85467 85558 85187 84785 84892 85595 86300 86275 85479 84740 84923
55143 84923 86018 87200 87668 87264 86435 85868 86063 86905 87631 87543 86759 85971 85501 85031 84299 83576 83211 83087 82863
55124 82863 82517 82383 82771 83649 84578 84911 84304 83117 82039 81318 80729 80320 80569 81527 82371 82331 81716 81450 81864
55105 81864 82558 83339 84601 86624 88999 91030 92402 93177 93417 93189 92878 93137 94224 95539 96106 95669 95056
55088 95056 95309 96598 98261 99724 100904 101770 102053 101668 101065 100835 101125 101626 101978 102028 101824 101490 101004 100138
55070 100138 98851 97664 97224 97462 97670 97564 97733 98696 100041 100856 100700 99740 98353 97078 96572 97000 97605
55053 97605 97428 96358 95057 94031 93293 92850 92899 93430 94052 94351 94151 93506 92762 92528 93104 93970 94349 94336 94892
55034 94892 96538 98550 99840 100236 100386 100593 100351 99174 97476 96279 96139 96676 97206 97520 97814 98152 98368
55017 98368 98395 98290 97923 97148 96344 96225 96852 97365 97085 96416 96201 96559 96956 97110 97147 97020 96491 95752 95474 96055
54997 96055 97167 98175 98697 98724 98465 98197 98059 98068 98433 99604 101631 103715 104949 105348 105657 106211 106627 106681
54979 106681 106777 107330 108151 108783 109075 109196 109360 109719 110252 110604 110355 109635 109146 109384 110052 110433 110127 109287 108372
54960 108372 107823 107783 107958 107902 107534 107328 107885 109395 111413 113074 113673 113255 112498 111931 111479 110943 110494 110271
54942 110271 109982 109506 109428 110142 110789 110174 108591 107524 107439 107219 106232 105538 106222 107686 108752 109598 111319 114054
54924 114054 116873 119337 121989 125284 129050 133075 137334 141491 145085 148438 152539 157718 163141 167925
54910 167925 171986 175330 177233 176873 174383 170638 166232 161250 155893 150699 146082 142084 138676 135910
54896 135910 133654 131485 129067 126500 124113 122114 120561 119543 119109 119083 119251 119757 120997 122928 124744
54881 124744 125646 125833 126429 128374 131647 135546 139343 142625 145435 148378 152282 157374 162958 168120 172531
54866 172531 176242 178986 180177 179543 177307 173722 168862 162991 156756 150804 145419 140693 136752 133652
54852 133652 131262 129466 128253 127369 126045 123498 119775 115878 112896 111095 109926 108726 107268 105669
54838 105669 104065 102505 101139 100280 100184 100738 101426 101684 101369 100939 101107 102253 104086 105861 106937 107214 107149
54821 107149 107333 107920 108491 108614 108433 108411 108496 108028 106769 105535 105316 106047 106828 107197 107506 108074 108687 109161 109722
54802 109722 110488 111100 111267 111262 111451 111690 111658 111471 111495 111757 112004 112193 112498 112946 113441 114056 114911 115861 116675 117369
54782 117369 117979 118174 117630 116796 116632 117428 118402 118775 118885 119787 121895 124465 126508 127965 129713 132442 135875
54765 135875 139348 142931 147436 153245 159718 166027 172050 177958 183438 188006 191727 194782 196473 195629
54751 195629 192196 187569 182994 178282 172593 165912 159176 153310 148663 145139 142310 139496 136247 132845
54737 132845 130010 128113 126884 125886 124996 124377 124150 124189 124240 124293 124793 126273 128709 131485 134137 136893 140261
54720 140261 144276 148505 152683 157017 161826 167080 172315 176809 179935 181525 181927 181541 180288 177695 173473
54705 173473 167885 161582 155273 149492 144442 139944 135699 131681 128238 125769 124401 123956 124044 124171 123932
54690 123932 123239 122278 121166 119775 117980 115993 114302 113301 113051 113337 113875 114480 115138 115905 116718 117376 117766
54673 117766 118001 118144 117892 116847 115163 113664 113085 113301 113512 113140 112356 111733 111530 111434 111001 110326 110144 111032
54655 111032 112572 113677 113889 113927 114598 115571 115832 115140 114271 113779 113324 112504 111621 111133 110889 110513 110127 110127 110452
54636 110452 110695 110789 110977 111215 111139 110668 110162 110006 110426 111613 113463 115161 115667 114838 113662 113140 113354 113778
54618 113778 114113 114450 114907 115462 116106 116953 118165 119694 121060 121611 121239 120595 120275 120034 119328 118391 117993 118222
54600 118222 118370 118144 118066 118374 118385 117577 116503 115946 115792 115492 115140 115203 115534 115575 115405 115731 116806 118100 119093
54581 119093 119775 120226 120290 119829 118873 117519 116113 115435 116053 117429 118320 118236 117888 117968 118160 117775 116804 115822 115190
54562 115190 114881 114917 115474 116546 117842 119089 120255 121432 122545 123256 123259 122757 122460 122813 123415 123589 123413 123596
54544 123596 124369 125191 125739 126418 127435 128066 127608 126663 126662 128162 130286 131841 132380 132127 131450 130732 130298 130143
54526 130143 129853 129003 127537 125735 124048 122942 122612 122720 122711 122475 122471 122986 123603 123710 123338 123080 123178 123096 122206
54507 122206 120695 119513 119471 120556 122151 123665 124798 125381 125279 124527 123434 122418 121779 121566 121515 121139 120118
54490 120118 118704 117630 117504 118402 120011 121893 123455 124084 123698 123058 123115 124027 125098 125688 125902 126331 127381
54473 127381 128974 130684 132017 132685 132750 132536 132409 132610 133149 133727 133888 133510 133007 132825 132853 132662 132207 131847
54455 131847 131693 131477 131207 131365 132093 132644 132174 130839 129646 129296 129574 129795 129473 128595 127593 127016 126941 126807
54437 126807 126126 125268 125080 125809 126924 128037 129365 131048 132574 133353 133476 133415 133252 132725 131911 131287 131101
54420 131101 131136 131198 131433 131992 132736 133395 133762 133654 133038 132411 132624 133968 135733 137036 137878 138883 140209 141365
54402 141365 142129 142967 144209 145343 145641 145126 144423 143893 143485 143392 144131 145786 147679 149124 150145 151095 151858
54385 151858 151914 151135 150098 149513 149550 149844 149949 149672 149112 148555 148332 148665 149484 150349 150723 150500 150245 150676 151872
54366 151872 153224 154237 155041 155948 156791 157105 156803 156320 156116 156384 157259 158958 161574 164814 168026 170477
54350 170477 171862 172811 174643 178163 182746 187027 190413 193322 195917 197303 196485 193622 189851 186142 182805
54335 182805 179835 177125 174330 171073 167490 164272 161990 160544 159404 158223 157146 156549 156539 156717 156508
54320 156508 155757 154887 154415 154389 154389 153959 153010 151935 151376 151579 151921 151398 149774 147913 146690 145916 144784 143051
54302 143051 141261 139903 138975 138382 138262 138725 139614 140665 141657 142351 142526 142101 141070 139478 137775 136977 137842
54285 137842 139934 141988 143273 144069 144792 145396 145835 146397 147131 147544 147384 147266 147877 148951 149611 149525 149160 149087
54267 149087 149533 150505 151755 152681 152723 151960 150985 150292 150125 150708 152061 153609 154532 154649 154494 154475 154454 154320 154427
54248 154427 155093 155981 156396 156036 155231 154541 154272 154295 154214 153766 153085 152424 151687 150544 149077 147985 147898 148679 149598
54229 149598 150051 149944 149551 149211 149131 149322 149674 150073 150359 150333 150034 149951 150617 151908 153044 153452 153361 153386 153828 154566
54209 154566 155385 156119 156615 156779 156555 155813 154479 152946 151972 151922 152372 152729 152895 153010 152961 152647 152400 152483 152393
54190 152393 151433 149905 148916 148871 148941 148348 147434 146984 147145 147603 148359 149528 150663 151036 150601 150063 149946 150130
54172 150130 150382 150767 151375 152046 152601 153003 153142 152804 152095 151546 151507 151722 151793 151813 152170 152911 153672 154183 154455 154448
54152 154448 153910 152726 151246 150089 149629 149672 149589 148869 147683 146827 147010 148213 149849 151361 152471 153035 153074
54135 153074 152961 153209 153922 154753 155445 156108 156795 157193 157061 156723 156768 157389 158378 159605 161064 162423 163037 162713
54117 162713 162206 162566 164003 165650 166518 166515 166360 166555 166697 165991 164355 162717 162091 162542 163302 163709 163778 163848 163970
54098 163970 163811 163021 161615 160069 159067 159016 159714 160560 161164 161658 162384 163399 164385 164977 165093 164978 165016 165496
54080 165496 166478 167796 169138 170151 170654 170878 171440 172892 175245 178022 180761 183294 185578 187536 189197
54065 189197 190772 192390 193944 195431 197310 200202 204254 209004 213973 219193 225170 232494 241440 251612
54051 251612 261779 270332 276139 278993 279185 277015 273000 268254 264061 261002 258933 257921 258645 261486
54037 261486 265721 270230 274812 280177 286637 293526 300079 306218 312050 317169 321149 324393 327722 331203
54023 331203 334101 336127 338010 340449 342994 344438 344055 342053 339042 335519 331738 327693 323129 317882
54009 317882 312159 306274 300135 293387 286109 279021 272774 267282 261938 256380 250866 245932 241873 238519
53995 238519 235442 232337 229207 226233 223563 221333 219742 218869 218433 217981 217405 217036 217108 217308 217055 216054
53979 216054 214410 212384 210255 208309 206675 205227 203886 202953 202804 203259 203615 203487 203317 203860 205360 207462
53963 207462 209706 211817 213623 215054 216325 217874 220065 223020 226712 230993 235575 240235 245094 250476
53949 250476 256379 262336 267896 273027 277777 281804 284568 285999 286736 287675 289453 292259 295821 299486 302599
53934 302599 304956 306827 308536 310273 312346 315212 318968 323096 327151 331553 337233 344445 352385 360169
53920 360169 367788 375826 384564 393816 403516 414010 425657 438426 451985 465961 480042 494058
53908 494058 508043 522041 535756 548672 560694 572412 584364 596081 606015 612301 613470 608710
53896 608710 598025 582351 563304 542529 521213 500024 479278 459109 439690 421286 404126
53885 404126 388290 373934 361418 350920 342080 334365 327673 322031 316768 310734 303614 296435 290457
53872 290457 285982 282570 279730 276848 273035 267932 262389 257581 253594 249690 245766 242554 240276 238127
53858 238127 235487 232827 230853 229442 228090 226885 226275 226109 225610 224267 222306 220332 218868 218109 217791
53843 217791 217374 216658 216059 215999 216260 216384 216471 217062 218255 219486 220248 220567 220714 220843 221056 221448 221924 222279 222521
53824 222521 222855 223266 223451 223324 223262 223687 224593 225624 226402 226745 226867 227504 229477 232862 236831 240565 244092
53807 244092 247922 252139 256325 260369 264844 270383 276933 283919 291000 298331 305999 313504 320090 325521
53793 325521 330180 334387 337970 340718 342811 344453 345374 345291 344679 344463 344838 344963 343965 341750 338661 334873
53777 334873 330399 325248 319254 312221 304602 297489 291384 285453 278681 271470 265300 260949 257766 254712
53763 254712 251364 247772 244065 240510 237439 234704 231690 228205 225013 223062 222432 222364 222090 221298 219998
53748 219998 218388 216830 215654 214928 214505 214210 213870 213321 212570 211921 211835 212699 214636 217221 219393 220221 220051
53731 220051 220406 222314 225044 227031 227695 227716 227790 228011 228536 229909 232249 234780 236702 238119 239627 241379
53715 241379 243119 244812 246541 247918 248324 247821 247282 247429 248204 249311 250870 253217 256362 259998 263843
53700 263843 267669 271262 274675 278343 282549 286883 290571 293241 294987 295826 295683 294967 294614 295245 296671
53685 296671 298362 299949 300989 300875 299598 298185 297645 297655 296989 295171 292902 290791 288577 286012 283698
53670 283698 282400 282012 281929 282060 282714 283664 284098 283633 282718 281900 281240 280623 280096 279573 278676 277342 276281 276332
53652 276332 277399 278443 278557 277850 277205 277412 278585 280295 282024 283469 284556 285456 286685 288882 292091
53637 292091 295304 297167 297340 296897 297224 298691 300549 301901 302525 302936 303825 305427 307292 308846 310235 312397
53621 312397 316043 320824 325733 330171 334240 338161 341862 345213 348337 351549 355189 359590 364932 370946
53607 370946 376907 382098 386307 389828 393061 396209 399311 402495 405970 409697 413178 415896 417999 420196
53593 420196 422810 425316 427107 428403 429840 431293 431689 430100 426602 421951 416846 411678 406676 401930
53579 401930 397400 393010 388712 384476 380423 376924 374216 371967 369639 367334 365748 365101 364655 363714 362612
53564 362612 362192 362585 363106 363212 363006 362808 362806 363202 364232 365767 367231 368146 368624 369209 370398 372411 375214
53547 375214 378541 381968 385085 387679 389890 392253 395461 399816 404943 410282 415884 422395 430201 438847
53533 438847 447512 455864 464234 473095 482622 492791 503653 515358 527938 541146 554615 568181
53521 568181 582053 596595 611977 628112 644892 662429 681014 700961 722433 745320 769180
53510 769180 793441 817846 842711 868607 895657 923182 950138 975927 1000612 1024369 1047086
53499 1047086 1068766 1090016 1111558 1133207 1153868 1172763 1190228 1207061 1223578 1239860 1256484
53488 1256484 1274298 1293466 1313306 1333115 1352694 1372030 1390976 1409378 1427025 1443289 1457229
53477 1457229 1468345 1476911 1483397 1487980 1490769 1491962 1491336 1488026 1481384 1471818 1460267 1447107 1432200
53464 1432200 1415880 1399072 1382258 1365022 1347007 1328747 1310970 1293341 1274554 1253698 1231088
53453 1231088 1207653 1183995 1160350 1137171 1115190 1094831 1075863 1057842 1040710 1024760 1010172
53442 1010172 996921 985196 975550 968348 963195 959158 955653 952911 951502 951570 952710 954542 957151 960881
53428 960881 965882 972111 979714 989047 1000202 1012699 1025920 1039758 1054651 1071045 1089051 1108604
53416 1108604 1129736 1152685 1177842 1205587 1235949 1268463 1302529 1337884 1374552 1412472 1451574
53405 1451574 1492226 1535137 1580594 1628076 1676834 1726598 1777571 1830029 1884162 1940012 1997205
53394 1997205 2054927 2112500 2169884 2227367 2284877 2341889 2397917 2452772 2506326 2558207 2607741
53383 2607741 2654131 2696768 2735521 2770569 2801862 2828885 2851043 2868004 2879587 2885700 2886648 2883062
53371 2883062 2875028 2861610 2841706 2815175 2782611 2744338 2700369 2651291 2598516 2543592 2487774
53360 2487774 2432102 2377088 2322298 2267085 2211932 2158257 2106635 2056193 2006313 1957971 1912494
53349 1912494 1869594 1827565 1785061 1741784 1697771 1653162 1608764 1565917 1525424 1487212 1451227
53338 1451227 1417972 1387820 1360345 1334823 1311047 1289255 1269494 1251413 1234540 1218431 1202672
53327 1202672 1187062 1171750 1156905 1142280 1127417 1112460 1098533 1086991 1078194 1071193 1064752 1058602
53315 1058602 1053500 1050263 1049066 1049747 1052303 1056778 1062969 1070556 1079362 1089252 1099985 1111556 1124533
53302 1124533 1139660 1157192 1176867 1198342 1221260 1245097 1269524 1294898 1321871 1350475 1380020
53291 1380020 1409868 1439742 1469194 1497442 1524003 1548939 1572182 1593113 1611240 1626853 1640545
53280 1640545 1652313 1661455 1667088 1668508 1665451 1658485 1648858 1637522 1624497 1609481 1592655 1574390
53268 1574390 1554483 1532394 1508102 1482131 1454880 1426573 1397824 1369431 1341383 1312712 1282741
53257 1282741 1252037 1221794 1192607 1164203 1136144 1108382 1081122 1054349 1027638 1000519 973097
53246 973097 946089 919971 894324 868465 842617 817863 794825 772975 751532 730580 710996
53235 710996 693597 678692 666121 655316 645508 636236 627484 619129 610517 600940 590380 579401 568367
53222 568367 557065 545029 532047 518370 504587 491177 478127 465216 452794 441817 432746 424783
53210 424783 416689 408158 399834 392204 385150 378604 372888 368047 363399 358206 352569 347233 342604 338279
53196 338279 333624 328540 323506 318898 314480 309817 305110 301262 298910 297647 296474 294763 292515 289934
53182 289934 287305 285128 283797 283032 282107 280701 279185 277996 277159 276430 275464 273817 271368 268909 267698
53167 267698 268043 268869 268981 268263 267286 266363 265573 265175 265232 265124 264176 262635 261377 260783 260515 260194 259626 258493
53149 258493 256678 254872 254008 253969 253689 252724 251805 251531 251502 251328 251557 252746 254288 255159 255351 255600 256038 256238
53131 256238 256401 257247 258539 258938 257821 256309 255806 256252 256589 256400 256191 256333 256591 256735 256936 257389 258050 258864
53113 258864 259863 260947 261897 262725 263669 264703 265407 265472 265021 264247 263017 261158 258944 256977 255623 254782 254169
53096 254169 253593 252982 252353 251849 251556 251197 250145 247983 245084 242476 241035 240834 241305 241917 242561 243351 244323
53079 244323 245406 246505 247487 248228 248789 249321 249663 249331 248213 247016 246539 246665 246657 246438 246834 248232 249639
53062 249639 249659 248054 245860 244159 243318 243237 243710 244412 244952 245180 245190 245052 244831 244887 245744 247513 249715 251758
53044 251758 253338 254347 254745 254702 254507 254118 253096 251263 249161 247513 246375 245206 243723 242323 241566 241501
53028 241501 241699 241822 241955 242327 242810 242896 242304 241484 241320 242285 243981 245525 246287 246266 245973 245911 246044 245819 244935
53009 244935 243990 243998 245185 246716 247729 248233 248724 249345 249873 250219 250475 250644 250855 251670 253550 255912 257339
52992 257339 257026 255744 255069 255858 257667 259414 260325 260345 259989 259930 260600 262037 263956 265921 267547 268663 269291
52975 269291 269489 269344 269243 269928 271956 275096 278433 281116 282832 283731 284206 284737 285552 286285 286282 285409 284278
52958 284278 283463 282779 281615 279782 277701 275862 274451 273476 272816 272026 270411 267671 264391 261625 259906
52943 259906 258830 257718 256492 255692 255700 256233 256708 256826 256600 256016 255028 253823 252734 251828 250898 249923 249237 249046
52925 249046 249038 248709 247933 246961 246017 245149 244424 244007 243976 244182 244341 244203 243722 243149 242857 242880 242752 242020 240843 239823
52905 239823 239206 238600 237626 236604 236309 237137 238718 240333 241517 242259 242806 243404 244162 245050 245991 246918 247719
52888 247719 248189 248183 247892 247875 248642 250216 252125 253794 254856 255189 254922 254440 254113 253836 253044 251500 249957 249674
52870 249674 251135 253525 255609 256911 257793 258598 259210 259501 259788 260439 261221 261491 261112 260796 261252 262261 262943
52853 262943 262756 261860 260549 258876 256889 254686 251940 247969 242793 237762 234454 233048 232414 231662 230909
52838 230909 230496 230265 229935 229540 229057 228130 226719 225547 225340 225911 226589 227315 228621 230623 232701 234262 235191
52821 235191 235392 234530 232592 230327 228684 227991 227950 228225 228693 229241 229686 229944 230115 230375 230940 232107 234176
52804 234176 237179 240708 244069 246650 248135 248393 247300 244887 241660 238464 235821 233593 231516 229804
52790 229804 228826 228358 227737 226823 226289 226752 228051 229604 231065 232254 232861 232716 232179 231859 232057 232833 234333
52773 234333 236549 238859 240393 240878 240660 239904 238418 236445 234911 234392 234293 233614 232304 231248 231084 231564
52757 231564 232122 232509 232690 232567 232145 231755 231817 232452 233495 234743 236040 237194 238073 238829 239880 241577 243895
52740 243895 246429 248674 250348 251548 252643 253936 255392 256677 257511 258028 258714 259911 261438 262846 264013
52725 264013 265221 266543 267450 267305 266061 264194 262091 259957 258191 257307 257265 257362 257015 256301 255481 254443 253086
52708 253086 251885 251491 251867 252325 252397 252210 252000 251774 251582 251700 252328 253338 254464 255479 256082 255975 255254 254509
52690 254509 254341 254858 255708 256341 256289 255471 254401 253765 253697 253769 253810 254231 255210 256045 255848 254696 253568 253229 253598
52671 253598 254153 254497 254449 254012 253408 252944 252748 252799 253157 253855 254609 254937 254688 254214 253960 254104 254631 255486 256536
52652 256536 257664 259006 260905 263455 266221 268512 269810 269918 268935 267235 265321 263489 261718 259957 258394
52637 258394 257339 256956 257187 257844 258718 259685 260733 261858 262993 264251 266213 269574 274309 279365 283394
52622 283394 285675 286207 285143 282557 278781 274648 271146 268800 267449 266595 265950 265627 265854 266594 267538 268322
52606 268322 268661 268379 267537 266539 265852 265568 265434 265301 265313 265578 265974 266402 266981 267743 268385 268566 268345 268051 267854
52587 267854 267668 267454 267368 267656 268503 269894 271480 272729 273431 273959 274805 276015 277237 278188 278737 278749 278316 278055
52569 278055 278595 279582 279766 278446 276471 275343 275473 275778 274969 272851 270310 268393 267563 267650 268201 268818 269237
52552 269237 269210 268534 267333 266220 265920 266651 267987 269319 270287 270772 270717 270160 269252 268092 266682 265227 264306
52535 264306 264374 265102 265531 265090 264287 264215 265489 267746 270021 271474 271885 271657 271360 271234 271170 271128 271289 271717 272108
52516 272108 272187 272184 272730 274333 277096 280700 284433 287536 289971 292659 296433 300848 304524 306667 307614 307845
52500 307845 307203 305437 302820 299717 296054 291819 287696 284490 282148 280003 277899 276343 275545 275016 274346
52485 274346 273773 273647 273770 273712 273502 273582 274173 275023 275803 276480 277204 277973 278597 279071 279874 281666 284573 287963
52467 287963 291080 293733 296161 298427 300373 302086 303980 306300 308849 311311 313499 315156 315862 315360 313772
52452 313772 311326 308153 304513 300955 297921 295274 292486 289242 285705 282317 279522 277596 276473 275753
52438 275753 275025 274207 273494 272986 272492 271720 270618 269540 269080 269646 271131 273000 274648 275668 275977 275883 275983
52421 275983 276652 277635 278403 278893 279581 280811 282472 284476 287059 290311 293852 297390 301270 305989 311479
52406 311479 317467 324362 333025 343433 354145 363400 370344 374923 376960 375936 371705 365025 357160 349091
52392 349091 341273 334058 328015 323593 320580 318243 316085 314246 313057 312516 312422 312777 313722 315229 317178
52377 317178 319587 322436 325380 328038 330546 333439 336951 340842 344954 349475 354447 359411 363804 367477
52363 367477 370570 373071 374763 375530 375555 375252 374991 374747 374001 372287 369948 368059 367398 367761 368533 369687 371800
52346 371800 375186 379398 383647 387509 391105 394747 398532 402346 406229 410629 416075 422609 429795 437402
52332 437402 445839 455721 467239 480178 494415 510086 527297 545913 565626 586098 606982 627937
52320 627937 648644 668830 688399 707540 726461 744920 762323 778445 793788 808928 823832
52309 823832 838213 852303 866629 881061 894694 906863 917797 927969 937245 945125 951579 957189
52297 957189 962442 967234 971147 973923 975400 975144 972472 967096 959663 951396 943171 935129 927173 919425
52283 919425 912003 904864 898387 893848 892522 894325 898022 902857 909288 917813 927850 938454 949628
52270 949628 962113 976050 990576 1004763 1018411 1031750 1044917 1057883 1070597 1082997 1095056
52259 1095056 1106831 1118237 1128878 1138491 1147510 1156704 1166128 1174958 1182598 1189456 1196205 1202650 1207733
52246 1207733 1210486 1210571 1208146 1203695 1197990 1191734 1185229 1178579 1172145 1166350 1161095 1155803 1150213 1144765
52232 1144765 1140063 1136293 1133367 1131334 1130349 1130321 1130849 1131459 1131887 1132285 1133247 1135392 1138768 1142825 1147093 1151656
52216 1151656 1156810 1162588 1168915 1175982 1184025 1192804 1201706 1210397 1219079 1228148 1237813 1247956 1257941 1266681
52202 1266681 1273416 1278536 1283243 1288274 1293397 1298248 1303055 1308162 1313356 1318254 1323055 1328278 1333876 1339183
52188 1339183 1343684 1347390 1350427 1352781 1354467 1355451 1355220 1352946 1348403 1342346 1335643 1328301 1319733 1309780
52174 1309780 1299098 1288578 1278734 1269623 1261117 1253210 1246279 1240981 1237652 1235802 1234477 1233212 1232428 1232825
52160 1232825 1234620 1237466 1240840 1244230 1247104 1249111 1250368 1251275 1251900 1251702 1250037 1246909 1243093 1239497 1236455
52145 1236455 1233623 1230535 1227257 1224417 1222481 1221078 1219292 1216642 1213537 1210649 1208238 1206417 1205696 1206663
52131 1206663 1209260 1213020 1218116 1225548 1236039 1249333 1264916 1282845 1303341 1326011 1350212 1375935
52119 1375935 1403624 1433127 1463461 1493655 1523287 1552056 1579393 1604651 1627339 1647059 1663655
52108 1663655 1677562 1689563 1700009 1708605 1715003 1719071 1720519 1719037 1715234 1710804 1707119 1704123 1701155
52095 1701155 1698357 1696366 1694884 1692621 1688772 1683712 1677870 1670712 1661415 1650124 1637916 1625705 1613774
52082 1613774 1602365 1592227 1584309 1579131 1576699 1576900 1579715 1584976 1592156 1600607 1609975 1620244 1631463
52069 1631463 1643683 1657168 1672269 1688817 1705826 1722052 1736744 1749729 1760952 1770253 1777531 1782861
52057 1782861 1786410 1788333 1788645 1787114 1783486 1778012 1771543 1764758 1757473 1749008 1739003 1727419 1713920
52044 1713920 1697939 1679515 1659457 1638484 1616643 1593942 1571107 1549221 1528828 1509822 1492097
52033 1492097 1475904 1461579 1449328 1439295 1431508 1425510 1420278 1414774 1408632 1402216 1396042 1390164 1384063
52020 1384063 1376956 1368195 1357656 1345974 1334284 1323354 1312879 1301911 1290057 1277885 1265924 1253621
52008 1253621 1239689 1223285 1204482 1183794 1161802 1139222 1116801 1094893 1073347 1051859 1030130
51997 1030130 1007771 984526 960791 937610 915966 896270 878578 862972 849556 838266 828699
51986 828699 819941 810767 800535 789906 780057 771088 761789 751166 739454 727284 714654 701336
51974 701336 687653 674027 660262 646257 633098 622386 614410 607979 602294 598080 596457 597444 600194
51961 600194 604214 609639 616590 624832 633977 643458 652224 658933 662740 663828 662984 660680 656681 650607
51947 650607 642786 634426 626880 620893 616691 614560 614948 618009 623405 630750 640002 651185 663842 676953
51933 676953 689376 700373 709795 717738 723908 727326 726871 722212 714035 703294 690515 675941 660044
51920 660044 643498 626743 609967 593553 578211 564561 552802 542902 534875 528689 524178 521429
51908 521429 521100 523848 529330 536270 543818 552518 563471 576759 591148 605177 617971 628999 637774
51895 637774 644066 647861 648707 645578 637916 626477 612659 597251 580401 562552 544776 528228 513801
51882 513801 502225 493803 487978 483801 481052 480403 482314 486341 491785 498383 505962 513901 521495 528527
51868 528527 535013 540671 545112 548306 550330 550820 549218 545474 540067 533537 526455 519747 514309 510264
51854 510264 507240 505512 506119 509452 514354 519171 523277 526954 530111 531908 531706 529752 526709 522908 518282
51839 518282 512724 506238 498985 491440 484335 478231 473183 468934 465338 462517 460761 460417 461647 464073
51825 464073 466780 468945 470389 471295 471511 470490 467940 464199 459907 455621 451837 448994 447148 445842 444609
51810 444609 443517 443026 443453 444816 447074 450153 453669 456880 459057 459872 459427 458007 455808 452812 449004
51795 449004 444765 440942 438252 436613 435221 433326 430747 427664 424154 420211 416131 412607 410196 408763
51781 408763 407661 406600 406120 406908 408740 410514 411449 411865 412613 414065 416012 418220 420663 423392 426632
51766 426632 430997 437123 445011 454081 463889 474476 485871 497515 508308 517064 522892 525429 524834
51753 524834 521486 515715 507913 498776 489185 479869 471343 463924 457535 451696 446217 441805 439424 439128
51739 439128 440078 441684 444119 447714 452576 459026 467601 478122 489297 499698 508605 515553 519854 521393
51725 521393 521465 521887 523349 525169 526338 526089 523705 518757 511763 504008 496555 489871 484314 480168 477001
51710 477001 473693 469499 464648 459681 454821 450407 447378 446673 448267 451302 455043 459295 463911 468329
51696 468329 471726 473496 473594 472606 471465 470963 471438 472850 474952 477215 478750 478628 476374 472139 466408 459653
51680 459653 452327 445093 438869 434465 432085 431360 431968 434034 437739 442776 448572 454989 462277 470295 478413
51665 478413 486468 495230 505182 515084 522474 525770 525377 522622 518196 512058 504479 496536 489542 484401
51651 484401 481590 481377 483787 488468 494777 501864 508514 513138 514328 511677 505942 498390 490064 481598
51637 481598 473381 465598 458173 450917 443806 437079 431105 426235 422642 420144 418179 416157 413917 411760
51623 411760 410078 409083 408822 409236 410004 410487 410120 408946 407643 406906 406794 406735 406133 404910 403527 402577 402405
51606 402405 402916 403633 404088 404307 404868 406315 408715 411970 416374 422322 429519 437051 444477 452392 461500
51591 461500 471467 481060 489127 494955 497891 497348 493469 487433 480857 474966 470298 466913 464751 463977 465090
51576 465090 468694 475193 484733 497210 512083 528419 545470 563231 582221 602792 624932 648492
51564 648492 673134 698161 722959 747738 773452 800978 830875 864008 901639 944287 990631
51553 990631 1037697 1081878 1119706 1148310 1165831 1171503 1165319 1147934 1120947 1086597 1046710 1002293
51541 1002293 954591 906010 859216 815509 774774 736911 702475 671872 644766 620685 599682
51530 599682 581916 566934 553769 541587 530001 519007 508862 499860 491935 484649 477723 471349
51518 471349 465768 460764 455902 451096 446634 442789 439790 438053 437946 439138 440556 441247 441143 440849 440920 441506
51502 441506 442480 443595 444568 445272 445856 446525 447191 447520 447275 446412 444963 443142 441633 441282 442139 443053 442685
51485 442685 440904 438821 437399 436400 434831 432050 428131 423411 418145 412672 407438 402533 397435 391594
51471 391594 385325 379769 375748 372864 370070 367000 364321 362668 361702 360571 359036 357613 356724 356207 355769
51456 355769 355492 355651 356343 357569 359399 361828 364648 367803 371752 377165 384226 392523 401626 411573 422745
51441 422745 435451 449641 464794 479902 493687 504987 512977 517177 517521 514646 510003 505358 501836
51428 501836 499305 496605 492436 486157 477957 468574 458959 450044 442441 436199 430930 426301 422310 419068
51414 419068 416488 414367 412665 411577 411377 412360 414765 418553 423224 428112 432858 437444 441766 445442 448206
51399 448206 450282 452175 454231 456599 459495 463198 467781 473094 479104 486062 494243 503708 514480 526816
51385 526816 541145 557901 577676 601396 630012 663975 703244 747822 797946 853665 914485
51374 914485 979462 1047178 1115153 1179565 1236023 1280837 1311649 1327385 1328192 1315295 1290309 1254464
51362 1254464 1208765 1154844 1095150 1032206 968110 904862 844599 788963 738448 692702 651412
51351 651412 614698 582882 556182 534487 517136 502968 490793 479796 469467 459474 449836 441007
51339 441007 433418 427039 421562 416812 412665 408772 404853 401175 398288 396246 394491 392548 390409 388099
51325 388099 385330 381956 378502 375835 374288 373386 372411 371105 369741 368732 368297 368457 369149 370202 371306
51310 371306 372205 372994 374041 375533 377233 378763 379945 380815 381530 382504 384356 387313 390755 393730 395963
51295 395963 398026 400438 402837 404207 403723 401308 397594 393525 389856 386888 384647 383235 382804 383242 384222
51280 384222 385706 388119 391764 396172 400300 403343 405214 406251 406728 406796 406755 407052 407844 408705 409097 409155 409649
51263 409649 411038 412832 414224 415118 416065 417249 417982 417403 415325 412267 408890 405626 402604 399674 396508
51248 396508 392898 388973 385134 381831 379389 377902 377202 376979 376941 376869 376650 376420 376578 377370 378515 379433 379803
51231 379803 379584 378577 376419 373182 369676 366915 365448 365231 365833 366608 367011 367015 367077 367574 368537 369990 372074
51214 372074 374509 376300 376556 375497 374275 373864 374449 375810 377775 380139 382513 384583 386493 388824 392117
51199 392117 396329 400763 404655 407828 410675 413477 415974 417649 418145 417331 415394 413074 411356 410475 409540
51184 409540 407639 405062 402885 401581 400752 400156 400162 400946 401890 402183 401562 400153 398061 395605 393593 392805 393270
51167 393270 394407 395721 397068 398454 400049 402341 405780 410118 414418 417929 420699 423133 425162 426206
51153 426206 425953 424836 423526 422122 420176 417516 414633 412078 409791 407413 405058 403343 402649 402760 403229
51138 403229 403709 403871 403459 402661 402061 402001 402244 402366 402122 401277 399645 397616 396163 395795 395875 395563 395076 395321
51120 395321 396445 397588 398193 398818 400326 402788 405549 408046 410244 412514 415313 418734 422164 424631 425720
51105 425720 426035 426639 428167 430607 433592 436707 439680 442531 445461 448453 451103 452947 453851 454075 454086 454295
51089 454295 454695 454761 453999 452632 451345 450337 449161 447645 446377 445904 445991 446154 446440 447011 447441 447210 446738
51072 446738 447079 448594 450677 452897 455644 459369 463837 468613 473895 480445 488931 499656 512706 528045
51058 528045 545431 564235 583190 600450 614404 624748 632648 639896 648163 658826 672687 689357
51046 689357 707291 724806 740886 754877 765909 773089 776006 774733 769609 761429 751519 741079 730394
51033 730394 718924 705972 690956 673412 653290 631312 608702 586619 566116 548366 534349
51022 534349 524226 517385 513138 511074 510851 512133 514840 519087 524719 531179 537991 545125 552818 561251
51008 561251 570433 580176 590085 599817 609400 619152 629205 639290 649085 658628 668343 678654 689571
50995 689571 700601 711273 721752 732631 743935 754755 764185 772242 779310 785148 789232 791944 794533
50982 794533 797813 801692 806098 811513 818158 825371 832360 839037 845712 852572 860107 869577 882353 898964
50968 898964 919276 943305 971293 1003204 1038812 1078217 1121702 1169123 1219920 1273615 1329757
50957 1329757 1387407 1445296 1502596 1559065 1614328 1667564 1718138 1766090 1811722 1854980 1895520
50946 1895520 1933132 1967922 2000336 2031303 2062116 2093828 2126643 2159935 2192646 2223575 2251415
50935 2251415 2274901 2293163 2306064 2314172 2318147 2317856 2312087 2299281 2278578 2250057 2214233 2171656
50923 2171656 2122879 2068261 2007615 1940619 1867973 1791936 1715340 1640168 1567206 1496776 1429366
50912 1429366 1365657 1306384 1252252 1203719 1160762 1122932 1089575 1059881 1032935 1008156 985630
50901 985630 965665 948013 931932 917023 903513 891502 880487 870006 860362 852183 845505 839853
50889 839853 835129 831833 830327 830354 831330 832730 834079 835078 835901 836992 838429 839944 841724 844652 849359
50874 849359 855522 862502 870223 878884 888267 898068 908640 920695 934370 949321 965555 983407 1002752
50861 1002752 1023204 1045250 1070318 1099357 1132132 1168331 1208529 1253448 1303038 1357116 1416479
50850 1416479 1482517 1555966 1636725 1724664 1819805 1921780 2029845 2143461 2262241 2385298
50840 2385298 2511251 2638953 2767513 2895292 3019379 3136495 3244290 3341639 3428073 3503251
50830 3503251 3566979 3619631 3662636 3698471 3729987 3759638 3789452 3821450 3857668 3899676 3948325
50819 3948325 4003785 4065291 4130621 4196055 4256955 4308276 4344798 4361736 4355689 4325070 4269592
50808 4269592 4189634 4086139 3960740 3815749 3654249 3480296 3298684 3114217 2931211 2753550
50798 2753550 2584648 2426986 2281887 2149942 2031468 1926454 1834500 1755167 1688165 1632818
50788 1632818 1587580 1550522 1520242 1495998 1477032 1462151 1450106 1440058 1431522 1423948 1416487 1408148
50776 1408148 1398258 1386856 1374661 1362544 1350870 1339220 1326583 1311915 1294845 1275978 1256398
50765 1256398 1236753 1217002 1197033 1177199 1157934 1139115 1120295 1101542 1083744 1067958 1054704
50754 1054704 1043942 1035521 1029404 1025555 1023833 1024077 1026275 1030580 1037241 1046574 1058960 1074726 1093911
50741 1093911 1116254 1141574 1170153 1202590 1239345 1280587 1326394 1376787 1431441 1489606 1550437
50730 1550437 1613205 1677136 1741346 1805187 1868474 1931062 1992389 2051734 2108861 2164004 2217117
50719 2217117 2267311 2313176 2353459 2387276 2413804 2432183 2442034 2444156 2440558 2433711 2425788 2418610
50707 2418610 2413977 2413715 2419402 2432207 2452758 2480667 2514166 2550649 2587740 2623549 2655825 2681432
50695 2681432 2697002 2699753 2687421 2658030 2610622 2546262 2467830 2378694 2281904 2180513 2078004
50684 2078004 1977940 1883298 1796128 1717578 1648060 1587632 1536417 1494641 1462219 1438516 1422711
50673 1422711 1414347 1413402 1419755 1432569 1450260 1471148 1494159 1518743 1544138 1568992 1591850 1611888
50661 1611888 1629072 1643896 1657149 1669590 1681465 1692502 1702722 1713086 1724928 1738856 1754585
50650 1754585 1771716 1790202 1810143 1831735 1855600 1882666 1913453 1947809 1985585 2027258 2073603
50639 2073603 2124825 2180086 2237787 2296408 2355370 2414995 2475222 2534500 2590566 2642470 2691220
50628 2691220 2738187 2783348 2825187 2861415 2889062 2904443 2904110 2886289 2851593 2803023 2745733 2686025
50616 2686025 2629368 2578941 2536117 2501696 2476002 2458249 2446898 2440706 2438649 2438914 2438896 2436329 2429586
50603 2429586 2416777 2395638 2364852 2324657 2275654 2217861 2151696 2079176 2003185 1925885 1848583
50592 1848583 1772688 1699842 1631197 1567356 1508973 1456627 1410187 1369053 1333065 1302392 1276426
50581 1276426 1253657 1233012 1214575 1198599 1184449 1171114 1158302 1146536 1136529 1128981 1124654 1123919
50569 1123919 1126291 1130864 1137208 1145432 1155449 1166725 1178958 1192639 1208673 1227553 1249017 1272421
50557 1272421 1297318 1323671 1351583 1380981 1411647 1443433 1476093 1508915 1540856 1571195 1599760
50546 1599760 1626357 1650492 1672129 1692503 1713650 1737121 1763481 1793005 1826408 1864788 1909121
50535 1909121 1959936 2017310 2081152 2151664 2229538 2315548 2410012 2512795 2623587 2741769 2866090
50524 2866090 2994885 3126690 3260320 3394348 3526821 3655511 3778057 3891771 3993688
50515 3993688 4081023 4151443 4203001 4234294 4244782 4234489 4203332 4151357 4080015 3992708 3893555
50504 3893555 3785996 3673059 3558545 3447161 3343473 3251239 3173574 3112912 3070418 3045885
50494 3045885 3038548 3047666 3071994 3108844 3153931 3202021 3247564 3284969 3308867 3314572 3298626 3259169
50482 3259169 3196113 3111101 3007277 2888932 2760974 2628222 2494677 2363201 2235763 2114009
50472 2114009 1999574 1893869 1797657 1710958 1633403 1564555 1503823 1450314 1403064 1361496 1325408
50461 1325408 1294476 1268003 1245369 1226613 1212377 1203255 1199164 1199254 1202343 1207580 1214800 1224234 1235895
50448 1235895 1249341 1263952 1279158 1294440 1309412 1324015 1338321 1351947 1364000 1373905 1381999 1388926
50436 1388926 1394630 1398402 1399883 1399619 1398566 1397415 1396515 1396201 1396960 1399327 1403654 1409919 1417848 1427345 1438757
50421 1438757 1452609 1469280 1489159 1512931 1541286 1574295 1611406 1652122 1696472 1744827 1797534
50410 1797534 1854736 1916151 1980843 2047451 2114772 2181847 2247405 2309628 2366762 2417825 2462513
50399 2462513 2500610 2531656 2554899 2569179 2572954 2564798 2544022 2510700 2465307 2408680 2342415 2269027
50387 2269027 2191524 2112851 2035652 1962346 1895183 1836199 1787051 1748846 1722020 1706376 1701229
50376 1701229 1705495 1717690 1735899 1757883 1781264 1803656 1822569 1835286 1839129 1832212 1814132 1785795
50364 1785795 1748529 1703431 1651556 1594509 1534548 1474095 1415152 1359045 1306389 1257187 1211065
50353 1211065 1167667 1126896 1088809 1053283 1019962 988694 960047 935133 914740 898649 886029
50342 886029 876434 870213 867845 869139 873307 879733 888436 899768 913852 930445 949288 970392 993864
50329 993864 1019473 1046417 1073436 1098938 1121031 1137845 1148289 1152659 1152340 1148927 1143660 1137439 1130861
50316 1130861 1124005 1116507 1108206 1099594 1091424 1083936 1076751 1069551 1062662 1056810 1052367 1048974 1046029 1043570
50302 1043570 1042474 1043540 1046463 1050101 1053827 1058244 1064334 1072361 1082063 1093598 1107461 1123384 1140047
50289 1140047 1156375 1172706 1190199 1209357 1229764 1251160 1274006 1298468 1323078 1344780 1360326
50278 1360326 1367515 1365407 1354108 1334899 1310475 1284406 1259751 1237954 1219023 1202625 1188700 1177057
50266 1177057 1166887 1157235 1147960 1139788 1133274 1128021 1123125 1118133 1113261 1108834 1104943 1101624 1099030 1097292
50252 1097292 1096429 1096538 1097846 1100460 1104280 1109332 1116018 1124800 1135726 1148457 1162683 1178387 1195708
50239 1195708 1214715 1235256 1256872 1278847 1300441 1321050 1340104 1357001 1371386 1383481 1393850
50228 1393850 1402734 1409732 1414234 1416039 1415436 1412714 1407680 1399594 1387491 1370568 1348476 1321559 1291028
50215 1291028 1258768 1226702 1196132 1167778 1142379 1120906 1103995 1091430 1082422 1076133 1071527 1066846
50203 1066846 1059870 1048999 1033910 1015109 993255 969199 944406 920715 899527 881307 865841
50192 865841 852663 841074 830035 818566 806479 794552 783705 774040 764794 755199 745151 735080
50180 735080 725510 716874 709464 703205 697596 692116 686680 681576 677053 673146 669779 666814 664067 661488
50166 661488 659303 657778 656976 656928 657906 660223 663838 668444 673832 679900 686397 693098 700226 708282 717433
50151 717433 727437 738179 749800 762062 774029 784567 792909 798614 801468 801771 800422 798331 795893
50138 795893 793252 790765 788940 788170 788938 792110 798578 808556 821490 836638 853559 872144 892466
50125 892466 914662 938885 965416 994813 1027617 1063681 1101985 1141403 1181504 1222318 1263569
50114 1263569 1304516 1344532 1383488 1421578 1459101 1496357 1533281 1568942 1601506 1628835 1649078
50103 1649078 1660913 1663624 1657089 1641600 1617726 1586544 1549874 1509870 1468238 1426084 1384492 1344833
50091 1344833 1308340 1275759 1247688 1224914 1207947 1196301 1188615 1183540 1180325 1178514 1177435 1176192
50079 1176192 1174119 1171083 1167397 1163467 1159522 1155549 1151427 1147049 1142302 1136989 1130890 1123911 1116042 1107114
50065 1107114 1096781 1084966 1072295 1059830 1048255 1037486 1027063 1016719 1006442 996400 987157
50054 987157 979709 974779 972096 970805 970596 971953 975173 979756 985125 991552 999851 1010349 1022531 1035557
50040 1035557 1048686 1061317 1073093 1084105 1094686 1104935 1114611 1123405 1131063 1137203 1141458 1143954
50028 1143954 1145400 1146462 1147135 1146896 1145351 1142566 1138757 1133873 1127632 1119997 1111421 1102543 1093715 1085021
50014 1085021 1076652 1068872 1061516 1053894 1045458 1036414 1027490 1019416 1012913 1008884 1008091 1010675 1016433 1025539
50000 1025539 1038549 1055645 1076305 1099878 1126077 1154661 1184952 1215960 1246849 1276986 1305707
49989 1305707 1332317 1356351 1377597 1395680 1409593 1417657 1418085 1409750 1392533 1366979 1333818 1294020
49977 1294020 1249211 1201679 1153713 1106954 1062297 1020237 981210 945808 914697 888140 865541
49966 865541 845679 827572 811045 796360 783536 772268 762421 754226 747815 742751 738338 734493 732102
49953 732102 732229 735047 739838 746078 754068 764241 776183 788907 801920 815439 829432 842917 854515
49940 854515 863445 869796 874116 876995 878816 879498 878409 874599 867153 855425 839318 819587 797748
49927 797748 775425 753710 733099 713801 695992 679976 666359 655843 648544 643587 639727 636434
49915 636434 634162 633537 634513 636461 638803 641362 644138 647056 650099 653617 658265 664540 672439 681689 692254
49900 692254 704394 718187 733229 748902 764768 780467 795390 808752 820064 829308 836537 841471
49888 841471 843570 842438 838103 831069 822209 812396 801917 790225 776525 760689 743421 725534 707386
49875 707386 689275 672069 656904 644207 633333 623340 613920 605524 598876 594519 592565 592593 593894
49862 593894 595995 598902 602768 607548 613154 619719 627412 636153 645832 656651 668963 682739 697490
49849 697490 712677 727879 742558 755983 767571 777146 784823 790751 794961 797231 797074 794086 788392
49836 788392 780674 771696 761892 751262 739585 726845 713721 701535 691392 683405 677047 672124 668968
49823 668968 667742 668153 670012 673554 678867 685418 692610 700571 709976 721210 733987 747668 761605
49810 761605 775243 788231 800500 812043 822543 831383 838049 842453 844879 845713 845204 843346 839939
49797 839939 834766 827755 819046 808969 797868 785796 772416 757432 741209 724814 709395 695625
49785 695625 683673 673395 664399 656181 648453 641321 635056 629748 625236 621295 617832 615042 613346 613108
49771 613108 614392 617115 621257 626701 633052 640033 647969 657344 667822 678303 688078 697278 705888 713125
49757 713125 718452 722688 727202 732130 736053 737412 735598 730677 722880 712711 701052 688754 676317
49744 676317 664116 652637 642264 633096 625221 618950 614495 611564 609476 607648 605890 604366 603405 603284
49730 603284 604010 605373 607279 609909 613421 617668 622418 627731 633833 640605 647636 655034 663830 675090
49716 675090 688643 703101 717268 731017 744446 756541 765369 769681 769933 767612 763907 759248 753762
49703 753762 747740 741577 735443 729141 722343 715048 707726 700853 694433 688132 681811 675547 669185 662313
49689 662313 654925 647800 642032 638364 637039 637963 640791 645135 650916 658360 667555 678274 690335 703795
49675 703795 718686 734895 752415 771149 790165 807631 821958 832672 839869 843490 843837 842385
49663 842385 841148 841187 842304 844128 846873 850958 856339 862168 866571 866887 860899 848161 829853 807547
49649 807547 782769 757639 734766 715772 700294 686933 674892 664407 656024 649998 646239 644354
49637 644354 643682 643494 643273 642830 642294 641899 641545 640548 638116 634097 628959 623114 616766 610449 605007 600638
49621 600638 596427 591337 585415 579638 574821 571135 568470 566730 565710 565021 564277 563273 562048 560898 560185
49606 560185 559993 560123 560575 561805 564216 567527 570837 573250 574305 574078 573147 572278 571854 571696 571618 571827 572516
49589 572516 573397 574207 575414 577724 580858 583564 585105 586135 587709 589931 592142 594059 596086 598553 601269
49574 601269 604001 606908 610258 614093 618552 624303 632163 642216 653628 665435 677194 688708 699377
49561 699377 708282 714889 719269 721577 721653 719428 715447 710578 705289 699573 693592 687894 682801 678035 673398
49546 673398 669531 667419 667161 667826 668702 670094 672522 675584 678241 680085 681747 684075 687393 691696 697104
49531 697104 703856 712117 721919 733082 745198 758087 772318 788823 807757 828107 848559 868273
49519 868273 886544 902378 915082 925031 933282 940603 947377 954199 961864 970773 980888 992281 1005120
49506 1005120 1018930 1032295 1043369 1050350 1051569 1045895 1033433 1015498 993667 969149 943167 917363
49494 917363 893301 871724 852545 835438 820183 806686 794924 784936 776758 770360 765618 762208
49482 762208 759685 757836 756816 756681 756983 757287 757917 759555 762085 764511 766210 767618 769424 771673 774050
49467 774050 776523 779209 782067 785226 789193 794206 799635 804542 808592 811952 814607 816379 817375 817740 817036
49452 817036 814542 810195 804673 798516 791782 784737 778185 772650 767610 762064 755773 749560 744412 740591
49438 740591 737767 735762 734872 735415 737276 740174 744265 750101 757977 767705 779173 792701 808631 826878
49424 826878 847249 869865 894937 922431 952445 985468 1021446 1058429 1092609 1119843 1136953
49413 1136953 1142127 1135433 1119633 1099871 1081446 1067578 1059218 1056538 1059879 1069278 1083742 1101471
49401 1101471 1120716 1140218 1159006 1176195 1191203 1204027 1215123 1224970 1233870 1242007 1249379 1255567
49389 1255567 1259795 1261388 1260049 1255593 1247709 1236280 1221855 1205485 1188053 1169907 1151208 1132530
49377 1132530 1115085 1100236 1088589 1079499 1071713 1064659 1058826 1054762 1052124 1050195 1049002 1049175 1050598
49364 1050598 1051847 1051283 1048365 1043566 1037323 1029589 1020351 1010167 999886 989950 980198 970360 960536 951084
49350 951084 942186 933836 926223 919867 915236 912377 910881 909996 908768 906585 903769 901259 899415 897539
49336 897539 894879 891608 888238 884498 879700 874128 869196 865936 863938 862056 859717 857253 855466 855233
49322 855233 857086 860697 864941 868895 872662 876987 882277 888297 894680 901267 907932 914396 920383 925913
49308 925913 931393 937443 944514 952547 961041 969602 978341 987660 997683 1008147 1018875 1030286 1043277
49295 1043277 1058534 1075873 1094283 1112584 1129921 1145502 1158060 1166010 1168429 1165820 1159824 1152266
49283 1152266 1144446 1137048 1130294 1124046 1117899 1111431 1104527 1097531 1091053 1085562 1081147 1077668 1075036 1073284
49269 1073284 1072496 1072816 1074471 1077567 1081833 1086655 1091420 1095785 1099660 1103080 1106122 1108858 1111459 1114410
49255 1114410 1118583 1124922 1134091 1146554 1162846 1183336 1207556 1233926 1260286 1284536 1304593 1318047
49243 1318047 1322428 1316275 1300061 1276055 1247224 1216205 1185043 1155432 1128827 1106214 1087944 1073814
49231 1073814 1063306 1055891 1051341 1049708 1050759 1053540 1056885 1060367 1064290 1068703 1073020 1076902 1080872 1085557
49217 1085557 1090754 1095931 1101365 1108100 1116832 1127366 1139108 1151613 1164661 1178303 1192741 1207788
49205 1207788 1222612 1236609 1250353 1264992 1280743 1296729 1312335 1327830 1343379 1358335 1371997
49194 1371997 1384443 1396115 1407101 1417316 1426935 1436105 1444702 1452905 1461562 1471269 1481395 1490785 1499383
49181 1499383 1508587 1520018 1534519 1552385 1573890 1599198 1628067 1660112 1695412 1734771 1779314
49170 1779314 1829747 1885926 1946810 2010260 2072251 2126585 2166550 2187913 2190646 2177945 2154207
49159 2154207 2124157 2092825 2064807 2042923 2027802 2018784 2014852 2014827 2017319 2020961 2024651 2027629 2029582
49146 2029582 2030752 2031723 2033056 2035204 2038676 2044001 2051495 2061263 2073318 2087414 2102791 2118477 2134068
49133 2134068 2150072 2167390 2186552 2207460 2229672 2252683 2275908 2298631 2320316 2341202 2362339
49122 2362339 2384602 2407670 2430419 2452458 2474760 2498468 2523595 2549564 2576806 2607137 2642456
49111 2642456 2683510 2730195 2782842 2843177 2914231 2999194 3099620 3213902 3337037 3462075
49101 3462075 3582832 3696425 3803715 3906513 4003138 4086135 4144522 4168857 4155304 4106619
49091 4106619 4030512 3936520 3832468 3722246 3606410 3485018 3360224 3236788 3120656 3016926
49081 3016926 2928331 2855010 2795467 2747671 2709478 2678789 2654061 2634547 2619531 2607444 2596371
49070 2596371 2585325 2574419 2563765 2552970 2541936 2531401 2522233 2514594 2508186 2502880 2498647 2495141
49058 2495141 2491790 2488184 2484207 2480038 2476249 2473640 2472579 2472607 2472869 2472811 2472390 2471887 2471726 2472238 2473467 2475466
49042 2475466 2478853 2484598 2492999 2503315 2514766 2527497 2542086 2558381 2575313 2591615 2606202 2618047
49030 2618047 2626316 2630737 2631414 2628332 2621512 2611675 2600184 2588133 2575863 2563491 2551487 2540454 2530684
49017 2530684 2522307 2515685 2511308 2509268 2509066 2509966 2511465 2513450 2515998 2519096 2522531 2526037 2529544 2533268
49003 2533268 2537579 2542701 2548328 2553464 2556886 2558128 2557917 2557352 2556588 2554647 2550700 2545277 2539890 2535431 2531223
48988 2531223 2525801 2518506 2510135 2502069 2495046 2488983 2483724 2479507 2476626 2475078 2474770 2475823 2478361 2482168
48974 2482168 2486897 2492519 2499272 2507120 2515522 2523759 2531323 2538053 2544073 2549560 2554462 2558636 2562422 2566719
48960 2566719 2571990 2577435 2581920 2585710 2590513 2597540 2606311 2615839 2626242 2638373 2652378 2667673 2684332
48947 2684332 2703508 2726182 2752146 2780631 2811310 2844170 2878749 2914192 2950059 2986732 3024950
48936 3024950 3065219 3107772 3152868 3200936 3252339 3307028 3364546 3424448 3486599 3550876 3616676
48925 3616676 3683115 3749796 3817016 3885004 3953276 4021093 4088265 4155035 4221188 4285772 4347777
48914 4347777 4406740 4462450 4514384 4561793 4604383 4642731 4677907 4710708 4741288 4769483 4795349
48903 4795349 4819154 4840979 4860695 4878460 4894864 4910260 4924190 4935825 4944822 4951342 4955464 4957121
48891 4957121 4956546 4954161 4949896 4943199 4933941 4922695 4909711 4894023 4874182 4849687 4821311 4790220
48879 4790220 4757208 4722654 4686657 4649111 4609964 4569462 4527800 4484447 4438062 4387295 4331679
48868 4331679 4271827 4209032 4144700 4079959 4015587 3952212 3890394 3830478 3772573 3716987 3664606
48857 3664606 3616562 3573442 3535001 3500700 3470315 3443844 3420866 3400240 3380767 3362249 3345734
48846 3345734 3332357 3322117 3314219 3308639 3306602 3309139 3315697 3324762 3335500 3348148 3363029 3379951
48834 3379951 3398549 3418522 3439348 3460356 3481317 3502544 3524250 3546164 3567913 3589327 3610247
48823 3610247 3630519 3650411 3670555 3691209 3711986 3732527 3752953 3773352 3793362 3812781 3832071
48812 3832071 3851646 3871010 3889395 3907108 3925463 3945254 3965956 3986685 4007410 4028845 4051458
48801 4051458 4075000 4098914 4122932 4147261 4172330 4198381 4225219 4252262 4278678 4303487 4325795
48790 4325795 4345247 4362218 4377325 4390726 4402061 4411029 4417726 4422267 4424223 4422544 4415955 4403428
48778 4403428 4384422 4358812 4326639 4288041 4243556 4194385 4142048 4087605 4031365 3973427 3914334
48767 3914334 3855092 3796660 3739568 3683892 3629467 3576257 3524762 3476008 3430792 3388856 3349072
48756 3349072 3310674 3274130 3240620 3210822 3184574 3161600 3142066 3126230 3114006 3105203 3099853 3097826
48744 3097826 3098308 3100247 3103349 3108170 3115062 3123464 3132456 3141702 3151515 3162218 3173654 3185100 3195452
48731 3195452 3203725 3209690 3213935 3217070 3219084 3219779 3219628 3219645 3220326 3221142 3221290 3220675 3219893 3219421 3219101 3218450 3217266
48714 3217266 3215827 3214586 3213827 3213643 3213967 3214432 3214310 3213000 3210707 3208385 3206819 3205950 3205270 3204625 3204359 3204827
48698 3204827 3206132 3208291 3211330 3215166 3219573 3224372 3229496 3234923 3240652 3246646 3252639 3258050 3262274 3264991
48684 3264991 3265976 3264846 3261403 3256199 3250311 3244442 3238548 3232438 3226281 3220212 3213669 3205431 3194242 3179355
48670 3179355 3160757 3139242 3116099 3092363 3068230 3043221 3016868 2989150 2960452 2931374 2902466
48659 2902466 2873882 2845227 2815915 2785686 2754563 2722262 2687886 2650511 2610161 2568260 2527137
48648 2527137 2488930 2454682 2424256 2397014 2372564 2350866 2331746 2314530 2298262 2282178 2265818
48637 2265818 2248749 2230431 2210528 2189303 2167532 2145938 2124757 2103900 2083442 2063713 2044891
48626 2044891 2026639 2008297 1989342 1969611 1949213 1928547 1908388 1889652 1872858 1857955 1844824
48615 1844824 1833729 1825006 1818507 1813787 1810874 1810327 1812366 1816318 1821302 1827064 1833683 1840569 1846411 1850205
48601 1850205 1851939 1852144 1851300 1849983 1849203 1849993 1852538 1855940 1858854 1860312 1860012 1857989 1854062 1847540 1837612
48586 1837612 1824191 1808297 1791477 1774789 1758351 1741797 1725026 1708494 1692889 1678623 1665742
48575 1665742 1654283 1644457 1636316 1629505 1623736 1619416 1617333 1617738 1620203 1624447 1630662 1638754 1647868 1657146
48561 1657146 1666356 1675133 1682114 1685730 1685690 1682845 1677638 1669592 1658506 1645284 1631199 1617029 1603409
48548 1603409 1591394 1581912 1574798 1568819 1562550 1554943 1545335 1533429 1519333 1503420 1486237 1468683
48536 1468683 1451948 1436862 1423362 1410918 1399503 1389928 1383265 1380052 1379904 1381764 1384770 1389179 1396213
48523 1396213 1406647 1419601 1432905 1444318 1452008 1454211 1449397 1437285 1419433 1398583 1377539 1358431
48511 1358431 1342475 1330021 1321053 1315867 1315097 1318976 1326974 1338478 1353529 1372519 1395239 1420588
48499 1420588 1447021 1472830 1495977 1514220 1525742 1529583 1525428 1513478 1494937 1472408 1449171 1427644
48487 1427644 1408473 1391040 1374583 1358767 1343435 1328312 1313104 1297797 1282673 1268109 1254430
48476 1254430 1241954 1230955 1221450 1213073 1205291 1197821 1190809 1184641 1179606 1175697 1172550 1169628 1166726
48463 1166726 1164429 1163849 1165675 1169548 1174546 1180088 1186142 1192743 1199893 1207835 1216702 1225568 1232387 1235489
48449 1235489 1234931 1231994 1227689 1222307 1216136 1209807 1203808 1198236 1193166 1188682 1184328 1179074 1172160 1163661
48435 1163661 1153974 1143224 1131521 1119368 1107357 1095726 1084598 1074376 1065402 1057466 1050135 1043434
48423 1043434 1037698 1032802 1028072 1022954 1017369 1011426 1005198 998836 992504 986126 979547 972956 966797 961227
48409 961227 956022 951067 946474 942201 938042 934094 930739 928029 925611 923471 922088 921483 920733 918965 916403
48394 916403 913795 911125 907601 902784 897088 891171 885359 879707 874171 868666 863323 858693 855288 852948
48380 852948 851037 849286 848005 847476 847543 847845 847997 847478 845873 843393 840731 838247 835774 833356 831614 830964
48364 830964 830960 830906 830733 830816 831212 831635 832053 832777 833942 835323 836747 838291 840015 841725 843104 843923 844141 843965
48346 843965 843828 844192 845437 848021 852473 858857 866417 874237 882330 891694 903124 916293 930326 945056
48332 945056 961305 979851 1000455 1022064 1043751 1064986 1085021 1102611 1116850 1128037 1137299 1145566
48320 1145566 1153500 1162169 1172900 1186210 1201618 1218811 1238298 1260482 1284864 1310824 1338645 1369128
48308 1369128 1402787 1440255 1482989 1532600 1589763 1654666 1728353 1812761 1909654 2020567 2147862
48297 2147862 2295113 2466664 2667972 2906630 3192621 3538199 3958840 4473904 5104144
48288 5104144 5867224 6775872 7840177 9071218 10484062 12098660 13931529 15969750
48280 15969750 18133911 20256064 22096788 23400033 23961742 23686612 22616126 20917547
48272 20917547 18833642 16612537 14450748 12471233 10732011 9246046 7999061 6963049
48264 6963049 6106149 5398148 4812120 4324840 3917308 3574661 3285149 3039153 2828723
48255 2828723 2647265 2489326 2350783 2229033 2122420 2029242 1947395 1874921 1810589 1753799
48245 1753799 1703937 1659844 1619974 1583172 1549227 1518472 1490997 1466568 1445182 1427108 1412168
48234 1412168 1399417 1387830 1377008 1367066 1358156 1350375 1343842 1338608 1334505 1331064 1327298 1321606 1312397
48221 1312397 1298980 1281479 1259953 1234275 1205132 1174463 1144365 1115889 1089168 1064142 1040682
48210 1040682 1018470 997338 977498 958988 941252 923730 906514 889929 873782 857652 841643
48199 841643 826198 811364 796932 783181 770802 760048 750555 742017 734408 727513 720926 714773 709767
48186 709767 706134 702934 699007 694372 690220 687557 686239 685429 684638 683926 683175 681694 678986 675703 673252
48171 673252 672318 672252 672089 671669 671348 671138 670712 670001 669195 668313 667346 666708 666964 668066 669363 670401 671206 671826
48153 671826 672144 672292 672680 673389 673910 673773 673086 672304 671787 671783 672428 673454 674183 674139 673588 673205 673295 673532 673439 673028
48133 673028 672905 673728 675464 677345 678713 679810 681473 684107 687307 690499 693643 697181 701538 706694 712066
48118 712066 716852 720774 724432 728629 733336 737767 741482 744944 748862 753526 759068 765934 774603 785033
48104 785033 796714 809117 821840 834474 846665 858310 869491 880252 890577 900488 910094 919594
48092 919594 929251 939213 949339 959470 969829 980789 992132 1002961 1012596 1021166 1029037 1036113 1042187
48079 1042187 1047655 1053177 1058752 1063736 1067856 1071608 1075445 1079094 1082102 1084724 1087825 1091994 1097069 1102540
48065 1102540 1108172 1114135 1120662 1127618 1134381 1140261 1145100 1149313 1153066 1155537 1155437 1152395 1147455 1141924
48051 1141924 1135996 1128853 1119843 1109030 1096695 1083018 1068457 1053854 1039718 1025747 1011386 996516
48039 996516 981251 965430 948859 931830 914830 897885 880735 863664 847584 833205 820500
48028 820500 809029 798332 787921 777362 766563 755748 745102 734752 724983 716009 707478 698721
48016 698721 689594 680572 672027 663962 656612 650582 646014 642235 638704 635750 633836 632564 631071 629169
48002 629169 627378 625983 624683 623283 622231 622237 623579 625844 628244 630181 631574 632631 633378 633710 633777 633868
47986 633868 633848 633325 632582 632581 633539 634191 633227 631016 629075 628166 627838 627529 627065 626019 623730 620365 617158 615090
47968 615090 613939 613067 612499 612656 613429 614219 614717 615144 615744 616429 616918 617059 617088 617703 619640 622989 627087 631274
47950 631274 635484 639886 644264 648216 651870 656012 661434 668356 676425 684919 692935 699715 705089 709566
47936 709566 713871 718485 723587 729227 735217 740943 745565 748606 750201 750673 750099 748517 746352 744104 741505
47921 741505 737510 731475 724056 716587 709759 703319 696838 690259 683656 677005 670441 664443 659488 655619
47907 655619 652465 649590 646815 644323 642458 641308 640557 639924 639634 640256 642172 645456 649994 655311 660443
47892 660443 664632 668224 672320 677391 682792 687801 692506 697363 702513 708025 714222 721126 727966 733928
47878 733928 739102 744026 748525 751824 753743 754877 755448 754813 752501 749052 745240 740974 735599 729003 721759
47863 721759 714265 706360 697910 689281 681021 673365 666281 659726 653669 647994 642648 637781 633568 629987
47849 629987 626987 624761 623535 623042 622606 621952 621650 622422 624171 626140 628025 630489 634285 639186 644074
47834 644074 648016 650968 653522 656190 659018 661715 664082 666378 669165 672745 676794 680675 684036 687005
47820 687005 689911 693087 696854 701393 706578 712255 718735 726657 736204 746857 758316 771447 787737
47807 787737 807841 831022 856111 882548 910323 939273 968768 997852 1025395 1050263 1071700
47796 1071700 1089549 1103898 1114582 1121229 1123616 1121719 1115573 1105447 1092088 1076368 1058700 1039275
47784 1039275 1018928 999168 981090 964664 949314 934747 920879 907481 894451 882129 870790
47773 870790 860047 849346 838873 829293 820737 812705 805003 798053 792115 786855 781992 777806 774648
47760 774648 772390 770682 769299 767924 766075 763684 761349 759531 757835 755662 753222 751277 750084 749329
47746 749329 749100 750187 753135 757513 762400 767321 772505 778566 786105 795332 805748 816379 826502 836037
47732 836037 845112 853560 861176 868311 875739 883774 891686 898246 902747 905419 906871 907409 906924 905170 901857
47717 901857 896630 889392 880712 871522 862236 852515 842143 831759 822272 813794 805611 797127 788403 779832
47703 779832 771831 764909 759553 755801 753249 751610 751010 751620 753375 756274 760596 766571 774068 782802 792528
47688 792528 802762 812774 822301 832005 842681 854144 865434 876081 886494 896941 906731 914877
47676 914877 921188 926244 930489 933890 936467 938547 940161 940537 938590 933923 927133 919291 911308 903647
47662 903647 896113 887821 877795 866016 853675 842076 831413 820947 810260 799865 790568 782722
47650 782722 776279 771121 766955 763206 759543 756528 755300 756407 759111 762057 764536 766964 770191 774539
47636 774539 779672 785261 791432 798442 806199 814502 823668 834539 847758 863398 881434 902236 926283
47623 926283 953601 983746 1016214 1050577 1086366 1123066 1160141 1196711 1231217 1261772 1286990
47612 1286990 1306348 1319744 1326967 1327664 1321652 1309135 1290657 1266843 1238074 1204466 1166375 1124917
47600 1124917 1081783 1038463 995837 954511 915249 878767 845225 814235 785445 758991 735308
47589 735308 714620 696748 681328 667993 656296 645751 636256 628301 622308 617719 613248 608229 603270
47576 603270 599253 596139 593282 590520 588244 586541 585026 583602 582657 582291 581923 580887 578856 575564 570837
47561 570837 565360 560643 557496 554970 551545 547004 542427 538654 535680 533466 532356 532367 532780 532841 532390 531574
47545 531574 530416 528991 527581 526285 524889 523406 522373 522150 522294 522097 521543 521238 521528 522174 522865 523572
47529 523572 524306 524967 525560 526302 527321 528479 529610 530749 532007 533393 534931 536790 539067 541439 543167
47514 543167 543557 542486 540524 538520 537006 535952 535082 534322 533831 533697 533781 533916 534104 534479 535123 536008 537004
47497 537004 537899 538518 538894 539315 540083 541247 542642 544190 546108 548702 551926 555242 558048 560286 562491
47482 562491 565168 568236 571263 574170 577475 581703 586713 591746 596135 599811 603090 606150 608896 611344
47468 611344 613873 616857 620113 622939 624785 625754 626354 626911 627356 627484 627222 626663 625983 625363 624920 624761 625153
47451 625153 626543 629238 633177 638230 644646 652904 663024 674375 686313 698908 712870 728923 747427
47438 747427 768397 791579 816520 842849 870591 900070 931417 964190 997401 1029775 1060039
47427 1060039 1087260 1111068 1131452 1148177 1160461 1167369 1168575 1164663 1156587 1144843 1129222 1109483
47415 1109483 1086263 1061115 1035503 1009899 984088 958204 933033 909204 886605 864964 844749
47404 844749 826932 811874 798890 787097 776343 767133 759908 754746 751616 750526 751278 753252 755647
47391 755647 758058 760844 764874 770798 778548 787571 797454 808137 819560 831419 843371 855208 866653
47378 866653 877266 886821 895545 903584 910351 914799 916375 915422 912613 908274 902296 894404 884413 872465
47364 872465 859070 844678 829241 812548 795035 777767 761365 745370 729077 712673 697098
47353 697098 683007 670338 658831 648380 638769 629469 620021 610523 601605 593996 588105 583831 580723
47340 580723 578432 577012 576663 577197 578032 578755 579474 580538 582163 584478 587741 592198 597732 603876 610189
47325 610189 616449 622380 627394 630874 632794 633796 634484 634772 634189 632677 630737 628733 626445 623453 619582
47310 619582 614790 609107 603098 597993 594706 592861 591357 589751 588443 587599 586788 585973 585964 587331 589505 591708
47294 591708 594307 598397 604206 610793 617333 623929 630931 638230 645636 653388 661749 670408 678813 686866
47280 686866 694827 702682 710163 717328 724633 732296 740029 747440 754270 760076 764237 766693 768307 770028
47266 770028 771843 772984 772978 772001 770327 768017 765212 762242 759265 756257 753450 751307 749892 748807 748098
47251 748098 748694 751573 756922 764541 774465 786386 798823 809715 817787 822697 824120 821758 816402 810012
47237 810012 804308 799884 796994 796279 798119 801945 806965 813125 820718 829528 839208 850217 863429 878771
47223 878771 894958 910701 925486 939119 951208 961467 969990 976828 981692 984384 985116 983999 980496
47210 980496 973896 964320 952899 940869 928695 916125 902939 889546 876769 865124 854477 844576
47198 844576 835747 828659 823418 819332 815838 813311 812629 814175 817622 822531 828694 835976 844301 854002
47184 854002 865841 880343 897257 915870 935704 956644 978480 1000653 1022632 1044373 1066187
47173 1066187 1088133 1109654 1129843 1147991 1163838 1177363 1188463 1196842 1202116 1204000 1202506 1198076
47161 1198076 1191456 1183245 1173532 1162091 1148948 1134599 1119575 1104022 1087942 1071686 1055842 1040645
47149 1040645 1025903 1011683 998716 987754 978702 970794 963584 957379 952665 949505 947702 947197 948036
47136 948036 950086 953096 956966 961765 967470 973803 980262 986142 990641 993176 993707 992651 990431 987134
47122 987134 982542 976386 968580 959384 949383 939216 929274 919604 910080 900561 890931 881163 871416 861955
47108 861955 852875 843954 834953 825985 817410 809259 800950 791819 781889 771923 762664 754333 746973 740936
47094 740936 736617 733760 731424 728830 726039 723719 722452 722388 723403 725312 727902 730895 733995 737026 739999
47079 739999 742935 745648 747904 749887 752206 755145 758092 760106 760914 760914 760348 759084 757311 755702 754538
47064 754538 753217 751116 748540 746344 744943 744263 744446 745967 748994 753060 757427 761544 765273 769005 773479
47049 773479 779109 785459 791667 797363 802871 808613 814648 820812 826986 833160 839426 845836 852152 858010
47035 858010 863609 869913 877614 886089 893999 900831 907245 913845 920327 926038 930803 934818 938142 940549
47021 940549 941667 941138 939052 936271 933789 931618 928857 925115 921199 918028 915434 912588 909132 905325
47007 905325 901445 897706 894457 891891 889791 888116 887482 888377 890191 891888 893579 896498 901246 906880 912044
46992 912044 916317 920068 923656 927357 931594 936609 942106 947680 953467 960002 967607 976267 985905 996342
46978 996342 1007207 1018334 1030146 1043085 1056626 1069404 1080509 1090220 1099262 1107697 1114962 1120785
46966 1120785 1125632 1130218 1134770 1138843 1141729 1143076 1143162 1142620 1141965 1141548 1141826 1143212 1145434 1147400 1148189 1148074
46950 1148074 1148195 1149343 1151506 1154545 1158644 1163787 1169329 1174592 1179693 1185349 1191986 1199398 1207201 1215237
46936 1215237 1223468 1231816 1240167 1248313 1255860 1262445 1268153 1273472 1278623 1283032 1285609 1285565 1282965 1278476
46922 1278476 1272555 1264945 1255163 1243501 1231209 1219404 1208000 1196076 1183167 1169875 1157277 1146181
46910 1146181 1136956 1129614 1123874 1119457 1116468 1115270 1115966 1118408 1122766 1129600 1139070 1150526 1163295 1177578
46896 1177578 1194090 1212959 1233433 1254676 1276475 1299035 1322324 1345727 1368247 1389055 1407917
46885 1407917 1425075 1440666 1454428 1466086 1475804 1483981 1490690 1495658 1498914 1501242 1503795 1507276 1511523
46872 1511523 1515948 1520296 1524898 1530177 1536168 1542783 1550418 1559813 1571205 1583969 1597361 1611313 1626243
46859 1626243 1642229 1658658 1674612 1689440 1703053 1715808 1727923 1738908 1747814 1754213 1758625 1761726
46847 1761726 1763410 1763040 1760409 1756058 1750783 1745256 1739983 1735137 1730410 1725524 1720961 1717734 1716284 1716052
46833 1716052 1716415 1717633 1720520 1725370 1731689 1738923 1747067 1756417 1766964 1778255 1789800 1801434 1813269
46820 1813269 1825450 1838034 1850835 1863162 1873834 1881901 1887446 1891356 1894216 1895766 1895634 1894161 1892099
46807 1892099 1889819 1887274 1884541 1881887 1879363 1876774 1874068 1871382 1868721 1866023 1863494 1861478 1859948 1858606
46793 1858606 1857602 1857695 1859416 1862412 1865864 1869373 1873217 1877971 1884042 1891392 1899504 1907718 1915678 1923376
46779 1923376 1930885 1938356 1946171 1954609 1963256 1971308 1978750 1986745 1996399 2007465 2018785 2029800 2041056
46766 2041056 2053306 2066761 2081375 2097360 2115001 2134137 2154195 2174806 2196219 2218996 2243342
46755 2243342 2268808 2294646 2320300 2345375 2369249 2391114 2410576 2427969 2443817 2458077 2470123
46744 2470123 2479407 2485967 2490354 2493193 2494751 2494810 2493131 2490187 2487228 2485235 2483917 2482231 2479974 2478330
46730 2478330 2478560 2480551 2483138 2485651 2488625 2493028 2499308 2507265 2516258 2525134 2532496 2537685 2541368 2544552
46716 2544552 2547063 2547505 2544778 2538958 2530420 2518796 2503491 2484901 2464384 2442968 2420520 2396234
46704 2396234 2369609 2340905 2310921 2280382 2249351 2217279 2183870 2149730 2115822 2082495 2049525
46693 2049525 2017075 1985948 1956729 1929177 1902764 1877395 1853343 1830798 1809808 1790396 1772451
46682 1772451 1755722 1740150 1725929 1713016 1700885 1689073 1677701 1667088 1657085 1647243 1637502 1628302
46670 1628302 1620014 1612657 1606247 1601031 1597205 1594640 1593062 1592438 1593008 1594854 1597514 1600223 1602704 1605513
46656 1605513 1609173 1612998 1615324 1615187 1613305 1610986 1608537 1605342 1601230 1596913 1593059 1589655 1586510 1583833
46642 1583833 1581961 1581033 1581399 1584009 1589811 1598813 1610189 1623369 1638597 1656219 1675710 1695756 1715291
46629 1715291 1734268 1753315 1772766 1792049 1809905 1825001 1836463 1844045 1848004 1848734 1846460 1841254
46617 1841254 1833348 1823281 1811671 1798866 1784822 1769317 1752327 1734332 1716247 1698846 1682292
46606 1682292 1666369 1651123 1636955 1624069 1612242 1601361 1591829 1584046 1577699 1571946 1566277 1560935
46594 1560935 1556537 1553504 1551706 1550399 1548531 1545386 1540987 1535764 1529950 1523540 1516693 1509855 1503412 1497431
46580 1497431 1491729 1486126 1480726 1476102 1472997 1471625 1471468 1472045 1473642 1476793 1481241 1485938 1490104 1493834
46566 1493834 1497633 1501866 1506689 1511974 1517092 1521330 1524851 1528756 1533826 1539552 1544920 1549900 1555615 1563054
46552 1563054 1572070 1581773 1591543 1601403 1611524 1621705 1631616 1641551 1652575 1665622 1680550 1696444
46540 1696444 1712730 1729582 1747277 1765773 1785125 1805779 1828088 1852017 1877686 1905763 1936750
46529 1936750 1970204 2005289 2041885 2080438 2120740 2161559 2201717 2240995 2279712 2317793 2354634
46518 2354634 2389627 2422464 2452986 2480985 2506162 2528201 2546850 2561992 2573630 2581913 2587287 2590460
46506 2590460 2591926 2591539 2588830 2583833 2577339 2570249 2562881 2555065 2546686 2537975 2529324 2520918 2512426 2503005
46492 2503005 2491804 2478571 2463632 2447210 2428981 2408471 2385659 2360884 2334267 2305532 2274427
46481 2274427 2241041 2205628 2168271 2128951 2087985 2046283 2005043 1965094 1926584 1889403 1853880
46470 1853880 1820897 1791222 1764921 1741569 1720955 1703444 1689716 1680277 1675227 1674394 1677643 1684992
46458 1684992 1696292 1710827 1727528 1745741 1765505 1786755 1808508 1829332 1848643 1867066 1885317
46447 1885317 1903061 1919095 1932330 1942315 1949030 1952623 1953419 1951866 1948323 1942959 1935888 1927256 1917156
$$ [...]
##END NTUPLES=NMR SPECTRUM
##END=
