##TITLE=AC1575_ROEFFECT0023_8271393_3lKNu8uw1t
##JCAMPDX= 6.0         $$ Bruker NMR JCAMP-DX V2.0
##DATA TYPE= NMR SPECTRUM
##DATA CLASS= NTUPLES
##ORIGIN= BRUKER
##OWNER= Administrator
$$ 1.72 TOPSPIN		Version 2.1
$$ 2013-10-18 20:28:29.419 -0700  Administrator@X
$$ Compression mode = diff/dup
##.OBSERVE FREQUENCY= 400.02188249412
##.OBSERVE NUCLEUS= ^1H
##.ACQUISITION MODE= SIMULTANEOUS (DQD)
##.ACQUISITION SCHEME= undefined
##.AVERAGES= 8
##.DIGITISER RES= 22
##SPECTROMETER/DATA SYSTEM= spect
##.PULSE SEQUENCE= zg30
##.SOLVENT NAME= COFFEE_meoh
##.SHIFT REFERENCE= INTERNAL, COFFEE_meoh, 1, 14.98509
##AUDIT TRAIL= $$ (NUMBER, WHEN, WHO, WHERE, PROCESS, VERSION, WHAT)
$$ ##TITLE= Audit trail, TOPSPIN		Version 2.1
$$ ##JCAMPDX= 5.01
$$ ##ORIGIN= Bruker BioSpin GmbH
$$ ##OWNER= Administrator
$$ $$ E:\/data/COFFEE/nmr/AC1575_ROEFFECT0023_8271393_3lKNu8uw1t/10/pdata/1/auditp.txt
$$ ##AUDIT TRAIL=  $$ (NUMBER, WHEN, WHO, WHERE, PROCESS, VERSION, WHAT)
(   1,<2013-10-18 20:28:22.482 -0700>,<Administrator>,<X>,<go>,<TOPSPIN 2.1>,
      <created by zg
	started at 2013-10-18 20:27:16.419 -0700,
	POWCHK enabled, PULCHK disabled,
       configuration hash MD5:
       C8 4E 4E 5D D3 5C D8 9E 9F 52 82 E0 59 8A DE 15
       data hash MD5: 64K
       B9 84 8F CD 2E AC DA A5 EC 0A 63 5A 7C 02 73 4A>)
(   2,<2013-10-18 20:28:25.466 -0700>,<Administrator>,<X>,<proc1d>,<TOPSPIN 2.1>,
      <Start of raw data processing
       efp LB = 0 FT_mod = 6 PKNL = 1 PHC0 = 0 PHC1 = 0 SI = 32K 
       data hash MD5: 32K
       B9 47 F9 6E 0A 77 70 CE 1C E2 EE F5 91 D7 F7 B4>)
(   3,<2013-10-18 20:28:25.794 -0700>,<Administrator>,<X>,<proc1d>,<TOPSPIN 2.1>,
      <pk PHC0 = 93.32336 PHC1 = 0 
       data hash MD5: 32K
       00 BE AC EC F3 C1 B8 E3 CD F6 5E DD A7 E6 20 AB>)
(   4,<2013-10-18 20:28:25.872 -0700>,<Administrator>,<X>,<proc1d>,<TOPSPIN 2.1>,
      <abs ABSG = 1 
       data hash MD5: 32K
       F3 F2 C4 D8 B3 E1 7F B0 3A FC 12 7A 2E 0B 62 4E>)
(   5,<2013-10-18 20:28:26.013 -0700>,<Administrator>,<X>,<proc1d>,<TOPSPIN 2.1>,
      <abs ABSG = 2 
       data hash MD5: 32K
       C2 7D EF 6A 1A EE 28 92 F9 2F 6C 44 F3 6C 36 03>)
(   6,<2013-10-18 20:28:26.076 -0700>,<Administrator>,<X>,<proc1d>,<TOPSPIN 2.1>,
      <abs ABSG = 3 
       data hash MD5: 32K
       64 4F 21 74 98 5A D1 5D 07 B4 EE 62 9C 02 19 86>)
(   7,<2013-10-18 20:28:26.138 -0700>,<Administrator>,<X>,<proc1d>,<TOPSPIN 2.1>,
      <abs ABSG = 4 
       data hash MD5: 32K
       1E BF 86 AB 0C EB 2D 78 67 39 0D 32 3A C8 0F BA>)
(   8,<2013-10-18 20:28:26.216 -0700>,<Administrator>,<X>,<proc1d>,<TOPSPIN 2.1>,
      <abs ABSG = 5 
       data hash MD5: 32K
       78 63 82 2F 3C F0 73 A7 1A 60 08 B8 4C 5D 1A 82>)
$$ ##END=
$$ 
$$ $$ hash MD5
$$ $$ 81 73 18 81 68 3A 02 D9 B8 E3 B0 40 B3 A5 B7 9B
##$RELAX= 
##$RELAX= 
##$RELAX= 
##$RELAX= 
##$RELAX= 
##$RELAX= 
##$RELAX= 
$$ Bruker specific parameters
$$ --------------------------
##$DU= <E:\>
##$EXPNO= 10
$$ [...]
150 150 150 150 150 150 150 150
##$TP07= 0
##$TPNAME0= <>
##$TPNAME1= <>
##$TPNAME2= <>
##$TPNAME3= <>
##$TPNAME4= <>
##$TPNAME5= <>
##$TPNAME6= <>
##$TPNAME7= <>
##$TPOAL= (0..7)
0.5 0.5 0.5 0.5 0.5 0.5 0.5 0.5
##$TPOFFS= (0..7)
0 0 0 0 0 0 0 0
##$TUNHIN= 0
##$TUNHOUT= 0
##$TUNXOUT= 0
##$USERA1= <user>
##$USERA2= <user>
##$USERA3= <user>
##$USERA4= <user>
##$USERA5= <user>
##$V9= 5
##$VALIST= <valist>
##$VCLIST= <CCCCCCCCCCCCCCC>
##$VD= 0
##$VDLIST= <DDDDDDDDDDDDDDD>
##$VPLIST= <PPPPPPPPPPPPPPP>
##$VTLIST= <TTTTTTTTTTTTTTT>
##$WBST= 1024
##$WBSW= 4
##$XGAIN= (0..3)
0 0 0 0
##$XL= 0
##$YL= 0
##$YMAX_a= 629648
##$YMIN_a= -534869
##$ZGOPTNS= <>
##$ZL1= 120
##$ZL2= 120
##$ZL3= 120
##$ZL4= 120
##$ABSF1= 14.98509
##$ABSF2= -5.573092
##$ABSG= 5
##$ABSL= 3
##$ALPHA= 0
##$AQORDER= 0
##$ASSFAC= 0
##$ASSFACI= 0
##$ASSFACX= 0
##$ASSWID= 0
##$AUNMP= <proc_prof1d_extract_pilot.lims>
##$AXLEFT= 0
##$AXNAME= <>
##$AXNUC= <1H>
##$AXRIGHT= 0
##$AXTYPE= 0
##$AXUNIT= <>
##$AZFE= 0.1
##$AZFW= 0.1
##$BCFW= 0
##$BC_mod= 0
##$BYTORDP= 0
##$COROFFS= 0
##$CY= 15
##$DATMOD= 1
##$DC= 0
##$DFILT= <>
##$DTYPP= 0
##$F1P= 0
##$F2P= 0
##$FCOR= 0.5
##$FTSIZE= 32768
##$FT_mod= 6
##$GAMMA= 0
##$GB= 0
##$INTBC= 1
##$INTSCL= 1
##$ISEN= 128
##$LB= 0
##$LEV0= 0
##$LPBIN= 0
##$MAXI= 10000
##$MC2= 0
##$MEAN= 0
##$ME_mod= 0
##$MI= 0
##$NCOEF= 0
##$NC_proc= -8
##$NLEV= 6
##$NOISF1= 0
##$NOISF2= 0
##$NSP= 0
##$NTH_PI= 0
##$NZP= 0
##$OFFSET= 14.98509
##$PC= 1
##$PHC0= 93.32336
##$PHC1= 0
##$PH_mod= 1
##$PKNL= yes
##$PPARMOD= 0
##$PPDIAG= 0
##$PPIPTYP= 0
##$PPMPNUM= 2147483647
##$PPRESOL= 1
##$PSCAL= 4
##$PSIGN= 0
##$PYNMP= <proc.py>
##$REVERSE= no
##$SF= 400.02
##$SI= 32768
##$SIGF1= 0
##$SIGF2= 0
##$SINO= 400
##$SIOLD= 32768
##$SPECTYP= <>
##$SREGLST= <1H.CDCl3>
##$SSB= 0
##$STSI= 32768
##$STSR= 0
##$SW_p= 8223.68421052631
##$SYMM= 0
##$S_DEV= 0
##$TDeff= 65536
##$TDoff= 0
##$TI= <>
##$TILT= no
##$TM1= 0
##$TM2= 0
##$TOPLEV= 0
##$USERP1= <user>
##$USERP2= <user>
##$USERP3= <user>
##$USERP4= <user>
##$USERP5= <user>
##$WDW= 1
##$XDIM= 32768
##$YMAX_p= 460878512
##$YMIN_p= -742382
##$CURPLOT= <Network HP LaserJet P1505>
##$CURPRIN= <$Network HP LaserJet P1505>
##$DFORMAT= <normdp>
##$LAYOUT= <+/1D_H.xwp>
##$LFORMAT= <normlp>
##$PFORMAT= <normpl>
##$SURQMSG= 1
$$ End of Bruker specific parameters
$$ ---------------------------------
##NTUPLES= NMR SPECTRUM
##VAR_NAME=  FREQUENCY,     SPECTRUM/REAL,   SPECTRUM/IMAG
##SYMBOL=    X,             R,               I
##VAR_TYPE=  INDEPENDENT,   DEPENDENT,       DEPENDENT
##VAR_FORM=  AFFN,          ASDF,            ASDF
##VAR_DIM=   32768,         32768,           32768
##UNITS=     HZ,            ARBITRARY UNITS, ARBITRARY UNITS
##FACTOR=    0.250966925370066, 1,           1
##FIRST=     8223.43324360094, -79680,       -110396
##LAST=      0,             -110465,         -173375
##MIN=       0,             -742382,         0
##MAX=       8223.43324360094, 460878512,    0
$$ Real data points
##PAGE= N=1
##DATA TABLE= (X++(R..R)), XYDATA
$$ [...]
19556C42301E6386e4338A19798a5220q7412B95779a71851F5423a07583A73221
19545G5449J41546F8015b05373l0046d0752j29924e6623A7487L1782d4965B61910
19533b12740J2086A94549j4182d4277k18150A4994b87340A38204a83732m0013
19523b23745e697j9481C8808K14999a03932r5293B81827K5078p3399D636e2173
19511b01452K980f7119C1509e8538K1578C41094A885K71601f799d87l3753j03692
19499a37932j12916B70035a16472B2714e463B29184c49848a38150j70726A83575
19488b4581m3593k36219k201J08649b6517j30730j00212b6388j41975l71532a3104
19476C23177n6443f6541j1822i70A29330K5887D8806g608k43852Q2952L5182A17013
$$ y = [342301, 56386, -54338, 119798, -15220, -102632, 295779, -171851, 65423, -107583, 173221, 75449, 216995, 68015, -205373, -235419, -40752, -170676, -56623, 17487, 49269, -44965, 261910, -212740, -200654, 194549, 180367, -44277, -262427, 14994, -287340, 138204, -183732, -223745, -5697, -25178, 38808, 253807, -103932, -199225, 281827, 306905, 233506, 4636, -52173, -201452, -198472, -67119, 31509, -58538, -36960, 341094, 1885, 273486, -6799, -487, -34240, -137932, -250848, 270035, -116472, 22714, -5463, 229184, -349848, -138150, -308876, 183575, -24581, -68174, -304393, -306594, -197945, -26517, -157247, -257459, -26388, -168363, -539895, -13104, 323177, 266734, -66541, -78363, -970, 129330, 155217, 48806, -7608, -251460, -168508, -133326, 117013]
19463b83915e350A25453c31100A62428o8677C9357c77646C25002a28033r1246
19453b19279j7192G2759d54681C35362b16919g6749A31209c17979g8957C0298
19442C19563E1470b9305G5559R7995a61317B75669h5369I7836a07985k06835A2837
19430a95794R7674B7290N6128b32160C9993h4015b8973p1209k76286q0094B1822
19418d84754a41758j74767Q222B75327R9958b8337j60818A58781N9229e8779o7903
19407a26682N2382a9164A39861b52694f5652r3889g4156A20976k7332a68671P1191
19396i7480I608O4765K13053a56118f5816k2865D6566b46703k3519M3397l4338
19385b61163C62029A27899b28036g3296q3699G3172a23546j3871j98435c1391
$$ y = [-283915, -5350, 125453, -331100, 162428, 93751, 39357, -377646, 325002, -128033, -219279, -236471, 72759, -454681, 335362, -216919, -76749, 131209, -317979, -78957, 30298, 319563, 51470, -29305, 75559, 173554, -161317, 275669, -85369, 97836, -107985, -314820, 12837, -195794, -98120, 27290, 83418, -232160, 39993, -84015, -28973, -100182, -376468, -456562, 21822, -484754, -141758, -316525, -308303, 275327, 375285, -28337, -189155, 158781, 218010, -58779, -126682, -74300, -19164, 139861, -252694, -65652, -159541, -74156, 120976, 93644, -168671, -97480, 9608, 74373, 287426, -156118, -65816, -88681, 46566, -246703, -270222, -226825, -261163, 362029, 127899, -228036, -73296, -156995, 73172, -123546, -137417, -335852, -31391]
19374a45173b6089k60822K9888a17996j81742J4775L4869f9610A35389e0801j92352
19363b43153e3529j17092J7242k30913A62591a5289B2580J14740a76003G1946
19352a71419f7580c2798B75638h6571E0549b71028O3945N1969c8803k94158G735
19340c6478j39433A99295c38715A35030n6462Q1763b26730g5847j44588e7849
19329a06821L5819b3074k14254A61837b8716a2887k10030P5798a7194o2352j99777
19318b79323a03687n5612G1782a21469l2481A13123C4678N9962g8407j5848A00851
19306b1951l1066j23318C3846b00944J7582P3939j3527A68316m8601a24445K6703
19295i7742l02240a08747h508A75941c15675A24709b77401B48614E1576J98937
$$ y = [-145173, -26089, -286911, -257023, -117996, -299738, -284963, -250094, -69610, 135389, -50801, -243153, -53529, -170621, -153379, -384292, 162591, -15289, 22580, 137320, -176003, 71946, -171419, -67580, -32798, 275638, -86571, 50549, -271028, -207083, -155114, -38803, -332961, 7735, -36478, -175911, 199295, -338715, 135030, 78568, 160331, -226730, -75847, -220435, -57849, -106821, -71002, -23074, -237328, 161837, -28716, -12887, -222917, -147119, -17194, -79546, -279323, -103687, -159299, 71782, -121469, -153950, 113123, 34678, 94640, -78407, -94255, 100851, -21951, -53017, -176335, 33846, -200944, -183362, -109423, -122950, 168316, 119715, -124445, -97742, -399982, -108747, -8508, 175941, -315675, 124709, -277401, 248614, 51576, 250513]
19285B50513b33502Q9407L028B08118H4204J6849e8659D2360J43076b58674h7868
19273C18929j2408g3315C6673J00943o1958f8203B77407K0118c31120B59931a89791
19261b90084i9727j51213B0605a50783e1291b4108k33484a24794L451l1039O1516
19250i0866j96840h1826j18612P7936e6541H031c51361H0264a42244A75777b7149
19238a82913J0152N8851B8036b6003j66334F8327J66365B9500J31179h9766C7847
19226a11994m9644Q0274a3920A0153N946L36153a28032n8352k8078A28671a77310
19214a77119B97717f6685a6448G87e8313k02093e357A1427b24037j14292A16046
19202b89858J6928D2893a95099o2178J8699C7128J70110E0237L0100b4753k27324
$$ y = [250513, -233502, -144095, -141067, 208118, 84204, 101053, -58659, 42360, 185436, -258674, -87868, 318929, 306521, -73315, 36673, 137616, 75658, -68203, 277407, 297525, -331120, 259931, -189791, -290084, -99727, -250940, 20605, -150783, -51291, -24108, -257592, -124794, -121343, -152382, -90866, -287706, -81826, -200438, -122502, -56541, 8031, -351361, 80264, -142244, 175777, -27149, -182913, -172761, -113910, 28036, -26003, -192337, 68327, 234692, 29500, 160679, -89766, 37847, -111994, -161638, -81364, -13920, 10153, 16099, 352252, -128032, -186384, -214462, 128671, -177310, -177119, 297717, -66685, -16448, 787, -58313, -260406, -5357, 11427, -224037, -338329, 116046, -289858, -272930, 42893, -195099, -257277, -238578, 37128, 207238, 50237, 80337, -24753, -252077]
19191b52077d720j18434D021f5444j36478R7594G7020J5869Q0721q6592c40602
19179g6764k19781e1838k2567A94249a98222g2082G8788b19975p1227B61632g6382
19167i7100B89590j13303b25235j4030a04316n2624O5384A3209K13410a06054
19156i9537A75195h4959a3859j12676j64344i8510K4490D47623c4741L728b026
19144i843j97322e1506j35699C1056i5402F7863B1857b85854C93987a32535a4584
19132a2488k0798k35240B8839a8289j44097f1993l3543J2494j15219Q7097j690
19121a12854M6100j34758j24298i8865b6160G1041b49481g8074n3172A3606a43760
19109A43322d03325J93444B71062a81186c3902B87460b42060A84722b10105n296
$$ y = [-252077, -4720, -123154, 4021, -65444, -201922, -104328, 77020, 92889, 173610, 87018, -340602, -76764, -296545, -51838, -74405, 194249, -198222, -72082, 78788, -219975, -291202, 261632, -76382, -97100, 289590, 176287, -225235, -239265, -104316, -156940, -91556, 13209, 226619, -106054, -99537, 175195, -84959, -13859, -126535, -290879, -98510, -74020, 447623, -34741, -31013, -2026, -9843, -207165, -51506, -187205, 31056, -95402, 67863, 21857, -285854, 393987, -132535, -14584, -12488, -33286, -268526, 28839, -18289, -162386, -61993, -95536, -83042, -198261, -111164, -112854, -66754, -201512, -325810, -98865, -26160, 71041, -249481, -78074, -131246, 13606, -143760, 143322, -403325, -209881, 271062, -181186, -33902, 287460, -242060, 184722, -210105, -215401]
19099b15401h2631G4070d6976o9135J4652B31720b32416O5294A04849C7121L09513
19088C46634f8723k9435k7529a5755A84798a41484f7384F4175b7602A39774b24948
19076e1190A97038a26216B747e7027A32769b29913o2137J32006B0124a05207c4193
19064a34486A61101a57524k0406g8651C761M54i1520K1289j64865H7704a3505
19052e3821m7019j17643O8988j01634A27447a1748r7034P380d8343G5773J28740
19041B04513h2995n5633F2572a48003b2896E9544J12562c8321A50309b8945j32824
19030a61769H2200P5951N3992q3636a3552A32353a47773d0782B03457a69221j31035
19019c00256h4448j82861c9067B22789b6161j07054A94457b43872E5980J08268
$$ y = [-215401, -82631, 74070, -46976, -116111, -101459, 231720, -232416, -167122, 104849, 37121, 346634, -68723, -98158, -125687, -15755, 184798, -141484, -67384, 64175, -27602, 139774, -224948, -51190, 197038, -126216, 2747, -57027, 132769, -229913, -292050, -160044, 20124, -105207, -34193, -134486, 161101, -157524, -177930, -78651, 3761, 4215, -91520, -70231, -235096, 87704, -13505, -53821, -100840, -218483, -149495, -251129, 127447, -11748, -108782, -101402, -48343, 75773, 204513, -82995, -138628, 62572, -148003, -22896, 59544, 172106, -38321, 150309, -28945, -161769, 82200, 158151, 212143, 128507, -13552, 132353, -147773, -40782, 203457, -169221, -300256, -84448, -267309, -39067, 222789, -26161, -133215, 194457, -243872, 55980, 164248]
19009A64248c6237p8948A29180a30816j1815G5466g2205k3866m5951C06728a04925
18997a57346A24728C6989a61275L9933k01848j6429C2044b06351k03295l9947
18987d49593f3342A87366a95486j7741P443P3266A13773a09254B9878J00508E401
18975d9103B83051j09279f0762A05773a25011H676a31697F9716A016J10662a50098
18963b8073C24737n0054b48878J15621J3669A30277b09558c1738B9546b76714
18952D08203i2942q7667r7525A62113G609J32302d79622h4041c2395o6866k87813
18941c87074G3890a16691J4658G1912B9474R7357a86566r250b6247n0222A10164
18929A9439Q7627e1197I3595c75375c691A68936d0994A48406b27454d8323A4258
$$ y = [164248, -36237, -115185, 129180, -130816, -142631, 75466, -72205, -96071, -142022, 306728, -104925, -157346, 124728, 36989, -161275, -121342, -323190, -339619, 32044, -206351, -409646, -449593, -63342, 187366, -195486, -213227, -205784, -132518, 113773, -109254, 29878, 130386, 5401, -49103, 283051, 173772, -60762, 105773, -125011, 8676, -131697, 69716, 1016, 111678, -150098, -28073, 324737, 274683, -248878, -133257, -119588, 130277, -209558, -31738, 29546, -276714, 408203, -92942, -180609, -278134, 162113, 7609, 139911, -479622, -84041, -32395, -99261, -387074, 73890, -116691, -102033, 71912, 29474, 126831, -186566, -195816, -26247, -76469, 110164, 19439, 107066, -51197, 93595, -375375, -3691, 168936, -40994, 148406, -227454, -48323, 14258]
18917A41167e9393C26898i2329b0120l58759J70094j03648e2448k63676C13470
18906C1792c0410j2813k9452q813J2551A18593n3963K8865a53108a7078q3068
18895a00146k11405B11780h8454l3431l9557A57588C4954J16867C9471b8263p134
18884c5397k4622D8004R0067b35678J08688B94108a81158M8053M5081j6567I6999
18872A78284a80378p3605A25108a63330r4449C0642a91625G4820b77732D2988
18861B23969d491B06508K2005j3498n668b18092g5206A7576J15720a30085K8941
18850a01144C7236a64900I7513h8772A417L14742c06176m4300B75749e2775l59651
18839d12426a42419C2277c20814n7571i8295E08664B3288a33270M8191N303I3924
$$ y = [141167, -59393, 326898, -92329, -20120, -378879, -208785, -312433, -52448, -316124, 313470, 31792, -30410, -43223, -72675, -81488, -68937, 118593, 64630, 93495, -153108, -17078, -100146, -311551, 211780, -88454, -121885, -161442, 157588, 34954, 151821, 39471, -28263, -35397, -60019, 48004, 138071, -235678, -126990, 294108, -181158, -133105, -88024, -104591, 96999, 178284, -180378, -253983, 125108, -163330, -257779, 30642, -191625, 74820, -277732, 42988, 223969, -4491, 206508, 228513, 215015, 209347, -218092, -75206, 17576, 133296, -130085, -101144, 37236, -164900, 97513, -88772, 1417, 316159, -306176, -350476, 275749, -52775, -412426, -142419, 32277, -320814, -378385, -98295, 508664, 23288, -133270, -85079, -79776, 93924]
18827a32150n58J0956j03945h3224B08108b31942g9309j71446A70409a73029A37272
18815d0299B277a49722B88278f0785j51018A55343K57696a58674B98414a11811
18804I8162a4929N451j91824d6356B7423J9370J32012a47483n392n1888O6267
18793a38496k89101F8306J10733b38233A141J5552d13082a82836j95520b6462
18782I6858K14984Q4181I17b83041Q79P9933C6253a78644O9163A93365a42380
18770a8181A91558b7813I5729b43745J19641e8382q9848A65312a6962A93080f6542
18758a26070k5696A18579b52593n6703H652a04145l2769q8490d9923A85762a05615
18746d7899k92827B18227b81416A24620a39353B35906K3275a18408M4743k28155
$$ y = [-132150, -132708, -121752, -225697, -83224, 208108, -231942, -79309, -250755, 170409, -173029, 137272, -40299, 2277, -149722, 288278, -60785, -211803, 155343, 413039, -158674, 298414, -111811, 98162, -14929, -9478, -201302, -46356, 27423, 46793, 178805, -147483, -152875, -204763, -138496, -427597, 68306, 179039, -238233, 1141, 16693, -413082, -182836, -378356, -26462, 96858, 311842, 396023, 917, -283041, -282162, -202229, 36253, -178644, -109481, 193365, -142380, -18181, 191558, -27813, 95729, -243745, -124104, -58382, -148230, 165312, -16962, 193080, -66542, -126070, -151766, 118579, -252593, -309296, 8652, -104145, -136914, -225404, -49923, 185762, -105615, -47899, -340726, 218227, -281416, 124620, -139353, 235906, 259181, -118408, -73665, -301820]
18736c01820a32308F4045a90830j2915i0687j0301B02449n9015J63727d70661
18725b45396H4207p551j8322j8704N42h1607r5390l1568C6605g6950k13847j07107
18713c97904J14350g111E9149a37480O897j76169a06527A03484e27035H5811c2660
18701B11397j5246n9230l2469i7518d2078i69A65429d6756D5927b40647h0630
18689d2669A46231b67236E3330c63572D9693a13341j60220a13665B1398b27295
18678a01246A0359a02435j25433A02518c02225a892A1551i6707j02108j85000
18668c83815a02625E0743b77480N2109H6810J00790a03541C58479j13204e7624
18657b86054Q9055F3162a3481j22962O7150l47457a96732P257G5954J19427c76002
$$ y = [-301820, -132308, 64045, -190830, -203745, -90687, -100988, 202449, 143434, 307161, -470661, -245396, 84207, 76656, 58334, 39630, 40172, -81607, -176997, -208565, 36605, -76950, -290797, -397904, -283554, -7111, 59149, -137480, -130583, -306752, -106527, 103484, -527035, 85811, -32660, 211397, 196151, 136921, 104452, -97518, -42078, -969, 165429, -46756, 45927, -240647, -80630, -42669, 146231, -267236, 53330, -363572, 49693, -113341, -273561, -113665, 21398, -227295, -101246, 10359, -102435, -227868, 102518, -302225, -1892, 11551, -96707, -198815, -383815, -102625, 50743, -277480, -225371, 86810, 187600, -103541, 358479, 245275, -57624, -286054, -196999, 63162, -13481, -136443, -69293, -416750, -196732, -189475, 75954, 195381, -376002]
18645c3081m5773A23201a09089h14D8636E007K85682E2950Q6937j8332m559f596
18632A74337a59830A13570G802c03512J09689O4686f0899c0097C77258a84074
18621A50021J7993c3762C59590A10273a98751P4740j78543O8485g4203R89c1452
18609H5698O2492A4458a0444j12309N3710m4366n3686C39126j04561a56006O5058
18598i0948C505a45606L6100N0281j0222A56169a3006m79984I0577k1004a20699
18586G5521i1124r681j35559D6934a62253f9745F099b27674B6880a02077c6839
18574a1833k49537A47935o3793A4975b40693a20202b3492H1345A5220b98331b7491
18562b52353b7043B65283d9067j15954A50040b25436E5922e7239E6436b8768j6900
$$ y = [-33081, -78854, 123201, -109089, -814, 48636, 5007, 290689, 52950, 139887, 121555, 116996, -6596, 174337, -159830, 113570, 7802, -303512, -193823, -129137, -60899, -30097, 377258, -184074, 150021, 168014, -33762, 359590, 110273, -198751, -124011, -302554, -234069, -74203, -73214, -31452, 85698, 148190, 14458, -10444, -122753, -69043, -113409, -167095, 339126, 234565, -156006, -90948, 3505, -145606, -109506, -59225, -69447, 156169, -13006, -492990, 90577, 69573, -120699, 75521, -91124, -100805, -236364, 46934, -162253, -69745, 6099, -227674, 26880, -102077, -36839, -11833, -261370, 147935, 84142, 14975, -240693, -120202, -23492, 81345, 15220, -298331, -27491, -252353, -27043, 265283, -49067, -165021, 150040, -225436, 55922, -57239, 56436, -28768, -45668]
18551d5668k09214A6841f0007n8269j91345E9087d7935j43410A1503M8932d37124
18539e19874b45812f7346k9011L5363B38661f3330q78g752A01561J45055c23668
18527C15281A7768a15337F1565M4590i1732A53860c8816c335j87289J5839n094
18516a79879g207j44653A02481a11767j41986a08178j52594k47830A32090E5391
18505I498a86455p3041f1370h748k03777B14134a75719n4185K0172g6381A25995
18493c59792a34461d1273q8479j94296H5135M3717A2131c03932c3765r7167e0226
18481A72734b20100o5490J33452J5082N8310j58804A40254L3632b84015J13131
18471a70884A44493K05244E9700q692J60745Q1804f1026D8123J20997n0392d30356
$$ y = [-45668, -254882, 16841, -60007, -118276, -309621, 59087, -47935, -191345, 11503, 60435, -437124, -519874, -245812, -67346, -96357, -60994, 238661, -63330, -64208, -7752, 101561, 246616, -323668, 315281, 17768, -115337, 61565, 106155, -91732, 153860, -38816, -3335, -190624, -174785, -179879, -7207, -151860, 102481, -111767, -253753, -108178, -260772, -508602, 132090, 55391, 9498, -186455, -259496, -61370, -8748, -212525, 214134, -175719, -229904, -209732, -76381, 125995, -359792, -134461, -41273, -129752, -324048, 85135, 128852, 12131, -303932, -33765, -130932, -50226, 172734, -220100, -285590, -152138, -137056, -78746, -237550, 140254, 173886, -284015, -170884, 144493, 349737, 59700, 51008, 211753, 293557, -61026, 48123, 169120, 118728, -430356]
18459a62046f9203A38496H650i0553B30437o7414F5878M2043K40575a97670A78814
18447B46613j23180b01060k01511g0398A14065B0568J86841a48664E2217f93A57898
18435a63224K9710k32745A12230a19461M506l600n370l2440j5031n3925o7652
18424b92973A51120a49497O7192B68063a27628A75048o7724i5691A44627a13358
18413e59821E7408a66409A2856M00783H68K13042C737d1889j75930i3775J9984
18402g3791l05418C94139b8023h014o4152K0128k39B53092b49831a04852L2572
18391g2280J5569A81771i6592J6793D20049h0230H4135K19203D3554a87893j6632
18380b04525f6462I1082d4217j52267D0032J23756j4025c3435j61502E4197O4198
$$ y = [-162046, -69203, 138496, 8650, -90553, 230437, 163023, 65878, 107921, 348496, -197670, 178814, 246613, 123433, -201060, -402571, -70398, 114065, 20568, 207409, -148664, 52217, -693, 157898, -163224, -133514, -366259, 112230, -119461, -114955, -118555, -123925, -156365, -171396, -225321, -292973, 151120, -149497, -82305, 268063, -127628, 175048, 107324, -95691, 144627, -113358, -559821, 57408, -166409, 12856, 413639, 868, 213910, 3737, -41889, -217819, -93775, -73791, -379209, 394139, -28023, -8014, -72166, -52038, -52277, 253092, -249831, -104852, -72280, -56711, 181771, -96592, -79799, 420049, -80230, 84135, 303338, 43554, -187893, -204525, -66462, 91082, -44217, -196484, 40032, 163788, 149763, -33435, -194937, 54197, 118395]
18369A18395L9850k8828J29245p0369N7946n1166a54863B52028E2236J4484A4683
18357e6468A67716b67101d0551E7444J73004b45982I3053a41426f9116A1975a60705
18345a64375g8372C21203H4005a62111B07122G589a62125A80921b03423n944j10133
18334c19500A70770g2565j8072n8078O4468H5965J36225a26688d6855a9138Q087
18323a1051k14259b9315C32901a49524j07617J13192a4433k52635c6049F2933
18312b35885B22086A015J30913k3375a49702H9859a56015H1172C6065J89287a42316
18300A96077c07458O5683d4885G746J482c39031E4985a17863l32410D48226E9148
18288a88242l38238A15608a12212A27681d1049j07360F4627j1747d0591C08380
$$ y = [118395, 158245, 129417, 258662, 188293, 246239, 195073, -154863, 252028, 52236, 66720, 14683, -56468, 167716, -267101, -40551, 57444, 230448, -245982, 93053, -141426, -69116, 11975, -160705, -164375, -78372, 321203, 84005, -162111, 207122, 7589, -162125, 180921, -203423, -209367, -319500, 170770, -72565, -90637, -148715, -84247, 85965, 222190, -126688, -46855, -19138, -11051, -225310, -29315, 332901, -149524, -257141, -143949, -14433, -267068, -36049, 62933, -235885, 222086, 1015, 131928, 108553, -149702, 89859, -156015, 81172, 36065, 225352, -142316, 196077, -307458, -241775, -44885, 7746, 9228, -339031, 54985, -117863, -450273, 448226, 59148, -188242, -526480, 115608, -112212, 127681, -41049, -148409, 64627, 52880, -40591, 308380]
18277a81429C7872j0688E692K17554J36181a23391b1923l9489K5841k07593h2150
18265b8265q446o7360l33125D03459g1934F0630J11657c0208B37665a55886j15733
18254b71619J15927B61492a22055e7089j2605j98725C3454b98040j29399K07196
18244b20243A35987a47595K9570A40784d5155j44237g2821j70241C05888a21151
18233A74893a27574B05443a79443J4243j36340B76404j21666b81775B9807J41590
18223A71397F46a25470A38855k4125a37325N0989j67661O2508A02739K7759b99137
18211B60430a20577O416e3789k46569a03841a52j30098K7607a1606B967O5102
18200F8069O3583b74377a21687A14183b65637I4816R5889B8888L4721j4495J54970
$$ y = [-181429, 37872, 27184, 5692, 223246, 359427, -123391, -21923, -61412, -35571, -243164, -82150, -28265, -36711, -104071, -437196, 403459, -71934, 60630, 172287, -30208, 237665, -155886, -271619, -155692, 261492, -122055, -57089, -69694, -268419, 33454, -298040, -427439, -220243, 135987, -147595, -118025, 140784, -45155, -189392, -72821, -243062, 305888, -121151, 174893, -127574, 205443, -179443, -165200, -301540, 276404, 154738, -281775, 29807, 171397, 646, -125470, 138855, 114730, -137325, -86336, -253997, -191489, 102739, 130498, -299137, 260430, -120577, -114161, -53789, -300358, -103841, -152, -130250, -102643, -11606, 2967, 68069, 131652, -274377, -121687, 114183, -265637, 94816, 190705, 28888, 63609, 49114, 204084]
18189B04084a52187E44a14114B9316K67663b41556E5324f5284k57800j18107C7566
18177B11855c64943J33682J08148l05689l2205c5286o8593p9756A03258p578A9297
18165G7471b68158c983A65780A8064c55235F4381b44356A6118J33605F701K08178
18154B14879I026M6669c03677B7216h4705H6052J9063g8854C215h4450j92513
18143b76963A1802e15454E9426k7654i8117C23b161k7267A35973a08583o0763
18132a69346Q3943A5723K47196a87366E350a03160j9645A77219f7468k27853A32271
18120b02175n0421B17172g0687F0810h9038B48464a00386L7256E69K57877j08271
18109A50175J8973q189a95603B1827Q027J00882D799g9271B28154a11608k9449
$$ y = [204084, -152187, 544, -114114, 29316, 296979, -241556, 55324, -65284, -323084, -441191, 37566, 211855, -364943, -231261, -123113, -428802, -461007, -35286, -103879, -183635, 103258, 95680, 19297, 77471, -268158, -3983, 165780, 18064, -355235, 64381, -244356, 16118, 149723, 6701, 214879, 9026, 55695, -303677, 27216, -84705, 86052, 105115, -78854, 3215, -84450, -276963, 11802, -515454, 59426, 31772, -98117, 323, -2161, -29428, 135973, -108583, -169346, -85403, 15723, 262919, -187366, 5350, -103160, -122805, 177219, -67468, -295321, 132271, -202175, -252596, 217172, -70687, 60810, -89038, 248464, -100386, -63130, 569, 258446, 150175, 169148, 160959, -195603, 21827, 29854, 130736, 4799, -79271, 228154, -111608, -141057]
18098a41057B82710A0152a27990C1352b17291A746a2907l9689k52986j21127j03094
18087e29803A8330b8542A3200K402k694J22697J41278g5029A1890J52407g5694
18075F2563M509c71298A22774c8669B88008F0063J145a46054c0163k59331A71596
18063i1174j39611f5427E0259a70455B12029k7054a23512a95B34696B1835e7576
18051A46197a36724B3239L47947j65625I6471a69684L2365A08619a60615c5638
18040A44546c0999A58609k4287a56299P1758E601a71419K5808K6631j23938B05677
18028b15557o092H0567C2630Q258h4721A62956b39789I8525i652j34919K3787
18017a20784F6897a74901q3403J19947G2800a3913j80320A34483K06378a18523
$$ y = [-141057, 282710, 10152, -127990, 31352, -217291, 1746, -12907, -52596, -305582, -426709, -529803, 18330, -28542, 13200, 15602, 12908, 135605, 276883, -75029, 11890, 164297, -75694, 62563, 67072, -371298, 122774, -38669, 288008, 60063, 61208, -146054, -30163, -289494, 171596, -91174, -230785, -65427, 50259, -170455, 212029, 184975, -123512, -195, 234696, 21835, -57576, 146197, -136724, 23239, 371186, 205561, 96471, -169684, -137319, 108619, -160615, -35638, 144546, -30999, 158609, 134322, -156299, -84541, 5601, -171419, -145611, -118980, -242918, 205677, -215557, -221649, 80567, 32630, 40888, -84721, 162956, -239789, 98525, -9652, -144571, -120784, 66897, -174901, -258304, -138357, 72800, -13913, -194233, 134483, 340861, -118523]
18006b97917B0280b30460k07772a26902A6990Q2198P8970a7574l7966B54494m445
17995B50049D8706J4076a02838E9249a46931n5735A07264l3781l1126f38123K52366
17984c85757A20115a97068A27568m973N3387g9904A80506e6731i525D8473c70375
17972I8125b07756m149b0071b833A1625d8204A75040a57565C25135F0920J02213
17961A63133k9105c12586Q3079F3923K1305g5497j38198O0544A81064b6587j48246
17950a74833g2751a0836B58664C7530c48697J71778A69153G9544l1305L4775K1418
17939A04432b79061Q1834Q3928J9428n6231j1486A25637a72639H970L34228j15950
17928B27248c12166J29678B38609a72007A63258d15337a25987j89780h3285o1032
$$ y = [-297917, 20280, -230460, -438232, -126902, 16990, 99188, 178158, -17574, -55540, 254494, 250049, 48706, 62782, -102838, 59249, -146931, -202666, 107264, 73483, 42357, -638123, -385757, 120115, -197068, 127568, 122595, 175982, -79904, 180506, -56731, -9525, 48473, -370375, 98125, -207756, -211905, -20071, -2833, 11625, -48204, 175040, -157565, 325135, 60920, 163133, 134028, -312586, -229507, 63923, 85228, -75497, -213695, -153151, 181064, -26587, -174833, -72751, -10836, 258664, 37530, -348697, -176919, 169153, 79544, 48239, 83014, 104432, -279061, -197227, -113299, -93871, -150102, -161588, 125637, -172639, 8970, 343198, 227248, -312166, -182488, 238609, -172007, 163258, -415337, -125987, -315767, -83285, -144317]
17918a44317E4840R4704e771n0440I7871Q5599b35684i0082j7049q1713M0649
17907a48195b9370B89179f2591F4916b31786G0360c75190B27176o1935F0965b57331
17895g2697j15510B11315F6716K3311N2892K7983o2067n2182j1554i2305A31905
17883B2134J71137i5316D643a77548O7267L8229A9364b0510A33783a56495e6124
17871d3940J5765l42380A6465i5847A30092k8968a59514A46687c53917A03216
17860d5332C0283a11645G2434J83311c56618A51001b82595B65435a98584C00499
17849B90331c29875f2102B03432Q2379j02255A3947a56406H8763i6217H0641b43310
17837c22329J33768b4262A58792a06285K6440E6062f9349A70735L9445a85623
$$ y = [-144317, 54840, 149544, -5771, -56211, 97871, 183470, -235684, -90082, -107131, -188844, -148195, -29370, 289179, -62591, 64916, -231786, 70360, -375190, 227176, 165241, 60965, -257331, -72697, -188207, 211315, 66716, 90027, 142919, 170902, 108835, 56653, 45099, -92305, 131905, 22134, 193271, -95316, 4643, -177548, -110281, -72052, 19364, -20510, 133783, -156495, -56124, -43940, -28175, -370555, 16465, -95847, 130092, 101124, -159514, 146687, -353917, 103216, -45332, 30283, -111645, 72434, 255745, -356618, 151001, -282595, 265435, -198584, 300499, 290331, -329875, -62102, 203432, 285811, 183556, 13947, -156406, 88763, -96217, 80641, -243310, -322329, -188561, -24262, 158792, -106285, -79845, 56062, -69349, 170735, 210180, -185623]
17826D7359J13346C2438a18621c3326B35100A2178K3407h7495j86870h8759r2849
17815a81608d7150G2082f9706l7742C5878b29833Q9308G4698a8499F9205L379
17804G2584b412B201a39929d9034B04182L5892P6606A53793J90234a75004p3674
17793b48678B7032E707a25255B59823D9698i6108R883j01482H9075L0662M0032
17782A59769E4023a73205L5625j1248C55297I2203H623a42072A5390J13378l4358
17771I4410B9637a03743k07023A51647a03352A76226a6942m8999C1587K19102
17761B50689i6811j93411H1341a49377B96418A29999J8842a28734j946b0852b555
17749a4129A65988G4719a29396A09516a6454q5757d5859C61271B6379J53866a18221
$$ y = [47359, 160705, 32438, -118621, -33326, 235100, 12178, 35585, -87495, -274365, -88759, -181608, -47150, 72082, -69706, -107448, 35878, -229833, -140525, 74698, -18499, 69205, 72584, -2412, 2201, -139929, -49034, 204182, 240074, 316680, 153793, 344027, -175004, -248678, 27032, 5707, -125255, 259823, 49698, -96108, -86225, -187707, 89075, 119737, 159769, 54023, -173205, -137580, -148828, 355297, 92203, 8623, -142072, 15390, 128768, 94410, 29637, -103743, -310766, 151647, -103352, 176226, -16942, -65941, 31587, 250689, -96811, -290222, 81341, -149377, 296418, 129999, 148841, -128734, -130680, -20852, -2555, -14129, 165988, 74719, -129396, 109516, -16454, -102211, -45859, 361271, 26379, 180245, -118221]
17737b39950A82589e2078F9410e8832q4940A10804a027j61676e465j34202A41973
17725b40917a07050j35811A30827b27563k0863b3478B55915b931k61831B11514
17714f2413B34153b50866B9327J40528d09879a54450C9933K521L7770K0463h7265
17702b54094a7829A97363b99125f0916A04768a10903l8985D9116K87618f7574
17691B86136A19007b22855c6061H6552l2854h7389F4240P8192g3927I0937A4327
17679C19096c32B19983h4602F319K34327H0020d5303A40262a3110C78720d89365
17667A38563h416j04626j754j75949m4447a13544B45221j01628e7646A39355a86598
17655B22533h7794A6402a30784A13279g4198f985k7597j33090C7176Q7633o0383
$$ y = [-239950, 182589, -52078, 69410, -58832, -143772, 110804, -1027, -162703, -5465, -139667, 141973, -240917, -107050, -242861, 130827, -227563, -248426, -23478, 255915, -2931, -264762, 211514, -62413, 234153, -250866, 29327, 169855, -409879, -154450, 39933, 42454, 80224, 100687, -87265, -254094, -17829, 197363, -299125, -60916, 104768, -110903, -149888, 49116, 336734, -67574, 286136, 119007, -222855, -36061, 86552, 53698, -87389, 64240, 142432, -73927, 90937, 14327, 319096, -332, 219983, -84602, 6319, 240646, 80020, -45303, 140262, -13110, 378720, -489365, 138563, -8416, -113042, -114796, -290745, -335192, -113544, 245221, 143593, -57646, 139355, -186598, 222533, -87794, 16402, -130784, 113279, -74198, -6985, -34582, -167672, 37176, 124809, 64426]
17644F4426b03241A72155B5263g8312k68426A13466a83653c6680B61838j11254
17634A50584B6667c822C77406b02168k03112B3158a10132j7464H2870b8750E8517
17622a75680a8516I2149k8862E808a0106D02686b67440d7006j00566D30764a71409
17610B02312k3369J34167r0951a3303A0970e2577D6406j031a09553n8607j41083
17599c09243a28869d5407r4861e6840q196A4745b5669A57547p7133M0307A4269
17587b09120H5021f1519A21995a61332B84190a21016I1038c9240A54202b37388
17576G6551M0641g1498C05357A35998J11294D6393J77924J34661e904A0867J39166
17565A50033G0807K20717K6595G1764d66115a31301A69280a74009b8877B01385
$$ y = [64426, -203241, 172155, 25263, -78312, -346738, 113466, -183653, -36680, 261838, 150584, 26667, -3822, 377406, -202168, -405280, 23158, -110132, -127596, 82870, -28750, 58517, -175680, -18516, 92149, 63287, 5808, -10106, 402686, -267440, -47006, -147572, 430764, -171409, 202312, 178943, 313110, 222159, -13303, 10970, -52577, 46406, 45375, -109553, -168160, -309243, -128869, -45407, -140268, -56840, -65036, 14745, -25669, 157547, 80414, 120721, 14269, -209120, 85021, -61519, 121995, -161332, 284190, -121016, 91038, -39240, 154202, -237388, 76551, 117192, -71498, 305357, 135998, 247292, 46393, 224317, 358978, -5904, 10867, 150033, 70807, 291524, 318119, 71764, -466115, -131301, 169280, -174009, -28877, 201385]
17554b5309J845j16538B7319J48238a60168I5819B3528K72267a34731B09110b67434
17542A03114A322e4821G3210a77734A33897a2763B8480J48052A3338b88145D8229
17530b77256B34751G5951C345a94229B65128m7583C6378K4278e7310B4177b02851
17518B59425a13771D08327e2897E5193K76568A46384a53958c7574j35361E6512
17507B18653C2440N6089j2946a01853B55242j9528j0836h1317j59811C58232A20160
17495b4191j51535A63196O8550K4860g2406F9013m6a19859C19705A03255J27670
17484B30925a30898G5789J34232I6989J62738A09800m7154b3184B64516l361J78842
17473D39997b30717A93783P571m7865k9273d3722o7490D14157j73453H2256F956
$$ y = [-25309, -23464, -140002, 27319, 175557, -160168, 95819, 23528, 295795, -134731, 209110, -267434, 103114, 1322, -54821, 73210, -177734, 133897, -12763, 28480, 176532, 13338, -288145, 48229, -277256, 234751, 75951, 3345, -194229, 265128, 217545, 36378, 60656, -57310, 24177, -202851, 259425, -113771, 408327, -52897, 55193, 331761, 146384, -153958, -37574, -172935, 56512, 218653, 32440, 88529, 75583, -101853, 255242, 235714, 224878, -81317, -241128, 358232, 120160, -24191, -175726, 163196, 231746, 256606, -72406, 69013, 68967, -119859, 319705, 103255, 230925, -130898, 75789, 210021, 96989, 259727, 109800, 62646, -23184, 264516, 261155, 439997, -230717, 193783, 201354, 153489, 124216, -43722, -111212, 414157, 240704, 82256, 6956]
17461D66930B01531I9482J70053m0278J1613e5235A59398n7929L03515A54252
17450H1136P8644J31779J03581l5996j39262J3608J3014m5361K25321H2284c64841
17438A96113M8164L17669a5079D08284A77720J76904j58035m6068K51328C0223
17427e7772D49946l8815O9979B16543I9730M22595b3568C10648j08409l5426j1783
17416A55030K84363A93274a34250B78043G5959M08102b2216j3111B75134A14560
17405e5914A67440K97321D173d7209J2075f306p0139E8193M7282f1490l16975
17394c78465F9406J06716I956J27108M2523q2827J25879J94110J9841f3062H4930
17382D9660O819c1438C17783g6714C00154j39180E3100M6227K68598p6281j10045
$$ y = [466930, 201531, 99482, 269535, 229257, 240870, -55235, 159398, 101469, 404984, 154252, 81136, 159780, 291559, 395140, 359144, 219882, 233490, 246504, 201143, 426464, 82284, -364841, 196113, 244277, 561946, -15079, 408284, 177720, 354624, 196589, 150521, 401849, 30223, -57772, 449946, 411131, 481110, 216543, 99730, 522325, -23568, 310648, 202239, 166813, 155030, 439393, 193274, -134250, 278043, 75959, 484061, -22216, -35327, 275134, 114560, -55914, 167440, 464761, 4173, -47209, -35134, -6306, -76445, 58193, 105475, -61490, -378465, 69406, 176122, 9956, 137064, 179587, 96760, 222639, 416749, 436590, -63062, 84930, 49660, 56479, -31438, 317783, -76714, 300154, 160974, 53100, 99327, 367925, 291644, 181599]
17371A81599J41140A22916M2170b3443C89567L3575F6329K44050m8085A17916
17360B13360a14815J512d0588A015b21587C82709o7739A13870e9665A60173Q9207
17349B49380R0340j11083K47165m1549j94541e0799A08137e0143J7784A85358
17338e4561B43526j04086D3605i6358I9802J96638A19558M7639p0578P0261N4607
17327B21487c6742C61872A9798i5736A18041N0763J2582l3927a94613B51477o4153
17316A87324K04759C4221K68012r4461P5163a5180B60272j13988O7791p7964e7536
17304A01521k6587K51070A22226M3128M2367J44960b2474A72631J61313A42785
17293C6371J13868b8901C30546r2746A14110b97411B19942o085A02023d5594B16752
$$ y = [181599, 322739, 122916, 165086, -23443, 389567, 423142, 66329, 310379, 262294, 117916, 213360, -114815, -113303, -40588, 1015, -221587, 382709, 314970, 113870, -59665, 160173, 249380, 339720, 228637, 475802, 434253, 239712, -50799, 108137, -50143, -32359, 185358, -54561, 243526, 139440, 43605, -96358, 99802, 296440, 119558, 167197, 96619, 166880, 221487, -36742, 361872, 19798, -95736, 118041, 168804, 181386, 147459, -194613, 251477, 187324, 392083, 34221, 302233, 207772, 282935, -15180, 260272, 146284, 214075, 136111, -57536, 101521, 74934, 326004, 122226, 165354, 207721, 352681, -22474, 172631, 333944, 142785, 36371, 150239, -28901, 330546, 237800, 114110, -297411, 219942, 213857, 102023, -45594, 216752]
17281B60158j1432c90885A07575K012D7974J97774j22312R7963b41333A20748
17270A96880i7223B22667M5751a12764C97962q2996g0382I8213K8567C3918J28421
17259A62339j0604f36A43776J01853I9170N5029E2713K96453e7036A93511K30963
17248D24474A22553L55N08026k73564C3886J65277D5843c2678m1157a3012C6471
17236E6413J55294F1888J53839E3211M8119C0888K46510l6311K11846A41502J05859
17225B47361j10507k6818a72876B87370l1935J60986E2526d9123B21103K58703
17215D79806C3903J17806J2324J84038F4189P3251Q1578M5023C8420g4260j99012
17204b73272B62772J8887q3898p2420D5740M02402J75547g7535A41155K95294
$$ y = [260158, 248726, -390885, 107575, 109587, 47974, 245748, 123436, 221399, -241333, 120748, 196880, -97223, 222667, 268418, -112764, 397962, 314966, -70382, 98213, 126780, 33918, 162339, 151735, -636, 143776, 245629, 99170, 154199, 52713, 349166, -57036, 193511, 424474, 122553, 122908, 630934, 357370, 33886, 199163, 45843, -32678, -73835, -13012, 36471, 56413, 211707, 61888, 215727, 53211, 101330, 30888, 277398, 241087, 452933, 141502, 247361, 136854, 110036, -172876, 287370, 255435, 416421, 52526, -49123, 221103, 479806, 33903, 151709, 164033, 348071, 64189, 137440, 219018, 264041, 38420, -74260, -273272, 262772, 281659, 197761, 125341, 45740, 448142, 623689, -77535, 141155, 436449]
17194D36449j53298N3878j59288B3496K33251K50561A45345h6250B43464c23994
17183C87818j90636L96840A81609P1233H4407N1499J12234r5958L43693k34403
17173B61472b9654B88230C3130M36241A31223N4866j1036N19634A16421L49916
17163D66337A90297m0837J29311j6532O5539O2108j72314m8376L30992j620D1074
17151D79366I1309J16868p3754Q350K1656L97072l3602A55663B6064J03914K23516
17140C53494j19915L27439I5274K29834j29328K44639B04592J08491L9085A62111
17129A01896N0023K50210j3455J08972k09952j19438M5203K04747P2473Q8536
17119E79215j60945L468j40176M54170B38584J89449i2835C15786J01614K055
$$ y = [436449, 283151, 337029, 177741, 23496, 256747, 507308, 145345, -86250, 243464, -323994, 387818, 197182, 594022, 181609, 252842, 84407, 135906, 248140, 152182, 495875, 261472, -29654, 288230, 33130, 469371, 131223, 186089, 175053, 694687, 116421, 466337, 190297, 149460, 278771, 262239, 327778, 389886, 217572, 169196, 500188, 498568, 41074, 479366, 91309, 208177, 134423, 142773, 164429, 561501, 527899, 155663, 26064, 129978, 353494, 233579, 561018, 95274, 325108, 195780, 440419, 204592, 313083, 352168, 162111, 101896, 151919, 402129, 388674, 497646, 287694, 168256, 213459, 418206, 490679, 579215, 418270, 421738, 281562, 735732, 238584, 428033, -92835, 315786, 417400, 419455]
17109D19455G3919J37877L67545k42792k9736K78339A94577K12145k1155M5601
17099D31168J79650A17335K3939Q5313J87096A85986F1757J37199L33490K1550
17089E53996j26676m2801k2001R8492j15963J02975R8652k20273N08969C17686
17078A94875j0619K13411k9928J04119B29842K55105j60888L10520B87260L44078
17068F31338l08310K20546A98738M97515j10216j81336j73399J80471J07036n7767
17058D61042K68899k18417n3027j8596L69437k30990A43244L57185j88768K09787
17048E21448B43292K71982M3956L00203C09632L85782j82039O6476A45023L94583
17038E39606B15858J67145j09215M59492j68032L3698B79961K09694B28636J97723
$$ y = [419455, 73919, 211796, 579341, 336549, 306813, 585152, 194577, 406722, 385567, 431168, 610818, 117335, 141274, 226587, 413683, 185986, 61757, 198956, 532446, 553996, 427320, 384519, 362518, 461010, 345047, 448022, 546674, 326401, 835370, 317686, 194875, 184256, 397667, 367739, 471858, 229842, 484947, 324059, 634579, 287260, 631338, 323028, 543574, 198738, 696253, 586037, 404701, 231302, 411773, 518809, 461042, 729941, 511524, 458497, 439901, 809338, 578348, 143244, 500429, 311661, 521448, 243292, 515274, 559230, 859433, 309632, 695414, 513375, 579851, 145023, 539606, 215858, 383003, 273788, 733280, 565248, 598946, 279961, 489655, 228636, 426359]
17028D26359j11348M04069j97326L4014j15719L22134C71756j03797A31316M68191
17018E99507P2930o8733L03409k86581m7011L57251k37955k99216M4780K83251
17008G21632j63594o8178M35345r2975j37373J29835Q1607l29698J21253j8441
16998F79413J64578q913p4132p7763j29493L04833q2169K33141l22653L5521Q8329
16987H10692l51769K32123R1273C74895J37461K51614p1457k61103L41025L05462
16977A077897l33683j34151K90005P7031k48376r8331K77601j20015k49806L70555
16967I08727j49749k12143J72445L7134J73527q6231K00023j72803J81230m92005
16957E60155K31036L30616l89924j80046J78802J95488K05248p1259l7735j28665
$$ y = [426359, 315011, 719080, 521754, 555768, 440049, 762183, 371756, 267959, 131316, 599507, 672437, 603704, 907113, 620532, 573521, 930772, 692817, 393601, 438381, 721632, 558038, 489860, 925205, 832230, 694857, 824692, 906299, 576601, 697854, 679413, 843991, 835078, 760946, 683183, 553690, 858523, 776354, 1009495, 686842, 722363, 810692, 458923, 691046, 782319, 374895, 512356, 763970, 692513, 431410, 772435, 1077897, 744214, 610063, 900068, 977099, 728723, 630392, 907993, 787978, 538172, 908727, 758978, 546835, 719280, 756414, 929941, 843710, 1043733, 870930, 1052160, 560155, 791191, 1121807, 731883, 551837, 730639, 926127, 1131375, 1060116, 1022381, 893716]
16947H93716J9715j54363K68818k81150r9040L81064K52238m24625K86783j5930
16937A127226J72937k73057k72539M06131J18889K26533k09816j62388J2791k6625
16927A120082P4935j60082M11733J7595j76770O2526j39345J71828p5829l13224
16917I93449R3673M12899l09113K01594m5159P6861j74994M23617j10041J04085
16907A666871j91263L61337l99471O1173m4820J89351n4210j56813J73635K1114
16897A626904O231k67375P43243k05732M25O6411k5346N9609l07369J53626j73120
16886A677507O41592n69260j1522L25898q9217m6911L78519l21781k9958K24373
16876B179240l4239L07726k36148r8753J80475l81041p5255O19563p1167P8416
$$ y = [893716, 913431, 759068, 1027886, 746736, 647696, 1028760, 1280998, 856373, 1143156, 1127226, 1300163, 1027106, 754567, 1160698, 1279587, 1506120, 1296304, 1133916, 1146707, 1120082, 1195017, 1034935, 1446668, 1464263, 1287493, 1350019, 1210674, 1382502, 1306673, 993449, 1087122, 1500021, 1190908, 1392502, 1347343, 1424204, 1249210, 1672827, 1562786, 1666871, 1475608, 1836945, 1437474, 1498647, 1453827, 1643178, 1588968, 1432155, 1605790, 1626904, 1633135, 1365760, 2109003, 1903271, 1903696, 1970107, 1944761, 2004370, 1697001, 1850627, 1677507, 2319099, 1749839, 1738317, 2064215, 1974998, 1928087, 2306606, 1984825, 1954867, 2179240, 2145001, 2452727, 2216579, 2117826, 2298301, 1917260, 1842005, 2461568, 2390401, 2468817]
16866B468817q5768J42175P6587M0570R9844q1635L4643m944J73419j71315J70194
16855B862587J29480q8393n1481K14477j31881K47317m8643k04025J40148K74993
16845C344579k69070M46003m15813L0502J43256J64669M73137n23616N07041k88662
16835C612026j49770M72553o9057J60909n1509K52151P8644j6094Q0751M73672
16825D844276k24075N4815p9455K54197j30447K99453L12354m94085P37500k95130
16815E279403J39147k37277L15579M39203l9732L27443j98832K46989J97009p29
16805F468203L12572J72844j40124N26039k20476L62330K56257L5419N12556l58302
16795G927318N33887M09156n9123L5823N18572l4679L52320N48993K46555L84369
$$ y = [2468817, 2383049, 2525224, 2601811, 2642381, 2742225, 2660590, 2695233, 2690289, 2863708, 2692393, 2862587, 2992067, 2903674, 2852193, 3066670, 2934789, 3182106, 3133463, 2929438, 3069586, 3344579, 3075509, 3521512, 3105699, 3136201, 3279457, 3444126, 3917263, 3393647, 3900688, 3612026, 3462256, 3934809, 3865752, 4026661, 3975152, 4227303, 4305947, 4289853, 4370604, 4844276, 4620201, 4675016, 4595561, 4849758, 4719311, 5018764, 5331118, 4837033, 5574533, 5279403, 5418550, 5181273, 5496852, 5936055, 5896323, 6223766, 6024934, 6271923, 6468932, 6468203, 6780775, 6953619, 6813495, 7339534, 7119058, 7481388, 7737645, 7773064, 8285620, 7927318, 8461205, 8870361, 8811238, 8847061, 9365633, 9330954, 9683274, 10232267, 10478822, 10863191]
16785A0863191M3338N50591j24628P12692L79941K63955p4450P82246J67113N81431
16775A4145420O22044K47192M84671O19455N97256M07024J123948N85059N00720
16766A9332789N53616O24941J081458L64729R42316Q74134J268859P03827J395861
16757B7142530J100422P34747J540415J266378J315142J445041K021898J588709
16749C8155282K214523J908181K227854J937204K584716K406032K822576L347640
16741E7604008L161687L219672L939812L860399M371908M722720M787385N150042
16733I0817633N588582N978708O389988O582388O862594O858033P122535P260847
16725A43461308P563330P129420O811023O442606O220710M807890L915810L094449
$$ y = [10863191, 10906529, 11457120, 11332492, 12045184, 12425125, 12689080, 12614630, 13396876, 13563989, 14145420, 14767464, 15014656, 15499327, 16118782, 16716038, 17123062, 18247010, 18832069, 19332789, 19886405, 20511346, 21592804, 21957533, 22899849, 23773983, 25042842, 25746669, 27142530, 28242952, 28977699, 30518114, 31784492, 33099634, 34544675, 36566573, 38155282, 40369805, 42277986, 44505840, 46443044, 49027760, 51433792, 54256368, 57604008, 60765695, 63985367, 67925179, 71785578, 76157486, 80880206, 85667591, 90817633, 96406215, 102384923, 108774911, 115357299, 122219893, 129077926, 136200461, 143461308, 151024638, 158154058, 164965081, 171407687, 177628397, 182436287, 186352097, 189446546]
16717A89446546K088693K59197p30633k098257k939387m844906m704019o148548
16709A70328686o839880p196878p107594p308603p372064p725040o848601o800562
16701A13129464o690037o368310n519450n544329n418494m740053m424951m314347
16693G0109493l836083l878784l252760l179813l307495k857613k135109k617897
16685D5043939k231506j980364j967167j668910j574277k199684j177504j594855
16677C0649672j546257r93436j346371q43231j331491p70271j294947p58242p28079
16668B1037347j022454m24393q83892o72872m30024j032787j31760q46779n15753
16659A5076633k70339m24387k61044n28976q27413m71281r8701l13634n09752
$$ y = [189446546, 191535239, 191794436, 191063803, 188965546, 186026159, 181181253, 176477234, 170328686, 163488806, 156291928, 149184334, 141875731, 134503667, 126778627, 119930026, 113129464, 106439427, 100071117, 94551667, 89007338, 83588844, 78848791, 74423840, 70109493, 66273410, 62394626, 59141866, 55962053, 52654558, 49796945, 47661836, 45043939, 42812433, 40832069, 38864902, 37195992, 35621715, 33422031, 32244527, 30649672, 29103415, 28109979, 26763608, 25920377, 24588886, 23818615, 22523668, 21765426, 21037347, 20014893, 19590500, 18706608, 18033736, 17603712, 16570925, 16439165, 15592386, 15076633, 14806294, 14381907, 14120863, 13591887, 12764474, 12293193, 12194492, 11880858, 11371106]
16650A1371106K46112q85428j44653m48311j71141k84957k61607k43679m73854
16641H703588k70977J49415k28757M8084p71061R775k82247j38067k71273N8977
16631G007457m78157j74450P7867j18317j41041r4477k39612k9836j43291K2476
16621E688619J26188j61866m48324k07249j81520k00373j65749K73320j77280
16612D545766m5798j58203l95113J71730l26526J59225j57170J78276l63839M27466
16602D035814o10856J35115n3661j5426j27902J47430r3353r4603J03374l32075
16592C093857P6460k10354j40345m8635L10119r6270l30001o917K46916j62025
16582B732805k43k64752O7397k40511j54018M7506L57448n37374K31730P7019
$$ y = [11371106, 11617218, 10731790, 10587137, 10138826, 9967685, 9682728, 9421121, 9177442, 8703588, 8432611, 8582026, 8353269, 8401353, 7630292, 7640067, 7357820, 7219753, 6948480, 7007457, 6529300, 6354850, 6432717, 6314400, 6173359, 6078882, 5839270, 5809434, 5666143, 5688619, 5814807, 5652941, 5204617, 4997368, 4815848, 4615475, 4449726, 4723046, 4545766, 4499968, 4341765, 3946652, 4118382, 3791856, 3951081, 3793911, 3972187, 3608348, 4035814, 3424958, 3560073, 3506412, 3490986, 3363084, 3510514, 3417161, 3322558, 3425932, 3093857, 3170317, 2959963, 2819618, 2770983, 3081102, 2984832, 2654831, 2647914, 2894830, 2732805, 2732562, 2467810, 2535207, 2294696, 2140678, 2188184, 2545632, 2008258, 2239988, 2317007]
16572B317007k37579J93978m4646P6291j92604j04355J57269J5163k01624M7315
16562B026215o1411k26011K23513L1715n5835j45629J91370k10542J0710l05757
16552A478338K68844j36069Q6785N3702k66902L10832m11765J91421j90183K43783
16542A628786k00380L86M225N2429k00324j1188J98686k12807j16541J84055J00087
16531A427414j10580K67226n07641J09605R4123p7745m7896L65018j89851j67552
16521A162121p7437l90941N28280k4738l06833J54783k12647L81879N3707l40690
16511I27484J18727K3792L6616j85427m8144L21423m9137k90649J96581j53336
16501H97930L7762j8251K70031j17230j64563j15261j50172M35936l53737L43972
$$ y = [2317007, 2079428, 2273406, 2228760, 2305051, 2112447, 2008092, 2165361, 2180524, 1978900, 2026215, 1964804, 1738793, 1962306, 1994021, 1938186, 1792557, 1983927, 1773385, 1784095, 1478338, 1747182, 1611113, 1697898, 1751600, 1484698, 1795530, 1383765, 1575186, 1385003, 1628786, 1428406, 1428792, 1433017, 1485446, 1285122, 1273934, 1472620, 1259813, 1143272, 1327327, 1427414, 1316834, 1584060, 1076419, 1186024, 1280147, 1202402, 1154506, 1519524, 1329673, 1162121, 1084684, 693743, 1222023, 1197285, 890452, 1045235, 832588, 1214467, 1268174, 927484, 1046211, 1070003, 1106619, 921192, 873048, 1194471, 1145334, 854685, 1051266, 897930, 935692, 917441, 1187472, 1070242, 905679, 790418, 640246, 1076182, 722445, 1066417]
16491A066417l74154L35007l27871L32278k84820K16900k96425J76616J7983K28046
16481A089977P9660E16404N31961n0505k61114j62544K43371n8232j17778K22049
16471H63612j60640l1740q2666J54150N1708j86685J21971o9807M67886E10683
16460H66459l07614K27648k61155N5911J53730l24509j11025J36278k4470Q5774
16450D97027Q9642j5829l5388M63494C3125M54472O7729J03596J35868l67189
16440D27601j68351k6013M74616B90228R5094K60619l13439J10935L74196l32584
16430D85049R7679J60494P7996j62902k40345J33926p1180J88173j64523J08152
16420F12519B75390J74226J82176k39778N5645K82448k92509J04983k50901L4973
$$ y = [1066417, 692263, 1027270, 699399, 1031677, 746857, 963757, 667332, 843948, 861931, 1089977, 1169637, 516404, 1048365, 997860, 736746, 574202, 817573, 759341, 641563, 863612, 702972, 671232, 588566, 742716, 794424, 607739, 729710, 659903, 1127789, 510683, 866459, 558845, 786493, 525338, 581249, 734979, 410470, 299445, 435723, 411253, 497027, 586669, 570840, 535452, 998946, 33125, 487597, 555326, 658922, 794790, 427601, 259250, 233237, 707853, 290228, 385322, 645941, 332502, 443437, 817633, 485049, 582728, 743222, 821218, 658316, 417971, 551897, 480717, 668890, 504367, 612519, 275390, 449616, 631792, 392014, 447659, 730107, 437598, 542581, 291680, 326653]
16410C26653j15053C1835N94302j93769B08726Q2847L47484j94789N138J90471
16400F39877A34352K90841J0327L56476I9814M39082j91675l7909j13408M38239
16390F34143l9169q3276M8970c2350B85859L05771B17096K25404B04798R9772
16380C04570P3631j68689L2002K9407a26523E12507G7284a01335C32111K896J98565
16369E33572k57430o1660R9990H2528K06553K9284j07054K203P4221O8866J80153
16358E36754B09274I7459O5078b0869B60156O7653j23440P0905M9291p5530a74562
16346A21144J56747K11059n6249J52725k79265K16137G9007K39501q3151e1115
16335C99279k2578I0452C7533N26083B50361o9932J36811j49049M3723J44911
$$ y = [326653, 211600, 31835, 626137, 432368, 208726, 291573, 639057, 444268, 449406, 639877, 134352, 425193, 435520, 791996, 99814, 538896, 347221, 309312, 195904, 634143, 594974, 511698, 560668, -32350, 285859, 591630, 217096, 442500, 204798, 304570, 378201, 209512, 241514, 270921, -126523, 512507, 77284, -101335, 332111, 335007, 533572, 276142, 214482, 314472, 82528, 289081, 318365, 211311, 213514, 287735, 356601, 536754, 209274, 97459, 162537, -20869, 260156, 327809, 204369, 275274, 324565, 249035, -174562, 121144, 277891, 488950, 432701, 585426, 306161, 522298, 79007, 318508, 235357, -51115, 399279, 376701, 90452, 37533, 563616, 250361, 180429, 317240, 168191, 211914, 356825]
16325C56825J05677q8662k0777H820J67923M6897L1185L2316K04913A11159E1483
16313C9774M01405G6643M65221A55313K17159B6750J45025M5379K07100j52622
16303B71632M2596J0930K00509A34845P0922L9627N0672A31910R4278A4121P8134
16292I2255L2144J25072i80G4433a24184F9606N8293Q6305P3723j12162J35937
16281C11702Q0904A74421k566a05372l0629D49656g6437B68743b31877C13882
16270A61716O5522M8902M5361b9126H1013a86319H0595a38232L8178E4964J84481
16259B39445k0336b48383A96919F6653k4515J05271c64j45138b9338j02800K4904
16248a07234C54317A66207J54664a08952D27283F1287a56206C29222j17881d9017
$$ y = [356825, 462502, 373840, 353063, 8820, 176743, 223640, 254825, 287141, 492054, 111159, 51483, 39774, 441179, 76643, 541864, 155313, 372472, 26750, 171775, 217154, 424254, 271632, 314228, 325158, 525667, 134845, 205767, 245394, 296066, 131910, 226188, 14121, 92255, 124399, 249471, -980, 74433, -124184, 69606, 127899, 214204, 287927, 175765, 311702, 392606, 174421, 171855, -105372, -136001, 449656, -76437, 268743, -231877, 313882, 161716, 227238, 276140, 321501, -29126, 81013, -186319, 80595, -138232, -100054, 54964, 239445, 219109, -248383, 196919, 66653, 42138, 147409, -364, -145502, -29338, -132138, -107234, 354317, 166207, 320871, -108952, 427283, 61287, -156206, 329222, 211341, -49017]
16237C37549A2394O0421O2452D294K0937J29281d6744k7707j85628B76R096J84852
16225A94224D7952b7754C97538d039A73073E9825K69977b38248B7833b63484d2495
16213B13148l4924N0482K01412B11598c6438H8242A1443a65844I0539b6017A66831
16201D13643n0287a03010B37a87912A53488G6654J0058M4501h2988l02187a80002
16189E4070J18679G686b7714D4468h9697G3263a85251B38528e5764B68628b12313
16177E6486P3642g3182A96073a24034e4856F2697a71911a9560F8720O4098n9120
16166G3698b9113I7032R6594E1132J65539I0713J18815C5617N7759P2397A7106
16154A05102i9926A48346M6545g8677A63936b27345A16803K02194g5916A07650
$$ y = [337549, 12394, 72815, 135267, 4294, 25231, 154512, -46744, -74451, -260079, 276, 9372, 194224, 47952, -27754, 397538, -4039, 173073, 59825, 329802, -238248, 27833, -263484, -42495, 213148, 178224, 228706, 430118, 211598, -36438, 88242, 11443, -165844, 90539, -26017, 166831, 413643, 363356, -103010, 237, -187912, 153488, 76654, 86712, 131213, -82988, -385175, -180002, 54070, 172749, 7686, -27714, 44468, -89697, 73263, -185251, 238528, -55764, 268628, -212313, 56486, 130128, -73182, 196073, -124034, -54856, 62697, -171911, -19560, 68720, 132818, 73698, -29113, 97032, 193626, 51132, 216671, 90713, 209528, 35617, 93376, 165773, 17106, 105102, -99926, 148346, 194891, -78677, 163936, -227345, 116803, 318997, -75916, 107650]
16143A64239a10700I332J27584i8824C3532a87584A07406O0187F0266K15888A06148
16131I5915a01788j95421i9052B80362c5039B8115J09528d2711j70729B48501
16120f6275o34B91052J9135b1166C2466L41467c03240b8247A45356a8931F0567
16108B49153d2223A17910e2149n3851A56219m043j5417c9655B17216L7839H9706
16096A02144i9215j05545f0677n1322B71333C1416I784a16708B89606D4354g3143
16084b27198A09833b81937F5581b14344A48189E2568K03882J7107d05053a12706
16073B85172l6775b26469O3146F9864l638a11306L0861q7588B9740K5806L9576
16062I5122C2842c13131C21458a36845F0863J09528a30902G0107K29643e8243
$$ y = [164239, -110700, 9332, 136916, -98824, 33532, -187584, 107406, 167593, 60266, 276154, 106148, 95915, -101788, -297209, -99052, 280362, -35039, 28115, 137643, -42711, -213440, 248501, -66275, -66909, 291052, 310187, -21166, 32466, 373933, -303240, -28247, 145356, -18931, 60567, 249153, -42223, 117910, -52149, -106000, 156219, 152176, 136759, -39655, 217216, 255055, 89706, 102144, -99215, -204760, -60677, -111999, 271333, 31416, 9784, -116708, 289606, 44354, -73143, -227198, 109833, -281937, 65581, -214344, 148189, 52568, 256450, 273557, -405053, -112706, 285172, 248397, -226469, -163323, 69864, 66226, -111306, -80445, -168033, 29740, 55546, 95122, 32842, -313131, 321458, -136845, 60863, 170391, -130902, 70107, 299750, -58243]
16051c24048g2921j20884H9547a03699B33975c34809J20173j86212G0357A2864
16040b58862A00165P8128K05223b38673L2713i7214A94462n123a03274r2586P3445
16029a22415D9917a66847B76938b74098B09334p5341h8140B3457a84084A48907
16018F3491f2395b469m99124f0563E5908K127a30108B00220c87512a40072A45746
16006B58911l5711A01866b33209m3392A38378H338J71003a61965N3937j86690
15996b94718a6030l4516o0544j82837A99630B2105Q0763b19605d8630A96720b01602
15984b06346A13897J00769D4011K12412J77992k13341a73164k1550A38830J56475
15974B95305a01614A84908B9093a27280f1058D3461b51422A41277b94141B4547
$$ y = [-324048, -72921, -193805, 89547, -103699, 233975, -334809, -214636, -400848, 70357, 12864, -258862, 100165, 178293, 383516, -238673, -205960, -97214, 194462, 189339, -103274, -195860, -122415, 49917, -166847, 276938, -274098, 209334, 133993, -88140, 23457, -184084, 148907, 63491, -62395, -2469, -501593, -60563, 55908, 58035, -130108, 200220, -387512, -140072, 145746, 258911, 223200, 101866, -233209, -276601, 138378, 8338, 179341, -161965, -108028, -294718, -16030, -50546, -111090, -293927, 199630, 22105, 102868, -219605, -48630, 196720, -201602, -206346, 113897, 214666, 44011, 256423, 434415, 221074, -173164, -194714, 138830, 295305, -101614, 184908, 29093, -127280, -61058, 43461, -251422, 141277, -294141, 24547]
15963i5845k48236C2632B204d9593k2406K7800p8728D17697f4080j03180J0014
15952a57246j51513A17438d4724j4569B1446b4055l6495k47485N6707O9516b747
15940a49201O1713j33090P8527q6138l42667D1183a64696G3164b97739f2970A07188
15928B1640N5949d88962b6773k90804R0906A19100c70545d0460C2698K14871a94418
15916F0377K90732a93612B02631B3053a37370M8553B7302K69784g9304j34486
15906b13790A27344g5506A48905O1444a35905M6132A50485n6237h8514k08209
15896b96723C058a40885a1221l095A97736q039a31543P682A7167b16706Q3515
15885a33191c3797A82721N2627a77657L3503a8391O31A82290m4795a26109a5702
$$ y = [-95845, -344081, 32632, 2204, -49593, -71999, -44199, -122927, 417697, -64080, -167260, -157246, -308759, 117438, -44724, -59293, 21446, -24055, -60550, -308035, -251328, -181812, -2747, -149201, -87488, -220578, -142051, -228189, -570856, 41183, -164696, 73164, -297739, -62970, 107188, 21640, 77589, -488962, -26773, -317577, -226671, 119100, -370545, -40460, 32698, 247569, -194418, 60377, 351109, -193612, 202631, 23053, -137370, -88817, 27302, 297086, -79304, -213790, 127344, -75506, 148905, 210349, -135905, -89773, 150485, 94248, -88514, -296723, 3058, -140885, -11221, -14316, 197736, 189697, -131543, -123861, 17167, -216706, -133191, -33797, 182721, 235348, -177657, -144154, -18391, -17760, 182290, 137495, -126109, -15702]
15873B12594i3653B4573a61895B02404a05008B30073b04167l93435A36837l6494
15863A00343P6546b5008C22449c45807G5595a53401d1106B08295j6911m5484b42130
15851A66803h2211A13407j8110a19835c9187k11980N5888o2796J23310M6066B22892
15839a32185N5706j69916M6354F2402C574a58755m0482J520l372F2450a55679
15827F3377J89362a48662k2411A49752e9614A86129a43012G8363a69734A99721
15816a04425I4175e5541D76998b19604p5199F7807R6667K55321b38264f2687F6862
15804a99932M6294j5798A1757P171i7255A43595b48920n0450J38535F8137c29622
15792A18886c9551j7110H4842a42218j43397C4251a50761E9088e9011q9707I4160
$$ y = [212594, -93653, 24573, -161895, 202404, -105008, 230073, -204167, -597602, 136837, 100343, 176889, -25008, 322449, -345807, 75595, -153401, -41106, 208295, 191384, 145900, -242130, 166803, -82211, 113407, 95297, -119835, -39187, -251167, -195279, -258075, -134765, -88699, 222892, -132185, -76479, -246395, -200041, 62402, 3574, -158755, -199237, -197717, -201089, 62450, -155679, 63377, 252739, -148662, -171073, 149752, -59614, 186129, -143012, 78363, -169734, 199721, -104425, 94175, -55541, 476998, -219604, -294803, 67807, 164474, 419795, -238264, -62687, 66862, -199932, -153638, -169436, 11757, 18928, -97255, 143595, -248920, -299370, -160835, 68137, -329622, 118886, -39551, -56661, 84842, -142218, -285615, 34251, -150761, 59088, -59011, -148718, 94160]
15780b83061J5916e7799k17801f6808b5680D3011J68152a28397D5501b48570B1955
15768A14004C8112b16251M9985c3356q4025J483L1630A26040j0008K2521E6344
15756H2045K23229n8289c9769k62892B04927M9240I058a16783m1489A06281E1052
15744g5409B48571b13252L6717L0574H8339b60378e0792I2209c24735A9100R1706
15733A10806C6641d0727j33410P9045A49333c97445J04604l5182A1802a56410
15722c57010B16877b61759c5444k66123J48924K8386B01995N7610D1872a70736
15711A6632i6220B37209D0460J75209b3842C278b98172E0832C469b2576l39912
15700c62488A28960b0351B18903A2264b7808j97771A06822i0569B98363j10909
$$ y = [-283061, -267145, -57799, -275600, -66808, -25680, 43011, 211163, -128397, 45501, -248570, 21955, 114004, 38112, -216251, -166266, -33356, -117381, -115898, -84268, 126040, 116032, 138553, 56344, 82045, 305274, 246985, -39769, -302661, 204927, 254167, 9058, -116783, -158272, 106281, 51052, -75409, 248571, -213252, -176535, -145961, 88339, -260378, -50792, 92209, -324735, 19100, 110806, 36641, -40727, -174137, -95092, 149333, -397445, -292841, -328023, 11802, -156410, -357010, 216877, -261759, -35444, -301567, -152643, -124257, 201995, 259605, 41872, -170736, 16632, -96220, 237209, 40460, 215669, -23842, 3278, -298172, 50832, 3469, -22576, -362488, 128960, -20351, 218903, 12264, -27808, -225579, 106822, -90569, 298363, 187454]
15690A87454D8599i0459n8037R441B53999g0835B8765a68322f1215k45606a12123
15678a87352A22175c6579l7958j42405L8214h7862j79872E4511J31047i2625o5067
15667a57692B59360F0920L9452B2909b4069j17819f4944k16296a7597k80030c7522
15655c15028C75243b0348i115l09994L7861B89697j24775G9669c96924e3221F8902
15643I1602d5111l5266j010A82724c9155B08748F5664J47057M0845a04304j17160
15632b21464B6746a24802l40738a15741B1665f8681o2883A78682c14837i279l4120
15621d3399j60326i1270A16847l0210A1290N987f8925B2141N2500K78935a10625
15609a01312A77814o2840b72854g244A43724k2914b43717k646C43253G8239i1518
$$ y = [187454, 48599, -90459, -148496, -139055, 253999, -70835, 28765, -168322, -61215, -306821, -112123, -187352, 122175, -36579, -74537, -216942, -178728, -87862, -267734, 54511, 185558, -92625, -157692, 259360, 60920, 100372, 22909, -24069, -141888, -64944, -281240, -17597, -297627, -37522, -315028, 375243, -20348, -9115, -319109, -281248, 289697, 164922, 79669, -396924, -53221, 68902, 91602, -45111, -80377, -81387, 182724, -39155, 208748, 65664, 212721, 253566, -104304, -221464, 26746, -124802, -465540, -115741, 21665, -68681, -131564, 178682, -314837, -9279, -43399, -203725, -91270, 116847, 86637, 11290, 17277, -68925, 22141, 74641, 353576, -110625, -101312, 177814, 114974, -272854, -7244, 143724, 120810, -243717, -246363, 343253, 78239, -91518]
15597a47943j5700f0119k0566B8981b30936B2891g4228F833J83796b08058B7044
15585B94360E3729K25239b73360G1163R9072C2219a24512B2725a17970G0482b89031
15573a52254C9968a23670k80879a9195k4567m5455A3692b1775A79298H132h6803
15561B48701R9575B1335L53246R510A35805f1128j10977I4973K3430e2184l74549
15550d26733B0899b27679A33124a46731A80753F0524f4746G1230l0457O1009c38058
15538D9824a95050A23137l3058h4227r0597P5360F9728a9372j9567q8477C82099
15526E3973P5399K18531a16453k90810B11240g1293B05710h7685k97848j8507
15516d04040d012q9878A79403H7571C3446a14255K9674E2989a7759m7444B90341
$$ y = [-147943, -163643, -60119, -80685, 28981, -230936, 22891, -74228, 6833, 190629, -208058, 27044, 294360, 53729, 278968, -273360, 71163, 170235, 32219, -124512, 22725, -117970, 70482, -289031, -152254, 39968, -123670, -404549, -19195, -43762, -89217, 13692, -21775, 179298, 8132, -86803, 248701, 348276, 21335, 374581, 384091, 135805, -61128, -172105, 94973, 118403, -52184, -426733, 20899, -227679, 133124, -146731, 180753, 60524, -64746, 71230, 40773, 101782, -338058, 49824, -195050, 123137, 90079, -84227, -174824, -99464, 69728, -19372, -38939, -127416, 382099, 53973, 129372, 347903, -116453, -407263, 211240, -71293, 205710, -87685, -385533, -404040, -4012, -93890, 179403, 87571, 33446, -114255, -84581, 52989, -17759, -65203, 290341]
15504e5328l68n2037k6015A04376h760I7197e62828H9574L25199i3467j2740A43035
15491F9143f3963C25692b46216g7860A52737a51013A70145p5737l7387h530C61308
15479a54713j21415E9288a83608C4750K17259H5509P93J8225b56227r583N2002
15468b13808A42106a09793J6095C7003b2568j89849d5224k3914A84544d16385
15457G3666b132l8055A00832a25112n5517a7692H4682h5219F4226a93294C1193
15445c18714A77832g2134J9860q8087B14812b34535A1553R6738h8425A02816a59679
15433h17I01a24257l9982G9199J76573a45137C18644b72552C9097K85424a6321
15421a31384N0875n5674F2587b59548f553H465J59280m9991h4961j35588k22858
$$ y = [-55328, -55696, -107733, -133748, 104376, -8760, 97197, -562828, 89574, 414773, -93467, -106207, 143035, 69143, -63963, 325692, -246216, -77860, 152737, -151013, 170145, 94408, 57021, -8530, 361308, -154713, -276128, 59288, -183608, 34750, 252009, 85509, 86302, 104527, -256227, -265810, -213808, 142106, -109793, -93698, 37003, -22568, -212417, -45224, -69138, 184544, -416385, 73666, -2132, -40187, 100832, -125112, -180629, -17692, 84682, -85219, 64226, -193294, 31193, -318714, 177832, -72134, -52274, -140361, 214812, -234535, 11553, 108291, -88425, 102816, -159679, -817, 901, -124257, -164239, 79199, 255772, -145137, 318644, -272552, 39097, 324521, -16321, -131384, -80509, -136183, 62587, -259548, -6553, 8465, 167745, 117754, -84961, -220549, -443407]
15410d43407C1190P5720e7263m7819j84737B00278A0725c5451j39446n9048A14494
15398B68344a0268j2882A88609l1684J265d0844D2315i7302C00463m4212R3048
15387C49299b41852i8493l7636a3375l26032A54502a5092r3025A32117a4955l89505
15376d04460h869j94203j66283b254k1205C16996b05741B20834b1979j67569I2145
15364C2335Q4524c39994A1239a68285B21394A02744a18j07480H6933h195C25852
15352C70192A33067b89744A7637b94832A30660j2517O7025a04236R971D09375
15341C7939j983q667f9690n8166B00886D0195c52156J60449i4699P085A56264
15329a44244C1922e3090R386j09283l2910A02849K6680c87428A61921p2727e5582
$$ y = [-443407, 31190, 106910, -57263, -105082, -289819, 200278, 10725, -35451, -174897, -233945, 114494, 268344, -10268, -23150, 188609, 156925, 158190, -40844, 42315, -97302, 300463, 256251, 349299, -241852, -98493, -136129, -13375, -339407, 154502, -15092, -108117, 132117, -14955, -404460, -8869, -203072, -369355, -2254, -23459, 316996, -205741, 220834, -21979, -189548, 92145, 32335, 116859, -339994, 11239, -168285, 221394, 102744, -118, -107598, 86933, -8195, 325852, 370192, 133067, -289744, 17637, -294832, 130660, 118143, 185168, -104236, -94265, 409375, 37939, 35956, 27289, -69690, -127856, 200886, 40195, -352156, -191707, -94699, -87614, 156264, -144244, 31922, -53090, -43704, -152987, -185897, 102849, 129529, -387428, 161921, 89194, -55582]
15317b28063B15843Q8067b47777B06477b89457c6118k61286N3123A01489J01557
15307B03046h314A30977J8512a55446M3080A71455b91736A87309o08e899A10143
15295c5200A0418b20287A1922L16192j06163h6461B88430A44030a70309c2685
15284A31723j7916E1539a75037o9772A54856a78477A49948K2237K1854a07008
15273d9324A53723i8768A65570l5760b40564P7363a9966A0287M34639A31858e5616
15261A52650j7503J84017P9415a79431B35597q478E7608e5153B80891A25939J09357
15250B35296L65575K12994Q20756n96466N05419n24981E03369A35451F6667J42550
15240B09217j00573K890g0365J8682I7131J03184J5560k2972N5089j10313J18773
$$ y = [-228063, 215843, 303910, -247777, 206477, -289457, -36118, -297404, -244281, 101489, 203046, -8314, 130977, 149489, -155446, -112366, 171455, -291736, 187309, 186701, -5899, 110143, -35200, 10418, -220287, 11922, 328114, 221951, -86461, 288430, 144030, -170309, -32685, 131723, 113807, 51539, -175037, -244809, 154856, -178477, 149948, 172185, 194039, -107008, -49324, 153723, -98768, 165570, 129810, -240564, -163201, -19966, 10287, 444926, 131858, -55616, 152650, 135147, 319164, 398579, -179431, 235597, 227119, 57608, -55153, 280891, 125939, 235296, 600871, 813865, 1634621, 1038155, 1543574, 1018593, 503369, 135451, 66667, 209217, 108644, 111534, -70365, -51683, 97131, 200315, 215875, 192903, 247992, 137679, 256452]
15229B56452b30942g6776A4855R1687l4826J47686h6686O282B10b76321g0404
15217I3133J09599p0313N9692n0367K573I569J8653c0150C03342A43362j5042
15206A28320g6070G8826K99442c18312A8280a5560F5825a06243B89999A21743
15195A70948m0916Q0560A4372a53468N8200F1244K30441G6244f9743A35543b6405
15183D91481I2164N9514h425B70194a32510a0570C08590B2237Q708Q5452b45411
15171c79698B4659e9314p9921H3482N5016N9402n2640f9311l82801e9743C38324
15159A10525M3252J1018K6357a05831i096A59386i5763k60M5664C22225e9168
15147C5755Q6136C9397J57159r8243m5775k1286J56413B1727a81406B45970m5751
$$ y = [256452, -230942, -76776, 14855, 106542, 71716, 219402, -86686, -80404, 210, -276321, -70404, 93133, 202732, 132419, 192111, 141744, 144317, 9569, 28222, -30150, 303342, 143362, 128320, -76070, 78826, 378268, -318312, 18280, -15560, 65825, -106243, 289999, 121743, 170948, 130032, 210592, 14372, -153468, -95268, 61244, 291685, 76244, -69743, 135543, -26405, 491481, 92164, 151678, -8425, 270194, -132510, -10570, 308590, 22237, 30945, 116397, -245411, -379698, 24659, -59314, -139235, 83482, 138498, 197900, 145260, -69311, -452112, -59743, 338324, 110525, 153777, 164795, 191152, -105831, -9096, 159386, -95763, -96023, -50359, 322225, -59168, 35755, 121891, 39397, 196556, 98313, 52538, 31252, 187665, 21727, -181406, 245970, 200219]
15136B00219E711d2507A79668a15014F7831h0520B43213C4227R5047b89712B36459
15124A69016J50415A57829O7577a23833C06442j04087b17672d9174A97871Q0351
15114B78222j16298A8924K71538g5490B1972b46448e1543B66623K9419k234a00274
15102B32593A824J71923a76536B17691e3628C19906J0713f3646G1455L05241e9853
15090A16268a23630k73526A84467M219Q3517A04573j7074C1956b16425B28810
15079A8701e7206C3693b9890B66014A07306a9427B60883b8606G1610j0870J82648
15068B43388q2400L9954m0109J53787c5571C61403r7658P0642q9602a76998A83350
15056A64877E2542g506j72028c5279F41888a7417B20371A8635J4135h0867A98650
$$ y = [200219, 5711, -42507, 179668, -115014, 67831, -80520, 243213, 34227, 129274, -289712, 236459, 169016, 319431, 157829, 225406, -123833, 306442, 202355, -217672, -49174, 197871, 278222, 161924, 18924, 290462, -75490, 21972, -246448, -51543, 266623, 296042, 293808, -100274, 232593, 1824, 173747, -176536, 217691, -53628, 319906, 330619, -63646, 71455, 376696, -59853, 116268, -123630, -397156, 184467, 188686, 272203, 104573, 87499, 31956, -216425, 228810, 18701, -57206, 33693, -29890, 266014, 107306, -19427, 260883, -28606, 71610, 60740, 243388, 160988, 200942, 160833, 314620, -35571, 361403, 263745, 334387, 244785, -176998, 183350, 164877, 52542, -7506, -179534, -35279, 641888, -17417, 220371, 18635, 32770, -80867, 198650]
15044B4927M41640A43159R9789E4024Q4794I37J64969n5389K19560C4001J62896
15033A96897o9201J12592A3195L19194H4633M17886a84949C43502A3112L85858
15023C98970E2934a74071E15863A75609J30864j30373M36173B96361g010B43866
15012E5239a60815G6380A6607K59891A28323J71598H9804R7172J07439G754L47605
15001C55359j13992A09252P6295L3956l7705a58958e2443C61830K8063A53549
14990B34492L36128A0439O9830J38369m2502L66011b5304H4439b0706E55813A44146
14978D24668A54777i4430A66250h978j38538B41712J18986A15539a5294C05381
14967E57284k75690L09000B48171O4754D5539L63590A63929L7325J93433P5029
$$ y = [24927, 466567, 143159, 242948, 54024, 138818, 937, 165906, 110517, 330077, 34001, 196897, 127696, 240288, 13195, 332389, 84633, 502519, -184949, 343502, 13112, 398970, 52934, -174071, 515863, 175609, 306473, 176100, 612273, 296361, -7010, 243866, 55239, -160815, 76380, 16607, 276498, 128323, 299921, 89804, 186976, 294415, 7754, 355359, 241367, 109252, 185547, 219503, 181798, -158958, -52443, 361830, 389893, 153549, 234492, 570620, 10439, 80269, 218638, 176136, 542147, -25304, 84439, -20706, 555813, 144146, 424668, 154777, -94430, 166250, -8978, -147516, 241712, 360698, 115539, -15294, 305381, 557284, 281594, 590594, 248171, 312925, 45539, 409129, 163929, 201254, 394687, 469716]
14957D69716d3380J8578A09250m5441L38323R9831a9317A8196L53055f1492D38457
14945D71344A14523b7218A43098Q6575m887A948K08512k3813L22769e545C47299
14933C88526A15676n0961L96517j89594A06341K98481j94660K18958j71236K4629
14923B82513I3753K24032p2037J78305B2613L54743A83780m3086a71910C39604
14912B81554E5454K49428J83391B03603K21799o790l3738l3321R1282J6952k23627
14901B36160j01849n5157K08275K33993j24659K8192j2538j72649L66141B16529
14890C41352j31773J35845K69785h5892C14176G8717M13681j24977A11569K38560
14880C50129m9972A21183L43755j56144m4073J11380l7875j63512D3494N36106
$$ y = [469716, -43380, -24802, 109250, 63809, 402132, 501963, -19317, 18196, 371251, -61492, 438457, 471344, 114523, -27218, 143098, 229673, 224786, 1948, 210460, 186647, 509416, -5545, 347299, 388526, 115676, 64715, 461232, 271638, 106341, 404822, 210162, 429120, 257884, 282513, 93753, 317785, 245748, 424053, 22613, 377356, 183780, 140694, -171910, 339604, 281554, 55454, 304882, 488273, 203603, 425402, 418612, 384874, 351553, 442835, 459787, 236160, 134311, 79154, 287429, 521422, 396763, 424955, 412417, 239768, 605909, 216529, 341352, 209579, 345424, 615209, -85892, 314176, 78717, 492398, 367421, 111569, 350129, 300157, 121183, 464938, 308794, 264721, 376101, 338226, 174714, 43494, 579600]
14870E79600A3887J6835K63735K51657k17407p6163J29953p4529o892o1762J83513
14859D22827j88572I7234J19337L35992A11337J24753R3962j12079o0173L48562
14849E06362j68737j08319J07390K78989k46654k5813M8248A45894N2111L5651
14839B33656L78243j71187J19483r776n4519r2106R264L57646C00341J63952K9422
14828D93715J2600j36068F3999K50192P2590O6053j75294K33708B42774K30451
14818D73225o577A37885L34236j37728Q8864K86357k04275k07519R2246J02488
14808D92554K03611k11489J42852B03699K89499J5881r0124r5175O0823M74413
14798H59016l77787j55213J54070Q6059B83056K22575A37175K91376K13292J29328
$$ y = [579600, 13887, 30722, 294457, 546114, 328707, 252544, 382497, 307968, 301076, 239314, 422827, 234255, 97234, 216571, 552563, 111337, 236090, 330052, 217973, 157800, 506362, 337625, 229306, 336696, 615685, 369031, 343218, 391466, 145894, 198005, 233656, 611899, 440712, 560195, 550419, 495900, 403794, 413058, 770704, 300341, 464293, 493715, 506315, 370247, 63999, 314191, 386781, 452834, 277540, 511248, 242774, 473225, 466648, 137885, 472121, 334393, 423257, 709614, 505339, 297820, 390066, 492554, 696165, 484676, 627528, 203699, 493198, 509079, 418955, 323780, 384603, 859016, 481229, 326016, 480086, 566145, 283056, 505631, 137175, 428551, 641843, 771171]
14788G71171k96917M4775K87065k34445J00741M9462k72498J95054l3200k14515
14778C96693j4019L63486r5764J83532j62185C30239J84907k04736L05456J86644
14768H02510l45042L8806L35631A93120K58959O1314L11400l13948I345P96755
14758H06100j65773j30009J23238C05075O26800j82818k57931k08930J24808L71720
14748G78724L7227k37992J86408j0987q1523J08649j13263l8337K93922O5792
14738I88620j09692l0480j43381j86579K83809l5985C50394N67790l37006m4564
14728E36614q4521j41657L39094k7228K21729k04037j64235K99848K62378m49810
14718E88175k33946K82954O5213J19036K90024C82397M51916P6815k20681Q6752
$$ y = [771171, 474254, 519029, 806094, 571649, 672390, 721852, 449354, 644408, 611208, 396693, 382674, 746160, 650396, 833928, 671743, 330239, 515146, 310410, 615866, 802510, 457468, 496274, 831905, 193120, 452079, 513393, 824793, 510845, 9345, 806100, 640327, 510318, 633556, 305075, 931875, 749057, 491126, 282196, 407004, 778724, 815951, 577959, 764367, 753380, 671857, 780506, 667243, 628906, 922828, 988620, 878928, 848448, 705067, 518488, 802297, 766312, 350394, 918184, 581178, 536614, 452093, 310436, 649530, 622302, 844031, 639994, 475759, 775607, 1037985, 588175, 354229, 637183, 702396, 821432, 1111456, 382397, 834313, 911128, 690447, 777199]
14708G77199n2578J98343j59141K969J77711o4489D13428N45295m34748M88071
14698A012046m34684K1765L69462j54115R8105k37063J38713l57394K22082O3794
14688G42711J73391l23518K89112r5937j9476q3844L91276l1459R3121r6972R9916
14677A138321l60410p0389K70675J25563J39732k23917j13907K2175j45231L04336
14667A086948k36371L37446E35236M78217J58144m78498M90399l14345Q4655J12241
14657A066049k15219K58101j79930O6326K155J53697k48167J69460j31232L54647
14647A295887n1206m08276Q57719o30995R4705J14770k95395o684L4345O8294
14637A073164O9891p9083J43298n3119L46525n4751j22060k83247L71464J5443
$$ y = [777199, 724621, 922964, 763823, 766792, 944503, 880014, 413428, 958723, 523975, 1012046, 577362, 599127, 968589, 814474, 912579, 675516, 814229, 456835, 678917, 742711, 916102, 592584, 881696, 785759, 766283, 682439, 1073715, 1042256, 1135377, 1038405, 1138321, 777911, 707522, 978197, 1103760, 1243492, 1019575, 905668, 927843, 782612, 1086948, 850577, 1188023, 535236, 1013453, 1171597, 693099, 1183498, 869153, 953808, 1066049, 850830, 1108931, 929001, 995327, 997482, 1151179, 903012, 1072472, 941240, 1295887, 1244681, 836405, 1694124, 1063129, 1157834, 1272604, 977209, 970525, 1004870, 1073164, 1143055, 1063972, 1207270, 1154151, 1500676, 1445925, 1323865, 1040618, 1412082, 1427525]
14627A427525j64043K0392K71080o7904j04933j0796N6987K3862K9602J70648
14617A652420m33314L29915m7773j74171J78648o4951j10835j57679M11556j87786
14607A396030r2469p6292M74228J3438j88206k62118N44025l5523P7897l44845
14597A506165J61569P3737J740k14551J57163L32044k15101k80861J34148J20079
14587A776132j74453J48022Q448P4753l3443r8670l22047L95798j0534J51683
14577A915689J15631k38575K79665q4868k998M3372J00223O4220j07219J9939
14567B105079K35398j31670J79571l40782O79933k30550p4343k2333J68993M08300
14557B977596k99623o1197M16933K99503N04763K76658O87522J391478K288427
$$ y = [1427525, 1263482, 1283874, 1554954, 1487050, 1382117, 1371321, 1428308, 1452170, 1481772, 1652420, 1219106, 1549021, 1501248, 1327077, 1505725, 1440774, 1329939, 1172260, 1583816, 1396030, 1303561, 1227269, 1701497, 1714935, 1526729, 1264611, 1808636, 1773113, 1851010, 1506165, 1667734, 1741471, 1743211, 1528660, 1685823, 2017867, 1802766, 1521905, 1656053, 1776132, 1601679, 1749701, 1758149, 1832902, 1799459, 1700789, 1378742, 1774540, 1764006, 1915689, 2031320, 1792745, 2072410, 1987542, 1984544, 2027916, 2128139, 2192359, 2085140, 2105079, 2340477, 2208807, 2388378, 2047596, 2727529, 2496979, 2422636, 2400303, 2569296, 2977596, 2677973, 2616776, 3033709, 3333212, 3837975, 4114633, 4802155, 6193633, 8482060]
14548H482060N031105R661913J4110659K927419j8222230I574520D703913j912778
14540B791135k70272m99950K40921m85851L1086O2599m7283K91588l48292L88156
14530B153837k31699L73083k79793K83347J1521P8616l7087M0374K37380l58744
14520B270835K7241N9797Q9587J39982P3365k43627L51313j47680J53366k15535
14510B558644R7250J79912k21546L40683l17731l1653M71397l80175j9245L36216
14500C013752k4428K08812q9879M9035p7474J87754K31005j55836k83334K75595
14490C335002L27603k87370R5720K40750j84898j4287k7858J8088L56548m8637
14480C810661J121k163J80768m44055L97789n3914k8684J61087j79967K07989
$$ y = [8482060, 13513165, 23175078, 37285737, 40213156, 21990926, 9574520, 4703913, 2791135, 2520863, 2020913, 2261834, 1775983, 1807069, 1869668, 1822385, 2113973, 1765681, 2153837, 1922138, 2295221, 2015428, 2298775, 2310296, 2388912, 2351825, 2392199, 2629579, 2270835, 2298076, 2357873, 2447460, 2587442, 2660807, 2417180, 2768493, 2620813, 2774179, 2558644, 2655894, 2835806, 2614260, 2954943, 2637212, 2605559, 3076956, 2696781, 2677536, 3013752, 2989324, 3198136, 3108257, 3157292, 3079818, 3267572, 3498577, 3342741, 3059407, 3335002, 3662605, 3375235, 3470955, 3711705, 3526807, 3512520, 3484662, 3502750, 3859298, 3810661, 3811782, 3809619, 3990387, 3546332, 3944121, 3890207, 3861523, 4022610, 3842643, 4050632]
14470D050632R4753O9404p8545L94275j31562J98629J3600j02788k16570K41067
14460D532895Q8370J20948J12254J41316j0103j24318J479K63839l5703m6318
14450E044659K92881m8719K40274j66697j10007O30088l67696R4070k4517J707
14440E586043K38668j860M8887M33482M3060r9724r7080J32423K49743o7382L50831
14429F817091L0812j84371J32236J10219J3379K21357N51665j39285q5702N5962
14419G523363K39426K33598P1118K98744J50435j05913k33508O07905m1553j54743
14409H588872M66134M41218k94587J76673K71261J03389l5415K11382J02916L81663
14399A0413506j99137M97171L76942k6247k22783M15482K53009l284L25893K45618
$$ y = [4050632, 4145385, 4214789, 4136244, 4530519, 4398957, 4597586, 4611186, 4508398, 4291828, 4532895, 4621265, 4742213, 4854467, 4995783, 4985680, 4861362, 4862841, 5126680, 5090977, 5044659, 5337540, 5288821, 5529095, 5362398, 5252391, 5882479, 5514783, 5608853, 5584336, 5586043, 5824711, 5822851, 5871738, 6305220, 6348280, 6248556, 6151476, 6283899, 6533642, 6466260, 6817091, 6847903, 6663532, 6795768, 6905987, 6919366, 7140723, 7692388, 7553103, 7467401, 7523363, 7762789, 7996387, 8067505, 8366249, 8516684, 8410771, 8177263, 8785168, 8743615, 8588872, 9055006, 9496224, 9201637, 9378310, 9649571, 9752960, 9717545, 9928927, 10031843, 10413506, 10214369, 10711540, 11088482, 11062235, 10839452, 11254934, 11507943, 11504659, 11830552, 12076170]
14389A2076170M74598n6313M67275R3755L27874K13636O0976L06242K13970k4351
14379A4153832L85329M84265M00133K21421L8543K96330K19569M84088L33717
14370A7017227L86667L07302K21017N08706L71318J81237K52240R82540M28028
14361B0656282J13332N50404M13384P52188K68071M53192Q49311O41254L76217
14352B5073635O68764M78335Q26734M74559N84172M85428J127070N30432R50939
14343C1200068N85149J049447Q93112J242558O83360J124350Q27702J401360J209593
14334D0216699J238058R59755J355873J515794J282986J406511J591756J793267
14326E1360699J500929K138736J419212K059844J779673K243971K342751K350466
$$ y = [12076170, 12550768, 12494455, 12961730, 13055485, 13383359, 13596995, 13657971, 13964213, 14178183, 14153832, 14539161, 15023426, 15423559, 15644980, 15683523, 15979853, 16199422, 16683510, 17017227, 17403894, 17711196, 17932213, 18440919, 18812237, 18993474, 19245714, 20228254, 20656282, 20769614, 21320018, 21733402, 22485590, 22753661, 23206853, 24056164, 24697418, 25073635, 25742399, 26220734, 27047468, 27522027, 28106199, 28591627, 29718697, 30249129, 31200068, 31785217, 32834664, 33727776, 34970334, 35653694, 36778044, 37605746, 39007106, 40216699, 41454757, 42414512, 43770385, 45286179, 46569165, 47975676, 49567432, 51360699, 52861628, 55000364, 56419576, 58479420, 60259093, 62503064, 64845815, 67196281]
14318F7196281K269233L212417K265863L244405K967004K983859L566553L438662
14310I1144277M343118L831691M337177M309629M993112M727201N624948O209528
14302A29520681N806919O258898P197992P359216P888019Q090417Q851640R242634
14294A90216416J0073496J0519393J0898770J1718172J2269944J2813845J3377957
14287B71887993J4253389J4388233J4904458J5203396J5751001J5335368J5340991
14280C77064829J5298738J4570959J3479367J2413949J0808405Q865939O189001
14273D58691187K187325j452968l246707j830897j342723l055232m250198p409860
14265D38289927r532454j1502780j3394890j4331539j5310041j5546448j5885558
$$ y = [67196281, 69465514, 72677931, 74943794, 78188199, 81155203, 84139062, 87705615, 91144277, 95487395, 99319086, 103656263, 107965892, 112959004, 117686205, 123311153, 129520681, 135327600, 141586498, 148784490, 156143706, 164031725, 172122142, 180973782, 190216416, 200289912, 210809305, 221708075, 233426247, 245696191, 258510036, 271887993, 286141382, 300529615, 315434073, 330637469, 346388470, 361723838, 377064829, 392363567, 406934526, 420413893, 432827842, 443636247, 452502186, 458691187, 460878512, 459425544, 456178837, 454347940, 453005217, 449949985, 445699787, 438289927, 428757473, 417254693, 403859803, 389528264, 374218223, 358671775, 342786217]
14258C42786217j6093012j5328337j5056386j3561207j4179473j2938639j3157943
14251B42471220j1998988j1761505j0748705j0477185r839088q908591q432101
14244A70305057q089150p466059p469342o467511o707273n874616n318527n386821
14236A17525758n026218n016523m662686m227249l541538l831122l566003l492660
14228H4161759k975435l026196l201335l102641k035696k686529k571113j717534
14220F2845280k366399k216693j631453k063699j639635j455731j656173j386765
14212D8428732j598399j617640j330699r91368r23277q49490j419636j200281
14204C8497942j030071j270047q09804r59291o40976o51185j116674j018686p39956
$$ y = [342786217, 326693205, 311364868, 296308482, 282747275, 268567802, 255629163, 242471220, 230472232, 218710727, 207962022, 197484837, 187645749, 178737158, 170305057, 162215907, 154749848, 147280506, 140812995, 134105722, 128231106, 122912579, 117525758, 112499540, 107483017, 102820331, 98593082, 95051544, 91220422, 87654419, 84161759, 81186324, 78160128, 74958793, 71856152, 69820456, 67133927, 64562814, 62845280, 60478881, 58262188, 56630735, 54567036, 52927401, 51471670, 49815497, 48428732, 46830333, 45212693, 43881994, 42890626, 41967349, 41117859, 39698223, 38497942, 37467871, 36197824, 35388020, 34428729, 33787753, 33136568, 32019894, 31001208, 30261252]
14195C0261252n11912p14932o52680q83420j075391l25804n86050j019044k09819
14186B4282200q62634j48975q26080q8152n35591l26088m57382m95604o30954
14177A9910740n34496j67740l64482n05290l41734n80567j21094k97697k81271
14168A6716369k39856n64844k60199m6990k40834n38256Q7778m23369k78590J2505
14158A4223714n56306j81732l49033k04998j3251m19367k98091J38160n82850
14149A1756246k1102l57301j25740j38244o75218N25552j22496m43748K32517
14140A0630466q92317L14313K6999j96970l93060k7589n6708k75672j31398k94333
14130H703731j10415n7264J49023k31923j95418O7092l9494k03358p12632M74975
$$ y = [30261252, 29749340, 29034408, 28381728, 27498308, 26422917, 26097113, 25511063, 24492019, 24282200, 23419566, 23270591, 22444511, 22356359, 21820768, 21494680, 21037298, 20541694, 19910740, 19376244, 19208504, 18844022, 18338732, 17996998, 17416431, 17295337, 16997640, 16716369, 16476513, 15911669, 15651470, 15604480, 15363646, 14825390, 14913168, 14489799, 14211209, 14223714, 13667408, 13485676, 13136643, 12931645, 12918394, 12499027, 12200936, 12339096, 11756246, 11735144, 11377843, 11252103, 11113859, 10438641, 10964193, 10841697, 10397949, 10630466, 9738149, 10052462, 10079461, 9882491, 9489431, 9461842, 9405134, 9129462, 8998064, 8703731, 8593316, 8536052, 8685075, 8453152, 8257734, 8324826, 8285332, 8081974, 7369342, 7844317]
14120G844317j57120m709l21228P1977k04300M9558k68989k22777K87089l63856
14110F709962j6808p1497Q1400r4615j84287J06705m01985J72272j03394l93327
14100E804426L4845N07641l55798k03651k17426M4223m0316O6329p5130k41934
14090E323209Q1738m48499M62032l21379n8935q1552M2212j33202K01418k46733
14080D820309J13848J918J99156m16559k22036K69990l77772K36234l74213j05720
14070D145155K80944k68981J7862R016l71796J70454k6208k092L65177k06056
14060D113475l326j63791J35942k28311K86755q6033j64652j20182m95876J39898
14050C413899K9843O4825L05875m88120l6493o0317K0856m967M43430n85628K48741
$$ y = [7844317, 7687197, 7682488, 7361260, 7433237, 7228937, 7278495, 7009506, 6786729, 7073818, 6709962, 6693154, 6621657, 6703057, 6608442, 6424155, 6530860, 6128875, 6301147, 6197753, 5804426, 5839271, 6346912, 5991114, 5787463, 5570037, 5614260, 5573944, 5640273, 5565143, 5323209, 5404947, 4956448, 5418480, 5097101, 5038166, 4956614, 4998826, 4865624, 5067042, 4820309, 4934157, 4936075, 5135231, 4718672, 4496636, 4766626, 4388854, 4625088, 4250875, 4145155, 4426099, 4157118, 4174980, 4183996, 3812200, 3982654, 3956446, 3954354, 4319531, 4113475, 4110149, 3946358, 4082300, 3853989, 4140744, 4054711, 3890059, 3769877, 3274001, 3413899, 3443742, 3508567, 3814442, 3326322, 3289829, 3229512, 3250368, 3245401, 3688831, 3103203, 3351944]
14039C351944k12640Q3281J30179j58472k62593j40906M31981j81176J03613Q6857
14029C232068l78837J47222j35137k44173L25080J99132l49404j2526j67171J25851
14019B742105j73907k29489L40195k05849j86955k4579L79854j64855J2633P9712
14009B568865l01428R0267j04214J96102l60394k5755L22696n1680J76991l92244
13999B119206L2913l6481l52541J50267m548j93758J80424L63472L33224K85287
13989B877465J687420L971152Q307376J4735759Q461495j4601377j1945880n667281
13981G826129k007358j541325k84482p60078K16439n29925m7468R6102J66713
13972C134747l19858m02108N3658k29844K52898l47974N1004J01361j37634m2943
$$ y = [3351944, 3139304, 3222585, 3352764, 3194292, 2931699, 2790793, 3222774, 3041598, 3145211, 3232068, 2853231, 3000453, 2865316, 2621143, 2946223, 3145355, 2795951, 2783425, 2616254, 2742105, 2568198, 2338709, 2678904, 2473055, 2286100, 2261521, 2641375, 2476520, 2489153, 2568865, 2267437, 2357704, 2253490, 2449592, 2089198, 2063443, 2386139, 2334459, 2511450, 2119206, 2152119, 2115638, 1763097, 1913364, 1908816, 1715058, 1895482, 2258954, 2592178, 2877465, 4564885, 8536037, 16843413, 31579172, 40040667, 25439290, 13493410, 7826129, 5818771, 4277446, 3992964, 3232886, 3449325, 2919400, 2871932, 2968034, 3134747, 2814889, 2412781, 2466439, 2236595, 2489493, 2141519, 2192523, 2293884, 2156250, 2113307]
13962B113307J87627J4306j40797K0188p0824o5123p6907N4826r9316N6484r8655
13951A895116O1941j14541k33651K92470M9248j05283K24459j82946N0643J34638
13941B072094m82259M22927l64419K70951j21976j12553j64534L97838j75752
13932A742317n1550l53794J58438n5764Q504J65348o6922O1859j66653j50130
13922A291653Q9290K6508j38055J90297K36090k39317J22809k60236K50231j73316
13912A395954n8149l7482L85162k21362j60684M08764m58316K93353J13244m90492
13902A169992L50714m03863L6704Q9105K93245J19963n07479K19527P2273P4967
13892A515148j87602q1268k42940J39612J63129J09796k98540L20697l61863K41168
$$ y = [2113307, 2300934, 2315240, 2174443, 2194631, 2123807, 2058684, 1981777, 2036603, 1937287, 1993771, 1895116, 1957057, 1842516, 1608865, 1901335, 1950583, 1845300, 2069759, 1886813, 1937456, 2072094, 1589835, 2012762, 1648343, 1919294, 1797318, 1684765, 1520231, 1918069, 1742317, 1690767, 1336973, 1495411, 1439647, 1448151, 1613499, 1546577, 1608436, 1441783, 1291653, 1380943, 1407451, 1269396, 1459693, 1695783, 1456466, 1579275, 1319039, 1569270, 1395954, 1337805, 1300323, 1685485, 1464123, 1303439, 1712203, 1253887, 1547240, 1660484, 1169992, 1520706, 1116843, 1153547, 1242652, 1535897, 1655860, 1148381, 1367908, 1440181, 1515148, 1327546, 1246278, 1003338, 1142950, 1306079, 1415875, 1117335, 1438032, 1076169, 1317337]
13882A317337l86332N3576O88998k41302k57246K0741K34974k61437N3562m02129
13872H20742O01214j85302k7521j92778K81089Q5327k07566j80685J33299M6477
13862A174296l9035J16448J23152j6868l97851l9892J04423j01303M3602J7807
13852I84779L47284k46072k86321O01389n40255k431R9383j08877K36987o4533
13842A021333D65280N01407k2455j66219R3555K30420m55836J25846J55735J68086
13832A095819m1243L24293m79746p7643K63648j23730K00504n07519L47057K5621
13822A027061k23174N9832o0875j35593O24672F01694L47423l90783n055M29877
13812I83156j4785k11375N2633R1455P3579J02925N2674l74509L2754k14500J88396
$$ y = [1317337, 931005, 984581, 1673579, 1432277, 1175031, 1195772, 1430746, 1169309, 1222871, 820742, 1421956, 1236654, 1209133, 1016355, 1297444, 1382771, 1175205, 994520, 1127819, 1174296, 1135261, 1251709, 1374861, 1357993, 960142, 920250, 1024673, 923370, 966972, 984779, 1332063, 1085991, 799670, 1401059, 860804, 858373, 957756, 848879, 1085866, 1021333, 465280, 966687, 944232, 778013, 871568, 1101988, 646152, 771998, 927733, 1095819, 1054576, 1378869, 899123, 821480, 1085128, 961398, 1161902, 654383, 1001440, 1027061, 803887, 863719, 802844, 667251, 1291923, 601694, 949117, 558334, 553279, 983156, 968371, 756996, 809629, 901084, 974663, 1077588, 1130262, 755753, 788507, 574007, 762403]
13801G62403O5324O5059k36986J85875j7448J28658j85487N616q0407J83153k82930
13790E92830P1541Q9718K89512j87255l87694R5165N41785m49009M36252k38806
13780H54039j64178p2907J71477J99728m27784J61713J40066j84481L01284j78700
13770H00257M3643j78822N73431l14727L226l22577k08190R7945L19898l67723
13760D46361K1722K53839B78917K63543J73778O9896l34321K81664O2157j59868
13750F35766q8150l1487l0654J80608K9161Q2198k65568B25298K81537L19432
13740H26267j48173K93669m61907m873L46133k83898L2831J36394J12642p7342
13730G71743C38698K17658p6458J85407q2805j05985N3541o0777J89590J2697
$$ y = [762403, 827727, 892786, 655800, 841675, 824227, 952885, 767398, 773014, 692607, 875760, 592830, 664371, 754089, 1043601, 856346, 468652, 563817, 1105602, 656593, 1092845, 854039, 689861, 616954, 788431, 988159, 560375, 722088, 862154, 677673, 978957, 800257, 843900, 665078, 1238509, 923782, 927008, 604431, 396241, 494186, 814084, 446361, 468083, 721922, 278917, 542460, 716238, 786134, 451813, 733477, 795634, 635766, 547616, 516129, 485475, 666083, 695244, 777442, 511874, 225298, 506835, 826267, 678094, 971763, 509856, 504983, 851116, 567218, 600049, 736443, 849085, 771743, 338698, 556356, 479898, 665305, 582500, 476515, 530056, 469279, 658869, 671566]
13720F71566o3555k08584K36416J66426l31456P8010k59018m9735Q34226E06967
13709B34276J93380L06145J22047l14621q9870J09129k11855J28984K55819j73038
13699E60396L04033C62898K91736B91467K55738k8608K54969B99272R0863J63185
13689E53320j76872Q1954L40720k37536o4344N6785j2970J5405q0592o1837p2155
13678C41878A35095K76805l1994O2936L02370C54468J88801n4649N7862q9879
13668D56603J29623l5874j41782O9449J02141k10771N239L07419k45462j16049
13658C20536O9362J29908A07700O52252B53988L86760j93341l568J13712Q43j22404
13647D35990L19400k02627j53781n726g0081E96905j68544J7098n008j23361E1261
$$ y = [671566, 608011, 399427, 635843, 802269, 470813, 548823, 289805, 240070, 1074296, 506967, 234276, 427656, 733801, 855848, 541227, 451357, 560486, 348631, 477615, 733434, 560396, 864429, 362898, 654634, 291467, 547205, 518597, 773566, 299272, 390135, 553320, 376448, 458402, 799122, 561586, 497242, 554027, 541057, 556462, 475870, 414033, 341878, 135095, 411900, 379906, 442842, 745212, 354468, 543269, 488620, 546482, 456603, 586226, 550352, 408570, 478019, 580160, 369389, 374628, 682047, 436585, 320536, 389898, 519806, 107700, 759952, 253988, 640748, 447407, 443839, 557551, 558394, 435990, 755390, 552763, 398982, 393256, -70081, 596905, 428361, 445459, 440451, 317090, 51261]
13635A62127L76246Q7365r0755K16055j80240L522A96567L85120k31554o3973
13625B86160j36047K95756J2525q0096K5291L03954k75264A67289J31396K95244
13615E93929j53034M3711B12275K73661K401o9419p2239j70627J48677l7052M9525
13604C37202P7294j28626J81890J91511k93259J67429j04660J82787j90970j34792
13594B85806l6332M3554N7448K59060A88772J40323J40292P5235k17734o2638
13584B64250K31591j97511J83107J80625j47025B7497M21309j19148J58557j89700
13574B98515G3325L30386A23827N1908K49998A57996K49412F8564J97051k4311
13564B41304Q3491J21188j54094q6242a2216E41289J18870j85405j62028j2330
$$ y = [162127, 538373, 625738, 534983, 751038, 570798, 574320, 196567, 581687, 350133, 286160, 150113, 445869, 458394, 378298, 403589, 707543, 432279, 167289, 298685, 593929, 440895, 484606, 212275, 485936, 488337, 418918, 346679, 176052, 324729, 287677, 337202, 414496, 285870, 467760, 659271, 366012, 533441, 428781, 611568, 420598, 285806, 249474, 293028, 350476, 609536, 188772, 329095, 469387, 544622, 326888, 264250, 495841, 298330, 481437, 662062, 515037, 27497, 448806, 329658, 488215, 298515, 73325, 403711, 123827, 175735, 425733, 157996, 407408, 68564, 265615, 241304, 324795, 445983, 291889, 205647, -12216, 541289, 660159, 474754, 312726, 300396]
13554C00396L770r5624K11439A74545N37965k48572r219m9283j06801r1666J23643
13543C30612J43712j58798B910J63905e237D65566n8285E0607K11915J25499A93294
13531C27539k3677J7687j14319m3345L5418a77457D7789K54020L36911B62434
13520G8439K10844k3916K5435J5164j14094K1252G8871j6098M63878b15980D10710
13508F42452B44164n0623m0150K63378a92463D11879o6123A53233E6291M65066
13498E21357A74731K39485b21314B17646A3393J66227J07536h1899E35245j40111
13488C95134a3205A45494J12060A09697N61368k62269Q1584A20245a64337D20179
13477C05288F8033P7823J46985q3077J24236m8230j8627Q7863J30866k24377J47928
$$ y = [300396, 304166, 208542, 419981, 174545, 712510, 463938, 454719, 405436, 298635, 206969, 330612, 474324, 315526, 2910, 166815, -5237, 465566, 407281, 50607, 262522, 388021, 193294, 327539, 303862, 321549, 207230, 163885, 199303, -177457, 47789, 301809, 638720, 262434, 78439, 289283, 265367, 290802, 305966, 191872, 213124, 78871, 62773, 526651, -215980, 410710, 642452, 244164, 193541, 153391, 416769, -192463, 411879, 345756, 153233, 56291, 521357, 174731, 414216, -221314, 217646, 13393, 179620, 287156, -81899, 535245, 395134, -13205, 145494, 257554, 109697, 671065, 408796, 490380, 120245, -164337, 420179, 305288, 68033, 145856, 292841, 209764, 334000, 285770, 267143, 355006, 485872, 261495, 409423]
13466D09423A11364K48913A30615J12226J85473l9112j29981i9158B42929o6659
13456A76270O4654m5732A5681J47039f8606B61854j3420l9617I9731N13359B16319
13444B10538n8411J81754E3067K65025l1351r921A24152J69028J39017A57831
13433C82556A32216P2212P0804A34058R2389j1287J73849G3377R4662m4040K72264
13422C96263p6087j04877K60025l132I3686N3428J62637j3399p4903j06381J65882
13411B80950k724M1834I8073k4534J78489o9100L14402q2798A26813O1280H1722
13399D78749I2203K8163C941J33831J01794K1075j24089K02342K1859q7306p2480
13388B00967h7180a8721B88642K837q7134a32664B28015J34467H9145J09946D7083
$$ y = [409423, 111364, 360277, 130615, 242841, 428314, 389202, 259221, -99158, 242929, 176270, 240924, 195192, 15681, 162720, -68606, 261854, 248434, 208817, 99731, 613090, 216319, 210538, 152127, 333881, 53067, 318092, 286741, 276820, 124152, 293180, 432197, 157831, 382556, 132216, 204428, 275232, 134058, 226447, 215160, 389009, 73377, 168039, 123999, 396263, 320176, 215299, 475324, 472192, 93686, 147114, 309751, 296352, 221449, 115068, 280950, 278226, 320060, 98073, 73539, 252028, 182928, 497330, 414532, 126813, 188093, 81722, 478749, 92203, 120366, 3941, 137772, 239566, 260641, 136552, 338894, 360753, 273447, 200967, -87180, -18721, 288642, 291479, 204345, -132664, 228015, 362482, 89145, 199091, 47083]
13376B25082N0178O6330A28152K0396Q0885J23488L8046J99322D3751J26973l786
13365A66938j9674o5295K82233A78857O5230i935B16906L3217H1199K25730B2731
13353G0506J83195B8441K76577J36872d0839B26822K07116j07125R4713A27511
13342A80248J98698p4668q1753j5115o1767J89370o5057H7043P8790l0122d9168
13330B4485L02120N7954L2651K9989A01658M71978A2094L75376n5270e1614j09569
13319a61183c3845i756A88569K66855a30114H3688J34230K2981a27913A18322
13308a99601B73419l8659D301P8542e734A47027p2086J48554M9910K0198r7093
13297A96510a6665F6786M4711J76885j33983m8219R1870j996n6860J1399o5413
$$ y = [225082, 275260, 341590, 128152, 148548, 229433, 352921, 390967, 590289, 43751, 170724, 166938, 147264, 81969, 364202, 178857, 244087, -9935, 216906, 250123, 81199, 306929, 22731, 70506, 253701, 28441, 305018, 441890, -40839, 226822, 433938, 326813, 421526, 127511, 180248, 378946, 304278, 222525, 207410, 145643, 335013, 269956, 87043, 165833, 135711, -49168, 24485, 326605, 384559, 417210, 447199, 101658, 573636, 12094, 387470, 332200, -51614, -161183, -33845, -9756, 188569, 455424, -130114, 83688, 217918, 240899, -127913, 118322, -199601, 273419, 234760, 4301, 82843, -5734, 147027, 74941, 223495, 273405, 293603, 196510, -16665, 66786, 111497, 288382, 154399, 106180, 198050, 196054, 139194, 150593, 85180]
13286H5180d0469C66468B1433a29425F6785J41722l1682N4812j08346J08090F9361
13274A32827O514m0184b7788B34137G8558R1509q2588b9460C87237r0764j32108
13263A64365f926k7163E5120J98808A20078J69508A0321a56354A85288a66779
13252I5176J8694O1889K33190l7675J0453A02334a5720B13164a38275H3970K3191
13241A07161b5503B0811b27013c4165B73862o5718D3712K54195E0701N2630J8223
13230A21554k9516J02407D7495J51092m1325C6539h7865B67739F3295L2628M4249
13219A40172c7615j23250B51253q9933m9300L7479K15129J06847f7780G7739K47183
13208C24922o4168H1748C2932J42040K34581b8191j48011j42056F4158D045h0487
$$ y = [85180, -40469, 366468, 21433, -129425, 66785, 208507, 176825, 231637, 123291, 231381, 69361, 132827, 139341, 99157, -27788, 234137, 78558, 170067, 87479, -29460, 387237, 296473, 164365, -6926, -34089, 55120, 253928, 120078, 289586, 10321, -156354, 185288, -166779, 95176, 113870, 175759, 408949, 371274, 381727, 102334, -15720, 213164, -138275, 83970, 107161, -25503, 20811, -227013, -34165, 273862, 208144, 43712, 297907, 50701, 103331, 121554, 92038, 194445, 47495, 198587, 157262, 36539, -87865, 267739, 63295, 95923, 140172, -37615, -160865, 251253, 161320, 112020, 149499, 364628, 471475, -67780, 77739, 324922, 260754, 81748, 32932, 174972, 409553, -28191, -176202, -318258, 64158, 4045, -80487]
13196H384a27835C78966j14233e355A96296G4757l875N60162I8486A6392L16132
13185C32524I4097c10280A50494J02957a01351B77605E1798J21741j5791b61030
13174h3469B98850c99627A8242J14796M4692a9125A00364a19393A60564j8294
13164A42270N3016M6069b58827O4035B18321o0895b9945k48405B59280E838J1002
13153A6840c43104B14134H0404L37916A77196i3058A65857Q9738o4760J32030
13143C22865I6453B8669g4793a2832m0301C03231H0336P7086e9798j18617D5765
13131B44924P1465A53930a8614l6259A99374r6941O9160P6485D5476a17633B45158
13119b57145C8614A0914J16163a26514A95994j2827a42821K601A02477J271k7310
$$ y = [8384, -127835, 378966, 264733, -5355, 196296, 74757, 70882, 631044, 98486, 16392, 332524, 94097, -310280, 150494, 253451, -101351, 277605, 51798, 173539, 157748, -261030, -83469, 298850, -399627, 18242, 133038, 177730, -19125, 100364, -119393, 160564, 142270, 195286, 241355, -258827, -194792, 218321, 157426, -29945, -278350, 259280, 5838, 16840, -343104, 214134, 80404, 418320, 177196, -93058, 165857, 255595, 190835, 322865, 96453, 28669, -74793, -12832, -53133, 303231, 80336, 157422, -59798, -178415, 45765, 244924, 316389, 153930, -18614, -54873, 199374, 102433, 171593, 248078, 45476, -117633, 245158, -257145, 38614, 10914, 127077, -126514, 195994, 183167, -142821, -140220, 102477, 103748, 76438]
13108G6438a6473I8958d8456A74356a19058D36323o5575A32431b26691B00496
13097A83132F0160B1680c2845A38830b18911d4441j82195A17502k5879l1615b83899
13085A89497q3150C8781c2071A52995D8770J96577d7762k2196j69071A11272m5316
13074F5956b1694B64174j22376m899a53113K4440B07057K42670a6582D5711M5269
13063I0980a89391A05606K5819O2419a76399B62429a21652C02129O9178A77245
13052B07923r3799b13947b4288j57440B92509m5276E7033a17272c2332j82779
13042b15111B09661A134h4164L4983j60374B03210J71399j78903a48882C35131
13031C64360A16351q159M1731l3990J50333a60925d0602C59432A43768L4364m8474
$$ y = [76438, -16473, 98958, -48456, 174356, -119058, 436323, 370748, 132431, -226691, 200496, 183132, 60160, 21680, -32845, 138830, -218911, -44441, -226636, 117502, 91623, 60008, -283899, 189497, 106347, 38781, -32071, 152995, 48770, 245347, -47762, -69958, -239029, 111272, 65956, -21694, 264174, 141798, 136899, -153113, -128673, 207057, 449727, -16582, 45711, 90980, -189391, 105606, 131425, 193844, -176399, 262429, -121652, 302129, 371307, 177245, 207923, 114124, -213947, -24288, -181728, 292509, 247233, 57033, -117272, -32332, -215111, 209661, 1134, -84164, -49181, -209555, 203210, 374609, 195706, -148882, 335131, 364360, 116351, 108192, 149923, 115933, 266266, -160925, -40602, 359432, 143768, 178132, 129658]
13020A29658D2053R7064f1421C75924j39100D7666K61532C0433L6405K58044r6803
13009B28079J33705M5168b55682a1344j47437B70464A17369k9068M10275a2479
12998D4191a41620B42767e08C44933G3046M341a27851A42856O338i208B29747
12986B09477l5074O994J75096L5274j94274b02693c533B78863b63686C24041j59721
12975A64320e5713A85112J05798F981K15573a24877D0550K11752o7962m7010G383
12963C0341i6026E5455i1967q3552H5390B7184c7A97363e69G7966g3762B23929
12950F3792m646K84196f0319A06715a05421A59669K41188C2089b77691B05812
12939a08817A52949F197O9050O7620j3481i3710A8685J39720a1226j4137G1676
$$ y = [129658, 42053, 139117, -61421, 375924, 236824, 47666, 309198, 30433, 66838, 324882, 228079, 361784, 406952, -255682, -11344, -158781, 270464, 117369, 88301, 498576, -12479, 44191, -141620, 242767, -508, 344933, 73046, 77387, -127851, 142856, 149194, -9208, 229747, 209477, 174403, 181397, 356493, 391767, 197493, -202693, -3533, 278863, -263686, 324041, 164320, -55713, 185112, 290910, 6981, 222554, -124877, 40550, 252302, 184340, 137330, 7383, 30341, -96026, 55455, -91967, -175519, 85390, 27184, -37, 197363, -569, 77966, -73762, 223929, 63792, 59146, 343342, -60319, 106715, -105421, 159669, 400857, 32089, -277691, 205812, -108817, 152949, 6197, 75247, 142867, 129386, -93710, 18685, 158405, -11226, -25363, 71676]
12927G6541R8503q578d4437l65903a36567a2782A54475J2686J29702g4627K2901
12916e1726B01380J09700A6684i0946n7508B84321a66837k9477H4866M2852b74068
12904b38348Q1172l08906A64372a58885m5394e0503G9323K1597J75662O7110A23469
12892G5955J54764o8353B4168N6188J2723l7830H098O1850K4106l0306a11841
12880a05450E66102h6753I6563a82061I3003K63876H3195b12306C41422D5073
12869A97086a2977p3957B37853p4072i2031A85312j7308B1389l457b39151B4569
12857a19059A44684F5823b9037A79093i7806B86756f6982C5540b08923A52453
12846A45951j0912L9442K45177j71086A16385c1299B04275n8895d2462k01622
$$ y = [76541, 175044, 166466, -44437, -410340, -136567, -12782, 154475, 167161, 296863, -74627, -51726, 201380, 311080, 16684, -90946, -148454, 284321, -166837, -196314, 84866, 127718, -274068, -238348, -157176, -466082, 164372, -158885, -204279, -50503, 79323, 100920, 276582, 343692, 123469, 75955, 230719, 162366, 24168, 80356, 93079, 55249, 8098, 69948, 94054, 63748, -111841, -105450, 566102, -86753, 96563, -182061, 93003, 356879, 83195, -212306, 341422, 45073, 197086, -12977, -86934, 237853, 163781, -92031, 185312, 168004, 21389, 17932, -239151, 24569, -119059, 144684, 65823, -29037, 179093, -97806, 286756, -66982, 35540, -208923, 152453, 145951, 135039, 174481, 419658, 248572, 116385, -31299, 204275, 145380, -42462, -244084]
12836b44084A05429M6566a05610C00680c60951H7802A6347J24409b59489e6278
12825B44005c75468J21A57299a01526B20103o4487a55885R722B17131E415J42271
12814A47686J16748I8415a10918A36814A06K22049b77995o1136M4456B16418I1415
12802d899A19036b3899C0674J05782P1163n4151b65766B14432E9721e8044k18376
12791b76420F5197a07910k70453A67894J45064b11942f0942A1657J0197N9834
12781H1688M9347a37015A25183a168A38136j2286a84632M1833C18220F330c23069
12769E252a81575C5732P1382k8257b44486A58560F1468b31467K0116L4387B18987
12757a81659L3803r7141q4765C34910f3984A75442o4735b20026k6668h0726k696
$$ y = [-244084, 105429, 151995, -105610, 300680, -360951, 87802, 16347, 140756, -259489, -56278, 244005, -375468, -375347, 157299, -101526, 220103, 155616, -155885, -146163, 217131, 5415, 147686, 264434, 98415, -110918, 136814, 106, 222155, -277995, -339131, -294675, 216418, 91415, -4899, 119036, -23899, 30674, 136456, 207619, 153468, -265766, 214432, 59721, -58044, -276420, 65197, -107910, -378363, 167894, 312958, -211942, -60942, 11657, 21854, 81688, 131035, -137015, 125183, -1168, 138136, 125850, -184632, -142799, 318220, 6330, -323069, 5252, -181575, 35732, 107114, 78857, -244486, 158560, 61468, -231467, -211351, -176964, 218987, -181659, -147856, -244997, -329762, 334910, -63984, 175442, 110707, -220026, -246694, -80726, -83422]
12746h3422k39454I6840i9559C84550j12893G1130a31192n9309A30691N0386D8318
12734D18164A0587R8078d2313A26662K5446f0667A28486b8959J790B62619j04685
12723A57934m3908a79673I1203a76563B8965b8299A80635f2326A79896p0340i5678
12711H0047d3824D0684J84702a94458B36538H6054E02Q3147J56984K8864a35851
12699B35896a88807F1134J21088b525B71929i629j34601H365a05460j5175I6612
12687B0636r35a15268d7079n168C7428J72280B4696A0839L52876j61446a5424
12675b3302k29034D67925C864K861a49484C18091B2116a63744A94092a88186e4095
12663H980N0147K16519a01745d0703k84531A85389F3103L38648A05591A4533J54713
$$ y = [-83422, -322876, 96840, -99559, 384550, 271657, 71130, -131192, -190501, 130691, 181077, 48318, 418164, 10587, 108665, -42313, 126662, 152108, -60667, 128486, -28959, -27169, 262619, 157934, 114026, -179673, 91203, -176563, 28965, -28299, 180635, -62326, 179896, 109556, -95678, 80047, -43824, 40684, 225386, -194458, 236538, 86054, 502, 83649, 240633, 269497, -135851, 235896, -188807, 61134, 182222, -2525, 271929, -9629, -144230, 8365, -105460, -120635, 96612, 20636, 19701, -115268, -47079, -52247, 37428, 209708, 24696, 10839, 363715, 202269, -15424, -23302, -252336, 467925, 3864, 6725, -149484, 318091, 22116, -163744, 194092, -188186, -54095, 8980, 59127, 275646, -101745, -40703, -325234, 185389, 63103, 401751, 105591, 14533, 169246]
12652A69246l7755d1049C43597q0173a10874A47029a98891A24865J7709o1489
12642H1085a01760E0301e2493A23743m3463Q1914L9907b9641A58968J23419m3539
12631B38848f5340A86186j7190C7813J13907J96792j24874J28668b61659A65456
12620B16986B8470J31266R1811C9167J65249A6451J43317o6385k1415J30104l577
12609A98495a63438n58e6437j20841A23077a91961B49879J43685A65984Q9899
12599B55883f0280r2068H2658a17733A5048P3799O3487a02976A25386P4024a16577
12587c63381h2142l26226H1721B8033a66780A66694G901N6477M2490l9492e7276
12575B12759j02829b45705a17128L2814A23101K16154a85241J3392a2316H2062
$$ y = [169246, 131491, -41049, 343597, 263424, -110874, 147029, -198891, 124865, 142574, 81085, -101760, 50301, -52493, 123743, 80280, 162194, 202101, -29641, 158968, 282387, 238848, -65340, 186186, 168996, 37813, 151720, 348512, 223638, 352306, -261659, 165456, 216986, 28470, 159736, 251547, 39167, 204416, 16451, 159768, 93383, 71968, 202072, 198495, -163438, -163996, -56437, -177278, 123077, -191961, 249879, 393564, 165984, 255883, -60280, -152348, 82658, -117733, 15048, 88847, 152334, -102976, 125386, 199410, -116577, -363381, -82142, -408368, 81721, 28033, -166780, 166694, 7901, 64378, 106868, 67376, -57276, 212759, 109930, -245705, -117128, -84314, 123101, 339255, -185241, -171849, -12316, 82062]
12564a50946H1873c22399A33961J23602g7111E08814j97478M8157b24770N2127
12554a72643G7548g6593k78150A9062d72771B86133c1014k4318F1891K35391k7986
12543B69296n4070d2214A83914a58494A611J23839a1298k84367J26524A64278
12532a83697I9029i2365A03323a10171K378K6409I1209J74595b9542j50106A94936
12520a52382E4325h4176C22147j18702B6363b50726B44705b0615j4430j06118
12510a41163a553A55057a40320j52286A97064b99377A00460k6335j5402a0470
12499F7481Q1598Q1507m2564c7264j3905A03787M9433A1033L6970I078a32235
12487b5826B22855l6533B4657R0960a4676C14133C0427K80107j25037E364M184
$$ y = [-150946, 81873, -322399, 133961, 257563, -77111, 508814, 311336, 359493, -224770, -172643, 77548, -76593, -354743, 19062, -472771, 286133, -31014, -55332, 61891, 297282, 269296, 215226, -42214, 183914, -158494, 1611, 125450, -11298, -295665, -169141, 164278, -183697, 99029, -92365, 103323, -110171, -107793, -81384, 91209, 265804, -29542, -179648, 194936, -152382, 54325, -84176, 322147, 203445, 26363, -250726, 244705, -20615, -35045, -141163, -1553, 155057, -140320, -292606, 197064, -299377, 100460, 74125, 58723, -10470, 67481, 149079, 230586, 188022, -37264, -51169, 103787, 153220, 11033, 48003, 9078, -132235, -25826, 222855, 186322, 24657, 115617, -14676, 314133, 30427, 310534, 185497, 5364, 9548]
12476I548i9295F929J45199a04703A27395k9882b70812B97628e9087B28618E4346
12464B6185K19673b97935D0305M2187L5648o323b81112L0116J05024C9124Q5413
12453A24537F0197J20467H398h7096L3722j85812N9231D6969b9328k15711H0639
12441G3599B8975d41228a22411d6340D18485c27481i3578d294k89989A53373a4043
12429D5408J9145a56869A76049b92000J43885d4056A79507j7330A6757J86018
12419B02775N6108b6298k58820A04082A6804J56931M8418i2455D0943b4383A61600
12407D53360B5025b95717B89400a63316p1209C59210A64207C8749i8967j21331
12397b20298b2685a1334j43572d7010K654C03601C0920a92500N0487A99417b4329
$$ y = [9548, -99295, 6929, 152128, -104703, 127395, 97513, -270812, 297628, -59087, 228618, 54346, 26185, 245858, -297935, 40305, 82492, 118140, 111817, -281112, -250996, -145972, 39124, 124537, 60197, 180664, 8398, -87096, -53374, -239186, -179955, 46969, -29328, -245039, 80639, 73599, 28975, -441228, -122411, -46340, 418485, -327481, -93578, -4294, -294283, 153373, -14043, 45408, 64553, -156869, 176049, -292000, -148115, -44056, 179507, 162177, 16757, 202775, 258883, -26298, -285118, 104082, 16804, 173735, 222153, -92455, 40943, -24383, 161600, 453360, 25025, -295717, 289400, -163316, -234525, 359210, 164207, 38749, -98967, -220298, -22685, -11334, -154906, -47010, -44356, 303601, 30920, -192500, -142013, 199417, -24329]
12385D239K10218o1193a44922A19184i598o8261K8328B17705k3496b68315B1618
12373i6106j40511d5016j99567C3776b5022l40741G7658l2087R1985A3065a78683
12361A6095K43222J19757j50033a38992B45720a7521j42663L1148d756B04725
12350A52890b08089O4658a691A13165a09461n2325D3326J85846h8475C03307h2768
12338f1488q5564A08408d15616b6007j3793D59262c30804A29523a43161P0658
12328g2503J6319G8330f3542C6044N0139b37815A29666D3778J53423a45938C5156
12316B16700C9187e7580n3636a0863l51012A32250J68144I320h1539m4367b8848
12304C826A656L0077a79378j24003A92505c9953k06065B15603N8854a93929L666
$$ y = [4239, 214457, 153264, -144922, 119184, -9598, -77859, -49531, 217705, 194209, -268315, 21618, -96106, -236617, -45016, -244583, 33776, -25022, -365763, 77658, 45571, 137556, 13065, -178683, 16095, 259317, 379074, 229041, -138992, 245720, -17521, -160184, -129036, -4756, 204725, 152890, -208089, -143431, -1691, 113165, -109461, -161786, 43326, 229172, -88475, 303307, -82768, -61488, -147052, 108408, -415616, -26007, -39800, 459262, -330804, 129523, -143161, -72503, -56184, 78330, -63542, 36044, 86183, -237815, 129666, 43778, 197201, -145938, 35156, 216700, 39187, -57580, -111216, -10863, -361875, 132250, 300394, 9320, -81539, -125906, -28848, 3826, 1656, 31733, -179378, -303381, 192505, -39953, -246018, 215603, 274457, -193929, -190263]
12293a90263G1121J06215I2O1980a11563A55667J89520a41712c8800k13643A51701
12281D079i5293B64163n8495O116j04529l3493L76521j36781J78896A19221a15366
12269G0860N8656k2973B8881J40352l2440h0152K9919j64123B06955a58307c2956
12257E0281O39966B09109j2955A2297L67664D01L0898g1985k6151J1j9391G1164
12244a65960l4870B82548a17938B95044b2407j09199Q028A29028R0299J33154
12234C52481b2855B26958e3849I4345c886C0352L37173A02168Q9916j565a60832
12222c81555f9255A50993a9751A44294A730a72068E09945B8890A3120N3141p819
12211E8442a53639D004b12078B71253q0504a08250A95199O2976J20538D7115K26165
$$ y = [-190263, 71121, 177336, 92, 62072, -111563, 155667, 345187, -141712, -38800, -252443, 151701, 4079, -95293, 264163, 205668, 211784, 107255, 73762, 450283, 313502, 492398, 119221, -115366, 70860, 129516, 106543, 28881, 169233, 136793, -80152, -50233, -214356, 206955, -158307, -32956, 50281, 690247, 209109, 196154, 12297, 379961, 401, 31299, -71985, -98136, -98125, -117516, 71164, -165960, -200830, 282548, -117938, 295044, -22407, -131606, -123578, 129028, 219327, 352481, -22855, 226958, -53849, 94345, -3886, 30352, 367525, 102168, 192084, 190519, -160832, -381555, -69255, 150993, -19751, 144294, 1730, -172068, 509945, 28890, 13120, 66261, 58442, -153639, 4004, -212078, 271253, 190749, -108250, 195199, 258175, 378713, 47115, 273280]
12200B73280B1448g4754C53720q1919b8110A76384D8603K64500l3807j35557G249
12188E6730A0989c48594a52521A33744L77588C7844J03844n5158M8769b6140C80542
12176C7272J101J07494K1318b6874D72366I2189C1324J57500p0963J88827A46942
12164A10143d2456A14254b33082N3653k2048A79830K16830A2002M31275B2367
12153A14096a47110D46115A20211J6516f0321C0700L15111e2772p0623k8471m33
12142a52299I678a90564I4477P5858o9293m3440d9273C00985f718A49090o9345
12131G9745B9408J5111K3994g9786L8889C3670M5286a08732J0449B62106a1990
12119A67271b37336a9268E6724J56831a14658c5864E8383K19540M4218f3265k01908
$$ y = [273280, 21448, -74754, 353720, 271801, -28110, 176384, 48603, 313103, 279296, 143739, 7249, 56730, 10989, -348594, -152521, 133744, 511332, 37844, 141688, 86530, 135299, -26140, 380542, 37272, 38373, 145867, 167185, -26874, 472366, 92189, 31324, 188824, 117861, 306688, 146942, 110143, -42456, 114254, -233082, -179429, -201477, 179830, 396660, 12002, 443277, 22367, 114096, -147110, 446115, 120211, 136727, -60321, 30700, 345811, -52772, -123395, -151866, -152299, 9678, -190564, 94477, 170335, 101042, 57602, -49273, 300985, -6718, 149090, 79745, 29408, 44519, 68513, -79786, -40897, 33670, 78956, -108732, -98283, 262106, -11990, 167271, -237336, -19268, 56724, 213555, -114658, -35864, 58383, 277923, 322141, -63265, -265173]
12108b65173a06751G888g2241F5852b4576A28694M2945i7300k29087A22607b7281
12096D1434J25410K20046j45614h8423E7936b47521G512b30695N451C2888d470
12084b52890B47607k3583e9391j74854C211g6589E113Q3905P2575R47335N89764
12073A698692p13445A62676K289A6321b41312g9506B86587A30497O7139b4595
12062D4678c3A36747D0578a64848B65133e0926B80187A05680c67600a19334B43754
12050a13327B26507C3623K68908b99387k8655A0929K76636j11778H5019F265P2574
12039G8839g1747c2761B42059b67642D20900j43338a10750B39499E6128J21259
12029A77387i0236B16999D2071I322N5288a06170A96417l508c02924d3259A99464
$$ y = [-265173, -106751, 7888, -72241, 65852, -24576, 128694, 171639, -97300, -326387, 122607, -27281, 41434, 166844, 386890, 241276, -88423, 57936, -247521, 7512, -230695, -225244, 32888, -4470, -252890, 247607, 224024, -59391, -234245, 3211, -76589, 5113, 89018, 161593, 1108928, 1698692, 985247, 162676, 164965, 16321, -241312, -79506, 286587, 130497, 197636, -24595, 44678, -33, 136747, 40578, -164848, 265133, -50926, 280187, 105680, -367600, -119334, 243754, -113327, 226507, 33623, 302531, -299387, -328042, 10929, 287565, 175787, 85019, 6265, 78839, -71747, -32761, 242059, -267642, 420900, 277562, -110750, 239499, 56128, 177387, -90236, 216999, 42071, 9322, 64610, -106170, 196417, 192909, -302924, -43259, 199464]
12017e7997A75175q2168b9558l09226b9366j89370A74821c20063J20108N1350
12007a48605A56377J53680h0446E8645a33314j680G9617K0996b76635a37966A1647
11995I8303a46877B47124b87163J0375B25993f0687C9479b5284C7296N8286C3711
11983B2071a49361n3761A02214l5875b68032C01139c17161c0104J1554G994a45639
11971A01463p060B7708C949K66622a92801a6101k46289A53281a21378a2517k54304
11960b66821A24973a50158B98403b38170I7649a11279j57962O1003B46836i8128
11949a04481A27623g2774a3327l9006H0506J02226f2192k5201b2096B90153C4194
11937a05824j44805j7329a10478K6619C26690C7847b15568o2944A7816c88489
$$ y = [-57997, 175175, 93007, -29558, -338784, -29366, -218736, 174821, -320063, -199955, -148605, 156377, 310057, -80446, 58645, -133314, -134994, 79617, 100613, -276635, -137966, 11647, 98303, -146877, 247124, -287163, -276788, 225993, -60687, 39479, -25284, 37296, 95582, 33711, 22071, -149361, -203122, 102214, 66339, -268032, 301139, -317161, -30104, -18550, 7994, -145639, 101463, 94403, 27708, 3949, 270571, -192801, -16101, -262390, 153281, -121378, -12517, -266821, 124973, -150158, 298403, -238170, 97649, -111279, -269241, -208238, 246836, -98128, -104481, 127623, -72774, -13327, -52333, 80506, 182732, -62192, -87393, -22096, 290153, 34194, -105824, -250629, -267958, -110478, -83859, 326690, 37847, -215568, -278512, 17816, -388489]
11926H0708J16329b35633D9368J13433J15787j14432L12605r4963a00641D7277
11915b1132A0297c08561N426e568A81165O5564a83413m7093E9472A5898b83019
11903h0106k5166A54722b28371l3363d368B32440n7347K99699F2878a20732j39397
11892b60129L5708J08693A52107a69972N2111F0833f3297R65A15659h4106k7214
11881a11320m0488n9642j66182g4767m0305C5554g879j02940k2490j0422O8134
11870g5597B1389c15385J43492a4329k28990i7138l8677M8389K9037l348B93689
11858f3689l7816A48372k4146D2039K67048j09877a25102B82253j26853F0672
11847B55784a09026a7470C2207a56514e7977j37880A33684f1859A17710Q0795
$$ y = [80708, 197037, -235633, 49368, 162801, 278588, 164156, 476761, 381798, -100641, 47277, -21132, 10297, -308561, -303135, -5568, 181165, 246729, -183413, -230506, 59472, 15898, -283019, -80106, -105272, 154722, -228371, -261734, -4368, 232440, 175093, 474792, 62878, -120732, -260129, -224421, -115728, 152107, -169972, -117861, 60833, -63297, -62332, 115659, -84106, -111320, -151808, -211450, -377632, -74767, -115072, 35554, -7879, -110819, -133309, -143731, -75597, 21389, -315385, -171893, -14329, -243319, -97138, -135815, -87426, -58389, -61737, 293689, -63689, -101505, 148372, 124226, 42039, 309087, 199210, -125102, 282253, 155400, 60672, 255784, -109026, -17470, 32207, -156514, -57977, -195857, 133684, -61859, 117710, 198505]
11837A98505B6692N1298R7665c68591b3142A14203a87304k51710b15201Q5983
11827a29218L5519m2665C2234J42457d64556A49989d17631P5323g591A93523d8672
11815b2610A82088D0762d7328j59985B61155d00223H920f3775r9000F7017J68239
11804B35256a32619N6954o867b6633q2183D7998J21886c36985B9377e8312A56757
11792A77614g3492J2778A95988a70677B0560P0782J57556p0473A5943b75494B75167
11780e083k1376F9719P9616a06547L6262A26239G150L7900c35605B36227c18837
11768B3091g4150A82006G7818i0015B42155q7524i5645A06702a12897B12564N7490
11757B70054G3987b29510H3982b6971B49177b74576e1449k2879b306A826K41009
$$ y = [198505, 26692, 77990, 175655, -368591, -23142, 114203, -187304, -439014, -215201, -129218, -93699, -136364, 32234, 174691, -464556, 149989, -417631, -342308, -7591, 193523, -48672, -22610, 182088, 40762, -47328, -207313, 261155, -400223, 8920, -63775, -162775, 67017, 235256, -132619, -75665, -82532, -26633, -108816, 47998, 169884, -336985, 29377, -58312, 156757, 177614, -73492, -60714, 195988, -170677, 20560, 91342, 248898, 178425, 15943, -275494, 275167, -5083, -26459, 69719, 149335, -106547, -70285, 126239, 7150, 45050, -335605, 236227, -318837, 23091, -74150, 182006, 77818, -90015, 242155, 154631, -95645, 106702, -112897, 212564, 270054, 73987, -229510, 83982, -26971, 249177, -274576, -51449, -74328, -2306, 1826, 242835]
11746B42835b07949H7697L27023a37240H7616C9030a83059Q0890n2313D97576
11735b2397B4827a78827c646A09587P6758i7717a6762j37210F692h2177J9883
11724f2294H7035d727I022b0557A8531a78547d4548n0373A66422G2807b02203
11712A91031J54576r5052f0203k7820I3768q122M3728n9923Q193a38347R334B28377
11699A2196b07078B66179G135Q6895a65081A7192c2782m15957F2336b40490A52308
11687A20781l9557J1732C7236M0520P6411K50326h9081j452B85825A39791a0765
11675B6901L83138j44495L5749a13584l645k09085J55552A4488R9250a7862H4094
11663B38940a32856A7100d8757A47598j6709E4049J27222f3220o3852D6137Q4109
$$ y = [242835, -207949, 87697, 414720, -137240, 87616, 39030, -183059, -102169, -154482, 497576, -22397, 24827, -178827, -3646, 109587, 186345, -97717, -16762, -153972, 6692, -82177, -62294, 87035, -4727, 9022, -20557, 18531, -178547, -44548, -94921, 166422, 72807, -202203, 191031, 345607, 250555, -60203, -88023, 93768, 85646, 129374, 69451, 77644, -138347, -129013, 228377, 12196, -207078, 266179, 7135, 94030, -165081, 17192, -32782, -448739, 62336, -240490, 152308, 120781, 81224, 92956, 37236, 77756, 154167, 404493, -89081, -90533, 285825, 139791, -10765, 26901, 410039, 265544, 301293, -113584, -117229, -326314, -170762, 14488, 113738, -17862, 84094, 238940, -132856, 17100, -48757, 147598, 130889, 54049, 181271, -63220, -127072, 46137, 130246]
11652A30246a15896D9161g5506H2709d1371k5796H1990J5241c54131B7654h2482
11640b73895A81776o3624j6837a29507K2943G9603J54796H7851a64411A1324K90326
11629C01650c01437G6432K16206g4011b1008A56529l6451l5813B9118h3311B5212
11617D7882j8048f0994A32360h8651G8843e8027A36110J27833A7854L01098g7599
11605b08379G8751J28311a02466B17311a29740A43524d8934A3921J91610I7541
11594A39995c7003n8565K9154A63107M1787C460M31784c14C6283L27321j43070
11583B20534p0826p4726J93498b4066E8845a56053A18141A7261f905n8282o3953
11572a29140A07438h8195G4631L5414l6627L2455P6034N9842K15110A72856a9719
$$ y = [130246, -115896, 49161, -75506, 82709, -41371, -67167, 81990, 97231, -354131, 27654, -82482, -273895, 181776, 118152, 101315, -129507, -106564, 79603, 234399, 87851, -164411, 11324, 301650, -301437, 76432, 292638, -74011, -21008, 156529, 120078, 84265, 29118, -83311, 25212, 47882, 29834, -60994, 132360, -88651, 78843, -58027, 136110, 263943, 17854, 318952, -77599, -208379, 78751, 207062, -102466, 217311, -129740, 143524, -48934, 13921, 205531, 97541, 139995, -37003, -95568, -66414, 163107, 204894, 3460, 435244, -314, 36283, 363604, 220534, 149708, 74982, 268480, -24066, 58845, -156053, 118141, 17261, -6905, -65187, -129140, 107438, -88195, 74631, 110045, 73418, 105873, 181907, 241749, 456859, 172856, -19719]
11560D0024c8943A5413d3392k01974B96358A01510b22899c2110j83095a5468B3939
11548B66987i3738A71933J8358o2320B2029d81814B12922e9131A75696C9442b02579
11536B52415a34227G0281b15357f3265J5507A67896c1751p6548A9446L41838f4604
11524b15146h8284A30362A2133a94064A7184L47551A3694M925a7348o650l59298
11513c83296A91130f8949B91819o9425L4840a0743A24243p56a17184C74800a13256
11501A73626Q6790q5239l7069j4208k9314O6922d5733j65741o2042A46065b01595
11489B38048K58169f0268K5430l8675B47696b90715C70965j41909m3244D9920
11478c1037A81459c3665B32819n9952N7098g1163G2720J02711J59023n9230a18397
$$ y = [40024, -38943, 15413, -43392, -245366, 296358, 101510, -222899, -32110, -215205, -15468, 23939, 266987, -93738, 171933, 190291, 127971, 22029, -481814, 212922, -59131, 175696, 39442, -202579, 252415, -134227, 70281, -215357, -63265, -47758, 167896, -31751, -108299, 19446, 361284, -64604, -215146, -88284, 130362, 12133, -194064, 17184, 364735, 13694, 18619, -17348, -23998, -383296, 191130, -68949, 291819, 222394, 257234, -10743, 124243, 123487, -117184, 374800, -113256, 173626, 260416, 175177, 138108, 123900, 94586, 161508, -45733, -211474, -273516, 146065, -201595, 238048, 496217, -60268, -34838, -73513, 247696, -290715, 370965, 229056, 185812, 49920, -31037, 181459, -33665, 232819, 172867, 229965, -71163, 72720, 175431, 334454, 275224, -118397]
11466I5491j1014J81497I9935g2996A47924b6859o9422H4208K90267I5684Q4349
11455A80033L0100K06511A69371J99950P6541A24986A1587N6668K2567J39172
11445B29994a70527a8747j41667F2140j5151N675A5419J52058D7707p42R9995
11434A46960B3500K300F319a74913H9254a8726A80051j3409a33378B08239G2021
11422a25190B00038h6702H7819i5957A69257k665h3924C35563b4840k92950a8207
11410A39962f0449B7881b48835Q3950c0599I2457R6737J6151G9502C8948a69926
11398a07269L4697j36499j4469k6538D2304a41384b9098A13223J47237E6025c8388
11386c5873j64325A85764g5503j83929c440k54848A57891e93838A49947Q5921
$$ y = [95491, 84477, 265974, 99935, -72996, 147924, -26859, -96281, 84208, 374475, 95684, 180033, 210133, 416644, 169371, 369321, 445862, 124986, 11587, 68255, 90822, 229994, -170527, -18747, -160414, 62140, 46989, 52664, 15419, 167477, 47707, 46965, 146960, 23500, 25800, 6319, -174913, 89254, -18726, 180051, 166642, -133378, 208239, 72021, -125190, 200038, -86702, 87819, -95957, 169257, 166592, -83924, 335563, -24840, -317790, -18207, 139962, -60449, 27881, -248835, -164885, -30599, 92457, 189194, 205345, 79502, 38948, -169926, -107269, -72572, -209071, -223540, -250078, 42304, -141384, -29098, 113223, 260460, 56025, -38388, -35873, -200198, 185764, -75503, -259432, -3440, -258288, 157891, -593838, 149947, 235868]
11376B35868p4710L9636H1051i6316C6174K99966B1275b54362H5536K15295D3929
11364A28727c00815i0608B9074c50194H7837b08774A01765c01866i9025D11353
11353H052a53252E0027J29319b30736d4607E0367f3204j18835f8337q4711C2212
11341b61375B15842h3260C3027h8141r0764E2283K15028c13738i2233a7785B8907
11329I3369K5752H532L1684b34670a13453N1368E9920b7752k16939B19035E383
11317H8748j6245K8037d2746p6935K038k61027e095r8999j03225A374b3730p7323
11305a01053C9637J64245a14485M1392l261B48262e4656k25685N8741O6829A25011
11293F4387B2134g8781E5412e445B6896a31766N6074j11817j4725C252b24345
$$ y = [235868, 161158, 200794, 81051, -96316, 36174, 336140, 21275, -254362, 85536, 300831, 43929, 128727, -300815, -90608, 29074, -350194, 87837, -208774, 101765, -301866, -99025, 411353, 8052, -153252, 50027, 179346, -230736, -44607, 50367, -63204, -182039, -68337, -153048, 32212, -261375, 215842, -83260, 33027, -88141, -178905, 52283, 267311, -313738, -92233, -17785, 28907, 93369, 119121, 8532, 40216, -234670, -113453, -62085, 59920, -27752, -244691, 219035, 5383, 88748, 72503, 100540, -42746, -119681, -117643, -378670, -5095, -104094, -207319, 1374, -23730, -101053, 39637, 203882, -114485, -73093, -76354, 248262, -54656, -280341, -221600, -154771, 125011, 64387, 22134, -78781, 55412, -5445, 26896, -131766, -75692, -187509, -202234, 3252, -224345]
11281a8423A15997c90328J92431A97558H1370b88901I2105m5437a02991A90756
11270b1123L272A00871D3291a18724A76921b70989c6851l2129m3286C6939K38777
11259B75716a56899C2736a0380j91078m1846a184l36594B69339f6590D2818J2454
11248E5272N0504i0556B08977B1201b02533D9919K50631b42042J5218N3754A04046
11236b81820D83185b67083B06220f2029o9730c5673p0275B87327b04718q0626
11226b85344A53865a91015B14525b98211a21667H3302o540d2767F5904c40560
11215a31712B32848q1803D3673a72674d4893B14349a60050M4899E1282a1519D0507
11203B24300b14937o7384A75810C7577a00131K8370I6892j2135b5865k43327d2041
$$ y = [-18423, 115997, -390328, -197897, 197558, 81370, -288901, 92105, 46668, -102991, 190756, -21123, -17851, 100871, 43291, -118724, 176921, -270989, -36851, -68980, -112266, 36939, 275716, -156899, 32736, -10380, -201458, -243304, -1184, -337778, 269339, -66590, 42818, 55272, 105776, -90556, 208977, 21201, -202533, 49919, 300550, -242042, -226824, -173070, 104046, -281820, 483185, -267083, 206220, -62029, -131759, -35673, -105948, 287327, -204718, -285344, 153865, -191015, 214525, -298211, -121667, 83302, 76762, -42767, 65904, -340560, -131712, 232848, 151045, 43673, -172674, -44893, 214349, -160050, -115151, 51282, -11519, 40507, 224300, -214937, -282321, 175810, 37577, -100131, -71761, 96892, 84757, -25865, -269192, -42041]
11191A45433p360b84843b8286A37320J48497a0572B94261L2718E341K06343c10717
11179A09394a19553b7076k44814a01443B92240b07083j74367A38520m6023A5851
11168b36171a01929b2610E6a93843R6251A79420B9875N0928g9831j5575B06682
11156B30278m2307e5863A94752J31742b25233B7159a3406E4294b30481A77574
11145B74495f6447G6309N5009a31629h859B5300a2321j06025p5103a7080o9134
11134h6214r4786j40074c0343I791K28498j00705K6334o6250J85947F3834K27203
11123B91037j23735G1034b45108q0724A81488d2915r9493A1211L46835I452J29366
11112A38818r675C9289K08017A6526L05512j06868a88437R2070A66526J56145
$$ y = [145433, 138073, -284843, -28286, 137320, 285817, -10572, 294261, 326979, 5341, 211684, -310717, 109394, -119553, -27076, -271890, -101443, 292240, -207083, -381450, 138520, 92497, 15851, -236171, -101929, -22610, 56, -193843, -97592, 179420, 29875, 80803, -79831, -95406, 206682, 230278, 187971, -55863, 194752, 326494, -225233, 27159, -13406, 54294, -230481, 177574, 274495, -66447, 76309, 131318, -131629, -8859, 25300, -12321, -118346, -193449, -17080, -86214, -181000, -321074, -30343, 9791, 238289, 137584, 163918, 97668, 283615, 63834, 291037, 167302, 71034, -245108, -325832, 181488, -42915, -142408, 11211, 358046, 9452, 138818, 129143, 39289, 247306, 16526, 322038, 215170, -188437, -96367, 166526, 322671]
11102C22671n7369q7064E3240K51088j3744E1082d38B05472J69581a24622n844
11091a30466B31145O0437Q1194j11161r5364J11187F200J74331k2221a0064B08768
11079B14727J9161o5813j7215L45845E8676J27023K37948j30021R3105l7786q6385
11068B62560F1001J28812K29702J46357k21142o595P0094D5213N46534K33113
11058H24860k54282Q3210k40459L05381q4610M81258m13299j617j36751J05615
11048F69306p3694L6614Q0000j35463L11968k41675J79485n7321l19805K55868
11038G05283j99410J0044J24163j19218j6194K11849p1272J7289r4549R4305k26434
11027D35856K68620j58340O4474N275L26657D18546J89891j69713Q3759k46451
$$ y = [322671, 265302, 178238, 53240, 304328, 290584, 51082, -438, 205472, 375053, -124622, -130466, 231145, 291582, 372776, 261615, 166251, 277438, 6200, 180531, 158310, -10064, 208768, 214727, 233888, 168075, 150860, 496705, 58676, 185699, 423647, 293626, 386731, 348945, 262560, 61001, 189813, 419515, 565872, 344730, 338135, 408229, 45213, 591747, 824860, 570578, 653788, 413329, 718710, 634100, 1115358, 702059, 700442, 563691, 669306, 595612, 632226, 712226, 576763, 888731, 647056, 826541, 769220, 449415, 705283, 505873, 515917, 640080, 520862, 504668, 716517, 645245, 662534, 567985, 662290, 435856, 704476, 546136, 610610, 615885, 942542, 418546, 608437, 438724, 522483, 276032]
11017B76032K69590J70477j41167J59070q7405k79958J74407N9627J73727A32033
11006C41683L35075J5514j48979J41841K98488l78660J46893j04409C15599M25974
10996G41573k81425L05964J41334N4471l87786K0448K67351D20233M40534J16347
10986I77114o8496R6843J69343p6790k92726M33603j88754J68899P3174K41525
10976A533735L99937J93364P9689J17825M37164k89626J32888j33720l34159P5717
10966B212814l89868j9709m04000j86197L17997K76249n29437M52706M74470o94666
10956A510359j15388L24261m84628j11830k90958j6767o8423k45619K62747B59251
10945B59953n2018l624R948J06647k1460Q2959P9766g5071B07455N715K56089
$$ y = [276032, 545622, 716099, 574932, 734002, 646597, 366639, 541046, 600673, 774400, 132033, 341683, 676758, 692272, 543293, 685134, 983622, 604962, 751855, 647446, 315599, 741573, 460148, 766112, 907446, 961917, 574131, 594579, 861930, 420233, 860767, 977114, 908618, 1005461, 1174804, 1098014, 805288, 1238891, 1050137, 1219036, 1292210, 1533735, 1933672, 2127036, 2206725, 2324550, 2761714, 2472088, 2604976, 2471256, 2137097, 2212814, 1822946, 1803237, 1399237, 1213040, 1531037, 1807286, 1277849, 1730555, 2205025, 1510359, 1394971, 1719232, 1234604, 1122774, 831816, 815049, 746626, 501007, 763754, 259251, 259953, 207935, 204311, 214259, 320906, 299446, 382405, 462171, -75071, 207455, 213170, 469259]
10934D69259a90940h7699M0296I1640h5648A4117J46781j1762a7191j25983j40188
10923b83362i1876A01335d2317q7113f2317E09699i7758k93058A3142N5548b99520
10911E2187i8647D68848j83588b37819c7366A02466h7255A04131a12180A27111
10900g504B4162c0559j54006c180m2867C9700D933c372k5383f762p9635K7648
10888e8749A97222K0015O5557a43189D22217d7777E9695c15298e5382l00476B07059
10876a76358j25139A38589a81806h5136J4473I486M4055M5889m0857e8670j71508
10865b30178l73349c0255A52134a18058j14737h6504J2744A16019c7175D6495
10854b73995E2743a15188r6123c47A05950a61323f7368k89214f053A78488h5796
$$ y = [469259, -190940, -87699, -47403, 91640, -85648, 14117, 160898, 149136, -17191, -143174, -283362, -91876, 101335, -42317, -129430, -62317, 509699, -97758, -390816, 13142, 68690, -299520, 52187, -98647, 468848, 285260, -237819, -37366, 102466, -87255, 104131, -112180, 127111, -7504, 24162, -30559, -184565, -3180, -46047, 39700, 4933, -3372, -28755, -6762, -86397, -58749, 197222, 217237, 282794, -143189, 422217, -47777, 59695, -315298, -55382, -355858, 207059, -176358, -301497, 138589, -181806, -85136, -70663, 9486, 53541, 99430, 58573, -58670, -230178, -603527, -30255, 152134, -118058, -232795, -86504, -73760, 116019, -37175, 46495, -273995, 52743, -115188, -211311, -347, 105950, -161323, -67368, -356582, -6053, 178488, -85796]
10842H5971J0902D1372J5226a8670E6371O3048a23040M4938F8452A6078K3911
10831C9989A8608c50267J37492h2248A53618i909m436r2272I3450C7562e523j86005
10819a91528A361M4711d1805k44681h9428A04128a748k1616j13361H0954J68527
10808B49481d12980Q8999a18154B31069b4901A41762b37119B798a17686F97724
10797A45103a43700O3143B0754N2590e7897j06041p857o3738e0251j42515g4155
10785I6398l1579C017d5376B93973D5928f2753l6434A13113J2679e325A02136
10773D4235Q9896d6746q2549G1319J8665c33823i7422A043i9725j36380f3265
10761G2948c35516C8907K3222K2164C4650N3876M9972b90455f5048j66612B22296
$$ y = [85971, 96873, 41372, 56598, -18670, 56371, 119419, -123040, -78102, 68452, 16078, 39989, 18608, -350267, -212775, -82248, 153618, -9909, -14345, -106617, 93450, 37562, -5523, -191528, 1361, 46072, -41805, -286486, -89428, 104128, -1748, -23364, -136725, 80954, 249481, -412980, -323981, -118154, 231069, -24901, 141762, -237119, 2798, -117686, 697724, 145103, -143700, -80557, 20754, 73344, -57897, -163938, -171795, -235533, -50251, -192766, -74155, 96398, 64819, 3017, -45376, 293973, 45928, -62753, -99187, 113113, 125792, -5325, 102136, 44235, 134131, -46746, -129295, 71319, 89984, -333823, -97422, 1043, -99725, -236105, -63265, 72948, -335516, 38907, 62129, 84293, 34650, 88526, 138498, -290455, -65048, -231660, 222296]
10749I5981a3886k01213f1252k1434K0396g542q7655M5548A18667E156K7920K52210
10737B85286a96223K2125A31107j3471J63663a08423l238M4009K1793G0228b66990
10725D5905b03218j9305J02667n2231L0880j24703E25486b32176j35822i8057
10714a52593B81513a48622B27898b86848j32365B35823a00581k0323L1134m04143
10704d93913A19948a19976A0260N1803a70383D9122R8959F104a49593b4030D9461
10692A00617c41035a51542P5235B26104K7181b67299J15997j69512B30097a34419
10681b61136A1514C09a82771k23706a35927A5415a8079o8743j12326A27246b02711
10669c10933A16425J17010G1385d22634J77050M6013B10205a67574H3479J09004
$$ y = [95981, -13886, -215099, -61252, -82686, -62290, -7542, -95197, -49649, 118667, 5156, 33076, 285286, -196223, -174098, 131107, 117636, 281299, -108423, -111661, -67652, -45859, 70228, -266990, 45905, -203218, -222523, -119856, -172087, -141207, -265910, 525486, -232176, -367998, -98057, -152593, 281513, -148622, 227898, -286848, -419213, 235823, -100581, -120904, -89770, -493913, 119948, -119976, 10260, 62063, -170383, 49122, 148081, 6104, -149593, -24030, 49461, 100617, -341035, -151542, -76307, 226104, 253285, -267299, -151302, -320814, 230097, -134419, -261136, 11514, 309, -182771, -406477, -135927, 15415, -18079, -86822, -199148, 127246, -202711, -310933, 116425, 233435, 71385, -422634, -245584, -199571, 210205, -167574, 83479, 192483]
10659A92483f683C3710J04460m4170a00296b5032k02175G662a07888J4678r8931
10648a92141h0433A38745a19665d6680j06919j46694A02466d6814j22950A88599
10637A65290a68432A7707a36594j49021B1667O66e8037I8089D7568Q0349n182
10626A22735J49358r0535b37226A78836B8924N3054i8743A3804J1975e2393j23397
10615a75790D86829c69828e3599j52125A15052O6339h8101B50787G007N836e4645
10603g1332o7955J7592A88340B4319a39235J7834L7128J2907j54253E2375c4615
10591B53635B7704b16459b8964r1358j01681A500b66058E8770B4437c7n8528b3231
10578c08658Q3411A5932R27g8893r4538B46424a51050L0903n1175L3034k6088
$$ y = [192483, -6683, 33710, 138170, 94000, -100296, -25032, -227207, 7662, -107888, -93210, -192141, -80433, 138745, -119665, -46680, -153599, -300293, 102466, -46814, -169764, 188599, 165290, -168432, 17707, -136594, -285615, 21667, 22333, -58037, 98089, 47568, 127917, 122735, 272093, 181558, -237226, 178836, 28924, 81978, -98743, 13804, 25779, -52393, -175790, 486829, -369828, -53599, -205724, 115052, 181391, -88101, 250787, 7007, 12843, -54645, -71332, -139287, -121695, 188340, 24319, -139235, -121401, -84273, -71366, -225619, 52375, -34615, 253635, 27704, -216459, -28964, -120322, -222003, 1500, -266058, 58770, 24437, -37, -58565, -23231, -308658, -225247, 15932, 16859, -78893, -173431, 246424, -151050, -120147, -171322, -138288, -164376]
10567a64376A96572d6739j0786k22688I4397P0346b54539i3722b3581j72529R0782
10556a05328A2037c09202J41381B07577m1922e4270j12203E6713a48935e6728
10545a34435B06916b7090E6729d3271B3494c8372k92598H0517b02348j14261f8525
10533a92840C6740K23030B9774f8522r8358K8535c300A7802J22824L2748a91117
10521a32360P249C8306h6059F9580c29383H887a93573A67112p6203a34426q1852
10510b16278M9924C6055i5478F0351K00021b15273J06163A08080l0855a97598
10499c16601i6874c0792J0390A81680P903c2448F5407a59246D5557J09141E9091
10487d5549A38441o4135J39369K66573D7059J39285Q2182J66791L73214I8661
$$ y = [-164376, 196572, -46739, -57525, -280213, 94397, 164743, -254539, -93722, -23581, -196110, -105328, 12037, -309202, -167821, 207577, 165655, -54270, -166473, 56713, -148935, -56728, -134435, 206916, -27090, 56729, -43271, 23494, -38372, -330970, 80517, -202348, -316609, -68525, -192840, 36740, 259770, 29774, -68522, -166880, -138345, -3300, 17802, 140626, 173374, -191117, -132360, -125111, 38306, -86059, 69580, -329383, 8887, -193573, 167112, 90909, -134426, -216278, -166354, 36055, -95478, 60351, 260372, -215273, -109110, 108080, 77225, -197598, -316601, -96874, -30792, -20402, 181680, 189583, -32448, 65407, -159246, 45557, 154698, 59091, -45549, 138441, 74306, 213675, 480248, 47059, 186344, 268526, 435317, 808531, 98661]
10476B07573j02234b5671E9826a71297O8380C20776A48807F5019c61467a05765
10465D28739a2883A72004J58380G1739b1140E27523A4544h5869E745J8500M0837
10454F5082b32291G2901c2858A58141F3524d1006k44045A24019h4584l13461B72884
10442a82873A58305b4008j97594m741k88715a90417L1985B57151a49966A91607
10431A56802F2549a68382o5806a00753B47213q6496d8376I7482h5656m0133k45092
10420c70881f670A149P9909i264q853m3923B11980a35188A26858g8483J4380j36402
10408b00505h7417p8352A99585b02234d5552o134H703f4421D8054Q6634a1155
10396a31599J4392I9087M015L18469a49168l8645A51065j5127l9439J21443a69489
$$ y = [207573, 105339, -25671, 59826, -171297, -102917, 320776, 148807, 65019, -361467, -105765, 428739, -12883, 172004, 330384, 71739, -21140, 527523, 14544, -85869, 5745, 24245, 65082, -232291, 72901, -32858, 158141, 63524, -41006, -285051, 124019, -84584, -398045, 272884, -182873, 158305, -24008, -221602, -226343, -515058, -190417, -158432, 257151, -149966, 191607, 156802, 62549, -168382, -234188, -100753, 247213, 160717, -48376, 97482, -85656, -125789, -370881, -6670, 1149, 81058, -9264, -18117, -62040, 211980, -135188, 126858, -78483, -64103, -200505, -87417, -165769, 199585, -202234, -45552, -51686, 8703, -64421, 48054, 134688, -11155, -131599, -117207, 99087, 103102, 421571, -149168, -187813, 151065, 135938, 96499, 217942, -169489]
10384A77253d8482B9076b45107B54658j10510K66609a2079B65332K3242J81685
10374D70259A78877n0716M72860B40408q0090J37021c9311C28965N3536m0441
10364C42060M32959A71499O6306K11301A74196P2252B6503K209K61406J14119
10354D04237A58875M07712k46000K7681o1664K29419Q198B38551n0790L44596
10344E32357k17244L45856n0791A9577K49827J02950B5118g5091A20281c14928
10333A41331M49484c52196B15840a50941B3448J17765a54317A42692d719B94499
10322A36020J16819B0426C720Q0820k6503a22B35315C8579J88151F5286b9188
10310f4804n4580B18842A05951d2984L700J4742A65697b75456A10724b11802e08
$$ y = [177253, -48482, 29076, -245107, 254658, 144148, 410757, -12079, 265332, 288574, 470259, 178877, 128161, 601021, 240408, 160318, 297339, -39311, 328965, 382501, 342060, 775019, 171499, 237805, 449106, 174196, 246448, 26503, 28712, 290118, 404237, 158875, 566587, 320587, 348268, 286604, 516023, 524221, 238551, 187761, 532357, 315113, 660969, 610178, 19577, 269404, 372354, 25118, -75091, 120281, -314928, 141331, 590815, -352196, 215840, -150941, 23448, 141213, -154317, 142692, -4719, 294499, 136020, 252839, 20426, 3720, 84540, 58037, -122, 235315, 38579, 226730, 65286, -29188, -64804, -119384, 218842, 105951, -42984, -39284, -24542, 165697, -275456, 110724, -211802, -508]
10298b17088i6008B41576q9261c3172k98001P8489B98641H4341a69959N0639B31627
10286b49934B74200j054j01244b38857Q8232j4547N714N933A96672f4172B86404
10274A63332b55286i025C4006n235P5282B9166D471a93568p9163A01214l4804
10263F6410b8784B19466K2420r7999c7000C57804A46994K25662j23707J16936
10253C65885A3376h7082C52730a36290A63717a8883B3487b96399F7068b55354
10242a0184m6412j18166k9347H2058a24226B43730a67707j4399d2674j03176f3119
10230H325d2934D04469a35475A53606f0175D5040O4550J58461p2538a16110F0824
10218a75051H4586K260g307p1467l0082n8052L8909o2179A07585K6338b31324
$$ y = [-217088, -96008, 241576, 152315, -33172, -331173, -252684, 298641, 84341, -169959, -119320, 231627, -249934, 274200, 273146, 171902, -238857, -150625, -165172, -159458, -153525, 196672, -64172, 286404, 163332, -255286, -9025, 34006, 28771, 104053, 29166, 4471, -193568, -272731, 101214, 66410, -28784, 219466, 241886, 143887, -37000, 357804, 146994, 372656, 248949, 365885, 13376, -87082, 352730, -136290, 163717, -18883, 23487, -296399, 67068, -255354, -10184, -56596, -174762, -204109, 82058, -124226, 243730, -167707, -182106, -42674, -145850, -63119, 8325, -42934, 404469, -135475, 153606, -60175, 45040, 109590, 268051, 195513, -116110, 60824, -175051, 84586, 86846, -7307, -78774, -108856, -166908, -127999, -190178, 107585, 133923, -231324]
10206a96370A322a75748G9625b30984J10468K8762D3076i6238j79483m5261A46551
10194B9182a47907e7042j12603A83707a10527m6031B38586A09968a09779c3075
10183E1149h9279k9582l202D2907b5212D05566a69189I2366b37505p8970g7328
10171c56032A53763a83322k2444A78099d19908q251a09965j58165B73517b41778
10160b3748j69026C0903n408c066A51704a50869H6880l7787L60854j71355i1515
10148b02874K1785c1052k20521G9879i5162J3891j31674D63035b42647j04671
10138c47318a29071F8768d18289f2997G0181a36408K0478L935m5633e2702D3789
10126b89836H443b8342A11712N7801b50701A12857a46827j9751A75034a22937
$$ y = [-196370, 1322, -175748, 79625, -230984, -120516, -91754, 43076, -96238, -275721, -320982, 146551, 29182, -147907, -57042, -169645, 183707, -110527, -156558, 238586, 109968, -109779, -33075, 51149, -89279, -118861, -122063, 42907, -25212, 405566, -169189, 92366, -237505, -316475, -77328, -356032, 153763, -183322, -205766, 178099, -419908, -428159, -109965, -268130, 273517, -241778, -23748, -192774, 30903, 25495, -3066, 151704, -150869, 86880, 49093, 409947, 238592, -91515, -202874, -181089, -31052, -251573, 79879, -95162, -81271, -212945, 463035, -242647, -347318, -129071, 68768, -418289, -62997, 70181, -136408, -115930, -111995, -157628, -52702, 43789, -289836, 8443, -28342, 111712, 169513, -250701, 112857, -146827, -166578, 175034, -122937]
10115I4716a48367B4424b81743P0287H8646a35614B9458d01236b1607m16648a66459
10103c8301o4471B0645a5322m22415A26982j1621R4751e4713o9315A76109H1262
10091a55463k28097A79074a64853D0564M2704K9611m8995e0470j57242A27972
10080e51712A59080c12157A00568b38392h2939l8688j22548B05288A8400N5904
10070G4304O2178n83H45i1729b9492D6844P3124d52794B47326c3694A47491N0607
10058A98098H4163i0116F269c16734J24573h2256B54827a47277N9759B09792e08473
10046b8472A88214b0118B73133A03212c3656A91396F5021b49594A37881a2730
10035A0713K32333I7985d36134N5665a22294A03099m727a94889k7437J0997A02926
$$ y = [94716, -148367, 24424, -281743, -211456, 88646, -135614, 29458, -401236, -21607, -438255, -166459, -38301, -102772, 20645, -15322, -437737, 126982, 115361, 210112, -54713, -124028, 176109, 81262, -155463, -383560, 179074, -164853, 40564, 83268, 112879, 63884, -50470, -207712, 127972, -551712, 159080, -312157, 100568, -238392, -82939, -121627, -244175, 205288, 18400, 74304, 136482, 135899, 845, -91729, -29492, 46844, 119968, -452794, 247326, -33694, 147491, 198098, 84163, -90116, 6269, -316734, -192161, -82256, 254827, -147277, -87518, 209792, -508473, -28472, 188214, -20118, 273133, 103212, -33656, 191396, 65021, -249594, 137881, -12730, 10713, 243046, 97985, -436134, -380469, -122294, 103099, 98372, -194889, -222326, -211329, 102926]
10023B4549K20183J7250a11011J6082j03119j10321a12576N4947B62581b13766
10012b03909B10425b96917J35423j21662i8194I5143M8373c20728A33591J04164
10002B37755c14575I2760e2120B21650B01a39410A99370B0401a43284M7862k09784
9991c05206A85189H965a18167A62048P2445j02802K0888J5182J9824a5305j28541
9980a43846c7258k08622g8959B77161a32356e267q1025D09884B8570a67408a916
9968c44384D3799a7733j7064k26471A33301K32756c96658J98165P3875k10321
9958c34939a46615r0888l8183D977c29565B34527a30112G8009a90661E0618b19765
9946A36355a84129R658d017A11100k6115a7726l38344a28341M9773O242j66008
$$ y = [24549, 244732, 261982, -111011, -94929, -198048, -308369, -112576, -57629, 262581, -213766, -203909, 210425, -296917, -161494, -283156, -98194, 95143, 143516, -320728, 133591, 237755, -314575, 92760, -52120, 221650, 201, -139410, 199370, 20401, -143284, -95422, -305206, 185189, 8965, -118167, 162048, 234493, 131691, 152579, 167761, 187585, -15305, -143846, -37258, -245880, -78959, 277161, -132356, -5267, -86292, 409884, 28570, -167408, -1916, -344384, 43799, -17733, -34797, -261268, 133301, 366057, -396658, -198493, -124618, -334939, -146615, -237503, -275686, 4977, -329565, 234527, -130112, 78009, -190661, 50618, -219765, 136355, -184129, -174471, -4017, 111100, 84985, -17726, -356070, -128341, -78568, -72326, -238334]
9935b38334L9301j45373J10513d4482r7885A9621h5014B1694c39276a11856B17443
9923A46778C5633c07463j80016B73386G1662a6890B0152h6850b1839l1506A44620
9911A68774a01503k27514A62968A1173c9492A61066a65735j5865R117o0247A86413
9899A20378Q3189b49673A5420M2302a06975b408l58128B8070J06857a62480e4191
9887c24242j38798a18322L0089j19439A45350G2447C4703a8092A32466L12026
9877D44492b44909A94932f1500k06246O7674L6054L0141p3210A25124b49042H3519
9865d52282J45707H5554b82352J4283R5301A24742J11625b07952k45903f4560
9854b18339f2348A13396a53423k218M6923K508j92697K4123a34937k27906J79704
$$ y = [-238334, -199033, -344406, -233893, -44482, -142367, 19621, -85014, 21694, -339276, -111856, 217443, 146778, 35633, -307463, -487479, 273386, 71662, -16890, 20152, -86850, -21839, -53345, 144620, 168774, -101503, -329017, 162968, 11173, -39492, 161066, -165735, -181600, -172483, -232730, 186413, 120378, 203567, -249673, 15420, 57722, -106975, -2408, -360536, 28070, 134927, -162480, -54191, -324242, -463040, -118322, -88233, -207672, 145350, 72447, 34703, -18092, 132466, 444492, -244909, 194932, -61500, -267746, -200072, -164018, -133877, -207087, 125124, -249042, 83519, -452282, -306575, 85554, -282352, -268069, -172768, 124742, 236367, -207952, -453855, -64560, -218339, -62348, 113396, -153423, -155641, -108718, -106210, -298907, -274784, -134937, -362843, -183139]
9843a83139c808A07635a06563k10448a40778E5598L08298c52629A57208a42385
9832F3212a0499j96018D5126a02506j25438C8032J03152b70176a16160r8047i9131
9820b9291A9974J6590a06170l67910g3659B38730G5567K7107D5878b53127i71
9808c4993H5824a32794k21562g8695j13596a2243p8364E9773d38252a53658P6144
9797g7514l5240E2122e21787J62146c7986h865j86422f4185j45552i5719r6467
9786a92186E5405f7132j24815c4709A30545a97423i5147j58759a9212G827a51716
9774a4721B3988c85333a14279r5156k14646d5284p8951o9208f573j38213k66063
9763d10849F3583P8526a4364o8130B5503A453J00193J03418E0157m536a53938
$$ y = [-183139, -3808, 107635, -106563, -317011, -140778, 55598, 363896, -352629, 157208, -142385, 63212, -10499, -206517, 45126, -102506, -227944, 38032, 141184, -270176, -116160, -214207, -99131, -29291, 19974, 36564, -106170, -474080, -73659, 238730, 75567, 102674, 45878, -253127, -971, -34993, 85824, -132794, -354356, -78695, -192291, -12243, -90607, 59773, -438252, -153658, -77514, -112754, 52122, -521787, -359641, -37986, -8865, -195287, -64185, -209737, -95719, -192186, 55405, -67132, -191947, -34709, 130545, -197423, -95147, -253906, -19212, 7827, -151716, -14721, 23988, -385333, -114279, -209435, -424081, -45284, -124235, -193443, -6573, -144786, -410849, 63583, 142109, -14364, -82494, 25503, 1453, 101646, 205064, 50157, 45621, -153938]
9751I0235g2351j68697C4204c19619H3611b21950A23083a78367d0820l816B12445
9739B21445g9450j44169f7577A39656R1346c19751f472F8250a04985A49791i7175
9727a01083o0154B66975b86799A61000b00258b7437j49641C9046J27161j4542
9717A51665F0252b0529k00297I8900a27289l7764A26943b51548b6519l60492B8758
9705A39371b78721h2271D4789M8910M4960a12339e2433K031J0323l7009A15100
9693a36595a8643j42048D4031a00398j66342N3032b9377E4004b73124f37H0515
9681c3986o6818k37650a42791L3483o7253b0282j75292j72517N6945d2503F3639
9669G5813b60237A02317m9048i1480A28037a96230g1823m57395a10678j16709
$$ y = [90235, -72351, -241048, 34204, -319619, 83611, -221950, 123083, -178367, -40820, -44636, 212445, 221445, -79450, -223619, -67577, 139656, 231002, -319751, -6472, 68250, -104985, 149791, -97175, -101083, -161237, 266975, -286799, 161000, -200258, -27437, -177078, 39046, 166207, 151665, 60252, -20529, -220826, 98900, -127289, -165053, 126943, -251548, -26519, -387011, 28758, 139371, -278721, -82271, 44789, 93699, 138659, -112339, -52433, -50402, -40079, -77088, 115100, -136595, -18643, -160691, 44031, -100398, -266740, -213708, -29377, 54004, -273124, -637, 80515, -33986, -100804, -338454, -142791, -109308, -176561, -20282, -195574, -368091, -311146, -42503, 63639, 75813, -260237, 102317, 53269, -91480, 128037, -196230, -71823, -529218, -110678, -227387]
9659b27387g2692m1729a1632k98181G9488l2937c9676j15299D5301a87517B8800
9647C12780n9442j18218L0656a57470l8506K3483J130a5452k50538J12335A38087
9635b0606j4773k160I7211K21811B5832i424j90191N7975L9461A96327b65741
9623b19580a7519r429p4319c6010j08811d4479R836p8594j24780f862p8165b979
9610I905N855F492J34836J65080i7468d8621j81541l9215a03027c9123A14139
9598b94896C8650R8298a74898N6157C8009b17943C08937a05498B58111a03637
9587b98155B66345K4571H7745a10179A02109R3020d50808g0843j92272e2368a346
9575a20922B56805c4066j69297e1928I1711a19161n084k44936A14301a0126m40870
$$ y = [-227387, -72692, -114421, -11632, -309813, 79488, 46551, -39676, -154975, 45301, -187517, 28800, 312780, 253338, 135120, 165776, -157470, -195976, -172493, -171363, -15452, -265990, -153655, 138087, -20606, -35379, -37539, 97211, 319022, 25832, -9424, -199615, -141640, -102179, 196327, -265741, -219580, -17519, -26948, -101267, -36010, -144821, -44479, -34643, -113237, -238017, -6862, -85027, -2979, 9905, 15760, 6492, 141328, 306408, -97468, -48621, -230162, -269377, -103027, -39123, 114139, -294896, 38650, 136948, -174898, -118741, 38009, -217943, 308937, -105498, 258111, -103637, -298155, 266345, 290916, 87745, -110179, 102109, 195129, -450808, -70843, -263115, -52368, -1346, -120922, 256805, -34066, -203363, -51928, 91711, -119161, -124245, -369181, 114301, -10126, -450996]
9564d50996c8169G2646b8257n054L335r4662A00542a42258K383J9776L4955F8284
9551E8042a69230H2607a25299k00723a1532m4011j94085e3895l08360a6214G1660
9539b59771j41124a65662E3733K02351a55649A67287k948d63072E4650c47291
9528b29821J5818a01043H0450F39b38536H8026a85384B10729b53774J10970l2382
9517a75186N3294C03175H6168J36362a88842B79439a55460O4566o2606G5391a28244
9505d03676J98616M2373r3824I7224J4982b01989r6343b5499B3963n941d4803
9493a80678G838c3589n5852k82732J35498G908b32323g792k06380g8886o5967
9482a44853d0218E335N732L5436c8653j0493J4581D1569J10371a97815j37986
$$ y = [-450996, -38169, 72646, -28257, -33311, -29976, -124638, 100542, -142258, -139875, -120099, -85144, 68284, 58042, -169230, 82607, -125299, -326022, -11532, -55543, -249628, -53895, -362255, -16214, 71660, -259771, -400895, -165662, 53733, 256084, -155649, 167287, 164339, -463072, 54650, -347291, -229821, -214003, -101043, 80450, 639, -238536, 88026, -185384, 210729, -253774, -142804, -175186, -121892, 303175, 86168, 222530, -188842, 279439, -155460, -90894, -153500, 75391, -128244, -403676, -205060, -162687, -256511, 97224, 112206, -201989, -298332, -25499, 23963, 18022, -44803, -180678, 7838, -33589, -89441, -372173, -236675, 7908, -232323, -7792, -214172, -78886, -144853, -40218, 5335, 11067, 46503, -38653, -49146, -34565, 41569, 151940, -197815, -335801]
9471c35801a27984m5898L5353a4916A03362a66902a3781A59341a46908I8546d5210
9459B15064L1046A02028a70920J5811k15799g1382A20891C5315i2576j0838o2592
9448a66006G1999c65506d8599j71513N3262j9659G5965b80706K2190G9408b44931
9436B98075b91857A4380d19450F623c33203A00539a30896B59766b48686N6643
9426a92043N458J2151j33875R1065B15077b04010B24153k2546C4307L8617i0341
9414h3600A78663a26568e0297n8553k5065e4834l6553j13355i7144A07534K2245
9403A29779a71281C33821A13267E713i8766B10488r4352d84755H7084h0456j68167
9392b48623B5436a61277f825l01672h952B24309a21760A93551b23744A03246e0749
$$ y = [-335801, -127984, -173882, -138529, -14916, 103362, -166902, -13781, 159341, -146908, 98546, -45210, 215064, 246110, 102028, -170920, -155109, -370908, -71382, 120891, 35315, -92576, -103414, -166006, 71999, -365506, -48599, -220112, -166850, -186509, 75965, -280706, -258516, 79408, -244931, 298075, -291857, 14380, -419450, 6623, -333203, 100539, -130896, 259766, -248686, -192043, -186585, -174434, -308309, -217244, 215077, -204010, 224153, 201607, 34307, 72924, -90341, -83600, 178663, -126568, -50297, -108850, -133915, -54834, -91387, -204742, -97144, 107534, 129779, -171281, 333821, 113267, 5713, -98766, 210488, 116136, -484755, 87084, -80456, -248623, 25436, -161277, -6825, -308497, -8952, 224309, -121760, 193551, -223744, 103246, -50749]
9380b87695G3929I507a6716C28987b30347b2075B53300g6683A43828h6300K1255
9369f5045n3851a8806q4163j51718h6130c7554m10631A85136e8927o961j4325
9358h0213H4434c32669A0534c10183A9495e8146D5939b55258p957c1924l67087
9347c99011A33522A2236a36525D2671q158j2558a34883k37304B5271a97574B49789
9335c08817A30811A2401P277L62704a71576p9624c6180m2412c4345D6380c2657
9323A44804c21038b4790k48093e2906K2739G8399a46994B84939b53905F1974F033
9311c99579G9482a94578C5119a33351b0642j26230e0704l6923B08021B6011d979
9299A07799c36860f2262A81788b63478A06658K8947f0721B22385b81383R7783
$$ y = [-287695, 73929, 9507, -16716, 328987, -230347, -22075, 253300, -76683, 143828, -86300, -65045, -118896, -18806, -102969, -254687, -86130, -37554, -448185, 185136, -58927, -65888, -80213, 84434, -332669, 10534, -310183, 19495, -58146, 45939, -255258, -263215, -31924, -399011, 133522, 12236, -136525, 42671, 34513, 21955, -134883, -372187, 25271, -197574, 249789, -308817, 130811, 12401, 19678, 382382, -171576, -251200, -36180, -78592, -34345, 46380, -32657, 144804, -321038, -24790, -272883, -52906, -30167, 78399, -146994, 284939, -253905, 61974, 6033, -399579, 79482, -194578, 35119, -133351, -20642, -146872, -50704, -87627, 208021, 26011, -4979, 107799, -336860, -62262, 181788, -263478, 106658, 135605, -60721, 222385, -281383, -183600]
9289a83600c078B63856c113j753j57783j08513R1427h0781j37244d0304j10727
9278a51031F2488J7983a06099b7319n1017k41H1530a2980A99225Q421b73351G7866
9265A3137J80762h9360B80295c787E583g6681B8872a08199k11908C3503e9761
9253A05249J52731b43245c1405p1114k6897p5761k837A90304a00824j74337g6193
9241b22626I345b94352a02274A36566a04583C36509b37531e9531R546h513B5893
9229a19084H8523a9810C9100a08230A0015b78530a22559B4234a66534A25021g9453
9217e3210A08589f1695l2568q4731L5678J0078c3314B13982b54247O9218G2558
9205A131a09405D6988N6616B5682K22539g2921C9767J32425m4411f2635B0735
$$ y = [-183600, -3078, 263856, -3113, -4866, -162649, -271162, -179735, -80781, -218025, -40304, -151031, 62488, 80471, -106099, -27319, -78336, -78577, 81530, -12980, 199225, 207646, -273351, 77866, 13137, 193899, -89360, 280295, -3787, 5583, -76681, 28872, -108199, -320107, 33503, -59761, 105249, 257980, -243245, -31405, -102519, -129416, -205177, -208014, 190304, -100824, -275161, -76193, -222626, 9345, -294352, -102274, 136566, -104583, 336509, -237531, -59531, -49985, -8513, 25893, -119084, 88523, -19810, 39100, -108230, 10015, -278530, -122559, 24234, -166534, 125021, -79453, -53210, 108589, -61695, -94263, -178994, -143316, -133238, -33314, 213982, -254247, -185029, 72558, 1131, -109405, 46988, 103604, 25682, 248221, -72921, 39767, 172192, 127781, -62635, 20735]
9193A14712b7899a1227n81516K81972i2483A13062a98925G3771a36890j61053
9183b97943h3765C77188E1145F793i49m8650a0549m70155A24299B7070N845Q6700
9171A19615a763j34805C0261b5529I6719a95120A04793d9349I2591a24134N987
9160a18147l00301J17949a37406k9851b0067A16964b86875L6800e0591j31487
9150a82078A71818O9453b64575J22773l64349f099n4270h865l16083f4017a0391
9138f2875k00603B57359k0246B1636c33864A18494b72940e2753B65867A15544
9127b21073A19783b80461A7977c89238d4461D0722k0186c01029m3071M863A7923
9115I8287d0871J3814B75896a83218O1711K6056l5779l8624H0819B3586a95909
$$ y = [114712, -27899, -11227, -592743, -310771, -92483, 113062, -198925, 73771, -136890, -297943, -83765, 377188, 51145, 6793, -949, -49599, -10549, -480704, 124299, 27070, 32915, 119615, -1763, -136568, 30261, -25529, 96719, -195120, 104793, -49349, 92591, -124134, -118147, -418448, -300499, -137406, -167257, -20067, 116964, -286875, -250075, -50591, -182078, 171818, 241271, -264575, -141802, -506151, -6099, -60369, -8865, -324948, -64017, -10391, -62875, -263478, 257359, 237113, 21636, -333864, 118494, -272940, -52753, 265867, 115544, -221073, 119783, -280461, 17977, -389238, -44461, 40722, 20536, -301029, -344100, -339237, 17923, 98287, -40871, -27057, 275896, -183218, -121507, -95451, -131230, -169854, 80819, 23586, -195909]
9103c07424E1570g5358m1182B44925H5670b11794f6742K0128j0906B28907j8534
9092B10373l4270b4136K620j86203B26097c40413e3967B3700b5768q9027A08989
9080i7484j6976k2402b1823B99865A6069K80102j27539a01278B28156m304E9688
9068C9072b44459a0144j44458O9037B70306b52028c7420l62102B55438d486j69847
9057a74333f7951I8780f4153l9850l5015j20998K8439A01070b72347A58735p2772
9046H5963l1930N2127b41088A40726d6090q4886N4604j84643R8084B36467j00697
9035A35770l9184e8674j85182N2409k54743K01769g6718j7531j00110l4456A226
9023I0836L7473o3969J46553f1397l79296J86686A49598K0901a07916j51865j60801
$$ y = [-307424, 51570, -75358, -116540, 244925, 85670, -211794, -66742, -46614, -57520, 228907, 210373, 176103, -24136, -21516, -207719, 226097, -340413, -53967, 23700, -25768, -114795, 108989, -97484, -114460, -136862, -21823, 299865, 16069, 296171, 168632, -101278, 228156, 223852, 59688, 39072, -244459, -10144, -154602, -85565, 270306, -252028, -37420, -399522, 255438, -4486, -174333, -67951, 98780, -64153, -104003, -139018, -260016, -231577, 101070, -272347, 158735, 85963, 54033, 106160, -241088, 140726, -46090, -130976, -76372, -261015, -162931, 236467, 135770, 96586, -58674, -243856, -191447, -446190, -244421, -76718, -94249, -194359, -228815, 1226, 90836, 128309, 64340, 210893, -61397, -440693, -254007, 149598, 170499, -107916, -259781, -420582]
9012d20582C0550K26532g4623L1695C9775M722J82614E0219D297a40972B13949
9000b53034A78086b88999G797J08828E2696b9865j36605K4088G6714a20125B6886
8988c2139B7493b1814A02344f4447A44141B4755L46385a39762r9645F2150a01950
8976d98843H5107b73160a0038k25296B14142i845A74040i1740c1954n7785M3618
8965d6121m60D6850f6578j56134H7700B5803K92838A38648A5873P2719c4684A07527
8952b75151c701n8623m6571K4436k77697J46014b5210n5692L6465n9028H5653
8940a95763M6865F6639i9889A09948a44582C96287A76452f1302D1812e7847m9804
8929a07651A40756K07246r7052P2912N31591J790704L832205P431043m531070
$$ y = [-420582, 30550, 257082, -74623, -42928, 39775, 44497, 227111, 50219, 4297, -140972, 213949, -253034, 178086, -288999, 7797, 116625, 52696, -29865, -166470, -142382, 76714, -120125, 26886, -32139, 27493, -21814, 102344, -64447, 144141, 24755, 371140, -139762, -239407, 62150, -101950, -498843, 85107, -273160, -10038, -235334, 214142, -9845, 174040, -91740, -31954, -89739, -46121, -46581, 46850, -66578, -222712, 87700, 25803, 318641, 138648, 15873, 88592, -34684, 107527, -275151, -3701, -62324, -108895, -84459, -362156, -216142, -25210, -80902, -44437, -103465, 85653, -195763, -148898, 66639, -99889, 109948, -144582, 396287, 176452, -61302, 41812, -57847, -107651, 140756, 348002, 250950, 323862, 855453, 2646157, 6478362, 13909405, 9378335]
8920I378335B887492A108847E39146k47374K01148a16625k78936J93187p7120
8911b79494I6421g9725A77702J18181n1980h1255j8481b6922A31929f2899j78503
8900b41402K5929A7862h0601I993a01238A58437M023d2481A11863d29892K09721
8889b20171B18240K55225c3281C9911a21758k8854I3509a41440F254c07318h7456
8877C09924c76881J53157c2173B3845g2935A27561f0987B23672A8443a18492b6201
8865a19409j90174C5342a11596N1197A8806O2224p84a49404A95314g9305A70346
$$ y = [9378335, 2887492, 1108847, 539146, 291772, 492920, -116625, -395561, -202374, -279494, 96421, -79725, 177702, 295883, 243903, -81255, -99736, -26922, 131929, -62899, -241402, -215473, 17862, -80601, 9993, -101238, 158437, 162460, -42481, 111863, -429892, -220171, 218240, 473465, -33281, 39911, -121758, -150612, 93509, -141440, 6254, -307318, -87456, 309924, -376881, -223724, -32173, 23845, -72935, 127561, -60987, 223672, 18443, -118492, -26201, -119409, -309583, 35342, -111596, -60399, 18806, 81030, 80246, -149404, 195314, -79305, 170346]
$$ [...]
##END NTUPLES=NMR SPECTRUM
##END=
