##TITLE=AC1575_ROEFFECT0023_8271393_3lKNu8uw1t
##JCAMPDX= 6.0         $$ Bruker NMR JCAMP-DX V2.0
##DATA TYPE= NMR SPECTRUM
##DATA CLASS= NTUPLES
##ORIGIN= BRUKER
##OWNER= Administrator
$$ 1.72 TOPSPIN		Version 2.1
$$ 2013-10-18 20:41:29.935 -0700  Administrator@X
$$ Compression mode = diff/dup
##.OBSERVE FREQUENCY= 400.02188249412
##.OBSERVE NUCLEUS= ^1H
##.ACQUISITION MODE= SIMULTANEOUS (DQD)
##.ACQUISITION SCHEME= undefined
##.AVERAGES= 64
##.DIGITISER RES= 22
##SPECTROMETER/DATA SYSTEM= spect
##.PULSE SEQUENCE= noesygpps1d.comp
##.SOLVENT NAME= COFFEE_meoh
##.SHIFT REFERENCE= INTERNAL, COFFEE_meoh, 1, 14.96072
##AUDIT TRAIL= $$ (NUMBER, WHEN, WHO, WHERE, PROCESS, VERSION, WHAT)
$$ ##TITLE= Audit trail, TOPSPIN		Version 2.1
$$ ##JCAMPDX= 5.01
$$ ##ORIGIN= Bruker BioSpin GmbH
$$ ##OWNER= Administrator
$$ $$ E:\/data/COFFEE/nmr/AC1575_ROEFFECT0023_8271393_3lKNu8uw1t/12/pdata/1/auditp.txt
$$ ##AUDIT TRAIL=  $$ (NUMBER, WHEN, WHO, WHERE, PROCESS, VERSION, WHAT)
(   1,<2013-10-18 20:41:24.794 -0700>,<Administrator>,<X>,<go>,<TOPSPIN 2.1>,
      <created by zg
	started at 2013-10-18 20:29:53.982 -0700,
	POWCHK enabled, PULCHK disabled,
       configuration hash MD5:
       C8 4E 4E 5D D3 5C D8 9E 9F 52 82 E0 59 8A DE 15
       data hash MD5: 64K
       B4 9A AA 18 BA 5A 08 FA 9E 07 E7 8C 4B A3 78 AB>)
(   2,<2013-10-18 20:41:27.857 -0700>,<Administrator>,<X>,<proc1d>,<TOPSPIN 2.1>,
      <Start of raw data processing
       efp LB = 0.3 FT_mod = 6 PKNL = 1 PHC0 = 0 PHC1 = 0 SI = 128K 
       data hash MD5: 128K
       2B CA D6 F2 5F 86 EE 8E 5E 0E 07 DA BD 4C 63 34>)
(   3,<2013-10-18 20:41:28.826 -0700>,<Administrator>,<X>,<proc1d>,<TOPSPIN 2.1>,
      <pk PHC0 = -84.60571 PHC1 = 0 
       data hash MD5: 128K
       46 14 A1 D3 AE EE 54 93 B3 B2 EF 18 DE B3 A2 79>)
(   4,<2013-10-18 20:41:29.310 -0700>,<Administrator>,<X>,<proc1d>,<TOPSPIN 2.1>,
      <abs ABSG = 1 
       data hash MD5: 128K
       05 F4 FA E8 D3 7C 9A 89 86 FE E5 6E FE 43 70 82>)
(   5,<2013-10-18 20:41:29.419 -0700>,<Administrator>,<X>,<proc1d>,<TOPSPIN 2.1>,
      <abs ABSG = 2 
       data hash MD5: 128K
       0E 4F 86 2C E3 1B A7 9D 6B 1A 58 E1 50 6A A1 81>)
(   6,<2013-10-18 20:41:29.560 -0700>,<Administrator>,<X>,<proc1d>,<TOPSPIN 2.1>,
      <abs ABSG = 3 
       data hash MD5: 128K
       4A C2 DC 9F 09 82 C4 25 B8 A2 14 D8 73 C5 FB 46>)
(   7,<2013-10-18 20:41:29.638 -0700>,<Administrator>,<X>,<proc1d>,<TOPSPIN 2.1>,
      <abs ABSG = 4 
       data hash MD5: 128K
       CC D1 1D 1F 3B A1 B4 89 08 E4 AD 03 86 19 BC D2>)
(   8,<2013-10-18 20:41:29.747 -0700>,<Administrator>,<X>,<proc1d>,<TOPSPIN 2.1>,
      <abs ABSG = 5 
       data hash MD5: 128K
       B3 FA 23 8D D7 6A B5 46 76 3E 5D 1D 6A E0 AB 7D>)
$$ ##END=
$$ 
$$ $$ hash MD5
$$ $$ 75 CE BC 4F B5 8A 33 66 1D 4A E6 9E 01 2A CF 69
##$RELAX= 
##$RELAX= 
##$RELAX= 
##$RELAX= 
##$RELAX= 
##$RELAX= 
##$RELAX= 
##$RELAX= 
$$ Bruker specific parameters
$$ --------------------------
##$DU= <E:\>
##$EXPNO= 12
$$ [...]
##$TP07= 0
##$TPNAME0= <>
##$TPNAME1= <>
##$TPNAME2= <>
##$TPNAME3= <>
##$TPNAME4= <>
##$TPNAME5= <>
##$TPNAME6= <>
##$TPNAME7= <>
##$TPOAL= (0..7)
0.5 0.5 0.5 0.5 0.5 0.5 0.5 0.5
##$TPOFFS= (0..7)
0 0 0 0 0 0 0 0
##$TUNHIN= 0
##$TUNHOUT= 0
##$TUNXOUT= 0
##$USERA1= <user>
##$USERA2= <user>
##$USERA3= <user>
##$USERA4= <user>
##$USERA5= <user>
##$V9= 5
##$VALIST= <valist>
##$VCLIST= <CCCCCCCCCCCCCCC>
##$VD= 0
##$VDLIST= <DDDDDDDDDDDDDDD>
##$VPLIST= <PPPPPPPPPPPPPPP>
##$VTLIST= <TTTTTTTTTTTTTTT>
##$WBST= 1024
##$WBSW= 4
##$XGAIN= (0..3)
0 0 0 0
##$XL= 0
##$YL= 0
##$YMAX_a= 6237169
##$YMIN_a= -11963441
##$ZGOPTNS= <>
##$ZL1= 120
##$ZL2= 120
##$ZL3= 120
##$ZL4= 120
##$ABSF1= 14.96072
##$ABSF2= -5.597462
##$ABSG= 5
##$ABSL= 3
##$ALPHA= 0
##$AQORDER= 0
##$ASSFAC= 0
##$ASSFACI= 0
##$ASSFACX= 0
##$ASSWID= 0
##$AUNMP= <proc_prof1d_extract.lims>
##$AXLEFT= 0
##$AXNAME= <>
##$AXNUC= <1H>
##$AXRIGHT= 0
##$AXTYPE= 0
##$AXUNIT= <>
##$AZFE= 0.1
##$AZFW= 0.1
##$BCFW= 0
##$BC_mod= 0
##$BYTORDP= 0
##$COROFFS= 0
##$CY= 15
##$DATMOD= 1
##$DC= 0
##$DFILT= <>
##$DTYPP= 0
##$F1P= 0
##$F2P= 0
##$FCOR= 0.5
##$FTSIZE= 131072
##$FT_mod= 6
##$GAMMA= 0
##$GB= 0
##$INTBC= 1
##$INTSCL= 1
##$ISEN= 128
##$LB= 0.3
##$LEV0= 0
##$LPBIN= 0
##$MAXI= 10000
##$MC2= 0
##$MEAN= 0
##$ME_mod= 0
##$MI= 0
##$NCOEF= 0
##$NC_proc= -2
##$NLEV= 6
##$NOISF1= 0
##$NOISF2= 0
##$NSP= 0
##$NTH_PI= 0
##$NZP= 0
##$OFFSET= 14.96072
##$PC= 1
##$PHC0= -84.60571
##$PHC1= 0
##$PH_mod= 1
##$PKNL= yes
##$PPARMOD= 0
##$PPDIAG= 0
##$PPIPTYP= 0
##$PPMPNUM= 2147483647
##$PPRESOL= 1
##$PSCAL= 4
##$PSIGN= 0
##$PYNMP= <proc.py>
##$REVERSE= no
##$SF= 400.020009747512
##$SI= 131072
##$SIGF1= 0
##$SIGF2= 0
##$SINO= 400
##$SIOLD= 131072
##$SPECTYP= <>
##$SREGLST= <1H.CDCl3>
##$SSB= 0
##$STSI= 131072
##$STSR= 0
##$SW_p= 8223.68421052631
##$SYMM= 0
##$S_DEV= 0
##$TDeff= 65536
##$TDoff= 0
##$TI= <>
##$TILT= no
##$TM1= 0
##$TM2= 0
##$TOPLEV= 0
##$USERP1= <user>
##$USERP2= <user>
##$USERP3= <user>
##$USERP4= <user>
##$USERP5= <user>
##$WDW= 1
##$XDIM= 131072
##$YMAX_p= 395562903
##$YMIN_p= -11855
##$CURPLOT= <Network HP LaserJet P1505>
##$CURPRIN= <$Network HP LaserJet P1505>
##$DFORMAT= <normdp>
##$LAYOUT= <+/1D_H.xwp>
##$LFORMAT= <normlp>
##$PFORMAT= <normpl>
##$SURQMSG= 1
$$ End of Bruker specific parameters
$$ ---------------------------------
##NTUPLES= NMR SPECTRUM
##VAR_NAME=  FREQUENCY,     SPECTRUM/REAL,   SPECTRUM/IMAG
##SYMBOL=    X,             R,               I
##VAR_TYPE=  INDEPENDENT,   DEPENDENT,       DEPENDENT
##VAR_FORM=  AFFN,          ASDF,            ASDF
##VAR_DIM=   131072,        131072,          131072
##UNITS=     HZ,            ARBITRARY UNITS, ARBITRARY UNITS
##FACTOR=    0.0627417313425164, 1,          1
##FIRST=     8223.62146879497, 5559,         -61482
##LAST=      0,             7306,            -60439
##MIN=       0,             -11855,          0
##MAX=       8223.62146879497, 395562903,    0
$$ Real data points
##PAGE= N=1
##DATA TABLE= (X++(R..R)), XYDATA
$$ [...]
$$ plain form
63927 5076519 5070310 5028873 4952520 4842223 4700140 4529674 4335281 4121992 3894788 3658446
63917 3658446 3417952 3178452 2944271 2718155 2501920 2297569 2107261 1932386 1773431
63908 1773431 1630876 1505487 1397248 1304363 1223814 1153006 1090788 1037086 991761 953810 921501
63897 921501 893261 868256 846046 825873 806667 787840 769639 752510 736342 720558 704725
63886 704725 688764 672758 657029 642406 630008 620504 613752 609299 607037 607195 609867 614830 621803
63873 621803 630672 641411 653950 668194 684054 701422 720133 739883 760069 779814 798468 816078
63861 816078 833094 849456 864271 876601 886320 893980 900053 904585 907329 907791 905302 899514 890813
63848 890813 879838 866632 850783 832383 812261 791080 768747 745024 720210 694810 668935
$$ packed form
63927E076519o209m1437p6353j10297j42083j70466j94393k13289k27204k36342
63917C658446k40494k39500k34181k26116k16235k04351j90308j74875j58955
63908A773431j42555j25389j08239r2885q0549p0808o2218n3702m5325l7951l2309
63897I21501k8240k5005k2210k0173j9206j8827j8201j7129j6168j5784j5833
63886G04725j5961j6006j5729j4623j2398r504o752m453k262J58K672M963O973
63873F21803Q869J0739J2539J4244J5860J7368J8711J9750K0186J9745J8654J7610
63861H16078J7016J6362J4815J2330R719P660O073M532K744M62k489n788q701
63848H90813j0975j3206j5849j8400k0122k1181k2333k3723k4814k5400k5875
$$ plain form
63837 668935 642570 616118 590115 564554 539105 513998 490138 468237 448238 429719 412481
63826 412481 396535 381844 368365 356151 345200 335281 326112 317585 309683 302259 295038 287837 280706
63813 280706 273905 267752 262411 257767 253574 249808 246808 245032 244630 245236 246067 246253 245288 243343 241108
63798 241108 239215 237787 236569 235366 234128 232659 230536 227582 224344 221775 220354 219639 218798 217445 215852
63783 215852 214471 213529 213026 212917 213140 213514 213742 213551 212950 212293 211941 211802 211408 210566 209682 209219 209087 208918
63765 208918 208674 208569 208571 208533 208701 209440 210383 210588 209763 208687 208110 207885 207664 207747 208493 209372 209492 208871 208403 208647
63745 208647 209431 210641 212560 215144 217628 219263 220041 220431 220794 221382 222509 224316 226550 228891 231365
63730 231365 234160 237205 240194 242974 245676 248475 251408 254426 257552 260915 264627 268539 272181 275059
$$ packed form
63837F68935k6365k6452k6003k5561k5449k5107k3860k1901j9999j8519j7238
63826D12481j5946j4691j3479j2214j0951r919r169q527p902p424p221p201p131
63813B80706o801o153n341m644m193l766l000j776m02O06Q31J86r65j945k235
63798B41108j893j428j218j203j238j469k123k954l238k569j421p15q41j353j593
63783B15852j381r42n03j09K23L74K28j91o01o57l52j39l94q42q84m63j32j69
63765B08918k44j05Kl8J68P39R43K05q25j076n77k25k21Q3P46Q79J20o21m68K44
63745B08647P84J210J919K584K484J635P78L90L63N88J127J807K234K341K474
63730B31365K795L045K989K780K702K799K933L018L126L363L712L912L642K878
$$ plain form
63716 275059 277069 278526 279793 280911 281544 281178 279538 276995 274420 272422 270828 269155 267444 266187 265536
63701 265536 265069 264511 264218 264724 266133 268160 270475 272773 274836 276836 279333 282700 286721 290954 295213
63686 295213 299310 302574 304236 304377 304105 304546 305826 307164 307780 307541 306850 306186 305853 305961 306411 306904 307158
63669 307158 307248 307550 308267 309137 309732 309858 309495 308600 307283 305942 304768 303213 300434 296277 291415 286490
63653 286490 281650 276990 272835 269313 266195 263465 261548 260567 259879 258903 258005 257998 258984 260384 261917 263895
63637 263895 266538 269637 273044 276934 281361 285963 290402 294847 299830 305763 312711 320433 328507 336588
63623 336588 344649 352909 361639 371203 382188 395111 409939 426182 443548 462207 482387 504070
63611 504070 527277 552291 579301 608006 637807 668187 698612 728147 755516 779528 799265
$$ packed form
63716B75059K010J457J267J118O33l66j640k543k575j998j594j673j711j257o51
63701B65536m67n58k93N06J409K027K315K298K063K000K497L367M021M233M259
63686B95213M097L264J662J41k72M41J280J338O16k39o91o64l33J08M50M93K54
63669C07158R0L02P17Q70N95J26l63q95j317j341j174j555k779m157m862m925
63653B86490m840m660m155l522l118k730j917r81o88r76q98pR86J400J533J978
63637B63895K643L099L407L890M427M602M439M445M983N933O948P722Q074Q081
63623C36588Q061Q260Q730R564J0985J2923J4828J6243J7366J8659K0180K1683
63611E04070K3207K5014K7010K8705K9801L0380L0425K9535K7369K4012J9737
$$ plain form
63600 799265 813969 823119 826866 826219 822561 816908 809620 800723 790331 778773 766416 753415 739528
63587 739528 724079 706287 685925 663695 640768 617926 595353 573195 551968 532213 514134
63576 514134 497879 483880 472486 463454 456261 450851 447597 446566 447311 449516 453279 458604 465078 472389
63562 472389 480782 490552 501356 512442 523485 534873 547239 561004 576315 593109 611267 630924
63550 630924 652677 677262 705035 735870 769381 804943 841461 877322 910573 938998 960370
63539 960370 973230 977709 975351 968016 957126 943871 929616 915607 902365 889562 876398 861986
63527 861986 845639 827093 806423 783569 758062 729513 698348 665836 633419 602103 572373
63516 572373 544331 517882 493041 470153 449662 431615 415601 401226 388448 377382 368005 360169
$$ packed form
63600G99265J4704R150L747o47l658n653p288q897j0392j1558j2357j3001j3887
63587G39528j5449j7792k0362k2230k2927k2842k2573k2158k1227j9755j8079
63576E14134j6255j3999j1394r032p193n410l254j031P45K205L763N325O474P311
63562D72389Q393R770J0804J1086J1043J1388J2366J3765J5311J6794J8158J9657
63550F30924K1753K4585K7773L0835L3511L5562L6518L5861L3251K8425K1372
63539I60370J2860M479k358p335j0890j3255j4255j4009j3242j2803j3164j4412
63527H61986j6347j8546k0670k2854k5507k8549l1165l2512l2417l1316k9730
63516E72373k8042k6449k4841k2888k0491j8047j6014j4375j2778j1066r377p836
$$ plain form
63504 360169 353658 348135 343217 338788 334973 331673 328402 324920 321750 319662 318732 318308 317902 317673 317949
63489 317949 318616 319192 319260 318713 317779 316967 316840 317668 319413 321982 325252 328769 331828 334097 335931 337839
63473 337839 339818 341507 342763 343680 344137 343687 342026 339340 336127 332815 329577 326327 322921 319533 316829
63458 316829 315507 315627 316575 317731 318954 320389 322172 324541 327926 332539 337976 343616 349426 356073 364146
63443 364146 373590 384098 395800 409183 424392 441015 458693 477631 498276 520714 544652 569810
63431 569810 595828 621618 645260 665033 680645 693305 704620 715575 726565 738050 750910
63420 750910 766165 784583 806578 832302 861530 893461 926810 960188 992285 1021611 1046340
63409 1046340 1064753 1075960 1080151 1078235 1071380 1060814 1047725 1033186 1018078 1002878 987265 970106
$$ packed form
63504C60169o511n523m918m429l815l300l271l482l170k088r30m24m06k29K76
63489C17949O67N76O8n47r34q12j27Q28J745K569L270L517L059K269J834J908
63473C37839J979J689J256R17M57m50j661k686l213l312l238l250l406l388k704
63458C16829j322J20R48J156J223J435J783K369L385M613N437N640N810O647Q073
63443C64146R444J0508J1702J3383J5209J6623J7678J8938K0645K2438K3938K5158
63431E69810K6018K5790K3642J9773J5612J2660J1315J0955J0990J1485J2860
63420G50910J5255J8418K1995K5724K9228L1931L3349L3378L2097K9326K4729
63409A046340J8413J1207M191j916o855j0566j3089j4539j5108j5200j5613j7159
$$ plain form
63397 970106 950274 927597 902721 876041 847219 815907 782502 747950 713246 679541 648248
63386 648248 620266 595170 571820 549948 530645 515097 503260 494051 486539 480609 476646 474951
63374 474951 475475 477918 482032 487871 495724 505773 517902 531902 547739 565483 585045 606169 628737
63361 628737 652937 679054 707188 737252 769119 802566 837064 871801 905998 938933 969559
63350 969559 996347 1017918 1033760 1044047 1048934 1048513 1043395 1034674 1023082 1008787 992339 975149
63338 975149 958229 940796 920940 897718 871924 844754 816475 786786 755995 725299 696046
63327 696046 669034 644423 622050 601871 584226 569736 558810 551150 545616 540590 534709 527454
63315 527454 518943 509101 497361 483458 468180 452813 437968 423496 409421 396290 384457 373678
$$ packed form
63397I70106j9832k2677k4876k6680k8822l1312l3405l4552l4704l3705l1293
63386F48248k7982k5096k3350k1872j9303j5548j1837r209p512n930l963j695
63374D74951N24K443M114N839P853J0049J2129J4000J5837J7744J9562K1124K2568
63361F28737K4200K6117K8134L0064L1867L3447L4498L4737L4197L2935L0626
63350I69559K6788K1571J5842J0287M887m21n118q721j1592j4295j6448j7190
63338I75149j6920j7433j9856k3222k5794k7170k8279k9689l0791l0696k9253
63327F96046k7012k4611k2373k0179j7645j4490j0926p660n534n026n881p255
63315E27454q511r842j1740j3903j5278j5367j4845j4472j4075j3131j1833j0779
$$ plain form
63303 373678 363746 355022 347985 342608 338514 335351 332663 329781 326323 322658 319494 317148 315463 314194
63289 314194 313051 311543 309265 306361 303439 301070 299557 298945 298864 298498 297230 295313 293546 292274 291154
63274 291154 289961 289156 289403 290751 292494 293716 293959 293612 293687 294922 297041 299116 300733 302377 304578 307186
63258 307186 309877 312940 316967 321966 327363 332867 338673 344726 350438 355552 360767 366942 374009 381325
63244 381325 389008 398167 409586 422728 436417 450150 464362 479690 496522 515148 535800 558293
63232 558293 581892 605778 629574 653399 677470 701736 725837 749374 772215 794521 816512
63221 816512 838383 860435 883007 906061 929033 951289 972469 992152 1009527 1023795 1034636
63210 1034636 1041783 1044367 1041401 1032860 1019617 1002232 980559 954835 926421 896980 867507 838609
$$ packed form
63303C73678r932q724p037n377m094l163k688k882l458l665l164k346j685j269
63289C14194j143j508k278k904k922k369j513o12q1l66j268j917j767j272j120
63274B91154j193q05K47J348J743J222K43l47P5J235K119K075J617J644K201K608
63258C07186K691L063M027M999N397N504N806O053N712N114N215O175P067P316
63244C81325P683R159J1419J3142J3689J3733J4212J5328J6832J8626K0652K2493
63232E58293K3599K3886K3796K3825K4071K4266K4101K3537K2841K2306K1991
63221H16512K1871K2052K2572K3054K2972K2256K1180J9683J7375J4268J0841
63210A034636P147K584k966q541j3243j7385k1673k5724k8414k9441k9473k8898
$$ plain form
63198 838609 811180 786106 763613 743552 726126 711753 700436 691895 686293 684113 685254 688808
63186 688808 693943 700560 708931 719187 731387 745723 762247 780501 799659 818945 837850 856069
63174 856069 873468 890030 905788 920809 935157 948694 960882 971007 978624 983634 985820 984511
63162 984511 978821 968156 952488 932316 908539 882217 854248 825179 795324 765012 734704 704958
63150 704958 676414 649791 625740 604508 585689 568478 552347 537464 524306 512940 502932
63139 502932 493975 486331 480472 476436 473682 471456 469224 466931 464974 463730 463069 462633 462679 464169 467648
63124 467648 472412 477342 482301 488012 494595 501016 506254 510460 514520 518818 522948 526493 529587 532574
63110 532574 535437 537813 539497 540764 542061 543509 544850 545895 546854 548134 549854 551663 552926 553094 552105
$$ packed form
63198H38609k7429k5074k2493k0061j7426j4373j1317q541n602k180J141L554
63186F88808N135O617Q371J0256J2200J4336J6524J8254J9158J9286J8905J8219
63174H56069J7399J6562J5758J5021J4348J3537J2188J0125P617N010K186j309
63162I84511n690j0665j5668k0172k3777k6322k7969k9069k9855l0312l0308k9746
63150G04958k8544k6623k4051k1232j8819j7211j6131j4883j3158j1366j0008
63139E02932q957p644n859m036k754k226k232k293j957j244o61m36M6J490L479
63124D67648M764M930M959N711O583O421N238M206M060M298M130L545L094K987
63110E32574K863K376J684J267J297J448J341J045R59J280J720J809J263J68r89
$$ plain form
63095 552105 550548 549274 548675 548468 548248 548007 547972 548218 548687 549328 549946 550203 550147 550534 552188 555162 558902 563058
63077 563058 567695 572901 578757 585598 593700 602711 611975 621459 631756 643108 655125 667674 681314
63064 681314 696477 712873 730233 749171 770713 795313 822835 853185 886387 922256 960596
63053 960596 1001666 1045963 1093531 1143886 1196576 1251368 1307903 1365600 1424019 1482893 1541702
63042 1541702 1599571 1655893 1710849 1765118 1819174 1873034 1926494 1979304 2030997 2080756 2127646
63031 2127646 2170895 2209677 2242525 2267258 2281899 2285667 2278826 2261565 2233454 2194208 2144710 2086975
63019 2086975 2023286 1955619 1885735 1815412 1746391 1680206 1618113 1561126 1510114 1465897 1429183
63008 1429183 1400348 1379325 1365733 1359016 1358511 1363565 1373729 1388736 1408203 1431454 1457715 1486310
$$ packed form
63095E52105j557j274n99k07k20k41l5K46M69O41O18K57n6L87J654K974L740M156
63077E63058M637N206N856O841Q102R011R264R484J0297J1352J2017J2549J3640
63064F81314J5163J6396J7360J8938K1542K4600K7522L0350L3202L5869L8340
63053I60596M1070M4297M7568N0355N2690N4792N6535N7697N8419N8874N8809
63042A541702N7869N6322N4956N4269N4056N3860N3460N2810N1693M9759M6890
63031B127646M3249L8782L2848K4733J4641L768o841j7261k8111l9246m9498n7735
63019B086975o3689o7667o9884p0323o9021o6185o2093n6987n1012m4217l6714
63008A429183k8835k1023j3592o717n05N054J0164J5007J9467K3251K6261K8595
$$ plain form
62996 1486310 1516562 1547677 1578892 1609787 1640321 1670568 1700382 1729255 1756556 1781933 1805303
62985 1805303 1826259 1843698 1856326 1863421 1864681 1859462 1846730 1825886 1797084 1760642 1716817 1666589
62973 1666589 1612108 1555713 1498672 1441199 1383415 1325919 1269792 1216535 1167672 1123806 1084170
62962 1084170 1047578 1013632 982587 954374 928452 904431 882076 860751 839739 819258 800295
62951 800295 783071 766400 749109 731500 714738 699234 684368 669598 655087 641176 627922
62940 627922 615447 604221 594498 585756 577155 568644 561213 555826 552319 549588 546799 544080 542006 540746
62926 540746 539940 539189 538332 537302 536021 534563 533278 532616 532825 533704 534621 534856 534070 532421 530207 527563
62910 527563 524521 521128 517317 512861 507733 502328 497125 492297 487885 484142 481305 479177 477343 475750
$$ packed form
62996A486310L0252L1115L1215L0895L0534L0247K9814K8873K7301K5377K3370
62985A805303K0956J7439J2628P095J260n219j2732k0844k8802l6442m3825n0228
62973A666589n4481n6395n7041n7473n7784n7496n6127n3257m8863m3866l9636
62962A084170l6592l3946l1045k8213k5922k4021k2355k1325k1012k0481j8963
62951H00295j7224j6671j7291j7609j6762j5504j4866j4770j4511j3911j3254
62940F27922j2475j1226r723q742q601q511p431n387l507k731k789k719k074j260
62926E40746q06p51q57j030j281j458j285o62K09Q79R17K35p86j649k214k644
62910E27563l042l393l811m456n128n405n203m828m412l743k837k128j834j593
$$ plain form
62896 475750 474726 474443 474780 475568 476546 477082 476537 475089 473748 473347 473824 474617 475310 475695 475684 475500 475623 476180
62878 476180 476690 476788 476898 477751 479357 480845 481269 480290 478188 475601 473241 471516 470347 469476 468926 468925 469444
62861 469444 470059 470314 470024 469271 468362 467779 467882 468526 469178 469567 470060 471189 472884 474402 475061 474881 474395 473888
62843 473888 473054 471436 469085 466543 464268 462278 460434 458843 457784 457348 457283 457199 456772 455818 454352 452658
62827 452658 451193 450328 450211 450880 452368 454553 456966 459058 460830 463022 466391 470865 475685 480304 484739
62812 484739 488983 492692 495845 499245 503734 509138 514627 519993 525898 532845 540629 549040 558370 568830
62798 568830 580016 591493 603511 616603 630809 645972 662587 681708 703976 729237 757227
62787 757227 788138 822476 860805 903801 952115 1005912 1064827 1128623 1197666 1272441 1352724
$$ packed form
62896D75750j024k83L37P88R78N36n45j448j341m01M77P93O93L85j1j84J23N57
62878D76180N10R8J10Q53J606J488M24r79k102k587k360j725j169q71n50jN19
62861D69444O15K55k90p53r09n83J03O44O52L89M93J129J695J518O59j80m86n07
62843D73888q34j618k351k542k275j990j844j591j059m36o5q4m27r54j466j694
62827D52658j465q65j17O69J488K185K413K092J772K192L369M474M820M619M435
62812D84739M244L709L153L400M489N404N489N366N905O947P784Q411R330J0460
62798E68830J1186J1477J2018J3092J4206J5163J6615J9121K2268K5261K7990
62787G57227L0911L4338L8329M2996M8314N3797N8915O3796O9043P4775Q0283
$$ plain form
62776 1352724 1437434 1525146 1614507 1704168 1792563 1877779 1957563 2029472 2091234 2141048 2177550
62765 2177550 2199616 2206481 2198178 2175615 2139965 2092034 2032546 1963044 1886085 1804245 1719165 1631871
62753 1631871 1543839 1457214 1373874 1294612 1219372 1148005 1080670 1017771 959786 907032 859426
62742 859426 816578 778191 744141 714126 687505 663680 642434 623743 607540 593839 582712
62731 582712 573807 566169 558954 552148 546238 541432 537707 535372 534889 536046 537937 539966 542379 545577
62717 545577 549426 553646 558534 564881 573316 584101 597420 613471 632233 653412 676716 702179
62705 702179 730268 761748 797318 837227 881290 929288 981201 1036986 1096294 1158570 1223327
62694 1223327 1290161 1358545 1427669 1496249 1562390 1623852 1678752 1725901 1764283 1792392 1808490
$$ packed form
62776A352724Q4710Q7712Q9361Q9661Q8395Q5216P9784P1909O1762M9814L6502
62765B177550K2066O865q303k2563l5650m7931n9488o9502p6959q1840q5080q7294
62753A631871q8032q6625q3340p9262p5240p1367o7335o2899n7985n2754m7606
62742H59426m2848l8387l4050l0015k6621k3825k1246j8691j6203j3701j1127
62731E82712q905p638p215o806n910m806l725k335m83J157J891K029K413L198
62717E45577L849M220M888O347Q435J0785J3319J6051J8762K1179K3304K5463
62705G02179K8089L1480L5570L9909M4063M7998N1913N5785N9308O2276O4757
62694A223327O6834O8384O9124O8580O6141O1462N4900M7149L8382K8109J6098
$$ plain form
62683 1808490 1811530 1801579 1779351 1745643 1701337 1647702 1586459 1519614 1449213 1377024 1304345 1232273
62671 1232273 1162172 1095514 1033074 974602 919670 868643 822329 780717 742651 707044 673987
62660 673987 644255 618055 594820 574174 556428 541828 529675 518617 507708 496927 486786
62649 486786 477766 470064 463469 457313 450836 443885 437214 431811 427965 425090 422454 419875 417664 416127
62635 416127 415320 415174 415600 416425 417400 418333 419087 419402 418916 417514 415556 413583 411901 410607 409855 409770 410224
62618 410224 411040 412468 415008 418609 422497 426084 429792 434582 440905 448458 456800 465760 475294 485466
62604 485466 496658 509454 524149 540639 558922 579378 602424 628141 656454 687454 721312
62593 721312 757971 797101 838248 880848 924073 966753 1007454 1044695 1077243 1104230 1124882
$$ packed form
62683A808490L040r951k2228l3708m4306n3635o1243o6845p0401p2189p2679p2072
62671A232273p0101o6658o2440n8472n4932n1027m6314m1612l8066l5607l3057
62660F73987k9732k6200k3235k0646j7746j4600j2153j1058j0909j0781j0141
62649D86786r020p702o595o156o477o951o671n403l846k875k636k579k211j537
62635D16127q07j46M26Q25R75R33P54L15m86j402j958j973j682j294p52q5M54
62618D10224Q16J428K540L601L888L587L708M790O323P553Q342Q960R534J0172
62604D85466J1192J2796J4695J6490J8283K0456K3046K5717K8313L1000L3858
62593G21312L6659L9130M1147M2600M3225M2680M0701L7241L2548K6987K0652
$$ plain form
62582 1124882 1138253 1143549 1140745 1130563 1113766 1090829 1062407 1029668 993831 955699 915999 875821
62570 875821 836252 797838 760918 726212 694344 664886 636706 609562 584668 563303 545356
62559 545356 529667 515379 502380 490808 480738 472284 465454 459831 454832 450330 446635 443820 441437
62546 441437 439075 436898 435446 435085 435707 436793 437674 437987 438037 438506 439729 441418 443114 444556 445549 445942
62530 445942 446097 447019 449571 453705 458959 465558 474492 486371 500681 516381 532972 550804 570587
62517 570587 592870 617844 645440 675587 708389 743929 781852 821333 861498 901725 941478
62506 941478 980059 1016627 1050250 1079807 1104095 1122299 1134274 1140243 1140370 1134836 1124189 1109411
62494 1109411 1091758 1072690 1053758 1036287 1021173 1009147 1001004 997216 997579 1001750 1010152 1023780
$$ packed form
62582A124882J3371N296k804j0182j6797k2937k8422l2739l5837l8132l9700m0178
62570H75821l9569l8414l6920l4706l1868k9458k8180k7144k4894k1365j7947
62559E45356j5689j4288j2999j1572j0070q454o830n623m999m502l695k815k383
62546D41437k362k177j452l61O22J086Q81L13N0M69J223J689J696J442R93L93
62530D45942J55R22K552M134N254O599Q934J1879J4310J5700J6591J7832J9783
62517E70587K2283K4974K7596L0147L2802L5540L7923L9481M0165M0227L9753
62506I41478L8581L6568L3623K9557K4288J8204J1975N969J27n534j0647j4778
62494A109411j7653j9068j8932j7471j5114j2026q143l788L63M171Q402J3628
$$ plain form
62482 1023780 1042935 1066618 1093483 1122914 1154756 1188224 1221684 1253495 1282604 1308175 1328943
62471 1328943 1343262 1349773 1347978 1338307 1321660 1298679 1269329 1233265 1190795 1143420 1093262 1042009
62459 1042009 990525 939434 889729 842665 799241 760011 725144 694418 667290 643492 623596
62448 623596 608516 598134 590788 584550 578859 574551 572507 572761 574883 578555 583480 589129 594990 600892
62434 600892 606806 612411 617095 620245 621359 619997 615948 609406 600804 590505 578827 566303 553576
62421 553576 540966 528363 515686 503273 491681 481234 471906 463559 456089 449367 443260 437804 433240
62408 433240 429656 426629 423431 419694 415813 412564 410407 409240 408674 408357 408076 407876 408124 409179 410845
62393 410845 412399 413385 414183 415559 417763 420324 422678 424677 426566 428710 431410 434718 438377 442168 446361
$$ packed form
62482A023780J9155K3683K6865K9431L1842L3468L3460L1811K9109K5571K0768
62471A328943J4319O511j795r671j6647k2981k9350l6064m2470m7375n0158n1253
62459A042009n1484n1091m9705m7064m3424l9230l4867l0726k7128k3798j9896
62448F23596j5080j0382p346o238n691m308k044K54K122L672M925N649N861N902
62434F00892N914N605M684L150J114j362m049o542q602j0299j1678j2524j2727
62421E53576j2610j2603j2677j2413j1592j0447r328q347p470o722o107n456m564
62408D33240l584l027l198l737l881l249k157j167n66l17k81k00K48J055J666
62393D10845J554R86P98J376K204K561K354J999J889K144K700L308L659L791M193
$$ plain form
62378 446361 451536 457877 464980 472532 480859 490483 501331 512801 524492 536524 549162 562586 577161
62365 577161 593579 612489 634180 658812 686693 718030 752613 790161 830975 875808 924914
62354 924914 977469 1032034 1087303 1142105 1194940 1243927 1287299 1323718 1352119 1371641 1381967
62343 1381967 1383616 1377672 1365224 1347147 1324192 1297004 1266024 1231644 1194585 1155979 1116952 1078312
62331 1078312 1040751 1005195 972662 943754 918470 896497 877400 860477 844740 829341 813897
62320 813897 798190 781685 763698 744052 723253 701901 680219 658324 636654 615759 595813
62309 595813 576684 558528 541969 527627 515644 505789 497753 491171 485571 480595 476236 472687 469972
62296 469972 467900 466372 465515 465446 466033 466975 468009 468970 469866 471032 473081 476423 480802 485509 490067 494539
$$ packed form
62378D46361N175O341P103P552Q327R624J0848J1470J1691J2032J2638J3424J4575
62365E77161J6418J8910K1691K4632K7881L1337L4583L7548M0814M4833M9106
62354I24914N2555N4565N5269N4802N2835M8987M3372L6419K8401J9522J0326
62343A381967J649n944j2448j8077k2955k7188l0980l4380l7059l8606l9027l8640
62331A078312l7561l5556l2533k8908k5284k1973j9097j6923j5737j5399j5444
62320H13897j5707j6505j7987j9646k0799k1352k1682k1895k1670k0895j9946
62309E95813j9129j8156j6559j4342j1983r855q036o582n600m976m359l549k715
62296D69972k072j528q57o9N87R42J034R61Q96J166K049L342M379M707M558M472
$$ plain form
62280 494539 499142 503840 508546 513506 519171 525715 532959 540797 549448 559160 569946 581752 594802
62267 594802 609577 626528 645863 667507 691251 717169 746067 779291 817827 861627 909952
62256 909952 962187 1018031 1077030 1138360 1201076 1264188 1326329 1385624 1440022 1487602 1526653
62245 1526653 1555922 1575007 1584207 1583856 1574118 1555580 1529410 1496369 1456045 1407806 1352469 1292411
62233 1292411 1230056 1166879 1104003 1042979 985391 932055 883145 838853 799428 764699 734058
62222 734058 706932 682944 661635 642475 625286 610295 597652 587130 578396 571182 564942 558713
62210 558713 551771 544383 537573 532162 528340 526052 525327 525954 527181 528211 528985 530195 532431 535518 538868
62195 538868 542396 546813 552904 560566 568744 576373 583350 590503 598636 607712 617033 626082 635019 644265
$$ packed form
62280D94539M603M698M706M960N665O544P244P838Q651R712J0786J1806J3050
62267E94802J4775J6951J9335K1644K3744K5918K8898L3224L8536M3800M8325
62256I09952N2235N5844N8999O1330O2716O3112O2141N9295N4398M7580L9051
62245A526653K9269J9085R200l51r738j8538k6170l3041m0324m8239n5337o0058
62233A292411o2355o3177o2876o1024n7588n3336m8910m4292l9425l4729l0641
62222G34058k7126k3988k1309j9160j7189j4991j2643j0522q734p214o240o229
62210E58713o942p388o810n411l822k288p25O27J227J030P74J210K236L087L350
62195E38868L528M417O091P662Q178P629O977P153Q133R076R321R049Q937R246
$$ plain form
62181 644265 653792 663038 671599 679778 688253 697316 706670 716027 725606 735940 747467 760582 775927
62168 775927 794261 816039 841313 870065 902314 937805 975831 1015460 1055699 1095192 1132027
62157 1132027 1164258 1190731 1211294 1226159 1235215 1238027 1234419 1224942 1210705 1192690 1171201 1146097
62145 1146097 1117626 1086906 1055447 1024252 993535 963395 934548 908229 885334 865858 849299
62134 849299 835518 824907 817627 812951 809624 806739 804025 801427 798872 796501 794706 793691 793196 792907
62120 792907 792969 793943 796362 800340 805285 809824 812339 811931 808831 803777 797335 790057 782878 776676 771366
62105 771366 765807 758722 749569 738666 726851 715036 703817 693391 683942 675975 670047 666273 664362
62092 664362 663983 664837 666527 668771 671693 675494 679947 684652 689723 695714 702853 710860 719576 729249 740102
$$ packed form
62181F44265R527R246Q561Q179Q475R063R354R357R579J0334J1527J3115J5345
62168G75927J8334K1778K5274K8752L2249L5491L8026L9629M0239L9493L6835
62157A132027L2231K6473K0563J4865R056K812l608r477j4237j8015k1489k5104
62145A146097k8471l0720l1459l1195l0717l0140k8847k6319k2895j9476j6559
62134H49299j3781j0611p280m676l327k885k714k598k555k371j795j015m95k89
62120G92907O2R74K419L978M945M539K515m08l100n054o442p278p179o202n310
62105G71366n559p085r153j0903j1815j1815j1219j0426r449p967n928l774j911
62092F64362l79Q54J690K244K922L801M453M705N071N991P139Q007Q716R673J0853
$$ plain form
62077 740102 752164 765683 781091 798312 816697 835947 856476 878408 900851 922898 944959
62066 944959 968328 993631 1020376 1047963 1076352 1105509 1134744 1162894 1188916 1212089 1231807
62055 1231807 1247365 1257976 1263110 1262884 1257969 1248878 1235491 1217505 1195189 1169324 1140407 1108287
62043 1108287 1072681 1033889 992976 951440 910682 871567 834317 798816 764964 732789 702487
62032 702487 674484 649244 626770 606483 587813 570691 555238 541277 528512 516986 506893
62021 506893 498033 489810 481757 473725 465681 457729 450225 443444 437221 431328 426097 422127 419420 417372
62007 417372 415686 414698 414656 415334 416612 418894 422491 427016 431750 436364 440921 445506 450180 455016 459822
61992 459822 464059 467367 469892 471748 472387 470985 467413 462460 457123 451956 446964 441807 436097 429753
$$ packed form
62077G40102J2062J3519J5408J7221J8385J9250K0529K1932K2443K2047K2061
62066I44959K3369K5303K6745K7587K8389K9157K9235K8150K6022K3173J9718
62055A231807J5558J0611N134k26m915r091j3387j7986k2316k5865k8917l2120
62043A108287l5606l8792m0913m1536m0758l9115l7250l5501l3852l2175l0302
62032G02487k8003k5240k2474k0287j8670j7122j5453j3961j2765j1526j0093
62021E06893q860q223q053q032q044p952p504o781o223n893n231l970k707k048
62007D17372j686r88m2O78J278K282L597M525M734M614M557M585M674M836M806
61992D59822M237L308K525J856O39j402l572m953n337n167m992n157n710o344
$$ plain form
61978 429753 423095 416468 409948 403622 397951 393459 390118 387361 384694 382016 379431 377093 375251 374077
61964 374077 373352 372572 371487 370265 369111 368020 367085 366751 367465 369126 371080 372711 373973 375385 377512
61949 377512 380433 383765 387270 391297 396366 402423 408825 415217 422088 430235 439836 450303 460937 471450
61935 471450 481916 492449 503002 513313 522988 531753 539602 546603 552652 557599 561555 564729 566949
61922 566949 567750 567152 565943 564802 563376 560790 557000 553127 550316 548833 548458 549332 551959 556647 563382
61907 563382 572028 582189 592988 603464 613286 622754 632009 640491 647206 651346 652683 651642 648955
61894 648955 644975 639367 631782 622746 613412 604448 595650 586785 578182 570185 562517 554664 546613 538813
61880 538813 531643 525253 519633 514352 508477 501346 493387 485772 479264 473773 468979 464874 461610 459172
$$ packed form
61978D29753o658o627o520o326n671m492l341k757k667k678k585k338j842j174
61964C74077p25p80j085j222j154j091r35l34P14J661J954J631J262J412K127
61949C77512K921L332L505M027N069O057O402O392O871Q147R601J0467J0634J0513
61935D71450J0466J0533J0553J0311R675Q765P849P001O049M947L956L174K220
61922E66949Q01n98j209j141j426k586l790l873k811j483l75Q74K627M688O735
61907E63382Q646J0161J0799J0476R822R468R255Q482O715M140J337j041k687
61894F48955l980n608p585r036r334q964q798q865q603p997p668p853q051p800
61880E38813p170o390n620n281n875p131p959p615o508n491m794m105l264k438
$$ plain form
61866 459172 457346 455786 454209 452867 452833 455268 460227 466547 473094 479843 487618 497159 508668 521859
61852 521859 536122 550891 566159 582479 600213 618995 638146 657256 676005 693706 709544
61841 709544 723188 734691 743853 750205 753685 754784 753795 750426 744547 737052 729521 723067 717836 713606
61827 713606 710561 709285 710201 713223 717995 724243 731688 739631 746907 752443 755683 756300 753765 747653 738305
61812 738305 726678 713451 698726 682742 666293 650039 633937 617934 602812 589553 577965
61801 577965 566772 555233 543984 533984 525193 516817 508505 500747 494131 488546 483195 477347 471131
61788 471131 465553 461485 458677 456095 453191 450331 447844 445365 442508 439614 437222 435232 433285 431671
61774 431671 431069 431459 432020 432175 432094 432074 432053 431945 431907 432032 432248 432754 434037 436198 438657 440869 442929 445198
$$ packed form
61866D59172j826j560j577j342l4K435M959O320O547O749P775R541J1509J3191
61852E21859J4263J4769J5268J6320J7734J8782J9151J9110J8749J7701J5838
61841G09544J3644J1503R162O352L480J099r89l369n879p495p531o454n231m230
61827G13606l045j276R16L022M772O248P445P943P276N536L240O17k535o112r348
61812G38305j1627j3227j4725j5984j6449j6254j6102j6003j5122j3259j1588
61801E77965j1193j1539j1249j0000q791q376q312p758o616n585n351n848o216
61788D71131n578m068k808k582k904k860k487k479k857k894k392j990j947j614
61774D31671o02L90N61J55q1k0k1j08l8J25K16N06J283K161K459K212K060K269
$$ plain form
61756 445198 447740 450505 453690 457463 461486 465065 467635 468854 468500 466654 463785 460351 456449 452145
61742 452145 447943 444482 441860 439606 437268 434768 432210 429705 427445 425732 424862 424997 426033 427553 429072
61727 429072 430471 431985 433683 435296 436744 438434 440648 442991 444896 446457 448197 450173 451870 452969
61713 452969 453671 454209 454480 454287 453573 452373 450838 449284 447795 445777 442455 437914 433188 429106 425489
61698 425489 421750 417836 414219 411206 408602 405907 402602 398436 393678 388959 384706 380878 377358 374316
61684 374316 371952 370062 368124 365714 362721 359352 356120 353649 352237 351642 351387 351135 350652 349694 348222
61669 348222 346610 345399 344919 345213 346135 347298 348208 348770 349478 350785 352424 353755 354709 355911 357852 360335
61653 360335 362828 364950 366409 366898 366457 365708 365379 365685 366520 368089 370784 374313 377483 379320 380147 381041
$$ packed form
61756D45198K542K765L185L773M023L579K570J219l54j846k869l434l902m304
61742D52145m202l461k622k254k338k500k558k505k260j713q70J35J036J520J519
61727D29072J399J514J698J613J448J690K214K343J905J561J740J976J697J099
61713D52969P02N38K71j93p14j200j535j554j489k018l322m541m726m082l617
61698D25489l739l914l617l013k604k695l305m166m758m719m253l828l520l042
61684C74316k364j890j938k410k993l369l232k471j412n95k55k52m83r58j472
61669C48222j612j211m80K94R22J163R10N62P08J307J639J331R54J202J941K483
61653C60335K493K122J459M89m41p49l29L06Q35J569K695L529L170J837Q27Q94
$$ plain form
61637 381041 382336 383195 382858 381794 381172 381513 382276 382721 382645 382206 381421 380093 378129 375737 373345 371293 369476
61620 369476 367385 364665 361592 358771 356456 354459 352629 350983 349361 347436 345251 343246 341531 339548
61606 339548 336800 333500 330094 326517 322482 318268 314589 311759 309518 307682 306348 305302 303771 301129
61592 301129 297663 294348 292004 290750 290087 289305 287950 286061 283962 281900 280018 278621 278133 278611 279517
61577 279517 280163 280278 280050 279740 279428 279082 278713 278435 278369 278545 278857 279192 279526 279836 279973 279768 279272 278843 278999
61558 278999 280177 282418 285186 287666 289513 291133 292949 294606 295382 295330 295456 296575 298461 300331 301760
61543 301760 302802 303544 303984 304178 304167 303894 303456 303293 303813 304926 306203 307325 308093 308196 307443 306236 305418
61526 305418 305543 306494 307728 308628 308638 307498 305484 303182 301013 299146 297784 297085 296785 296349 295627 294975 294612
$$ packed form
61637C81041J295Q59l37j064o22L41P63M45p6m39p85j328j964k392k392k052j817
61620C69476k091k720l073k821k315j997j830j646j622j925k185k005j715j983
61606C39548k748l300l406l577m035m214l679k830k241j836j334j046j531k642
61592C01129l466l315k344j254o63p82j355j889k099k062j882j397m88M78R06
61577B79517O46J15k28l10l12l46l69k78o6J76L12L35L34L10J37k05m96m29J56
61558B78999J178K241K768K480J847J620J816J657P76n2J26J119J886J870J429
61543C01760J042P42M40J94j1k73m38j63N20J113J277J122P68J03p53j207q18
61526C05418J25R51J234R00J0j140k014k302k169j867j362o99l00m36p22o52l63
$$ plain form
61509 294612 294381 294336 294995 296528 298120 298773 298501 298155 298221 298422 298482 298560 298705 298470 297493 296109 294970 294347 294219
61490 294219 294779 296263 298241 299652 299871 299417 299276 299718 300213 300487 301121 302833 305534 308535 311495 314621
61474 314621 317870 320580 322235 323148 323931 324524 324307 323073 321368 319825 318688 318101 318292 319121 319830 319763 319173
61457 319173 318920 319407 320154 320419 319944 319037 318222 317959 318519 319880 321707 323503 324841 325560 325806 325899 326087 326477
61439 326477 327182 328441 330369 332611 334418 335260 335372 335592 336553 338091 339534 340542 341381 342266 342769 342294
61423 342294 341075 340153 340171 340612 340578 340016 339711 340176 341031 341587 341711 341884 342549 343587 344451 344762 344688 344692 344894 344876
61403 344876 344190 342905 341499 340340 339456 338621 337462 335668 333445 331653 331118 331804 333002 334272 335736
61388 335736 337441 338965 339938 340505 340895 340952 340548 340203 340704 342115 343712 344935 345931 347022 348134 349152
$$ packed form
61509B94612k31m5O59J533J592O53k72l46O6K01O0P8J45k35r77j384j139o23j28
61490B94219N60J484J978J411K19m54j41M42M95K74O34J712K701L001K960L126
61474C14621L249K710J655R13P83N93k17j234j705j543j137n87J91Q29P09o7n90
61457C19173k53M87P47K65m75r07q15k63N60J361J827J796J338P19K46R3J88L90
61439C26477P05J259J928K242J807Q42J12K20R61J538J443J008Q39Q85N03m75
61423C42294j219r22J8M41l4n62l05M65Q55N56J24J73O65J038Q64L11p4MK02j8
61403C44876o86j285j406j159q84q35j159j794k223j792n35O86J198J270J464
61388C35736J705J524R73N67L90N7m04l45N01J411J597J223R96J091J112J018
$$ plain form
61372 349152 350475 352664 355600 358387 360220 361058 361426 361851 362681 364089 365933 367779 369388 371139 373624
61357 373624 376892 380476 384189 388407 393337 398471 403181 407599 412415 417883 423507 428726 433487 438023
61343 438023 442399 446466 450052 453014 455347 457367 459590 462212 464844 466977 468584 470010 471296 471902
61329 471902 471266 469502 467330 465317 463380 461218 459083 457784 457818 458819 460120 461658 463969 467434 471895
61314 471895 477017 482649 488717 495122 501951 509596 518440 528564 539881 552394 566131 580845 595919
61301 595919 610519 623835 635278 644539 651402 655579 656881 655578 652403 648124 643119 637317 630372
61288 630372 622012 612434 602353 592419 582635 572672 562677 553312 544963 537449 530736 525420 522046 520303
61274 520303 519278 518368 517590 517231 517560 518714 520534 522596 524647 526832 529256 531605 533601 535610 538338
$$ packed form
61372C49152J323K189K936K787J833Q38L68M25Q30J408J844J846J609J751K485
61357C73624L268L584L713M218M930N134M710M418M816N468N624N219M761M536
61343D38023M376M067L586K962K333K020K223K622K632K133J607J426J286O06
61329D71902o36j764k172k013j937k162k135j299L4J001J301J538K311L465M461
61314D71895N122N632O068O405O829P645Q844J0124J1317J2513J3737J4714J5074
61301E95919J4600J3316J1443R261O863M177J302j303l175m279n005n802o945
61288F30372q360r578j0081r934r784r963r995r365q349p514o713n316l374j743
61274E20303j025r10p78l59L29J154J820K062K051K185K424K349J996K009K728
$$ plain form
61259 538338 542051 546503 551429 556556 561228 564694 566931 568633 570237 571425 571788 571499 571062 570786 570852 571503
61243 571503 572737 573970 574419 573808 572498 571038 569834 569095 568779 568536 567951 567011 566278 566585 568510 572025
61227 572025 576554 581408 586300 591483 597485 604772 613484 623247 633198 642569 651348 660213 669724 679804
61213 679804 690079 700265 709955 718384 724953 729914 734104 738065 741781 745252 748837 752842 757182 761703
61199 761703 766619 772382 779310 787551 797222 808229 820031 831874 843275 854070 863964 872376 878835
61186 878835 883276 885769 886149 884296 880760 876706 872882 868771 863144 855584 847179 839406 832479 825184
61172 825184 816414 806455 796499 787207 778159 768594 758191 747099 735677 724479 714077 704506 695034
61159 695034 684782 673562 661875 650288 639131 628710 619390 611310 604312 598304 593491 590103 588005
$$ packed form
61259E38338L713M452M926N127M672L466K237J702J604J188L63k89m37k76O6O51
61243E71503J234J233M49o11j310j460j204p39l16k43n85r40p33L07J925L515
61227E72025M529M854M892N183O002P287Q712R763R951R371Q779Q865R511J0080
61213F79804J0275J0186R690Q429O569M961M190L961L716L471L585M005M340M521
61199G61703M916N763O928Q241R671J1007J1802J1843J1401J0795R894Q412O459
61186H78835M441K493L80j853l536m054l824m111n627p560q405p773o927p295
61172H25184q770r959r956r292r048r565j0403j1092j1422j1198j0402r571r472
61159F95034j0252j1220j1687j1587j1157j0421r320q080o998o008m813l388k098
$$ plain form
61146 588005 586633 585237 583127 579867 575405 570015 564141 558287 552929 548340 544518 541475 539519 538959
61132 538959 539600 540937 542946 546265 551355 557837 565071 573138 582812 594595 608189 622952 638614
61119 638614 655395 673675 693663 715274 738163 761910 786169 810699 835302 859865 884429
61108 884429 909009 933287 956545 978049 997526 1015187 1031210 1045233 1056428 1064100 1068065 1068407
61096 1068407 1065068 1057928 1047229 1033596 1017561 999318 979030 957221 934701 912199 890115 868502
61084 868502 847211 826115 805283 784956 765439 747103 730302 715063 700993 687871 676225
61073 676225 666839 659647 653601 647857 642691 638999 637237 637135 638100 639590 641356 643646 647033 651845 657980
61058 657980 665369 674189 684334 695138 706124 717759 731016 746310 763296 781481 800613 820618
$$ packed form
61146E88005j372j396k110l260m462n390n874n854n358m589l822l043j956n60
61132E38959O41J337K009L319N090O482P234Q067R674J1783J3594J4763J5662
61119F38614J6781J8280J9988K1611K2889K3747K4259K4530K4603K4563K4564
61108H84429K4580K4278K3258K1504J9477J7661J6023J4023J1195P672L965L42
61096A068407l339p140j0699j3633j6035j8243k0288k1809k2520k2502k2084k1613
61084H68502k1291k1096k0832k0327j9517j8336j6801j5239j4070j3122j1646
61073F76225r386p192o046n744n166l692j762j02R65J490J766K290L387M812O135
61058F57980P389Q820J0145J0804J0986J1635J3257J5294J6986J8185J9132K0005
$$ plain form
61046 820618 841640 864094 888321 914199 941355 969690 999461 1031017 1064682 1100631 1138581
61035 1138581 1177930 1218509 1260892 1305595 1352416 1401046 1451874 1505454 1561483 1619120 1678218
61024 1678218 1739565 1804079 1872567 1946298 2027098 2116818 2217276 2330630 2459095 2604448
61014 2604448 2768637 2955003 3168318 3414000 3698474 4030441 4420897 4882063 5427595
61005 5427595 6073810 6838887 7739975 8791807 10007132 11394113 12948953 14649090 16449688
60996 16449688 18277626 20021757 21537053 22683298 23387915 23686974 23706511 23597387 23474796
60987 23474796 23395385 23358573 23304831 23115023 22639919 21765097 20470895 18840713 17015367
60978 17015367 15134768 13305280 11596408 10048816 8681467 7497512 6489776 5644135
$$ packed form
61046H20618K1022K2454K4227K5878K7156K8335K9771L1556L3665L5949L7950
61035A138581L9349M0579M2383M4703M6821M8630N0828N3580N6029N7637N9098
61024A678218O1347O4514O8488P3731Q0800Q9720J00458J13354J28465J45353
61014B604448J64189J86366K13315K45682K84474L31967L90456M61166N45532
61005E427595O46215P65077R01088J051832J215325J386981J554840J700137J800598
60996A6449688J827938J744131J515296J146245P04617K99059J9537j09124j22591
60987B3474796p9411l6812n3742j89808m75104q74822j294202j630182j825346
60978A7015367j880599j829488j708872j547592j367349j183955j007736q45641
$$ plain form
60970 5644135 4941277 4359549 3878569 3480757 3150604 2874423 2641225 2442677 2271737
60961 2271737 2122104 1989176 1870492 1764576 1669781 1584538 1508045 1440086 1380278 1327642
60951 1327642 1280692 1237842 1197929 1160352 1124647 1090207 1056807 1025067 995732 968581 942580
60940 942580 917044 892118 868205 845551 824407 804892 786509 768364 750078 732104 714985
60929 714985 698744 683090 667858 653144 639364 627153 616830 608007 600169 593427 588047 583408
60917 583408 578347 572682 567487 563554 560453 557552 555098 553574 552637 551564 550389 549798 550042 550701 551429
60902 551429 552315 553430 554542 555399 555934 556102 555828 555220 554541 553834 552729 550800 548063 545037 542226 539466
60886 539466 535871 530664 524065 517112 510517 503973 496735 488609 480132 472010 464700 458381 452921 447865
$$ packed form
60970E644135p02858n81728m80980l97812l30153k76181k33198j98548j70940
60961B271737j49633j32928j18684j05916r4795q5243p6493o7959n9808n2636
60951A327642m6950m2850l9913l7577l5705l4440l3400l1740k9335k7151k6001
60940I42580k5536k4926k3913k2654k1144j9515j8383j8145j8286j7974j7119
60929G14985j6241j5654j5232j4714j3780j2211j0323q823p838o742n380m639
60917E83408n061n665n195l933l101k901k454j524r37j073j175n91K44O59P28
60902E51429Q86J115J112Q57N35J68k74o08o79p07j105j929k737l026k811k760
60886E39466l595n207o599o953o595o544p238q126q477q122p310o319n460n056
$$ plain form
60872 447865 442719 437381 432208 427640 423892 420935 418607 416680 415014 413801 413590 414850 417413 420498
60858 420498 423424 426181 429036 431692 433395 434035 434634 436282 438964 441886 444640 447368 449961 451907 453055
60843 453055 453831 454488 454677 454070 452939 451796 450802 449739 448226 445834 442465 438831 436049 434427 433133
60828 433133 431375 429408 427898 426821 425604 424058 422519 421185 419865 418344 416517 414224 411331 407961
60814 407961 404347 400618 397019 394061 391939 389937 386975 382780 378103 373827 370290 367394 364776 361803
60800 361803 357970 353588 349672 346907 345052 343515 342120 340991 339996 338776 337250 335762 334656 333875 333023
60785 333023 331794 330341 329252 329116 330070 331755 333611 335126 335984 336281 336648 337887 340258 343206 345876
60770 345876 347916 349735 352035 355146 358801 362505 366096 369830 373859 377789 380895 382711 383316 383082 382318
$$ packed form
60872D47865n146n338n173m568l748k957k328j927j666j213k11J260K563L085
60858D20498K926K757K855K656J703O40N99J648K682K922K754K728K593J946J148
60843D53055P76O57J89o07j131j143r94j063j513k392l369l634k782j622j294
60828D33133j758j967j510j077j217j546j539j334j320j521j827k293k893l370
60814D07961l614l729l599k958k122k002k962m195m677m276l537k896k618k973
60800C61803l833m382l916k765j855j537j395j129r95j220j526j488j106p81q52
60785C33023j229j453j089j36R54J685J856J515Q58K97L67J239K371K948K670
60770C45876K040J819K300L111L655L704L591L734M029L930L106J816O05k34p64
$$ plain form
60755 382318 381149 379613 377831 376033 374334 372511 370238 367680 365616 364751 365011 365696 366175 366184 365645 364512
60739 364512 362781 360443 357485 354099 350727 347605 344453 340922 337193 333733 330557 327191 323409 319547
60725 319547 316046 313120 310914 309530 308712 307997 307410 307530 308517 309495 309396 308230 307064 306880 307791 309274 310686
60708 310686 311548 311767 311824 312545 314425 317161 319899 321979 323475 325004 326971 329096 330863 332358 334263
60693 334263 336900 339639 341615 342825 344099 346046 348445 350745 352811 354956 357412 360022 362451 364532
60679 364532 366278 367611 368317 368434 368520 369172 370285 371180 371559 371830 372167 371754 369601 365951 362186 359292 357010
60662 357010 354666 352189 349947 348000 346085 344201 342754 342098 342161 342563 342989 343473 344353 345883 347803 349526
60646 349526 350815 352044 353594 355263 356619 357667 358682 359381 358800 356295 352412 348507 345579 343649 342143
$$ packed form
60755C82318j169j536j782j798j699j823k273k558k064q65K60O85M79Rn39j133
60739C64512j731k338k958l386l372l122l152l531l729l460l176l366l782l862
60725C19547l501k926k206j384q18p15n87J20R87R78r9j166j166j84R11J483J412
60708C10686Q62K19N7P21J880K736K738K080J496J529J967K125J767J495J905
60693C34263K637K739J976J210J274J947K399K300K066K145K456K610K429K081
60679C64532J746J333P06J17Q6O52J113Q95L79K71L37m13k153l650l765k894k282
60662C57010k344k477k242j947j915j884j447o56O3M02M26M84Q80J530J920J723
60646C49526J289J229J550J669J356J048J015O99n81k505l883l905k928j930j506
$$ plain form
60631 342143 340692 339495 339000 339307 339970 340451 340693 341095 341945 343033 343873 344154 343856 343116 342111 341052 340091
60614 340091 339227 338410 337748 337541 337987 338839 339451 339329 338660 338154 338291 338876 339460 339986 340783 342008 343426 344740
60596 344740 345868 346847 347764 348849 350350 352124 353606 354397 354754 355280 356248 357395 358305 358855 359306 360057 361210
60579 361210 362412 363285 364023 365275 367404 370228 373671 378207 384296 391710 399881 408682 418369 428883
60565 428883 439762 450700 461640 472158 481217 487832 491751 493357 493143 491384 488156 483585 478194
60552 478194 472937 468614 465259 462398 459860 457995 457194 457682 459864 464309 471038 479195 487785 496559 506029
60537 506029 516865 529477 543844 559397 575265 590821 605814 619783 631735 640699 646342 648747
60525 648747 647970 644312 638705 632198 625008 616601 606833 596570 587093 579230 573193 568906 566203 564817
$$ packed form
60631C42143j451j197m95L07O63M81K42M02Q50J088Q40K81k98p40j005j059r61
60614C40091q64q17o62k07M46Q52O12j22o69n06J37N85N84N26P97J225J418J314
60596C44740J128R79R17J085J501J774J482P91L57N26R68J147R10N50M51P51J153
60579C61210J202Q73P38J252K129K824L443M536O089P414Q171Q801R687J0514
60565D28883J0879J0938J0940J0518R059O615L919J606k14j759l228m571n391
60552D78194n257m323l355k861k538j865q01M88K182M445O729Q157Q590Q774R470
60537E06029J0836J2612J4367J5553J5868J5556J4993J3969J1952Q964N643K405
60525F48747p77l658n607o507p190q407r768j0263r477p863o037m287k703j386
$$ plain form
60511 564817 564396 564589 565220 566546 569237 573855 580421 588734 599023 611873 627494 645606 666310 690598
60497 690598 719459 752652 788796 826594 865439 904746 943296 979660 1012959 1042677 1067948
60486 1067948 1087653 1101392 1109758 1113301 1111559 1103521 1088763 1067613 1040446 1007474 969373 927570
60474 927570 883717 839211 795306 753141 713376 676152 641769 611015 584504 561962 542534
60463 542534 525522 510389 496378 482784 469648 457740 447775 439881 433757 428931 424873 421218 417974
60450 417974 415271 412907 410446 407759 405150 402894 400942 399130 397374 395619 393841 392186 390806 389485
60436 389485 387784 385726 384046 383459 383819 384174 383680 382308 380738 379612 378913 378129 377025 376045 375756 376103
60420 376103 376559 376912 377457 378399 379494 380448 381290 382126 382840 383281 383512 383656 383732 383876 384474 385770 387465 389010
$$ packed form
60511E64817m21J93O31J326K691M618O566Q313J0289J2850J5621J8112K0704K4288
60497F90598K8861L3193L6144L7798L8845L9307L8550L6364L3299K9718K5271
60486A067948J9705J3739Q366L543j742q038j4758k1150k7167l2972l8101m1803
60474I27570m3853m4506m3905m2165l9765l7224l4383l0754k6511k2542j9428
60463E42534j7012j5133j4011j3594j3136j1908r965p894o124m826m058l655l244
60450D17974k703k364k461k687k609k256j952j812j756j755j778j655j380j321
60436C89485j701k058j680n87L60L55m94j372j570j126o99p84j104r80k89L47
60420C76103M56L53N45R42J095R54Q42Q36P14M41K31J44P6J44N98J296J695J545
$$ plain form
60402 389010 390170 391069 391846 392646 393884 396045 399035 402057 404416 406342 408743 412144 416088 419667 422454
60387 422454 424721 426833 428764 430347 431772 433499 435735 438206 440497 442411 443955 445180 446170 447080 448052
60372 448052 449102 450183 451318 452679 454499 456800 459148 460809 461398 461367 461750 463359 466294 470078 474075
60357 474075 477837 481359 485102 489635 495257 501975 509684 518051 526360 533890 540495 546481 551838 555956
60343 555956 558227 558557 557074 553688 548338 541453 533847 526173 518699 511513 504816 499019 494571 491444
60329 491444 488770 485319 480663 475631 471376 468149 465321 462318 459195 456375 454279 453270 453610 455349
60315 455349 458388 462674 468181 474800 482504 491576 502353 514706 528017 541728 555703 570005 584569
60302 584569 599128 613147 625636 635298 641133 642868 640675 634609 624583 610934 594826 577880
$$ packed form
60402C89010J160Q99P77Q00J238K161K990L022K359J926K401L401L944L579K787
60387D22454K267K112J931J583J425J727K236K471K291J914J544J225R90R10R72
60372D48052J050J081J135J361J820K301K348J661N89l1L83J609K935L784L997
60357D74075L762L522L743M533N622O718P709Q367Q309P530O605N986N357M118
60343E55956K271L30j483l386n350o885p606p674p474p186o697n797m448l127
60329D91444k674l451m656n032m255l227k828l003l123k820k096j009L40J739
60315D55349L039M286N507O619P704R072J0777J2353J3311J3711J3975J4302J4564
60302E84569J4559J4019J2489R662N835J735k193o066j0026j3649j6108j6946
$$ plain form
60290 577880 561349 545645 530702 516719 504416 494542 487304 482397 479337 477508 476016 473966 471083
60277 471083 467803 464635 461615 458575 455667 453232 451162 448727 445204 440632 435846 431836 429070 427369
60263 427369 426221 425167 423914 422279 420241 418080 416271 415093 414417 414012 413956 414503 415573 416708 417651 418673
60247 418673 420077 421624 422860 423907 425429 427733 430347 432736 434977 437266 439118 439730 439138 438361 438184
60232 438184 438284 437962 437318 437280 438580 441118 444231 447244 449775 451896 454068 456629 459266 461365 462979
60217 462979 465124 468807 474042 480127 486626 493570 500827 507909 514689 521783 529729 538048 545674 552260
60203 552260 558499 564997 571390 576940 581632 586113 590689 594981 598678 602072 605504 608653 610823 611808
60189 611808 611986 611559 610165 607447 603694 599590 595465 591139 586402 581278 575765 569743 563383 557334 552145
$$ packed form
60290E77880j6531j5704j4943j3983j2303r874p238m907l060j829j492k050k883
60277D71083l280l168l020l040k908k435k070k435l523m572m786m010k766j701
60263D27369j148j054j253j635k038k161j809j178o76m05n6N47J070J135R43J022
60247D18673J404J547J236J047J522K304K614K389K241K289J852O12n92p77j77
60232D38184J00l22o44l8J300K538L113L013K531K121K172K561K637K099J614
60217D62979K145L683N235O085O499O944P257P082O780P094P946Q319P626O586
60203E52260O239O498O393N550M692M481M576M292L697L394L432L149K170R85
60189F11808J78m27j394k718l753m104m125m326m737n124n513o022o360o049n189
$$ plain form
60174 552145 547695 543560 539804 536948 535123 533709 531999 529879 527671 525688 524173 523312 522897 522231 520779
60159 520779 518774 516795 514974 513054 511133 509767 509197 508958 508452 507654 507078 507310 508689 511136 514114 516979
60143 516979 519545 522197 525387 529237 533649 538505 543589 548572 553314 558033 563006 568259 573652 579111
60129 579111 584642 590229 595856 601441 606654 610979 614072 615947 616839 617177 617694 619114 621455 623935 625826
60114 625826 627153 628342 629562 630763 631994 633221 634045 634113 633634 632985 631980 630118 627503 624786 622097
60099 622097 618741 614393 609944 606583 604340 602168 599354 596303 593898 592580 592254 592691 593738 595288 597201
60084 597201 599187 600655 600916 599772 597770 595661 593693 591660 589521 587532 585709 583556 580528 576489
60070 576489 571551 565822 559561 553221 546871 539905 531913 523662 516521 510821 505508 499672 493805 489125
$$ packed form
60174E52145m450m135l756k856j825j414j710k120k208j983j515q61m15o66j452
60159E20779k005j979j821j920j921j366n70k39n06p98n76K32J379K447K978K865
60143E16979K566K652L190L850M412M856N084M983M742M719M973N253N393N459
60129E79111N531N587N627N585N213M325L093J875Q92L38N17J420K341K480J891
60114F25826J327J189J220J201J231J227Q24O8m79o49j005j862k615k717k689
60099F22097l356m348m449l361k243k172k814l051k405j318l26M37J047J550J913
60084E97201J986J468K61j144k002k109j968k033k139j989j823k153l028m039
60070E76489m938n729o261o340o350o966p992q251p141n700n313n836n867m680
$$ plain form
60056 489125 486082 484067 482292 480470 478773 477532 477026 477273 478033 479149 480754 483065 486154 490046 494721
60041 494721 499840 504888 509900 515621 522468 529678 536054 541210 545415 548527 550000 549905 548983 547452 544653
60026 544653 540309 535327 530793 526801 522881 518912 514774 509610 502545 494124 486058 479315 473271 466981
60012 466981 460486 454370 448705 443196 438013 433746 430624 428397 426979 426561 427005 427635 427864 427599 426872 425548
59996 425548 423764 422298 422021 423116 425127 427588 430287 433106 435974 438910 441777 444186 445968 447579
59982 447579 449570 451821 453828 455606 457568 459468 460238 459244 457099 454825 452694 450353 447644 444765 441922
59967 441922 439333 437391 436360 436068 436283 437158 438880 441041 442905 444192 445154 446031 446920 448091 449819 451863
59951 451863 453572 454601 455071 455032 454338 453180 452168 451563 450885 449604 447891 446308 445048 443845 442454 440899
$$ packed form
60056D89125l043k015j775j822j697j241n06K47P60J116J605K311L089L892M675
60041D94721N119N048N012N721O847P210O376N156M205L112J473r5r22j531k799
60026E44653m344m982m534l992l920l969m138n164p065q421q066o743o044o290
60012D66981o495o116n665n509n183m267l122k227j418m18M44O30K29k65p27j324
59996D25548j784j466k77J095K011K461K699K819K868K936K867K409J782J611
59982D47579J991K251K007J778J962J900P70r94k145k274k131k341k709k879k843
59967D41922k589j942j031k92K15Q75J722K161J864J287R62Q77Q89J171J728K044
59951D51863J709J029M70l9o94j158j012o05o78j281j713j583j260j203j391j555
$$ plain form
59935 440899 439358 438131 437620 438071 439319 440950 442663 444360 446061 447988 450667 454618 459837 465715 471533
59920 471533 476959 482093 487167 492245 497066 501062 503656 504698 504614 504026 503260 502419 501902 502539 504904 508613
59904 508613 512551 515757 517950 519362 520510 522080 524531 527549 530234 532066 533404 534842 536485 538218
59890 538218 540344 543370 547295 551607 555928 560239 564517 568593 572486 576447 580545 584562 588479 592723
59876 592723 597668 602978 607656 610702 611697 610841 608626 605556 602147 598912 596083 593389 590492 587660 585567
59861 585567 584285 583071 581487 580155 579778 579942 579751 579466 580578 584194 590081 597399 605565 614129 622489
59846 622489 630136 636735 641694 644272 644489 643421 642163 640877 639240 637389 635803 634479 632708 629662
59832 629662 624890 618394 610579 602132 593725 585803 578633 572301 566583 561138 556037 551790 548641 546092
$$ packed form
59935D40899j541j227n11M51J248J631J713J697J701J927K679L951N219N878N818
59920D71533N426N134N074N078M821L996K594J042q4n88p66q41n17O37K365L709
59904E08613L938L206K193J412J148J570K451L018K685J832J338J438J643J733
59890E38218K126L026L925M312M321M311M278M076L893L961M098M017L917M244
59876E92723M945N310M678L046R95q56k215l070l409l235k829k694k897k832k093
59861E85567j282j214j584j332l77J64j91k85J112L616N887P318Q166Q564Q360
59846F22489P647O599M959K578K17j068j258j286j637j851j586j324j771l046
59832F29662m772o496p815q447q407p922p170o332n718n445n101m247l149k549
$$ plain form
59818 546092 543417 540359 537045 533559 530001 526748 524136 521954 519600 516827 514062 511972 510815 510194
59804 510194 509362 507932 506400 505683 506015 506557 506353 505344 504113 502909 501490 499827 498371 497444 496726 495632
59788 495632 494025 492356 491075 490036 488618 486543 484468 483409 483537 483876 483359 481908 480230 478920 478112
59773 478112 477721 477522 477174 476673 476773 478377 481414 484743 487377 489419 491589 494211 497084 500086 503408
59758 503408 507112 510918 514735 519124 524839 531898 539535 547227 555363 564547 574536 584345 593286 601347
59744 601347 608587 614858 620353 625812 631702 637564 642594 646531 649564 651660 652535 652144 650749 648569 645736
59729 645736 642497 639096 635597 632166 629291 627248 625497 623172 620087 616684 613110 609039 604547 600407
59715 600407 597186 594649 592373 590430 588995 587793 586515 585385 584747 584375 583845 583434 583905 585391 587136
$$ packed form
59818E46092k675l058l314l486l558l253k612k182k354k773k765k090j157o21
59804E10194q32j430j532p17L32N42k04j009j231j204j419j663j456r27p18j094
59788D95632j607j669j281j039j418k075k075j059J28L39n17j451j678j310q08
59773D78112l91j99l48n01J00J604L037L329K634K042K170K622K873L002L322
59758E03408L704L806L817M389N715P059P637P692Q136R184R989R809Q941Q061
59744F01347P240O271N495N459N890N862N030L937L033K096Q75l91j395k180k833
59729F45736l239l401l499l431k875k043j751k325l085l403l574m071m492m140
59715F00407l221k537k276j943j435j202j278j130o38l72n30m11M71J486J745
$$ plain form
59700 587136 588482 589515 590500 591364 592143 593419 595685 598547 601166 603374 605718 608426 610951 612712 613758
59685 613758 614391 614559 613961 612502 610346 607735 604980 602351 599673 596348 592164 587763 583832 580060 575529
59670 575529 570111 564837 560755 557898 555537 553044 550323 547744 545863 544906 544425 543782 543055 543077 544424 546808
59654 546808 549635 552719 556137 559744 563213 566355 569116 571422 573219 574466 574937 574342 572798 570763 568305
59639 568305 564881 560175 554745 549414 544366 539340 534426 530121 526722 524095 521931 519903 517762 515633
59625 515633 513992 512940 511727 509487 506235 502657 499111 495441 491658 488158 485244 482940 481308 480335
59611 480335 479433 477666 474758 471508 469028 467869 467957 468914 470262 471635 473017 474513 475932 476952 477748
59596 477748 478871 480338 481366 481360 480732 480357 480579 481141 481759 482269 482410 482002 481292 480663 479985 478721 476753 474689
$$ packed form
59700E87136J346J033R85Q64P79J276K266K862K619K208K344K708K525J761J046
59685F13758O33J68n98j459k156k611k755k629k678l325m184m401l931l772m531
59670E75529n418n274m082k857k361k493k721k579j881r57m81o43p27K2J347K384
59654E46808K827L084L418L607L469L142K761K306J797J247M71n95j544k035k458
59639E68305l424m706n430n331n048n026m914m305l399k627k164k028k141k129
59625E15633j641j052j213k240l252l578l546l670l783l500k914k304j632r73
59611D80335r02j767k908l250k480j159Q8R57J348J373J382J496J419J020P96
59596D77748J123J467J028oo28l75K22N62O18N10J41m08p10o29o78j264j968k064
$$ plain form
59578 474689 473066 471558 469365 466338 463317 461234 460096 459124 457715 456029 454603 453734 453381 453381 453488 453380
59562 453380 452921 452397 452192 452215 451990 451351 450765 450758 451190 451425 451150 450812 451159 452519 454712 457526 460983 465074
59544 465074 469567 474421 480207 487734 497232 508168 519878 532080 544833 558326 572603 586819
59532 586819 598696 605507 606179 602054 595307 587244 578596 570615 564663 560948 558670 557466 557713 559260
59518 559260 560844 561291 560712 559968 559404 558563 556828 553913 549921 545221 540136 534546 528025 520577 512982
59503 512982 506126 500263 495179 490786 487064 483570 479596 475038 470822 468138 467309 467567 467951 468229 468821
59488 468821 469965 471290 472305 473052 474050 475719 478119 481139 484642 488430 492324 496391 500934 506205 512186
59473 512186 518573 524860 530500 535133 538686 541186 542639 543197 543272 543272 543359 543590 544136 545128 546466 548072 550169
$$ packed form
59578D74689j623j508k193l027l021k083j138r72j409j686j426q69l53%J07j08
59562D53380m59n24k05K3k25o39n86pM32K35k75l38L47J360K193K814L457M091
59544D65074M493M854N786P527R498J0936J1710J2202J2753J3493J4277J4216
59532E86819J1877O811O72m125o747q063q648p981n952l715k278j204K47J547
59518E59260J584M47n79p44n64q41j735k915l992m700n085n590o521p448p595
59503E12982o856n863n084m393l722l494l974m558m216k684q29K58L84K78N92
59488D68821J144J325J015P47R98J669K400L020L503L788L894M067M543N271N981
59473E12186O387O287N640M633L553K500J453N58P5%Q7K31N46R92J338J606K097
$$ plain form
59456 550169 553056 556739 561064 566021 571629 577719 584162 591064 598385 605617 612342 618765 625032 630176
59442 630176 632566 631553 628024 623189 617460 610793 603531 596403 589956 584309 579288 574627 570270 566583
59428 566583 564111 563057 563268 564667 567367 571377 576628 583382 592165 603217 616377 631568 648986
59415 648986 668598 689823 711848 734057 756104 777802 798695 817284 830874 837058 835655 828846
59403 828846 819432 809520 800680 794288 791114 791102 793748 798050 801803 801898 796109 784406 768358 749882
59389 749882 730817 712759 696469 681824 668871 658421 651059 646180 642698 640176 638560 637359 636055
59376 636055 634967 634750 635184 635321 634784 634084 633668 633398 633025 632440 631393 629718 628004 627344 628155 629817 631637
59359 631637 633617 636052 639029 642721 647639 654054 661470 669212 677455 687244 699352 713287 727561
$$ packed form
59456E50169K887L683M325M957N608O090O443O902P321P232O725O423O267N144
59442F30176K390j013l529m835n729o667p262p128o447n647n021m661m357l687
59428E66583k472j054K11J399K700M010N251O754Q783J1052J3160J5191J7418
59415F48986J9612K1225K2025K2209K2047K1698K0893J8589J3590O184j403o809
59403H28846r414r912q840o392l174j2K646M302L753R5n789j1703j6048j8476
59389G49882j9065j8058j6290j4645j2953j0450p362m879l482k522j616j201j304
59376F36055j088k17M34J37n37p00m16k70l73n85j047j675j714o60Q11J662J820
59359F31637J980K435K977L692M918O415P416P742Q243R789J2108J3935J4274
$$ plain form
59346 727561 741005 753851 767376 782382 798235 813594 827753 840799 852595 862352 869454 874189
59334 874189 877273 878913 878646 875909 870478 862453 852138 839962 826380 811828 796779 781688 766795
59321 766795 752146 737886 724366 711765 699803 688084 676692 666160 656870 648784 641853 636325
59309 636325 632345 629478 627073 625160 624648 626465 630692 636612 643392 650612 658332 666698 675177 682045
59295 682045 685036 682879 676060 665934 653521 639524 625002 611238 598978 588364 579482 572434
59283 572434 566946 562576 559374 557762 557755 558917 561179 564998 570541 577362 585106 593930 603966 614972
59269 614972 626818 639672 653333 666933 679694 691440 702010 710753 717125 721306 723796 724872
59257 724872 724792 723918 722063 718326 712341 705257 698728 693275 688325 683555 679372 676190 673977 672586 671980
$$ packed form
59346G27561J3444J2846J3525J5006J5853J5359J4159J3046J1796R757P102M735
59334H74189L084J640k67k737n431q025j0315j2176j3582j4552j5049j5091j4893
59321G66795j4649j4260j3520j2601j1962j1719j1392j0532r290q086o931n528
59309F36325l980k867k405j913n12J817M227N920O780P220P720Q366Q479O868
59295F82045K991k157o819j0126j2413j3997j4522j3764j2260j0614q882p048
59283E72434n488m370l202j612pJ162K262L819N543O821P744Q824J0036J1006
59269F14972J1846J2854J3661J3600J2761J1746J0570Q743O372M181K490J076
59257G24872q0q74j855l737n985p084o529n453m950m770m183l182k213j391o06
$$ plain form
59242 671980 672124 673052 674934 677749 681084 684678 688828 693773 698990 703718 707899 711926 715647 718400 719927
59227 719927 720491 720020 717849 713512 707277 699648 690779 680592 669255 657427 646160 636353 628090 620603
59213 620603 613146 605611 598047 590131 581775 573896 567788 563814 561403 560133 560039 560814 561567 561641 561130 560433
59197 560433 559883 559948 561147 563422 566004 568229 570180 572334 574869 577583 580339 583367 587105 591738 596898
59182 596898 602020 606978 611997 616934 621248 624964 628867 633176 636766 638669 639695 641453 644094 646331
59168 646331 647557 648593 650143 651784 652959 653880 654815 655378 655216 654714 654321 653630 651693 647987 642767 636793
59152 636793 630921 625516 620024 613576 606077 598164 590056 581362 572232 563705 556309 549178 541343 533233
59138 533233 526037 520052 514589 509246 504421 500615 497933 496294 495619 495738 496540 498130 500513 503245 505855
$$ packed form
59242F71980J44R28J882K815L335L594M150M945N217M728M181M027L721K753J527
59227G19927N64m71k171m337o235p629q869j0187j1337j1828j1267r807q263p487
59213F20603p457p535p564p916q356p879o108l974k411j270r4P75P53P4n11o97
59197E60433n50O5J199K275K582K225J951K154K535K714K756L028L738M633N160
59182E96898N122M958N019M937M314L716L903M309L590J903J026J758K641K237
59168F46331J226J036J550J641J175R21R35N63j62n02l93o91j937l706n220n974
59152F36793n872n405n492o448p499p913q108q694r130q527p396p131p835q110
59138E33233p196n985n463n343m825l806k682j639o75J19Q02J590K383K732K610
$$ plain form
59123 505855 508502 511767 515859 520502 525674 531915 539672 548621 557896 566911 575730 584675 593705 602325
59109 602325 610069 616833 622611 627170 630373 632740 635251 638434 641924 644990 647199 648472 648901 648712 648158
59094 648158 647209 645566 643109 640190 637332 634801 632528 630289 627882 625297 622702 620144 617387 614272
59080 614272 611061 607980 604588 600143 594554 588457 582405 576606 571508 567780 565326 562981 559708 555665
59066 555665 551683 548074 544439 540362 535882 531425 527543 524484 521834 518895 515627 512845 511188 510358
59052 510358 509690 509058 508660 508259 507301 505753 504272 503452 503281 503431 503765 504357 505159 505862 506145 506016 505859 506094
59034 506094 506917 508403 510570 513191 515859 518616 522258 527510 534033 540790 547326 554150 561914 570854
59020 570854 581067 592569 604808 616713 627538 637251 645948 653350 659004 662449 663139 660951 656980
$$ packed form
59123E05855K647L265M092M643N172O241P757Q949R275R015Q819Q945R030Q620
59109F02325P744O764N778M559L203K367K511L183L490L066K209J273M29j89n54
59094F48158r49j643k457k919k858k531k273k239k407k585k595k558k757l115
59080F14272l211l081l392m445n589o097o052n799n098l728k454k345l273m043
59066E55665l982l609l635m077m480m457l882l059k650k939l268k782j657q30
59052E10358o68o32l98m01r58j548j481q20j71J50L34N92Q02P03K83j29j57K35
59034E06094Q23J486K167K621K668K757L642N252O523O757O536O824P764Q940
59020E70854J0213J1502J2239J1905J0825R713Q697P402N654L445O90k188l971
$$ plain form
59007 656980 653064 650106 647515 644601 641762 639725 638378 637158 636189 636280 637957 640999 644733 648438 651712
58992 651712 654788 658150 661603 664181 665291 665411 665250 664864 664169 663753 664369 665990 668117 670775 674508 679501
58976 679501 685407 692039 699699 708772 719349 731233 744032 757329 770956 784920 798951 812488
58964 812488 825267 837493 849131 859612 868588 876367 883064 887910 890086 889744 887451 883007 875681
58951 875681 865401 852943 838983 823660 807089 789769 772479 756086 741228 727821 715145
58940 715145 702879 691696 682429 675082 669254 665020 662573 661365 660521 659944 660232 661638 663879 666772
58926 666772 670159 673315 675325 676136 676419 676389 675647 674207 672687 671213 669060 665787 662056 658882 656726
58911 656726 655699 656054 657918 660918 664491 668360 672566 677415 683616 691998 702749 715131 728166 741308
$$ packed form
59007F56980l916k958k591k914k839k037j347j220r69R1J677L042L734L705L274
58992F51712L076L362L453K578J110J20j61l86o95m16O16J621K127K658L733M993
58976F79501N906O632P660R073J0577J1884J2799J3297J3627J3964J4031J3537
58964H12488J2779J2226J1638J0481Q976P779O697M846K176l42k293m444p326
58951H75681j0280j2458j3960j5323j6571j7320j7290j6393j4858j3407j2676
58940G15145j2266j1183r267p347n828m234k447j208q44n77K88J406K241K893
58926F66772L387L156K010Q11K83l0p42j440j520j474k153l273l731l174k156
58911F56726j027L55J864L000L573L869M206M849O201Q382J0751J2382J3035J3142
$$ plain form
58897 741308 754342 767113 779594 791896 803961 815571 826947 838942 852308 866950 882190
58886 882190 897575 913113 928849 944492 959449 973022 984560 993537 999671 1003048 1004121 1003382 1000832
58873 1000832 995951 988406 978728 968063 957329 946845 936641 926819 917564 909040 901382 894634 888655
58860 888655 883118 877523 871260 863903 855567 846717 837537 827791 817484 807216 797499 788091 778485 768793
58846 768793 759665 751462 743952 736719 729409 721662 713252 704368 695495 687007 679022 671440 663932 656125
58832 656125 648110 640590 634240 629185 625328 622828 621848 622163 623454 625719 629007 633031 637438 642147 647021
58817 647021 651609 655682 659672 664048 668630 672965 676917 680366 682854 684238 685132 685951 686013 684473 681642
58802 681642 678339 674409 669039 662245 654841 647135 638913 630582 622912 615557 607248 597758 588446 580526
$$ packed form
58897G41308J3034J2771J2481J2302J2065J1610J1376J1995J3366J4642J5240
58886H82190J5385J5538J5736J5643J4957J3573J1538Q977O134L377J073p39k550
58873A000832m881p545r678j0665j0734j0484j0204r822r255q524p658o748n979
58860H88655n537n595o263p357q336q850r180r746j0307j0268r717r408r606r692
58846G68793r128q203p510p233p310p747q410q884q873q488p985p582p508p807
58832F56125q015p520o350n055l857k500r80L15J291K265L288M024M407M709M874
58817F47021M588M073L990M376M582M335L952L449K488J384Q94Q19O2j540k831
58802F81642l303l930n370o794p404p706q222q331p670p355q309r490r312p920
$$ plain form
58788 580526 574027 568883 565654 564401 563964 563271 562581 562691 563689 565248 567443 570405 573736 576957 580112
58773 580112 583208 585551 586325 585502 583523 580470 576203 571088 565912 561150 556703 552199 547259 541770 536238
58758 536238 531552 528122 525583 523666 522837 523594 525558 527870 530233 532936 535971 538744 540694 541846 542671
58743 542671 543703 545357 547920 551581 556366 561977 567841 573593 579484 585955 592850 599401 605038 609804
58729 609804 613994 617818 621483 625104 628490 631463 634387 637806 641602 645224 648842 653408 659272 665577
58715 665577 671515 677417 683956 690911 697445 703125 707917 711492 713292 713133 711231 707749 702726 696210
58701 696210 688023 677717 665295 651708 638071 624509 610353 595359 580178 565602 551940 539238
58689 539238 527719 517705 509290 502218 496019 490308 485052 480497 476724 473400 470098 466780 463779 461355
$$ packed form
58788E80526o499n144l229j253m37o93o90J10R98J559K195K962L331L221L155
58773E80112L096K343P74q23j979l053m267n115n176m762m447m504m940n489n532
58758E36238m686l430k539j917q29P57J964K312K363K703L035K773J950J152Q25
58743E42671J032J654K563L661M785N611N864N752N891O471O895O551N637M766
58729F09804M190L824L665L621L386K973K924L419L796L622L618M566N864O305
58715F65577N938N902O539O955O534N680M792L575J800j59j902l482n023o516
58701F96210q187j0306j2422j3587j3637j3562j4156j4994j5181j4576j3662j2702
58689E39238j1519j0014q415p072o199n711n256m555l773l324l302l318l001k424
$$ plain form
58675 461355 459439 457815 456539 456103 457090 459525 462714 465924 469182 473159 478380 484853 492305 500310 508144
58660 508144 515018 520617 525059 528227 529589 528843 526446 523185 519510 515424 510841 505912 501127 497040
58646 497040 493706 490484 486726 482557 478653 475345 472483 470050 468327 467404 467135 467716 469676 473037 476955
58631 476955 480469 483286 485651 487866 490093 492287 494135 495334 495926 496042 495439 493874 491924 490771 491031
58616 491031 492283 493880 495753 498317 502039 507131 513122 518738 522842 525579 528034 530788 533451 535590
58602 535590 537245 538408 538816 538518 537954 537314 536497 535758 535567 535759 535805 536025 537403 539901 542289 544251 547412
58585 547412 553285 561189 569237 576675 584139 592109 600225 608034 615600 623342 631657 640517 649182 656722
58571 656722 663180 669841 678019 688023 699556 712456 726640 741959 758685 777674 799535 823968
$$ packed form
58675D61355j916j624j276m36R87K435L189L210L258L977N221O473P452Q005P834
58660E08144O874N599M442L168J362p46k397l261l675m086m583m929m785m087
58646D97040l334l222l758m169l904l308k862k433j723r23k69N81J960L361L918
58631D76955L514K817K365K215K227K194J848J199N92J16o03j565j950j153K60
58616D91031J252J597J873K564L722N092N991N616M104K737K455K754K663K139
58602E35590J655J163M08k98n64o40q17p39j91J92M6K20J378K498K388J962L161
58585E47412N873P904Q048P438P464P970Q116P809P566P742Q315Q860Q665P540
58571F56722O458O661Q178J0004J1533J2900J4184J5319J6726J8989K1861K4433
$$ plain form
58559 823968 850064 876696 902391 925701 946159 964209 979741 991518 998528 1001111 1000194 996282
58547 996282 989914 982291 974574 967013 959390 951619 943300 933455 921522 908038 893631 878011 860727
58534 860727 842191 823119 803654 783983 765164 748330 733530 720273 708668 699051 690984 683720
58522 683720 677293 672096 667688 663108 658208 653720 650093 647043 644138 641028 637361 633229 629532 627067
58508 627067 625407 623403 620609 617530 614644 612048 609973 608890 608987 609984 611442 612937 614200 615468 617361
58493 617361 619972 622526 624432 626182 628648 632005 635949 640501 645861 651901 658476 665933 674713 684807
58479 684807 696105 708776 722716 737228 751837 766802 782090 796481 808528 817810 824398 827732
58467 827732 827134 823124 817268 810874 804516 798441 792668 787008 781715 777786 776064 776542 779038 783845 790942
$$ packed form
58559H23968K6096K6632K5695K3310K0458J8050J5532J1777P010K583r17l912
58547I96282o368p623p717p561p623p771q319r845j1933j3484j4407j5620j7284
58534H60727j8536j9072j9465j9671j8819j6834j4800j3257j1605r617q067p264
58522F83720o427n197m408m580m900m488l627l050k905l110l667m132l697k465
58508F27067j660k004k794l079k886k596k075j083R7R97J458J495J263J268J893
58493F17361K611K554J906J750K466L357L944M552N360O040O575P457Q780J0094
58479F84807J1298J2671J3940J4512J4609J4965J5288J4391J2047R282O588L334
58467H27732n98m010n856o394o358o075n773n660n293l929j722M78K496M807P097
$$ plain form
58452 790942 799363 808222 817674 827917 837917 846099 851690 854410 853560 848676 840610 830920 820532 809840
58438 809840 799478 789954 781142 773130 766921 763193 761105 759532 758786 759848 762610 766293 770951 777050
58424 777050 784022 790843 797656 805305 813488 820783 826290 829908 831305 830088 826752 822092 815910 807674
58410 807674 798204 789138 780849 772420 763642 755516 748638 742477 736526 731113 726893 724437 724187 725888
58396 725888 728321 730558 733114 736839 741220 745019 748118 751382 755155 759229 763747 768626 772579 774355
58382 774355 774701 775500 777312 779365 781576 784714 788657 792382 795813 800113 805921 812657 819667 826765 833796
58367 833796 840868 848797 858116 868081 877946 888511 900841 914177 926999 939501 952941 967009
58355 967009 980037 991504 1002203 1012059 1020002 1025969 1031015 1035414 1038554 1040544 1042084 1043113 1043678 1045616
$$ packed form
58452G90942Q421Q859R452J0243J0000Q182N591K720q50m884q066r690j0388j0692
58438H09840j0362r524q812q012o209l728k088j573p46J062K762L683M658O099
58424G77050O972O821O813P649Q183P295N507L618J397j217l336m660o182q236
58410H07674r470r066q289q429q778q126o878o161n951n413m220k456k50J701
58396G25888K433K237K556L725M381L799L099L264L773M074M518M879L953J776
58382G74355L46P99J812K053K211L138L943L725L431M300N808O736P010P098P031
58367H33796P072P929R319R965R865J0565J2330J3336J2822J2502J3440J4068
58355I67009J3028J1467J0699R856P943N967N046M399L140J990J540J029N65J938
$$ plain form
58341 1045616 1050895 1058577 1065969 1072638 1080662 1091022 1102593 1114855 1128636 1143705 1158448 1172617
58329 1172617 1187797 1204442 1220883 1235872 1249636 1261890 1271433 1278492 1284974 1291549 1296873 1300409
58317 1300409 1303574 1307303 1310918 1314303 1318817 1325243 1333010 1342086 1353288 1366133 1378845 1391116 1404340
58304 1404340 1418677 1432709 1446540 1462143 1479789 1497295 1513843 1531341 1550716 1570056 1588048
58293 1588048 1606300 1626501 1648013 1669974 1693138 1717867 1742800 1767193 1792311 1818981 1846185
58282 1846185 1873424 1901976 1932373 1963179 1993658 2025062 2057924 2090812 2123211 2156893 2192927
58271 2192927 2230118 2267901 2307924 2351195 2396514 2443341 2493270 2547084 2603250 2660943 2721585
58260 2721585 2785777 2851804 2918832 2988438 3061341 3135859 3211178 3288711 3368548 3448238 3527020
$$ packed form
58341A045616N279P682P392O669Q024J0360J1571J2262J3781J5069J4743J4169
58329A172617J5180J6645J6441J4989J3764J2254R543P059O482O575N324L536
58317A300409L165L729L615L385M514O426P767R076J1202J2845J2712J2271J3224
58304A404340J4337J4032J3831J5603J7646J7506J6548J7498J9375J9340J7992
58293A588048J8252K0201K1512K1961K3164K4729K4933K4393K5118K6670K7204
58282A846185K7239K8552L0397L0806L0479L1404L2862L2888L2399L3682L6034
58271B192927L7191L7783M0023M3271M5319M6827M9929N3814N6166N7693O0642
58260B721585O4192O6027O7028O9606P2903P4518P5319P7533P9837P9690P8782
$$ plain form
58249 3527020 3607745 3692807 3781762 3874637 3973505 4078830 4188446 4302278 4423815 4554883
58239 4554883 4693485 4839019 4994698 5162206 5338986 5523771 5719853 5929865 6152475
58230 6152475 6387522 6639263 6911123 7202402 7513547 7849304 8213241 8604890 9025893
58221 9025893 9483043 9981685 10522649 11109609 11752633 12460542 13237572 14092356 15042304
58212 15042304 16104263 17289932 18616781 20115123 21819176 23762194 25988831 28563228
58204 28563228 31558177 35047669 39118061 43874097 49425896 55886904 63399791 72153824
58196 72153824 82369162 94284760 108174306 124342786 143069235 164549161 188877959
58189 188877959 216004019 245584595 276827650 308434782 338599888 364985642 384844563
$$ packed form
58249C527020Q0725Q5062Q8955R2875R8868J05325J09616J13832J21537J31068
58239D554883J38602J45534J55679J67508J76780J84785J96082K10012K22610
58230F152475K35047K51741K71860K91279L11145L35757L63937L91649M21003
58221I025893M57150M98642N40964N86960O43024P07909P77030Q54784R49948
58212A5042304J061959J185669J326849J498342J704053J943018K226637K574397
58204B8563228K994949L489492M070392M756036N551799O461008P512887Q754033
58196G2153824J0215338J1915598J3889546J6168480J8726449K1479926K4328798
58189A88877959K7126060K9580576L1243055L1607132L0165106K6385754J9858921
$$ plain form
58182 384844563 395562903 395527870 384746546 364751362 337945456 306920850 274058364
58175 274058364 241336300 210218664 181637487 156087814 133748826 114558847 98277155
58168 98277155 84571996 73096734 63515029 55506137 48787259 43131433 38354548 34296156
58160 34296156 30822731 27834968 25255172 23012117 21045473 19313932 17786263 16429502
58152 16429502 15213694 14120505 13137531 12249393 11441946 10709152 10047537 9448393 8902126
58143 8902126 8405153 7955429 7545552 7166848 6816188 6492503 6190458 5903781 5631537
58134 5631537 5375388 5133732 4903821 4686689 4484671 4296528 4119634 3954385 3801996
58125 3801996 3660319 3526122 3399295 3280958 3169721 3063537 2962979 2869171 2780634 2695408
$$ packed form
58182C84844563J0718340l5033j0781324j9995184k6805906l1024606l2862486
58175B74058364l2722064l1117636k8581177k5549673k2338988j9189979j6281692
58168I8277155j3705159j1475262r581705q008892o718878n655826m776885m058392
58160C4296156l473425k987763k579796k243055j966644j731541j527669j356761
58152A6429502j215808j093189r82974q88138q07447p32794o61615n99144n46267
58143H902126m96973m49724m09877l78704l50660l23685l02045k86677k72244
58134E631537k56149k41656k29911k17132k02018j88143j76894j65249j52389
58125C801996j41677j34197j26827j18337j11237j06184j00558r3808q8537q5226
$$ plain form
58115 2695408 2614058 2537545 2464597 2394137 2327678 2266197 2207293 2148660 2091832 2039275 1990276
58104 1990276 1942901 1897467 1854679 1812725 1769749 1727106 1686803 1647694 1607558 1567011 1527970
58093 1527970 1490001 1451582 1413507 1377785 1344468 1312510 1282414 1255089 1229441 1203839 1178740
58082 1178740 1155224 1132407 1109030 1086213 1065795 1047225 1028777 1010556 993581 977141 959926
58071 959926 942680 926979 912315 897145 881894 868223 856017 843712 831063 819173 808377
58060 808377 798328 789482 782231 775163 766427 756293 746341 736776 726615 715916 705684 695997 686144
58047 686144 676226 666954 658420 650603 644257 639648 635253 629472 622766 616476 610550 604240 597899 592098
58033 592098 585998 578717 571299 565103 559104 551075 540852 530212 520176 510625 502025 495141 489342
$$ packed form
58115B695408q1350p6513p2948p0460o6459o1481n8904n8633n6828n2557m8999
58104A990276m7375m5434m2788m1954m2976m2643m0303l9109m0136m0547l9041
58093A527970l7969l8419l8075l5722l3317l1958l0096k7325k5648k5602k5099
58082A178740k3516k2817k3377k2817k0418j8570j8448j8221j6975j6440j7215
58071I59926j7246j5701j4664j5170j5251j3671j2206j2305j2649j1890j0796
58060H08377j0049q846p251p068q736j0134r952r565j0161j0699j0232r687r853
58047F86144r918r272q534p817o346m609m395n781o706o290n926o310o341n801
58033E92098o100p281p418o196n999q029j0223j0640j0036r551q600o884n799
$$ plain form
58020 489342 483259 476888 471138 465824 460178 454868 451226 448748 445616 441587 438172 435917 433728 431127
58006 431127 429059 427993 426995 425279 423245 421627 420825 421264 423132 425575 427280 427872 427747 426795 424559 421367
57990 421367 417965 414239 409631 404604 400245 396647 393088 389658 387176 385534 383530 380439 376560 372301
57976 372301 368024 364629 362923 362382 361761 360856 360450 360741 361150 361623 362714 364366 365819 366750 367334 367290 366175
57959 366175 364608 363883 364219 364477 363671 361760 359007 355703 352581 350431 349227 348397 347756 347302 346544 345132
57943 345132 343843 343774 344816 346119 347691 350291 354033 358444 363675 370223 377605 384641 390953 396895 402103
57928 402103 405516 406783 406342 404271 400421 395553 390762 385704 378963 370380 361580 353929 347389 341709
57914 341709 337305 334352 332114 329729 326898 323638 320254 317630 316558 316669 316963 317327 318419 320165 321686
$$ packed form
58020D89342o083o371n750n314n646n310l642k478l132m029l415k255k189k601
58006D31127k068j066r98j716k034j618q02M39J868K443J705N92j25r52k236l192
57990D21367l402l726m608n027m359l598l559l430k482j642k004l091l879m259
57976C72301m277l395j706n41o21r05m06K91M09M73J091J652J453R31N84m4j115
57959C66175j567p25L36K58q06j911k753l304l122k150j204q30o41m54p58j412
57943C45132j289o9J042J303J572K600L742M411N231O548P382P036O312N942N208
57928D02103L413J267m41k071l850m868m791n058o741q583q800p651o540n680
57914C41709m404k953k238k385k831l260l384k624j072J11K94L64J092J746J521
$$ plain form
57899 321686 322778 324120 325831 327171 328022 329479 332469 336666 341060 344770 347303 348936 350822 353644
57885 353644 356234 356726 355005 352709 350817 348718 345781 342290 338449 333938 328963 324394 320391 316161
57871 316161 311571 307704 305249 303603 302195 301430 301585 301918 301706 301196 300779 300204 299434 299401 301079 304414 308799
57854 308799 313902 319419 324708 329365 333619 337715 341443 344689 347717 350512 352555 353747 354884 356637
57840 356637 358562 359504 358623 355863 351952 348075 344969 342274 339346 336439 334185 332123 329098 325197 321905
57825 321905 319989 318608 317008 315719 315277 314980 313873 312053 310204 308673 307759 308020 309307 310138 308866
57810 308866 305068 299312 292289 284795 277790 271647 265869 260167 255227 251764 249427 247307 245054 242908
57796 242908 241118 239887 239365 239202 238688 237814 237575 238657 240451 241977 243194 244780 247112 250083 253440
$$ packed form
57899C21686J092J342J711J340Q51J457K990M197M394L710K533J633J886K822
57885C53644K590M92j721k296j892k099k937l491l841m511m975m569m003m230
57871C16161m590l867k455j646j408p65J55L33k12n10m17n75p70l3J678L335M385
57854C08799N103N517N289M657M254M096L728L246L028K795K043J192J137J753
57840C56637J925R42q81k760l911l877l106k695k928k907k254k062l025l901l292
57825C21905j916j381j600j289m42k97j107j820j849j531r14K61J287Q31j272
57810C08866l798n756p023p494p005o143n778n702m940l463k337k120k253k146
57796B42908j790j231n22j63n14q74k39J082J794J526J217J586K332K971L357
$$ plain form
57781 253440 256816 259931 263253 267854 274042 280708 286610 291673 296396 300638 303846 306038 307775 309305
57767 309305 310409 310865 310576 309422 307431 304888 301972 298631 295076 291928 289547 287597 285597 283474 281383
57752 281383 279511 278260 277962 278130 277784 276841 276358 276921 277678 277602 276871 276179 275451 274190 272593 271386 270869
57735 270869 270919 271565 272818 274260 275550 277143 279746 283210 286600 289260 291298 293124 294952 296706 298167
57720 298167 299350 300792 302987 305417 306821 306760 306199 306098 306156 305584 304346 302797 300666 297379 293192 289109
57704 289109 285694 282528 278833 274226 269051 264267 260723 258232 255706 252539 249432 247413 246540 245995 245069
57689 245069 243633 241994 240712 240138 239872 239215 238427 238826 241228 245096 249776 255718 263818 274363 287598
57674 287598 304587 326419 353004 383605 418154 457044 499913 545514 592405 638626 680654
$$ packed form
57781B53440L376L115L322M601O188O666N902N063M723M242L208K192J737J530
57767C09305J104M56k89j154j991k543k916l341l555l148k381j950k000k123k091
57752B81383j872j251k98J68l46r43m83N63P57p6p31o92p28j261j597j207n17
57735B70869N0O46J253J442J290J593K603L464L390K660K038J826J828J754J461
57720B98167J183J442K195K430J404o1n61j01N8n72j238j549k131l287m187m083
57704B89109l415l166l695m607n175m784l544k491k526l167l107k019q73n45r26
57689B45069j436j639j282n74k66o57p88L99K402L868M680N942Q100J0545J3235
57674B87598J6989K1832K6585L0601L4549L8890M2869M5601M6891M6221M2028
$$ plain form
57663 680654 713581 732686 734895 719595 689098 648020 601263 552355 503799 458105 417416 382523
57651 382523 353222 329322 310396 294984 281318 268897 258422 250296 244080 239337 236000 233793
57639 233793 232186 231030 230454 230154 229645 229197 229588 230753 231593 231394 230661 230270 230404 230563 230025 228143 224818
57622 224818 220906 217633 215433 213832 212500 211716 211603 211551 210769 209033 206686 204278 202417 201583 201769 202454
57606 202454 202989 202901 201989 200456 198809 197377 196039 194654 193466 192668 191929 190818 189420 187961 186152 183557
57590 183557 180404 177401 174905 172850 171206 169883 168482 166856 165623 165271 165075 163863 161684 159604 157966
57575 157966 156080 153783 152029 151438 151319 150684 149391 147691 145463 142628 139736 137434 135702 134193 132990
57560 132990 132493 132759 133444 134295 135412 137038 139258 141857 144440 146769 148837 150448 151081 150634 149945 149936 150381
$$ packed form
57663F80654L2927J9105K209j5300l0497m1078m6757m8908m8556m5694m0689l4893
57651C82523k9301k3900j8926j5412j3666j2421j0475q126o216m743l337k207
57639B33793j607j156n76l00n09m48L91J165Q40j99p33l91J34J59n38j882l325
57622B24818l912l273k200j601j332p84j13n2p82j736k347k408j861q34J86O85
57606B02454N35q8r12j533j647j432j338j385j188p98p39j111j398j459j809k595
57590A83557l153l003k496k055j644j323j401j626j233l52j96j212k179k080j638
57575A57966j886k297j754n91j19o35j293j700k228k835k892k302j732j509j203
57560A32990m97K66O85Q51J117J626K220K599K583K329K068J611O33m47o89rM45
$$ plain form
57543 150381 150281 149335 148244 147565 147165 146966 147294 148124 148835 149200 149850 151151 152258 152032 150550 149005 148259
57526 148259 147992 147283 145734 143965 143089 143625 145020 146475 148026 150271 153161 155768 157380 158147 158480 158526
57510 158526 158585 159266 160709 162170 162903 163027 163044 162978 162622 162255 162336 162621 162217 160607 158203 155762 153577 151371
57492 151371 148845 146189 143960 142352 140753 138358 135225 132340 130537 129748 129489 129644 130417 131765 133212
57477 133212 134153 134170 133305 132128 131313 130915 130265 128751 126515 124254 122538 121474 120822 120222 119470 118719 118315
57460 118315 118334 118443 118238 117559 116413 114878 113157 111578 110389 109666 109385 109444 109677 109961 110200 110095 109248 107850
57442 107850 106915 107276 108521 109547 110010 110486 111222 111639 111393 111204 112093 114200 116768 118952 120417 121408 122477
57425 122477 123892 125199 125760 125699 125762 126141 126122 125215 123986 123233 122864 122256 121382 120902 121185 121799 122131 122201 122639
$$ packed form
57543A50381j00r46j091o79m00j99L28Q30P11L65O50J301J107k26j482j545p46
57526A48259k67p09j549j769q76N36J395J455J551K245K890K607J612P67L33M6
57510A58526N9O81J443J461P33J24J7o6l56l67Q1K85m04j610k404k441k185k206
57492A51371k526k656k229j608j599k395l133k885j803p89k59J55P73J348J447
57477A33212R41J7q65j177q15l98o50j514k236k261j716j064o52o00p52p51m04
57460A18315J9J09k05o79j146j535j721j579j189p23k81N9K33K84K39j05q47j398
57442A07850r35L61J245J026M63M76P36M17k46j89Q89K107K568K184J465R91J069
57425A22477J415J307N61o1O3L79j9r07j229p53l69o08q74m80K83O14L32P0M38
$$ plain form
57406 122639 123872 125437 126273 125825 124626 123524 122646 121613 120565 120163 120547 121026 121080 121007 121280 121921 122826
57389 122826 124110 125748 127341 128721 130304 132423 134775 136956 139067 141284 143251 144485 145127 145729 146469
57374 146469 146982 146775 145461 142906 139566 136419 134151 132596 131311 130376 130204 130835 131868 132909 133678 133943
57358 133943 133825 133943 134772 135990 136910 137426 138072 139243 140780 142300 143487 144067 143879 143105 142227 141633 141377
57341 141377 141218 140788 139809 138299 136554 134928 133776 133547 134534 136412 138328 139572 139931 139415 138204 136968
57325 136968 136596 137216 137969 138112 137879 137790 137643 136805 135232 133543 132216 131203 130272 129324 128419 127784 127669 127982
57307 127982 128285 128380 128604 129223 129879 130018 129647 129284 129390 130126 131406 132850 134013 134957 136256 138097 139802
57290 139802 140679 140905 141035 141118 140910 140613 140672 141054 141416 141882 142934 144679 146850 149453 152710 156286 159203
$$ packed form
57406A22639J233J565Q36m48j199j102q78j033j048m02L84M79N4p3K73O41R05
57389A22826J284J638J593J380J583K119K352K181K111K217J967J234O42O02P40
57374A46469N13k07j314k555l340l147k268j555j285r35j72O31J033J041P69K65
57358A33943j18J18Q29J218R20N16O46J171J537J520J187N80j88p74q78n94k56
57341A41377j59m30r79j510j745j626j152k29R87J878J916J244L59n16j211j236
57325A36968l72O20P53J43k33q9j47q38j573j689j327j013r31r48r05o35j15L13
57307A27982L03R5K24O19O56J39l71l63J06P36J280J444J163R44J299J841J705
57290A39802Q77K26J30Q3k08k97N9L82L62M66J052J745K171K603L257L576K917
$$ plain form
57273 159203 160720 160960 160640 160591 161478 163452 165902 167882 168931 169307 169514 169813 170117 170167 169906 169748 170158 170909
57255 170909 171284 171283 171922 173809 176060 177370 177606 177512 177361 176961 176687 177294 178657 179787 180286 180833 181965 183241
57237 183241 183975 184064 183801 183466 183410 183940 184805 185356 185450 185655 186312 186970 187096 186843 186780 187233 188216 189631 191290
57218 191290 193042 195058 197662 200752 203738 206187 208248 210360 212879 215966 219411 222557 224881 226670
57204 226670 228722 231416 234660 238622 243664 249393 254611 258592 261835 265227 269079 273305 277959 283154
57190 283154 288884 295274 302539 310423 318252 325851 333880 342854 352444 362184 372266 383003 394067
57177 394067 405002 416263 428994 443856 460564 478488 497215 516592 536716 557941 580651
57166 580651 604939 630625 657428 684996 712900 740739 768141 794771 820689 846595 873116
$$ packed form
57273A59203J517K40l20m9Q87J974K450J980J049L76K07K99L04N0k61j58M10P51
57255A70909L75jO39J887K251J310K36r4j51m00k74O07J363J130M99N47J132J276
57237A83241P34Q9k63l35n6N30Q65N51R4K05O57O58J26k53o3M53R83J415J659
57218A91290J752K016K604L090K986K449K061K112K519L087L445L146K324J789
57204B26670K052K694L244L962N042N729N218L981L243L392L852M226M654N195
57190B83154N730O390P265P884P829P599Q029Q974R590R740J0082J0737J1064
57177C94067J0935J1261J2731J4862J6708J7924J8727J9377K0124K1225K2710
57166E80651K4288K5686K6803K7568K7904K7839K7402K6630K5918K5906K6521
$$ plain form
57155 873116 899721 924994 948319 970649 993261 1016396 1039699 1063340 1087864 1113213 1138669
57144 1138669 1163691 1188224 1212389 1236516 1261471 1288250 1317083 1347313 1378307 1410140 1443296
57133 1443296 1477898 1513450 1549390 1586021 1624759 1667082 1713121 1761679 1811807 1863915 1919115
57122 1919115 1978061 2040853 2107638 2178757 2254658 2336175 2424628 2521184 2626307 2740186 2863324
57111 2863324 2996395 3140115 3295936 3466539 3655193 3865201 4100800 4368346 4676160
57102 4676160 5033916 5453192 5948183 6534594 7227433 8040045 8984512 10072082 11313739
57093 11313739 12721335 14307335 16081593 18047966 20204270 22543760 25053946 27714066
57085 27714066 30496079 33368937 36301989 39267802 42245484 45214021 48121390 50840720
$$ packed form
57155H73116K6605K5273K3325K2330K2612K3135K3303K3641K4524K5349K5456
57144A138669K5022K4533K4165K4127K4955K6779K8833L0230L0994L1833L3156
57133A443296L4602L5552L5940L6631L8738M2323M6039M8558N0128N2108N5200
57122A919115N8946O2792O6785P1119P5901Q1517Q8453R6556J05123J13879J23138
57111B863324J33071J43720J55821J70603J88654K10008K35599K67546L07814
57102D676160L57756M19276M94991N86411O92839Q12612R44467J087570J241657
57093A1313739J407596J586000J774258J966373K156304K339490K510186K660120
57085B7714066K782013K872858K933052K965813K977682K968537K907369K719330
$$ plain form
57077 50840720 53156149 54810492 55593013 55407475 54281987 52333846 49725811 46633605
57069 46633605 43224027 39641860 36007654 32422857 28973127 25726195 22729239 20009901
57061 20009901 17579139 15433498 13558065 11931156 10528496 9324824 8294258 7411571
57053 7411571 6653950 6001682 5437910 4948459 4521727 4148156 3819607 3529175 3271140
57044 3271140 3040694 2833744 2647044 2478207 2325358 2186996 2062193 1950533 1851585 1764690
57034 1764690 1689374 1625519 1572893 1530910 1499157 1477755 1466783 1465470 1471950 1482889 1492570 1492861
57022 1492861 1475697 1436779 1377395 1303063 1220606 1135852 1052726 973568 900037 833641 775352
57011 775352 724990 681496 643818 611216 582832 557597 534840 514652 497358 482845 470586
$$ packed form
57077E0840720K315429J654343P82521j85538j125488j948141k608035l092206
57069D6633605l409578l582167l634206l584797l449730l246932k996956k719338
57061B0009901k430762k145641j875433j626909j402660j203672j030566q82687
57053G411571p57621o52268n63772m89451m26732l73571l28549k90432k58035
57044C271140k30446k06950j86700j68837j52849j38362j24803j11660r8948q6895
57034A764690p5316o3855n2626m1983l1753k1402j0972j313O480J0939R681K91
57022A492861j7164l8918n9384p4332q2457q4754q3126p9158p3531o6396n8289
57011G75352n0362m3494l7678l2602k8384k5235k2757k0188j7294j4513j2259
$$ plain form
57000 470586 460069 451002 443234 436706 431405 427193 423692 420449 417250 414270 411947 410637 410374 411054
56986 411054 412808 415872 419955 424038 427152 429068 429750 428430 423878 415659 404545 391612 377565 363167
56972 363167 349668 338197 328969 321468 315259 310364 307122 306067 307777 312444 319609 328490 338496
56959 338496 349290 360622 372341 384285 395698 404853 409692 408994 402825 392089 378065 362293
56947 362293 346321 331211 317497 305683 296414 289907 285560 282652 281370 282730 287433 295176 305201
56934 305201 317159 331121 347059 364625 383169 401438 417289 428311 432884 430373 420497 403397
56922 403397 380683 355590 331201 308640 287476 267498 249358 233704 220561 209701 200928 193805
56910 193805 187697 182338 177926 174461 171495 168738 166428 164825 163776 163139 163254 164638 167406 171269 175944
$$ packed form
57000D70586j0517r067p768o528n301m212l501l243l199k980k323j310k63O80
56986D11054J754L064M083M083L114J916O82j320m552q219j1114j2933j4047j4398
56972C63167j3499j1471r228p501o209m895l242j055J710M667P165Q881J0006
56959C38496J0794J1332J1719J1944J1413R155M839o98o169j0736j4024j5772
56947C62293j5972j5110j3714j1814r269o507m347k908j282J360M703P743J0025
56934C05201J1958J3962J5938J7566J8544J8269J5851J1022M573k511r876j7100
56922D03397k2714k5093k4389k2561k1164j9978j8140j5654j3143j0860q773p123
56910A93805o108n359m412l465k966k757k310j603j049o37J15J384K768L863M675
$$ plain form
56895 175944 181419 188054 196500 207154 219587 232895 246804 261860 278322 295390 311960 327583
56883 327583 342060 354463 363238 367190 365938 359753 349644 337569 325803 315848 308158 302868 300356
56870 300356 301120 305653 314531 328171 346333 368235 393424 422265 455320 492393 532323 573411
56858 573411 613662 650558 680909 701338 709376 704463 688124 663277 633320 601614 571275 544864
56846 544864 524034 509452 501188 499326 504418 517385 538874 568746 606378 651351 703478 761990
56834 761990 825041 890062 954035 1012911 1061124 1092538 1102521 1089559 1055521 1004961 943956 878735
56822 878735 814511 755005 702484 657972 621591 593255 573299 562376 560790 568125 583627 606856
56810 606856 637751 675832 719237 764709 808699 848248 880435 901402 907037 895303 867529 827172
$$ packed form
56895A75944N475O635Q446J0654J2433J3308J3909J5056J6462J7068J6570J5623
56883C27583J4477J2403Q775L952j252o185j0109j2075j1766r955p690n290k512
56870C00356P64M533Q878J3640J8162K1902K5189K8841L3055L7073L9930M1088
56858E73411M0251L6896L0351K0429Q038m913j6339k4847k9957l1706l0339k6411
56846E44864k0830j4582q264j862N092J2967K1489K9872L7632M4973N2127N8512
56834G61990O3051O5021O3973N8876M8213L1414R983j2962l4038n0560o1005o5221
56822H78735o4224n9506n2521m4512l6381k8336j9956j0923j586P335J5502K3229
56810F06856L0895L8081M3405M5472M3990L9549L2187K0967N635j1734k7774m0357
$$ plain form
56798 827172 777914 723359 667639 614845 567545 526448 491619 463353 441768 426349 416461 412051
56786 412051 413403 420405 432346 448335 467585 489243 512010 533947 552566 565210 569555 564092
56774 564092 548616 524504 494351 460945 426403 392194 359656 330055 304071 281496 261596
56763 261596 243775 227927 214306 203071 193895 186058 178903 172172 165897 160213 155347 151536 148727
56750 148727 146506 144482 142554 140657 138536 136077 133655 131755 130410 129342 128546 128348 128854 129701 130396
56735 130396 130634 130282 129401 128427 128035 128572 129683 130609 130882 130680 130545 130785 131273 131853 132763 134392 136705 139194
56717 139194 141366 142970 143789 143723 143187 142918 143185 143595 143847 144088 144251 143735 142286 140727 140208 140998 142550
56700 142550 144382 146318 148151 149657 150773 151354 151146 150530 150764 152699 155531 157677 158627 159050 159312 159047
$$ packed form
56798H27172m9258n4555n5720n2794m7300m1097l4829k8266k1585j5419r888m410
56786D12051J352P002J1941J5989J9250K1658K2767K1937J8619J2644M345n463
56774E64092j5476k4112l0153l3406l4542l4209l2538k9601k5984k2575j9900
56763B61596j7821j5848j3621j1235r176p837p155o731o275n684m866l811k809
56750A48727k221k024j928j897k121k459k422j900j345j068p96j98N06Q47O95
56735A30396K38l52q81r74l92N37J111R26K73k02j35K40M88N80R10J629K313K489
56717A39194K172J604Q19o6n36k69K67M10K52K41J63n16j449j559n19P90J552
56700A42550J832J936J833J506J116N81k08o16K34J935K832K146R50M23K62k65
$$ plain form
56684 159047 158315 158088 159130 161066 162969 164300 164999 165237 165411 165909 166597 166927 166726 166452 166493 166702 166822 166909
56666 166909 167114 167421 167782 168174 168416 168323 168106 168182 168532 168716 168630 168699 169189 169819 170268 170625 171100 171695 172309 172817
56646 172817 173006 172821 172633 172720 172565 171430 169697 168787 169347 170309 170215 168949 167660 167443 168482 170072 171061
56629 171061 170691 169380 168348 168251 168620 168782 168690 168498 168014 167199 166692 167165 168364 169260 169006 167455 165135 163031
56611 163031 161983 161874 161759 161104 160415 160216 159998 158907 157152 155981 156284 157733 159286 160139 160198 159956 159977
56594 159977 160398 160989 161665 162527 163382 163747 163618 163705 164533 165740 166688 167352 168107 169017 169809 170391 170902 171400 171831
56575 171831 172238 172791 173743 175410 177854 180569 182983 185321 188386 192317 196400 200396 205146 211278 218195
56560 218195 225100 232273 240370 248990 256984 263821 269705 274500 277485 278201 276867 274060 270531 267114
$$ packed form
56684A59047p32k27J042J936J903J331O99K38J74M98O88L30k01k74M1K09J20Q7
56666A66909K05L07L61L92K42r3k17P6L50J84q6O9M90O30M49L57M75N95O14N08
56646A72817J89j85j88Q7j55j135j733r10N60R62r4j266j289k17J039J590R89
56629A71061l70j311j032r7L69J62r2j92m84q15n07M73J199Q96k54j551k320k104
56611A63031j048j09j15o55o89j99k18j091j755j171L03J449J553Q53N9k42K1
56594A59977M21N91O76Q62Q55L65j29Q7Q28J207R48O64P55R10P92N82N11M98M31
56575A71831M07N53R52J667K444K715K414K338L065L931M083L996M750O132O917
56560B18195O905P173Q097Q620P994O837N884M795K985P16j334k807l529l417
$$ plain form
56546 267114 264164 261293 258240 255653 254249 253556 252400 250404 248052 245440 242086 238117 234616 232395
56532 232395 231135 230003 228508 226550 224276 222202 220914 220385 220004 219427 218908 218637 218293 217473 216152 214521
56516 214521 212772 211214 210232 209894 209883 209878 209651 208819 206997 204414 201952 200340 199554 199145 198886 198908 199362 200052
56498 200052 200369 199704 198080 196280 195130 194806 194944 195180 195318 195280 195256 195640 196503 197438 198261 199393 201044 202511
56480 202511 202949 202487 201881 201393 200899 200821 201935 204166 206468 208002 208766 209012 208823 208393 208002 207592 206984 206563
56462 206563 206948 207849 208059 206906 205058 203587 202832 202441 202030 201492 201088 201417 202852 204956 206908 208518
56446 208518 210195 211950 213272 214140 215310 217144 218893 219648 219494 219248 219475 220169 221009 221515 221252 220242
56430 220242 219033 218203 218000 218388 219076 219494 219245 218642 218367 218607 219081 219820 221139 222710 223495 222930 221546
$$ packed form
56546B67114k950k871l053k587j404o93j156j996k352k612l354l969l501k221
56532B32395j260j132j495j958k274k074j288n29l81n77n19k71l44q20j321j631
56516B14521j749j558r82l38j1nk27q32j822k583k462j612p86m09k59K2M54O90
56498B00052L17o65j624j800j150l24J38K36J38l8k4L84Q63R35Q23J132J651J467
56480B02511M38m62o06m88m94p8J114K231K302J534P64K46j89m30l91m10o08m21
56462B06563L85R01K10j153j848j471p55l91m11n38m04L29J435K104J952J610
56446B08518J677J755J322Q68J170J834J749P55j54k46K27O94Q40N06k63j010
56430B20242j209q30k03L88O88M18k49o03k75K40M74P39J319J571P85n65j384
$$ plain form
56413 221546 220114 218869 217922 217718 218540 219973 221320 222251 222753 222861 222725 222602 222579 222624 222978 223955 225249 226076
56395 226076 226226 226412 227282 228609 229720 230338 230771 231685 233673 236522 239014 240148 240504 241501 243389 245077
56379 245077 246052 247103 248675 249948 250309 250515 251306 251916 251203 249494 248085 247451 247197 247353 248421 250238
56363 250238 251962 253297 254896 257381 260605 263910 266560 268011 268393 268711 269989 272174 274288 275555 276008
56348 276008 276163 276551 277419 278456 278947 278615 278135 278415 279594 281144 282688 284267 286035 288219 291221 295239
56332 295239 299889 304555 308968 313112 316831 319983 322741 325368 327843 330059 332148 334218 336043 337323
56318 337323 338030 338157 337547 336408 335682 336331 338391 341113 343787 346078 347899 349459 351303 353851 356967
56303 356967 360275 363748 367733 372546 378232 384469 390606 396110 401125 406226 411627 417134 422879 429362
$$ packed form
56413B21546j432j245r47k04Q22J433J347R31N02J08j36j23k3M5L54R77J294Q27
56395B26076J50J86Q70J327J111O18M33R14J988K849K492J134L56R97J888J688
56379B45077R75J051J572J273L61K06P91O10p13j709j409o34k54J56J068J817
56363B50238J724J335J599K485L224L305K650J451L82L18J278K185K114J267M53
56348B76008J55L88Q68J037M91l32m80K80J179J550J544J579J768K184L002M018
56332B95239M650M666M413M144L719L152K758K627K475K216K089K070J825J280
56318C37323P07J27o10j139p26O49K060K722K674K291J821J560J844K548L116
56303C56967L308L473L985M813N686O237O137N504N015N101N401N507N745O483
$$ plain form
56289 429362 436584 443963 451358 459317 467903 476246 483834 491414 499995 509759 520539 532423 545130
56276 545130 557779 570280 584055 600243 617984 635775 653907 674180 697543 723366 750921
56265 750921 780345 812178 847042 885839 929375 977772 1030967 1089614 1154777 1227097 1307181
56254 1307181 1396485 1496712 1608471 1731478 1865892 2012346 2170693 2339696 2517996 2704425
56244 2704425 2897259 3093911 3291283 3485627 3672155 3845753 4002148 4137789 4248943
56235 4248943 4331993 4384616 4405857 4395215 4352730 4279997 4180139 4056698 3913294 3754143 3583781
56224 3583781 3406129 3224506 3042352 2862893 2688119 2519082 2357171 2204100 2060738
56215 2060738 1927035 1803121 1689362 1585310 1489794 1402195 1322553 1250320 1184209 1123521
$$ packed form
56289D29362P222P379P395P959Q586Q343P588P580Q581R764J0780J1884J2707
56276E45130J2649J2501J3775J6188J7741J7791J8132K0273K3363K5823K7555
56265G50921K9424L1833L4864L8797M3536M8397N3195N8647O5163P2320Q0084
56254A307181Q9304J00227J11759J23007J34414J46454J58347J69003J78300J86429
56244B704425J92834J96652J97372J94344J86528J73598J56395J35641J11154
56235D248943Q3050N2623K1241j0642m2485p2733r9858j23441j43404j59151j70362
56224C583781j77652j81623j82154j79459j74774j69037j61911j53071j43362
56215B060738j33703j23914j13759j04052r5516q7599p9642p2233o6111o0688
$$ plain form
56205 1123521 1068483 1019000 974228 933713 897746 866086 837430 810756 786285 764518 745173
56194 745173 727623 711635 697127 683812 671613 660860 651726 643937 637245 631551 626431 621250 615976
56181 615976 611219 607318 604090 601560 600083 599543 599285 599057 599239 599926 600603 601017 601550 602521 603875 605725
56165 605725 608390 611710 615215 619126 624257 630742 637877 645496 654421 665120 676934 689252 702560
56152 702560 717794 735310 754981 776729 800643 827206 857598 893106 934126 980547 1033071
56141 1033071 1092907 1159844 1231716 1306176 1381861 1457285 1529754 1596338 1655370 1706497 1750051
56130 1750051 1787004 1818865 1846774 1870809 1890302 1904426 1912455 1914144 1910026 1900789 1886489 1867073
56118 1867073 1843337 1816099 1784321 1745277 1696968 1639668 1575249 1506269 1435900 1367315 1302518
$$ packed form
56205A123521n5038m9483m4772m0515l5967l1660k8656k6674k4471k1767j9345
56194G45173j7550j5988j4508j3315j2199j0753r134p789o692n694n120n181n274
56181F15976m757l901l228k530j477n40k58k28J82O87O77M14N33R71J354J850
56165F05725K665L320L505L911N131O485P135P619Q925J0699J1814J2318J3308
56152G02560J5234J7516J9671K1748K3914K6563L0392L5508M1020M6421N2524
56141A033071N9836O6937P1872P4460P5685P5424P2469O6584N9032N1127M3554
56130A750051L6953L1861K7909K4035J9493J4124Q029J689m118r237j4300j9416
56118A867073k3736k7238l1778l9044m8309n7300o4419o8980p0369o8585o4797
$$ plain form
56107 1302518 1242443 1188166 1140864 1100566 1066307 1037709 1015075 997797 984178 973192 964981
56096 964981 959301 955025 951670 949898 949972 951177 953233 956694 961359 965888 969749 974036 979617 986000 992786
56081 992786 1000699 1010248 1020766 1031661 1043283 1055758 1068344 1080710 1093433 1106506 1118875 1130287
56069 1130287 1142047 1155086 1168839 1182835 1197745 1213940 1230667 1247630 1265660 1284838 1303738
56058 1303738 1321673 1339849 1359096 1378339 1396688 1415175 1434822 1454664 1473405 1491520 1510128
56047 1510128 1529179 1548296 1568085 1589118 1610894 1633065 1656297 1680695 1704972 1728485 1752427
56036 1752427 1777742 1803650 1829648 1856980 1886467 1916688 1946142 1975627 2006834 2040224 2075870
56025 2075870 2114627 2156901 2201880 2249320 2300094 2353822 2408436 2463653 2522120 2585265 2650853
$$ packed form
56107A302518o0075n4277m7302m0298l4259k8598k2634j7278j3619j0986q211
56096I64981n680m276l355j772P4J205K056L461M665M529L861M287N581O383O786
56081I92786P913R549J0518J0895J1622J2475J2586J2366J2723J3073J2369J1412
56069A130287J1760J3039J3753J3996J4910J6195J6727J6963J8030J9178J8900
56058A303738J7935J8176J9247J9243J8349J8487J9647J9842J8741J8115J8608
56047A510128J9051J9117J9789K1033K1776K2171K3232K4398K4277K3513K3942
56036A752427K5315K5908K5998K7332K9487L0221K9454K9485L1207L3390L5646
56025B075870L8757M2274M4979M7440N0774N3728N4614N5217N8467O3145O5588
$$ plain form
56014 2650853 2716827 2784685 2856556 2931854 3009705 3091856 3179912 3272127 3366263 3463459 3566070
56003 3566070 3673900 3785837 3903130 4027693 4159115 4296586 4441762 4596584 4760344
55994 4760344 4931935 5112718 5304219 5505792 5717875 5944589 6189524 6452006 6731360
55985 6731360 7031589 7357653 7710507 8090330 8501266 8948251 9432738 9956891 10528612
55976 10528612 11157288 11848389 12607954 13448608 14385500 15431030 16600658 17920033 19420208
55967 19420208 21131802 23092892 25358952 27997849 31081083 34688450 38914054 43857639
55959 43857639 49619229 56317913 64112629 73195820 83779586 96103741 110438640 127043072
55951 127043072 146106478 167722971 191856957 218228654 246162755 274514350 301668537
$$ packed form
56014B650853O5974O7858P1871P5298P7851Q2151Q8056R2215R4136R7196J02611
56003C566070J07830J11937J17293J24563J31422J37471J45176J54822J63760
55994D760344J71591J80783J91501K01573K12083K26714K44935K62482K79354
55985F731360L00229L26064L52854L79823M10936M46985M84487N24153N71721
55976A0528612O28676O91101P59565Q40654R36892J045530J169628J319375J500175
55967A9420208J711594J961090K266060K638897L083234L607367M225604M943585
55959D3857639N761590O698684P794716R083191J0583766J2324155J4334899J6604432
55951A27043072J9063406K1616493K4133986K6371697K7934101K8351595K7154187
$$ plain form
55944 301668537 325526131 343568167 353277589 352956394 342467343 323318743 298031521
55937 298031521 269292661 239399430 210082223 182521696 157425716 135137978 115746232
55930 115746232 99151128 85113309 73317554 63439867 55178824 48258528 42437067
55923 42437067 37519087 33349551 29796384 26747323 24116587 21839360 19858331 18122550
55915 18122550 16594872 15249062 14059550 13001163 12056158 11212504 10456049 9771550 9149897
55906 9149897 8586857 8075516 7606594 7175038 6779556 6416167 6078425 5763594 5472637
55897 5472637 5204210 4954005 4719913 4502720 4301643 4113815 3938246 3776056 3626787
55888 3626787 3488303 3360001 3242308 3133437 3030408 2932877 2842204 2757093 2673834 2590607
$$ packed form
55944C01668537K3857594J8042036R709422l21195j0489051j9148600k5287222
55937B98031521k8738860k9893231k9317207k7560527k5095980k2287738j9391746
55930A15746232j6595104j4037819j1795755r877687q261043o920296n821461
55923D2437067m917980m169536l553167l049061k630736k277227j981029j735781
55915A8122550j527678j345810j189512j058387r45005q43654p56455o84499o21653
55906I149897n63040n11341m68922m31556l95482l63389l37742l14831k90957
55897E472637k68427k50205k34092k17193k01077j87828j75569j62190j49269
55888C626787j38484j28302j17693j08871j03029r7531r0673q5111q3259q3227
$$ plain form
55878 2590607 2508121 2426439 2344745 2264021 2186460 2112226 2039809 1969394 1902818 1840375 1780666
55867 1780666 1723449 1669815 1619880 1573043 1530100 1492101 1457435 1423052 1388419 1355405 1324467
55856 1324467 1293876 1262737 1231907 1201752 1171608 1141666 1112982 1085453 1057927 1030245 1003062
55845 1003062 975996 948285 920888 895548 872061 848971 826590 806625 789030 772018 755254
55834 755254 740224 727195 714561 701693 689881 679845 670616 661545 653258 645907 638439 630233 621806
55821 621806 613384 604363 594490 584147 573381 562226 551791 543275 536034 528495 520752 514253 509235
55808 509235 504708 500786 498495 497276 495389 493069 492607 494718 497480 499633 502324 506512 511115 515059
55794 515059 518938 523149 526328 527189 526359 524952 522748 519159 514692 510107 505271 499956 494647 489357 482768
$$ packed form
55878B590607q2486q1682q1694q0724p7561p4234p2417p0415o6576o2443n9709
55867A780666n7217n3634m9935m6837m2943l7999l4666l4383l4633l3014l0938
55856A324467l0591l1139l0830l0155l0144k9942k8684k7529k7526k7682k7183
55845A003062k7066k7711k7397k5340k3487k3090k2381j9965j7595j7012j6764
55834G55254j5030j3029j2634j2868j1812j0036r229r071q287p351p468q206q427
55821F21806q422r021r873j0343j0766j1155j0435q516p241p539p743o499n018
55808E09235m527l922k291j219j887k320m62K111K762K153K691M188M603L944
55794E15059L879M211L179Q61q30j407k204l589m467m585m836n315n309n290o589
$$ plain form
55779 482768 473784 463124 452390 442445 433715 427169 423762 423386 425254 428875 433894 439440 444232 447014
55765 447014 446665 442566 435261 426182 416471 406597 397009 388172 379800 371069 361868 352884 344305 335533
55751 335533 326391 317455 308895 300132 291000 282160 274071 266709 260622 256847 255292 254496 253597 253307 254256
55736 254256 255630 256254 255915 254782 252598 249365 245948 243087 240535 237796 234868 231625 227463 222354 217402
55721 217402 213457 210017 206381 203098 201277 201023 201511 202214 203244 204837 207199 210598 214976 219682 223957
55706 223957 227395 229725 230692 230470 229561 227957 225022 220554 215288 209973 204626 199130 193850 189126 184736
55691 184736 180388 176239 172567 169489 167306 166462 166831 167722 168928 171020 174210 177726 180834 183710 186759
55676 186759 189744 192161 193903 195014 195342 194918 194108 192952 190916 187730 183941 180329 177393 175611 175366
$$ packed form
55779D82768q984j0660j0734r945q730o546l407l76J868L621N019N546M792K782
55765D47014l49m099p305r079r711r874r588q837q372q731r201q984q579q772
55751C35533r142q936q560q763r132q840q089p362o087l775j555p96q99k90R49
55736B54256J374O24l39j133k184l233l417k861k552k739k928l243m162n109m952
55721B17402l945l440l636l283j821k54M88P03J030J593K362L399M378M706M275
55706B23957L438K330R67k22r09j604k935m468n266n315n347n496n280m724m390
55691A84736m348m149l672l078k183q44L69Q91J206K092L190L516L108K876L049
55676A86759K985K417J742J111L28m24q10j156k036l186l789l612k936j782k45
$$ plain form
55661 175366 176230 177137 177747 178800 180733 182865 184506 185948 187730 189796 192073 194986 198515 201575 203301
55646 203301 204279 205540 206904 207283 206163 203806 200352 195748 190393 184981 179686 174163 168303 162476 157127
55631 157127 152499 148592 145071 141529 138126 135612 134411 134043 133804 133537 133428 133481 133553 133508 133111 132228 131308
55614 131308 130987 131052 130572 129244 127711 126206 123989 120709 117271 114585 112370 110057 107951 106551 105519
55599 105519 104373 103540 103599 104039 103824 102810 101633 100610 99726 99264 99433 99653 99217 98443 98200 98528 98682 98428
55581 98428 98400 99167 100686 102592 104380 105517 106064 107019 109348 112862 116606 120057 123236 126020 128190 129966
55565 129966 131690 133162 134002 134396 134659 134335 132640 129698 126504 123710 121243 119025 117186 115525 113611
55550 113611 111520 109788 108476 106914 104572 101685 98972 97097 96394 96616 97029 97112 97081 97389 98008 98616 99135
$$ packed form
55661A75366Q64R07O10J053J933K132J641J442J782K066K277K913L529L060J726
55646B03301R78J261J364L79j120k357l454m604n355n412n295n523n860n827n349
55631A57127m628l907l521l542l403k514j201l68k39k67j09N3P2m5l97q83r20
55614A31308l21O5m80j328j533j505k217l280l438k686k215k313k106j400j032
55599A05519j146q33N9M40k15j014j177j023q84m62J69K20m36p74k43L28J54k54
55581I8428k8P67J519J906J788J137N47R55K329L514L744L451L179K784K170J776
55565A29966J724J472Q40L94K63l24j695k942l194k794k467k218j839j661j914
55550A13611k091j732j312j562k342k887k713j875p03K22M13Q3l1L08O19O08N19
$$ plain form
55533 99135 99542 99508 98838 98018 97672 97743 97796 97779 97850 97842 97603 97433 97363 96462 93894 90330 87276 85223 83551 82088
55513 82088 81487 81903 82463 82410 81878 81253 80545 79680 78747 77771 76824 76355 76645 77008 76429 75033 73960 73662 73339
55494 73339 72354 71221 70742 70993 71652 72594 73709 74714 75553 76435 77227 77451 77173 77209 78040 79144 79765 79758 79335
55475 79335 78600 77743 77101 76657 76009 75168 74786 75187 75803 76002 75821 75443 74654 73437 72495 72426 72868 73199 73684
55456 73684 75043 77081 78615 78806 77963 76943 76303 76105 76122 76084 75971 76059 76434 76601 75925 74420 72785 71703
55438 71703 71416 71920 73104 74568 75701 76224 76470 76879 77356 77414 76931 76409 76360 76641 76681 76243 75601 75032 74460
55419 74460 73786 73214 73044 73421 74454 76275 78740 81347 83774 86173 88579 90361 90770 89855 88334 86729
55403 86729 85144 83764 82930 82626 82367 81685 80360 78304 75711 73312 71926 71632 71821 72094 72604 73436 74207
$$ packed form
55533I9135M07l4o70q20l46P1N3j7P1qk39j70p0r01k568l564l054k053j672j463
55513H2088o01M16N60n3n32o25p08q65r33r76r47m69K90L63n79j396j073k98l23
55494G3339r85j133m79K51O59R42J115J005Q39Q82P92K24k78L6Q31J104O21pm23
55475G9335p35q57o42m44o48q41l82M01O16J99j81l78p89j217r42o9M42L31M85
55456G3684J359K038J534J91q43j020o40j98J7l8j13Q8L75J67o76j505j635j082
55438G1703k87N04J184J464J133N23K46M09M77N8m83n22m9K81M0m38o42n69n72
55419G4460o74n72j70L77J033J821K465K607K427K399K406J782M09r15j521j605
55403H6729j585j380q34l04k59o82j325k056k593k399j386k94J89K73N10Q32P71
$$ plain form
55386 74207 74532 74497 74504 74948 76103 77885 79574 80186 79398 77828 76325 75275 74705 74588 74827 75197 75546 75886
55368 75886 76196 76351 76243 75796 74928 73797 72938 72713 72666 71975 70587 69409 69211 69757 70180 69884 68922 67902
55350 67902 67675 68762 70865 73094 74702 75405 75215 74448 73795 73749 73947 73577 72516 71467 70949 70796 70788 71074
55332 71074 71670 72187 72441 72804 73582 74490 75157 75670 76216 76543 76242 75312 74115 73007 72306 72346 73202 74500
55314 74500 75708 76459 76571 76070 75373 75082 75402 75982 76390 76431 76013 75180 74359 74060 74257 74591 75239 76776 78927
55295 78927 80342 80211 79414 79412 80490 81809 82709 83093 82805 81560 79690 78277 78180 79117 79885 79456 77916 76395
55277 76395 75987 76714 77734 78401 78671 78504 77608 76066 74661 74113 74390 75073 75857 76336 75936 74708 73708
55260 73708 73850 74707 75120 74794 74568 75213 76613 78086 78946 78750 77569 76103 75159 74946 75117 75349 75471 75256
$$ packed form
55386G4207L25l5PM44J155J782J689O12p88j570j503j050n70j17K39L70L49L40
55368G5886L10J55j08m47q68j131q59k25m7o91j388j178j98N46M23k96r62j020
55350F7902k27J087K103K229J608P03j90p67o53m6J98l70j061j049n18j53qK86
55332G1074N96N17K54L63P78R08O67N13N46L27l01r30j197j108p01M0Q56J298
55314G4500J208P51J12n01o97k91L20N80M08M1m18q33q21k99J97L34O48J537K151
55295G8927J415j31p97kJ078J319R00L84k88j245j870j413r7R37P68m29j540j521
55277G6395m08P27J020O67K70j67q96j542j405n48K77O83P84M79m00j228j000
55260G3708J42Q57M13l26k26O45J400J473Q60j96j181j466r44k13J71K32J22k15
$$ plain form
55242 75256 74627 74009 73946 74367 74710 74771 74863 75119 75178 74760 74099 73500 72881 72090 71394 71272 71786 72433 72703 72652 72846
55221 72846 73689 74904 75705 75506 74317 72569 70787 69506 69146 69718 70797 71983 73213 74521 75714 76525
55205 76525 76848 76678 76088 75495 75576 76511 77562 77788 77101 76189 75617 75402 75374 75432 75457 75400 75521 76150 77118 77838
55185 77838 78068 78245 78824 79610 80023 79874 79573 79585 79955 80480 81158 82221 83708 85272 86537 87430 87902 87553
55167 87553 86050 83898 82242 81729 81936 82119 82038 81790 81315 80672 80484 81455 83409 85251 86008 85665 84994 84778
55149 84778 85176 85633 85412 84333 82957 82022 81869 82417 83296 83818 83245 81549 79672 78616 78482 78750 79198
55132 79198 79937 80710 80881 80287 79585 79506 80115 80942 81563 81864 82008 82272 82691 82813 82078 80670 79637 79866 81090
55113 81090 82239 82744 83119 84078 85436 86284 86179 85696 85629 86033 86478 86940 87870 89399 91041 92343 93363
$$ packed form
55242G5256o29o18o3M21L43O1R2K56N9m18o61n99o19p91o96j22N14O47K70n1J94
55221G2846Q43J215Q01j99j189j748j782j281l60N72J079J186J230J308J193Q11
55205G6525L23j70n90n93Q1R35J051K26o87r12n72k15k8N8K5n7J21O29R68P20
55185G7838K30J77N79P86M13j49l01J2L70N25O78J063J487J564J265Q93M72l49
55167H7553j503k152j656n13K07J83q1k48m75o43j88R71J954J842P57l43o71k16
55149H4778L98M57k21j079j376r35j53N48Q79N22n73j696j877j056j34K68M48
55132G9198P39P73J71n94p02p9O09Q27O21L01J44K64M19J22p35j408j033K29J224
55113H1090J149N05L75R59J358Q48j05m83o7M04M45M62R30J529J642J302J020
$$ plain form
55096 93363 94291 95014 95306 95125 94410 92949 90779 88512 86949 86529 87265 88927 91024 92988 94675 96432
55080 96432 98401 100094 100973 101131 100994 100706 100254 99911 99952 100177 100242 100364 101086 102384 103560 104062 103936 103376
55062 103376 102354 100888 99373 98387 98308 99081 100155 100734 100389 99482 98708 98270 97750 96740 95292 93694 92186
55045 92186 91005 90436 90565 91076 91413 91204 90533 89859 89585 89675 89771 89662 89488 89466 89648 89965 90238 90152 89589 89051
55025 89051 89259 90192 91024 91291 91504 92235 93157 93607 93605 93646 93762 93566 93048 92654 92616 92744 92823 92706 92164 91199 90363
55004 90363 90221 90588 90867 90984 91293 91692 91586 90831 90033 89707 89786 90090 90716 91656 92563 93134 93411 93505 93428 93331
54984 93331 93515 94074 94827 95724 96950 98529 100126 101292 101691 101210 100260 99809 100591 102311 104062 105388 106280
54967 106280 106419 105371 103671 102660 102882 103461 103580 103711 104716 106401 107822 108640 109306 110065 110500 110100 108788
$$ packed form
55096I3363R28P23K92j81p15j461k170k267j563m20P36J662K097J964J687J757
55080I6432J969J693Q79J58j37k88m52l43M1K25O5J22P22J298J176N02j26n60
55062A03376j022j466j515r86p9P73J074N79l45r07p74m38n20j010j448j598j508
55045I2186j181n69J29N11L37k09o71o74k74R0R6j09j74k2J82L17K73q6n63n38
55025H9051K08R33Q32K67K13P31R22M50kM1J16j96n18l94l8J28P9j17n42r65q36
55004I0363j42L67K79J17L09L99j06p55p98l26P9L04O26R40R07N71K77R4p7r7
54984I3331J84N59P53Q97J226J579J597J166L99m81r50m51P82J720J751J326Q92
54967A06280J39j048j700j011K22N79J19J31J005J685J421Q18O66P59M35m00j312
$$ plain form
54950 108788 106877 104895 103420 102693 102335 101738 100754 99778 99208 99059 99090 99122 99164 99375 99884 100674 101689 103009
54932 103009 104678 106367 107525 108063 108572 109618 111004 112034 112397 112589 113515 115881 119867 125083 130768
54917 130768 136223 141207 145902 150444 154573 157837 160074 161439 161844 160700 157622 153272 148945 145189
54903 145189 141427 137191 133024 129597 126558 123130 119573 117064 116088 115826 115364 114761 114516 114622 114641 114419
54887 114419 114305 114784 116091 118025 120021 121570 122645 123582 124679 126189 128557 132173 136882 142138 147562
54872 147562 152934 157717 161258 163532 165048 165910 165601 163920 161499 158981 156224 152689 148244 143231 138101
54857 138101 133305 129204 125765 122610 119554 116750 114186 111492 108572 105946 104101 102833 101620 100360
54843 100360 99348 98757 98482 98319 98009 97285 96152 95043 94567 95183 96967 99361 101304 102138 102428 103240 104501
$$ packed form
54950A08788j911j982j475p27l58n97r84r76n70j49L1L2M2K11N09P90J015J320
54932A03009J669J689J158N38N09J046J386J030L63J92R26K366L986N216N685
54917A30768N455M984M695M542M129L264K237J365M05j144l078m350m327l756
54903A45189l762m236m167l427l039l428l557k509r76k62m62o03k45J06J9k22
54887A14419j14M79J307J934J996J549J075R37J097J510K368L616M709N256N424
54872A47562N372M783L541K274J516Q62l09j681k421k518k757l535m445n013n130
54857A38101m796m101l439l155l056k804k564k694k920k626j845j268j213j260
54843A00360j012n91k75j63l10p24j133j109m76O16J784K394J943Q34K90Q12J261
$$ plain form
54826 104501 104915 103832 102420 102304 103609 105031 105514 105110 104386 103660 102936 102154 101383 100864 100830 101180 101600 102051
54808 102051 102781 103711 104282 104221 104047 104459 105468 106481 106985 106926 106708 107005 108166 109576 110050 109145 107601 106285
54790 106285 105291 104462 104081 104363 104798 104768 104514 104809 105893 107340 108765 110072 111182 112088 113061 114340 115758
54773 115758 117089 118480 120092 121663 123034 124804 127793 132080 137133 142617 148388 153921 158620 162683
54759 162683 166875 171355 175325 177891 178643 177425 174338 170185 166174 162783 159304 154804 149256 143583
54745 143583 138858 135562 133333 131356 129263 127572 126965 127263 127591 127455 127113 126872 126626 126210 125721 125285 124969
54728 124969 125101 126236 128521 131412 134241 136802 139275 141817 144486 147375 150682 154655 159351 164255
54714 164255 168292 170578 171121 170489 168942 166347 162856 159071 155389 151666 147733 143838 140330 137221 134317
$$ packed form
54826A04501M14j083j412j16J305J422M83m04p24p26p24p82p71n19l4L50M20M51
54808A02051P30R30N71o1j74M12J009J013N04n9k18K97J161J410M74r05j544j316
54790A06285r94q29l81K82M35l0k54K95J084J447J425J307J110R06R73J279J418
54773A15758J331J391J612J571J371J770K989M287N053N484N771N533M699M063
54759A62683M192M480L970K566P52j218l087m153m011l391l479m500n548n673
54745A43583m725l296k229j977k093j691o07K98L28j36l42k41k46m16m89m36l16
54728A24969J32J135K285K891K829K561K473K542K669K889L307L973M696M904
54714A64255M037K286N43o32j547k595l491l785l682l723l933l895l508l109k904
$$ plain form
54699 134317 131541 128936 126533 124408 122682 121316 120008 118441 116576 114699 113251 112544 112476 112555 112354 111896
54683 111896 111467 111182 110906 110508 109979 109476 109324 109736 110264 109967 108552 107017 106576 107198 107844 107965 107948 108119
54665 108119 108208 108086 108242 109005 109878 110162 109927 109790 109995 110189 110068 109801 109707 109777 109725 109453 109317 109751 110642 111317
54645 111317 111348 111114 111276 111855 112202 111839 111006 110380 110441 111100 111719 111617 110768 109821 109247 108809 108182 107630 107433
54626 107433 107096 105985 104597 104167 104933 105772 105822 105535 105642 105928 105776 105325 105305 105965 106821 107373 107522 107331 106838
54607 106838 106179 105604 105292 105231 105273 105255 105161 105120 105117 104861 104271 103948 104590 105932 106840 106689 106031 105635 105472 105166 104927
54586 104927 105341 106444 107626 108410 108866 109276 109799 110435 111015 111203 110851 110310 110116 110405 110854 111159 111262 111123
54568 111123 110656 110007 109598 109671 109948 109984 109783 109885 110756 112265 113856 115088 115841 116101 115902 115560 115638 116410 117566
$$ packed form
54699A34317k776k605k403k125j726j366j308j567j865j877j448p07o8P9k01m58
54683A11896m29k85k76l98n29n03j52M12N28k97j415j535m41O22O46J21j7J71
54665A08119Q9j22J56P63Q73K84k35j37K05J94j21k67r4P0n2k72j36M34Q91O75
54645A11317L1k34J62N79L47l63q33o26O1O59O19j02q49r47n74m38o27n52j97
54626A07433l37j111j388m30P66Q39N0k87J07K86j52m51k0O60Q56N52J49j91m93
54607A06838o59n75l12o1M2j8r4m1lk56n90l23O42J342R08j51o58l96j63l06k39
54586A04927M14J103J182P84M56M10N23O36N80J88l52n41j94K89M49L05J03j39
54568A11123m67o49m09P3K77L6k01J02Q71J509J591J232P53K60j99l42P8P72J156
$$ plain form
54549 117566 118625 119416 119856 119568 118259 116411 115132 115178 116367 117903 119060 119601 119923 120698 122041 123136
54533 123136 123101 122092 120985 120069 118768 116848 115103 114477 115002 116035 117087 117943 118355 118169 117665 117361 117485
54516 117485 117843 118102 118007 117432 116427 115236 114246 113953 114732 116285 117490 117338 116117 115113 115028 115336 115430 115678
54498 115678 116769 118512 119967 120588 120604 120439 120279 120224 120323 120330 119748 118325 116414 114768 114028 114315 115221 116265
54480 116265 117395 118884 120708 122310 123098 123031 122602 122399 122718 123408 124008 124267 124521 125251 126288 126885 126719
54463 126719 126382 126630 127555 128743 129826 130546 130628 130011 129017 127990 126992 126065 125496 125450 125695 125980 126425 127107
54445 127107 127560 127169 125910 124313 122848 121776 121410 121975 123110 123997 124127 123731 123380 123385 123684 124156 124871 126048
54427 126048 127771 129765 131506 132540 132687 132109 131380 131279 132152 133489 134482 134982 135430 135940 136011 135322 134297
$$ packed form
54549A17566J059P91M40k88j309j848j279M6J189J536J157N41L22P75J343J095
54533A23136l5j009j107r16j301j920j745o26N25J033J052Q56M12j86n04l04J24
54516A17485L58K59r5n75j005j191r90k93P79J553J205j52j221j004q5L08R4K48
54498A15678J091J743J455O21J6j65j60n5R9Pn82j423j911j646p40K87R06J044
54480A16265J130J489J824J602P88o7m29k03L19O90O00K59K54P30J037N97j66
54463A26719l37K48R25J188J083P20Q2o17r94j027r98r27n69m6K45K85M45O82
54445A27107M53l91j259j597j465j072l66N65J135Q87J30l96l51NK99M72P15J177
54427A26048J723J994J741J034J47n78p29j01Q73J337R93N00M48N10P1o89j025
$$ plain form
54410 134297 133642 133771 134801 136566 138394 139423 139440 139004 138553 138029 137562 137736 138702 139766 140390 140899 141563
54393 141563 141751 140923 139792 139492 140006 140473 140762 141570 143062 144528 145502 146251 146940 147224 146942 146479 146113 145676
54375 145676 145177 145107 145727 146560 147004 147086 147335 148184 149796 152182 155302 159124 163600 168361 172585 175583 177536
54358 177536 179206 180941 182392 183228 183543 183418 182532 180435 176931 172190 166846 161961 158355 155896 153832
54343 153832 151819 150078 148564 146755 144517 142511 141308 140683 140175 139831 139869 140004 139730 139038 138356 137873 137404
54326 137404 136855 136405 136186 136084 135906 135548 135007 134402 133980 133914 134080 134186 134135 134132 134334 134495 134132 133122 132004
54307 132004 131481 131656 132019 132197 132335 132574 132640 132324 132047 132370 133122 133590 133533 133474 133950 134926 136021 136881 137262
54288 137262 137188 137096 137434 138062 138445 138455 138485 138696 138735 138419 138151 138373 139045 139934 140984 142046 142637 142427 141732 141205
$$ packed form
54410A34297o55J29J030J765J828J029J7m36m51n24m67J74R66J064O24N09O64
54393A41563J88q28j131l00N14M67K89Q08J492J466R74P49O89K84k82m63l66m37
54375A45676m99p0O20Q33M44Q2K49Q49J612K386L120L822M476M761M224K998J953
54358A77536J670J735J451Q36L15j25q86k097l504m741n344m885l606k459k064
54343A53832k013j741j514j809k238k006j203o25n08l44L8J35k74o92o82m83m69
54326A37404n49m50k19j02j78l58n41o05m22o6J66J06n1lK02J61l63j010j118
54307A32004n23J75L63J78J38K39O6l16k77L23P52M68n7n9M76R76J095Q60L81
54288A37262p4r2L38O28L83J0L0K11L9l16k68K22O72Q89J050J062N91k10o95n27
$$ plain form
54268 141205 141230 141852 142978 144291 145200 145331 144995 144885 145381 146379 147671 149197 150882 152425 153354 153341 152630
54251 152630 152081 152495 153768 154946 155209 154548 153392 151963 150285 148596 147322 146639 146272 145722 144665 143242
54235 143242 142029 141587 142004 142948 144108 145299 146201 146413 145907 145111 144393 143808 143453 143686 144656 145876 146539
54218 146539 146158 144828 143151 142000 141963 142730 143344 143297 143069 143303 143856 144094 143840 143480 143263 142992 142430 141623
54200 141623 140712 139695 138483 137084 135769 135084 135458 136611 137564 137575 136971 136738 137396 138582 139693 140540 141236
54183 141236 141768 141927 141656 141312 141465 142388 143803 145256 146672 148272 149922 150987 151042 150374 149473 148318 146636
54166 146636 144666 143138 142444 142286 142275 142517 143339 144702 146162 147309 148020 148279 147986 147131 146026 145097 144376
54149 144376 143468 142269 141472 141857 143131 143997 143679 142859 142764 143643 144656 145005 144614 143741 142509 141083 139881
$$ packed form
54268A41205K5O22J126J313R09J31l36j10M96R98J292J526J685J543R29j3p11
54251A52630n49M14J273J178K63o61j156j429j678j689j274o83l67n50j057j423
54235A43242j213m42M17R44J160J191R02K12n06p96p18n85l55K33R70J220O63
54218A46539l81j330j677j151l7P67O14m7k28K34N53K38k54l60k17k71n62q07
54200A41623r11j017j212j399j315o85L74J153R53J1o04k33O58J186J111Q47O96
54183A41236N32J59k71l44J53R23J415J453J416J600J650J065N5o68r01j155j682
54166A46636j970j528o94j58j1K42Q22J363J460J147P11K59k93q55j105r29p21
54149A44376r08j199p97L85J274Q66l18q20r5Q79J013L49l91q73j232j426j202
$$ plain form
54132 139881 139269 139128 138920 138199 137061 136144 136172 137339 139132 140860 142306 143666 144935 145708 145779 145599 145859
54115 145859 146750 147978 149387 151169 153330 155403 156977 158234 159506 160517 160653 160027 159613 160016 160668 160736
54099 160736 160395 160519 161408 162608 163969 166061 169261 173078 176795 180371 184236 188466 192492 195513 196948
54084 196948 196683 195103 192761 189910 186541 182920 179681 177196 175190 173280 171582 170443 169849 169441 168993
54069 168993 168541 168190 168091 168490 169492 170836 172129 173220 174191 175125 176116 177350 178940 180809 182897 185307
54053 185307 188011 190599 192608 194006 195237 197003 200087 204939 210979 216605 220417 222434 223841 225720
54039 225720 228361 231527 234808 237721 240029 242116 244773 248481 253095 258113 262970 267223 270834 274212
54025 274212 277579 280392 281849 281978 281687 281673 281734 281358 280476 279360 278114 276567 274497 271765 268422 264811
$$ packed form
54132A39881o12j41k08p21j138r17K8J167J793J728J446J360J269P73P1j80K60
54115A45859Q91J228J409J782K161K073J574J257J272J011J36o26m14M03O52O8
54099A60736l41J24Q89J200J361K092L200L817L717L576L865M230M026L021J435
54084A96948k65j580k342k851l369l621l239k485k006j910j698j139n94m08m48
54069A68993m52l51r9L99J002J344J293J091R71R34R91J234J590J869K088K410
54053A85307K704K588K009J398J231J766L084M852O040N626L812K017J407J879
54039B25720K641L166L281K913K308K087K657L708M614N018M857M253L611L378
54025B74212L367K813J457J29k91j4O1l76q82j116j246j547k070k732l343l611
$$ plain form
54009 264811 261285 257696 253463 248358 242978 238178 234242 230843 227622 224490 221533 218894 216724 214977
53995 214977 213300 211345 209176 207171 205496 203936 202273 200619 199252 198284 197654 197321 197197 196934 196103 194765
53979 194765 193613 193218 193286 192999 192126 191399 191640 192871 194475 195918 196972 197498 197494 197292 197358 197885 198830 200249
53961 200249 202219 204513 206847 209552 213503 219069 225584 232241 239267 247622 257624 268401 278877
53948 278877 288750 297996 305671 309945 309694 305686 299905 293915 288283 283295 279472 277068 275597 274327
53934 274327 273081 272176 271768 271685 271893 272771 274784 278017 282025 286053 289512 292484 295676 299670 304314 309090
53918 309090 313992 319654 326555 334372 342210 349318 355508 361115 366666 372460 378269 383522 387760 390901
53904 390901 393048 394198 394197 392927 390578 387758 385220 383266 381387 378607 374253 368450 361950 355513 349352
$$ packed form
54009B64811l526l589m233n105n380m800l936l399l221l132k957k639k170j747
53995B14977j677j955k169k005j675j560j663j654j367r68o30l33j24k63q31j338
53979A94765j152l95O8k87q73p27K41J231J604J443J054N26mk02O6N27R45J419
53961B00249J970K294K334K705L951N566O515O657P026Q355J0002J0777J0476
53948B78877R873R246P675M274k51m008n781n990n632m988l823k404j471j270
53934B74327j246r05m08q3K08Q78K013L233M008M028L459K972L192L994M644M776
53918C09090M902N662O901P817P838P108O190N607N551N794N809N253M238L141
53904C90901K147J150jj270k349k820k538j954j879k780m354n803o500o437o161
$$ plain form
53889 349352 343080 336318 329289 322584 316270 309703 302466 295114 288517 282739 277181 271735 267121 263939
53875 263939 261821 259819 257281 254135 250616 246991 243388 239687 235677 231422 227318 223717 220649 218030
53861 218030 215873 214181 212732 211185 209375 207446 205787 204826 204697 204987 204951 204121 202683 201248 200273 199721
53845 199721 199182 198297 197130 196062 195308 194646 193772 192786 192122 192076 192633 193624 194761 195577 195706 195325 195023 195147
53827 195147 195504 195811 196155 196875 198171 199928 201697 202838 202981 202545 202544 203603 205312 206741 207489 208007 209015
53810 209015 210833 213313 216197 219397 222967 226935 231297 236102 241380 246911 252261 257184 261836 266382
53796 266382 270577 274040 276791 279233 281666 284151 286794 289702 292603 294885 296228 296884 297276 297547 297583
53781 297583 297128 295749 293021 288983 284192 279152 273984 268806 264092 260273 257126 253866 249893 245329
$$ packed form
53889C49352o272o762p029o705o314o567p237p352o597n778n558n446m614l182
53875B63939k118k002k538l146l519l625l603l701m010m255m104l601l068k619
53861B18030k157j692j449j547j810j929j659r61j29K90l6q30j438j435r75n52
53845A99721n39q85j167j068p54o62q74r86o64m6N57R91J137Q16J29l81l02J24
53827A95147L57L07L44P20J296J757J769J141J43m36jJ059J709J429P48N18J008
53810B09015J818K480K884L200L570L968M362M805N278N531N350M923M652M546
53796B66382M195L463K751K442K433K485K643K908K901K282J343O56L92K71L6
53781B97583m55j379k728m038m791n040n168n178m714l819l147l260l973m564
$$ plain form
53767 245329 240894 237330 234814 232837 230713 228183 225383 222367 219075 215788 213142 211478 210515 209828 209260
53752 209260 208636 207545 205805 203856 202228 200896 199555 198307 197518 197186 197019 197163 198233 200444 203114
53737 203114 205296 206609 207285 207608 207567 206976 205815 204514 203833 204291 205626 207019 207940 208592 209489 210862 212594
53720 212594 214543 216645 218799 220933 223221 226022 229453 233077 236142 238167 239275 239947 240486 240812 240804 240772
53704 240772 241433 243326 246350 250019 254114 258795 264038 269293 273980 278116 282021 285503 287856 288810 289011
53689 289011 289279 289772 290213 290574 291029 291451 291458 290922 289962 288534 286510 284208 282303 281082 280173 279159 278083
53672 278083 277194 276539 276013 275529 274990 274381 273985 274224 275101 276016 276272 275597 274209 272717 271896 272075 272610 272471
53654 272471 271518 270643 270469 270538 270210 269770 270023 271164 272678 274124 275431 276574 277504 278326 279141 279845 280518
$$ packed form
53767B45329m435l564k516j977k124k530k800l016l292l287k646j664r63o87n68
53752B09260o24j091j740j949j628j332j341j248p89l32j67J44J070K211K670
53737B03114K182J313O76L23m1n91j161j301o81M58J335J393R21O52Q97J373J732
53720B12594J949K102K154K134K288K801L431L624L065K025J108O72N39L26ql2
53704B40772O61J893L024L669M095M681N243N255M687M136L905L482K353R54K01
53689B89011K68M93M41L61M55M22Pn36r60j428k024k302j905j221r09j014j076
53672B78083q89o55n26m84n39o09l96K39Q77R15K56o75j388j492q21J79N35j39
53654B72471r53q75j74O9l28m40K53J141J514J446J307J143R30Q22Q15P04O73
$$ plain form
53637 280518 281782 284153 287118 289500 290884 292170 294517 298137 302347 306468 310372 314287 318308 322185
53623 322185 325638 328827 332273 336162 339964 343078 345669 348545 352245 356549 360783 364363 367135 369470
53609 369470 371929 374664 377329 379852 382882 386941 391408 395049 397458 399308 401204 403041 404573 405772
53595 405772 406398 405934 404423 402744 401552 400518 399169 397955 397729 398458 399168 399037 397887 395747 392691 389243
53579 389243 386253 384115 382507 381128 380182 379858 379776 379427 378804 378142 377270 375807 373951 372447 371561 370660 369180
53562 369180 367599 366913 367326 368096 368623 369097 369892 370895 371786 372561 373312 373796 373758 373546 373837 374777 375921 377125
53544 377125 378954 381974 386027 390485 394884 398999 402648 405907 409393 413858 419418 425528 431774 438407
53530 438407 445944 454526 463936 474131 485387 497842 511073 524347 537240 549905 562815 576390
$$ packed form
53637B80518J264K371K965K382J384J286K347L620M210M121L904L915M021L877
53623C22185L453L189L446L889L802L114K591K876L700M304M234L580K772K335
53609C69470K459K735K665K523L030M059M467L641K409J850J896J837J532J199
53595D05772O26m64j511j679j192j034j349j214k26P29P10j31j150k140l056l448
53579C89243k990k138j608j379r46l24q2l49o23o62q72j463j856j504q86r01j480
53562C69180j581o86M13P70N27M74P95J003Q91P75P51M84l8k12K91R40J144J204
53544C77125J829L020M053M458M399M115L649L259L486M465N560O110O246O633
53530D38407P537Q582R410J0195J1256J2455J3231J3274J2893J2665J2910J3575
$$ plain form
53518 576390 590866 606316 622594 639360 656324 673581 691681 711359 733040 756464 780825
53507 780825 805493 830547 856271 882146 906870 929705 951370 973058 994865 1015784 1035166
53496 1035166 1053444 1071365 1089166 1106837 1124601 1142619 1160594 1178147 1195449 1212961 1230666
53485 1230666 1247972 1264403 1280045 1295256 1310212 1324873 1339139 1352852 1365669 1377037 1386400
53474 1386400 1393521 1398655 1402227 1404223 1404060 1401269 1396147 1389383 1381052 1370422 1356976 1341380 1325145
53461 1325145 1309436 1294407 1279582 1264453 1248613 1231660 1213423 1194303 1175121 1156469 1138293
53450 1138293 1120140 1101711 1083126 1064832 1047343 1030971 1015696 1001393 988255 976787 967259
53439 967259 959380 952753 947411 943553 940900 938830 937136 936231 936473 937745 939893 943165 947917 954202 961889
$$ packed form
53518E76390J4476J5450J6278J6766J6964J7257J8100J9678K1681K3424K4361
53507G80825K4668K5054K5724K5875K4724K2835K1665K1688K1807K0919J9382
53496A035166J8278J7921J7801J7671J7764J8018J7975J7553J7302J7512J7705
53485A230666J7306J6431J5642J5211J4956J4661J4266J3713J2817J1368R363
53474A386400P121N134L572J996j63k791n122o764q331j0630j3446j5596j6235
53461A325145j5709j5029j4825j5129j5840j6953j8237j9120j9182j8652j8176
53450A138293j8153j8429j8585j8294j7489j6372j5275j4303j3138j1468r528
53439I67259p879o627n342l858k653k070j694r05K42J272K148L272M752O285P687
$$ plain form
53424 961889 970888 980988 991859 1003609 1016951 1032349 1049309 1067154 1086200 1107371 1130666 1154968
53412 1154968 1179653 1205592 1233985 1264805 1297123 1330542 1365471 1402062 1439683 1477763 1516700
53401 1516700 1557596 1601261 1647601 1695765 1744760 1794114 1844066 1895028 1946904 1999115 2051260
53390 2051260 2103415 2155730 2208000 2259774 2310594 2359912 2407045 2451520 2493298 2532415 2568476
53379 2568476 2600757 2628736 2652309 2671556 2686499 2697045 2702962 2703944 2699951 2691372 2678574 2661210
53367 2661210 2638282 2609114 2574130 2534634 2491941 2446822 2399651 2350830 2300936 2250514 2199874
53356 2199874 2149270 2099212 2050366 2003040 1957064 1912260 1868757 1826599 1785462 1745212 1706417
53345 1706417 1669627 1634310 1599238 1564032 1529634 1497063 1466468 1437724 1411171 1387021 1364662
$$ packed form
53424I61889Q999J0100J0871J1750J3342J5398J6960J7845J9046K1171K3295K4302
53412A154968K4685K5939K8393L0820L2318L3419L4929L6591L7621L8080L8937
53401A516700M0896M3665M6340M8164M8995M9354M9952N0962N1876N2211N2145
53390B051260N2155N2315N2270N1774N0820M9318M7133M4475M1778L9117L6061
53379B568476L2281K7979K3573J9247J4943J0546N917R82l993q579j2798j7364
53367B661210k2928k9168l4984l9496m2693m5119m7171m8821m9894n0422n0640
53356B199874n0604n0058m8846m7326m5976m4804m3503m2158m1137m0250l8795
53345A706417l6790l5317l5072l5206l4398l2571l0595k8744k6553k4150k2359
$$ plain form
53334 1364662 1343389 1323598 1306409 1292159 1279979 1268850 1258352 1248144 1237448 1225526 1212392
53323 1212392 1198713 1185224 1172406 1160494 1149476 1139244 1129873 1121670 1114797 1109016 1103965 1099646
53311 1099646 1096573 1095433 1096561 1099576 1103600 1108063 1113260 1119895 1128181 1137764 1148545 1161078 1175906
53298 1175906 1192898 1211564 1231734 1253500 1276662 1300691 1325213 1350163 1375424 1400619 1425353
53287 1425353 1449389 1472445 1494030 1513747 1531608 1547824 1562189 1573840 1581776 1585656 1586003 1583577
53275 1583577 1578657 1571065 1560799 1548357 1534298 1518718 1501389 1482302 1461764 1440016 1417076 1393125
53263 1393125 1368713 1344274 1319547 1293785 1266626 1238538 1210317 1182363 1154560 1126726 1098963
53252 1098963 1071632 1045134 1019687 995148 971090 947255 923896 901458 879943 858883 838026
$$ packed form
53334A364662k1273j9791j7189j4250j2180j1129j0498j0208j0696j1922j3134
53323A212392j3679j3489j2818j1912j1018j0232r371q203o873n781n051m319
53311A099646l073j140J128L015M024M463N197O635Q286R583J0781J2533J4828
53298A175906J6992J8666K0170K1766K3162K4029K4522K4950K5261K5195K4734
53287A425353K4036K3056K1585J9717J7861J6216J4365J1651P936L880L47k426
53275A583577m920p592j0266j2442j4059j5580j7329j9087k0538k1748k2940k3951
53263A393125k4412k4439k4727k5762k7159k8088k8221k7954k7803k7834k7763
53252A098963k7331k6498k5447k4539k4058k3835k3359k2438k1515k1060k0857
$$ plain form
53241 838026 817672 798138 779193 760417 741888 724150 707610 692414 678883 667481 658076 649624
53229 649624 641000 632058 623579 616224 609778 603324 595933 587102 576792 565228 552683 539408 525690
53216 525690 511854 498131 484631 471533 459237 448131 438243 429262 420914 413169 406073 399590 393693
53203 393693 388393 383523 378667 373441 367719 361376 354114 345875 337332 329485 322711 316595 310736 305219
53189 305219 300160 295352 290760 286902 284154 282012 279651 277030 274796 273202 271764 270055 268128 266024
53175 266024 263534 260763 258363 256803 255846 255031 254280 253612 252712 251256 249433 247718 246378 245513 245269 245587
53159 245587 246027 246267 246489 246796 246604 245261 243079 241084 239828 239073 238607 238600 238978 239136 238646 237776 236960 236163
53141 236163 235177 234241 233919 234398 235248 235862 235962 235677 235318 235153 235360 236070 237311 238862 240308 241355 242047
$$ packed form
53241H38026k0354j9534j8945j8776j8529j7738j6540j5196j3531j1402r405q452
53229F49624q624q942q479p355o446o454p391q831j0310j1564j2545j3275j3718
53216E25690j3836j3723j3500j3098j2296j1106r888q981q348p745p096o483n897
53203C93693n300m870m856n226n722o343p262q239q543p847o774o116n859n517
53189C05219n059m808m592l858k748k142k361k621k234j594j438j709j927k104
53175B66024k490k771k400j560r57q15p51o68r00j456j823j715j340q65k44L18
53159B45587M40K40K22L07j92j343k182j995j256p55m66pL78J58m90q70q16p97
53141B36163r86r36l22M79Q50O14J00k85l59j65K07P10J241J551J446J047O92
$$ plain form
53124 242047 242594 243131 243726 244445 245280 246178 247242 248589 249876 250360 249791 248890 248491 248573 248628 248685 249180 249971 250246
53105 250246 249537 248161 246559 244863 243320 242409 242108 241578 240055 237750 235471 233640 232101 230701 229608
53090 229608 229057 229023 229184 229169 228849 228362 227813 227126 226369 225948 226072 226264 225988 225576 225838 226743 227322 227088 226730
53071 226730 226961 227411 227294 226572 225749 224950 223985 223106 222826 222973 222614 221167 219129 217455 216588 216318 216382 216810
53053 216810 217705 218903 220072 221140 222427 224153 226012 227431 228146 228215 227632 226401 224949 223890 223261 222529
53037 222529 221552 220972 221313 222151 222607 222290 221406 220319 219481 219426 220322 221644 222725 223455 224121 224774 225187 225262
53019 225262 225082 224698 224249 224164 224831 226179 227877 229796 231881 233768 235063 235913 236805 237771 238267 237908 236931
53002 236931 235817 234833 234075 233601 233298 232834 232029 231183 230854 231266 232072 232678 232828 232813 233098 233803 234683 235552 236523
$$ packed form
53124B42047N47N37N95P19Q35Q98J064J347J287M84n69r01l99Q2N5N7M95P91K75
53105B50246p09j376j602j696j543r11l01n30j523k305k279j831j539j400j093
53090B29608n51l4J61j5l20m87n49o87p57m21J24J92k76m12K62R05N79k34l58
53071B26730K31M50j17p22q23p99r65q79k80J47l59j447k038j674q67k70O4M28
53053B16810Q95J198J169J068J287J726J859J419P15O9n83j231j452j059o29p32
53037B22529r77n80L41Q38M56l17q84j087q38n5Q96J322J081P30O66O53M13P5
53019B25262j80l84m49q5O67J348J698J919K085J887J295Q50Q92R66M96l59r77
53002B36931j114r84p58m74l03m64q05q46l29M12Q06O06J50j5K85P05Q80Q69R71
$$ plain form
52983 236523 237789 239325 240889 242215 243190 243956 244797 245802 246804 247902 249708 252521 255407 256883 256616
52968 256616 255780 255512 255792 256132 256508 257007 257286 257130 257032 257418 257763 257309 256338 255808 255874 255698 254717 253244 251662
52949 251662 249862 247758 245710 244042 242518 240673 238436 236246 234709 234151 234345 234682 234763 234705 234659 234368 233621
52932 233621 232843 232631 232800 232573 231773 231184 231503 232375 232795 232164 230742 229232 228135 227465 227079 227136 227938 229206
52914 229206 229971 229573 228417 227368 226765 226545 226912 228076 229558 230540 230872 231048 231222 231022 230412 229946 229947 230093
52896 230093 230105 230253 230868 231755 232395 232496 232222 232170 233028 234902 237037 238632 239734 240776 241481 241094 239709
52879 239709 238467 238200 238719 239599 240846 242381 243703 244605 245603 247186 249117 250883 252263 253060 252901 251826
52863 251826 250634 250131 250437 251350 252767 254269 254935 254263 252868 251633 250479 248608 245646 241913 237819
$$ packed form
52983B36523J266J536J564J326R75P66Q41J005J002J098J806K813K886J476k67
52968B56616q36k68K80L40L76M99K79j56r8L86L45m54r71n30O6j76r81j473j582
52949B51662j800k104k048j668j524j845k237k190j537n58J94L37Q1n8m6k91p47
52932B33621p78k12J69k27q00n89L19Q72M20o31j422j510j097o70l86N7Q02J268
52914B29206P65l98j156j049o03k20L67J164J482R82L32J76J74k00o10m66JJ46
52896B30093J2J48O15Q87O40J01k74n2Q58J874K135J595J102J042P05l87j385
52879B39709j242k67N19Q80J247J535J322R02R98J583J931J766J380P97j59j075
52863B51826j192n03L06R13J417J502O66o72j395j235j154j871k962l733m094
$$ plain form
52848 237819 233607 229588 226049 222980 220247 217943 216234 215114 214604 214879 215799 216630 216721 216217 215650 215106
52832 215106 214271 213081 211824 210794 210258 210474 211249 211847 211937 212297 213826 216066 217553 217605 216978 216648 216753
52815 216753 216901 216812 216249 214979 213298 212241 212781 214945 217933 220865 223180 224585 225014 224685 223984 223217
52799 223217 222471 221635 220542 219172 217682 216188 214651 213149 212102 211891 212226 212226 211292 209769 208626 208521
52783 208521 209228 209901 209931 209565 209616 210550 211997 213270 214125 214747 215187 215193 214680 214018 213670 213643 213438 212593 211252
52764 211252 210118 209724 209824 209756 209403 209424 210390 212043 213692 215008 216065 216835 217159 217184 217361 217978 218985 220318
52746 220318 222048 224119 226188 227904 229244 230420 231579 232653 233519 234271 235221 236493 237708 238358 238546
52731 238546 238984 240073 241300 241811 241316 240167 238831 237612 236600 235501 233741 231261 229062 228424 229550
$$ packed form
52848B37819m212m019l539l069k733k304j709j120n10K75R20Q31R1n04n67n44
52832B15106q35j190j257j030n36K16P75N98R0L60J529K240J487N2o27l30J05
52815B16753J48q9n63j270j681j057N40K164K988K932K315J405M29l29p01p67
52799B23217p46q36j093j370j490j494j537j502j047k11L35%r34j523j143j05
52783B08521P07O73L0l66N1R34J447J273Q55O22M40On13o62l48k7k05q45j341
52764B11252j134l94J00o8l53K1R66J653J649J316J057P70L24K5J77O17J007J333
52746B20318J730K071K069J716J340J176J159J074Q66P52R50J272J215O50J88
52731B38546M38J089J227N11m95j149j336j219j012j099j760k480k199o38J126
$$ plain form
52716 229550 231368 232668 233024 232663 231963 231289 230900 230748 230550 230194 229876 229764 229704 229400 228752 227952 227375 227316 227686
52697 227686 228038 228115 228280 229093 230495 231732 232242 232264 232437 232967 233442 233393 232914 232647 233094 233913 234056 232795 230531
52678 230531 228417 227227 226772 226348 225559 224649 224239 224798 226270 228105 229582 230134 229538 228139 226864 226656
52662 226656 227702 229425 231268 233105 234847 236244 237387 238873 241025 243405 245600 247998 251088 254345
52648 254345 256594 257294 256779 255456 253569 251576 249919 248398 246593 244874 244081 244138 244041 243527 243683 245301
52632 245301 247554 249054 249614 250101 251029 252124 253054 253848 254590 255162 255249 254358 252174 249260 246973 246155 246216
52615 246216 246052 245530 245367 245776 246095 245835 245338 245155 245363 245761 246326 247104 247976 248777 249471 250030 250366 250494 250605
52596 250605 250788 250895 250856 250933 251410 252081 252318 251759 250801 250249 250492 251160 251742 252335 253443 255043 256291 256442
$$ packed form
52716B29550J818J300L56l61p00o74l89j52j98l56l18j12o0l04o48q00n77n9L70
52697B27686L52P7J65Q13J402J237N10K2J73N30M75m9m79k67M47Q19J43j261k264
52678B30531k114j190m55m24p89r10m10N59J472J835J477N52n96j399j275k08
52662B26656J046J723J843J837J742J397J143J486K152K380K195K398L090L257
52648B54345K249P00n15j323j887j993j657j521j805j719p93N7r7n14J56J618
52632B45301K253J500N60M87R28J095R30P94P42N72Q7q91k184k914k287q18O1
52615B46216j64n22j63M09L19k60m97j83K08L98N65P78Q72Q01O94N59L36J28J11
52596B50605J83J07l9P7M77O71K37n59r58n52K43O68N82N93J108J600J248J51
$$ plain form
52578 256442 255795 255349 255659 256378 256898 256995 256796 256476 256189 256105 256266 256455 256319 255599 254271 252605 251099 250187
52560 250187 249901 249868 249639 248951 247729 246092 244437 243323 243089 243635 244629 245767 246702 246896 245935 244097 242405
52543 242405 241889 242784 244485 246205 247599 248785 249968 251136 252037 252392 252139 251569 251156 251155 251347 251283 250832 250398
52525 250398 250548 251448 252732 253914 254817 255537 256030 255998 255355 254718 255063 256745 259064 261069 262641 264452 266868
52508 266868 269396 271451 273356 276045 279749 283394 285526 285678 284538 282895 280824 278010 274509 270831
52494 270831 267375 264182 261265 258808 256865 255174 253505 252013 250987 250401 250043 249955 250405 251378 252419 253130
52478 253130 253604 254252 255292 256526 257512 257960 258014 258176 258864 260084 261639 263523 265890 268673 271545 274351
52462 274351 277308 280607 283953 286701 288409 289158 289352 289285 288832 287575 285221 281927 278170 274389 270855
$$ packed form
52578B56442o47m46L10P19N20R7j99l20k87q4J61J89j36p20j328j666j506r12
52560B50187k86l3k29o88j222j637j655j114k34N46R94J138R35J94r61j838j692
52543B42405n16Q95J701J720J394J186J183J168R01L55k53n70m13jJ92o4m51m34
52525B50398J50R00J284J182R03P20M93l2o43o37L45J682K319K005J572J811K416
52508B66868K528K055J905K689L704L645K132J52j140j643k071k814l501l678
52494B70831l456l193k917k457j943j691j669j492j026n86l58q8M50R73J041P11
52478B53130M74O48J040J234R86M48N4J62O88J220J555J884K367K783K872K806
52462B74351K957L299L346K748J708P49J94o7m53j257k354l294l757l781l534
$$ plain form
52447 270855 267742 265126 262880 260752 258592 256436 254440 252878 252077 252103 252551 252937 253254 253813 254517 254785
52431 254785 254360 253766 253566 253537 253021 251994 251284 251615 252802 254015 254659 254835 255055 255700 256734 257885 259005
52414 259005 260238 261908 264366 267959 272923 279113 285917 292704 299418 306584 314575 322962 330653 336595
52400 336595 340243 341463 340327 337180 332700 327534 321884 315688 309246 303312 298392 294283 290606 287551
52386 287551 285641 284869 284587 284341 284402 285166 286387 287374 287849 288307 289513 291856 295160 298956 302857 306849
52370 306849 311256 316300 321633 326402 330000 332693 335301 338188 340805 342370 342776 342486 341742 340460 338974
52355 338974 338191 338545 339282 339367 338930 339121 340637 343018 345527 348038 350705 353266 355285 356932 359049 362332
52339 362332 366690 371440 376009 380438 385320 391293 398548 406804 415769 425590 436799 449836 464623
$$ packed form
52447B70855l113k616k246k128k160k156j996j562q01K6M48L86L17N59P04K68
52431B54785m25n94k00k9n16j027p10L31J187J213O44J76K20O45J034J151J120
52414B59005J233J670K458L593M964O190O804O787O714P166P991Q387P691N942
52400C36595L648J220j136l147m480n166n650o196o442n934m920m109l677l055
52386B87551j910p72k82k46O1P64J221R87M75M58J206K343L304L796L901L992
52370C06849M407N044N333M769L598K693K608K887K617J565M06k90p44j282j486
52355C38974p83L54P37Q5m37J91J516K381K509K511K667K561K019J647K117L283
52339C62332M358M750M569M429M882N973P255Q256Q965R821J1209J3037J4787
$$ plain form
52326 464623 480631 497412 515055 534020 554437 575713 596914 617422 637151 656294 675062
52315 675062 693514 711440 728551 744957 761282 777989 794753 810837 826017 840767 855541
52304 855541 870247 884456 897823 910194 921570 932058 941655 950047 956862 962037 965651 967366 966408
52291 966408 962282 955368 946765 937671 928863 920491 912340 904373 896886 890040 883661 877924 873809 872195
52277 872195 872719 874294 876721 880940 887589 896153 905821 916382 927841 939875 952210 964981 978144
52264 978144 991002 1002932 1014204 1025547 1037247 1049171 1061334 1073754 1085967 1097306 1107643
52253 1107643 1117403 1126860 1135831 1143937 1150746 1155728 1158474 1158958 1157310 1153409 1147019 1138188 1127254 1114619
52239 1114619 1100868 1086908 1073528 1060770 1048078 1035075 1021938 1009051 996632 984747 973551
$$ packed form
52326D64623J6008J6781J7643J8965K0417K1276K1201K0508J9729J9143J8768
52315F75062J8452J7926J7111J6406J6325J6707J6764J6084J5180J4750J4774
52304H55541J4706J4209J3367J2371J1376J0488R597Q392O815N175L614J715r58
52291I66408m126o914q603r094q808q372q151p967p487o846o379n737m115j614
52277H72195N24J575K427M219O649Q564R668J0561J1459J2034J2335J2771J3163
52264I78144J2858J1930J1272J1343J1700J1924J2163J2420J2213J1339J0337
52253A107643R760R457Q971Q106O809M982K746M84j648l901o390q831j0934j2635
52239A114619j3751j3960j3380j2758j2692j3003j3137j2887j2419j1885j1196
$$ plain form
52228 973551 963421 954839 948016 942612 938009 933845 930010 926180 921986 917836 914935 914044 914726 916240
52214 916240 918613 922148 926360 930295 933703 937131 940909 944792 948549 952210 955648 958645 961448 964600
52200 964600 968131 971562 974902 978839 983582 988211 991771 994512 997458 1001083 1005084 1009220 1013644 1018216
52186 1018216 1022072 1024233 1024464 1023231 1020959 1017682 1013363 1008140 1002013 994657 985996 976829 968318 960822
52172 960822 953744 946654 939980 934319 929716 926138 924105 924108 925694 927861 930249 933285 937230 941716 946199
52157 946199 950259 953436 955481 956962 958941 961685 964172 965251 964942 964248 963982 964174 964472 964753 965256 966306
52141 966306 968010 970226 972755 975400 977843 979794 981524 984003 988141 994028 1001200 1009485 1019289 1031197
52127 1031197 1045652 1062850 1082511 1103918 1126655 1151187 1178193 1207438 1237776 1268178 1298171
$$ packed form
52228I73551j0130q582o823n404m603m164l835l830m194m150k901q91O82J514
52214I16240K373L535M212L935L408L428L778L883L757L661L438K997K803L152
52200I64600L531L431L340L937M743M629L560K741K946L625M001M136M424M572
52186A018216L856K161K31j233k272l277m319n223o127p356q661r167q511p496
52172I60822p078p090o674n661m603l578k033LJ586K167K388L036L945M486M483
52157I46199M060L177K045J481J979K744K487J079l09o94k66J92K98K81N03J050
52141I66306J704K216K529K645K443J951J730K479M138N887P172Q285R804J1908
52127A031197J4455J7198J9661K1407K2737K4532K7006K9245L0338L0402K9993
$$ plain form
52116 1298171 1327373 1355372 1382170 1408048 1432715 1455141 1474543 1491142 1505677 1518563 1529691
52105 1529691 1538658 1545000 1548498 1549385 1548054 1544693 1539640 1533919 1528674 1523959 1518727 1512150 1504225 1494962
52091 1494962 1483802 1470360 1455075 1438591 1421065 1402586 1383837 1365793 1349071 1333946 1320671
52080 1320671 1309366 1299974 1292657 1287839 1285613 1285601 1287697 1292319 1299504 1308466 1318687 1330734 1345134
52067 1345134 1361003 1376756 1391823 1406679 1421479 1435750 1449371 1462738 1475751 1487548 1497564
52056 1497564 1506048 1513258 1518906 1522817 1525444 1527219 1527790 1526356 1522433 1515978 1507142 1496217 1483475 1468684
52042 1468684 1451184 1430833 1408613 1385888 1363337 1340940 1318762 1297194 1276648 1257481 1240155
52031 1240155 1224917 1211294 1198384 1185735 1173528 1161869 1150429 1139022 1127965 1117400 1106641
$$ packed form
52116A298171K9202K7999K6798K5878K4667K2426J9402J6599J4535J2886J1128
52105A529691Q967O342L498Q87j331l361n053n721n245m715n232o577p925r263
52091A494962j1160j3442j5285j6484j7526j8479j8749j8044j6722j5125j3275
52080A320671j1305r392p317m818k226j2K096M622P185Q962J0221J2047J4400
52067A345134J5869J5753J5067J4856J4800J4271J3621J3367J3013J1797J0016
52056A497564Q484P210N648L911K627J775N71j434l923o455q836j0925j2742j4791
52042A468684j7500k0351k2220k2725k2551k2397k2178k1568k0546j9167j7326
52031A240155j5238j3623j2910j2649j2207j1659j1440j1407j1057j0565j0759
$$ plain form
52020 1106641 1094835 1082124 1069582 1058008 1047310 1037115 1027362 1017988 1008501 998317 987241 975355
52008 975355 962679 949294 935478 921298 906411 890734 875025 860155 845922 831244 815520
$$ packed form
52020A106641j1806j2711j2542j1574j0698j0195r753r374r487j0184j1076j1886
52008I75355j2676j3385j3816j4180j4887j5677j5709j4870j4233j4678j5724
$$ [...]
##END NTUPLES=NMR SPECTRUM
##END=
