##TITLE=AC1576_ROEFFECT0023_8271349_9g5SQ6rEx1
##JCAMPDX= 6.0         $$ Bruker NMR JCAMP-DX V2.0
##DATA TYPE= NMR SPECTRUM
##DATA CLASS= NTUPLES
##ORIGIN= BRUKER
##OWNER= Administrator
$$ 1.72 TOPSPIN		Version 2.1
$$ 2013-10-18 21:02:37.999 -0700  Administrator@X
$$ Compression mode = diff/dup
##.OBSERVE FREQUENCY= 400.02188249412
##.OBSERVE NUCLEUS= ^1H
##.ACQUISITION MODE= SIMULTANEOUS (DQD)
##.ACQUISITION SCHEME= undefined
##.AVERAGES= 8
##.DIGITISER RES= 22
##SPECTROMETER/DATA SYSTEM= spect
##.PULSE SEQUENCE= zg30
##.SOLVENT NAME= COFFEE_meoh
##.SHIFT REFERENCE= INTERNAL, COFFEE_meoh, 1, 14.98509
##AUDIT TRAIL= $$ (NUMBER, WHEN, WHO, WHERE, PROCESS, VERSION, WHAT)
$$ ##TITLE= Audit trail, TOPSPIN		Version 2.1
$$ ##JCAMPDX= 5.01
$$ ##ORIGIN= Bruker BioSpin GmbH
$$ ##OWNER= Administrator
$$ $$ E:\/data/COFFEE/nmr/AC1576_ROEFFECT0023_8271349_9g5SQ6rEx1/10/pdata/1/auditp.txt
$$ ##AUDIT TRAIL=  $$ (NUMBER, WHEN, WHO, WHERE, PROCESS, VERSION, WHAT)
(   1,<2013-10-18 21:02:30.952 -0700>,<Administrator>,<X>,<go>,<TOPSPIN 2.1>,
      <created by zg
	started at 2013-10-18 21:01:25.046 -0700,
	POWCHK enabled, PULCHK disabled,
       configuration hash MD5:
       C8 4E 4E 5D D3 5C D8 9E 9F 52 82 E0 59 8A DE 15
       data hash MD5: 64K
       4C 6D 08 6F 61 D0 F1 CC 1B 24 7D 99 85 61 25 97>)
(   2,<2013-10-18 21:02:34.015 -0700>,<Administrator>,<X>,<proc1d>,<TOPSPIN 2.1>,
      <Start of raw data processing
       efp LB = 0 FT_mod = 6 PKNL = 1 PHC0 = 0 PHC1 = 0 SI = 32K 
       data hash MD5: 32K
       50 6E 65 98 C5 CD 69 D6 DD D5 77 9D C5 B1 67 0F>)
(   3,<2013-10-18 21:02:34.327 -0700>,<Administrator>,<X>,<proc1d>,<TOPSPIN 2.1>,
      <pk PHC0 = 91.73584 PHC1 = 0 
       data hash MD5: 32K
       BE 18 67 46 12 49 51 38 B3 CE 37 11 86 8F C5 95>)
(   4,<2013-10-18 21:02:34.452 -0700>,<Administrator>,<X>,<proc1d>,<TOPSPIN 2.1>,
      <abs ABSG = 1 
       data hash MD5: 32K
       9B 88 FA F8 04 16 0A 15 10 93 22 78 45 D6 25 4C>)
(   5,<2013-10-18 21:02:34.577 -0700>,<Administrator>,<X>,<proc1d>,<TOPSPIN 2.1>,
      <abs ABSG = 2 
       data hash MD5: 32K
       DB 7A 53 75 B7 F8 40 82 76 1B 2D 4E B9 D8 5F 37>)
(   6,<2013-10-18 21:02:34.687 -0700>,<Administrator>,<X>,<proc1d>,<TOPSPIN 2.1>,
      <abs ABSG = 3 
       data hash MD5: 32K
       56 E2 F6 62 65 D7 6B 43 F9 4F 8E F6 59 5B 38 51>)
(   7,<2013-10-18 21:02:34.780 -0700>,<Administrator>,<X>,<proc1d>,<TOPSPIN 2.1>,
      <abs ABSG = 4 
       data hash MD5: 32K
       8E 9B 9A 82 B6 AE B9 C5 1C E3 7A 04 FF E0 6F 56>)
(   8,<2013-10-18 21:02:34.827 -0700>,<Administrator>,<X>,<proc1d>,<TOPSPIN 2.1>,
      <abs ABSG = 5 
       data hash MD5: 32K
       81 3E C1 A8 BF 57 71 4C 89 4E 78 9E 06 CF EF 7A>)
$$ ##END=
$$ 
$$ $$ hash MD5
$$ $$ 74 C4 EB DC 04 8F 25 18 7C BC F6 1C A3 D3 32 A6
##$RELAX= 
##$RELAX= 
##$RELAX= 
##$RELAX= 
##$RELAX= 
##$RELAX= 
##$RELAX= 
$$ Bruker specific parameters
$$ --------------------------
##$DU= <E:\>
##$EXPNO= 10
$$ [...]
150 150 150 150 150 150 150 150
##$TP07= 0
##$TPNAME0= <>
##$TPNAME1= <>
##$TPNAME2= <>
##$TPNAME3= <>
##$TPNAME4= <>
##$TPNAME5= <>
##$TPNAME6= <>
##$TPNAME7= <>
##$TPOAL= (0..7)
0.5 0.5 0.5 0.5 0.5 0.5 0.5 0.5
##$TPOFFS= (0..7)
0 0 0 0 0 0 0 0
##$TUNHIN= 0
##$TUNHOUT= 0
##$TUNXOUT= 0
##$USERA1= <user>
##$USERA2= <user>
##$USERA3= <user>
##$USERA4= <user>
##$USERA5= <user>
##$V9= 5
##$VALIST= <valist>
##$VCLIST= <CCCCCCCCCCCCCCC>
##$VD= 0
##$VDLIST= <DDDDDDDDDDDDDDD>
##$VPLIST= <PPPPPPPPPPPPPPP>
##$VTLIST= <TTTTTTTTTTTTTTT>
##$WBST= 1024
##$WBSW= 4
##$XGAIN= (0..3)
0 0 0 0
##$XL= 0
##$YL= 0
##$YMAX_a= 628736
##$YMIN_a= -538279
##$ZGOPTNS= <>
##$ZL1= 120
##$ZL2= 120
##$ZL3= 120
##$ZL4= 120
##$ABSF1= 14.98509
##$ABSF2= -5.573092
##$ABSG= 5
##$ABSL= 3
##$ALPHA= 0
##$AQORDER= 0
##$ASSFAC= 0
##$ASSFACI= 0
##$ASSFACX= 0
##$ASSWID= 0
##$AUNMP= <proc_prof1d_extract_pilot.lims>
##$AXLEFT= 0
##$AXNAME= <>
##$AXNUC= <1H>
##$AXRIGHT= 0
##$AXTYPE= 0
##$AXUNIT= <>
##$AZFE= 0.1
##$AZFW= 0.1
##$BCFW= 0
##$BC_mod= 0
##$BYTORDP= 0
##$COROFFS= 0
##$CY= 15
##$DATMOD= 1
##$DC= 0
##$DFILT= <>
##$DTYPP= 0
##$F1P= 0
##$F2P= 0
##$FCOR= 0.5
##$FTSIZE= 32768
##$FT_mod= 6
##$GAMMA= 0
##$GB= 0
##$INTBC= 1
##$INTSCL= 1
##$ISEN= 128
##$LB= 0
##$LEV0= 0
##$LPBIN= 0
##$MAXI= 10000
##$MC2= 0
##$MEAN= 0
##$ME_mod= 0
##$MI= 0
##$NCOEF= 0
##$NC_proc= -8
##$NLEV= 6
##$NOISF1= 0
##$NOISF2= 0
##$NSP= 0
##$NTH_PI= 0
##$NZP= 0
##$OFFSET= 14.98509
##$PC= 1
##$PHC0= 91.73584
##$PHC1= 0
##$PH_mod= 1
##$PKNL= yes
##$PPARMOD= 0
##$PPDIAG= 0
##$PPIPTYP= 0
##$PPMPNUM= 2147483647
##$PPRESOL= 1
##$PSCAL= 4
##$PSIGN= 0
##$PYNMP= <proc.py>
##$REVERSE= no
##$SF= 400.02
##$SI= 32768
##$SIGF1= 0
##$SIGF2= 0
##$SINO= 400
##$SIOLD= 32768
##$SPECTYP= <>
##$SREGLST= <1H.CDCl3>
##$SSB= 0
##$STSI= 32768
##$STSR= 0
##$SW_p= 8223.68421052631
##$SYMM= 0
##$S_DEV= 0
##$TDeff= 65536
##$TDoff= 0
##$TI= <>
##$TILT= no
##$TM1= 0
##$TM2= 0
##$TOPLEV= 0
##$USERP1= <user>
##$USERP2= <user>
##$USERP3= <user>
##$USERP4= <user>
##$USERP5= <user>
##$WDW= 1
##$XDIM= 32768
##$YMAX_p= 468585922
##$YMIN_p= -615138
##$CURPLOT= <Network HP LaserJet P1505>
##$CURPRIN= <$Network HP LaserJet P1505>
##$DFORMAT= <normdp>
##$LAYOUT= <+/1D_H.xwp>
##$LFORMAT= <normlp>
##$PFORMAT= <normpl>
##$SURQMSG= 1
$$ End of Bruker specific parameters
$$ ---------------------------------
##NTUPLES= NMR SPECTRUM
##VAR_NAME=  FREQUENCY,     SPECTRUM/REAL,   SPECTRUM/IMAG
##SYMBOL=    X,             R,               I
##VAR_TYPE=  INDEPENDENT,   DEPENDENT,       DEPENDENT
##VAR_FORM=  AFFN,          ASDF,            ASDF
##VAR_DIM=   32768,         32768,           32768
##UNITS=     HZ,            ARBITRARY UNITS, ARBITRARY UNITS
##FACTOR=    0.250966925370066, 1,           1
##FIRST=     8223.43324360094, 5014,         -53501
##LAST=      0,             74090,           -355192
##MIN=       0,             -615138,         0
##MAX=       8223.43324360094, 468585922,    0
$$ Real data points
##PAGE= N=1
##DATA TABLE= (X++(R..R)), XYDATA
$$ [...]
19571b17320G0010a76460p959f8661L962q4707f2578K878n62q5392d0556l08805
$$ -217320 70010 -176460 -184419 -68661 -64699 -149406 -62578 -59700 -60262 -145654 -40556 -349361
19559c49361h7375j60920M7462C6464c65256B38741P0138j51517C9931c26402
$$ -349361 -87375 -248295 -200833 36464 -365256 238741 308879 157362 39931 -326402
19548B33136a36497B32998a1991A2460J08778a70128M1655j03259O9059j74504
$$ 233136 -136497 232998 -11991 12460 121238 -170128 -128473 -231732 -162673 -337177
19538c37177A04816K4809b5555j54922E6655q586M3453C1365a62025B71515B3280
$$ -337177 104816 129625 -25555 -180477 56655 48069 91522 31365 -162025 271515 23280
19526B63232b95249I7813L7967l7146c01963C3743Q4834J20532H0987e08747A07576
$$ 263232 -295249 97813 135780 98634 -301963 33743 118577 239109 80987 -508747 107576
19514I0330C4635d4673H737L91821A24862d0952j93839n6706D08724A04223N4060
$$ 90330 34635 -44673 8737 400558 124862 -40952 -234791 -291497 408724 104223 158283
19503A58283b59662B41595a58650l7631A47360a24999j95109A05967D0454b70937
$$ 158283 -259662 241595 -158650 -196281 147360 -124999 -320108 105967 40454 -270937
19492b53033E4759J67953b01321j3141B63005b32848M0429k2702J02458B65047
$$ -253033 54759 222712 -201321 -214462 263005 -232848 -192419 -215121 -112663 265047
19481B54053A0790b34694E6798k1020c90169f5101A41125f7458e343D6466O7261
$$ 254053 10790 -234694 56798 35778 -390169 -65101 141125 -67458 -5343 46466 113727
19470A13727B6568a48675e5845E04b01816K8878a0320B2171c10322d7205K0007
$$ 113727 26568 -148675 -55845 504 -201816 -172938 -10320 22171 -310322 -47205 -27198
19459b7198A62320f2973A09048J4376a34066K3388A5603N5835i7165l8731N8416
$$ -27198 162320 -62973 109048 123424 -134066 -110678 15603 71438 -97165 -135896 -77480
19448g7480C6948R2686g0549o1396A88003L0455I8696c1893j55983D7066e7519
$$ -77480 36948 129634 -70549 -131945 188003 218458 98696 -31893 -187876 47066 -57519
19436e9628j04857F4312N0263a04773A39075e4882l02432I6845R0892c80825A13152
$$ -59628 -164485 64312 114575 -104773 139075 -54882 -357314 96845 187737 -380825 113152
19424H5087R5853b19266e4653B80533C2830d9051m0927l43971a47484A69386a19813
$$ 85087 180940 -219266 -54653 280533 32830 -49051 -89978 -433949 -147484 169386 -119813
19412B6974h9904l0482B42185H3698a06336b0656j435A30021b11516G4602b61553
$$ 26974 -89904 -120386 242185 83698 -106336 -20656 -22091 130021 -211516 74602 -261553
19400F961J14936c40741d7183C274L5388J71694c46708R2191D2670j2849J13113
$$ 6961 121897 -340741 -47183 3274 38662 210356 -346708 -254517 42670 29821 142934
19389A42934F8787b95603C7451a13664g847K820D6161b08316C23638d34236d516
$$ 142934 68787 -295603 37451 -113664 -7847 -5027 46161 -208316 323638 -434236 -4516
19377a0399k3546l6418m01208A00533a63747A3933e6491k81546C3169P2480e7035
$$ -10399 -33945 -70363 -471571 100533 -163747 13933 -56491 -338037 33169 105649 -57035
19365A82942H2331B011a48976C76757a59698f122j71521P0823j21735A00629a70090
$$ 182942 82331 2011 -148976 376757 -159698 -6122 -177643 -106820 -228555 100629 -170090
19353i2003I8571c51636J11044D5155b73888B56899e9508B21654c02389B13539
$$ -92003 98571 -351636 -240592 45155 -273888 256899 -59508 221654 -302389 213539
19342H9975e8701l10096C2617c4740e330j38268a4630j14130N587k7627k66284
$$ 89975 -58701 -368797 32617 -34740 -5330 -143598 -14630 -128760 -123173 -150800 -417084
19331d17084h1831k48934i3891C80256j17441j8262D0487L2530a42223j1533P6459
$$ -417084 -81831 -330765 -93891 380256 262815 244553 40487 73017 -142223 -153756 -77297
19320g7297k08720O5259E2442c2082A0025a48610A55438b63722E0257a76798A53818
$$ -77297 -286017 -220758 52442 -32082 10025 -148610 155438 -263722 50257 -176798 153818
19308g1940k25845f7439j1191A65056Q518h5015j24252f0117J7388k17297J22578
$$ -71940 -297785 -67439 -78630 165056 173574 -85015 -209267 -60117 -42729 -260026 -137448
19297a37448B40690a67980C00850a27647N0269k67754A91953G6313b86849a20555
$$ -137448 240690 -167980 300850 -127647 -77378 -345132 191953 76313 -286849 -120555
19286a22290E1301Q0480O863c06145Q3987r8988h2830E6537A42b41938A73261
$$ -122290 51301 131781 138644 -306145 -222158 -321146 -82830 56537 142 -241938 173261
19274a34677O1409C01229r0980E5575b3282n2527A05192a12477j0495F1570p542
$$ -134677 -73268 301229 210249 55575 -23282 -75809 105192 -112477 -122972 61570 54028
19263E4028a17246c6378A43224h5810j19594k4823K0680L4767j59826a13531h568
$$ 54028 -117246 -36378 143224 -85810 -205404 -230227 -209547 -174780 -334606 -113531 -8568
19251G479a02668A25245b08945D310b36m06208a17619j66984a32423j67086E774
$$ 7479 -102668 125245 -208945 4310 -236 -406444 -117619 -284603 -132423 -299509 5774
19239b91238A56319b22556d2400A09358a64591a6796n7224c3773j8730A81822
$$ -291238 156319 -222556 -42400 109358 -164591 -16796 -74020 -33773 -52503 181822
19228i4390E2441n246d2097k25824D3595K31752I7378a41585e4855J5789D7026
$$ -94390 52441 47195 -42097 -267921 43595 275347 97378 -141585 -54855 -39066 47026
19216a8791g302A35093b46412I506a39743B30302E3069a7325q0194L1493k78907
$$ -18791 -7302 135093 -246412 9506 -139743 230302 53069 -17325 -97519 -66026 -344933
19205c44933a61192B59229j04547c3206a1001k10174B13056i4698l59996B99897
$$ -344933 -161192 259229 154682 -33206 -11001 -221175 213056 -94698 -454694 299897
19194g7219n3467d3602j09222B12178a08685F8340a38119j1047o2900B35895b95542
$$ -77219 -130686 -43602 -152824 212178 -108685 68340 -138119 -149166 -212066 235895 -295542
19182a81381g9822A7766N0898e5695l05614c040r8450k13642M2192c1796r6448
$$ -181381 -79822 17766 68664 -55695 -361309 -3040 -101490 -315132 -272940 -31796 -128244
19171a28244l1803f2428k49799A78805h0388j4528r5750A25679e7514A06285a87895
$$ -128244 -160047 -62428 -312227 178805 -80388 -94916 -190666 125679 -57514 106285 -187895
19159F5111K0075b25947a0431A1143K76330a07242j48162j4080a188r8671D0511
$$ 65111 85186 -225947 -10431 11143 287473 -107242 -255404 -269484 -1188 -99859 40511
19147B2533k764l033a32773F3622d23500F6845c11091A41768b69271J12724B33298
$$ 22533 19769 16736 -132773 63622 -423500 66845 -311091 141768 -269271 -156547 233298
19135A49210K826a72301l640b3250j17649A0860J63071a75566k62280a46456G411
$$ 149210 152036 -172301 -175941 -23250 -140899 10860 173931 -175566 -437846 -146456 7411
19123a1845B06852d7427E4427a07691a1084B1036P3733N122J47523m5820o1089
$$ -11845 206852 -47427 54427 -107691 -11084 21036 94769 99891 247414 201594 140505
19112A40505i7131A21968e5938A9666J2150a47120n22J5644A81920n7402n3709
$$ 140505 -97131 121968 -55938 19666 31816 -147120 -147642 -131998 181920 124518 70809
19101G0809g5784j50258C5053j1441K73583e234r9068B1480c05193i4622j19521
$$ 70809 -75784 -226042 35053 23612 297195 -5234 -104302 21480 -305193 -94622 -214143
19090b14143N4745O0650A26151L5487i2701L4827j22953k92606a10146B33662
$$ -214143 -159398 -98748 126151 161638 -92701 -57874 -180827 -473433 -110146 233662
19079a49051A22120a11037l95771a21351L0318A71730b43661c3593k0453a0184
$$ -149051 122120 -111037 -506808 -121351 -91033 171730 -243661 -33593 -54046 -10184
19068B9793c17869J01473F4859K25827e4110a4075G475R5343R0602B6812J69020
$$ 29793 -317869 -216396 64859 290686 -54110 -14075 7475 102818 193420 26812 195832
19057A95832G7191K08346i1818I6306D989J6427d41247a77705A94884b71685E8023
$$ 195832 77191 285537 -91818 96306 4989 21416 -441247 -177705 194884 -271685 58023
19045a27360E1540N4245Q9793c27257j59571a63932k670E7054A5625O0765B2167
$$ -127360 51540 105785 195578 -327257 -486828 -163932 -166602 57054 15625 76390 22167
19033H8032b24331A65888b7789j19900f60j2496A85256h0421D21522d1007B30474
$$ 88032 -224331 165888 -27789 -147689 -660 -13156 185256 -80421 421522 -41007 230474
19021C52464E4426J5046b4026E0035f1254C17041A16478J43171D6830J24277C8549
$$ 352464 54426 69472 -24026 50035 -61254 317041 116478 259649 46830 171107 38549
19009b64895A16193H110J2482R7927c1284F8844h9082a6196B3276a63042o6132
$$ -264895 116193 8110 20592 118519 -31284 68844 -89082 -16196 23276 -163042 -229174
18998b29174M9827K0175p111J7624a4469j20599n9236h3838d1595k9257k17026
$$ -229174 -179347 -159172 -166283 -148659 -14469 -135068 -194304 -83838 -41595 -70852 -287878
18987b87878B39983C5209R7413h9250A9224K1181d9274q1760B8424r56L1402b81
$$ -287878 239983 35209 132622 -89250 19224 40405 -49274 -131034 28424 27468 58870 -281
18974g095A22916b75301b5310H1749a2137N697l2128A21898m4765C0854i7490
$$ -7095 122916 -275301 -25310 81749 -12137 -6440 -38568 121898 77133 30854 -97490
18962a97025i7456B99143c6708B24945c7949j97179e9072E7431a51155p8445j9556
$$ -197025 -97456 299143 -36708 224945 -37949 -235128 -59072 57431 -151155 -229600 -249156
18951b49156A71884c3342J0036k7870j54450A19650b69058a4455q1002j09843
$$ -249156 171884 -33342 -23306 -51176 -205626 119650 -269058 -14455 -95457 -205300
18941b05300A15848a00359j48419l1641E6626p07a29700K3061j24362N6686O9896
$$ -205300 115848 -100359 -248778 -280419 56626 55919 -129700 -106639 -231001 -174315 -104419
18930a04419A2777a71244j646j77487a30218L227j39608J07902k58191a17198
$$ -104419 12777 -171244 -172890 -350377 -130218 -126991 -266599 -158697 -416888 -117198
18919a00532b2815j82955g391A92445c21861A7045b53642L2882N0579E3701i029
$$ -100532 -22815 -205770 -7391 192445 -321861 17045 -253642 -220760 -170181 53701 -9029
18907e4049k43757a35365n7366j40237a43091o8697A10349L1690O813B0245J77707
$$ -54049 -297806 -135365 -192731 -332968 -143091 -211788 110349 142039 148852 20245 197952
18896A97952g936j1652Q074j77545q584M6846g0947m90n624j82771h597B96170
$$ 197952 -7936 -19588 -11514 -189059 -197643 -150797 -70947 -71437 -77061 -259832 -8597 296170
18883e2512C6969J0161h4036J1381A17175a71100h3572C7838e0579B8977c79895
$$ -52512 36969 47130 -84036 -72655 117175 -171100 -83572 37838 -50579 28977 -379895
18871B3435a60859p8641B2356a10815A45336A6399K1136b06922A95259d6726G2998
$$ 23435 -160859 -239500 22356 -110815 145336 16399 37535 -206922 195259 -46726 72998
18859B42109F3116c60690A54255E5705c9894F3152a00127j34508A69499m9283
$$ 242109 63116 -360690 154255 55705 -39894 63152 -100127 -234635 169499 120216
18849A20216J4948l8445m358k5821A8538c89351A79469a53388c7273D0392b86264
$$ 120216 135164 96719 92361 66540 18538 -389351 179469 -153388 -37273 40392 -286264
18837b01790R2807f75l25186o6121A36615D9040b02711j7990A71986d6982K0641
$$ -201790 -108983 -675 -325861 -391982 136615 49040 -202711 -220701 171986 -46982 -26341
18826b6341A58735d30937H3184k1716a03135o0063B35669j3340d3888k0265D61247
$$ -26341 158735 -430937 83184 61468 -103135 -163198 235669 222329 -43888 -64153 461247
18814D1846N3496J39510k5184L7043a87134b5732c975j5056G3125a84646B17800
$$ 41846 95342 234852 209668 246711 -187134 -25732 -3975 -19031 73125 -184646 217800
18802A58693e5599C8468d68784i4566G8409P2451A0895J58630a1651p8156l0958
$$ 158693 -55599 38468 -468784 -94566 78409 150860 10895 169525 -11651 -89807 -120765
18791a20765j33225O5421A56756i5925j41295B1088a11790j22552I3091b73414
$$ -120765 -253990 -188569 156756 -95925 -237220 21088 -111790 -234342 93091 -273414
18780a43609N7053A1261a53271r1327c31j97784F1158a81118B8916N4688a24108
$$ -143609 -86556 11261 -153271 -244598 -331 -198115 61158 -181118 28916 83604 -124108
18768E7128b81536d9019J3285J6646G3727J1740F488b68580j83436a59384A06146
$$ 57128 -281536 -49019 -35734 -19088 73727 85467 6488 -268580 -452016 -159384 106146
18756F4371a63067D8532D461a51537B9448b32581A67339b8817M950r2902j5247
$$ 64371 -163067 48532 4461 -151537 29448 -232581 167339 -28817 -23867 -116769 -132016
18745a32016B2558E96g1997A37618a80416D6712P1346b71109B6245F627b60101
$$ -132016 22558 596 -71997 137618 -180416 46712 118058 -271109 26245 6627 -260101
18733G3422e4848k1912A54706d86585a79430A21814a277p2495E1090B0630e2837
$$ 73422 -54848 -76760 154706 -486585 -179430 121814 -1277 -73772 51090 20630 -52837
18721d0947B61486F8394L1698P2211b53823N1478b2198j54467d9853K605b3200
$$ -40947 261486 68394 100092 172303 -253823 -202345 -22198 -176665 -49853 -47248 -23200
18709a94214k8588f9516j32607d9148p225F6533A7590c45207a04440j06714B74273
$$ -194214 -222802 -69516 -202123 -49148 -56373 66533 17590 -345207 -104440 -211154 274273
18697C16296o2327E9528M366M3074C5946c1681k39865c4614H9505K305m2177b92670
$$ 316296 253969 59528 63894 106968 35946 -31681 -271546 -34614 89505 91810 49633 -292670
18684a62832B62860A4799a69512n579L3999B34174A9130J81319D5832f0662k49841
$$ -162832 262860 14799 -169512 -175091 -141092 234174 19130 200449 45832 -60662 -310503
18673c10503J39411j27224h5828K2336k16666i3785j16232r3783a31073q7485
$$ -310503 -171092 -298316 -85828 -63492 -280158 -93785 -210017 -303800 -131073 -218558
18663b18558h3485k72767C6637J37946c48268A03266a04190G756J97931a71429
$$ -218558 -83485 -356252 36637 174583 -348268 103266 -104190 7756 205687 -171429
18652a01790A96905b87373b8422D3752c2375l0884l4117b0621j61471j30324i5729
$$ -101790 196905 -287373 -28422 43752 -32375 -63259 -97376 -20621 -182092 -312416 -95729
18640d9058A6402g590j99094F7347b13021A66840J0205a66266j4264B82583D0024
$$ -49058 16402 -7590 -206684 67347 -213021 166840 177045 -166266 -180530 282583 40024
18628A50554K0124a49002K6472p8462B12934P4292m3742e6273g059B14918c19692
$$ 150554 170678 -149002 -122530 -200992 212934 287226 243484 -56273 -7059 214918 -319692
18616a94748A77154c49558J44294B20389b01212J00099A02818C2236b85054A05746
$$ -194748 177154 -349558 -205264 220389 -201212 -101113 102818 32236 -285054 105746
18605c26231G8703a39287k33868J25140N7265A49728a7916A7340i1577j37650
$$ -326231 78703 -139287 -373155 -248015 -190750 149728 -17916 17340 -91577 -229227
18595b29227C93557B929J71894a26920Q66b60C9439J19740D9582L54234g5773
$$ -229227 393557 2929 174823 -126920 -126054 -260 39439 159179 49582 403816 -75773
18583F0297b38404G5279a71172Q5545G1495a10049d5062C8260b51216b375j57129
$$ 60297 -238404 75279 -171172 -85627 71495 -110049 -45062 38260 -251216 -2375 -159504
18572a59504M6624a6422C5717a06103j61900a20825l3186d3878o6748j56670g1619
$$ -159504 -112880 -16422 35717 -106103 -268003 -120825 -154011 -43878 -110626 -267296 -71619
18560a90970B9107C907b5933j6334m16285A3879b05017A40869c61378d2231m9215
$$ -190970 29107 3907 -25933 -42267 -458552 13879 -205017 140869 -361378 -42231 -91446
18549i1446a9566l4286j09605B29099A3940b06244i8834M8164E2654b35952l4319
$$ -91446 -19566 -53852 -163457 229099 13940 -206244 -98834 -50670 52654 -235952 -270271
18538b70271J32467A13218F981b15527k5201A22311l0632l0288Q7871I207J45607
$$ -270271 -137804 113218 6981 -215527 -240728 122311 91679 61391 149262 9207 154814
18527A54814a41879K515j03899c7767C5006b7872j30801g5643k80733D2482g4552
$$ 154814 -141879 -139364 -243263 -37767 35006 -27872 -158673 -75643 -356376 42482 -74552
18515C2471c51928B11103a54450O4508j7253r7885C784N461a62640f0609B8280
$$ 32471 -351928 211103 -154450 -89942 -107195 -205080 3784 9245 -162640 -60609 28280
18503b04233i5632r109b0079F9590a34767B03343a82791e1995A86346M001a31888
$$ -204233 -95632 -104741 -20079 69590 -134767 203343 -182791 -51995 186346 190347 -131888
18491A40378C2902J2691b16517g7120j90585J13674A31797B4710J59424a75949
$$ 140378 32902 45593 -216517 -77120 -267705 -154031 131797 24710 184134 -175949
18480g9398B09949J55520a98477A19865Q3555j1589J76790b45785A54367M1455
$$ -79398 209949 365469 -198477 119865 203420 191831 368621 -245785 154367 195822
18470A95822a53562B82096A15804a61804A23092d9897m4258E4973A3537P8373
$$ 195822 -153562 282096 115804 -161804 123092 -49897 -94155 54973 13537 91910
18460I1910c6456A4758J36490b36895a05323L8351F9084a32355L8002M5559o9315
$$ 91910 -36456 14758 151248 -236895 -105323 -66972 69084 -132355 -94353 -48794 -118109
18449a18109j6475L2559j39463n1118A62728g9157k85421e6450j54596e5271r1648
$$ -118109 -134584 -102025 -241488 -292606 162728 -79157 -364578 -56450 -211046 -55271 -146919
18438a46919j62429J38520K6747k45441J07234J32751D1980g8518A00648g2732
$$ -146919 -309348 -170828 -144081 -389522 -282288 -149537 41980 -78518 100648 -72732
18427c01233K320a4735l52439H6993K71802b02572N1450j8543j53604f2976A71565
$$ -301233 -298913 -14735 -367174 86993 358795 -202572 -151122 -169665 -323269 -62976 171565
18415b17546A23428J4520a63365C67367h0941A8728g0494B0417e1668A15408f5371
$$ -217546 123428 137948 -163365 367367 -80941 18728 -70494 20417 -51668 115408 -65371
18403A4857b81003d5574j9941D7066M3531J95558A14692k5725L129f386I7297
$$ 14857 -281003 -45574 -65515 47066 90597 286155 114692 88967 92096 -6386 97297
18391g6571k22323a325m6009A0453N1815b26297f4641j28027I8217J60883b3444
$$ -76571 -298894 -1325 -47334 10453 62268 -226297 -64641 -192668 98217 259100 -23444
18379G5197a25621D3075g7255A40433d20360K00223A80157G9442h4565k01720
$$ 75197 -125621 43075 -77255 140433 -420360 -220137 180157 79442 -84565 -286285
18369b86285a10306A47897l83N4175L10719a79159k7102c9186D8581K52997A11899
$$ -286285 -110306 147897 147514 201689 512408 -179159 -206261 -39186 48581 301578 111899
18357a84746c7224m7277b4243j6298j55446R5395k13736A69683a10609A5458K00301
$$ -184746 -37224 -84501 -24243 -40541 -195987 -100592 -314328 169683 -110609 15458 215759
18346B15759o9401b18805p0724O4648J0915A37013A4227K71527j11202A8299b9656
$$ 215759 146358 -218805 -289529 -224881 -213966 137013 14227 285754 174552 18299 -29656
18334I1254O3324b62295a04759J3905k6975I0681g7576a8056r1870G4996i273
$$ 91254 154578 -262295 -104759 -90854 -117829 90681 -77576 -18056 -109926 74996 -9273
18322a29594M5969I6073a62393q1194e9269I7793e6219q1280B60803b67729J14114
$$ -129594 -83625 96073 -162393 -243587 -59269 97793 -56219 -137499 260803 -267729 -153615
18311a53615L0609A35524b8592p6603a9137j62655e7266r7986r9205d1051j62998
$$ -153615 -123006 135524 -28592 -105195 -19137 -181792 -57266 -155252 -254457 -41051 -204049
18300b04049A84740a35159N3451H5524C4582a7450A41874B1686c00134h9387H2587
$$ -204049 184740 -135159 -81708 85524 34582 -17450 141874 21686 -300134 -89387 82587
18288d02943F3727J52681b69086g3740m3411H5892a1252m9969A08529a91794j6272
$$ -402943 63727 216408 -269086 -73740 -117151 85892 -11252 -61221 108529 -191794 -208066
18277b08066p3934K0396M0218e7967K4367D1702N0604f9026B90963A15413c58241
$$ -208066 -282000 -261604 -221386 -57967 -33600 41702 92306 -69026 290963 115413 -358241
18265C91610H2528b2212c903D17646B05811L8332p4625e7769C0211a00960l1783
$$ 391610 82528 -22212 -3903 417646 205811 244143 169518 -57769 30211 -100960 -132743
18254a32743e2929b6028l68518J38145G3727c21475D35366b85877j96255E5297
$$ -132743 -52929 -26028 -394546 -256401 73727 -321475 435366 -285877 -482132 55297
18243A75R5334m4914c27941d8094r2793a6229j5844k977j0012j24601K3986B0547
$$ 175 95509 50595 -327941 -48094 -140887 -16229 -32073 -35050 -45062 -169663 -145677 20547
18230B4005a76061M9483A19829Q4058a7839J164p5341p3817n9242e3718a9349
$$ 24005 -176061 -126578 119829 203887 -17839 -16675 -92016 -165833 -225075 -53718 -19349
18218E0344L0232e0191k46410B12399m4201a39591j32632f0880n3607m3500A12996
$$ 50344 80576 -50191 -296601 212399 168198 -139591 -272223 -60880 -114487 -157987 112996
18206c1244I9759b86904M0599a5943l68582F9198b57852A97048G9845J66275a27403
$$ -31244 99759 -286904 -246305 -15943 -384525 69198 -257852 197048 79845 246120 -127403
18194h9496M0486Q245j07563A56198g6181n0606o0793k396g3692C14691a52436
$$ -89496 -49010 -40765 -148328 156198 -76181 -126787 -187580 -189976 -73692 314691 -152436
18182a96633f494q6571n14c9718B69826a49132F7579i8272I7523j9040a31976
$$ -196633 -6494 -93065 -93579 -39718 269826 -149132 67579 -98272 97523 78483 -131976
18170b11936b5414k33523L1581M3401A31366b5235a0353E2261P8292B2887b2839
$$ -211936 -25414 -258937 -227356 -183955 131366 -25235 -10353 52261 130553 22887 -22839
18158a7719m9648A16227g5831A52847E401J35772f1083j6462o0146o223N1990
$$ -17719 -67367 116227 -75831 152847 5401 141173 -61083 -77545 -137691 -143914 -91924
18147i1924q2939I6233C9723i6376d7098E7840c26400E6425K71J36678b85814
$$ -91924 -174863 96233 39723 -96376 -47098 57840 -326400 56425 56696 193374 -285814
18135b66668k27638A91195g7577b1420H6091d5697j88395E5789J15287c27875
$$ -266668 -494306 191195 -77577 -21420 86091 -45697 -234092 55789 171076 -327875
18124b20079h4798A35210L6792b62422A83636c2819A43223a93556g6738D2304
$$ -220079 -84798 135210 172002 -262422 183636 -32819 143223 -193556 -76738 42304
18113h3119E5663a89642f9564A25163M0487d7057J6504I537e0831B9928B816O6695
$$ -83119 55663 -189642 -69564 125163 165650 -47057 -30553 9537 -50831 29928 2816 69511
18101F9511d49291D6725i0765E1086i9260B10657c86584a17485C06473j20796
$$ 69511 -449291 46725 -90765 51086 -99260 210657 -386584 -117485 306473 185677
18091A85677h7725A10583K22398a96954n0703J00130r916H0830c48774a17073
$$ 185677 -87725 110583 332981 -196954 -247657 -147527 -157443 80830 -348774 -117073
18080B74131q8058E7575f0013B68364e399m59955A95979a74213C013J24948J57709
$$ 274131 186073 57575 -60013 268364 -5399 -465354 195979 -174213 3013 127961 285670
18069B85670A35743b68007a11518M2965r8627l6026K033G8468Q7897g8317k2372
$$ 285670 135743 -268007 -111518 -68553 -167180 -203206 -201173 78468 166365 -78317 -100689
18058a00689D2203R167a9336j80665k353D4419a00326H8370b6880K762j31003
$$ -100689 42203 51370 -19336 -200001 -202354 44419 -100326 88370 -26880 -24118 -155121
18047a55121A09248a74419c3248l58514A05764a53866f693k7145P432j78237Q8654
$$ -155121 109248 -174419 -33248 -391762 105764 -153866 -6693 -33838 -26406 -204643 -115989
18036a15989k2604j8398d0944H088L15564m8550a43764d2599j83952B58438a87376
$$ -115989 -138593 -156991 -40944 8088 323652 275102 -143764 -42599 -226551 258438 -187376
18024A3179a39722m3437m4573Q2112L024F7500k1612a59957D2512J86028b615
$$ 13179 -139722 -183159 -227732 -145620 -142596 67500 45888 -159957 42512 228540 -2615
18012d3653k68966R097g8335B8840i7982i104o2567J3480p0914A1387M2309a20078
$$ -43653 -312619 -303522 -78335 28840 -97982 -9104 -71671 -58191 -129105 11387 53696 -120078
17999a45793b2790I9900R7911d4315A27356a12703D9344i781j67366A27418c0094
$$ -145793 -22790 99900 197811 -44315 127356 -112703 49344 -9781 -177147 127418 -30094
17987b48919f1334j75129c3326B6744K33350Q3803f0204H6003M4229b89808a0213
$$ -248919 -61334 -236463 -33326 26744 260094 343897 -60204 86003 130232 -289808 -10213
17975e3590m6617F003d5367F1305K3139a71285H6072a90291f0268A06934c2886
$$ -53590 -100207 6003 -45367 61305 84444 -171285 86072 -190291 -60268 106934 -32886
17963a6178B00613C84a47841f1022a1370p3514a8451j26748A42202a90868h6208
$$ -16178 200613 384 -147841 -61022 -11370 -84884 -18451 -145199 142202 -190868 -86208
17951c5955p1830B15570A7324K94487k1208A30059g7693j61605I1961i965k32656
$$ -35955 -107785 215570 17324 311811 290603 130059 -77693 -239298 91961 -9965 -242621
17940b42621Q6587N0928K5266D320J60701J18689a90360G8227B7609C060M3506
$$ -242621 -156034 -105106 -79840 4320 165021 283710 -190360 78227 27609 3060 46566
17929D6566J57137a45433j09304i9593E2688a30149m78911a99914A04980k017
$$ 46566 203703 -145433 -254737 -99593 52688 -130149 -609060 -199914 104980 102963
17919A02963B980a74711F6589c90543a53630k4756A55459n6044O7216g6032j3107
$$ 102963 2980 -174711 66589 -390543 -153630 -178386 155459 99415 166631 -76032 -89139
17908h9139j53520A23966c9882D3995i2779A46527E3407i630j33265A23228j0071
$$ -89139 -242659 123966 -39882 43995 -92779 146527 53407 -9630 -142895 123228 113157
17897A13157b48480J22630A30105J32915G0383O5035J44365i0723r2942A97750
$$ 113157 -248480 -125850 130105 263020 70383 135418 279783 -90723 -183665 197750
17886I3378d3060B06752c04053C3449Q7041i678k9831F9871d61721a85078M4726
$$ 93378 -43060 206752 -304053 33449 120490 -9678 -39509 69871 -461721 -185078 -140352
17875a40352c2599A62560b01987b6222q8318K531J9495H1797J7760a01916d6582
$$ -140352 -32599 162560 -201987 -26222 -114540 -112009 -92514 81797 99557 -101916 -46582
17863D8138a17876D77458I8425D6767j9828g3470j6671A8043b29833m8220G4662
$$ 48138 -117876 477458 98425 46767 26939 -73470 -90141 18043 -229833 -278053 74662
17851A50420h0744j28162A78602b23736A49742k3465J11590g143B05329F16a23429
$$ 150420 -80744 -208906 178602 -223736 149742 126277 237867 -7143 205329 616 -123429
17839B55804f1803p0856j13673c2896B47585b66260J07628R336A54175L055a66804
$$ 255804 -61803 -132659 -246332 -32896 247585 -266260 -158632 -149296 154175 157230 -166804
17827c9630A7322a25773F2312f8390K4192j98822A97688f2188E451J35352a26525
$$ -39630 17322 -125773 62312 -68390 -44198 -243020 197688 -62188 5451 140803 -126525
17815h9991j26219a7680k08121f1606I3172a50632O1302L0996B0290L8312c33390
$$ -89991 -216210 -17680 -225801 -61606 93172 -150632 -89330 -58334 20290 58602 -333390
17803I816J99948e40608b36794d8040k4876b1976k64760G6486L80446A33159a56476
$$ 9816 209764 -540608 -236794 -48040 -72916 -21976 -286736 76486 456932 133159 -156476
17791b41266d6948j5313A50172a43266N1377G8503d2140A49219D552b59143g8934
$$ -241266 -46948 -62261 150172 -143266 -91889 78503 -42140 149219 4552 -259143 -78934
17779e8881j37288D5298b4415E7774b22908e3882j01427E12310B23510c14730
$$ -58881 -196169 45298 -24415 57774 -222908 -53882 -155309 512310 223510 -314730
17768E0326M35697c54688C2651J36885C0710g3010q6473A4584p136K77632a3335
$$ 50326 486023 -354688 32651 169536 30710 -73010 -159483 14584 7448 285080 -13335
17756G9723L7288M0307f1495A95855a54499k28740E9748J92209A4313e3122B7784
$$ 79723 117011 157318 -61495 195855 -154499 -383239 59748 251957 14313 -53122 27784
17744E8812L5811O2982J10420h0834b4188l939C70453j45832a20998A88805R4373
$$ 58812 94623 157605 268025 -80834 -24188 -28127 370453 224621 -120998 188805 283178
17733B83178c3882A4685c2185D5083A282b1533q140j24292F8843b36966r479M0440
$$ 283178 -33882 14685 -32185 45083 1282 -21533 -29673 -153965 68843 -236966 -246445 -206005
17721b06005C4760K67750j49631a11391d2246C09615g9203j08446a0505B19861
$$ -206005 34760 302510 152879 -111391 -42246 309615 -79203 -187649 -10505 219861
17710a1343M038G1960g634A24023a69655b4612j4773B6175a68084M19C03193a34868
$$ -11343 -7305 71960 -7634 124023 -169655 -24612 -39385 26175 -168084 -167665 303193 -134868
17697A33667E4672A5579L8451a36327C77399b78988d710q8674l8568B36483C5924
$$ 133667 54672 15579 54030 -136327 377399 -278988 -4710 -93384 -131952 236483 35924
17685c79923H2273M14006a45150j37150a32772d929q274B442K71561p2306p2912
$$ -379923 82273 496279 -145150 -282300 -132772 -4929 -13203 2442 274003 201697 128785
17674A28785j1753Q1562a95178A24958a57225A14234f0648B77226j32919J40080
$$ 128785 117032 198594 -195178 124958 -157225 114234 -60648 277226 144307 284387
17664B84387E3521J5157f8806E6165b62426L7034q8794J17293H8162h1244H9460
$$ 284387 53521 68678 -68806 56165 -262426 -225392 -314186 -196893 88162 -81244 89460
17652d9957J6113l8072D6292N662e8913j89421E6027b6913m8918m9681k9588C3728
$$ -49957 -33844 -71916 46292 51954 -58913 -248334 56027 -26913 -75831 -125512 -155100 33728
17639h2021a7458J229k01513A18397k9511a7380k49270b1478j57974B21137d8645
$$ -82021 -17458 -16229 -217742 118397 88886 -17380 -266650 -21478 -179452 221137 -48645
17627b9396I2734d0051r7560C18800a33836B46314a02971C36601g1713L2422A08701
$$ -29396 92734 -40051 -137611 318800 -133836 246314 -102971 336601 -71713 -39291 108701
17615A65068i7286q7451Q9874j52076a20738B75698H2298g6088G4345J08203b02405
$$ 165068 -97286 -184737 -94863 -246939 -120738 275698 82298 -76088 74345 182548 -202405
17603b0995k58080e6454l95713i8978E5009a68089A36512j2452n5449b48008D5350
$$ -20995 -279075 -56454 -452167 -98978 55009 -168089 136512 124060 68611 -248008 45350
17591e7274B38332I2453L46966j33324b93431a14984E0767g965k4286I8528J30131
$$ -57274 238332 92453 439419 306095 -293431 -114984 50767 -7965 -32251 98528 228659
17580B28659j9831i70E35066A36432B0434J29668a49224L1708j29613K6857o3981
$$ 228659 208828 -970 535066 136432 20434 150102 -149224 -117516 -247129 -220272 -284253
17569b84253o1949A55041P4864c11183E33745E2322D555e1432d650B2977d1778
$$ -284253 -346202 155041 229905 -311183 533745 52322 4555 -51432 -4650 22977 -41778
17557c50656h0009g256H3725j3258R4730b39778k29407H7452N200P2855B7973
$$ -350656 -80009 -7256 83725 70467 165197 -239778 -469185 87452 92652 165507 27973
17545B70943d3762A75480k4089a21372H536K85957j46284D5549K72468f712A18158
$$ 270943 -43762 175480 151391 -121372 8536 294493 148209 45549 318017 -6712 118158
17533F8555R158k1011g0733A31563L8240I134L1645N3933C7814Q0067c9738C59703
$$ 68555 77713 56702 -70733 131563 169803 9134 40779 94712 37814 117881 -39738 359703
17520c4277A28678f4522C1448L2758J77267J29067j49849e3354D5733J73000h0595
$$ -34277 128678 -64522 31448 64206 241473 370540 220691 -53354 45733 218733 -80595
17508b18229C16580d5940E3616a61610A83664J10584I2310b51688G9402K01045
$$ -218229 316580 -45940 53616 -161610 183664 294248 92310 -251688 79402 280447
17498B80447D3722J99383m7320j6542k4675c766G2892a31578N8551p5116B8568
$$ 280447 43722 243105 195785 179243 154568 -3766 72892 -131578 -73027 -148143 28568
17486H59K7628R6234a15674C02674A39701f01315H6494Q1419l9421a36793a022
$$ 859 28487 124721 -115674 302674 139701 -601315 86494 167913 128492 -136793 -1022
17474I350N5020a68028F3245K07819N6794M957b2328J648A69969a12021B98764
$$ 9350 64370 -168028 63245 271064 327858 332815 -22328 -20680 169969 -112021 298764
17462B56243b06936C8393j8867K08656k082a57815C72943j79866A7303K48301
$$ 256243 -206936 38393 19526 228182 226100 -157815 372943 193077 17303 265604
17452B65604M58K68J02473A8207g1738D40071p0570a24585C08580A38740N023
$$ 265604 266062 266330 368803 18207 -71738 440071 369501 -124585 308580 138740 143763
17441A43763j2434Q1929k7366L18671j22011m0344q2477A3324K04277J77935j15250
$$ 143763 131329 213258 185892 504563 382552 342208 259731 13324 217601 395536 280286
17430B80286b8447A49142a6211k9482a7829A57692M3792a48665E7553Q9600J84612
$$ 280286 -28447 149142 -16211 -45693 -17829 157692 201484 -148665 57553 147153 331765
17419C31765l6589Q205m7456R1621j0320o6920J8738N5841b01829C06122j43915
$$ 331765 295176 303381 255925 347546 337226 270306 289044 344885 -201829 306122 162207
17408A62207a57568F4536P1071J50065J60116B4774K87308A32216b37804A0708
$$ 162207 -157568 64536 135607 285672 445788 24774 312082 132216 -237804 10708
17397B97352M4539D8034R5412M6494K0048a15360C79118j36053A0780O7737a0560
$$ 297352 341891 48034 143446 189940 209988 -115360 379118 243065 10780 78517 -10560
17385A61229B50N47103F1085J99572a85977g2051A18206J94023F847a0488H9467
$$ 161229 250 547353 61085 260657 -185977 -72051 118206 312229 6847 -10488 89467
17373A59664f6306B31855A3897J74775q1719M2819K67009j84997F5597L61101
$$ 159664 -66306 231855 13897 188672 106953 149772 416781 231784 65597 426698
17363D26698p0237i5399C2574C446O1527M4720l7354a0738B02124P655D436L22569
$$ 426698 356461 -95399 32574 3446 64973 109693 72339 -10738 202124 209779 4436 327005
17351C27005j34221l8630K12987J46271G1023M6650J21183k655J50246i3752B61060
$$ 327005 192784 154154 367141 513412 71023 117673 238856 236201 386447 -93752 261060
17339A76518m2259B2653J89117l0405a39403B33185F4071i0864A76737G2485J57373
$$ 176518 134259 22653 211770 181365 -139403 233185 64071 -90864 176737 72485 229858
17328B29858e2941A71014J6670C8297e7186C2051J71361f1532B04817g018j71055
$$ 229858 -52941 171014 187684 38297 -57186 32051 203412 -61532 204817 -7018 -178073
17317a78073f1039B96555J54870G2543K8973K18749A11239J46058c2408I4328
$$ -178073 -61039 296555 451425 72543 101516 320265 111239 257297 -32408 94328
17306A51491a79859k7267B42847m6832Q14A4444J3780N52571i8890B11625a58024
$$ 151491 -179859 -207126 242847 196015 196829 14444 28224 580795 -98890 211625 -158024
17294A80617B315K92209A14644l8303l985C1989K37332q4865o3957J99686j37705
$$ 180617 2315 294524 114644 76341 72356 31989 269321 184456 120499 320185 182480
17283A82480i6255C54295H4007J15150k5225J39453g4269K8265D21858A37791
$$ 182480 -96255 354295 84007 199157 173932 313385 -74269 -46004 421858 137791
17272A01881a93602A30785d1352a8110D92535n9652A36735b88541A65377a6564
$$ 101881 -193602 130785 -41352 -18110 492535 432883 136735 -288541 165377 -16564
17261B46362o2614P349C3406J77203J70365b8401r2146C797N28908I3677d4853
$$ 246362 183748 191097 33406 210609 380974 -28401 -120547 3797 532705 93677 -44853
17249A19919K8161K8521m3310B710J74639J6560r0086a71980C48066b32123B37924
$$ 119919 148080 176601 133291 2710 177349 193909 103823 -171980 348066 -232123 237924
17237B75871d3962n2315D38086k00831A6959M854N3939J28270K40454p4571G8061
$$ 275871 -43962 -96277 438086 237255 16959 21813 75752 204022 444476 369905 78061
17225B84661H6707I959J64184L93132g2842R436B49604q3618a12187H7996a01190
$$ 284661 86707 9959 174143 567275 -72842 -63406 249604 165986 -112187 87996 -101190
17213B60747m7794Q6147K87725c2979A81968K7839R6132J91274j18161N9327j92166
$$ 260747 212953 299100 586825 -32979 181968 209807 305939 497213 379052 438379 246213
17202B46213B3308K36342q9857a9762A89123C4161L32528l8716J98163O7610D1723
$$ 246213 23308 259650 169793 -19762 189123 34161 366689 327973 526136 593746 41723
17190B72980A30352J17545Q7531j15174h011D54194j15585J43482l2988G2272
$$ 272980 130352 247897 335428 220254 -8011 454194 338609 482091 449103 72272
17179A65861K9500P9749J06039f8842A37213K86L4589J09141j23820k9927J66149
$$ 165861 195361 275110 381149 -68842 137213 137499 172088 281229 157409 127482 293631
17168B93631O0875r786A61826J35509n4406e075B36561J61668K09788g4106D79644
$$ 293631 354506 344720 161826 297335 242929 -5075 236561 398229 608017 -74106 479644
17156B91750J8386k6349E1182L8716l2630K65150E8208O5413L4894J15544A33343
$$ 291750 310136 283787 51182 89898 57268 322418 58208 123621 158515 274059 133343
17144B07658P7115k8182J83036J11360A24852J88521l7559Q8956P8299M170I8021
$$ 207658 284773 256591 439627 550987 124852 313373 275814 364770 443069 447239 98021
17132B4532Q5762K94636I5574L69480o5931j65031J96988m4275L945A56244L67940
$$ 24532 110294 404930 95574 465054 399123 234092 431080 386805 390750 156244 524184
17121E24184k29977M6411J8730A02996J97476L13843k47621G197M84212m4202
$$ 524184 294207 340618 359348 102996 300472 614315 366694 7197 491409 447207
17111D47207K5662N9883A61233J69395J84070j63421j14797j02328K58449r8307
$$ 447207 472869 532752 161233 330628 514698 351277 236480 134152 392601 294294
17101B94294j8947A15853L23600J12008J8125B10648n9522K74447j85951L77010
$$ 294294 275347 115853 439453 551461 569586 210648 151126 425573 239622 616632
17091F16632j07688N9379j71272j57257J21331L27365k68260O1743j01984N1028
$$ 616632 508944 568323 397051 239794 361125 688490 420230 481973 379989 431017
17081D31017K50298j97016m1644r9094L11722j04557B37952J88995J43640k0005
$$ 431017 681315 484299 442655 343561 655283 550726 237952 426947 570587 550582
17071E50582r5544o2889k4266L97153l38797m586q8911j02020M30528k61143n0187
$$ 550582 455038 392149 367883 765036 426239 421653 332742 230722 661250 400107 349920
17060C49920J66613r5100J65957O6420l8021R4341l14642J42241j80814K45925
$$ 349920 516533 421433 587390 653810 615789 710130 395488 537729 356915 602840
17050F02840B02800M83295J57160k82117j96543M44378C90136l7656K95320r701
$$ 602840 202800 686095 843255 561138 364595 808973 390136 352480 647800 638099
17040F38099L6659l01528M75096k28309k60662r7112M24832L4958k48660J16358
$$ 638099 674758 373230 848326 620017 359355 262243 687075 722033 473373 589731
17030E89731J44780C48130P39941D55492A59339J39891J73588K48783C58425K28680
$$ 589731 734511 348130 1088071 455492 159339 299230 472818 721601 358425 587105
17020E87105J86272l24576O2330l0628J07157N1038r8952J94905l42309K9380
$$ 587105 773377 448801 511131 480503 587660 638698 539746 734651 392342 421722
17010D21722J18832l3276M4772J73179M5231j18940J94930C14732K62900o1580
$$ 421722 540554 507278 552050 725229 770460 651520 846450 314732 577632 516052
17000E16052j19094M92049k46639M3670m1828M07699m25014K11022N7287N3263
$$ 516052 396958 889007 642368 686038 644210 1051909 626895 837917 895204 948467
16990I48467D04662K70599K4158k28423L01708K19241k26547r2354l15049M06227
$$ 948467 404662 675261 699419 470996 772704 991945 765398 673044 357995 764222
16980G64222J01574L28859l45596J6300O6453k94619N1965r3062J09302K52134
$$ 764222 865796 1194655 849059 865359 931812 637193 689158 596096 705398 957532
16970I57532m5005L05711k88091K0232j70922R7337m6637K04196p7710P0989K42298
$$ 957532 912527 1218238 930147 950379 779457 876794 830157 1034353 956643 1027632 1269930
16959A269930n26587L00353j04731k02662L76126m11774J92057J55941j74509
$$ 1269930 743343 1043696 938965 736303 1112429 700655 892712 1048653 874144
16950H74144j49135K13207J534j45563N12003l84294j03010L00504j77974J70527
$$ 874144 725009 938216 939750 794187 1306190 921896 818886 1119390 941416 1111943
16940A111943J6198J80275P5870k24290k47813P86405m81526J2909K87377m85042
$$ 1111943 1128141 1308416 1384286 1159996 912183 1698588 1217062 1229971 1517348 1032306
16930A032306L57139k04926K32580q646l88208M36684j69914K3970K8018j77375
$$ 1032306 1389445 1184519 1417099 1408453 1020245 1456929 1287015 1310985 1339003 1161628
16920A161628K73340j28246M11013m95197L73796l24783K96760m29390K65568
$$ 1161628 1434968 1306722 1717735 1222538 1596334 1271551 1568311 1138921 1404489
16911A404489j46200L25505J88891R6539m26389L89313k92031j1187l4634k23194
$$ 1404489 1258289 1583794 1772685 1869224 1442835 1832148 1540117 1528930 1494296 1271102
16901A271102O28806J714l44548K31442j25863J66089J47308k40824k43258J66407
$$ 1271102 1899908 1901622 1557074 1788516 1662653 1828742 1976050 1735226 1491968 1658375
16891A658375M3872L65279k95820N62339l97095j5136K77931k8592k65611J81850
$$ 1658375 1702247 2067526 1771706 2334045 1936950 1921814 2199745 2171153 1905542 2087392
16881B087392k0355j2187J46980j73448L08202p1157k56901N19576l48553L62967
$$ 2087392 2067037 2054850 2201830 2028382 2336584 2265427 2008526 2528102 2179549 2542516
16871B542516M07210p76034M48904j50005k8593O9983j02217L49837Q5167q6521
$$ 2542516 2949726 2173692 2622596 2472591 2443998 2513981 2411764 2761601 2846768 2760247
16861B760247l76128N22485k53190P8157r58j94200M76096J3498K91473l78266
$$ 2760247 2384119 2906604 2653414 2731571 2730613 2536413 3012509 3026007 3317480 2939214
16851B939214J27933O9841p422J68845J22512J83943k55228L95875j98868K68866
$$ 2939214 3067147 3136988 3129566 3298411 3420923 3604866 3349638 3745513 3546645 3815511
16841C815511r0721K9652k33205K62385J53506L4057M064q8770L99617K16559
$$ 3815511 3724790 3754442 3521237 3783622 3937128 3971185 3975249 3886479 4286096 4502655
16831D502655k20418p6118N60551l60305j24198K19043K21273K19113k27613L61170
$$ 4502655 4282237 4206119 4766670 4406365 4282167 4501210 4722483 4941596 4713983 5075153
16821E075153k83594L52562M41702K2231R0167j35379k01077O85323l20383M65928
$$ 5075153 4791559 5144121 5585823 5608054 5698221 5562842 5361765 6047088 5726705 6192633
16811F192633j73035K15874L15641K312R1841J05063M85256k87476K47443R5684
$$ 6192633 6019598 6235472 6551113 6553425 6645266 6750329 7235585 6948109 7195552 7291236
16801G291236K17365J09684L98318L66154j6902M51931K19834j23574L56280j1421
$$ 7291236 7508601 7618285 8016603 8382757 8365855 8817786 9037620 8914046 9270326 9258905
16791I258905N11402Q3466N51702j54259L96481N74162K09105K15249M86752K71386
$$ 9258905 9770307 9853773 10405475 10251216 10647697 11221859 11430964 11646213 12132965 12404351
16781A2404351N43094L81551O28752r255L61652O39871K27519O17388L89015O05257
$$ 12404351 12947445 13328996 13957748 13948493 14310145 14950016 15177535 15794923 16183938 16789195
16771A6789195N29093N86074P89708O11915Q03515N71113P04862R22858Q24283
$$ 16789195 17318288 17904362 18694070 19305985 20109500 20680613 21385475 22308333 23132616
16762B3132616O65108J225140O78682J130729J161655J298461J152746J325186
$$ 23132616 23797724 25022864 25701546 26832275 27993930 29292391 30445137 31770323
16754C1770323J508344J305001J433448J917091J726887K038521J945831K124347
$$ 31770323 33278667 34583668 36017116 37934207 39661094 41699615 43645446 45769793
16746D5769793K124605K327920L004201K987375L233016L082063L815905L394371
$$ 45769793 47894398 50222318 53226519 56213894 59446910 62528973 66344878 69739249
16738F9739249M131916M050594M930978M406066N381735N481148N694183N976479
$$ 69739249 73871165 77921759 82852737 87258803 92640538 98121686 103815869 109792348
16730A09792348O026512O843842P081123P169413O583379P148587P086163O232573
$$ 109792348 115818860 122662702 129743825 136913238 143496617 150645204 157731367 163963940
16722A63963940O193327N562475M345364L986552K393919J913763J63039q83505
$$ 163963940 170157267 175719742 180065106 184051658 186445577 188359340 188522379 187638874
16714A87638874k243010l021458m723742m472723o057060o220806p114656p000824
$$ 187638874 185395864 182374406 177650664 173177941 167120881 160900075 153785419 146784595
16706A46784595p277138p167821o491845o950349o671384o764801n732911n925667
$$ 146784595 139507457 132339636 125847791 118897442 112226058 105461257 99728346 93802679
16698I3802679n153052n384727m332246m644658m071189l796243m021802l297464
$$ 93802679 88649627 83264900 78932654 74287996 70216807 66420564 62398762 59101298
16690E9101298l400831k454400k985687k432794k444274k198652j780872k272472
$$ 59101298 55700467 53246067 50260380 47827586 45383312 43184660 41403788 39131316
16682C9131316k070141j405208j889145j622963j322963j462567j047588j337467
$$ 39131316 37061175 35655967 33766822 32143859 30820896 29358329 28310741 26973274
16674B6973274r18941j260505q78852j108633r15136l05939r68125o32483r52825
$$ 26973274 26054333 24793828 23914976 22806343 21891207 21585268 20617143 19984660 19031835
16665A9031835j030574m83133o10744l38276m24536n97409o97708q82692n0980
$$ 19031835 18001261 17518128 16907384 16569108 16144572 15547163 14849455 13966763 13915783
16656A3915783m55287j94604m31596o71919k77543m79021j89819M3845n66186
$$ 13915783 13460496 13265892 12834296 12162377 11884834 11405813 11215994 11259839 10693653
16647A0693653m35599j64819k73311k41233m87182l97470j49005J44584n48439
$$ 10693653 10258054 10093235 9819924 9578691 9091509 8694039 8545034 8689618 8141179
16638H141179N6864m95888J26361m11797O9716n64047J60718l69833k11642J04206
$$ 8141179 8198043 7702155 7828516 7416719 7486435 6922388 7083106 6713273 6501631 6605837
16628F605837j17151m79363j14668n0036j68396j22156n1349j82716k1896k67210
$$ 6605837 6488686 6009323 5894655 5844619 5676223 5554067 5502718 5320002 5298106 5030896
16618E030896k02277p9835L45748j21481j31860k63677L5201l65175J78893l10658
$$ 5030896 4828619 4748784 5094532 4973051 4841191 4577514 4612715 4247540 4426433 4115775
16608D115775K96055m27144j55565l8482K86854l21892L66659k00970j33761k57973
$$ 4115775 4411830 3984686 3829121 3790639 4077493 3755601 4122260 3921290 3787529 3529556
16598C529556l78594K27490J07568k3969O8967j66612j63555j00694k82521M00191
$$ 3529556 3150962 3378452 3486020 3462051 3531018 3364406 3200851 3100157 2817636 3217827
16588C217827k42330O3791j09115k91845j2736R8356J35713k24796J11352k83761
$$ 3217827 2975497 3039288 2930173 2638328 2625592 2723948 2859661 2634865 2746217 2462456
16578B462456J59424m0840j17465K2888j3048k43419j72208K49940J0518K45086
$$ 2462456 2621880 2581040 2463575 2486463 2473415 2229996 2057788 2307728 2318246 2563332
16568B563332m22678J45637m2159j46349J4835k91427M81555j58791l21389M34174
$$ 2563332 2140654 2286291 2244132 2097783 2112618 1821191 2302746 2143955 1822566 2256740
16558B256740o27340L11458l72632N20864m36050R1920j34734L12550m57363K36794
$$ 2256740 1629400 1940858 1568226 2089090 1653040 1744960 1610226 1922776 1465413 1702207
16548A702207r5376j22794J21156p6586o4137J23555j69340J06000J83750j91354
$$ 1702207 1606831 1484037 1605193 1528607 1464470 1588025 1418685 1524685 1708435 1517081
16538A517081q2115j65705K9287L1923j31404J23755l7651K65103n3839J75465
$$ 1517081 1434966 1269261 1298548 1330471 1199067 1322822 1285171 1550274 1496435 1671900
16528A671900k05784n02584K20487n4567p1987M25765m70275L5794K71765j01378
$$ 1671900 1466116 963532 1184019 1129452 1057465 1483230 1012955 1048749 1320514 1219136
16518A219136m580P3587m1131m96646K58187M13782k98773J13070j9857j78295
$$ 1219136 1214556 1288143 1247012 750366 1008553 1422335 1123562 1236632 1216775 1038480
16508A038480J2274J18862k29j22125J12984k21162P6279j19422Q3652J84267
$$ 1038480 1050754 1169616 1169387 1047262 1160246 939084 1015363 895941 979593 1163860
16498A163860j38955j11768j34992J04179r0152j84104N042J82698p460J03782
$$ 1163860 1024905 913137 778145 882324 792172 608068 613110 795808 788348 892130
16488H92130J35601R1743l85381L382J72426J80611r8193m42969N12218l45796
$$ 892130 1027731 1119474 734093 737475 909901 1090512 992319 549350 1061568 715772
16478G15772J15810k16599K14999j84063K08780K33855k34376n4588j97193K74298
$$ 715772 831582 614983 829982 645919 854699 1088554 854178 799590 602397 876695
16468H76695r3315J10074k79698K63442M4267j97177P1141C50708K15252l3417
$$ 876695 783380 893454 613756 877198 921465 724288 795429 350708 565960 532543
16458E32543O4970k25823N4901K88661j58399p0178N181R3264j39690j76389L54043
$$ 532543 597513 371690 426591 715252 556853 486675 491856 585120 445430 269041 623084
16447F23084k36202J02026K57873l51479K22645k08666K02514B77980L51899k69940
$$ 623084 386882 488908 746781 395302 617947 409281 611795 277980 629879 359939
16437C59939J96703m0393J03708N6097B08465k1782L86677j13855M5321J36771
$$ 359939 556642 516249 619957 676054 208465 186683 573360 459505 504826 641597
16427F41597k09480n747j17976o1423l0865K78661Q211k4716L27610C73459r7867
$$ 641597 432117 426370 308394 246971 216106 494767 502978 478262 805872 373459 275592
16416B75592L25627k7986j47456J08332K08980j71424F6441L88639J5302B03728
$$ 275592 601219 573233 425777 534109 743089 571665 66441 455080 470382 203728
16405D57772r857O0298R6050I6167L22110P0030K59775B86833H3455J41668J12482
$$ 457772 447915 508213 604263 96167 418277 488307 748082 286833 83455 225123 337605
16394C37605K55988B43981n0991L01268n0329M1390k38016K97712L9697k15005
$$ 337605 593593 243981 192990 494258 443929 485319 247303 545015 584712 369707
16384C69707F2971M30103j45483n7619K44082k66987R6538q3690J6333J6257a01076
$$ 369707 62971 493074 347591 289972 534054 267067 363605 279915 296248 312505 -101076
16372A75941J92092r7952L60431j91388A62172Q626o223L12938j16256r5450K16782
$$ 175941 368033 270081 630512 439124 162172 170798 164575 477513 361257 265807 482589
16361D82589k26609h3479B18358J85505r1537P2414j17651O139r1240A9377N25165
$$ 482589 255980 -83479 218358 403863 312326 384740 267089 273228 181988 19377 544542
16350E44542B42531d422A24445k4686n560J49663r2746N13625A72921p5312K1778
$$ 544542 242531 -4422 124445 99759 94199 243862 151116 664741 172921 97609 119387
16339A19387P8473k0655N7018J32256I5380L33060r7319N7109j7046M9162j72803
$$ 119387 197860 177205 234223 366479 95380 428440 331121 388230 371184 420346 247543
16328B47543L77689C02214K2317A48415J58022M628B6761K18384J34474F9433
$$ 247543 625232 302214 324531 148415 306437 311065 26761 245145 379619 69433
16317A75183Q0998B7533d0149D28944A00126K09909a02612A68580N8190i6933
$$ 175183 256181 27533 -40149 428944 100126 310035 -102612 168580 226770 -96933
16306A18044B7788J59325n9223J08666l730J2138K40538g1062A11727J59438p8051
$$ 118044 27788 187113 127890 236556 232826 244964 485502 -71062 111727 271165 193114
16295A93114h698A39125C2509L1435M42078k04431I9940Q9565l8362K3226J84938
$$ 193114 -8698 139125 32509 63944 506022 301591 99940 189505 151143 174369 359307
16284C59307j70778B6282K2767K14924f8531H623L35061A41034N6366a75559B28408
$$ 359307 188529 26282 49049 263973 -68531 8623 343684 141034 197400 -175559 228408
16272G3697K72459a23625B54953J07565a30317B54923j07529f9558K6078B03470
$$ 73697 346156 -123625 254953 362518 -130317 254923 147394 -69558 -43480 203470
16261B35210J3492b9191B44412A21681K04811p3155b89977a12143B67399A11631
$$ 235210 248702 -29191 244412 121681 326492 253337 -289977 -112143 267399 111631
16250a14676e2705A92438J32085A02141N3488a2076j634B94400F0684b37469J05842
$$ -114676 -52705 192438 324523 102141 155629 -12076 -13710 294400 60684 -237469 -131627
16239a31627B96065d53A82221K26087b77387J33235C84957j32823a27639C93655
$$ -131627 296065 -453 182221 408308 -277387 -144152 384957 252134 -127639 393655
16228B49014N880B2903K18320d9900A16842g5648A57973G8038J9232J3951i6772
$$ 249014 254894 22903 241223 -49900 116842 -75648 157973 78038 97270 111221 -96772
16216A59116b57889A8413b6739C84752j28084A03826J64639A21290g0224a3001
$$ 159116 -257889 18413 -26739 384752 256668 103826 268465 121290 -70224 -13001
16205C05654j06311J6991k9373a77594C17537j53842j4839d0761F6022g1576D66889
$$ 305654 199343 216334 186961 -177594 317537 163695 148856 -40761 66022 -71576 466889
16193i1951A66022D0253f8307A42091l4863Q8621K75723B05884C192R9401J37857
$$ -91951 166022 40253 -68307 142091 107228 195849 471572 205884 3192 102593 240450
16182B40450H0396b0536r7625j19142G1466i0019B56065G3299J68500N1969A6096
$$ 240450 80396 -20536 -118161 -237303 71466 -90019 256065 73299 241799 293768 16096
16170B35561j00734J48616a73336A32823c4673j61481C1292a47651A40171J06855
$$ 235561 134827 283443 -173336 132823 -34673 -196154 31292 -147651 140171 247026
16160B47026f0657B35579F1357J38838b6222A04912a16951A4511J09288j2382
$$ 247026 -60657 235579 61357 200195 -26222 104912 -116951 14511 123799 111417
16150A11417a20174I5428b24999D7893K01536d9200A854J78554d0686l8532j7816
$$ 111417 -120174 95428 -224999 47893 249429 -49200 1854 180408 -40686 -79218 -97034
16139i7034b7807k83427e5601K3701A99093A7083L20156g3448a2419n4241r8294
$$ -97034 -27807 -311234 -55601 -31900 199093 17083 337239 -73448 -12419 -66660 -164954
16128a64954A8800J82641P7180a97375h9568b3852j87403A31656e0578E5260L8634
$$ -164954 18800 201441 278621 -197375 -89568 -23852 -211255 131656 -50578 55260 93894
16117I3894a49536E5842c82176A1727b03536A16909a01219o1053B32267J19707
$$ 93894 -149536 55842 -382176 11727 -203536 116909 -101219 -162272 232267 351974
16107C51974D2160a03671I399P7562J78143g3403b9335G2538j7157J60195A3143
$$ 351974 42160 -103671 9399 86961 265104 -73403 -29335 72538 55381 215576 13143
16095B31661i6277E9171e8782I9291Q3433a02608q920B07051i6143r7435A29790
$$ 231661 -96277 59171 -58782 99291 182724 -102608 -111528 207051 -96143 -193578 129790
16083B69461j1239A6913a40739f3415C05301i8947A39638c36457B69278A3944
$$ 269461 258222 16913 -140739 -63415 305301 -98947 139638 -336457 269278 13944
16072B5301a99339A82735a12124A1424O343f5005k9363C8370g7380E4688g4712
$$ 25301 -199339 182735 -112124 11424 17767 -65005 -94368 38370 -77380 54688 -74712
16060D129a2171j76147h571A23816A9891c09519C50570a49860d2522C2523a97207
$$ 4129 -12171 -188318 -8571 123816 19891 -309519 350570 -149860 -42522 32523 -197207
16048a22802j24935d5967E25971B57112r5804E0091k664b91075k23174K45734
$$ -122802 -247737 -45967 525971 257112 161308 50091 47427 -291075 -514249 -268515
16038b68515A35549b23373A06639A0129N6814J82204b4869o07A91597m4835d131
$$ -268515 135549 -223373 106639 10129 66943 249147 -24869 -25476 191597 146762 -4131
16026a5612I0221A267K1047e0336a824A30859a31326F6300a06975L5539j8200
$$ -15612 90221 1267 22314 -50336 -1824 130859 -131326 66300 -106975 -71436 -89636
16015h9636j058r650p7291N9041k9052j7850D35425h8583j94B23800a61098M7046
$$ -89636 -90694 -100344 -177635 -118594 -147646 -165496 435425 -88583 -88777 223800 -161098 -114052
16003a14052b8940q6820c1581j57855e7945I2366k8687A1934a25696A78708H0205
$$ -114052 -28940 -115760 -31581 -189436 -57945 92366 63679 11934 -125696 178708 80205
15991A60991b41381J07771B00387K06553A61982d9796A7053N01317j13995A45174
$$ 160991 -241381 -133610 200387 406940 161982 -49796 17053 518370 404375 145174
15980G9478K72261j44344H4140j1966a02998A7941K81681A27716a86539D101i420
$$ 79478 351739 207395 84140 72174 -102998 17941 299622 127716 -186539 4101 -9420
15968b61553d5488B27779b52452C4092N6376h7467o8761k9513Q5777B81188b11936
$$ -261553 -45488 227779 -252452 34092 90468 -87467 -156228 -185741 -99964 281188 -211936
15956a92485G8994a77118m0524j850L7233k7069C2393c16878e2549k19403e9537
$$ -192485 78994 -177118 -217642 -219492 -182259 -209328 32393 -316878 -52549 -271952 -59537
15944A68400a15417j2083r3207p9456H7395L5519B4596J31155K12819c93761a81102
$$ 168400 -115417 -127500 -220707 -300163 87395 122914 24596 155751 368570 -393761 -181102
15932b5717r0763p552e3686M675l3991a8711F182R8520h2554J1423b6771F6617
$$ -25717 -116480 -124032 -53686 -49011 -83002 -18711 6182 104702 -82554 -71131 -26771 66617
15919E5294P1879a58094H5702L60521j06677r6835H9755a65299B47193A5483d50662
$$ 55294 127173 -158094 85702 446223 339546 242711 89755 -165299 247193 15483 -450662
15907B70802d4659k14683b4610k45582h7955A34389E8155J99253g0577m5752A27144
$$ 270802 -44659 -259342 -24610 -270192 -87955 134389 58155 257408 -70577 -116329 127144
15895D255a68929E7191J010b7986j08234E0397a36823B6480c51768G7434K30303
$$ 4255 -168929 57191 58201 -27986 -136220 50397 -136823 26480 -351768 77434 307737
15884C07737a57922g2402A12244A746b36372C7276M7082b36976j14846A78355
$$ 307737 -157922 -72402 112244 1746 -236372 37276 84358 -236976 -351822 178355
15873A13448A3796b31239J13457C12819A26521c00247B29359l5519a44357A69135
$$ 113448 13796 -231239 -117782 312819 126521 -300247 229359 193840 -144357 169135
15862D01833e3177A62615b55898L1355j57467b6565A1405f5999F2146O7076c5728
$$ 401833 -53177 162615 -255898 -224543 -382010 -26565 11405 -65999 62146 129222 -35728
15850e5476j99333L8714a4954B3665K3159a12231k16928e4428j73855P0058g7917
$$ -55476 -254809 -216095 -14954 23665 46824 -112231 -329159 -54428 -228283 -158225 -77917
15838c04096N3202A2601J06909D2002L4428c20330A69145a42082f4039A24546
$$ -304096 -250894 12601 119510 42002 76430 -320330 169145 -142082 -64039 124546
15827C7369J13620a54339E2585b81417B24306p6232a55883D7035b708A08862c99476
$$ 37369 150989 -154339 52585 -281417 224306 148074 -155883 47035 -2708 108862 -399476
15815F3597M5579a30478b232j82501e5785j24102j43102J26388B51148b13832
$$ 63597 109176 -130478 -2232 -184733 -55785 -179887 -322989 -196601 251148 -213832
15804A51121a84053Q4539j79784e688B24412A3464d08118a14791j73268E4299
$$ 151121 -184053 -99514 -279298 -5688 224412 13464 -408118 -114791 -288059 54299
15793A02781D5714J68400c6465j32120B78649a22921F3638B4020c22635a26708
$$ 102781 45714 214114 -36465 -168585 278649 -122921 63638 24020 -322635 -126708
15782I800J54170E9201J50833i8617B89717a05825H5566J67356F0416K2373d9186
$$ 9800 163970 59201 210034 -98617 289717 -105825 85566 252922 60416 82789 -49186
15770h6144H9651K4335B4872J33011K52880a72532B7977J30921e7465C6950i6201
$$ -86144 89651 113986 24872 157883 410763 -172532 27977 158898 -57465 36950 -96201
15758I2269Q6518F1932a4313A41401b32372A16197l4026k6605a84262d6871m780
$$ 92269 178787 61932 -14313 141401 -232372 116197 82171 55566 -184262 -46871 -51651
15747e1651b3267C95860C5582b7287j49579j08202L1298A9266a50362N964C50067
$$ -51651 -23267 395860 35582 -27287 -176866 -285068 -253770 19266 -150362 -144398 350067
15735A95667E5207a39874A11583a11358L5756I6761P3790a96575M8676I7006b48801
$$ 195667 55207 -139874 111583 -111358 -75602 96761 170551 -196575 -147899 97006 -248801
15723a45973N6274L7845a047B06174a99973b1800j17223d2756p9452C36515a53859
$$ -145973 -89699 -51854 -1047 206174 -199973 -21800 -139023 -42756 -122208 336515 -153859
15711D5566a0604j41042B3372b55054c4782C3406O1277b45713H6342h1153j49362
$$ 45566 -10604 -151646 23372 -255054 -34782 33406 94683 -245713 86342 -81153 -230515
15700b30515j50924A82519F7185a95323h7695q5428A23861b9009C95725I2387
$$ -230515 -381439 182519 67185 -195323 -87695 -173123 123861 -29009 395725 92387
15689B09655k4236h2694K6250q0450F7506N1140b69604a30159A15669m6041a76461
$$ 209655 185419 -82694 -56444 -136894 67506 118646 -269604 -130159 115669 69628 -176461
15677B19587d2046A74942B9846L1791a84203p5282C0310K17192b22605C4559J87026
$$ 219587 -42046 174942 29846 61637 -184203 -259485 30310 247502 -222605 34559 221585
15666B21585F2259c7262A35286b4025j32895A93302a28131m2263j10774a09067
$$ 221585 62259 -37262 135286 -24025 -156920 193302 -128131 -170394 -281168 -109067
15655b49976e5983F0048a26456A8952J09930k4716g122D24903A46543o8598Q94
$$ -249976 -55983 60048 -126456 18952 128882 104166 -7122 424903 146543 77945 78839
15644G8839c25070a05795A10491c74639e7127j24237A04755B2707M6053b9483
$$ 78839 -325070 -105795 110491 -374639 -57127 -181364 104755 22707 68760 -29483
15633D6376a8143A91829j3171k1871c55868C30411h06m6052F8677g545I8098i3524
$$ 46376 -18143 191829 178658 156787 -355868 330411 -806 -46858 68677 -7545 98098 -93524
15620c0067D9502P100a88194c4646k04937L9759A16093j1716N10c2700k18324
$$ -30067 49502 56602 -188194 -34646 -239583 -199824 116093 104377 104887 -32700 -251024
15609b51024A1857f0076j02088j62699f9275j81335B47499C9500c48912A46082
$$ -251024 11857 -60076 -162164 -324863 -69275 -250610 247499 39500 -348912 146082
15598H1841A5233L83876b72795q4321B03779g446j63180E0189a09222k8803k2404
$$ 81841 15233 399109 -272795 -357116 203779 -7446 -170626 50189 -109222 -138025 -160429
15587a60429L0436B48380b57164g4311a2901B78184I6249b52718a643q2793k4148
$$ -160429 -129993 248380 -257164 -74311 -12901 278184 96249 -252718 -1643 -84436 -108584
15576a08584d0958A34517m1746b9345A31026D8720a47403f5247B41390B0305K49225
$$ -108584 -40958 134517 92771 -29345 131026 48720 -147403 -65247 241390 20305 269530
15565B69530c3483j57268j0228g317B95829A6135O460c49823h2949C5948R0338
$$ 269530 -33483 -190751 -200979 -7317 295829 16135 22595 -349823 -82949 35948 126286
15554A26286J25094a59552C27006c70392g9272A04643c42818i4067A43432J6004
$$ 126286 251380 -159552 327006 -370392 -79272 104643 -342818 -94067 143432 159436
15544A59436i5056j04373B3797O5226J38700q094A00011i8395B0556a44116e3822
$$ 159436 -95056 -199429 23797 89023 227723 219629 100011 -98395 20556 -144116 -53822
15532a38677d4911H3245b33865o9452g3218A77919L1054b4091n2833b062H4836
$$ -138677 -44911 83245 -233865 -303317 -73218 177919 208973 -24091 -76924 -2062 84836
15520I8623P6278o1092h8354j94508A27734b14062G4044b97204G7149L39383g4809
$$ 98623 174901 113809 -88354 -282862 127734 -214062 74044 -297204 77149 416532 -74809
15508B87632r5440D9420b22285C306a24671C24771e8166m8402A33688P8394b1650
$$ 287632 192192 49420 -222285 3306 -124671 324771 -58166 -106568 133688 212082 -21650
15496A7556a96998H9590b3486I4348D2787a55677d0946A42592b42804M8985A34381
$$ 17556 -196998 89590 -23486 94348 42787 -155677 -40946 142592 -242804 -193819 134381
15484C06031c7019n3971A71993g9189E03813j61830I4322J07034A3193a85120
$$ 306031 -37019 -90990 171993 -79189 503813 341983 94322 201356 13193 -185120
15473A19650J15885m5349c7865N578E8274b29618a0281D1466b36521c2278m17968
$$ 119650 235535 190186 -37865 -32287 58274 -229618 -10281 41466 -236521 -32278 -450246
15462d50246f3950j13071B11752Q0870B6756h637A87236a28496C08789b49422
$$ -450246 -63950 -177021 211752 292622 26756 -8637 187236 -128496 308789 -249422
15451b35536K0602A39302k2296a57173b8395E0300b62167K0166m3862B2409J74745
$$ -235536 -214934 139302 117006 -157173 -28395 50300 -262167 -242001 -285863 22409 197154
15440A97154a50386A50020b3829l53154B19940I054d9823e456A26556D486O6592
$$ 197154 -150386 150020 -23829 -376983 219940 9054 -49823 -5456 126556 4486 71078
15429G1078k7176A2168b93301g2550C8867a03198k79330C62864A03680b67631
$$ 71078 43902 12168 -293301 -72550 38867 -103198 -382528 362864 103680 -267631
15418b0669r074B07553h3580j65145a16002A72362j4717F0657M0223Q8896n1184
$$ -20669 -29743 207553 -83580 -248725 -116002 172362 157645 60657 100880 189776 138592
15407A38592J01836a76894b8405J0667C6138a62807g4916L5708N824l61558D3663
$$ 138592 240428 -176894 -28405 -17738 36138 -162807 -74916 -39208 -33384 -394942 43663
15395e9442r9161F0632a31818A14221C5308g5291B09588r0351b51213G4290o105
$$ -59442 -158603 60632 -131818 114221 35308 -75291 209588 119237 -251213 74290 68185
15384F8185a6881l29639A40255e2355k69122A10018h8217F5115c61761B79656
$$ 68185 -16881 -346520 140255 -52355 -321477 110018 -88217 65115 -361761 279656
15373b24272Q5439C1124o284d7296A58862a46857H6158C4233L4449b02529A57486
$$ -224272 -138833 31124 24840 -47296 158862 -146857 86158 34233 68682 -202529 157486
15361a64760M0368A77552C7963c40943j4123B5805A0534i8706R179l8100j61149
$$ -164760 -124392 177552 37963 -340943 -355066 25805 10534 -98706 -89527 -127627 -288776
15350b88776h5220C28541l7540a04150H1774a21202j2133j09598O4932A2652K3006
$$ -288776 -85220 328541 291001 -104150 81774 -121202 -133335 -242933 -178001 12652 35658
15339C5658J15567J6033b79332C1954b27403I1269j2585K5548J0299J63531a26991
$$ 35658 151225 167258 -279332 31954 -227403 91269 78684 104232 114531 278062 -126991
15327B67703d5845B44126J0758b4205A80195J09149a95282I4418a32463j05608
$$ 267703 -45845 244126 254884 -24205 180195 289344 -195282 94418 -132463 -238071
15317b38071A44555l5584b124E20044a08632K256a1759A61242c11292h4524j9084
$$ -238071 144555 108971 -2124 520044 -108632 -106376 -11759 161242 -311292 -84524 -103608
15306a03608J3150H1271K64562D6574l185b3063j59373C54414e5908K0007B27679
$$ -103608 -90458 81271 345833 46574 43389 -23063 -182436 354414 -55908 -35901 227679
15294g4825l242r1879F8905J16390m4926a35901o4004A42403M8028i429E0695
$$ -74825 -78067 -169946 68905 185295 140369 -135901 -199905 142403 190431 -9429 50695
15282f9120j68764J09611e10A50203E2641K36031D241b65575A1891g6595B13793
$$ -69120 -237884 -128273 -510 150203 52641 288672 4241 -265575 11891 -76595 213793
15270g2363A27830J34367g275B9511O9548g9951D54771j30163j6387E5351a14249
$$ -72363 127830 262197 -7275 29511 99059 -79951 454771 324608 308221 55351 -114249
15258B62735j7684A9565h4756D5848e0271A84793i7602A7866R7130L77059N73098
$$ 262735 245051 19565 -84756 45848 -50271 184793 -97602 17866 114996 492055 1065153
15247A065153J59039l845K99400G26163B10444J80560G4957J24343h4435B7524
$$ 1065153 1224192 1220347 1519747 726163 210444 391004 74957 199300 -84435 27524
15236F3097a45940K0779i636B95412D5985i6025C24137h8354C3076J78831g0631
$$ 63097 -145940 -125161 -9636 295412 45985 -96025 324137 -88354 33076 211907 -70631
15224A05333O7246b58643N1170B97710a41337C2257K54070g3706B83832i250C3841
$$ 105333 172579 -258643 -207473 297710 -141337 32257 286327 -73706 283832 -9250 33841
15212d468B7292J41907A4600c31000A0826a17867p4302D89317A29335f0423L696
$$ -4468 27292 169199 14600 -331000 10826 -117867 -192169 489317 129335 -60423 -56727
15201e6727m0747A03846k1621J86467q7932K30339A80262B0837a30716m312A08311
$$ -56727 -97474 103846 82225 268692 180760 411099 180262 20837 -130716 -135028 108311
15189A83953a62118B62487m5260l3759A3853J36380J45980G432J56458M7144a6075
$$ 183953 -162118 262487 217227 183468 13853 150233 296213 7432 163890 211034 -16075
15177A51322o8593b53767A39922n9734a24752c0640D3647L71014g948l437p9264
$$ 151322 82729 -253767 139922 80188 -124752 -30640 43647 414661 -7948 -11385 -90649
15166i0649C36819A61318n218b36537C02762A19042Q8140I3225a8711B05491P1863
$$ -90649 336819 161318 156100 -236537 302762 119042 207182 93225 -18711 205491 277354
15155B77354L4338j13517m8498Q9867r873H5033f0578q9837A26111b8971B49380
$$ 277354 311692 198175 149677 239544 229671 85033 -60578 -150415 126111 -28971 249380
15143a65630B269J04804c74855B32127p7504g5727A59114L46924B15298k8509
$$ -165630 2269 107073 -374855 232127 154623 -75727 159114 506038 215298 186789
15133A86789p9626n2700K69688k1171A1910K11424H7335J58252j10413M9557l8675
$$ 186789 107163 54463 324151 302980 11910 223334 87335 245587 135174 184731 146056
15122A46056J25936A2040e9089A30420G59h0292A78381J28834M1108j24246J28087
$$ 146056 271992 12040 -59089 130420 759 -80292 178381 307215 348323 224077 352164
15111C52164e9430n8561a5101A38306h8417H1093l3235G625J7162L24117p1338
$$ 352164 -59430 -117991 -15101 138306 -88417 81093 47858 7625 24787 348904 277566
15100B77566J59920D4278A4652J58094J09284b43494B11775H9014b02570A86496
$$ 277566 437486 44278 14652 172746 282030 -243494 211775 89014 -202570 186496
15089i102E6873B683a56585A15782e1159p3725B83546a39306C67638A31751D2512
$$ -9102 56873 2683 -156585 115782 -51159 -124884 283546 -139306 367638 131751 42512
15077B52487e8024B28206K38139j81253n9810B2477J66924b3826j02006B37303
$$ 252487 -58024 228206 466345 285092 225282 22477 189401 -23826 -125832 237303
15066A35705E7319Q7084F3326c442r9555A63713f2220j3982H7321a98156B6588
$$ 135705 57319 144403 63326 -3442 -102997 163713 -62220 -76202 87321 -198156 26588
15054A65273J40417l5872a82028A98302g5419A04921c7705B73795H5623c3338
$$ 165273 305690 269818 -182028 198302 -75419 104921 -37705 273795 85623 -33338
15043D23516K15722j84449i974A76088q5505N0185j7120O9874n7661K43332j79542
$$ 423516 639238 454789 -9974 176088 90583 140768 123648 193522 135861 379193 199651
15032A99651E7981K33625K19899k34216I9278k7562K00809c3909A19250j6863
$$ 199651 57981 291606 511505 277289 99278 71716 272525 -33909 119250 102387
15022A02387K18891k2323g7486A68230M54330A41519J07855o869J75171l3300
$$ 102387 321278 298955 -77486 168230 622560 141519 249374 242505 417676 384376
15012C84376p5035k5422E073K59982O9188j0061j7271G7045A2879L12696R5931
$$ 384376 309341 283919 5073 265055 334243 324182 306911 77045 12879 325575 421506
15001D21506B10696J17325j07033r3881a46517B57510b9329C50556A05822P027
$$ 421506 210696 328021 220988 127107 -146517 257510 -29329 350556 105822 112849
14991A12849k6245J23513i5652F3338K96511A28122K8372L9424R9474p1045D7793
$$ 112849 86604 210117 -95652 63338 359849 128122 156494 195918 295392 224347 47793
14979F4958K87361m9362a22120B84452a64157B13825d6599B52185N4812M1499
$$ 64958 352319 302957 -122120 284452 -164157 213825 -46599 252185 306997 348496
14969C48496j30579q0781a88359B96444c9145C0866M33747j56301k8520L2852
$$ 348496 217917 137136 -188359 296444 -39145 30866 464613 308312 279792 312644
14959C12644l4007o9022J61640E0984J61775K99115k17495e221G4845J45460O3467
$$ 312644 278637 209615 371255 50984 212759 511874 294379 -5221 74845 220305 283772
14948B83772R0340o2843j19727A1106K52957J03370k3575O2659d1688F9406O35775
$$ 283772 374112 311269 191542 11106 264063 367433 343858 406517 -41688 69406 705181
14937G05181j55445H6554N7852K86267j07308A30048Q5347J98880j8281G3029
$$ 705181 549736 86554 144406 430673 323365 130048 215395 414275 395994 73029
14926C77663M6313H8082K9345J72004N2878K28325B18398m4531M17524B54723
$$ 377663 423976 88082 117427 289431 342309 570634 218398 173867 591391 254723
14915B06585J31491D4088N34356B26447p6126j2727O69510l92201Q8489j19551
$$ 206585 338076 44088 578444 226447 150321 137594 807104 414903 503392 383841
14905C83841J31124j93319L43212B91614J98547j60401j10956J49519r1362J67250
$$ 383841 514965 321646 664858 291614 490161 329760 218804 368323 276961 444211
14895D44211e7169D74957N9023j27751j05514K35952B57961P2486J30493J29046
$$ 444211 -57169 474957 533980 406229 300715 536667 257961 330447 460940 589986
14885E89986j20119B8813J21147J31173J27093l6458b12727D60412A89775J4280
$$ 589986 469867 28813 149960 281133 408226 371768 -212727 460412 189775 204055
14875B04055n0920K53875j70739K20012A89810M752K93448o9179J73472k66539
$$ 204055 153135 407010 236271 456283 189810 194562 488010 418831 592303 325764
14865C25764p2238L4282L00265j39130m6162K70470B49427m232A08605K69925
$$ 325764 253526 287808 588073 448943 402781 673251 249427 245195 108605 378530
14855C78530q8227J41279n1628j06778l9571o7703L51064P4067B64262p7016H4183
$$ 378530 290303 431582 379954 273176 233605 165902 516966 591033 264262 187246 84183
14843D61634J23961n8784I9622K77190r6084P0420K15767B25716L57303B89804
$$ 461634 585595 526811 99622 376812 280728 351148 566915 225716 583019 289804
14832C34750j54262J95265Q6082p4404L63766l52805L72683J0454l86819p792
$$ 334750 180488 375753 461835 387431 751197 398392 771075 781529 394710 386918
14822C86918A53070L74792L1692l6711Q0781A36217L03899O8474B07627J79171
$$ 386918 153070 527862 559554 522843 603624 136217 440116 508590 207627 386798
14812C86798N8102r8056M8362Q1021N4652L4541K07705k06755J25909l28172L26365
$$ 386798 444900 346844 395206 476227 530879 565420 773125 566370 692279 364107 690472
14801F90472C22975N6957L02430B90639L26365n7366L1237k5719j64469K94637
$$ 690472 322975 379932 682362 290639 617004 559638 590875 565156 400687 695324
14791F95324l12648J03765O1369q8601M43200k33056k42215O6284J37693K0314
$$ 695324 382676 486441 547810 459209 902409 669353 427138 493422 631115 651429
14781F51429J84632n8659j10541j73641R2954P3872J73658l0424k42610J69984
$$ 651429 836061 777402 666861 493220 586174 660046 833704 803280 560670 730654
14771G30654l06665K66384j18248J07743Q6093k48016L4008m9422P5468R2625
$$ 730654 423989 690373 572125 679868 765961 517945 551953 502531 577999 670624
14761F70624p8807J36125k14290n8067m6296L66528k17129K09081k60524A55139
$$ 670624 591817 727942 513652 455585 409289 775817 558688 767769 507245 155139
14750G01140K28014k73730J8879o6873m2931j14920K14770n2557K72544r6822
$$ 701140 929154 655424 674303 607430 564499 449579 664349 611792 884336 787514
14740G87514k22050J71213j3887j31576j29148L44968K8151k93203L8214J4716
$$ 787514 565464 736677 722790 591214 462066 807034 835185 541982 580196 594912
14730E94912J32227j94049K19085K38100k54481k19189J53712J12877j54569K07592
$$ 594912 727139 533090 752175 990275 735794 516605 670317 783194 628625 836217
14720H36217J86111k38984k36686K74138J14742k94073J89409M186R6082D53671
$$ 836217 1022328 783344 546658 820796 935538 641465 830874 835060 931142 453671
14709E42915M18645j16049J85076o9254k42423J50715J1428k95028L2222M36660
$$ 542915 961560 845511 1030587 961333 718910 869625 881053 586025 618247 1054907
14699A054907k56331J84065k62123M53508o8412k39800J03084j81462j65216M35358
$$ 1054907 798576 982641 720518 1174026 1105614 865814 968898 787436 622220 1057578
14689A057578J01717k33801j57741n2383J87678k30830M24224m73890L84605k76348
$$ 1057578 1159295 925494 767753 715370 903048 672218 1096442 622552 1007157 730809
14679G30809M64076J08536o15041M95611k60373K27153k00266k21830J45719L08035
$$ 730809 1194885 1303421 688380 1183991 923618 1150771 950505 728675 874394 1182429
14669A182429k46992K41739j56849j36813r3392J85648r5234J72022q4263M34991
$$ 1182429 935437 1177176 1020327 883514 790122 975770 880536 1052558 968295 1403286
14659A403286p8231j43936l07409P3584J03791O252k13446M51358k56805j27035
$$ 1403286 1325055 1181119 873710 947294 1051085 1057337 843891 1295249 1038444 911409
14649I11409K88192m54282M43729l3492K38861k16084j52982J53264m3566K76144
$$ 911409 1199601 745319 1189048 1155556 1394417 1178333 1025351 1178615 1135049 1411193
14639A411193N0720j63727m97771N92462l31130K89594R4790j53451L03870m69992
$$ 1411193 1461913 1298186 800415 1392877 1061747 1351341 1446131 1292680 1596550 1126558
14629A126558R6418O4668k8892K1423k21692o7648J14940J16042J24226K1816
$$ 1126558 1222976 1287644 1258752 1280175 1058483 990835 1105775 1221817 1346043 1367859
14619A367859j11062K6025R8663N3914p1211J87011m94153K91449K12539k269
$$ 1367859 1256797 1282822 1381485 1435399 1364188 1551199 1057046 1348495 1561034 1558765
14609A558765k88201J03538K71030m02597p2718O1054L30533l24177K00969J60738
$$ 1558765 1270564 1374102 1645132 1242535 1169817 1230871 1561404 1237227 1438196 1598934
14599A598934N303J33905l79479L43369l55866L41837Q8535N0391R2666J75414
$$ 1598934 1604237 1738142 1358663 1702032 1346166 1688003 1776538 1826929 1919595 2095009
14589B095009l54442j60382M25631l24083p3240j91632K62010K88635R0918J10318
$$ 2095009 1740567 1580185 2005816 1681733 1608493 1416861 1678871 1967506 2058424 2168742
14579B168742j6361l53039N13705n16716J6456J27804J82364P5416m81553N38134
$$ 2168742 2152381 1799342 2313047 1796331 1812787 1940591 2122955 2198371 1716818 2254952
14569B254952p5293k46861K62360K97856l60235J0102M59087k77825K90111J49988
$$ 2254952 2179659 1932798 2195158 2493014 2132779 2142881 2601968 2324143 2614254 2764242
14559B764242k27266J71896p687N2669J28049M82105L48855J81990M96866J157510
$$ 2764242 2536976 2708872 2701185 2753854 2881903 3364008 3712863 3894853 4391719 5549229
14549E549229J477923L273756Q545946J9042656O235068j9551744A0788944m962007
$$ 5549229 7027152 10300908 18846854 37889510 44124578 24572834 10788944 5826937
14541E826937k068718j021337m73587l30783J44470J08672j35180n1323k69225
$$ 5826937 3758219 2736882 2263295 1932512 2076982 2185654 2050474 1999151 1729926
14532A729926M41430j09330j94799J00493L81693m39899N44112k85064J48343
$$ 1729926 2171356 2062026 1867227 1967720 2349413 1909514 2453626 2168562 2316905
14523B316905j47687K84891k8982j53786L0921L58315j1796r9008k12907J28924
$$ 2316905 2169218 2454109 2425127 2271341 2302262 2660577 2648781 2549773 2336866 2465790
14513B465790J77943J3901j04017K81864k45367n1160K54397J34241l64867M47887
$$ 2465790 2643733 2657634 2553617 2835481 2590114 2538954 2793351 2927592 2562725 3010612
14503C010612J31612j88360L1837k58376n2417L75386J95049l28976K60284j5678
$$ 3010612 3142224 2953864 2985701 2727325 2674908 3050294 3245343 2916367 3176651 3160973
14493C160973K16016p8886K60475m73933J77604J27986j98842J21964k1591M74686
$$ 3160973 3376989 3298103 3558578 3084645 3262249 3390235 3191393 3313357 3291766 3766452
14483C766452k1776k28186J23134k41553M42953J38715J89163l49089l3176J57371
$$ 3766452 3744676 3516490 3639624 3398071 3841024 3979739 4168902 3819813 3786637 3944008
14473C944008K42073j59509J92741k5770j75315J73328P456L41286j35525j29378
$$ 3944008 4186081 4026572 4219313 4193543 4018228 4191556 4199012 4540298 4404773 4275395
14463D275395k06068K01597J84029m771k8507L80468m64639O14444j06303L31194
$$ 4275395 4069327 4270924 4454953 4450182 4421675 4802143 4337504 4951948 4845645 5176839
14453E176839l68371J97573J148J10584J09391M42761m01968L12823k12824M00218
$$ 5176839 4808468 5006041 5007189 5117773 5227164 5669925 5267957 5580780 5367956 5768174
14443E768174m6759R4404K98920j98801J70296J31467K1927r3937o0210M26898
$$ 5768174 5721415 5815819 6114739 5915938 6086234 6217701 6239628 6145691 6085481 6512379
14433F512379P4578K2120L08505r2584J12495O1380K18892l55733M79210O80L55517
$$ 6512379 6586957 6609077 6917582 6824998 6937493 6998873 7217765 6862032 7341242 7341922 7697439
14422G697439Q0821J01403k55596J96878n2664K47956J71161K52671L6333j38852
$$ 7697439 7778260 7879663 7624067 7820945 7768281 8016237 8187398 8440069 8476402 8337550
14412H337550K46945J46660R8379o5936L75976K2985J9028M32473L14033l7897
$$ 8337550 8584495 8731155 8829534 8763598 9139574 9162559 9181587 9614060 9928093 9890196
14402I890196K28463J24064L98522M7886L0766j46275L79524L17198K22716J59071
$$ 9890196 10118659 10242723 10641245 10689131 10719897 10573622 10953146 11270344 11493060 11652131
14392A1652131L29092j42728M08252K90486L28924L44095L2679J49894l5070M60532
$$ 11652131 11981223 11838495 12246747 12537233 12866157 13210252 13242931 13392825 13357755 13818287
14382A3818287p2029N83770q969O16850K40002J92655J40590O62956K12956K97120
$$ 13818287 13746258 14330028 14321059 14937909 15177911 15370566 15511156 16174112 16387068 16684188
14372A6684188K01233K17302Q07555j16498L51577N28471N88855K56887K21932
$$ 16684188 16885421 17102723 17910278 17793780 18145357 18673828 19262683 19519570 19741502
14363A9741502N39848M10693M01791R06478L08616O3271N84704L51725O68094
$$ 19741502 20281350 20692043 21093834 22000312 22308928 22372199 22956903 23308628 23976722
14354B3976722O14099J029607M52352P26304L54898P40261P64088O59524L04274
$$ 23976722 24590821 25620428 26072780 26799084 27153982 27894243 28658331 29317855 29622129
14345B9622129J415873O74632O48795Q36659R00273J121297J112528J146422P53874
$$ 29622129 31038002 31712634 32361429 33198088 34098361 35219658 36332186 37478608 38232482
14336C8232482J100603J196692J148347J189771J490601J071535K018661J103653
$$ 38232482 39333085 40529777 41678124 42867895 44358496 45430031 47448692 48552345
14328D8552345J826236J337114J850462J728471J980966J855211J955336K080251
$$ 48552345 50378581 51715695 53566157 55294628 57275594 59130805 61086141 63166392
14320F3166392K238775K411046K694946K122406L268348L014676L166317L210027
$$ 63166392 65405167 67816213 70511159 72633565 75901913 78916589 82082906 85292933
14312H5292933L426839L839513L701751L973559M481080M791936M752230M796722
$$ 85292933 88719772 92559285 96261036 100234595 104715675 109507611 114259841 119056563
14304A19056563N791109N597275O780422O326227O782810P022197Q235037Q500781
$$ 119056563 124847672 130444947 137225369 143551596 150334406 157356603 165591640 174092421
14296A74092421Q662838R460475J0199262J0039669J1236469J1461931J2437905
$$ 174092421 182755259 192215734 202414996 212454665 223691134 235153065 247590970
14289B47590970J2788093J3225913J3940793J4445956J4554697J5136247J4927624
$$ 247590970 260379063 273604976 287545769 301991725 316546422 331682669 346610293
14282C46610293J5282801J5287768J4303637J4492255J3751394J2624379J1033830
$$ 346610293 361893094 377180862 391484499 405976754 419728148 432352527 443386357
14275D43386357R528735P811920N415923K442987j770654m541486m154862o364920
$$ 443386357 452915092 460727012 466142935 468585922 466815268 462273782 458118920 451754000
14267D51754000n674634q363030r397701j0474179j2523465j3906823j4924408
$$ 451754000 446079366 437716336 428318635 417844456 405320991 391414168 376489760
14260C76489760j6157549j5580157j5972024j5671191j5470531j4175063j3675787
$$ 376489760 360332211 344752054 328780030 313108839 297638308 283463245 269787458
14253B69787458j3547022j2940520j2406515j1688929j1209050j0150101j0307316
$$ 269787458 256240436 243299916 230893401 219204472 207995422 197845321 187538005
14246A87538005q807330q556936q210052p512734p461680o776304o641317o011343
$$ 187538005 178730675 170173739 161963687 154450953 146989273 140212969 133571652 127560309
14238A27560309n280520n177896n151600n187592m514085m054944l720613l677232
$$ 127560309 122279789 117101893 111950293 106762701 102248616 98193672 94473059 90795827
14230I0795827l529429l549743l465330l204844k851505k913892k582410k453573
$$ 90795827 87266398 83716655 80251325 77046481 74194976 71281084 68698674 66245101
14222F6245101k155980k297539j857295k140066k077357j605797k083477j243886
$$ 66245101 64089121 61791582 59934287 57794221 55716864 54111067 52027590 50783704
14214E0783704j511325j236733j671196j554944j402400j369437q13283o28134
$$ 50783704 49272379 48035646 46364450 44809506 43407106 42037669 41224386 40596252
14206D0596252j501826r88446j162843j459695q76668q24807m35761o59442r89003
$$ 40596252 39094426 38105980 36943137 35483442 34606774 33781967 33346206 32686764 31697761
14197C1697761j030926p23730p00784n56156o39338j027218q99360l42060m84817
$$ 31697761 30666835 29943105 29242321 28686165 28046827 27019609 26120249 25778189 25293372
14188B5293372r14349k24433o97111o74713k35214o18747m78665k06094o55745
$$ 25293372 24379023 24154590 23457479 22782766 22547552 21928805 21450140 21244046 20588301
14179B0588301p36112k35310n57639j95842l53774n44453p5787l51379q08969
$$ 20588301 19852189 19616879 19059240 18863398 18509624 17965171 17889384 17538005 16729036
14170A6729036R8105k32651n40015l33856p9989m98852n80477j20554l34570m7359
$$ 16729036 16827141 16594490 16054475 15720619 15640630 15141778 14561301 14440747 14106177 14058818
14160A4058818l27678n2311k90222k98263j75118m4710r2516m31846n88402K4292
$$ 14058818 13731140 13678829 13388607 13090344 12915226 12870516 12778000 12346154 11757752 11782044
14150A1782044l8963k90262j11743k72927R7307l08194l27667n9630o2816k71071
$$ 11782044 11743081 11452819 11341076 11068149 11165456 10857262 10529595 10469965 10407149 10136078
14140A0136078k03370k16865m5105K0487k63307L0885m43441K33367l70147r9777
$$ 10136078 9932708 9715843 9670738 9691225 9427918 9458803 9015362 9248729 8878582 8778805
14130H778805j72114k48283o4828j38536M38911m45012k06610k55267k02823J43816
$$ 8778805 8606691 8358408 8293580 8155044 8593955 8148943 7942333 7687066 7484243 7628059
14120G628059l67985L86686k68209j23623r3982j07499J08389m32071M8935n8661
$$ 7628059 7260074 7646760 7378551 7254928 7160946 7053447 7161836 6729765 6778700 6720039
14110F720039m6198j2395j57605p1699q9941j96650j20308L8114J85368l63254
$$ 6720039 6673841 6661446 6503841 6432142 6342201 6145551 6025243 6063357 6248725 5885471
14100E885471J31282j97508Q2269k62510J8568m6088k04503K57729j69912k8042
$$ 5885471 6016753 5819245 5901514 5639004 5657572 5611484 5406981 5664710 5494798 5466756
14090E466756j17601j59849k17420M15255m55283R2950p7314J06380j60115k5699
$$ 5466756 5349155 5189306 4971886 5387141 4931858 5024808 4947494 5053874 4893759 4868060
14080D868060j6705J12630m04053j23115L3672k11422M35925q3337n15203n0805
$$ 4868060 4851355 4963985 4559932 4436817 4470489 4259067 4694992 4611655 4096452 4045647
14070D045647L04460J696k68175k34440J68310k07983J87100O1719q8093K63399
$$ 4045647 4350107 4351803 4083628 3849188 4017498 3809515 3996615 4058334 3970241 4233640
14060D233640p5232k20359J55593k12003L8628P7469m57891M63034p34146K66820
$$ 4233640 4158408 3938049 4093642 3881639 3920267 3997736 3539845 4002879 3268733 3535553
14050C535553k91501M13746n2666j69788k6633j92499J33581l071J26029O7667
$$ 3535553 3244052 3657798 3605132 3435344 3408711 3216212 3349793 3346722 3472751 3540418
14040C540418k04460k06092k44210M13454r1519j67820r1595N0919J25883o1441
$$ 3540418 3335958 3129866 2885656 3299110 3207591 3039771 2948176 2999095 3124978 3063537
14030C063537J50111l98913K43638j56107p1634k53912K7539n8663M72440j82048
$$ 3063537 3213648 2814735 3058373 2902266 2830632 2576720 2604259 2545596 3018036 2835988
14020B835988j25836K52822l21603k17326K07878P5599j12128l11170K83267j48703
$$ 2835988 2710152 2962974 2641371 2424045 2631923 2707522 2595394 2284224 2567491 2418788
14010B418788j45182M6768j32460J51692M4051j32406P4005r2307k96924K63962
$$ 2418788 2273606 2320374 2187914 2339606 2383657 2251251 2325256 2232949 1936025 2199987
14000B199987j55388L03827J00365m93394k4872P2775O9689L5046R8797M10582
$$ 2199987 2044599 2348426 2448791 1955397 1930525 2003300 2072989 2108035 2206832 2617414
13990B617414j17587R26070J951679O692235J7920344J3854717j6400894j2412935
$$ 2617414 2499827 3425897 5377576 12069811 29990155 43844872 27443978 15031043
13982A5031043n422461l200534j139156q29360n98139l35323j20616l9695k91253
$$ 15031043 9608582 6408048 5268892 4439532 3841393 3506070 3385454 3345759 3054506
13973C054506o94425O64336q16358J33700m22968N27189j62336q6301n1940k36249
$$ 3054506 2360081 3024417 2208059 2341759 1918791 2445980 2283644 2197343 2145403 1909154
13963A909154J93681j78766K44238k41617L31059K04687j23630j20367k12781
$$ 1909154 2102835 1924069 2168307 1926690 2257749 2462436 2338806 2218439 2005658
13954B005658j22599L70520n04535L79646k39645R8666k11671Q5539J33639J46125
$$ 2005658 1883059 2253579 1749044 2128690 1889045 1987711 1776040 1861579 1995218 2141343
13944B141343m33214J0655J37983M4185j68377L71326l89275K23186j78875K67210
$$ 2141343 1708129 1718784 1856767 1900952 1732575 2103901 1714626 1937812 1758937 2026147
13934B026147p5617k50182J28403q1539m62320J90998K68061k36007K37568m29225
$$ 2026147 1950530 1700348 1828751 1747212 1284892 1475890 1743951 1507944 1745512 1316287
13924A316287M9765J03909p4852K23879j92882O5596K38201m99688K26764l04405
$$ 1316287 1366052 1469961 1395109 1618988 1426106 1491702 1729903 1230215 1456979 1152574
13914A152574M36319J02387j03747k48455j77922L04925k30558Q2240J19916j51673
$$ 1152574 1588893 1691280 1587533 1339078 1161156 1466081 1235523 1317763 1437679 1286006
13904A286006K3516L46445j8303j5960k28354K31539k86695p6309J60283q5521
$$ 1286006 1309522 1655967 1637664 1621704 1393350 1624889 1338194 1261885 1422168 1336647
13894A336647k18034K39574L36850o12886K17658l12492N30919k1352k09917j48395
$$ 1336647 1118613 1358187 1695037 1082151 1299809 987317 1518236 1496884 1286967 1138572
13884A138572N12971l76272p7704L78923l81961J31224m15374K39687K12410k34967
$$ 1138572 1651543 1275271 1197567 1576490 1194529 1325753 910379 1150066 1362476 1127509
13874A127509O9809l48138K12727J27620l7590J4612m41803K28052L7035K0383
$$ 1127509 1197318 849180 1061907 1189527 1151937 1166549 724746 952798 989833 1010216
13864A010216R8102j02837L02899j63310j73475K39339j37880n15804M73335K36602
$$ 1010216 1108318 1005481 1308380 1145070 971595 1210934 1073054 557250 1030585 1267187
13854A267187l13611K15891k39576o2445p7182K17598K2509k21638L33615k20689
$$ 1267187 953576 1169467 929891 867446 790264 1007862 1030371 808733 1142348 921659
13844I21659L19517J93972m99627J2343P4216j20724N01941l93781L537k42541
$$ 921659 1241176 1435148 935521 947864 1022080 901356 1403297 1009516 1013053 770512
13834G70512J00321N6597k23841L2617l0014K27174j12808q0250L6732j05766
$$ 770512 870833 927430 703589 736206 706192 933366 820558 740308 777040 671274
13824F71274J3630K56702j48211j5250J12658K10070k08541k03108J1035k68423
$$ 671274 684904 941606 793395 778145 890803 1100873 892332 689224 700259 431836
13814D31836K67384J260M9867J02981r2760J27782j57057k3696m5099J95182K18924
$$ 431836 699220 700480 750347 853328 760568 888350 731293 707597 662498 857680 1076604
13803A076604l78607M99257o7323k67753k31806K88514k10386K40652k22790j01396
$$ 1076604 697997 1197254 1129931 862178 630372 918886 708500 949152 726362 624966
13793F24966q4346J14708R3054j14523N19489D68936M41165J41873k33882q8455
$$ 624966 540620 655328 748382 633859 1153348 468936 910101 1051974 818092 729637
13783G29637N0885k42425J51827J28656k80633L29046k69173r6584J07780L54990
$$ 729637 780522 538097 689924 818580 537947 866993 597820 501236 609016 964006
13773I64006D75614m9338K07534P8011j29537J32767j18376L22957k98508J66686
$$ 964006 475614 426276 633810 711821 582284 715051 596675 919632 621124 787810
13763G87810j84428J45217n7752J08913r8012q1069K1568p6557K20289r6987r5905
$$ 787810 603382 748599 690847 799760 701748 620679 642247 565690 785979 688992 593087
13752E93087J44876k17056K30553j81447J56072O9136B97777M49799Q3624j06793
$$ 593087 737963 520907 751460 570013 726085 795221 297777 747576 831200 724407
13742G24407B71359j6791N09196l09592J28320j94346K62865K63011m44627k0974
$$ 724407 271359 254568 763764 454172 582492 388146 651011 914022 469395 448421
13732D48421L35513j45980J3449l2562O2802n0804M6257j62937N6815L52223k97360
$$ 448421 783934 637954 651403 618841 681643 630839 677096 514159 570974 923197 625837
13721F25837L1721A21687M03912n8646L52771C34877N87074C54169N82287l82276
$$ 625837 657558 121687 525599 466953 819724 334877 921951 354169 936456 554180
13711E54180L78662m49453M46479B56521M25293j37470K17303J61466l95500L37963
$$ 554180 932842 483389 929868 256521 681814 544344 761647 923113 527613 865576
13701H65576J10353B33960M02084k71696j6951M48650A81365N10842J81502r4189
$$ 865576 975929 233960 636044 364348 347397 796047 181365 692207 873709 779520
13691G79520l09352k8137J9537j18171L08468B39005J66268j65355J26249L6291
$$ 779520 470168 442031 461568 343397 651865 239005 405273 239918 366167 402458
13681D02458M8180K5988Q6790j13686j71291L61137l12917J2372O5713P4138J99558
$$ 402458 450638 476626 563416 449730 278439 639576 326659 339031 404744 478882 678440
13670F78440p0391k68468J69902m3229j87649J32157L18745k29526r3298J29506
$$ 678440 608049 339581 509483 466254 278605 410762 729507 499981 406683 536189
13660E36189j88591M36027m3305C57516L08498j17345l3375m8583j64315J8059
$$ 536189 347598 783625 740320 357516 666014 548669 515294 466711 302396 320455
13650C20455K81677k74931P9218K06197m7665B76452K16835B9507N59139A80786
$$ 320455 602132 327201 406419 612616 564951 276452 493287 29507 588646 180786
13639D07209m9578J89519k24870r5379K61677L6635H6247K89436j24817K91678
$$ 407209 357631 547150 322280 226901 488578 525213 86247 375683 250866 542544
13629E42544J6833E9546K76977J64738q7155A02535J86465J39158J53837j38693
$$ 542544 559377 59546 336523 501261 414106 102535 289000 428158 581995 443302
13619D43302k21213K93921M2441J34216C33520J84399A04190K69639P5084H0896
$$ 443302 222089 516010 558451 692667 333520 517919 104190 373829 448913 80896
13608B75840M5333L79989H0943L26900j39441j22616J05353J37879K13997I5691
$$ 275840 321173 701162 80943 407843 268402 145786 251139 389018 603015 95691
13597C61364K25714j5677j33265j03144L14671A07315L55596j842m524k09683
$$ 361364 587078 571401 438136 334992 649663 107315 462911 461069 456545 246862
13587B46862K15641K40226A27179c1412B89290J6981L86402j68789l7839j24781
$$ 246862 462503 702729 127179 -31412 289290 306271 692673 523884 486045 361264
13577C61264N8577J47690B79087K83580A6927i3666C32046N2773j52587o2425
$$ 361264 419841 567531 279087 562667 16927 -93666 332046 384819 232232 169807
13567A69807J34l3833K25110N5585G8174M19997B2806O592c3778D97876k24776
$$ 169807 169941 136108 361218 416803 78174 498171 22806 29398 -33778 497876 273100
13556B73100l8878H7292N27402k98562j11826o8088J22839A09392K17702K7048
$$ 273100 234222 87292 614694 316132 204306 136218 259057 109392 327094 354142
13546C54142r7542K33220A59620J56967K8016J19180B28890K04581a07489D96369
$$ 354142 256600 489820 159620 316587 344603 463783 228890 433471 -107489 496369
13535D26653j44810k9475Q5063A66768L06481J35671j42192n0235J11256A01386
$$ 426653 281843 252368 337431 166768 473249 608920 466728 416493 527749 101386
13524C52040A1557N98818A4102K60000P1425r8222K60193r1189i6268D78090a6382
$$ 352040 11557 610375 14102 274102 345527 247305 507498 416309 -96268 478090 -16382
13512C17857J08528O9461A55877K77110r2342j2372A25279A6078N47768B07612
$$ 317857 426385 495846 155877 432987 340645 328273 125279 16078 563846 207612
13501B27848n2173E7848N09410a74671C70321j48268H6907J48157o5787J45921
$$ 227848 175675 57848 567258 -174671 370321 222053 86907 235064 169277 315198
13491C15198n4745P6150n6298P3207q2296m551r9048L7397J65354j6934L5100
$$ 315198 260453 336603 280305 353512 271216 266665 167617 205014 370368 353434 388534
13480C88534j39845L9418J4315J50260l7661j23909M3894j02716L6628H1285K46672
$$ 388534 248689 288107 302422 452682 415021 291112 335006 232290 268918 81285 327957
13469C27957J9462A39433P1178l8922a6616A5947J61829H7772L66299d1418B75439
$$ 327957 347419 139433 210611 171689 -16616 15947 177776 87772 454071 -41418 275439
13457B99755H7112O718K59826j66533q6060Q9468J09103j00447J20167A12968
$$ 299755 87112 93830 353656 187123 101063 190531 299634 199187 319354 112968
13446B17021j1538L1596J9505n4976m7879K22380A81492J5244f1406A24053L01138
$$ 217021 205483 237079 256584 201608 153729 376109 181492 196736 -61406 124053 425191
13435D25191F3363M00590j42252O980I7686L938K11859F9532K78741p4928C6159
$$ 425191 63363 463953 321701 328681 97686 101624 313483 69532 348273 273345 36159
13423a07227I3064L51080l8533A18458m7169J67649j10028J32642N8689J27319
$$ -107227 93064 444144 405611 118458 71289 238938 128910 261552 320241 447560
13413D47560A44627K45047j79558P1872A24845R1378q7646K9777m6075g4715A20956
$$ 447560 144627 389674 210116 281988 124845 216223 128577 158354 112279 -74715 120956
13401A79648H952M81086G0136L15042I9064B0413J46135C4225N2724J69773m1973
$$ 179648 8952 490038 70136 385178 99064 20413 166548 34225 86949 256722 214749
13390B14749L8782a20608l063B55578r0132J33797R9180O1718a82779D5609L82101
$$ 214749 253531 -120608 -123671 255578 165446 299243 398423 460141 -182779 45609 427710
13379D27710k06574H3353r941J7848K86401q7583k8770K2461j22002O0297j7271
$$ 427710 221136 83353 73412 91260 377661 290078 261308 283769 161767 222064 204793
13368B04793p486K52326A01640J88197J49235i0591c9836G596J1538P3114O8331
$$ 204793 197307 449633 101640 289837 439072 -90591 -39836 7596 19134 92248 160579
13357A60579o3865D6068g35D14731K13380A65428a0455B87366K18419A29378J77024
$$ 160579 96714 46068 -735 414731 628111 165428 -10455 287366 505785 129378 306402
13346C06402J70477B08340J44537J2607A58753B5612J84222J93828m6013H2557
$$ 306402 476879 208340 352877 365484 158753 25612 209834 403662 357649 82557
13335B26771M5419A02218C8101J25894c032A84019L06654j71223G9951J62474
$$ 226771 272190 102218 38101 163995 -3032 184019 490673 319450 79951 242425
13325B42425F8014L97078J36226B25005M6909P1330f7276A65479K99542A07434
$$ 242425 68014 465092 601318 225005 271914 343244 -67276 165479 465021 107434
13314B28019H8474K47150m6819O3066A16802M36284B5189J63504j8766B2722K41178
$$ 228019 88474 335624 288805 351871 116802 553086 25189 188693 169927 22722 263900
13303B63900L848G4579a23004e3752P32C2979g1379A71257b18878f377C18718
$$ 263900 267748 74579 -123004 -53752 -53020 32979 -71379 171257 -218878 -6377 318718
13291A7664c8279J0673A90578l8193H892c8748A63732a25513B24507a00027O784
$$ 17664 -38279 -27606 190578 152385 8892 -38748 163732 -125513 224507 -100027 -93243
13280i3243A67442O9538p9708P8894i009B1409J03766Q7689a41787C18079q771
$$ -93243 167442 236980 157272 236166 -9009 21409 125175 212864 -141787 318079 309308
13269C09308d4473C91165j59207j08280m9162J12680Q2420i0500B48327a71890
$$ 309308 -44473 391165 231958 123678 74516 187196 269616 -90500 248327 -171890
13258E1696K26612p9414M16321A17650n4535R0931c8803B73739A7018g047A6004
$$ 51696 278308 198894 615215 117650 63115 154046 -38803 273739 17018 -7047 16004
13246A68661a24998A12186a59761A42331A0552b9195C47360j42941j01301D4025
$$ 168661 -124998 112186 -159761 142331 10552 -29195 347360 204419 103118 44025
13235B45574H6113L4042Q57O389h2634j13911B06619J29075L419a58828C9604
$$ 245574 86113 120155 121012 127401 -82634 -196545 206619 335694 339113 -158828 39604
13223I1648C1585a3001C74562d9289B61929P5401F9914J801J49989K3562K61531
$$ 91648 31585 -13001 374562 -49289 261929 337330 69914 71715 221704 245266 506797
13212E06797a11564A53572L00438B7332e3798C86094j994A72647J85071A55325
$$ 506797 -111564 153572 454010 27332 -53798 386094 384100 172647 357718 155325
13201I9280a58330A04963a18725j1065K4262m770B48874J40553A09048i169B27406
$$ 99280 -158330 104963 -118725 -129790 -105528 -110298 248874 389427 109048 -9169 227406
13189H4654J06413L4332b10574A38447a02337a666p7494B90976a43389A26427
$$ 84654 191067 225399 -210574 138447 -102337 -1666 -79160 290976 -143389 126427
13178I8360P0382G9649d7341A97948p1528J32765r1394B4065J31176n103a34720
$$ 98360 168742 79649 -47341 197948 126420 259185 167791 24065 155241 150138 -134720
13166G30923A76769N7217E95b08181Q3419d7124j16602B87534q4339h801r015
$$ 730923 176769 233986 595 -208181 -124762 -47124 -163726 287534 203195 -8801 -17816
13155a7816k06162a4828A13629R3536d6677A27409Q077a591l9874G5347K02468
$$ -17816 -223978 -14828 113629 207165 -46677 127409 135486 -1591 -41465 75347 277815
13144B77815b8023j53230P9159n0431A76674l5433B265K6053L48646b52379F6
$$ 277815 -28023 -181253 -102094 -152525 176674 141241 2265 28318 376964 -252379 66
13132B28419f0372j5242I8144L5163d9385A37143o5436P3644J4432K332N335g7251
$$ 228419 -60372 -75614 98144 133307 -49385 137143 71707 145351 159783 162115 167450 -77251
13119B10542r3550J43564D1303R9565D4533j5601K49488G8366O8114R7923a64552
$$ 210542 116992 260556 41303 140868 44533 28932 278420 78366 146480 244403 -164552
13107A38576o8660b37058J8798A80236c8954B01903J85631e143l5459r7616b3193
$$ 138576 69916 -237058 -218260 180236 -38954 201903 387534 -5143 -40602 -138218 -23193
13095a72934b0501j2295j05761a3400A14809a66664d6333j18880K6389E9114B7432
$$ -172934 -20501 -32796 -138557 -13400 114809 -166664 -46333 -165213 -138824 59114 27432
13083a2442E188K51995j16890e4078p8915A55026D1056P4114a94034B78612G7758
$$ -12442 5188 257183 140293 -54078 -132993 155026 41056 115170 -194034 278612 77758
13071a46824A11734O4663e4803q6248A22553E254P1965J24794o0667g6262E9343
$$ -146824 111734 176397 -54803 -141051 122553 5254 77219 202013 141346 -76262 59343
13059C9430K21544O8439f0181B71017E6570J15964a11713B1754Q4307n1491e0162
$$ 39430 260974 329413 -60181 271017 56570 172534 -111713 21754 106061 54570 -50162
13047D9207M19472A09799K54921a39175C88658c05615b6485I4695K28670F9276
$$ 49207 468679 109799 364720 -139175 388658 -305615 -26485 94695 323365 69276
13036B17528e327A2802M8101a22002B33513Q5336d3789B4826J64313n3249P431
$$ 217528 -5327 12802 60903 -122002 233513 318849 -43789 24826 189139 135890 143321
13025A43321R1361b00826B65100K81638A95652n4860a6999A37872J57162A3393
$$ 143321 234682 -200826 265100 546738 195652 140792 -16999 137872 295034 13393
13014C1834a81472C12718A54374M5074n7201L90168k59004L6246A07573K74256
$$ 31834 -181472 312718 154374 199448 142247 532415 273411 309657 107573 381829
13004C81829O0645D7189b45695A80302j596m0356J94319a11022L892A57835b33298
$$ 381829 442474 47189 -245695 180302 178706 138350 332669 -111022 -107130 157835 -233298
12992a7966j17389G5820J7030J49524f1500G2618e5003l20409B79902a7067B11115
$$ -17966 -135355 75820 92850 242374 -61500 72618 -55003 -375412 279902 -17067 211115
12980c2125D38923d052I6296L4901O0105J08399E8414K19979b52965a00119F078
$$ -32125 438923 -4052 96296 131197 191302 299701 58414 278393 -252965 -100119 6078
12968D12568c16108C07194b0728A17370d4714O358h003I5782K3815d1474j04182
$$ 412568 -316108 307194 -20728 117370 -44714 -38356 -8003 95782 119597 -41474 -145656
12957a45656n3212R1939M8233J9535A34047d4323k0478B01981o4690a19020j16857
$$ -145656 -198868 -106929 -58696 -39161 134047 -44323 -64801 201981 137291 -119020 -235877
12946b35877A77560J25631F2644i013A89151a05665B28413c8309A48413J0488
$$ -235877 177560 303191 62644 -9013 189151 -105665 228413 -38309 148413 158901
12936A58901a05960B59925G5089K18804a36303C92482r8225O286o3436g7050G1104
$$ 158901 -105960 259925 75089 293893 -136303 392482 294257 300543 237107 -77050 71104
12924a13652j6969A00790c1746o4450J0742b0719A3443a83816C88907a53586E987
$$ -113652 -130621 100790 -31746 -96196 -85454 -20719 13443 -183816 388907 -153586 5987
12912A36836F0896J19857a05353J9572M30j41567A81841o6968J25374k4485b90493
$$ 136836 60896 180753 -105353 -85781 -85351 -226918 181841 114873 240247 215762 -290493
12900b5148D7584a06092r5785h6063e686A07409g2966A00129K35717e823j59829
$$ -25148 47584 -106092 -201877 -86063 -5686 107409 -72966 100129 335846 -5823 -165652
12889a65652A95039M2017f6112l10534B8727R8782b18295B46090b97062C8632
$$ -165652 195039 237056 -66112 -376646 28727 127509 -218295 246090 -297062 38632
12878b546B13379e9722A86353a8436A16254g3385k6286A51238d6401m3571F154
$$ -2546 213379 -59722 186353 -18436 116254 -73385 -99671 151238 -46401 -89972 6154
12866d4087C7924b58235e0915j66119f3887b9516J3657D04372b36919I0102j5206
$$ -44087 37924 -258235 -50915 -217034 -63887 -29516 -15859 404372 -236919 90102 74896
12855G4896a36910F7831c0001I2764M2293a02081j3434A3684b05112B47385b60197
$$ 74896 -136910 67831 -30001 92764 135057 -102081 -115515 13684 -205112 247385 -260197
12843A71483a15281A75834J60755a35130B79846A29849J34217r5479K4322m7286
$$ 171483 -115281 175834 336589 -135130 279846 129849 264066 168587 192909 145623
12833A45623a4039k479A22474h0166k16121F5568K73474h6835E6305K49442g5354
$$ 145623 -14039 -16518 122474 -80166 -296287 65568 339042 -86835 56305 305747 -75354
12821a74176F6408a1180j04020E2140L08225A07546c5017j46783C04470G5418
$$ -174176 66408 -11180 -115200 52140 360365 107546 -35017 -181800 304470 75418
12810I8425O725J20787A2387c67453A67232H688J54458a75303L4560I060L84679
$$ 98425 105150 225937 12387 -367453 167232 8688 163146 -175303 -140743 9060 393739
12799C93739F2014b5588A75743K1970l7627K5864K0832J08237i3434j4881M0277
$$ 393739 62014 -25588 175743 197713 160086 185950 206782 315019 -93434 -108315 -68038
12788f8038J5385A8649g5933A80786a39153A10458C4127g0340G3823J23123i506
$$ -68038 -52653 18649 -75933 180786 -139153 110458 34127 -70340 73823 196946 -9506
12776A4273N0002K54925i9442d7432f620B08480d3437j76228j80945f1705C1310
$$ 14273 64275 319200 -99442 -47432 -6620 208480 -43437 -219665 -400610 -61705 31310
12764H8673b91474C2654a62102B11986K5249c95572d105j29799G0057b45065E32284
$$ 88673 -291474 32654 -162102 211986 237235 -395572 -4105 -133904 70057 -245065 532284
12752I8688K7748J40741A07637B1228b75319H827a76376A59499d19355A27798
$$ 98688 126436 267177 107637 21228 -275319 8827 -176376 159499 -419355 127798
12741G8417f325j65592D3429K09950J54599A51664c1032A17501K14623A19236
$$ 78417 -6325 -171917 43429 253379 407978 151664 -31032 117501 332124 119236
12730A7755i4741B75503b0523q4033C9349J25281e9326I1435a97111E3374a86555
$$ 17755 -94741 275503 -20523 -104556 39349 164630 -59326 91435 -197111 53374 -186555
12718A0379J20182Q5427D7206J65500d4734B0850L60722I9032l3087N8043L56099
$$ 10379 130561 215988 47206 212706 -44734 20850 381572 99032 65945 123988 480087
12707D80087A57476F4166N12289A55846k1446i9805K6309C5517J68646k3264N7021
$$ 480087 157476 64166 576455 155846 134400 -99805 -73496 35517 204163 180899 237920
12696B37920D5092J38812e4625o7096l4900j84745e1411j07395D7565j2454K19059
$$ 237920 45092 183904 -54625 -121721 -156621 -341366 -51411 -158806 47565 35111 254170
12685B54170b6509K451B8000N7916c01531J20813h0661I3362J9877l2238A8290
$$ 254170 -26509 -24058 28000 85916 -301531 -180718 -80661 93362 113239 81001 18290
12673a26021k66890E1151J15984b48328o7549A07754E698J55747b41900f4268
$$ -126021 -392911 51151 167135 -248328 -315877 107754 5698 161445 -241900 -64268
12662h0255D40636A25761A205i168B9932n390K16960J07565a19527E37468G3085
$$ -80255 440636 125761 1205 -9168 29932 24542 241502 349067 -119527 537468 73085
12650D01690A38985l3022C1189Q1493m04b10190H6831N09368k82586c21123c7305
$$ 401690 138985 105963 31189 112682 112278 -210190 86831 596199 313613 -321123 -37305
12638B4533J34024Q22P3093P8540e924C4856K62745j17501J27556M624A18351
$$ 24533 158557 159379 232472 311012 -5924 34856 297601 180100 307656 312280 118351
12626A79633k3674G5939J64729o6729O4603A14758D8842J95294r8113n5325d4175
$$ 179633 155959 75939 240668 173939 238542 114758 48842 244136 146023 90698 -44175
12614a91243F5978J6153J99786j35424L2546i3767j15748A02718M9897a0747B8769
$$ -191243 65978 82131 281917 146493 179039 -93767 -209515 102718 152615 -10747 28769
12602c7526l16963F251K57442A23176E2332b13807I5324P2231E9534R2119O6266
$$ -37526 -354489 6251 263693 123176 52332 -213807 95324 167555 59534 151653 217919
12591B17919e0985A47J20063b18692R8297B06766O365p7730b45830q321C6710
$$ 217919 -50985 147 120210 -218692 -120395 206766 213131 135401 -245830 -254151 36710
12579B58940F6393a36774A13404a35044a8994j71088A29858J99611b5795A90452
$$ 258940 66393 -136774 113404 -135044 -18994 -190082 129858 329469 -25795 190452
12568C2939J4071f8052A2630M40741q1344j00953J64640A95571G4042a31223o3768
$$ 32939 47010 -68052 12630 453371 372027 271074 435714 195571 74042 -131223 -194991
12557a94991c8600j82739h1217E3161K90544e1985E3230J41856R3625J15514c65387
$$ -194991 -38600 -221339 -81217 53161 343705 -51985 53230 195086 288711 404225 -365387
12545a35182E08675E920b27849j52693g8038A51114a9057E312K79917A06402a79231
$$ -135182 508675 5920 -227849 -380542 -78038 151114 -19057 5312 285229 106402 -179231
12533D4636a85163A58031E7772c3253A91172b28026j70927a61438D9668c9544
$$ 44636 -185163 158031 57772 -33253 191172 -228026 -398953 -161438 49668 -39544
12522f2223n5408j03073C8163c17260a34854B53324a28566B89114G5344P8861
$$ -62223 -117631 -220704 38163 -317260 -134854 253324 -128566 289114 75344 154205
12512A54205N1958p0042B0825J17609L1354C283a51785B30876J02019c52666A30933
$$ 154205 206163 136121 20825 138434 169788 3283 -151785 230876 332895 -352666 130933
12500e6615A01045J0993a74371B10486a02349A40335R091b88222i2785b8930e832
$$ -56615 101045 112038 -174371 210486 -102349 140335 149426 -288222 -92785 -28930 -5832
12488A26975a20251j12919N6268A9493f3308r8033E1836g5632n7888A23973n0572
$$ 126975 -120251 -233170 -176902 19493 -63308 -161341 51836 -75632 -133520 123973 73401
12477G3401A5101J53660E8510b57346B54094o1786A0343c54007A55151A7174b13054
$$ 73401 15101 168761 58510 -257346 254094 192308 10343 -354007 155151 17174 -213054
12465d2753E2013b69999A57422f0259D1486d53435G5954C735K3968O2027N5786
$$ -42753 52013 -269999 157422 -60259 41486 -453435 75954 3735 27703 89730 145516
12454A45516D8827J7519A4927i6560A55148a33064A81737a61468j72493a08740
$$ 145516 48827 66346 14927 -96560 155148 -133064 181737 -161468 -333961 -108740
12443B83270d7086G5378f649A40675M6756C5047b29334a07828j30508L2793A30103
$$ 283270 -47086 75378 -6649 140675 187431 35047 -229334 -107828 -238336 -205543 130103
12431B1355N1638a23714C38571m4177o6905r4503a19597e7577j1495k25729f0351
$$ 21355 72993 -123714 338571 294394 227489 132986 -119597 -57577 -69072 -294801 -60351
12419A93682A3047b73331a4526H0681a55603c9716k3068A05942K16662A24836
$$ 193682 13047 -273331 -14526 80681 -155603 -39716 -62784 105942 322604 124836
12408A01717a94072I4464Q7336D1643g2454j3991C56080f851j37011A48834D7701
$$ 101717 -194072 94464 181800 41643 -72454 -86445 356080 -6851 -143862 148834 47701
12396I1700b66631A37765E6581J43093c6253l10787i957A488b25115A55614l5226
$$ 91700 -266631 137765 56581 199674 -36253 -347040 -9957 1488 -225115 155614 120388
12385A20388E1998b09421O2598j09691E87507B40308J2189c576B97224r5775a34441
$$ 120388 51998 -209421 -146823 -256514 587507 240308 252497 -3576 297224 201449 -134441
12373d56939E4138J8502l596J17015a18833A25814k0864i9891j17499B28825B3892
$$ -456939 54138 72640 69044 186059 -118833 125814 104950 -99891 -217390 228825 23892
12361c02148a06284a5853A62178b1812A2619a47780d6916B21815h9454q0442h1860
$$ -302148 -106284 -15853 162178 -21812 12619 -147780 -46916 221815 -89454 -169896 -81860
12349A7719h8606A959i7304B28417a26310P660r2073I7597a58207R46B0049h2677
$$ 17719 -88606 1959 -97304 228417 -126310 -118650 -210723 97597 -158207 -157261 20049 -82677
12336b4835B79067d04276B49438b6564J1527D0992a92054p56B66692b30659d4537
$$ -24835 279067 -404276 249438 -26564 -15037 40992 -192054 -192810 266692 -230659 -44537
12324a0038B07980q1800a86675q9302F2600K88101b75960i8437b6382D4739a78526
$$ -10038 207980 126180 -186675 -275977 62600 350701 -275960 -98437 -26382 44739 -178526
12312B23590H8769d4370A71860a3903I5132a10242D1597O9330J20027I7352a16067
$$ 223590 88769 -44370 171860 -13903 95132 -110242 41597 110927 230954 97352 -116067
12300d0178m909B73889A10034L30350e2554F3439a02154B68099b0050F3785J37724
$$ -40178 -45087 273889 110034 440384 -52554 63439 -102154 268099 -20050 63785 201509
12289B01509K6371p4128g2883q6818c3599J508A16587b97963R4286A85826R329
$$ 201509 227880 153752 -72883 -159701 -33599 -32091 116587 -297963 -203677 185826 195155
12278A95155e9378j4280j1429B47336o2474K71546F4675K12716j38517e3455A19790
$$ 195155 -59378 -73658 -85087 247336 184862 456408 64675 277391 138874 -53455 119790
12266H671J31871J4905g0757j93244a8613j34331b3012o3661C83687A11510a4515
$$ 8671 140542 155447 -70757 -264001 -18613 -152944 -23012 -86673 383687 111510 -14515
12254a47263d178F920e0731A21936N7034O6677o0223j0824a38397B66964M9490
$$ -147263 -4178 6920 -50731 121936 178970 245647 185424 174600 -138397 266964 316454
12243C16454Q6368B2605J83322D3941K98137j34049a69855A91248E2244a46512
$$ 316454 402822 22605 205927 43941 342078 208029 -169855 191248 52244 -146512
12232F0760K12498D5411K58806a04223B14162b9944E24728b08570A11903J32565
$$ 60760 273258 45411 304217 -104223 214162 -29944 524728 -208570 111903 244468
12222B44468l6256J03063K51813A06834N8134J56372B3449K10781G1362A86Q6388
$$ 244468 208212 311275 563088 106834 164968 321340 23449 234230 71362 186 86574
12211H6574K57131A21203O1808R9438d7246B07728l1336R5497G235L63386j16649
$$ 86574 343705 121203 183011 282449 -47246 207728 176392 271889 7235 370621 253972
12200B53972P6832f4154D72401o3396a28527a4278j89212B87701A23299f5779
$$ 253972 330804 -64154 472401 409005 -128527 -14278 -203490 287701 123299 -65779
12189D1600P1446M0798C5009M4228b3874j6760A37405E6275d975I1536d228A58546
$$ 41600 113046 153844 35009 79237 -23874 -40634 137405 56275 -4975 91536 -4228 158546
12176D68558B11397h55k70785D82196k25856E7001K86465A44033E3600L11796
$$ 468558 211397 -855 -271640 482196 256340 57001 343466 144033 53600 365396
12166C65396K4256n1221k4174B3898M9264d3576B04208O329i2956o9241F7285
$$ 365396 389652 338431 314257 23898 73162 -43576 204208 210537 -92956 -162197 67285
12154b14089B7833J83848P8714A30014D7879a07550n351A55339E7483d1006D4677
$$ -214089 27833 211681 290395 130014 47879 -107550 -112901 155339 57483 -41006 44677
12142a17059B17465J49627j07735b09365f2490c816A6396L62525C6601d43598
$$ -117059 217465 367092 259357 -209365 -62490 -3816 16396 378921 36601 -443598
12131a72874N6285m970B00493a08928B57076A3301M4167Q2590o6182L9168J47457
$$ -172874 -116589 -121559 200493 -108928 257076 13301 57468 140058 73876 113044 260501
12120B60501a33016r0957Q4142o9095C09641b38258E0558J9217N6430D43J07882
$$ 260501 -133016 -223973 -139831 -208926 309641 -238258 50558 69775 126205 443 108325
12109A08325n2271k3714M43076G7195a14429G5888d3439n9728b3320B1537a56772
$$ 108325 56054 32340 475416 77195 -114429 75888 -43439 -103167 -23320 21537 -156772
12097a8421r04j51131G4776a98810C42140a30615A02992g1111j2593J2070p1261
$$ -18421 -19325 -170456 74776 -198810 342140 -130615 102992 -71111 -83704 -71634 -142895
12086a42895j6843e2151j87966D1490b83869k780a4360C8216A3100d7865D35298
$$ -142895 -159738 -52151 -240117 41490 -283869 -286649 -14360 38216 13100 -47865 435298
12074H86258J014098H90266j82637a67490D79289B13646D8449b00203N0960A82400
$$ 886258 1900356 890266 707629 -167490 479289 213646 48449 -200203 -149243 182400
12063a1364q3051A93989B2435a07351G339b75917A64388o9926a6854C6649a45328
$$ -11364 -94415 193989 22435 -107351 7339 -275917 164388 94462 -16854 36649 -145328
12051b25808M5909h3106A88225b14950F8925P1594c3987A72671c0137j70102f9434
$$ -225808 -179899 -83106 188225 -214950 68925 140519 -33987 172671 -30137 -200239 -69434
12039A86275b8712Q891j08295J99N8687o8847K3952j41195H5570P0391f0975l19908
$$ 186275 -28712 -19821 -128116 -127917 -69230 -138077 -114125 -255320 85570 155961 -60975 -380883
12027c80883C02323h8234B0071J5241i6188D0373A6948O8489g8546H4889a48539
$$ -380883 302323 -88234 20071 35312 -96188 40373 16948 85437 -78546 84889 -148539
12015A33320e3874F2307P43a33897C21915j26124b94985D125P5595J91505E7007
$$ 133320 -53874 62307 63050 -133897 321915 195791 -294985 4125 79720 271225 57007
12003A15800J557K1157a9237o4222j42205A61835O3493a2449A9386O6349a4704
$$ 115800 117357 138514 -19237 -83459 -225664 161835 225328 -12449 19386 85735 -14704
11991A31221F4574a89130A07338C8527L45836F5297a60681A45129H003L31282
$$ 131221 64574 -189130 107338 38527 384363 65297 -160681 145129 8003 339285
11981C39285A54040c9644A90142o4047K01178a27680k83317J54822A34139a44135
$$ 339285 154040 -39644 190142 126095 327273 -127680 -410997 -256175 134139 -144135
11970a68215k15768C0361J64562o8425B8123a39799n0160d8362A37292b11976
$$ -168215 -383983 30361 194923 126498 28123 -139799 -189959 -48362 137292 -211976
11959B6741c84613I4873D2434J89667g6276B62499K7652c24821D23592j10393
$$ 26741 -384613 94873 42434 232101 -76276 262499 290151 -324821 423592 313199
11949C13199A27413d88789a91752B02401q7324b76993A12692c10241f7301J4146
$$ 313199 127413 -488789 -191752 202401 115077 -276993 112692 -310241 -67301 -53155
11939e3155B9408a80617j25721B52593i4327d5279l20183P0810a7280E0341J24534
$$ -53155 29408 -180617 -306338 252593 -94327 -45279 -365462 -294652 -17280 50341 174875
11928A74875q7339J89319H7205i9965k86170e099H978c9975j99749C1947Q1271
$$ 174875 87536 276855 87205 -99965 -386135 -5099 8978 -39975 -239724 31947 113218
11917A13218g3438A36920A9066f6260C9349g6718m59034a51435G1217c13761a54032
$$ 113218 -73438 136920 19066 -66260 39349 -76718 -535752 -151435 71217 -313761 -154032
11905H3652b6475B5036e4844B2372J16406R2911h0709B2229J42879I939J8475
$$ 83652 -26475 25036 -54844 22372 138778 231689 -80709 22229 165108 9939 28414
11894B8414c08597B8278L89891j80355B8588b25095b1707m15722A7495a6264A4673
$$ 28414 -308597 28278 418169 237814 28588 -225095 -21707 -437429 17495 -16264 14673
11882a66044A74311b24331o4530J33090A77875D0752q682J01662c80155A05883
$$ -166044 174311 -224331 -288861 -155771 177875 40752 32070 133732 -380155 105883
11871a26577l94655a98885m3014b4906j09376j17635B2866K44007f1619c0139
$$ -126577 -521232 -198885 -241899 -24906 -134282 -251917 22866 266873 -61619 -30139
11860D315a77633A94728J53832b00737l3794J00618l129H871b35331A1967d779
$$ 4315 -177633 194728 348560 -200737 -234531 -133913 -137042 8871 -235331 11967 -4779
11848a07506A40825a30806I1104a87908j08554F9484J9357i9087D731a26455A86
$$ -107506 140825 -130806 91104 -187908 -296462 69484 88841 -99087 4731 -126455 186
11836A14992a59782j18797J32783q2752O2820J0811k84476B3034a44280a4014
$$ 114992 -159782 -278579 -145796 -228548 -165728 -154917 -439393 23034 -144280 -14014
11825G4881A5296i4242A72729b12765A57150A3017c0092k2005q5415C70315j65472
$$ 74881 15296 -94242 172729 -212765 157150 13017 -30092 -52097 -137512 370315 204843
11814B04843J4904b15143i2331k48217D32312i6669A71582D5005a12593K9449
$$ 204843 219747 -215143 -92331 -340548 432312 -96669 171582 45005 -112593 -83144
11804h3144A207R5629c5848C3806Q6954m3359l3446J25033f7293j91362A01996
$$ -83144 1207 96836 -35848 33806 120760 77401 43955 168988 -67293 -258655 101996
11792A74236B3749K0808a24850L1092k04244A58051l4397K6252a56000B62828
$$ 174236 23749 44557 -124850 -93758 -298002 158051 123654 149906 -156000 262828
11781C11819C3680N190g0645q1667k38688G5487a1878k81883C4056c43718a36819
$$ 311819 33680 38870 -70645 -152312 -391000 75487 -11878 -293761 34056 -343718 -136819
11769G1994b35532g3528c1103D56444f0796H2970a33846A64950a10392l9084A03894
$$ 71994 -235532 -73528 -31103 456444 -60796 82970 -133846 164950 -110392 -149476 103894
11757B05310G7389e9699B60681f0941A45870a9090B4120b27952e9721A18236J45629
$$ 205310 77389 -59699 260681 -60941 145870 -19090 24120 -227952 -59721 118236 263865
11746B63865a36672A12198l46J10024b00653A11157M0312a20581A6499J63314
$$ 263865 -136672 112198 111852 221876 -200653 111157 151469 -120581 16499 179813
11736A79813P7640G0130l1152b98254A00241a07952d6975j05132g149p9453j24858
$$ 179813 257453 70130 38978 -298254 100241 -107952 -46975 -152107 -7149 -86602 -211460
11725b11460C58977a30702O1233F2545J10123k9336n3391K88825j46766q7515
$$ -211460 358977 -130702 -69469 62545 172668 143332 89941 378766 232000 144485
11715A44485J89367b0711A4320J99425b49628g2148j66761A44336a69706E7411
$$ 144485 333852 -20711 14320 213745 -249628 -72148 -238909 144336 -169706 57411
11704A7463J0919N1657J9546K5846J08410b70634j35415F8578J25744l0041b23947
$$ 17463 28382 80039 99585 125431 233841 -270634 -406049 68578 194322 164281 -223947
11692A10323h8643m1057C44372B0490b01107C1795e5645n9614N326A79251p9149
$$ 110323 -88643 -129700 344372 20490 -201107 31795 -55645 -115259 -109933 179251 100102
11681A00102j7678B6842P0220b42560H5463Q0805o9700L7635o3188h4304F9127
$$ 100102 82424 26842 97062 -242560 85463 166268 96568 134203 71015 -84304 69127
11669b95343P3229F07240h8074B04254k9666b5243r1704l8299H0263d5319B69044
$$ -295343 -222114 607240 -88074 204254 174588 -25243 -116947 -155246 80263 -45319 269044
11657C5055e6726B25450J93943G3086J70399e0524j56036O9913H4154o017j6874
$$ 35055 -56726 225450 419393 73086 243485 -50524 -206560 -136647 84154 78137 61263
11646F1263N2289J34335a8488j3047a0100I9452E068d151F4312D960a56242f5681
$$ 61263 113552 247887 -18488 -31535 -10100 99452 5068 -4151 64312 4960 -156242 -65681
11633A68351C1895f9897A90705I060K96597J91819j74562h5084I0767K25138j30346
$$ 168351 31895 -69897 190705 9060 305657 497476 322914 -85084 90767 315905 185559
11622A85559g4594B09592F616M88352b33615C57224b54248j19374H2584b41416
$$ 185559 -74594 209592 6616 494968 -233615 357224 -254248 -373622 82584 -241416
11611C9034b50272N4083b2072A53782K28138a41303D4667K71055I1387a02399
$$ 39034 -250272 -196189 -22072 153782 381920 -141303 44667 315722 91387 -102399
11600c8389A27343b79552a17782q9983f9443l7634j43656g4564A8802f3792B53482
$$ -38389 127343 -279552 -117782 -207765 -69443 -107077 -250733 -74564 18802 -63792 253482
11588a27890b9924H4044a690A01390D5545P335c3246B58383a29634A61302J9005
$$ -127890 -29924 84044 -1690 101390 45545 52880 -33246 258383 -129634 161302 180307
11577A80307H102N8394R8448J71109A373J1889b16148g6084I9323b23232B449
$$ 180307 8102 66496 164944 336053 1373 13262 -216148 -76084 99323 -223232 2449
11565C2835J86280l2139P5651j00194e6302B52932m6004j672b42934a00469n3281
$$ 32835 219115 186976 262627 162433 -56302 252932 206928 205256 -242934 -100469 -153750
11554a53750C61946C6995M3936p642L25111h0887F1758k347J23588i88I8024C4818
$$ -153750 361946 36995 80931 73289 398400 -80887 61758 59411 182999 -988 98024 34818
11541a06733a3040k12525E189K03894A211L9639O0186N8592n1116M1773o4000
$$ -106733 -13040 -225565 5189 209083 1211 40850 101036 159628 108512 150285 86285
11530H6285a88510A50906O5385J48126J33851H4614R5794a94531A10671E3891
$$ 86285 -188510 150906 216291 364417 498268 84614 180408 -194531 110671 53891
11519a49341C32774E5531O4334g8392B38091j02480Q5059q612b31473A58011b48399
$$ -149341 332774 55531 119865 -78392 238091 135611 220670 212058 -231473 158011 -248399
11507a79066D4915J44218q7410f73F9987K27119q9056m8229l3885k4497J83871
$$ -179066 44915 189133 101723 -673 69987 297106 208050 159821 125936 101439 285310
11496B85310j37799A2053L3336c7344C76931j03884i1018c3235D33790d4819A80985
$$ 285310 147511 12053 45389 -37344 376931 273047 -91018 -33235 433790 -44819 180985
11484D04149C7961a13007B16349j2957l7895M0314d9842B83376D2445P990J70154
$$ 404149 37961 -113007 216349 203392 165497 205811 -49842 283376 42445 50435 220589
11473B20589a2159C80788j1030A51605a47914B43787b46912E2611h0680D22282
$$ 220589 -12159 380788 369758 151605 -147914 243787 -246912 52611 -80680 422282
11462a67067A61771l7141J47360b39649A02381a46065d893K334A42832J78085
$$ -167067 161771 124630 271990 -239649 102381 -146065 -4893 -2559 142832 320917
11452C20917h001B56903g9129B28619o1204L0392n9351c06548c6304k8341m7761
$$ 320917 -8001 256903 -79129 228619 167415 197807 138456 -306548 -36304 -64645 -112406
11441a12406C14227I6394B7618L2316J57119a63438d9040A48183m8533J53007
$$ -112406 314227 96394 27618 59934 217053 -163438 -49040 148183 99650 252657
11431B52657a6761j37117g194n4931E6905K5176a2136A56766O3477r6133Q7098
$$ 252657 -16761 -153878 -7194 -62125 56905 82081 -12136 156766 220243 124110 211208
11420B11208b23941B92056J61057a4240A02146B0885c0506G3716A1839L32732
$$ 211208 -223941 292056 453113 -14240 102146 20885 -30506 73716 11839 344571
11410C44571b78095G3144J56872B672J78918d5921B50684G0529L81076a1458j55136
$$ 344571 -278095 73144 230016 2672 181590 -45921 250684 70529 451605 -11458 -166594
11399a66594B67652I2307j8837g4107A08188a88276E39668B62790b84987A72660
$$ -166594 267652 92307 73470 -74107 108188 -188276 539668 262790 -284987 172660
11388a18969c2679C24103F1290L1074B8977J55883b70816F135a82946G4569a58097
$$ -118969 -32679 324103 61290 92364 28977 184860 -270816 6135 -182946 74569 -158097
11376A52125P0002F0840a51054J9666c481q6259G6526n012h5181I3951K903a73073
$$ 152125 222127 60840 -151054 -131388 -3481 -89740 76526 71514 -85181 93951 96854 -173073
11363b08175A98061o6339i5591j86673B49336A06024h9282J1764b9100A15133
$$ -208175 198061 131722 -95591 -282264 249336 106024 -89282 -77518 -29100 115133
11352b11952M1771B26655a12946A55K05544d438C3532c9438A78654e4610j60295
$$ -211952 -170181 226655 -112946 155 205699 -4438 33532 -39438 178654 -54610 -214905
11341b14905A09995L7174b12532A96120A1977b04336A65044a50014A14133J79617
$$ -214905 109995 147169 -212532 196120 11977 -204336 165044 -150014 114133 293750
11331B93750D0506a55300B592c45135a8631j85786A74225k4621J1319g8391B17137
$$ 293750 40506 -155300 2592 -345135 -18631 -204417 174225 149604 160923 -78391 217137
11319a52897D9884J28272d1162F6770J61280j11976J64522a91747q3519B55654
$$ -152897 49884 178156 -41162 66770 228050 116074 280596 -191747 -275266 255654
11308a55811K869K921O8272k78032D5855a06629p7865O868B07251a18880I3750
$$ -155811 -152942 -150021 -81749 -359781 45855 -106629 -184494 -177626 207251 -118880 93750
11296d5230j75414A72320b16248P5869I3424p023a62922A08062c3608k16996E7585
$$ -45230 -220644 172320 -216248 -140379 93424 86401 -162922 108062 -33608 -250604 57585
11284C58762h655l23984H6206K8685c00954A08512a56697f3732B10101b51975
$$ 358762 -8655 -332639 86206 114891 -300954 108512 -156697 -63732 210101 -251975
11273a80689J1372D6973K49936b37159A356J40196D4884N313a26498B32178a88439
$$ -180689 -169317 46973 296909 -237159 1356 141552 44884 50197 -126498 232178 -188439
11261b47811A04478F593c25158C14247a28637k86437I2092e7769K6810m4665L4785
$$ -247811 104478 6593 -325158 314247 -128637 -415074 92092 -57769 -30959 -75624 -40839
11250d0839I5225c08907A56780d3479k32685B752a55512J692p2999e2774j12539
$$ -40839 95225 -308907 156780 -43479 -276164 2752 -155512 -153820 -226819 -52774 -165313
11239a65313D7928a93094C5154R9709d3914J6390A69658a28768b2264k57883D10604
$$ -165313 47928 -193094 35154 134863 -43914 -27524 169658 -128768 -22264 -280147 410604
11227B04492i7167A54857h9891C01708L468I1834b10203M2455j7699A89998d550
$$ 204492 -97167 154857 -89891 301708 305176 91834 -210203 -167748 -185447 189998 -4550
11215b66017P0232k05375e5876j4857E9821P1886a43794b9736J2264M043C29415
$$ -266017 -195785 -401160 -55876 -70733 59821 131707 -143794 -29736 -17472 -13429 329415
11203C00264A33855k2303M7769o4097d01384C8831J98345c2534m0992J4887k39079
$$ 300264 133855 111552 159321 95224 -401384 38831 237176 -32534 -73526 -58639 -297718
11192b97718h8427A25341J26220p8431i4748N567F0855c1519j4694k36658B0450
$$ -297718 -88427 125341 251561 173130 -94748 -89181 60855 -31519 -46213 -282871 20450
11180B96508e076F5317a11474E405L3062J09480b51644I2337a43705B26486a57751
$$ 296508 -5076 65317 -111474 5405 38467 147947 -251644 92337 -143705 226486 -157751
11168C9711b86265B06688r6811c88602C40371j22225b41319d5127A44553i8041
$$ 39711 -286265 206688 109877 -388602 340371 218146 -241319 -45127 144553 -98041
11157b22033B72700a91356G8719Q0398J45962p415l4919d5285E5994b7741j7315
$$ -222033 272700 -191356 78719 159117 305079 297664 262745 -45285 55994 -27741 -45056
11146d5056A73616a01317l7486A60687E6198k3791L51257c59956a65124f9724
$$ -45056 173616 -101317 -138803 160687 56198 32407 383664 -359956 -165124 -69724
11135B32624E0229b84458A5011J92350m5424K7002a18489b5316D629J0478J0178
$$ 232624 50229 -284458 15011 207361 161937 188939 -118489 -25316 4629 15107 25285
11124B5285J49674d06944A11671a41193M8264j07431A80331q8753a41531B06302
$$ 25285 174959 -406944 111671 -141193 -92929 -200360 180331 91578 -141531 206302
11113d06631F7760j3243a00792B56194E4084J78521J09264J04806a897G179M56210
$$ -406631 67760 54517 -100792 256194 54084 232605 341869 446675 -1897 7179 463389
11102D63389k24717B9131a2932q3333C07516j26805l0498L37092F7699n170J27628
$$ 463389 238672 29131 -12932 -96265 307516 180711 150213 487305 67699 62529 190157
11091A90157G6674N7499J37311R4675D1520L24623A64979J63179q9637o9198M1588
$$ 190157 76674 134173 271484 366159 41520 366143 164979 328158 238521 169323 210911
11080B10911K50121D4005L06237F8425M00791F2041A0639M4594J9272M30137A36237
$$ 210911 461032 44005 350242 68425 469216 62041 10639 55233 74505 504642 136237
11068B44716j11074R4366L68020j44885P3935k04871L5817L4374L62212m8984
$$ 244716 133642 228008 596028 451143 525078 320207 356024 390398 752610 703626
11058G03626j49009J97738j42589K1443q5919K05661J44267j10810K37796m81643
$$ 703626 554617 752355 609766 631209 545290 750951 895218 784408 1022204 540561
11048E40561J88922j06323J39834j93819J77227j06013N3813k77491N8425L24384
$$ 540561 729483 623160 762994 569175 746402 640389 694202 416711 475136 799520
11038G99520j56501K5764N6312m7917k70750L18532k21062L6133R0912R222q6380
$$ 799520 643019 668783 725095 677178 406428 724960 503898 540031 630943 640165 553785
11027E53785j31814K48526J30872m2386j21884C04226K56944Q5849K4416l1573
$$ 553785 421971 670497 801369 758983 637099 304226 561170 647019 671435 639862
11017F39862B11731M19125l14628M11878k61038N18779B75857K02423J8140p5107
$$ 639862 211731 630856 316228 728106 467068 985847 275857 478280 496420 421313
11007D21313j82942K86846l5499p7811L38190k71850J40311j41078J12612j81943
$$ 421313 238371 525217 489718 411907 750097 478247 618558 477480 590092 408149
10997D08149M29222l12972k48613L62025j12773J88153k38281K69226J09318j56406
$$ 408149 837371 524399 275786 637811 525038 713191 474910 744136 853454 697048
10987F97048L24720j09423J95687n26002L98464J23417j00863J89372j73567M89273
$$ 697048 1021768 912345 1108032 582030 980494 1103911 1003048 1192420 1018853 1508126
10977A508126L6189J97478J74593M99820J35688L44623j66432k72077j09090j1638
$$ 1508126 1544315 1741793 1916386 2416206 2551894 2896517 2730085 2458008 2348918 2337280
10967B337280n42444N0700K1216j22102j44654k41057L81770n1350n27218K43728
$$ 2337280 1794836 1845536 1866752 1744650 1599996 1358939 1740709 1689359 1162141 1405869
10957A405869N32656m7282n6802l43973k1678k34980j81144m3537j44340k93596
$$ 1405869 1938525 1891243 1834441 1490468 1468790 1233810 1052666 1009129 864789 571193
10947E71193B02278M80034j51162B08198J38440j60513M49333C6905j3437K40243
$$ 571193 202278 682312 531150 208198 346638 186125 635458 36905 23468 263711
10937B63711J8950m9453E3859j4961h1436n6628A44951a00115B06567n5064b9584
$$ 263711 282661 233208 53859 38898 -81436 -138064 144951 -100115 206567 151503 -29584
10925b56695O192A36003J7870a47708F0722C518K6956c20268B09932p8922a12072
$$ -256695 -250503 136003 153873 -147708 60722 3518 30474 -320268 209932 131010 -112072
10913f2546J753o8900l8028p3691A41512j4099i7631K3701k26468P4756f0208
$$ -62546 -60793 -129693 -167721 -241412 141512 127413 -97631 -73930 -300398 -225642 -60208
10901h7544j16575j019B54629g9712l1707m8204J4290b1271j28167j07152A90792
$$ -87544 -204119 -205138 254629 -79712 -111419 -159623 -145333 -21271 -149438 -256590 190792
10889B8996M2032a23463A54711F551i6346B32538b19282Q0811a4017A871a92210
$$ 28996 71028 -123463 154711 6551 -96346 232538 -219282 -138471 -14017 1871 -192210
10877i6767B3154L9679d22357E9342J09450p4093K69975a919o9572B090h3900
$$ -96767 23154 62833 -422357 59342 168792 94699 364674 -1919 -71491 2090 -83900
10865a98910I5135b40759A01891a17176A0680O1a26503A24287B9955K03682a66691
$$ -198910 95135 -240759 101891 -117176 10680 10741 -126503 124287 29955 233637 -166691
10853A19097a93013A79739o1719b08291A09112f2916B48114i6624j29779A30850
$$ 119097 -193013 179739 118020 -208291 109112 -62916 248114 -96624 -226403 130850
10842B398b20659J00339C19768A0256b90609C16722b01810c9360j14570B63365
$$ 2398 -220659 -120320 319768 10256 -290609 316722 -201810 -39360 -153930 263365
10831A30814J58274b72706A0532B936O9741h5621B1384a90574E7644a89985m2242
$$ 130814 289088 -272706 10532 2936 72677 -85621 21384 -190574 57644 -189985 -232227
10820b32227E8167a53406l2234n3391j04576B7523a86733F4383J3172N6935a46387
$$ -232227 58167 -153406 -185640 -239031 -343607 27523 -186733 64383 77555 134490 -146387
10808a4073k54817A37247a24602B35116B3230K5612a80660H8842b3794j02811
$$ -14073 -268890 137247 -124602 235116 23230 48842 -180660 88842 -23794 -126605
10798a26605j66386F5918m771j5740J50009J9134A5988J55773b64254E6298a4201
$$ -126605 -292991 65918 61147 45407 195416 214550 15988 171761 -264254 56298 -14201
10786a46022H372b99780b5168F4466i8129K0080B47421b28031k17424J54061C5323
$$ -146022 8372 -299780 -25168 64466 -98129 -78049 247421 -228031 -445455 -291394 35323
10774h2599C0097M0463c7221A50459O6077l5168F7719b06447B17629B7644R2457
$$ -82599 30097 70560 -37221 150459 216536 181368 67719 -206447 217629 27644 120101
10763A20101Q3122a85325c8943j65453J01529D4233a8229k18701J4834m422I9269
$$ 120101 203223 -185325 -38943 -204396 -102867 44233 -18229 -236930 -222096 -226518 99269
10751i6039A0243M6773a3061k26681F4825a5153A69770E9895L80823B3857c34899
$$ -96039 10243 57016 -13061 -239742 64825 -15153 169770 59895 440718 23857 -334899
10739a97635A43794E781K9559J81965h9532a6969l6033B04392g3265m3364r661
$$ -197635 143794 5781 35340 217305 -89532 -16969 -53002 204392 -73265 -116629 -126290
10728a26290A38829h9677B32051b06283A27309b13031d8437d389j4790k5727m1244
$$ -126290 138829 -89677 232051 -206283 127309 -213031 -48437 -4389 -19179 -44906 -86150
10717h6150L2345o3503B28801J7059c41138C17289o4826d1158o5201D3494a45854
$$ -86150 -53805 -117308 228801 245860 -341138 317289 252463 -41158 -106359 43494 -145854
10705C68488e2728D47045k13666b9855B2679J9935a70371k1668h3336b4309I1479
$$ 368488 -52728 447045 233379 -29855 22679 42614 -170371 -192039 -83336 -24309 91479
10693b74290J13101k99070f6452F0481J56924F2912R1293l2487K3407b14047A009
$$ -274290 -161189 -460259 -66452 60481 217405 62912 154205 121718 145125 -214047 1009
10681c9963A57024g2050B48037b14240B40326a83636B66743A22772J31418o9667
$$ -39963 157024 -72050 248037 -214240 240326 -183636 266743 122772 254190 184523
10671A84523L5752a47665F1015b63385J08989a0187k03495P4138B6703d9032A84840
$$ 184523 220275 -147665 61015 -263385 -154396 -10187 -213682 -139544 26703 -49032 184840
10659A04044a26137m6492Q740G7330c87825f0740p5933K5054b6399l09685h2438
$$ 104044 -126137 -172629 -163889 77330 -387825 -60740 -136673 -111619 -26399 -336084 -82438
10647c28768Q0419e1780A95677B7236g7854A03923b52783r6258H2099J00514e6171
$$ -328768 -248349 -51780 195677 27236 -77854 103923 -252783 -349041 82099 182613 -56171
10635b83383c7844j67270E981J12163a29315B59389c77009M8950C01083J08434
$$ -283383 -37844 -205114 5981 118144 -129315 259389 -377009 -328059 301083 409517
10625D09517A55635a14354j79918G6196a31360j51743b1087B40566c077E2074
$$ 409517 155635 -114354 -294272 76196 -131360 -283103 -21087 240566 -3077 52074
10614a53638P2455D4639M5597K36169r150I0615a29097k90106a25240B5855b52990
$$ -153638 -81183 44639 90236 326405 317255 90615 -129097 -419203 -125240 25855 -252990
10602b40894N2302q8427f6584o4463I1205J85194b62818a1366k17938A92029F6758
$$ -240894 -188592 -277019 -66584 -131047 91205 276399 -262818 -11366 -229304 192029 66758
10590D7022c69341E4854D363K3024d1508k67154B11346b24197B85953E3381B6117
$$ 47022 -369341 54854 4363 27387 -41508 -308662 211346 -224197 285953 53381 26117
10578a48023L7418k44882J25589A0550K58767A0565a59298E05928g712l02368
$$ -148023 -110605 -355487 -229898 10550 269317 10565 -159298 505928 -7712 -310080
10568c10080b1878H5788a23215p4134n7168A77585e02745a14404J3868A34119
$$ -310080 -21878 85788 -123215 -197349 -254517 177585 -502745 -114404 -100536 134119
10557B66541H9991J5008b36337F8682a17789d8790l01282A00413a17902a4558
$$ 266541 89991 104999 -236337 68682 -117789 -48790 -350072 100413 -117902 -14558
10546a38389q5995e9816C92346d742B40092a3421j74413A73817c14108b5302l11258
$$ -138389 -224384 -59816 392346 -4742 240092 -13421 -187834 173817 -314108 -25302 -336560
10535c36560A3453N870N489a03245k04495E3228J03014A2381a62968d8368q5642
$$ -336560 13453 19323 24812 -103245 -307740 53228 156242 12381 -162968 -48368 -134010
10524a34010c139r9548B4317a30679j08480D6387J08517h8356A36742l4580a3618
$$ -134010 -3139 -102687 24317 -130679 -239159 46387 154904 -88356 136742 102162 -13618
10512D6840c70926A84148o6130c46610A1319b7732D7859c18149A06690N1311a53606
$$ 46840 -370926 184148 118018 -346610 11319 -27732 47859 -318149 106690 158001 -153606
10500i7160k2424A43009G124N329b5343B35568f1212I4060b08441r0095I5083
$$ -97160 -119584 143009 7124 12453 -25343 235568 -61212 94060 -208441 -298536 95083
10488A3835R254f3728B97094o1791r4581j7327L49602j16748K21006o6232k01527
$$ 13835 23089 -63728 297094 235303 140722 123395 472997 356249 577255 511023 309496
10477C09496q0821H6282b29590A2974c42534A18972e8250k8440D4171d7159B86003
$$ 309496 228675 86282 -229590 12974 -342534 118972 -58250 -86690 44171 -47159 286003
10465A2377L23127A22091l8571b02619C5566J26718a03944L0825A878g6009L4560
$$ 12377 335504 122091 83520 -202619 35566 162284 -103944 -73119 1878 -76009 -41449
10454d1449k82726k3883a51831L2108R9r7153c106B71582g72l97095a94603B13698
$$ -41449 -324175 -348058 -151831 -119723 -119624 -216777 -3106 271582 -772 -397867 -194603 213698
10441A38101b7750j40130B6718K3136i7439M5423p6321B42419b80845A74986g3922
$$ 138101 -27750 -167880 26718 49854 -97439 -52016 -128337 242419 -280845 174986 -73922
10429B04149c92845A40785a66843P9991j57741g049A95808b09035j35326J08934
$$ 204149 -392845 140785 -166843 -86852 -244593 -7049 195808 -209035 -344361 -235427
10419b35427a01117D1540f0489F1850B9914c19j20889B98215a45792k30192B08152
$$ -235427 -101117 41540 -60489 61850 29914 -319 -121208 298215 -145792 -375984 208152
10407c11023A08748c75957i2418E5237K14058q3044e1221q2762o9251A00373f3202
$$ -311023 108748 -375957 -92418 55237 269295 186251 -51221 -133983 -203234 100373 -63202
10395A35628h6763G9410J9039F006a01449b841A72196J46528F7866J45132a38398
$$ 135628 -86763 79410 98449 6006 -101449 -2841 172196 318724 67866 212998 -138398
10383C94640b51309B43508O3979j01072G849i189A71071b0596C89127j75872n4380
$$ 394640 -251309 243508 307487 206415 7849 -9189 171071 -20596 389127 213255 158875
10372A58875J25634o6415O1244R5573l0578K15819k38966K92154k64674A34294
$$ 158875 284509 218094 279338 374911 344333 560152 321186 613340 348666 134294
10361A81558P7462l7612o5932J66421J52803A23551b0812A86710K43531c4274
$$ 181558 259020 221408 155476 321897 474700 123551 -20812 186710 430241 -34274
10350E77007j82442n5992M5415A31335L63697a31002D11960A72455c2636o3597
$$ 577007 394565 338573 383988 131335 495032 -131002 411960 172455 -32636 -96233
10340i6233B53588m6944C3725J2140J51965b12214j18664B75552j26737a21086
$$ -96233 253588 206644 33725 45865 197830 -212214 -330878 275552 148815 -121086
10329D27217G7125J6465K763J20662J24033p9460p6023K07662A21608J70826o3580
$$ 427217 77125 93590 96353 217015 341048 261588 185565 393227 121608 292434 228854
10318B28854c6649l4854l057K73E5265k7498b61047C13665q3011G9825J8949A0152
$$ 228854 -36649 -71503 -74560 -74287 55265 27767 -261047 313665 230654 79825 98774 10152
10305A25258c70489h2661m8289A87330a52557A87894q427b68977d7650B12860
$$ 125258 -370489 -82661 -130950 187330 -152557 187894 179467 -268977 -47650 212860
10294a42224E1298K121a15356A34211b6310l51052d1711A04394A6716O6932b83445
$$ -142224 51298 53419 -115356 134211 -26310 -377362 -41711 104394 16716 83648 -283445
10282h3313b1278j41641P4431G8393L9565d33392A20912J9609g3071j86012B6604
$$ -83313 -21278 -162919 -88488 78393 117958 -433392 120912 140521 -73071 -259083 26604
10270B29900f945k8738j22646j6890N0438e7697H1710J72108R6886q7562G5384
$$ 229900 -6945 -35683 -158329 -175219 -124781 -57697 81710 253818 350704 263142 75384
10258E40053k67692j22238K76265p1081b8818C29675a42289d2797j64633p3336
$$ 540053 272361 150123 426388 355307 -28818 329675 -142289 -42797 -207430 -280766
10248b80766J09353A52497a52528I0842K5024d80285C821a15898A77122Q5479
$$ -280766 -171413 152497 -152528 90842 115866 -480285 3821 -115898 177122 262601
10238B62601j16669c9698k22271N3428I9230a46775A57193I666e7887A51378a38209
$$ 262601 145932 -39698 -261969 -208541 99230 -146775 157193 9666 -57887 151378 -138209
10226b29777B8525J00248Q2524B4743J69275F7436a67309K2343b3974j11522B5562
$$ -229777 28525 128773 211297 24743 194018 67436 -167309 -144966 -23974 -135496 25562
10214A02304N432a68384E3317c73082B78265a49543c1470A19488J52073b4612
$$ 102304 107736 -168384 53317 -373082 278265 -149543 -31470 119488 271561 -24612
10203b91883i9480k62403R353b9091j00589m52571G8882d3905o5332i707o5945
$$ -291883 -99480 -361883 -352530 -29091 -129680 -582251 78882 -43905 -109237 -9707 -75652
10192g5652j83193C12884a10894i256B3604b60623j64038J51157a02527d8997
$$ -75652 -258845 312884 -110894 -9256 23604 -260623 -424661 -273504 -102527 -48997
10181h2107H9538a87728k3549j78194g9968A78697f7868j2850j04780c3793p3536
$$ -82107 89538 -187728 -211277 -389471 -79968 178697 -67868 -80718 -185498 -33793 -107329
10170a07329p6223Q8385J1118A3496b85244e7840C5709e4031k10431K8294A4241
$$ -107329 -183552 -95167 -84049 13496 -285244 -57840 35709 -54031 -264462 -236168 14241
10158g7595k24838a20135B70518e7159C3575O0096J08430c0814a3078k56459E993
$$ -77595 -302433 -120135 270518 -57159 33575 93671 202101 -30814 -13078 -269537 5993
10146b17624G6450d4067p9276E5109e5077k35912c5105k17517L6076A02491g7209
$$ -217624 76450 -44067 -123343 55109 -55077 -290989 -35105 -252622 -216546 102491 -77209
10134g3070A47635b56470A62511b80828e8876A90938A0023N8654b38607R1322
$$ -73070 147635 -256470 162511 -280828 -58876 190938 10023 68677 -238607 -147285
10124a47285j32949C8565b20280C3229M5265A7155J27512l80E4513J24872E6787
$$ -147285 -280234 38565 -220280 33229 78494 17155 144667 144287 54513 179385 56787
10112a96915f7690k67492a52503d2570l39208a04999p9459h5818F7023j1642a0311
$$ -196915 -67690 -335182 -152503 -42570 -381778 -104999 -184458 -85818 67023 55381 -10311
10100a66811h0475p5677A36438d7554B28312c30971E2936c18288A8812L40463
$$ -166811 -80475 -156152 136438 -47554 228312 -330971 52936 -318288 18812 359275
10090C59275A28330a01991r8030I388K10251G1032a21164j54904i0911G3966a54701
$$ 359275 128330 -101991 -200021 9388 219639 71032 -121164 -276068 -90911 73966 -154701
10078b13799R0669b6458m4565F954J91686a31380a9773j94134k1178A07947J23444
$$ -213799 -123130 -26458 -71023 6954 198640 -131380 -19773 -213907 -235085 107947 231391
10067B31391a5658j81528P6288j41427n5610A71963D9133P2226H425f7056A18206
$$ 231391 -15658 -197186 -120898 -262325 -317935 171963 49133 121359 8425 -67056 118206
10055A24720L54107k04449b30868m2170P0506A47494l6564A375Q9102a07183L3862
$$ 124720 478827 274378 -230868 -273038 -202532 147494 110930 1375 90477 -107183 -73321
10044g3321K6260m7492F3790J50031C9724J0629L2786i7328j48002A55469a70629
$$ -73321 -47061 -94553 63790 213821 39724 50353 83139 -97328 -245330 155469 -170629
10032A11217a90830O0893A24595b15239A09977a5633m8043B732c4807G454K2533
$$ 111217 -190830 -129937 124595 -215239 109977 -15633 -63676 2732 -34807 7454 29987
10021B9987J11309e950G0953J07364G0782Q2741C4723R8959L63896a83447L1848
$$ 29987 141296 -5950 70953 178317 70782 153523 34723 133682 497578 -183447 -151599
10010a51599A46737a40250r3256f9361j8616A44058i8151p21j90595e7684k3304
$$ -151599 146737 -140250 -233506 -69361 -87977 144058 -98151 -98872 -289467 -57684 -80988
9999h0988k8928l68663a23877N7452D6237J71672b28811C14729C2287a46220A20631
$$ -80988 -109916 -478579 -123877 -66425 46237 217909 -228811 314729 32287 -146220 120631
9987a26225B38812l0624f1150A26557P2708c49636J18683D7439J06224c56362
$$ -126225 238812 208188 -61150 126557 199265 -349636 -230953 47439 153663 -356362
9976A07378e3055J2567k42506F8781c8978j36906k762j4321d1023j93648L3353
$$ 107378 -53055 -40488 -282994 68781 -38978 -175884 -178646 -192967 -41023 -234671 -201318
9965b01318a2622l84551J36411a8128A42370b05097A09875E4367a15315j4599
$$ -201318 -12622 -397173 -260762 -18128 142370 -205097 109875 54367 -115315 -129914
9955a29914n6378G4288a172j3599A02882j2224a93711i5890l4728a7532j05364
$$ -129914 -186292 74288 -1172 -14771 102882 90658 -193711 -95890 -130618 -17532 -122896
9944a22896l0833m0454i0064l8967N1855I5443a70551h501j43459A40281a73479
$$ -122896 -153729 -194183 -90064 -129031 -77176 95443 -170551 -8501 -151960 140281 -173479
9932c30030O1194A06061J04638A9448b02573g952A3407c54314B7795a10472A59287
$$ -330030 -268836 106061 210699 19448 -202573 -7952 13407 -354314 27795 -110472 159287
9920c8966A5677K44456b7896n8499G5088l0425a22712A56833a2053j28011q7595
$$ -38966 15677 260133 -27896 -86395 75088 44663 -122712 156833 -12053 -140064 -227659
9909b27659C0803b03582I5722J42047k7616a16563H0609R4842a98738l3618A22225
$$ -227659 30803 -203582 95722 237769 210153 -116563 80609 175451 -198738 -232356 122225
9897A16229b49329a24315c3632j29840E6345b81186O5829R5835M508d7672I8678
$$ 116229 -249329 -124315 -33632 -163472 56345 -281186 -215357 -119522 -115014 -47672 98678
9885A70651C3558L00517b1709I0866h4748d0798B2461J32321J28993E4665b20713
$$ 170651 33558 334075 -21709 90866 -84748 -40798 22461 154782 283775 54665 -220713
9873a33973K551A59892F3132a36815k2898k50449g2246A61698C4640j3342c83375
$$ -133973 -131422 159892 63132 -136815 -159713 -410162 -72246 161698 34640 21298 -383375
9861d51100A8991b32405J05398m570j38684I7225b93819c9616K23m7845H2876
$$ -451100 18991 -232405 -127007 -131577 -270261 97225 -293819 -39616 -39393 -87238 82876
9849A755b72713Q9188E0638L7347O3795D778e4861J6036l2782j97192c3802n7404
$$ 1755 -272713 -183525 50638 87985 151780 4778 -54861 -38825 -71607 -268799 -33802 -91206
9837i1206C35774b30182I278a0413j43060O4811j30876L2479d745C99344g9403
$$ -91206 335774 -230182 9278 -10413 -153473 -88662 -219538 -187059 -4745 399344 -79403
9825H2694a04430l53840a54427j77141P2491f1881j60285A48409b46197L9710
$$ 82694 -104430 -458270 -154427 -331568 -259077 -61881 -222166 148409 -246197 -206487
9815b06487A2853J00600d71592A64112i4045J8682m9698E5261J79005c8685J6548
$$ -206487 12853 113453 -471592 164112 -94045 -75363 -125061 55261 234266 -38685 -22137
9804b2137k90320B10673b00264g3176r2150j1544C02332a37106A93404a16741
$$ -22137 -312457 210673 -200264 -73176 -165326 -176870 302332 -137106 193404 -116741
9793b06330G0765g4826k182A70650q0068a24839A32567o6083a46061A51787D9178
$$ -206330 70765 -74826 -77008 170650 90582 -124839 132567 66484 -146061 151787 49178
9781C18707a5332B035c61781j15206a06834j26108j0244k7500B62694g4586o8699
$$ 318707 -15332 2035 -361781 -476987 -106834 -232942 -243186 -270686 262694 -74586 -143285
9770a43285a4899D437b58891D8633K01019f3553C5249a48046j09971c3283l130
$$ -143285 -14899 4437 -258891 48633 249652 -63553 35249 -148046 -258017 -33283 -36413
9759c6413A11341a62923k7613P3424j62220L3114B5063b7789F0773J76710a42339
$$ -36413 111341 -162923 -190536 -117112 -279332 -246218 25063 -27789 60773 237483 -142339
9747a17588L7831L1747A5581g6508k7580E5557D246a16883N8161G8489J16194
$$ -117588 -79757 -48010 15581 -76508 -104088 55557 4246 -116883 -58722 78489 194683
9736A94683i1423A91794b4562j64287D7999d789k16571e5340K4741j1561A102
$$ 194683 -91423 191794 -24562 -188849 47999 -4789 -221360 -55340 -30599 -42160 1102
9724C7314a4786B1356f678n8680k73732a00141m7590L6270K7985B63284d79628
$$ 37314 -14786 21356 -6678 -65358 -339090 -100141 -147731 -111461 -83476 263284 -479628
9712h2243q6114P7560A53953J14618j20139g4501j17636k01909J64880I0186i771
$$ -82243 -168357 -90797 153953 268571 148432 -74501 -192137 -394046 -229166 90186 -9771
9700a35570e5077k44305c5302E4342L4855K82235c9365m5022K6589j08314A9241
$$ -135570 -55077 -299382 -35302 54342 89197 371432 -39365 -84387 -57798 -166112 19241
9688b54417C805b69715R2767d2852E3849c5099A12060c6056p1373j39158n0620
$$ -254417 3805 -269715 -176948 -42852 53849 -35099 112060 -36056 -107429 -246587 -297207
9677b97207J33834B11637b46338O044A89436D7367c08170a47687l4291q1767I9447
$$ -297207 -163373 211637 -246338 -240294 189436 47367 -308170 -147687 -181978 -263745 99447
9665e7150k7219A77518n6612d96509G2778b01424k377h2029A83810a94169a5464
$$ -57150 -84369 177518 120906 -496509 72778 -201424 -203801 -82029 183810 -194169 -15464
9653I7696a81072N2397H3480a17727p3794O7573B1809K80230c43994H4812Q576
$$ 97696 -181072 -128675 83480 -117727 -191521 -123948 21809 302039 -343994 84812 93388
9642I3388B4672K24329D8638c86791G9241K3207a56606J9862L6241j01856p7213
$$ 93388 24672 249001 48638 -386791 79241 102448 -156606 -136744 -100503 -202359 -279572
9631b79572J22707O8594j65273I8519b15200b5183j33417I471a1116p9281j20871
$$ -279572 -156865 -88271 -253544 98519 -215200 -25183 -158600 9471 -11116 -90397 -211268
9620b11268B4419j0270d20527a17696H0525R2063L4076D6142d2837C10199c569
$$ -211268 24419 14149 -420527 -117696 80525 172588 206664 46142 -42837 310199 -3569
9608d15572A10694f1877P1j52790k8351l6091H5424C1565K44648G4405C5725j7549
$$ -415572 110694 -61877 -61806 -214596 -242947 -279038 85424 31565 276213 74405 35725 18176
9596A8176G627c81231b7038k89906E1967N81B2940a18201k03722C4900a66049
$$ 18176 7627 -381231 -27038 -316944 51967 52548 22940 -118201 -321923 34900 -166049
9584a36094L5360r4423D9083g6214k55979a29991D9212B3470J23618K4066a70005
$$ -136094 -100734 -195157 49083 -76214 -332193 -129991 49212 23470 147088 171154 -170005
9572A08248a76828P4336A79586a17402b1494A60505F9010d2517A77030b53385
$$ 108248 -176828 -102492 179586 -117402 -21494 160505 69010 -42517 177030 -253385
9561B75106c12993G2186J3163b4284r9390j35587a3861A03489b33366A2930b00254
$$ 275106 -312993 72186 85349 -24284 -123674 -259261 -13861 103489 -233366 12930 -200254
9549b35317B54868c24655A7779a96458A26045O036e7986B08660a21708A09722
$$ -235317 254868 -324655 17779 -196458 126045 132081 -57986 208660 -121708 109722
9538g8938q1137M3363d3185k53980e0860j53379j9359A73871c74974f1388b3276
$$ -78938 -160075 -116712 -43185 -297165 -50860 -204239 -223598 173871 -374974 -61388 -23276
9526D2193J22732c93975a90920m0432e2739l2071A05429J34409e7050b3491j81470
$$ 42193 164925 -393975 -190920 -231352 -52739 -84810 105429 239838 -57050 -23491 -204961
9515b04961A62930i704j53795k166e6714k13135a13601A29829J26811A3272c5859
$$ -204961 162930 -9704 -163499 -165665 -56714 -269849 -113601 129829 256640 13272 -35859
9503b16455C7532R6296f7679B42480M2093E5145P646a97368p3289E1626a55036
$$ -216455 37532 133828 -67679 242480 284573 55145 62791 -197368 -270657 51626 -155036
9491A36285d18157A8875a247j12365B46446a72760L4784N8897q8214H7880B3669
$$ 136285 -418157 18875 -1247 -113612 246446 -172760 -137976 -79079 -167293 87880 23669
9479i8628j48639A0678J24387b81945H7776a05698l8911n416q8369A68410p6705
$$ -98628 -247267 10678 135065 -281945 87776 -105698 -144609 -150025 -238394 168410 91705
9468I1705a03888A66260a85538a7954j23846N9969B90350d08045F6195i1597j94170
$$ 91705 -103888 166260 -185538 -17954 -141800 -81831 290350 -408045 66195 -91597 -285767
9457b85767A84325k9124c3700A36232M8585a09420k38730P9973F4282a72112e8534
$$ -285767 184325 155201 -33700 136232 184817 -109420 -348150 -268177 64282 -172112 -58534
9445e9956m0003c6119j96923D9422K66448G0153Q0290D9098Q6591A5253R7652
$$ -59956 -99959 -36119 -233042 49422 315870 70153 150443 49098 135689 15253 112905
9434A12905a40241I165b5219j99868e134B04019i8316B21216b02575B4013c8229
$$ 112905 -140241 9165 -25219 -225087 -5134 204019 -98316 221216 -202575 24013 -38229
9422a13752l25585f2389O673j25870A7487R2457E2649c30189A80845J24567b54760
$$ -113752 -439337 -62389 -55716 -181586 17487 109944 52649 -330189 180845 305412 -254760
9410b69152A79360a10743n8771A57526J75c02853a20636j93479a4655o5831k851
$$ -269152 179360 -110743 -169514 157526 157701 -302853 -120636 -314115 -14655 -80486 -83337
9399h3337q0192B44132b23236P9601l1577B20898F8720e9424E1020b8347j77745
$$ -83337 -163529 244132 -223236 -143635 -175212 220898 68720 -59424 51020 -28347 -206092
9388b06092f1926n8101D7266f7096A57272c14347J36090f7134L352j5100l5157
$$ -206092 -61926 -120027 47266 -67096 157272 -314347 -178257 -67134 -63782 -78882 -114039
9377a14039j62410i7423a8247m6273c0275l74015H4024a99704f1171B34091L5146
$$ -114039 -276449 -97423 -18247 -64520 -30275 -404290 84024 -199704 -61171 234091 269237
9366B69237f6520j9405n9409j35403d8347A57800a34544j81341h906A48311e1286
$$ 269237 -66520 -85925 -145334 -280737 -48347 157800 -134544 -315885 -8906 148311 -51286
9354A43931J29042a11906d2960A21840k9226a38635K555A04834g1553B64599a19307
$$ 143931 272973 -111906 -42960 121840 92614 -138635 -136080 104834 -71553 264599 -119307
9342e0079j72959A02633l7661k9989i6359A33860K1400c20691A856b16152h5301
$$ -50079 -223038 102633 64972 34983 -96359 133860 155260 -320691 1856 -216152 -85301
9330a20743a3044k2250k58429e4620a8255p8111I0166a2992D92913a83750Q1286
$$ -120743 -13044 -35294 -293723 -54620 -18255 -96366 90166 -12992 492913 -183750 -102464
9319a02464o7869A9012d47611C57424A8461a33571j00381j67288a73277F5374
$$ -102464 -170333 19012 -447611 357424 18461 -133571 -233952 -401240 -173277 65374
9308a55614l8445A66618c36978b7988j36406D61277a1080A47157b22955j34349
$$ -155614 -194059 166618 -336978 -27988 -164394 461277 -11080 147157 -222955 -357304
9298c57304c4332B95646p5505a7465A26853a79336K7441L0053A0027a16467J6559
$$ -357304 -34332 295646 220141 -17465 126853 -179336 -151895 -121842 10027 -116467 -99908
9287i9908k12609N4184A58245a52929O2175d3559p7750a7261A05222a07479k2358
$$ -99908 -312517 -258333 158245 -152929 -90754 -43559 -121309 -17261 105222 -107479 -129837
9276a29837k37395N433a68125f4628C361b77002a06624B29133b38866A15406a85437
$$ -129837 -367232 -361799 -168125 -64628 3361 -277002 -106624 229133 -238866 115406 -185437
9264B948J37538a08050G398L5338K24885A01680c68606D3935i1317j96791a14653
$$ 2948 140486 -108050 7398 42736 267621 101680 -368606 43935 -91317 -288108 -114653
9252b62830B14799b01091I4406a1328r9606M7245A20562B6026K27196C1137a29746
$$ -262830 214799 -201091 94406 -11328 -110934 -63689 120562 26026 253222 31137 -129746
9240a96221B22339a51820A37261M23209a64804A63534a60082o9687i5714A60355
$$ -196221 222339 -151820 137261 560470 -164804 163534 -160082 -229769 -95714 160355
9229i2970r1293B3980m353J02418h9835j40067a1985A84878H1622a7964O978l19388
$$ -92970 -184263 23980 19627 122045 -89835 -229902 -11985 184878 81622 -17964 -10986 -330374
9217c30374C77439b77671I0285b64576A13170d2961B43054c02383d826j71A4215
$$ -330374 377439 -277671 90285 -264576 113170 -42961 243054 -302383 -4826 -4997 14215
9205a17667k22696A54591A3880c2472j31743B0796a73370Q2268j8077P718L7576
$$ -117667 -340363 154591 13880 -32472 -164215 20796 -173370 -91102 -109179 -101461 -63885
9194f3885m3712a338l97781J44869j7290A7396c65779a07637j62856q2272a49449
$$ -63885 -107597 -1338 -399119 -254250 -271540 17396 -365779 -107637 -270493 -352765 -149449
9182a42108A31540a85348e6011p969B5761M7614a63191N352d5289G4828M7540
$$ -142108 131540 -185348 -56011 -63980 25761 73375 -163191 -157839 -45289 74828 122368
9171A22368n3510O9567a28937b2890j09680r0783F9478B7314K60105e5760H3474
$$ 122368 68858 138425 -128937 -22890 -132570 -223353 69478 27314 287419 -55760 83474
9159c5032o4653B26614a477B4237N8455J97176c41A0890J9736d7653G5800c2391
$$ -35032 -99685 226614 -1477 24237 82692 279868 -341 10890 30626 -47653 75800 -32391
9146a27428j63677n3440B34108B4973b18802C1757b07096i8770c905k54018D9089
$$ -127428 -291105 -344545 234108 24973 -218802 31757 -207096 -98770 -3905 -257923 49089
9134A0021K9391J9720a37754j481A01199b4776A44494C2819h9069A51415O808
$$ 10021 39412 59132 -137754 -139235 101199 -24776 144494 32819 -89069 151415 158223
9123A58223k9185F2853a69883A03290a61493k78966a4042F0253c070l27498A01067
$$ 158223 129038 62853 -169883 103290 -161493 -440459 -14042 60253 -3070 -330568 101067
9111e9327H4855b9985j54419j07593c3570A57011k3448a85931o5225i9039A5385
$$ -59327 84855 -29985 -184404 -291997 -33570 157011 133563 -185931 -251156 -99039 15385
9099A72031a47865A30565h5503j08438d5208k28794a9358k3165l56363g2635A3629
$$ 172031 -147865 130565 -85503 -193941 -45208 -274002 -19358 -42523 -398886 -72635 13629
9087a22360l3108r3803C5490a45413C8495b84374a7699j2795o2719j61597d2467
$$ -122360 -155468 -249271 35490 -145413 38495 -284374 -17699 -30494 -93213 -254810 -42467
9075A25318a71089F681a98365i5204l6228K2046I3498b51142H7697J10026b51249
$$ 125318 -171089 6681 -198365 -95204 -131432 -109386 93498 -251142 87697 197723 -251249
9063a94707a6936B71831b3314j5322j05056h243D1731f2413A32983a24601J0008
$$ -194707 -16936 271831 -23314 -38636 -143692 -8243 41731 -62413 132983 -124601 -114593
9052a14593A73587b37501C97770j77108e7514k4885o5867A81082E6792j1063c17094
$$ -114593 173587 -237501 397770 220662 -57514 -82399 -148266 181082 56792 45729 -317094
9040a25361A43674a11446b530l44288a28714A86791p5370a53581P1334r2295M3437
$$ -125361 143674 -111446 -2530 -346818 -128714 186791 111421 -153581 -82247 -174542 -131105
9029a31105a8587A567a75978A00616e3538o8155j78757B2858O5429b32047D8328
$$ -131105 -18587 1567 -175978 100616 -53538 -121693 -300450 22858 88287 -232047 48328
9017A51438g0362n4404j3467J2225o3537A57279a54586A87908B2903b09957A2161
$$ 151438 -70362 -124766 -138233 -126008 -189545 157279 -154586 187908 22903 -209957 12161
9005a86342M0674j09020e6055D0236d9129D62131a85380O8624J6544c6464q7059
$$ -186342 -145668 -254688 -56055 40236 -49129 462131 -185380 -116756 -100212 -36464 -123523
8994a23523c4469j46973I2599J03806a14554o5444g6972k5966B1017N1618a59763
$$ -123523 -34469 -181442 92599 196405 -114554 -179998 -76972 -102938 21017 72635 -159763
8982b63200m7491G9443J29494f4940B64728a61093l0583A27003a37021e4612L057
$$ -263200 -310691 79443 208937 -64940 264728 -161093 -191676 127003 -137021 -54612 -51555
8971e1555k51898A19397A7547K7705b91428A22425b50426K729c8507A1054h7091
$$ -51555 -303453 119397 17547 45252 -291428 122425 -250426 -247697 -38507 11054 -87091
8959B53608g425B05374a26386e8785j17467A6912a45540E7036J83433a16676o6804
$$ 253608 -7425 205374 -126386 -58785 -176252 16912 -145540 57036 240469 -116676 -183480
8948a83480m3288M8555f6087A55099a09074F4605i4016m8602j09248F2839a76239
$$ -183480 -226768 -178213 -66087 155099 -109074 64605 -94016 -142618 -251866 62839 -176239
8936c9316D19878j51515H5421b02375D9710K23695b02106A6082J6081M33032A88230
$$ -39316 419878 268363 85421 -202375 49710 273405 -202106 16082 32163 465195 188230
8924C14370O60774K572069J0076319l652188C211271A246258k28557m75237E4482
$$ 314370 975144 3547213 13623532 9971344 3211271 1246258 1017701 542464 54482
8914h3400C95379e7185B21425A1099a99946D06377K58686B07106d5150B85169
$$ -83400 395379 -57185 221425 11099 -199946 406377 665063 207106 -45150 285169
8903b5098k00950a5477r4641a0284p2347j23046m6089A40500M6933f6052B12912
$$ -25098 -226048 -15477 -110118 -10284 -82631 -205677 -251766 140500 187433 -66052 212912
8891a66641r3063p869d9708q0756L2285F408b7650o5105l6718q7506F6773R3402
$$ -166641 -259704 -267573 -49708 -130464 -98179 6408 -27650 -92755 -129473 -216979 66773 160175
8879A60175h9770A37930a44284F7751C2925J01112a1294C5904a51404M2097j49689
$$ 160175 -89770 137930 -144284 67751 32925 134037 -11294 35904 -151404 -109307 -258996
8868b58996A67650F1368N3416P7115e2538r9298j2451C5171e8015j09333B35369
$$ -258996 167650 61368 114784 191899 -52538 -151836 -164287 35171 -58015 -167348 235369
8856A27995A6505b59587B00618a70620j3680j98255E1261J34211p285i9974M8840
$$ 127995 16505 -259587 200618 -170620 -184300 -382555 51261 185472 178187 -99974 -51134
$$ [...]
##END NTUPLES=NMR SPECTRUM
##END=
