##TITLE=AC1576_ROEFFECT0023_8271349_9g5SQ6rEx1
##JCAMPDX= 6.0         $$ Bruker NMR JCAMP-DX V2.0
##DATA TYPE= NMR SPECTRUM
##DATA CLASS= NTUPLES
##ORIGIN= BRUKER
##OWNER= Administrator
$$ 1.72 TOPSPIN		Version 2.1
$$ 2013-10-18 21:15:37.595 -0700  Administrator@X
$$ Compression mode = diff/dup
##.OBSERVE FREQUENCY= 400.02188249412
##.OBSERVE NUCLEUS= ^1H
##.ACQUISITION MODE= SIMULTANEOUS (DQD)
##.ACQUISITION SCHEME= undefined
##.AVERAGES= 64
##.DIGITISER RES= 22
##SPECTROMETER/DATA SYSTEM= spect
##.PULSE SEQUENCE= noesygpps1d.comp
##.SOLVENT NAME= COFFEE_meoh
##.SHIFT REFERENCE= INTERNAL, COFFEE_meoh, 1, 14.96082
##AUDIT TRAIL= $$ (NUMBER, WHEN, WHO, WHERE, PROCESS, VERSION, WHAT)
$$ ##TITLE= Audit trail, TOPSPIN		Version 2.1
$$ ##JCAMPDX= 5.01
$$ ##ORIGIN= Bruker BioSpin GmbH
$$ ##OWNER= Administrator
$$ $$ E:\/data/COFFEE/nmr/AC1576_ROEFFECT0023_8271349_9g5SQ6rEx1/12/pdata/1/auditp.txt
$$ ##AUDIT TRAIL=  $$ (NUMBER, WHEN, WHO, WHERE, PROCESS, VERSION, WHAT)
(   1,<2013-10-18 21:15:32.438 -0700>,<Administrator>,<X>,<go>,<TOPSPIN 2.1>,
      <created by zg
	started at 2013-10-18 21:04:02.374 -0700,
	POWCHK enabled, PULCHK disabled,
       configuration hash MD5:
       C8 4E 4E 5D D3 5C D8 9E 9F 52 82 E0 59 8A DE 15
       data hash MD5: 64K
       EA C4 AA 23 2D 0F 99 C8 DA 38 38 DF 5B 42 C6 0F>)
(   2,<2013-10-18 21:15:35.517 -0700>,<Administrator>,<X>,<proc1d>,<TOPSPIN 2.1>,
      <Start of raw data processing
       efp LB = 0.3 FT_mod = 6 PKNL = 1 PHC0 = 0 PHC1 = 0 SI = 128K 
       data hash MD5: 128K
       9F 77 72 64 34 17 03 40 AB DC 01 B4 24 B0 F9 9E>)
(   3,<2013-10-18 21:15:36.485 -0700>,<Administrator>,<X>,<proc1d>,<TOPSPIN 2.1>,
      <pk PHC0 = -86.1438 PHC1 = 0 
       data hash MD5: 128K
       DB DB 2B 27 04 BF 81 40 00 AC 1E 77 A6 8E 72 98>)
(   4,<2013-10-18 21:15:36.954 -0700>,<Administrator>,<X>,<proc1d>,<TOPSPIN 2.1>,
      <abs ABSG = 1 
       data hash MD5: 128K
       BB EE A9 B6 C5 8F F6 AD 8B A9 A9 E4 13 7B B7 B6>)
(   5,<2013-10-18 21:15:37.063 -0700>,<Administrator>,<X>,<proc1d>,<TOPSPIN 2.1>,
      <abs ABSG = 2 
       data hash MD5: 128K
       E2 E2 6C 39 C6 31 48 52 00 AB BB 9F 28 F8 3A 4E>)
(   6,<2013-10-18 21:15:37.142 -0700>,<Administrator>,<X>,<proc1d>,<TOPSPIN 2.1>,
      <abs ABSG = 3 
       data hash MD5: 128K
       27 06 01 9F 5D 03 C8 17 7E 6D D6 97 BB FB 71 98>)
(   7,<2013-10-18 21:15:37.267 -0700>,<Administrator>,<X>,<proc1d>,<TOPSPIN 2.1>,
      <abs ABSG = 4 
       data hash MD5: 128K
       55 AC EF 01 13 EF F3 7D D6 CF 5A 66 82 34 A3 3C>)
(   8,<2013-10-18 21:15:37.360 -0700>,<Administrator>,<X>,<proc1d>,<TOPSPIN 2.1>,
      <abs ABSG = 5 
       data hash MD5: 128K
       65 EE 7F 33 5C 92 CA 3D 51 CF 00 28 7A EC 1D B8>)
$$ ##END=
$$ 
$$ $$ hash MD5
$$ $$ ED 61 D9 57 8B 8D 85 AF 3E CD EA 92 CE 23 7A 6E
##$RELAX= 
##$RELAX= 
##$RELAX= 
##$RELAX= 
##$RELAX= 
##$RELAX= 
##$RELAX= 
##$RELAX= 
$$ Bruker specific parameters
$$ --------------------------
##$DU= <E:\>
##$EXPNO= 12
$$ [...]
150 150 150 150 150 150 150 150
##$TP07= 0
##$TPNAME0= <>
##$TPNAME1= <>
##$TPNAME2= <>
##$TPNAME3= <>
##$TPNAME4= <>
##$TPNAME5= <>
##$TPNAME6= <>
##$TPNAME7= <>
##$TPOAL= (0..7)
0.5 0.5 0.5 0.5 0.5 0.5 0.5 0.5
##$TPOFFS= (0..7)
0 0 0 0 0 0 0 0
##$TUNHIN= 0
##$TUNHOUT= 0
##$TUNXOUT= 0
##$USERA1= <user>
##$USERA2= <user>
##$USERA3= <user>
##$USERA4= <user>
##$USERA5= <user>
##$V9= 5
##$VALIST= <valist>
##$VCLIST= <CCCCCCCCCCCCCCC>
##$VD= 0
##$VDLIST= <DDDDDDDDDDDDDDD>
##$VPLIST= <PPPPPPPPPPPPPPP>
##$VTLIST= <TTTTTTTTTTTTTTT>
##$WBST= 1024
##$WBSW= 4
##$XGAIN= (0..3)
0 0 0 0
##$XL= 0
##$YL= 0
##$YMAX_a= 6357270
##$YMIN_a= -11774454
##$ZGOPTNS= <>
##$ZL1= 120
##$ZL2= 120
##$ZL3= 120
##$ZL4= 120
##$ABSF1= 14.96082
##$ABSF2= -5.597362
##$ABSG= 5
##$ABSL= 3
##$ALPHA= 0
##$AQORDER= 0
##$ASSFAC= 0
##$ASSFACI= 0
##$ASSFACX= 0
##$ASSWID= 0
##$AUNMP= <proc_prof1d_extract.lims>
##$AXLEFT= 0
##$AXNAME= <>
##$AXNUC= <1H>
##$AXRIGHT= 0
##$AXTYPE= 0
##$AXUNIT= <>
##$AZFE= 0.1
##$AZFW= 0.1
##$BCFW= 0
##$BC_mod= 0
##$BYTORDP= 0
##$COROFFS= 0
##$CY= 15
##$DATMOD= 1
##$DC= 0
##$DFILT= <>
##$DTYPP= 0
##$F1P= 0
##$F2P= 0
##$FCOR= 0.5
##$FTSIZE= 131072
##$FT_mod= 6
##$GAMMA= 0
##$GB= 0
##$INTBC= 1
##$INTSCL= 1
##$ISEN= 128
##$LB= 0.3
##$LEV0= 0
##$LPBIN= 0
##$MAXI= 10000
##$MC2= 0
##$MEAN= 0
##$ME_mod= 0
##$MI= 0
##$NCOEF= 0
##$NC_proc= -2
##$NLEV= 6
##$NOISF1= 0
##$NOISF2= 0
##$NSP= 0
##$NTH_PI= 0
##$NZP= 0
##$OFFSET= 14.96082
##$PC= 1
##$PHC0= -86.1438
##$PHC1= 0
##$PH_mod= 1
##$PKNL= yes
##$PPARMOD= 0
##$PPDIAG= 0
##$PPIPTYP= 0
##$PPMPNUM= 2147483647
##$PPRESOL= 1
##$PSCAL= 4
##$PSIGN= 0
##$PYNMP= <proc.py>
##$REVERSE= no
##$SF= 400.020009707318
##$SI= 131072
##$SIGF1= 0
##$SIGF2= 0
##$SINO= 400
##$SIOLD= 131072
##$SPECTYP= <>
##$SREGLST= <1H.CDCl3>
##$SSB= 0
##$STSI= 131072
##$STSR= 0
##$SW_p= 8223.68421052631
##$SYMM= 0
##$S_DEV= 0
##$TDeff= 65536
##$TDoff= 0
##$TI= <>
##$TILT= no
##$TM1= 0
##$TM2= 0
##$TOPLEV= 0
##$USERP1= <user>
##$USERP2= <user>
##$USERP3= <user>
##$USERP4= <user>
##$USERP5= <user>
##$WDW= 1
##$XDIM= 131072
##$YMAX_p= 431740199
##$YMIN_p= -11790
##$CURPLOT= <Network HP LaserJet P1505>
##$CURPRIN= <$Network HP LaserJet P1505>
##$DFORMAT= <normdp>
##$LAYOUT= <+/1D_H.xwp>
##$LFORMAT= <normlp>
##$PFORMAT= <normpl>
##$SURQMSG= 1
$$ End of Bruker specific parameters
$$ ---------------------------------
##NTUPLES= NMR SPECTRUM
##VAR_NAME=  FREQUENCY,     SPECTRUM/REAL,   SPECTRUM/IMAG
##SYMBOL=    X,             R,               I
##VAR_TYPE=  INDEPENDENT,   DEPENDENT,       DEPENDENT
##VAR_FORM=  AFFN,          ASDF,            ASDF
##VAR_DIM=   131072,        131072,          131072
##UNITS=     HZ,            ARBITRARY UNITS, ARBITRARY UNITS
##FACTOR=    0.0627417313425164, 1,          1
##FIRST=     8223.62146879497, -1061,        -60722
##LAST=      0,             859,             -60713
##MIN=       0,             -11790,          0
##MAX=       8223.62146879497, 431740199,    0
$$ Real data points
##PAGE= N=1
##DATA TABLE= (X++(R..R)), XYDATA
$$ [...]
$$ plain form
63940 2523052 2768990 3027214 3294143 3566328 3839345 4106938 4361776 4596813 4805980
63931 4805980 4984574 5129707 5239881 5313534 5348340 5342342 5295288 5208397 5083477 4923238
63921 4923238 4732219 4516515 4282481 4036102 3783150 3528920 3277545 3032172 2795913
63912 2795913 2571978 2362810 2169749 1993682 1835313 1694480 1569860 1459816 1363108 1278564
63902 1278564 1204732 1140385 1084929 1037702 997196 961624 930136 902809 879370 858428 838257
63891 838257 817992 797863 778389 759578 740864 721663 701956 682491 664568 649518 638024
63880 638024 629734 623699 619332 616764 616193 617367 620188 625388 633885 645565 659458 675062 692665
63867 692665 712147 732410 752529 772800 794001 816020 837803 858283 876864 893292 907615
$$ packed form
63940B523052K45938K58224K66929K72185K73017K67593K54838K35037K09167
63931D805980J78594J45133J10174P3653L4806n998m7054q6891j24920j60239
63921D923238j91019k15704k34034k46379k52952k54230k51375k45373k36259
63912B795913k23935k09168j93061j76067j58369j40833j24620j10044r6708q4544
63902A278564p3832o4347n5456m7227m0506l5572l1488k7327k3439k0942k0171
63891H38257k0265k0129j9474j8811j8714j9201j9707j9465j7923j5050j1494
63880F38024q290o035m367k568n71J174K821N200Q497J1680J3893J5604J7603
63867F92665J9482K0263K0119K0271K1201K2019K1783K0480J8581J6428J4323
$$ plain form
63856 907615 920080 930669 938905 944403 947212 947291 944168 937696 928633 917763 904802 889004 870550
63843 870550 850435 829113 806189 781472 755404 728296 700013 670760 641446 612925 585414
63832 585414 558937 533751 510005 487534 466336 446762 428886 412233 396453 381770 368341
63821 368341 355705 343418 331870 321928 313944 307543 302120 297122 292060 286704 281247 276054 271323
63808 271323 267143 263577 260478 257556 254886 252989 252079 251626 251068 250550 250449 250453 249753 247999 245532 242780
63792 242780 239914 237037 234261 231625 229345 227938 227589 227540 226727 225002 223140 221662 220324 218942 217964
63777 217964 217879 218475 219124 219451 219393 218925 218107 217273 216825 216847 217071 217160 216960 216671 216800 217708 219074 220066 220193 219768
63757 219768 219389 219210 218933 218336 217535 216792 216251 215838 215377 214873 214692 215227 216334 217357 217856 218068 218440 218991
$$ packed form
63856I07615J2465J0589Q236N498K809P9l123o472r063j0870j2961j5798j8454
63843H70550k0115k1322k2924k4717k6068k7108k8283k9253k9314k8521k7511
63832E85414k6477k5186k3746k2471k1198j9574j7876j6653j5780j4683j3429
63821C68341j2636j2287j1548r942p984o401n423m998n062n356n457n193m731
63808B71323m180l566l099k922k670j897r10m53n58n18j01Mp00j754k467k752
63792B42780k866k877k776k636k280j407l49m9q13j725j862j478j338j382r78
63777B17964q5N96O49L27n8m68q18q34m48K2K24Q9k00k89J29R08J366R92J27m25
63757B19768l79j79k77n97q01p43n41m13m61n04j81N35J107J023M99K12L72N51
$$ plain form
63739 218991 219414 219673 220157 221283 223177 225730 228720 231895 235100 238360 241712 244957 247718 249787 251312
63724 251312 252728 254603 257507 261745 267034 272483 277074 280299 282338 283680 284652 285355 285894 286385 286590
63709 286590 285853 283726 280548 277102 273808 270660 267922 266264 265937 266280 266471 266516 267070 268525 270732 273447
63693 273447 276490 279486 282034 284267 286828 290083 293759 297522 301419 305379 308663 310397 310560 310005 309561
63678 309561 309484 309744 310288 310824 310792 309967 308913 308545 309278 310786 312432 313632 313990 313556 313031 313271 314319 315156
63660 315156 314664 312604 309385 305224 300074 294377 289194 285233 282073 278755 274980 271317 268354 266156
63646 266156 264682 264226 264997 266496 267801 268548 269264 270613 272633 274962 277522 280548 284006 287414 290357
63631 290357 292954 295714 299193 303865 309968 317180 324658 331730 338504 345613 353532 362382 372243 383268
$$ packed form
63739B18991M23K59M84J126J894K553K990L175L205L260L352L245K761K069J525
63724B51312J416J875K904M238N289N449M591L225K039J342R72P03N39M91K05
63709B86590p37k127l178l446l294l148k738j658l27L43J91M5N54J455K207K715
63693B73447L043K996K548K233K561L255L676L763L897L960L284J734J63n55m44
63678C09561p7K60N44N36l2q25j054l68P33J508J646J200L58m34n25K40J048Q37
63660C15156m92k060l219m161n150n697n183l961l160l318l775l663k963k198
63646B66156j474m56P71J499J305P47P16J349K020K329K560L026L458L408K943
63631B90357K597K760L479M672O103P212P478P072O774P109P919Q850R861J1025
$$ plain form
63617 383268 395537 409084 424076 440630 458556 477664 498288 521088 546308 573726 603384
63606 603384 635646 670103 704891 737591 766503 790638 808985 820676 825892 825936 822273 815940 807878
63593 807878 799162 790527 782009 773282 763972 753363 740221 723515 703300 680615 656615 632106
63581 632106 607838 584740 563556 544356 526642 509998 494635 481262 470427 462066 455756 451305
63569 451305 448835 448309 449315 451571 455376 461214 468872 477310 485507 493263 501065 509386 518268 527553
63555 527553 537295 547932 560126 574476 591363 611075 634068 661034 692610 728924 769324 812373
63543 812373 855881 896917 932095 958379 974099 979400 975824 965591 951244 935559 921050 909059
63531 909059 899388 891035 883193 875318 866339 854420 837954 816639 791345 763041 732224 699364
$$ packed form
63617C83268J2269J3547J4992J6554J7926J9108K0624K2800K5220K7418K9658
63606F03384L2262L4457L4788L2700K8912K4135J8347J1691N216M4l663o333q062
63593H07878q716q635q518q727r310j0609j3142j6706k0215k2685k4000k4509
63581F32106k4268k3098k1184j9200j7714j6644j5363j3373j0835q361o310m451
63569D51305k470n26J006K256L805N838P658Q438Q197P756P802Q321Q882R285
63555E27553R742J0637J2194J4350J6887J9712K2993K6966L1576L6314M0400M3049
63543H12373M3508M1036L5178K6284J5720N301l576j0233j4347j5685j4509j1991
63531I09059r671q353p842p875q979j1919j6466k1315k5294k8304l0817l2860
$$ plain form
63519 699364 665420 631649 599104 568557 540594 515383 492485 471383 452258 435874 422492
63508 422492 411268 400954 390949 381446 372859 365500 359584 355028 351208 347373 343416 339947 337462
63495 337462 335787 334456 333271 332226 331228 330315 329923 330437 331469 332024 331580 330739 330576 331504 332967 334177
63479 334177 334974 336003 338133 341703 346212 350690 354365 356970 358508 358948 358300 356821 354837 352332 348980
63464 348980 344783 340457 336889 334288 332163 330126 328327 326967 325822 324646 323787 323911 325184 327175 329640
63449 329640 332910 337340 342775 348837 355431 362660 370584 379389 389524 401153 413678 426442 439955
63436 439955 455940 475931 500156 527809 557790 588673 618269 643933 663669 677028 685082 689791
63424 689791 693282 697372 703432 712467 725184 742047 763461 789954 821859 858526 897944 937433
$$ packed form
63519F99364l3944l3771l2545l0547k7963k5211k2898k1102j9125j6384j3382
63508D22492j1224j0314j0005r503q587p359n916m556l820l835l957l469k485
63495C37462j675j331j185j045r98r13l92N14J032N55m44q41j63R28J463J210
63479C34177P97J029K130L570M509M478L675K605J538M40o48j479j984k505l352
63464C48980m197m326l568k601k125k037j799j360j145j176q59J24J273J991K465
63449C29640L270M430N435O062O594P229P924Q805J0135J1629J2525J2764J3513
63436D39955J5985J9991K4225K7653K9981L0883K9596K5664J9736J3359Q054M709
63424F89791L491M090O060R035J2717J6863K1414K6493L1905L6667L9418L9489
$$ plain form
63412 937433 974719 1008238 1036591 1058192 1071744 1077015 1075057 1067795 1057413 1045848 1034379 1023389
63400 1023389 1012463 1000782 987450 971575 952277 928937 901597 871014 838222 804093 769442
63389 769442 735377 703162 673513 646197 620535 596275 573808 553662 535978 520567 507300
63378 507300 496346 488055 482641 479986 479736 481557 485235 490533 497100 504633 513095 522696 533675 546248
63364 546248 560674 577246 596155 617440 641102 667197 695802 726942 760587 796632 834774
63353 834774 874263 913724 951253 984784 1012453 1032793 1044973 1049208 1046891 1039976 1030062 1018238
63341 1018238 1005606 993349 981902 970380 957264 941461 922507 900160 874443 845984 815711
63330 815711 784221 751906 719680 688869 660261 633973 610570 591607 578419 570697 566853 565435
$$ packed form
63412I37433L7286L3519K8353K1601J3552N271j958p262j0382j1565j1469j0990
63400A023389j0926j1681j3332j5875j9298k3340k7340l0583l2792l4129l4651
63389G69442l4065l2215k9649k7316k5662k4260k2467k0146j7684j5411j3267
63378E07300j0954q291n414k655k50J821L678N298O567P533Q462R601J0979J2573
63364E46248J4426J6572J8909K1285K3662K6095K8605L1140L3645L6045L8142
63353H34774L9489L9461L7529L3531K7669K0340J2180M235k317o915r914j1824
63341A018238j2632j2257j1447j1522j3116j5803j8954k2347k5717k8459l0273
63330H15711l1490l2315l2226l0811k8608k6288k3403j8963j3188p722l844j418
$$ plain form
63318 565435 565474 565609 563735 557963 547623 533269 516090 497489 478774 460814 443939 428258 413942
63305 413942 401184 390061 380602 372834 366662 361843 358179 355596 353893 352551 350953 348800 346216 343527
63291 343527 340961 338504 335928 333017 329789 326409 322915 319266 315711 312840 310967 309658 308210 306527
63277 306527 305101 304154 303261 302045 300846 300293 300447 300809 301098 301592 302625 304118 305772 307462 309218 311065
63261 311065 313044 315206 317400 319261 320684 322221 324739 328712 333921 339685 345225 350027 354225 358532
63247 358532 363579 369409 375840 383020 391159 399981 409095 418929 430551 444369 459648 475611 492423
63234 492423 510658 530415 551593 574516 599495 625913 652486 678343 703243 726889 748896
63223 748896 769623 790315 812017 834804 858331 882596 907688 933186 958310 982493 1005383
$$ packed form
63318E65435L9J35j874n772j0340j4354j7179j8601j8715j7960j6875j5681j4316
63305D13942j2758j1123r459p768o172m819l664k583j703j342j598k153k584k689
63291C43527k566k457k576k911l228l380l494l649l555k871j873j309j448j683
63277C06527j426r47q93j216j199n53J54L62K89M94J033J493J654J690J756J847
63261C11065J979K162K194J861J423J537K518L973N209N764N540M802M198M307
63247C58532N047N830O431P180Q139Q822R114R834J1622J3818J5279J5963J6812
63234D92423J8235J9757K1178K2923K4979K6418K6573K5857K4900K3646K2007
63223G48896K0727K0692K1702K2787K3527K4265K5092K5498K5124K4183K2890
$$ plain form
63212 1005383 1026417 1044756 1059597 1070220 1075776 1075374 1068428 1054884 1035249 1010652 982696 952845
63200 952845 921861 890082 858245 827705 799707 774686 752493 733066 716625 703291 692872
63189 692872 685159 680235 678361 679623 683848 690806 700357 712414 726861 743498 761894 781300 800837
63176 800837 819841 837994 855224 871766 888308 905629 923772 941801 958698 974230 988528
63165 988528 1000979 1010140 1014852 1014919 1010476 1001195 986590 966855 942960 915947 886451 854947 822182
63152 822182 789229 757184 726772 698161 671141 645560 621639 599912 580943 565021 551832
63141 551832 540364 529446 518701 508865 500908 494907 490061 485722 481999 479208 477146 475321 473804
63128 473804 473412 474899 478149 482348 486804 491385 496217 501258 506321 511282 516032 520331 524009 527340
$$ packed form
63212A005383K1034J8339J4841J0623N556m02o946j3544j9635k4597k7956k9851
63200I52845l0984l1779l1837l0540k7998k5021k2193j9427j6441j3334j0419
63189F92872p713m924j874J262M225O958R551J2057J4447J6637J8396J9406J9537
63176H00837J9004J8153J7230J6542J6542J7321J8143J8029J6897J5532J4298
63165I88528J2451R161M712O7m443r281j4605j9735k3895k7013k9496l1504l2765
63152H22182l2953l2045l0412k8611k7020k5581k3921k1727j8969j5922j3189
63141E51832j1468j0918j0745r836p957o001m846m339l723k791k062j825j517
63128D73804l92J487L250M199M456M581M832N041N063M961M750M299L678L331
$$ plain form
63114 527340 530982 535355 540147 544549 548008 550706 553307 556268 559419 562265 564598 566642 568600 570297
63100 570297 571422 571913 571867 571204 569774 567774 565801 564400 563751 563741 564150 564715 565213 565499 565420 564873 564185 564197
63082 564197 565521 567820 570326 572987 576514 581220 586552 592054 598093 605134 612878 620750 628834 637567
63068 637567 646757 655725 664448 673907 685173 698626 714145 731491 750292 770189 791431 815097
63056 815097 842373 873686 908641 946618 987291 1030710 1077210 1127174 1180706 1237327 1295977
63045 1295977 1355375 1414539 1473104 1531128 1588565 1645091 1700543 1755364 1810364 1866074 1922460
63034 1922460 1979108 2035380 2090455 2143483 2193651 2239829 2280159 2312307 2334240 2344623 2342585
63023 2342585 2327501 2299178 2258035 2205105 2142132 2071768 1997250 1921475 1846319 1772851 1702040
$$ packed form
63114E27340L642M373M792M402L459K698K601K961L151K846K333K044J958J697
63100E70297J125M91m6o63j430k000j973j401o49j0M09N65M98K86p9n47o88J2
63082E64197J324K299K506K661L527M706N332N502O039P041P744P872Q084Q733
63068F37567R190Q968Q723R459J1266J3453J5519J7346J8801J9897K1242K3666
63056H15097K7276L1313L4955L7977M0673M3419M6500M9964N3532N6621N8650
63045A295977N9398N9164N8565N8024N7437N6526N5452N4821N5000N5710N6386
63034A922460N6648N6272N5075N3028N0168M6178M0330L2148K1933J0383k038
63023B342585j5084k8323m1143n2930o2973p0364p4518p5775p5156p3468p0811
$$ plain form
63012 1702040 1635189 1573866 1519552 1473124 1434566 1403326 1379093 1362097 1352557 1350093 1353909 1363339
63000 1363339 1377888 1396809 1419050 1443779 1470731 1499793 1530412 1561715 1593285 1625535 1658989
62989 1658989 1693269 1727084 1759299 1789728 1818694 1845973 1870365 1890144 1903676 1909768 1907765 1897435
62977 1897435 1878690 1851552 1816466 1774375 1726160 1672267 1613372 1551332 1488866 1428138 1370049
62966 1370049 1314959 1263400 1215707 1171479 1130060 1091426 1056110 1024288 995334 968288 942387
62955 942387 917164 892458 868566 846141 825583 806526 788031 769303 750217 731231 712954
62944 712954 695823 680027 665520 652080 639519 627932 617613 608622 600598 593180 586436 580597
62932 580597 575457 570444 565383 560875 557708 556037 555323 554910 554501 554123 553795 553275 552136 550175 547736 545458
$$ packed form
63012A702040o6851o1323n4314m6428l8558l1240k4233j6996r540k464L816R430
63000A363339J4549J8921K2241K4729K6952K9062L0619L1303L1570L2250L3454
62989A658989L4280L3815L2215L0429K8966K7279K4392J9779J3532O092k003j0330
62977A897435j8745k7138l5086m2091m8215n3893n8895o2040o2466o0728n8089
62966A370049n5090n1559m7693m4228m1419l8634l5316l1822k8954k7046k5901
62955I42387k5223k4706k3892k2425k0558j9057j8495j8728j9086j8986j8277
62944G12954j7131j5796j4507j3440j2561j1587j0319q991q024p418o744n839
62932E80597n140n013n061m508l167j671p14m13m09l78l28n20j139j961k439k278
$$ plain form
62916 545458 543701 542325 541001 539476 537508 534789 531247 527256 523392 519943 516718 513277 509322 504971
62902 504971 500760 497296 494816 493068 491606 490097 488456 486842 485598 485023 485107 485518 485883 486013 485958 485907 485944
62885 485944 485789 484980 483537 482325 482386 483896 486030 487851 489052 489913 490840 491951 492833 492768 491488 489645
62869 489645 488148 487132 486008 484416 482564 480687 478864 477456 476972 477207 477161 476154 474465 472701 471222
62854 471222 470488 471054 472614 473775 473569 472619 472148 472388 472786 473132 473466 473281 472002 470120 468786 468237 467579
62837 467579 466175 464320 462469 460700 459166 458183 457600 456865 456015 455807 456544 457542 458144 458506 458969 459447 460026
62820 460026 461397 463968 467042 469621 471709 474145 477454 481481 485914 490529 495082 499520 504202 509426
62806 509426 514878 520058 525099 530675 537184 544561 552824 562163 572368 582711 592665 602506 613023
$$ packed form
62916E45458j757j376j324j525j968k719l542l991l864l449l225l441l955m351
62902E04971m211l464k480j748j462j509j641j614j244n75Q4M11L65J30n5n1L7
62885D85944j55q09j443j212O1J510K134J821J201Q61R27J111Q82o5j280j843
62869D89645j497j016j124j592j852j877j823j408m84K35m6j007j689j764j479
62854D71222p34N66J560J161k06r50m71K40L98L46L34j85j279j882j334n49o58
62837D67579j404j855j851j769j534r83n83p35q50k08P37R98O02L62M63M78N79
62820D60026J371K571L074K579K088K436L309M027M433M615M553M438M682N224
62806E09426N452N180N041N576O509P377Q263R339J0205J0343R954R841J0517
$$ plain form
62793 613023 624920 638521 653804 670562 688765 708888 731783 758220 788701 823713 863925
62782 863925 909988 962238 1020626 1084926 1155046 1231217 1313763 1402560 1496686 1594563 1694158
62771 1694158 1792947 1888067 1976911 2057500 2127942 2185735 2228192 2253720 2262375 2255060 2232560 2195537
62759 2195537 2145077 2082834 2010732 1930802 1845253 1756367 1666159 1576217 1487836 1402172 1320208
62748 1320208 1242727 1170415 1103880 1043324 988256 937832 891631 849867 812566 778820 747345
62737 747345 717818 691164 668297 648936 631974 616686 603088 591224 580691 571090 562631 555927
62725 555927 551235 548102 545864 544304 543623 543830 544543 545601 547544 551018 555866 561384 567522 575246 585420
62710 585420 597879 611984 627682 645504 665866 688972 715210 745090 778742 815941 856688
$$ packed form
62793F13023J1897J3601J5283J6758J8203K0123K2895K6437L0481L5012M0212
62782H63925M6063N2250N8388O4300P0120P6171Q2546Q8797R4126R7877R9595
62771A694158R8789R5120Q8844Q0589P0442N7793M2457K5528Q655p315k2500l7023
62759B195537n0460o2243p2102p9930q5549q8886r0208q9942q8381q5664q1964
62748A320208p7481p2312o6535o0556n5068n0424m6201m1764l7301l3746l1475
62737G47345k9527k6654k2867j9361j6962j5288j3598j1864j0533r601q459o704
62725E55927m692l133k238j560o81K07P13J058J943L474M848N518O138P724J0174
62710E85420J2459J4105J5698J7822K0362K3106K6238K9880L3652L7199M0747
$$ plain form
62699 856688 901438 950749 1004966 1064116 1127765 1195087 1265405 1338494 1413880 1489943 1564258
62688 1564258 1634640 1699223 1755585 1800808 1832875 1851441 1856863 1849017 1827517 1792632 1745517 1687936
62676 1687936 1622294 1551508 1478176 1403880 1329653 1256804 1186755 1120268 1057471 998601 944134
62665 944134 894183 848289 805969 767049 731414 698887 669539 643651 621143 601396 583800
62654 583800 568137 554164 541217 528626 516342 504789 494176 484215 474519 465066 456291 448809
62642 448809 442976 438609 435214 432546 430717 429669 428836 427715 426594 426246 426835 427504 427225 425800 423831
62627 423831 421905 420138 418463 417008 415988 415385 414948 414522 414162 413897 413664 413697 414774 417627 422041 426923
62611 426923 431457 435927 441145 447443 454590 462490 471369 481246 491717 502551 514233 527692 543615
$$ packed form
62699H56688M4750M9311N4217N9150O3649O7322P0318P3089P5386P6063P4315
62688A564258P0382O4583N6362M5223L2067J8566N422p846k1500l4885m7115n7581
62676A687936o5642p0786p3332p4296p4227p2849p0049o6487o2797n8870n4467
62665I44134m9951m5894m2320l8920l5635l2527k9348k5888k2508j9747j7596
62654E83800j5663j3973j2947j2591j2284j1553j0613r961r696r453q775p482
62642D48809n833m367l395k668j829j048q33j121j121l48N89O69k79j425j969
62627D23831j926j767j675j455j020o03m37m26l60k65k33L3J077K853M414M882
62611D26923M534M470N218O298P147P900Q879R877J0471J0834J1682J3459J5923
$$ plain form
62598 543615 562182 583285 606904 633399 663459 697624 735807 777481 822221 869600 918463
62587 918463 966863 1013078 1056231 1095461 1128896 1154210 1170116 1176757 1174721 1164409 1146489 1122206
62575 1122206 1092789 1058962 1021399 981346 940303 899288 858729 818921 780227 742962 707483
62564 707483 674456 644775 619051 597144 578093 560565 543719 527871 514154 503274 494741 487381
62552 487381 480340 473472 467201 462389 459930 459801 460591 460610 459481 458162 457406 456859 455848 454486 453551 453653
62536 453653 454798 456453 457751 457952 457117 456134 455791 456065 456581 457517 459583 463298 468728 475845 484737 495454
62520 495454 508049 522823 540216 560367 583051 608098 635673 666081 699533 736100 775658
62509 775658 817765 861733 906748 951735 995261 1035947 1072967 1105764 1133303 1154131 1167352
$$ packed form
62598E43615J8567K1103K3619K6495L0060L4165L8183M1674M4740M7379M8863
62587I18463M8400M6215M3153L9230L3435K5314J5906O641k036j0312j7920k4283
62575A122206k9417l3827l7563m0053m1043m1015m0559l9808l8694l7265l5479
62564G07483l3027k9681k5724k1907j9051j7528j6846j5848j3717j0880q533p360
62552D87381p041o868o271m812k459j29P90J9j129j319p56n47j011j362r35J02
62536D53653J145J655J298K01q35r83l43K74N16R36K066L715N430P117Q892J0717
62520D95454J2595J4774J7393K0151K2684K5047K7575L0408L3452L6567L9558
62509G75658M2107M3968M5015M4987M3526M0686L7020L2797K7539K0828J3221
$$ plain form
62498 1167352 1173135 1172093 1164671 1151482 1133868 1113577 1092116 1070790 1051156 1034836 1022809 1015205
62486 1015205 1011846 1012801 1018430 1029181 1045356 1066898 1093409 1124452 1159577 1197723 1236820 1274359
62474 1274359 1308361 1337478 1360494 1376407 1385020 1386731 1381412 1367959 1345305 1313559 1273962 1228204
62462 1228204 1178133 1125636 1072129 1018190 964174 911173 861027 815338 774751 739154 708302
62451 708302 682063 660119 641611 625320 610490 597437 587056 579713 575025 572737 573138 576226 581068
62438 581068 586601 592694 599737 607439 614803 621172 626550 630809 633334 633609 631542 626992 619628 609576
62424 609576 597657 584627 570651 555919 541317 527947 516223 505814 496283 487414 479099 471251
62412 471251 463784 456508 449270 442387 436557 432068 428403 424987 421966 419776 418227 416635 414773 413136
$$ packed form
62498A167352N783j042p422j3189j7614k0291k1461k1326j9634j6320j2027p604
62486A015205l359R55N629J0751J6175K1542K6511L1043L5125L8146L9097L7539
62474A274359L4002K9117K3016J5913Q613J711n319j3453k2654l1746l9597m5758
62462A228204n0071n2497n3507n3939n4016n3001n0146m5689m0587l5597l0852
62451G08302k6239k1944j8508j6291j4830j3053j0381p343m688k288M01L088M842
62438E81068N533O093P043P702P364O369N378M259K525K75k067m550p364j0052
62424F09576j1919j3030j3976j4732j4602j3370j1724j0409r531q869q315p848
62412D71251p467p276p238o883n830m489l665l416l021k190j549j592j862j637
$$ plain form
62398 413136 412232 412073 412455 413316 414666 416402 418317 420087 421335 421933 422242 422818 423962 425778 428428 431917
62382 431917 435795 439647 443886 449466 456658 464633 472461 480045 487792 495874 504214 512910 522166 531937
62368 531937 542038 552634 564388 578117 594390 613290 634453 657565 683058 712179 746164
62357 746164 785411 829596 878293 931156 987598 1046607 1106784 1166220 1222360 1272457 1314493
62346 1314493 1347702 1372249 1388536 1396823 1397329 1390517 1377176 1358087 1333599 1303726 1268869 1230318
62334 1230318 1189895 1149195 1109351 1071259 1035665 1003044 973730 948121 926399 908049 892056
62323 892056 877636 864310 851157 836616 819555 800215 779608 758229 735907 712766 689626
62312 689626 667269 645824 625155 605461 587174 570529 555560 542374 531093 521625 513755 507403
$$ packed form
62398D13136r04j59L82Q61J350J736J915J770J248N98L09N76J144J816K650L489
62382D31917L878L852M239N580P192P975P828P584P747Q082Q340Q696R256R771
62368E31937J0101J0596J1754J3729J6273J8900K1163K3112K5493K9121L3985
62357G46164L9247M4185M8697N2863N6442N9009O0177N9436N6140N0097M2036
62346A314493L3209K4547J6287Q287N06o812j3341j9089k4488k9873l4857l8551
62334A230318m0423m0700l9844l8092l5594l2621k9314k5609k1722j8350j5993
62323H92056j4420j3326j3153j4541j7061j9340k0607k1379k2322k3141k3140
62312F89626k2357k1445k0669j9694j8287j6645j4969j3186j1281r468p870o352
$$ plain form
62300 507403 502486 498513 494601 490076 485096 480595 477597 476397 476392 476769 477404 478906 481758 485679 489977
62285 489977 494248 498438 502515 506463 510491 514857 519534 524389 529593 535416 541683 547963 554359 561567
62271 561567 569973 579216 588981 599779 612493 627479 644463 663123 683409 705550 730229 758627
62259 758627 791876 830421 874170 923120 977438 1036945 1100875 1168120 1237297 1306399 1372680
62248 1372680 1433265 1485969 1529589 1563504 1587219 1600435 1603621 1598088 1584974 1564120 1534385 1495198
62236 1495198 1447387 1392468 1331898 1267528 1202053 1138128 1077204 1019798 966526 918067 874323
62225 874323 834586 798638 766878 739209 714620 692246 672276 655370 641587 630157 620009
62214 620009 610366 601188 593096 586489 580747 574862 568811 563552 559516 556023 552559 549740 548407 548475 549380
$$ packed form
62300E07403m917l973l912m525m980m501k998j200nL77O35J502K852L921M298
62285D89977M271M190M077L948M028M366M677M855N204N823O267O280O396P208
62271E61567Q406R243R765J0798J2714J4986J6984J8660K0286K2141K4679K8398
62259G58627L3249L8545M3749M8950N4318N9507O3930O7245O9177O9102O6281
62248A372680O0585N2704M3620L3915K3715J3216L186n533j3114k0854k9735l9187
62236A495198m7811n4919o0570o4370o5475o3925o0924n7406n3272m8459m3744
62225H74323l9737l5948l1760k7669k4589k2374j9970j6906j3783j1430j0148
62214F20009r643r178q092o607n742n885o051n259m036l493l464k819j333O8R05
$$ plain form
62199 549380 550971 553184 555402 557174 559216 562723 567808 573478 579120 585104 591917 599484 607582 616176
62185 616176 625090 633983 642917 652421 662720 673346 683760 693839 703392 711700 718049 722621 726527
62172 726527 731069 737159 745295 755866 769494 787096 809442 836639 868251 903909 943447 986282
62160 986282 1030945 1075405 1117611 1155654 1187810 1212975 1231046 1242613 1248237 1248088 1242259 1231166
62148 1231166 1215508 1195855 1172369 1145023 1114132 1080641 1045942 1011518 978712 948505 921343
62137 921343 897403 877146 861206 849453 840586 833251 827288 823231 820776 818595 815725 812337 808925
62124 808925 805556 802324 799774 798234 797355 797033 798316 802424 808959 815818 820917 823375 823075 819921 814035
62109 814035 806305 798250 791298 786048 781918 777375 770890 761933 751076 739190 726880 714704 703461
$$ packed form
62199E49380J591K213K218J772K042L507N085N670N642N984O813P567Q098Q594
62185F16176Q914Q893Q934R504J0299J0626J0414J0079R553Q308O349M572L906
62172G26527M542O090Q136J0571J3628J7602K2346K7197L1612L5658L9538M2835
62160I86282M4663M4460M2206L8043L2156K5165J8071J1567N624j49n829j1093
62148A231166j5658j9653k3486k7346l0891l3491l4699l4424l2806l0207k7162
62137I21343k3940k0257j5940j1753q867p335n963m057k455k181k870l388l412
62124H08925l369l232k550j540q79l22J283M108O535O859N099K458l00l154n886
62109H14035p730q055o952n250m130m543o485q957j0857j1886j2310j2176j1243
$$ plain form
62096 703461 693869 686104 679928 675248 672290 671231 671833 673596 676218 679772 684324 689491 694612 699428
62082 699428 704343 709810 715750 721950 728908 737761 749283 763284 779070 796040 813735 831778 850251
62069 850251 869776 890821 913072 935936 959554 984838 1012518 1042630 1074889 1108935 1143771
62058 1143771 1177315 1207048 1231181 1249173 1261348 1268275 1270409 1267971 1261123 1250288 1236115 1218841
62046 1218841 1197810 1171932 1140723 1104842 1065752 1025083 984168 943721 903878 864753 826907
62035 826907 791040 757349 725734 696572 670602 647770 626926 607165 588928 573131 559649
62024 559649 547421 535742 524546 513572 502343 491136 481034 472511 464777 457079 449921 444249
62012 444249 439922 435825 431304 426653 422308 418387 415182 413394 413482 415205 418096 422104 427471 434191 441745
$$ packed form
62096G03461r592p765o176m680k958j059O02J763K622L554M552N167N121M816
62082F99428M915N467N940O200O958Q853J1522J4001J5786J6970J7695J8043J8473
62069H50251J9525K1045K2251K2864K3618K5284K7680L0112L2259L4046L4836
62058A143771L3544K9733K4133J7992J2175O927K134k438o848j0835j4173j7274
62046A218841k1031k5878l1209l5881l9090m0669m0915m0447l9843l9125l7846
62035H26907l5867l3691l1615k9162k5970k2832k0844j9761j8237j5797j3482
62024E59649j2228j1679j1196j0974j1229j1207j0102q523p734p698p158n672
62012D44249m327m097m521m651m345l921l205j788Q8J723K891M008N367O720P554
$$ plain form
61997 441745 449257 455856 461150 465457 469359 472981 475950 478072 479608 480659 480679 478985 475544 470848 465229
61982 465229 458739 451666 444646 438091 431841 425590 419406 413576 408189 403223 398952 395817 393711 391709
61968 391709 388870 385275 382036 380218 379957 380613 381440 381889 381545 380303 378675 377583 377571 378341 379161 379617 379845
61951 379845 380218 380965 382076 383438 385047 387146 390080 394003 398843 404579 411356 419125 427439 435946 445015
61936 445015 455450 467467 480254 492742 504550 515922 526943 537235 546459 554728 562328 569189
61924 569189 574847 578869 581135 581747 580804 578366 574561 569690 564300 559107 554720 551366 549044 548067 549240
61909 549240 553287 560167 569213 579830 591699 604267 616583 627962 638398 647880 655575 660337 661987
61896 661987 661438 659439 655766 650007 642606 634610 626652 618718 610794 603172 596072 589391 582958 576738
$$ packed form
61997D41745P512O599N294M307L902L622K969K122J536J051K0j694l441m696n619
61982D65229o490p073p020o555o250o251o184n830n387m966m271l135k106k002
61968C91709k839l595l239j818k61O56Q27M49l44j242j628j092j2P70Q20M56K28
61951C79845L73P47J111J362J609K099K934L923M840N736O777P769Q314Q507R069
61936D45015J0435J2017J2787J2488J1808J1372J1021J0292R224Q269P600O861
61924E69189N658M022K266O12r43k438l805m871n390n193m387l354k322r77J173
61909E49240M047O880R046J0617J1869J2568J2316J1379J0436R482P695M762J650
61896F61987n49j999l673n759p401p996p958p934p924p622p100o681o433o220
$$ plain form
61882 576738 570681 564630 558439 551929 544703 536384 527206 518041 509579 501766 494281 487271 481246 476402
61868 476402 472441 469008 466002 463482 461676 461044 461955 464143 466842 469721 473440 478973 486503 495304 504732
61853 504732 515032 527014 541130 557057 574190 592306 611559 631903 652762 673412 693506
61842 693506 712929 731145 746941 759005 766702 770237 770294 767651 762971 756679 749001 740296 731373 723331
61828 723331 717071 713108 711762 713242 717386 723650 731538 740869 751276 761581 770056 775439 777487 776537
61814 776537 772821 766321 756992 744879 730218 713638 696144 678620 661471 644882 629254 614996
61802 614996 601972 589595 577602 566377 556342 547313 538747 530411 522511 515288 508824 503248 498752
61789 498752 495216 491978 488206 483510 478149 472702 467662 463361 460053 457860 456584 455763 455031 454327 453669
$$ packed form
61882E76738o057o051o191o510p226q319r178r165q462p813p485p010o025m844
61868D76402l961l433l006k520j806o32R11K188K699K879L719N533P530Q801R428
61853E04732J0300J1982J4116J5927J7133J8116J9253K0344K0859K0650K0094
61842F93506J9423J8216J5796J2064P697L535N7k643m680o292p678q705q923q042
61828G23331o260l963j346J480M144O264P888R331J0407J0305Q475N383K048r50
61814G76537l716o500r329j2113j4661j6580j7494j7524j7149j6589j5628j4258
61802F14996j3024j2377j1993j1225j0035r029q566q336p900p223o464n576m496
61789D98752l536l238l772m696n361n447n040m301l308k193j276q21p32p04o58
$$ plain form
61774 453669 452878 451724 450272 448869 447801 447150 446918 447038 447252 447291 447262 447553 448241 448901 449223 449556 450539 452368
61756 452368 454770 457596 461009 465025 469138 472605 474984 476293 476698 476199 474701 472345 469573 466662 463336
61741 463336 459175 454392 449809 445965 442679 439751 437625 436867 437277 438044 438656 439167 439678 440181 440910 442231
61725 442231 443971 445355 445943 446237 447065 448637 450525 452283 453689 454548 454746 454559 454693 455827 458109 460962
61709 460962 463295 464037 462768 459941 456506 453270 450567 448289 446078 443562 440573 437162 433377 429105
61695 429105 424275 419221 414670 411184 408579 406006 402743 398836 394832 390990 387060 382862 378653 374726
61681 374726 371025 367533 364674 362810 361534 360050 358245 356770 355980 355432 354697 354067 354031 354412 354552 354089
61665 354089 353196 352200 351417 351231 351874 353065 354191 354966 355725 356978 358776 360659 362151 363217 364159 365114
$$ packed form
61774D53669p91j154j452j403j068o51k32J20K14L9k9K91O88O60L22L33R83J829
61756D52368K402K826L413M016M113L467K379J309M05m99j498k356k772k911l326
61741D63336m161m783m583l844l286k928k126p58M10P67O12N11N11N03P29J321
61725D42231J740J384N88K94Q28J572J888J758J406Q59J98j87J34J134K282K853
61709D60962K333P42j269k827l435l236k703k278k211k516k989l411l785m272
61695D29105m830n054m551l486k605k573l263l907m004l842l930m198m209l927
61681C74726l701l492k859j864j276j484j805j475p90n48p35o30l6L81J40m63
61665C54089q93r96p83j86O43J191J126P75P59J253J798J883J492J066R42R55
$$ plain form
61649 365114 365852 366239 366731 368057 370383 373022 375063 376132 376586 377229 378822 381490 384478 386759 387980
61634 387980 388569 388950 389118 389013 388733 388131 386708 384303 381481 378855 376402 373751 370757 367352 363388 359177
61618 359177 355816 354243 354206 354753 355460 356436 357386 357660 357242 356715 356017 354104 350350 345556 341001 337061 333348
61601 333348 329777 326690 324049 321240 317877 314368 311422 309184 307104 304673 302067 299888 298252 296508
61587 296508 294141 291738 290488 290676 291218 290943 289884 288926 288493 288139 287378 286437 285995 286336 286919 286766 285359
61570 285359 283153 281170 280043 279624 279545 279851 280846 282492 284319 285915 287261 288541 289883 291371 293099
61555 293099 295029 296866 298277 299272 300317 301966 304327 306880 308854 309828 310032 310076 310411 311086 311949 312943
61539 312943 314059 315080 315650 315738 315815 316267 316717 316315 314847 313219 312598 313219 314239 314635 313998 312588 310942
$$ packed form
61649C65114P38L87M92J326K326K639K041J069M54O43J593K668K988K281J221
61634C87980N89L81J68j05k80o02j423k405k822k626k453k651k994l405l964m211
61618C59177l361j573l7N47P07R76R50K74m18n27o98j913l754m794m555l940l713
61601C33348l571l087k641k809l363l509k946k238k080k431k606k179j636j744
61587B96508k367k403j250J88N42k75j059r58m33l54p61r41m42L41N83j53j407
61570B85359k206j983j127m19p9L06R95J646J827J596J346J280J342J488J728
61555B93099J930J837J411R95J045J649K361K553J974R74K04M4L35O75Q63R94
61539C12943J116J021N70Q8P7M52M50m02j468j628o21O21J020L96o37j410j646
$$ plain form
61522 310942 309494 308367 307432 306563 305779 305085 304336 303421 302488 301796 301434 301293 301244 301222 301218 301324 301620 301978 302171
61503 302171 302357 303088 304567 306150 306980 306921 306502 306138 305857 305637 305518 305398 305183 305109 305504 306351 307504 309142
61485 309142 311368 313464 314338 313816 312784 311960 311378 311279 312454 315041 317829 319665 320997 323052 325767 327621
61469 327621 327582 326350 325401 325417 326051 326779 327536 328569 329931 331206 331725 331062 329318 326981 324717 323284 323254
61452 323254 324530 326380 328186 329933 331699 332992 333136 332155 330857 330021 329849 330227 331107 332485 334201 335919
61436 335919 337310 338370 339547 341321 343545 345561 347072 348446 349789 350362 349616 348377 348056 348849 349665
61421 349665 349901 350259 351453 353011 354028 354388 354558 354656 354504 354341 354665 355371 355678 355054 353761 352385 351189
61404 351189 350054 348741 347106 345343 344071 343909 344761 345739 345948 345231 344070 342963 342074 341414 341110 341408
$$ packed form
61522C10942j448j127r35q69p84o94p49r15r33o92l62j41m9k2mJ06K96L58J93
61503C02171J86P31J479J583Q30n9m19l64k81k20j19j20k15p4L95Q47J153J638
61485C09142K226K096Q74n22j032q24n82r9J175K587K788J836J332K055K715J854
61469C27621l9j232r49J6O34P28P57J033J362J275N19o63j744k337k264j433l0
61452C23254J276J850J806J747J766J293J44r81j298q36j72L78Q80J378J716J718
61436C35919J391J060J177J774K224K016J511J374J343N73p46j239l21P93Q16
61421C49665K36L58J194J558J017L60J70R8j52j63L24P06L07o24j293j376j196
61404C51189j135j313j635j763j272j62Q52R78K09p17j161j107q89o60l04K98
$$ plain form
61388 341408 342432 343952 345447 346463 346961 347263 347711 348464 349576 351086 352934 354911 356826 358654 360456
61373 360456 362219 363895 365580 367510 369844 372515 375307 377973 380226 381705 382147 381714 381103 381129 382076 383538
61357 383538 384997 386484 388434 391022 394067 397728 402791 409746 417855 425739 432850 439676 446388 452078
61343 452078 455881 458314 460769 463935 467322 470230 472435 473934 474743 475235 476110 477563 478892 479280 478733
61328 478733 477890 477160 476448 475595 474624 473501 472013 470084 468116 466892 467070 468758 471565 475072 479138 483727
61312 483727 488669 493956 500176 508193 518259 529771 542068 555114 569224 584425 600332 616347
61300 616347 631651 645290 656599 665424 671726 675250 675935 674351 671251 666793 660673 652955 644318 635430
61286 635430 626458 617242 607633 597580 587199 576884 567218 558729 551786 546538 542688 539534 536679
$$ packed form
61388C41408J024J520J495J016M98L02M48P53J112J510J848J977J915J828J802
61373C60456J763J676J685J930K334K671K792K666K253J479M42m33o11K6R47J462
61357C83538J459J487J950K588L045L661N063O955Q109P884P111O826O712N690
61343D52078L803K433K455L166L387K908K205J499Q09M92Q75J453J329L88n47
61328D78733q43p30p12q53r71j123j488j929j968j224J78J688K807L507M066M589
61312D83727M942N287O220Q017J0066J1512J2297J3046J4110J5201J5907J6015
61300F16347J5304J3639J1309Q825O302L524O85j584l100m458o120p718q637q888
61286F35430q972r216r609j0053j0381j0315r666q489o943n248l850l154k855
$$ plain form
61273 536679 534628 534161 535091 536170 536427 536116 536072 536545 537111 537487 537984 539181 541502 545121 549956 555563 561220
61256 561220 566283 570541 574199 577542 580593 583133 584982 586242 587198 588081 588913 589486 589422 588448 586750 585019
61240 585019 583887 583365 582929 582140 581020 579858 578846 577962 577135 576549 576713 578092 580588 583607 586813 590569
61224 590569 595388 601196 607574 614569 622717 632194 642418 652654 662706 672780 682964 693051 702687
61211 702687 711482 719191 725960 732255 738373 744114 749088 753254 757029 760930 765223 769822 774502 779328
61197 779328 784953 792362 802175 814282 828154 843250 858900 873981 887158 897671 905757 912072
61185 912072 916772 919390 919697 918348 916360 914038 910785 906011 899815 892621 884566 875605 865954 856014
61171 856014 845969 835744 825250 814417 803143 791476 779677 767822 755538 742512 729050
$$ packed form
61273E36679k051m67R30J079K57l11m4M73N66L76M97J197K321L619M835N607N657
61256E61220N063M258L658L343L051K540J849J260R56Q83Q32N73o4r74j698j731
61240E85019j132n22m36p89j120j162j012q84q27n86J64J379K496L019L206L756
61224E90569M819N808O378O995Q148R477J0224J0236J0052J0074J0184J0087R636
61211G02687Q795P709O769O295O118N741M974M166L775L901M293M599M680M826
61197G79328N625P409R813J2107J3872J5096J5650J5081J3177J0513Q086O315
61185I12072M700K618L07j349j988k322l253m774o196p194q055q961r651r940
61171H56014j0045j0225j0494j0833j1274j1667j1799j1855j2284j3026j3462
$$ plain form
61160 729050 715726 702651 689553 676459 663792 651948 641283 632333 625342 619692 614569 610251
61148 610251 607829 607406 607468 606511 604551 602431 600238 597167 592635 586862 580566 574600 569733 566280 563991
61133 563991 562539 561938 562294 563551 565817 569526 574780 580904 587205 593925 601894 611604 623230 637241
61119 637241 654079 673280 693780 715214 738197 763094 789270 815924 843032 870936 899379
61108 899379 927462 954368 979726 1003441 1025523 1046030 1064862 1081561 1095408 1105685 1111884 1113882
61096 1113882 1112023 1106763 1098125 1085773 1069794 1051073 1030555 1008400 984340 958728 932740 907432
61084 907432 883122 859837 837917 817811 799501 782530 766523 751365 736966 723269 710517
61073 710517 699230 689802 682306 676697 672898 670634 669523 669415 670365 672235 674738 678003 682561 688526
$$ packed form
61160G29050j3324j3075j3098j3094j2667j1844j0665q950o991n650n123m318
61148F10251k422m23O2r57j960k120k193l071m532n773o296n966m867l453k289
61133E63991j452o01L56J257K266L709N254O124O301O720P969R710J1626J4011
61119F37241J6838J9201K0500K1434K2983K4897K6176K6654K7108K7904K8443
61108H99379K8083K6906K5358K3715K2082K0507J8832J6699J3847J0277O199J998
61096A113882j859n260q638j2352j5979j8721k0518k2155k4060k5612k5988k5308
61084I07432k4310k3285k1920k0106j8310j6971j6007j5158j4399j3697j2752
61073G10517j1287r428p496n609l799k264j111j08R50J870K503L265M558N965
$$ plain form
61059 688526 695332 702707 711288 721592 732916 744137 755327 767611 781576 796834 813241 831423
61047 831423 851758 873753 896891 921309 947140 973984 1001618 1030624 1061652 1094638 1129351
61036 1129351 1166166 1205531 1247085 1290036 1334230 1380290 1428975 1480854 1536061 1593730 1652089
61025 1652089 1709912 1767621 1826419 1886864 1949206 2014768 2085942 2164844 2252678 2350036 2456804
61014 2456804 2571964 2694764 2826452 2970378 3130921 3313665 3526605 3779936 4084604
61005 4084604 4452814 4900744 5450442 6130876 6981829 8058807 9427735 11140325 13196289
60996 13196289 15510877 17905360 20130910 21929009 23116953 23663552 23709539 23512626 23345239
60987 23345239 23399562 23736059 24275009 24818310 25102254 24883550 24032071 22578507 20685778
$$ packed form
61059F88526O806P375Q581J0304J1324J1221J1190J2284J3965J5258J6407J8182
61047H31423K0335K1995K3138K4418K5831K6844K7634K9006L1028L2986L4713
61036A129351L6815L9365M1554M2951M4194M6060M8685N1879N5207N7669N8359
61025A652089N7823N7709N8798O0445O2342O5562P1174P8902Q7834R7358J06768
61014B456804J15160J22800J31688J43926J60543J82744K12940K53331L04668
61005D084604L68210M47930N49698O80434Q50953J076978J368928J712590K055964
60996A3196289K314588K394483K225550J798099J187944N46599M5987j96913j67387
60987B3345239N4323L36497N38950N43301K83944k18704q51479j453564j892729
$$ plain form
60978 20685778 18568370 16416901 14364920 12491548 10834695 9402009 8181123 7150162
60970 7150162 6284798 5560777 4955157 4447791 4021534 3661114 3352929 3086082 2852603
60961 2852603 2646358 2462534 2298083 2151321 2020432 1903055 1797559 1703695 1621332 1549158
60951 1549158 1485222 1428113 1376901 1330246 1286274 1243298 1200413 1157713 1116312 1077816 1043188
60940 1043188 1012049 983265 955990 929863 904521 879535 854857 830954 808287 786831 766208
60929 766208 746260 727448 710622 696277 684015 672868 662185 652045 642890 634944 628036 621651
60917 621651 615143 608244 601510 595955 592034 589235 586787 584414 582198 580186 578479 577364 576875 576504 575803
60902 575803 575067 574951 575555 576393 577106 577615 577615 576585 574466 571825 569151 566422 563516 560543 557504 554019
$$ packed form
60978B0685778k117408k151469k051981j873372j656853j432686j220886j030961
60970G150162q65364p24021o05620n07366m26257l60420l08185k66847k33479
60961B852603k06245j83824j64451j46762j30889j17377j05496r3864q2363p2174
60951A549158o3936n7109n1212m6655m3972m2976m2885m2700m1401l8496l4628
60940A043188l1139k8784k7275k6127k5342k4986k4678k3903k2667k1456k0623
60929G66208j9948j8812j6826j4345j2262j1147j0683j0140r155p946o908o385
60917F21651o508o899o734n555l921k799k448k373k216k012j707j115m89l71p01
60902E75803p36j16O04Q38P13N09%j030k119k641k674k729k906k973l039l485
$$ plain form
60886 554019 549727 544654 538931 532496 525401 518074 510886 503691 496177 488482 481052 474027 467189 460418
60872 460418 453870 447747 442234 437579 433893 430879 428114 425565 423524 422096 421171 420927 421943 424569 428371
60857 428371 432256 435093 436402 436775 437518 439422 441917 443822 444915 446199 448519 451536 454293 456308 457773
60842 457773 459140 460879 463201 465571 466875 466520 465088 463495 461891 459889 457504 455111 452682 449867
60828 449867 446878 444482 442853 441067 438165 434276 430342 427048 424469 422498 421095 420055 418883 417091
60814 417091 414454 410953 406617 401644 396611 392265 388901 386046 383033 379774 376699 373955 371134 367928
60800 367928 364576 361383 358203 354851 351683 349203 347302 345398 343292 341388 340087 339400 339115 338934 338513
60785 338513 337814 337404 337886 339020 339963 340391 340810 341616 342509 343159 343956 345590 348175 351147 353883 356230 358636
$$ packed form
60886E54019m292n073n723o435p095p327p188p195p514p695p430p025o838o771
60872D60418o548o123n513m655l686l014k765k549k041j428r25k44J016K626L802
60857D28371L885K837J309L73P43J904K495J905J093J284K320L017K757K015J465
60842D57773J367J739K322K370J304l55j432j593j604k002k385k393k429k815
60828D49867k989k396j629j786k902l889l934l294k579j971j403j040j172j792
60814D17091k637l501m336m973n033m346l364k855l013l259l075k744k821l206
60800C67928l352l193l180l352l168k480j901j904k106j904j301o87k85j81m21
60785C38513o99m10M82J134R43M28M19Q06Q93O50P97J634K585K972K736K347K406
$$ plain form
60768 358636 361879 366346 371421 375883 379080 381355 383204 384534 385063 384969 384659 384164 383267 382061 380947 380123
60752 380123 379368 378277 376517 374032 371251 368997 367958 368286 369739 371871 373954 375112 374923 373633 371547
60737 371547 368531 364458 359731 354826 349630 343924 338355 334144 331682 329988 327849 325028 322141 319741
60723 319741 317924 316537 315382 314250 313071 312101 311753 312133 312865 313499 314059 314998 316543 318250 319422 319822
60707 319822 319791 319839 320444 322088 324898 328166 330746 332194 333111 334208 335561 337097 339220 342282 345820 348957
60691 348957 351351 353208 354602 355500 356373 358039 360706 363668 366123 367836 368893 369281 369016 368418 368021 368308
60675 368308 369488 371346 373340 375026 376339 377212 377175 375849 373681 371636 370113 368677 366868 364677 362136
60660 362136 359050 355473 351956 349017 346804 345444 345148 345634 346085 346253 347107 349648 353433 357000 359636
$$ packed form
60768C58636L243M467N075M462L197K275J849J330N29r4l10m95q97j206j114q24
60752C80123p55j091j760k485k781k254j039L28J453K132K083J158j89j290k086
60737C71547l016m073m727m905n196n706n569m211k462j694k139k821k887k400
60723C19741j817j387j155j132j179r70l48L80P32O34N60R39J545J707J172M00
60707C19822l1M8O05J644K810L268K580J448R17J097J353J536K123L062L538L137
60691C48957K394J857J394Q98Q73J666K667K962K455J713J057L88k65n98l97K87
60675C68308J180J858J994J686J313Q73l7j326k168k045j523j436j809k191k541
60660C62136l086l577l517k939k213j360k96M86M51J68Q54K541L785L567K636
$$ plain form
60645 359636 361896 364378 366796 368549 369466 369514 368274 365389 361343 357222 353698 350669 347880 345429 343488
60630 343488 341975 340826 340293 340600 341494 342549 343783 345428 347079 347714 346937 345774 345728 347152 348935 349722
60614 349722 349133 347813 346680 346217 346300 346528 346699 346847 346921 346739 346426 346491 347165 347937 348234 348287 348818 350020 351458
60595 351458 352959 354940 357628 360559 363114 365137 366731 367824 368334 368500 368674 368892 368926 368691 368399 368324 368573
60578 368573 369056 369684 370639 372331 374911 377958 381023 384408 388978 395131 402437 410483 419619 430476 443070
60563 443070 456633 470086 482396 492694 500407 505218 506826 505039 500326 493909 486991 480093 473434
60550 473434 467609 463414 461122 460406 460906 462433 464653 467119 469849 473557 479022 486332 494968 504605 515696
60535 515696 529162 545493 564165 583947 603603 622210 638949 652956 663510 670148 672711 671527
$$ packed form
60645C59636K260K482K418J753R17M8j240k885m046m121l524l029k789k451j941
60630C43488j513j149n33L07Q94J055J234J645J651O35p77j163m6J424J783P87
60614C49722n89j320j133m63Q3K28J71J48P4j82l13O5O74P72K97N3N31J202J438
60595C51458J501J981K688K931K555K023J594J093N10J66J74K18L4k35k92p5K49
60578C68573M83O28R55J692K580L047L065L385M570O153P306Q046R136J0857J2594
60563D43070J3563J3453J2310J0298P713M811J608j787m713o417o918o898o659
60550D73434n825m195k292p16N00J527K220K466K730L708N465P310Q636R637J1091
60535E15696J3466J6331J8672J9782J9656J8607J6739J4007J0554O638K563j184
$$ plain form
60523 671527 667533 661731 654405 645310 634744 623917 613974 605194 597493 591149 586357 582526 578799 575143
60509 575143 572244 570407 569281 568727 569246 571426 575564 582044 591541 604557 621247 641995 667649 698710
60495 698710 734559 773882 815643 859205 903556 946869 987069 1022789 1053821 1080673 1103680
60484 1103680 1122521 1136542 1145317 1148623 1145972 1136593 1119975 1096151 1065362 1027881 984499 936983
60472 936983 887750 839042 792399 748659 708178 671158 637829 608281 582204 559112 538832
60461 538832 521388 506311 492598 479770 468543 459926 453816 449031 444589 440399 436717 433522 430597
60448 430597 427712 424482 420444 415664 411006 407387 404873 402780 400629 398691 397542 397342 397722 398281 398956
60433 398956 399774 400336 399809 397611 394019 389962 386284 383362 381338 380320 380268 380931 382073 383601 385365 387034
$$ packed form
60523F71527l994n802p326r095j0566j0827r943q780p701o344m792l831l727l656
60509E75143k899j837j126n54N19K180M138O480R497J3016J6690K0748K5654L1061
60495F98710L5849L9323M1761M3562M4351M3313M0200L5720L1032K6852K3007
60484A103680J8841J4021Q775L306k651r379j6618k3824l0789l7481m3382m7516
60472I36983m9233m8708m6643m3740m0481l7020l3329k9548k6077k3092k0280
60461E38832j7444j5077j3713j2828j1227q617o110m785m442m190l682l195k925
60448D30597k885l230m038m780m658l619k514k093k151j938j149k00L80N59O75
60433C98956Q18N62n27k198l592m057l678k922k024j018n2O63J142J528J764J669
$$ plain form
60417 387034 388356 389355 390132 390618 390743 390681 390689 390797 390947 391321 392248 393762 395522 397234 398950 400854 402882
60400 402882 404586 405404 405187 404564 404567 405650 407300 408862 410494 412818 415871 419083 422254 425754 429490 432491
60384 432491 434104 435062 436665 439226 441987 444355 446469 448533 450323 451630 452752 454248 456396 458981
60370 458981 461420 463075 463736 463883 464211 464917 465721 466547 467775 469705 472161 474828 477686 480843 484212 487685
60354 487685 491539 496429 502899 510972 520147 529730 539245 548584 557763 566543 574315 580232 583340 582859
60340 582859 578736 571959 564025 555972 548064 540314 532929 526149 520017 514497 509646 505520 502066 499146
60326 499146 496561 494085 491631 489289 486891 483709 479126 473690 468985 466219 465321 465615 466897 469528 473831
60311 473831 479808 487299 496059 505832 516631 528831 542845 558783 576436 595250 614144 631684
$$ packed form
60417C87034J322R99P77M86J25o2QJ08J50L74R27J514J760J712J716J904K028
60400D02882J704Q18k17o23LJ083J650J562J632K324L053L212L171L500L736L001
60384D32491J613R58J603K561K761K368K114K064J790J307J122J496K148K585
60370D58981K439J655O61J47L28P06Q04Q26J228J930K456K667K858L157L369L473
60354D87685L854M890O470Q073R175R583R515R339R179Q780P772N917L108m81
60340E82859m123o777p934q053p908p750p385o780o132n520m851m126l454k920
60326D99146k585k476k454k342k398l182m583n436m705k766q98K94J282K631M303
60311D73831N977P491Q760R773J0799J2200J4014J5938J7653J8814J8894J7540
$$ plain form
60299 631684 646667 658301 665732 667974 664632 656341 644102 628570 610417 590961 571888 554492
60287 554492 539590 527806 519269 513158 508154 503451 499003 494957 491318 488062 485075 481976 478469 474801
60273 474801 471448 468338 464869 460752 456454 452722 449978 448157 446759 445085 442764 440042 437296 434477
60259 434477 431456 428672 426780 425740 424936 424184 423905 424196 424550 424807 425599 427350 429392 430689 431076 431240
60243 431240 431752 432685 433992 435705 437684 439572 441078 442157 442874 443193 442986 442260 441444 441315 442393 444466
60227 444466 446966 449638 452436 454909 456481 457468 459120 462258 466433 470836 475431 480608 486208 491676
60213 491676 496892 502174 507578 512949 518655 525541 533910 543068 552063 560496 568406 575855 582988 590221
60199 590221 597846 605475 612202 617498 621760 625801 629796 632973 634513 634627 634386 634457 634339 633035 630197
$$ packed form
60299F31684J4983J1634P431K242l342q291j2239j5532j8153j9456j9073j7396
60287E54492j4902j1784q537o111n004m703m448m046l639l256k987l099l507l668
60273D74801l353l110l469m117m298l732k744j821j398j674k321k722k746k819
60259D34477l021k784j892j040q04p52k79K91L54K57P92J751K042J297L87J64
60243D31240N12R33J307J713J979J888J506J079P17L19k07p26q16j29J078K073
60227D44466K500K672K798K473J572R87J652L138M175M403M595N177N600N468
60213D91676N216N282N404N371N706O886Q369R158Q995Q433P910P449P133P233
60199E90221P625P629O727N296M262M041L995L177J540J14k41P1j18j304k838
$$ plain form
60184 630197 626389 622333 618142 613218 606838 599042 590960 583925 578097 572389 566030 559741 554809 551389
60170 551389 548426 545132 541790 539049 537131 535941 535330 534835 533630 531236 528111 525225 523193 522012 521354
60155 521354 520757 519742 518154 516451 515428 515552 516647 518142 519521 520646 521802 523412 525582 527959 530077
60140 530077 531848 533684 536297 540400 546298 553529 561045 568080 574776 581747 589098 596200 602487 608059
60126 608059 613307 618206 622319 625357 627386 628556 629040 629360 630427 632890 636504 640388 643882 646971 649898
60111 649898 652643 654899 656400 657129 657280 657083 656577 655547 653768 651360 648737 646108 643250 639901 636190
60096 636190 632403 628447 623960 619023 614473 611300 609861 609809 610556 611582 612431 612816 612891 613199 614096 615294
60080 615294 616138 616289 615932 615328 614436 613098 611334 609170 606308 602297 597044 590888 584177 576989 569297
$$ packed form
60184F30197l808m056m191m924o380p796q082p035n828n708o359o289m932l420
60170E51389k963l294l342k741j918j190o11m95j205k394l125k886k032j181o58
60155E21354n97j015j588j703j023J24J095J495J379J125J156J610K170K377K118
60140E30077J771J836K613M103N898P231P516P035O696O971P351P102O287N572
60126F08059N248M899M113L038K029J170M84L20J067K463L614L884L494L089K927
60111F49898K745K256J501P29J51j97n06j030j779k408k623k629k858l349l711
60096F36190l787l956m487m937m550l173j439n2P47J026Q49L85P5L08Q97J198
60080F15294Q44J51l57o04q92j338j764k164k862m011n253o156o711p188p692
$$ plain form
60065 569297 561105 552439 543563 535265 528447 523132 518275 512985 507629 503243 500083 497335 494232 490899
60051 490899 488035 486240 485839 486871 488987 491625 494545 498011 502311 507349 512849 518638 524525 530222
60037 530222 535616 540859 545931 550414 553968 556730 558886 560191 560358 559611 558288 556110 552604 548188 543982
60022 543982 540315 536182 530614 523966 517258 510762 503946 496548 488940 481458 474023 466624 459671 453658
60008 453658 448799 445084 442389 440331 438331 436033 433537 431162 429193 427889 427407 427510 427654 427607 427771 428674
59992 428674 430333 432350 434428 436494 438523 440620 443202 446650 450670 454349 457090 459271 461754 464756
59978 464756 467451 468759 468418 467166 465823 464341 461925 458077 453311 448706 444914 441783 438924 436415
59964 436415 434875 434930 436643 439457 442633 445774 448949 452401 456194 460033 463281 465204 465469 464469 463042
$$ packed form
60065E69297q192q666q876q298o818n315m857n290n356m386l160k748l103l333
60051D90899k864j795m01J032K116K638K920L466M300N038N500N789N887N697
60037E30222N394N243N072M483L554K762K156J305J67p47j323k178l506m416m206
60022E43982l667m133n568o648o708o496o816p398p608p482p435p399o953o013
60008D53658m859l715k695k058k000k298k496k375j969j304m82J03J44m7J64R03
59992D28674J659K017K078K066K029K097K582L448M020L679K741K181K483L002
59978D64756K695J308l41j252j343j482k416l848m766m605l792l131k859k509
59964D36415j540N5J713K814L176L141L175L452L793L839L248J923K65j000j427
$$ plain form
59949 463042 461798 460844 460052 459298 458433 457425 456675 456784 457735 458686 458850 458236 457196 455660 453466 451126 449544
59932 449544 448956 448762 448519 448523 449247 450733 452808 455507 458960 463145 468020 473675 480098 486900 493480 499345
59916 499345 504222 507990 510583 511905 511958 511195 510584 510897 512059 513620 515679 518725 522546 526120 528890
59901 528890 531416 534320 537209 539301 540610 541769 542954 543818 544417 545451 547436 550188 553311 556734 560522
59886 560522 564516 568434 572187 575931 579926 584345 589079 593735 598057 602312 607008 612202 617334 621806
59872 621806 625415 628082 629453 629061 626842 623274 619047 614672 610487 606846 604103 602255 600703 598654
59858 598654 595928 593233 591422 590527 589812 588891 588543 590201 594609 601258 609212 618220 628582 639904 650480
59843 650480 658327 662620 663823 662715 659938 656474 653731 652630 652820 653095 652395 650185 646221 640363 632649
$$ packed form
59949D63042j244r54p92p54q65j008p50J09R51R51J64o14j040j536k194k340j582
59932D49544n88j94k43MP24J486K075K699L453M185M875N655O423O802O580N865
59916D99345M877L768K593J322N3p63o11L13J162J561K059L046L821L574K770
59901E28890K526K904K889K092J309J159J185Q64N99J034J985K752L123L423L788
59886E60522L994L918L753L744L995M419M734M656M322M255M696N194N132M472
59872F21806L609K667J371l92k219l568m227m375m185l641k743j848j552k049
59858E98654k726k695j811q95p15r21l48J658M408O649P954R008J0362J1322J0576
59843F50480P847M293J203j108k777l464k743j101J90K75p00k210l964n858p714
$$ plain form
59828 632649 623446 613604 604316 596427 589737 583441 577373 572284 568600 565593 562318 558814 555617 552512
59814 552512 548721 544214 539890 536299 533045 529733 526764 524722 523465 522352 521046 519669 518387 517279
59800 517279 516433 515810 515103 514075 513027 512587 512931 513408 513093 511635 509451 507211 505312 503859 502843 502105
59784 502105 501255 499988 498508 497297 496354 495095 493222 491301 490066 489433 488656 487370 486043 485430 485907 487264
59768 487264 488854 490027 490762 491783 493707 496198 498422 500210 502244 505076 508562 512462 517081 522889
59754 522889 529799 537160 544366 551373 558700 566973 576332 586228 595932 605165 614063 622644 630679 638038
59740 638038 644746 650682 655548 659251 661978 663902 665102 665780 666134 665954 664736 662344 659171 655606 651712
59725 651712 647614 643766 640543 637825 635194 632343 629211 625932 622729 619627 616358 612842 609648 607404
$$ packed form
59828F32649r203r842r288p889o690o296o068n089l684l007l275l504l197l105
59814E52512l791m507m324l591l254l312k969k042j257j113j306j377j282j108
59800E17279q46o23p07j028j048m40L44M77l15j458k184k240j899j453j016p38
59784E02105q50j267j480j211r43j259j873j921j235o33p77j286j327o13M77J357
59768D87264J590J173P35J021J924K491K224J788K034K832L486L900M619N808
59754E22889O910P361P206P007P327Q273R359R896R704R233Q898Q581Q035P359
59740F38038O708N936M866L703K727J924J200O78L54j80j218k392l173l565l894
59725F51712m098l848l223k718k631k851l132l279l203l102l269l516l194k244
$$ plain form
59711 607404 605764 603592 600355 596767 593831 591803 590406 589425 588714 588152 588062 589184 591702 594708 597203
59696 597203 599373 602294 606618 612005 617697 623093 627823 631677 634474 635866 635551 633931 632187 631231 630830
59681 630830 630125 628699 626687 624163 621058 617516 613748 609671 605158 600526 596211 592110 587857 583596
59667 583596 579779 576193 572000 566983 562111 558492 556247 554787 553804 553544 554226 555639 557375 559362 562088
59652 562088 566163 571525 577264 582440 586908 591029 594703 597199 597920 596893 594449 590827 586253 581040
59638 581040 575455 569713 564126 558960 554133 549462 545186 541796 539238 536796 534013 531228 528926 526974
59624 526974 524917 522675 520485 518320 515810 512656 508855 504524 499851 495175 490908 487330 484545 482526
59610 482526 481063 479805 478583 477608 477191 477322 477743 478385 479514 481367 483775 486219 488189 489464 490100 490267
$$ packed form
59711F07404j640k172l237l588k936k028j397r81p11n62r0J122K518L006K495
59696E97203K170K921M324N387N692N396M730L854K797J392l15j620j744r56m01
59681F30830p05j426k012k524l105l542l768m077m513m632m315m101m253m261
59667E83596l817l586m193n017m872l619k245j460r83k60O82J413J736J987K726
59652E62088M075N362N739N176M468M121L674K496P21j027k444l622m574n213
59638E81040n585n742n587n166m827m671m276l390k558k442k783k785k302j952
59624E26974k057k242k190k165k510l154l801m331m673m676m267l578k785k019
59610D82526j463j258j222r75m17J31M21O42J129J853K408K444J970J275O36J67
$$ plain form
59594 490267 490174 490161 490663 491906 493628 495264 496435 497134 497457 497334 496601 495256 493559 491914 490520 489088
59578 489088 487087 484441 481784 479717 478010 475977 473566 471498 470230 469391 468481 467614 467186 467204 467443 467971
59562 467971 468975 470163 470785 470297 468742 466589 464480 463074 462735 463273 464195 465189 466246 467443 468890 470772
59546 470772 473155 475809 478569 481762 485928 491230 497638 505767 516971 532270 551370 572776 594309
59533 594309 613193 626295 631381 628607 620529 610409 600441 591382 583407 576980 572917 571770 573199
59520 573199 575953 578655 580744 582608 584709 586661 587381 586187 583470 580001 575699 569571 561131 551533
59506 551533 542833 536113 530697 525295 519463 513678 508349 503340 498448 493859 489925 486801 484547 483352
59492 483352 483340 484246 485547 486901 488171 489134 489526 489585 490158 491897 494465 496937 498969 501237 504607 509118
$$ packed form
59594D90267r3j3N02J243J722J636J171O99L23j23p33j345j697j645j394j432
59578D89088k001k646k657k067j707k033k411k068j268q39r10q67m28J8K39N28
59562D67971J004J188O22m88j555k153k109j406l39N38R22R94J057J197J447J882
59546D70772K383K654K760L193M166N302O408Q129J1204J5299J9100K1406K1533
59533E94309J8884J3102N086k774q078j0120r968r059p975o427m063j147J429
59520E73199K754K702K089J864K101J952P20j194k717l469m302o128q440r598
59506E51533q700o720n416n402n832n785n329n009m892m589l934l124k254j195
59492D83352j2R06J301J354J270R63L92N9N73J739K568K472K032K268L370M511
$$ plain form
59476 509118 514029 518694 523226 528321 534507 541427 547771 552106 554004 554294 554124 553957 553652 553222 553032 553325
59460 553325 554016 555083 556791 559308 562478 566200 570756 576434 583023 590077 597584 605969 615367 625200
59446 625200 634572 642845 649652 654492 656603 655389 651007 644431 636829 628916 621005 613554 607195 602141
59432 602141 597945 594102 590532 587188 583686 579924 576789 575526 576462 579017 582917 588631 596470 606124
59418 606124 617423 630873 646932 665447 686379 710533 738785 770737 804419 836687 863368
59407 863368 880024 884261 877635 864457 848681 832647 818567 809551 808208 814771 827037 841412
59395 841412 853486 858743 854359 840773 820996 798337 775034 752582 732269 714938 700702 689258
59383 689258 680277 673335 667732 662740 658057 653921 650821 649042 648354 648066 647544 646788 646425 646965 648076 648720
$$ packed form
59476E09118M911M665M532N095O186O920O344M335J898K90j70j67l05m30j90K93
59460E53325O91J067J708K517L170L722M556N678O589P054P507Q385R398R833
59446F25200R372Q273O807M840K111j214m382o576p602p913p911p451o359n054
59432F02141m196l843l570l344l502l762l135j263R36K555L900N714P839R654
59418F06124J1299J3450J6059J8515K0932K4154K8252L1952L3682L2268K6681
59407H63368J6656M237o626j3178j5776j6034j4080r016j343O563J2266J4375
59395H41412J2074N257m384j3586j9777k2659k3303k2452k0313j7331j4236j1444
59383F89258q981o942n603m992m683m136l100j779o88k88n22p56l63N40J111O44
$$ plain form
59367 648720 648056 646124 643621 641217 639356 638564 639392 641773 644842 647806 650842 654755 659953 666238 673523
59352 673523 682144 692290 703604 715550 727843 740372 753126 766410 780770 796361 812656 828990
59340 828990 845113 860961 876159 889984 901592 910036 914468 914700 911432 905603 897681 887771 876086
59327 876086 862944 848497 832917 816726 800607 784946 769803 755156 740922 726956 713405
59316 713405 700855 689737 679748 670313 661439 653611 646924 640910 635325 630566 627057 624716 623360 623400
59302 623400 625726 630965 639152 650127 663894 680067 696779 710431 717228 715391 705975 691646 674987
59289 674987 657863 641580 626920 614107 603173 594288 587557 582757 579647 578294 578651 580105 582005
59276 582005 584523 588458 594233 601585 610209 620118 631356 643810 657392 671883 686589 700686 713950
$$ packed form
59367F48720o64j932k503k404j861p92Q28K381L069K964L036L913N198O285P285
59352F73523Q621J0146J1314J1946J2293J2529J2754J3284J4360J5591J6295J6334
59340H28990J6123J5848J5198J3825J1608Q444M432K32l268n829p922r910j1685
59327H76086j3142j4447j5580j6191j6119j5661j5143j4647j4234j3966j3551
59316G13405j2550j1118r989r435q874p828o687o014n585m759l509k341j356M0
59302F23400K326N239Q187J0975J3767J6173J6712J3652O797j837r416j4329j6659
59289F74987j7124j6283j4660j2813j0934q885o731m800l110j353L57J454J900
59276E82005K518L935N775P352Q624R909J1238J2454J3582J4491J4706J4097J3264
$$ plain form
59263 713950 726540 737915 746662 751847 754021 754436 753637 751279 747025 741117 734182 726970 720260 714609
59249 714609 710019 706011 702159 698518 695521 693586 692854 693336 695159 698469 703017 708055 712853 717198 721232
59234 721232 725023 728607 732293 736462 741037 745379 748640 749982 748718 744759 738831 731784 723708 714192
59220 714192 703351 691923 680368 668642 657099 646744 638099 630442 622778 615119 608212 602378 597357
59207 597357 593035 589597 586970 584756 582846 581552 580892 580178 578705 576724 575394 575681 577460 579831 582237
59192 582237 585001 588570 592580 596138 599011 601920 605465 609321 612923 616500 620793 625900 631011 635342
59178 635342 638914 642225 645507 648512 650821 652190 652716 652895 653448 654934 657330 660022 662259 663714 664607
59163 664607 665288 665845 666222 666554 667047 667494 667210 665607 662693 658918 654674 649993 644526 637746 629383 619871
$$ packed form
59263G13950J2590J1375Q747N185K174M15p99k358m254n908o935p212o710n651
59249G14609m590m008l852l641k997j935p32M82J823L310M548N038M798M345M034
59234G21232L791L584L686M169M575M342L261J342j264l959n928p047q076r516
59220G14192j0841j1428j1555j1726j1543j0355q645p657p664p659o907n834n021
59207E97357m322l438k627k214j910j294o60p14j473j981j330K87J779K371K406
59192E82237K764L569M010L558K873K909L545L856L602L577M293N107N111M331
59178F35342L572L311L282L005K309J369N26J79N53J486K396K692K237J455Q93
59163F64607O81N57L77L32M93M47k84j603k914l775m244m681n467o780q363r512
$$ plain form
59147 619871 610194 601168 592948 585325 578261 571910 566246 560919 555452 549473 542863 535903 529279 523765
59133 523765 519699 516752 514237 511698 509249 507356 506374 506355 507255 509085 511815 515341 519738 525230 531711
59118 531711 538549 545231 552045 559786 568864 579004 589590 599897 609226 617479 625503 634240 643384
59105 643384 651496 657564 661916 665427 668461 670926 672788 673984 674192 673162 671111 668494 665558 662362
59091 662362 658976 655430 651721 648134 645304 643729 643394 643925 644734 644867 643223 639407 634163 628658 623530
59076 623530 618742 613958 608734 602698 595986 589288 583201 577751 572780 568402 564691 561283 557754 554124
59062 554124 550621 547214 543850 540859 538601 536853 535051 533018 531040 529341 527919 526846 526185 525606 524533
59047 524533 522775 520795 519309 518824 519409 520586 521546 521863 521948 522481 523407 523889 523285 521863 520509 519994 520603
$$ packed form
59147F19871r677r026q220p623p064o351n664n327n467n979o610o960o624n514
59133E23765m066k947k515k539k449j893r82j9R00J830K730L526M397N492O481
59118E31711O838O682O814P741R078J0140J0586J0307R329Q253Q024Q737R144
59105F43384Q112O068M352L511L034K465J862J196K08j030k051k617k936l196
59091F62362l386l546l709l587k830j575l35N31Q09J33j644l816n244n505n128
59076F23530m788m784n224o036o712o698o087n450m971m378l711l408l529l630
59062E54124l503l407l364k991k258j748j802k033j978j699j422j073o61n79j073
59047E24533j758j980j486m85N85J177R60L17Q5N33R26M82o04j422j354n15O09
$$ plain form
59030 520603 522203 524523 527483 531293 536192 542139 548880 556276 564521 574086 585426 598491 612471
59017 612471 626223 639023 650674 660847 668800 673968 676418 676449 674169 669928 664819 660150 656411 653165
59003 653165 649891 646658 644059 642802 643330 645568 649028 653193 657666 661919 665320 667701 669537 671302
58989 671302 672944 674283 675529 676979 678524 679884 681081 682221 683085 683447 683647 684441 686483 690264 696205
58974 696205 704316 714010 724806 736945 750726 765536 780263 794562 808963 823650 837830 850539
58962 850539 861668 872022 882576 893562 903947 911897 916185 917068 915448 911493 904696 895066 883471
58949 883471 870665 856647 841201 824613 807595 790823 774711 759408 744897 731283 719008
58938 719008 708664 700708 695386 692536 691209 690012 688371 687114 687274 688657 690238 691532 692768 693990
$$ packed form
59030E20603J600K320K960L810M899N947O741P396Q245R565J1340J3065J3980
59017F12471J3752J2800J1651J0173P953N168K450L1k280m241n109m669l739l246
59003F53165l274l233k599j257N28K238L460M165M473M253L401K381J836J765
58989F71302J642J339J246J450J545J360J197J140Q64L62K00P94K042L781N941
58974F96205Q111R694J0796J2139J3781J4810J4727J4299J4401J4687J4180J2709
58962H50539J1129J0354J0554J0986J0385P950M288Q83j620l955o797r630j1595
58949H83471j2806j4018j5446j6588j7018j6772j6112j5303j4511j3614j2275
58938G19008j0344p956n322k850j327j197j641j257J60J383J581J294J236J222
$$ plain form
58924 693990 694935 695716 696675 697511 697364 695913 693612 690836 687580 684155 681269 679187 677561 676295 675712 675599
58908 675599 675043 673851 673442 675650 681031 688785 697823 707454 717546 728639 741597 756537 772175
58895 772175 786652 799004 809692 819951 830897 843055 856433 870958 886783 904061 922545
58884 922545 941641 960698 978863 994950 1008045 1018187 1025871 1030983 1032920 1031711 1028200 1022944 1015733
58871 1015733 1006475 995819 984550 973043 961672 951144 941996 934223 927708 922414 917840 912945 907126
58858 907126 900758 894333 887600 879961 871113 860833 848802 835398 822211 810921 801849 794132 787013
58845 787013 780281 773677 766687 759023 750806 742130 732851 722887 712461 701968 691800 682281 673611
58832 673611 665858 659029 653084 647846 643105 638886 635479 633225 632446 633415 636057 639693 643558 647567 652186
$$ packed form
58924F93990R45P81R59Q36j47j451k301k776l256l425k886k082j626j266n83j13
58908F75599n56j192m09K208N381P754R038R631J0092J1093J2958J4940J5638
58895G72175J4477J2352J0688J0259J0946J2158J3378J4525J5825J7278J8484
58884I22545J9096J9057J8165J6087J3095J0142P684N112J937j209l511n256p211
58871A015733r258j0656j1269j1507j1371j0528r148p773o515n294m574m895n819
58858I07126o368o425o733p639q848j0280j2031j3404j3187j1290r072p717p119
58845G87013o732o604o990p664q217q676r279r964j0426j0493j0168r519q670
58832F73611p753o829n945n238m741m219l407k254p79R69K642L636L865M009M619
$$ plain form
58817 652186 657604 663559 669889 676507 682739 687523 690637 693030 695495 697688 698901 699152 698838 697793 695493
58802 695493 691948 687789 683492 678911 673604 667333 660339 653186 646170 638897 630844 622284 614150 606857
58788 606857 599865 592632 585425 578989 574010 571110 570620 571963 573939 576062 578951 583047 587720 592168
58774 592168 596364 600405 603657 605382 605625 604689 602266 597967 592243 585899 579121 571865 564842 559079 554713
58759 554713 551048 547686 544759 542290 540239 539095 539496 541246 543493 545839 548475 551189 553144 553889 553956
58744 553956 554257 555434 557828 561438 565737 570135 574723 580040 586071 592165 598093 604462 611709 619255
58730 619255 626084 631797 636712 641227 645467 649352 652740 655597 658213 661093 664501 668250 672090 676202
58716 676202 681165 687450 695002 703270 711583 719467 726645 732938 738299 742801 746258 747928 746969 743186
$$ packed form
58817F52186N418N955O330O618O232M784L114K393K465K193J213K51l14j045k300
58802F95493l545m159m297m581n307o271o994p153p016p273q053q560q134p293
58788F06857o992p233p207o436m979k900m90J343J976K123K889M096M673M448
58774E92168M196M041L252J725K43r36k423m299n724o344o778p256p023n763m366
58759E54713l665l362k927k469k051j144M01J750K247K346K636K714J955P45O7
58744E53956L01J177K394L610M299M398M588N317O031O094N928O369P247P546
58730F19255O829N713M915M515M240L885L388K857K616K880L408L749L840M112
58716F76202M963O285P552Q268Q313P884P178O293N361M502L457J670r59l783
$$ plain form
58702 743186 736969 728528 717736 704781 690323 674767 657964 640067 622133 605371 590168 576233
58690 576233 563363 551696 541528 533208 526732 521215 515333 508762 502594 497853 494233 490858 487570
58677 487570 484592 481568 478037 474615 472631 472520 473381 474206 474859 475863 477885 481536 487105 494368 502900
58662 502900 512471 522751 532893 541861 549036 554138 556881 557193 555498 552214 547345 541123 534597 528826
58648 528826 523748 518590 513132 507874 503192 499077 495509 492365 489214 485999 483645 483109 484032 485277 486626
58633 486626 488812 491881 494719 496544 497870 499563 501696 503739 505248 505984 505898 505354 504955 504957 505218 505738 506702
58616 506702 507967 509124 510234 511951 514769 518621 523275 528576 534158 539525 544575 549576 554436 558522
58602 558522 561381 563225 564506 565368 565649 565076 563419 560766 557718 554939 552526 550177 547936 546405 546219
$$ packed form
58702G43186o217q441j0792j2955j4458j5556j6803j7897j7934j6762j5203j3935
58690E76233j2870j1667j0168q320o476n517n882o571o168m741l620l375l288
58677D87570k978l024l531l422j984j11Q61Q25O53J004K022L651N569P263Q532
58662E02900R571J0280J0142Q968P175N102K743L12j695l284m869o222o526n771
58648E28826n078n158n458n258m682m115l568l144l151l215k354n36R23J245J349
58633D86626K186L069K838J825J326J693K133K043J509P36q6n44l99KK61N20R64
58616E06702J265J157J110J717K818L852M654N301N582N367N050N001M860M086
58602E58522K859J844J281Q62K81n73j657k653l048k779k413k349k241j531j86
$$ plain form
58587 546219 547638 550646 555185 561282 569049 578369 588538 598660 608587 618849 629364 638986 646907
58574 646907 653641 659914 665451 669922 674376 680437 688556 698350 710219 725163 743145 763089 784597
58561 784597 808315 834489 862415 891455 921259 950606 977286 999620 1017165 1029719 1036798 1038629
58549 1038629 1036635 1032388 1026797 1020590 1014561 1008841 1002801 996144 989306 982276 973776 962172 946735
58536 946735 927721 905913 882512 858923 836203 814910 795388 777713 761574 746927 734555
58525 734555 725154 718023 711674 705591 700320 695982 692001 688297 685341 682831 679651 675493 671213 667360
58511 667360 663655 660207 657768 656299 654776 652910 651628 651202 650527 649009 647569 646748 645407 642651 639689
58496 639689 638266 638268 638382 638267 638624 639742 641414 643814 647143 650768 653943 657165 661754 668287 676304 685286
$$ packed form
58587E46219J419L008M539O097P767R320J0169J0122R927J0262J0515R622P921
58574F46907O734O273N537M471M454O061Q119R794J1869J4944J7982J9944K1508
58561G84597K3718K6174K7926K9040K9804K9347K6680K2334J7545J2554P079J831
58549A038629j994m247n591o207o029n720o040o657o838p030q500j1604j5437
58536I46735j9014k1808k3401k3589k2720k1293j9522j7675j6139j4647j2372
58525G34555r401p131o349o083n271m338l981l704k956k510l180m158m280l853
58511F67360l705l448k439j469j523j866j282m26o75j518j440q21j341k756k962
58496F39689j423KJ14j15L57J118J672K400L329L625L175L222M589O533Q017Q982
$$ plain form
58480 685286 695139 706003 718359 732956 749882 768099 786519 804981 823328 840040 852859 860540
58468 860540 863213 861354 855292 845659 833524 820089 806685 794784 785439 778878 774997 773955 775872
58455 775872 780449 787412 796926 809068 823223 838401 853683 867860 879146 885882 887426 884144 877031
58442 877031 867547 857141 846456 835428 824364 814234 805685 798573 792799 788700 786202 784543 783414
58429 783414 783474 785130 787791 791049 795695 802666 811723 821902 832449 842517 850784 856388 859715 861443
58415 861443 861395 859052 854538 848372 840866 832451 823914 815619 807201 798639 790778 784142 778169 772434 767564
58400 767564 764025 761030 757783 754866 753207 752524 752143 752573 754864 758872 763413 767709 771541 774477 776291
58385 776291 777915 780786 785288 790637 795965 800773 804820 808523 813059 819139 826022 832509 838415 844243
$$ packed form
58480F85286R853J0864J2356J4597J6926J8217J8420J8462J8347J6712J2819P681
58468H60540K673j859o062r633j2135j3435j3404j1901r345o561l881j042J917
58455G75872M577O963R514J2142J4155J5178J5282J4177J1286O736J544l282p113
58442H77031r484j0406j0685j1028j1064j0130q549p112n774m099k498j659j129
58429G83414O0J656K661L258M646O971R057J0179J0547J0068Q267N604L327J728
58415H61443m8k343m514o166p506q415q537q295q418q562p861o636n973n735m870
58400G67564l539k995l247k917j659o83l81M30K291M008M541M296L832K936J814
58385G76291J624K871M502N349N328M808M047L703M536O080O883O487N906N828
$$ plain form
58371 844243 850071 855767 861806 868830 876685 884736 892761 900876 909130 917922 928168 940275 953545
58358 953545 967244 981514 996403 1010877 1023719 1034650 1043718 1050551 1055162 1058564 1061482 1063441 1064235
58345 1064235 1065284 1068162 1072602 1077277 1081812 1086766 1092472 1099235 1107907 1118840 1130951 1143180 1156264
58332 1156264 1171750 1189924 1209889 1230855 1252022 1271962 1289619 1305246 1319138 1330346 1338083
58321 1338083 1343497 1348402 1353036 1356630 1359396 1362261 1365343 1368404 1372190 1377653 1384405 1391500 1399209 1408468
58307 1408468 1419242 1430977 1443947 1458566 1474118 1489790 1506201 1524190 1542956 1561226 1579512
58296 1579512 1599219 1620143 1640772 1660561 1680145 1699834 1719645 1740272 1762267 1784839 1807067
58285 1807067 1829624 1853746 1879345 1905674 1932810 1960779 1988434 2015119 2042198 2070927 2100172
$$ packed form
58371H44243N828N696O039P024P855Q051Q025Q115Q254Q792J0246J2107J3270
58358I53545J3699J4270J4889J4474J2842J0931R068O833M611L402K918J959P94
58345A064235J049K878M440M675M535M954N706O763Q672J0933J2111J2229J3084
58332A156264J5486J8174J9965K0966K1167J9940J7657J5627J3892J1208P737
58321A338083N414M905M634L594K766K865L082L061L786N463O752P095P709R259
58307A408468J0774J1735J2970J4619J5552J5672J6411J7989J8766J8270J8286
58296A579512J9707K0924K0629J9789J9584J9689J9811K0627K1995K2572K2228
58285A807067K2557K4122K5599K6329K7136K7969K7655K6685K7079K8729K9245
$$ plain form
58274 2100172 2128494 2157140 2188573 2223311 2260873 2302540 2350251 2403605 2460663 2520882 2584691
58263 2584691 2651203 2719111 2788926 2861668 2936342 3011384 3087349 3165333 3244076 3321693 3398968
58252 3398968 3477775 3557716 3637772 3719771 3806418 3897199 3990202 4086734 4190038 4300506 4416347
58241 4416347 4537904 4667031 4803337 4945617 5096055 5258244 5431826 5613826 5804552
58232 5804552 6007348 6223383 6451771 6694189 6954161 7232277 7527169 7840528 8176055
58223 8176055 8534556 8915717 9323800 9765759 10244781 10761717 11321537 11931853 12596571
58214 12596571 13318187 14105100 14969467 15919714 16963499 18116491 19399638 20830021 22424572
58205 22424572 24211367 26227139 28506581 31087624 34028103 37408205 41323684 45897311
$$ packed form
58274B100172K8322K8646L1433L4738L7562M1667M7711N3354N7058O0219O3809
58263B584691O6512O7908O9815P2742P4674P5042P5965P7984P8743P7617P7275
58252C398968P8807P9941Q0056Q1999Q6647R0781R3003R6532J03304J10468J15841
58241D416347J21557J29127J36306J42280J50438J62189J73582J82000J90726
58232E804552K02796K16035K28388K42418K59972K78116K94892L13359L35527
58223H176055L58501L81161M08083M41959M79022N16936N59820O10316O64718
58214A2596571P21616P86913Q64367R50247J043785J152992J283147J430383J594551
58205B2424572J786795K015772K279442K581043K940479L380102L915479M573627
$$ plain form
58197 45897311 51302022 57765146 65562839 75041181 86654839 100984969 118750454 140834670
58189 140834670 168220265 201646036 240990100 284684873 329528707 371046975 404349883
58182 404349883 425316720 431740199 423876218 404054216 375629710 341987457 306052610
58175 306052610 270192246 236180167 205140750 177591877 153612816 133020856 115484091
58168 115484091 100602197 87979347 77262116 68138443 60336061 53633600 47858507
58161 47858507 42867136 38534725 34761465 31470502 28592991 26062829 23825813 21841981
58153 21841981 20075746 18492449 17066004 15780525 14621683 13573487 12624364 11768124
58145 11768124 10996709 10298552 9665253 9093213 8577258 8108715 7680776 7289774 6930071
$$ packed form
58197D5897311N404711O463124P797693R478342J1613658J4330130J7765485K2084216
58189A40834670K7385595L3425771L9344064M3694773M4843834M1518268L3302908
58182D04349883K0966837O423479p863981j9822002k8424506l3642253l5934847
58175C06052610l5860364l4012079l1039417k7548873k3979061k0591960j7536765
58168A15484091j4881894j2622850j0717231r123673p802382o702461n775093
58161D7858507m991371m332411l773260l290963k877511k530162k237016j983832
58153B1841981j766235j583297j426445j285479j158842j048196r49123q56240
58145A1768124p71415o98157o33299n72040n15955m68543m27939l91002l59703
$$ plain form
58136 6930071 6593509 6275183 5974738 5691312 5422365 5167890 4930319 4709356 4501777
58127 4501777 4306714 4125985 3958636 3800469 3649912 3509263 3379069 3256131 3138386
58118 3138386 3027162 2923279 2825206 2732350 2646012 2565735 2488604 2413461 2342149 2275468 2211620
58107 2211620 2149800 2091627 2037681 1986066 1935719 1887951 1843514 1801237 1760619 1722623 1686797
58096 1686797 1650661 1613095 1575439 1538263 1500068 1460289 1420738 1382850 1346234 1310964 1278573
58085 1278573 1249592 1222652 1197029 1173578 1152177 1130841 1108497 1086235 1064865 1043628 1022269
58074 1022269 1001923 982864 963688 943777 924356 906179 888413 870725 854228 839363 825073
58063 825073 810961 798156 787111 776729 766494 757206 748774 739593 729172 719056 710048 700710
$$ packed form
58136F930071l36562l18326l00445k83426k68947k54475k37571k20963k07579
58127D501777j95063j80729j67349j58167j50557j40649j30194j22938j17745
58118C138386j11224j03883r8073r2856q6338q0277p7131p5143p1312o6681o3848
58107B211620o1820n8173n3946n1615n0347m7768m4437m2277m0618l7996l5826
58096A686797l6136l7566l7656l7176l8195l9779l9551l7888l6616l5270l2391
58085A278573k8981k6940k5623k3451k1401k1336k2344k2262k1370k1237k1359
58074A022269k0346j9059j9176j9911j9421j8177j7766j7688j6497j4865j4290
58063H25073j4112j2805j1045j0382j0235r288q432r181j0421j0116r008r338
$$ plain form
58051 700710 689859 678468 667847 657884 648291 639724 632499 625893 619625 614223 609162 602726 594690
58038 594690 587082 581218 576029 570366 564803 559871 554642 548498 542337 536588 529895 521320 512020 503209
58024 503209 494241 484367 474720 466684 459676 452332 444723 437826 431829 426492 422119 418733 415309 411187
58010 411187 407308 404732 402874 400440 397256 394004 391013 388374 386400 384975 383331 381279 379693 379024
57996 379024 378556 377923 378020 379462 381518 383545 385999 388876 390686 390407 389080 388052 386957 384961 382612
57981 382612 380698 378431 374673 370104 366317 363393 360197 356570 353429 351023 348717 346347 344357 342689
57967 342689 340817 338823 337355 336645 336495 336940 338031 339256 340048 340538 341031 341295 341104 340813 340436 338934 335606
57950 335606 331570 328561 326693 324758 322356 320340 319222 318499 317719 317196 317435 318676 321137 325019 330136
$$ packed form
58051G00710j0851j1391j0621r963r593q567p225o606o268n402n061o436q036
58038E94690p608n864n189n663n563m932n229o144o161n749o693q575r300q811
58024E03209q968r874r647q036p008p344p609o897n997n337m373l386l424m122
58010D11187l879k576j858k434l184l252k991k639j974j425j644k052j586o69
57996C79024m68o33R7J442K056K027K454K877J810k79j327j028j095j996k349
57981C82612j914k267l758m569l787k924l196l627l141k406k306k370j990j668
57967C42689j872j994j468p10j50M45J091J225P92M90M93K64j91k91l77j502l328
57950C35606m036l009j868j935k402k016j118p23p80n23K39J241K461L882N117
$$ plain form
57935 330136 336037 342480 349434 356793 364490 372583 380719 387827 392784 395095 394652 391441 386013 379623
57921 379623 373189 366552 359303 351778 344559 337581 330518 323644 317598 312660 308837 306257 304907 304427
57907 304427 304717 306198 308885 311834 314155 315961 317611 318674 318498 317295 315843 314626 313990 314502 316266
57892 316266 318408 320143 321898 324472 327624 330440 332657 334601 336194 337016 337067 336501 334914 331939 328311
57877 328311 325272 322951 320285 316542 312034 307274 302308 297151 292291 288452 286053 284796 283611 281400
57863 281400 278287 275729 274944 275655 276825 278073 279730 282075 285354 290108 296561 303910 310952 317226 322917
57848 322917 328024 332333 335880 338747 340722 341799 342571 343383 343587 342511 340701 339186 337859 335666 332264
57833 332264 328432 324927 321900 319414 317517 315655 312890 309018 304908 301609 299587 298764 298697 298684 298202 297239
$$ packed form
57935C30136N901O443O954P359P697Q093Q136P108M957K311m43l211n428o390
57921C79623o434o637p249p525p219o978p063o874o046m938l823k580j350m80
57907C04427K90J481K687K949K321J806J650J063j76j203j452j217o36N12J764
57892C16266K142J735J755K574L152K816K217J944J593Q22N1n66j587k975l628
57877C28311l039k321k666l743m508m760m966n157m860l839k399j257j185k211
57863B81400l113k558p85P11J170J248J657K345L279M754O453P349P042O274N691
57848C22917N107M309L547K867J975J077P72Q12K04j076j810j515j327k193l402
57833C32264l832l505l027k486j897j862k765l872m110l299k022q23o7j3m82r63
$$ plain form
57817 297239 295900 294063 291927 290491 290614 291744 292236 290803 287129 281398 274073 265968 257787 249642 241621
57802 241621 234523 229241 225636 222825 220497 219094 218819 219265 220017 220853 221372 221225 220755 220736 221414 222374 223317
57785 223317 224399 225887 228093 231461 236044 241100 245856 250521 255812 261729 267642 273335 278939 283892
57771 283892 287117 288485 289140 290120 291456 292887 294541 296427 297848 297877 296151 293002 289140 285308 281882
57756 281882 278677 275400 272213 269475 267150 264962 262938 261303 259990 258868 258204 258250 258544 258311 257483 256649
57740 256649 256127 255755 255425 255060 254275 252886 251657 251655 252923 254579 256133 257815 259707 261591 263670 266393
57724 266393 269422 271805 273362 274874 276710 278340 279522 280814 282405 283494 283429 282593 281496 279824 277178
57709 277178 274069 271355 269137 266887 264287 261373 258147 254627 250987 247300 243402 239369 235723 232789
$$ packed form
57817B97239j339j837k136j436J23J130M92j433l674n731p325q105q181q145q021
57802B41621p098n282l605k811k328j403k75M46P52Q36N19j47m70j9O78R60R43
57785B23317J082J488K206L368M583N056M756M665N291N917N913N693N604M953
57771B83892L225J368O55R80J336J431J654J886J421K9j726l149l862l832l426
57756B81882l205l277l187k738k325k188k024j635j313j122o64M6K94k33q28q34
57740B56649n22l72l30l65p85j389j229kJ268J656J554J682J892J884K079K723
57724B66393L029K383J557J512J836J630J182J292J591J089o5q36j097j672k646
57709B77178l109k714k218k250k600k914l226l520l640l687l898m033l646k934
$$ plain form
57695 232789 230216 227479 224547 221721 219151 216802 214541 212055 209105 206142 204209 203897 204783 206191 207998
57680 207998 210332 212990 215756 218992 223485 229918 238953 251590 268981 292021 321535 358832 405651
57667 405651 463178 530623 603984 675797 736477 777038 791852 780238 746395 697707 641904
57656 641904 584647 529138 477403 431281 392050 359701 333094 310822 291932 276033 262857
57645 262857 251715 241590 232017 223578 217097 212591 209483 207551 206849 206811 206369 205146 203815 203008 202634
57630 202634 202461 202576 202787 202326 200797 198923 197716 197189 196421 194669 191990 188927 186006 183479 181289 179278
57614 179278 177419 175696 173896 171842 169804 168189 166873 165475 164275 164100 165044 166092 166486 166766 167773
57599 167773 169156 169618 168454 166183 163757 161713 160120 158822 157511 155799 153444 150613 147855 145700
$$ packed form
57695B32789k573k737k932k826k570k349k261k486k950k963j933l12Q86J408J807
57680B07998K334K658K766L236M493O433R035J2637J7391K3040K9514L7297M6819
57667D05651N7527O7445P3361P1813O0680M0561J4814j1614l3843m8688n5803
57656F41904n7257n5509n1735m6122l9231l2349k6607k2272j8890j5899j3176
57645B62857j1142j0125r573q439o481m506l108j932p02l8m42j223j331q07l74
57630B02634j73J15K11m61j529j874j207n27p68j752k679l063k921k527k190k011
57614A79278j859j723j800k054k038j615j316j398j200j75R44J048L94K80J007
57599A67773J383M62j164k271k426k044j593j298j311j712k355k831k758k155
$$ plain form
57585 145700 144130 142603 140768 138981 137760 136915 135724 133903 131898 130247 129173 128763 128890 128904 128074 126520
57569 126520 125062 124017 122822 121039 118977 116963 114802 112442 110477 109363 108692 107805 106669 105568 104455
57554 104455 103279 102548 102826 103881 105020 106107 107636 109870 112442 114815 116677 117878 118423 118560 118664
57539 118664 118981 119570 120360 121042 121196 120771 120251 120086 120112 119784 118835 117487 116175 115300 115049 115229 115422 115458 115567
57520 115567 115926 116376 116814 117539 118834 120398 121586 122196 122716 123740 125271 126691 127427 127584 127739 128091 128166
57503 128166 127642 126995 126810 126765 126073 124774 123697 123134 122481 121406 120392 119691 118597 116403 113446 110587
57487 110587 108168 106090 104487 103682 103767 104663 106225 107932 108866 108576 107588 106698 106116 105696 105436 105201 104384
57470 104384 102537 100050 97657 95532 93394 91184 89083 87156 85532 84630 84605 84790 84348 83267 82150
$$ packed form
57585A45700j570j527j835j787j221q45j191j821k005j651j074m10J27J4q30j554
57569A26520j458j045j195j783k062k014k161k360j965j114o71q87j136j101j113
57554A04455j176p31K78J055J139J087J529K234K572K373J862J201N45J37J04
57539A18664L17N89P90O82J54m25n20j65K6l28r49j348j312q75k51J80J93L6J09
57520A15567L59M50M38P25J295J564J188O10N20J024J531J420P36J57J55L52P5
57503A28166n24o47j85m5o92j299j077n63o53j075j014p01j094k194k957k859
57487A10587k419k078j603q05Q5Q96J562J707R34k90r88q90n82m20k60k35q17
57470A04384j847k487k393k125k138k210k101j927j624r02k5J85m42j081j117
$$ plain form
57455 82150 81255 80382 79600 79357 79824 80646 81414 81959 82229 82293 82427 82801 83146 83066 82583 82048 81656 81463 81701 82538
57435 82538 83635 84386 84625 84694 84789 84646 83983 82973 82152 81949 82334 82876 83260 83634 84201 84580 84118 82912 81849
57416 81849 81384 80977 80177 79536 79778 80678 81522 82199 83004 83763 84038 83971 84012 84019 83509 82705 82344 82375 81858 80433
57396 80433 78994 78523 78910 79385 79523 79423 79327 79611 80762 82898 85395 87404 88700 89816 91407 93598
57380 93598 95916 97728 98716 98975 98741 98175 97488 97002 96873 96782 96120 94450 91849 88959 86760 85916 86190
57363 86190 86698 86864 86772 86534 85900 84830 83859 83402 83126 82557 81927 81808 82251 82904 83669 84507 84893 84345 83428
57344 83428 83324 84284 85251 85244 84402 83430 82661 82057 81635 81422 81277 81116 81088 81273 81403 81170 80667 80291 80191 79978
57324 79978 79018 76995 74169 71144 68466 66537 65671 65837 66346 66216 65066 63374 61832 60880 60939 62344
$$ packed form
57455H2150q95q73p82k43M67Q22P68N45K70O4J34L74L45q0m83n35l92j93K38Q37
57435H2538J097P51K39O9R5j43o63j010q21k03L85N42L84L74N67L79m62j206j063
57416H1849m65m07q00o41K42R00Q44O77Q05P59K75o7M1Pn10q04l61L1n17j425
57396H0433j439m71L87M75J38j00r6K84J151K136K497K009J296J116J591K191
57380I3598K318J812R88K59k34n66o87m86j29r1o62j670k601k890k199q44K74
57363H6190N08J66r2k38o34j070r71m57k76n69o30j19M43O53P65Q38L86n48r17
57344H3428j04R60R67pq42r72p69o04m22k13j45j61k8J85J30k33n03l76j00k13
57324G9978r60k023k826l025k678j929q66J66N09j30j150j692j542r52N9J405
$$ plain form
57308 62344 64588 66229 66252 65181 64296 64102 64178 64196 64263 64327 64010 63181 62210 61543 61374 61715 62440 63274 64050 64847
57288 64847 65634 66050 65932 65778 66164 66852 67014 66273 65122 64423 64884 66829 69990 73550 76766 79459 81720
57271 81720 83572 85295 87633 91003 94793 98028 100504 102664 104691 106475 108217 110350 112850 115263
57257 115263 117314 118959 120037 120499 120817 121556 122697 123939 125365 127123 128788 129875 130738 132164 134216
57242 134216 136303 138177 139971 141476 142371 143073 144361 146207 147936 149511 151636 154543 157666 160671 163797
57227 163797 167116 170462 174190 178892 184207 189034 193215 197870 203690 210013 216023 221758 227382 232582
57213 232582 237372 242532 248492 254561 259951 264833 269740 274716 279771 285467 292279 299910 307911 316419
57199 316419 325629 335159 344730 355038 367200 381565 397633 414819 432818 451551 471196 491959
$$ packed form
57308F2344K244J641K3j071q85j94P6J8O7O4l17q29r71o67j69L41P25Q34P76P97
57288F4847P87M16j18j54L86O88J62p41j151o99M61J945L161L560L216K693K261
57271H1720J852J723K338L370L790L235K476K160K027J784J742K133K500K413
57257A15263K051J645J078M62L18P39J141J242J426J758J665J087Q63J426K052
57242A34216K087J874J794J505Q95P02J288J846J729J575K125K907L123L005L126
57227A63797L319L346L728M702N315M827M181M655N820O323O010N735N624N200
57213B32582M790N160N960O069N390M882M907M976N055N696O812P631Q001Q508
57199C16419R210R530R571J0308J2162J4365J6068J7186J7999J8733J9645K0763
$$ plain form
57187 491959 513468 534843 555671 576310 596866 616575 634780 651904 668751 685378 701465
57176 701465 717431 734425 753249 773802 795377 817179 838820 860722 883808 908506 934431
57165 934431 961181 988838 1017331 1045991 1074344 1102853 1132353 1163232 1195735 1230529 1268221
57154 1268221 1308555 1350611 1393464 1436218 1477863 1517729 1555743 1591747 1624969 1654726 1681207
57143 1681207 1704985 1726201 1744978 1762336 1779933 1799056 1820495 1845188 1874312 1908724 1948765
57132 1948765 1994356 2044639 2097500 2149949 2199058 2242468 2278527 2306639 2327493 2342560 2353509
57121 2353509 2362404 2372025 2385172 2403452 2426897 2454504 2484721 2515632 2545502 2573707 2601328 2631001
57109 2631001 2666154 2709913 2764182 2829569 2906207 2994650 3096415 3214324 3352690 3517043
$$ packed form
57187D91959K1509K1375K0828K0639K0556J9709J8205J7124J6847J6627J6087
57176G01465J5966J6994J8824K0553K1575K1802K1641K1902K3086K4698K5925
57165I34431K6750K7657K8493K8660K8353K8509K9500L0879L2503L4794L7692
57154A268221M0334M2056M2853M2754M1645L9866L8014L6004L3222K9757K6481
57143A681207K3778K1216J8777J7358J7597J9123K1439K4693K9124L4412M0041
57132A948765M5591N0283N2861N2449M9109M3410L6059K8112K0854J5067J0949
57121B353509Q895R621J3147J8280K3445K7607L0217L0911K9870K8205K7621K9673
57109B631001L5153M3759N4269O5387P6638Q8443J01765J17909J38366J64353
$$ plain form
57099 3517043 3713741 3950206 4235555 4580978 5000123 5509920 6130685 6884159 7790425
57090 7790425 8865681 10120556 11557487 13167713 14929299 16805290 18741798 20670413
57082 20670413 22517949 24216600 25704605 26920864 27808443 28330937 28485703 28299290 27812007
57073 27812007 27068354 26116120 25003974 23774577 22461606 21094471 19703371 18318457
57065 18318457 16966334 15668757 14442359 13297161 12235842 11255807 10351866 9517295
57057 9517295 8744739 8028283 7364600 6751637 6186973 5667951 5192086 4756163 4355614
57048 4355614 3985865 3644003 3328551 3038368 2772635 2531366 2314918 2122879 1953785
57039 1953785 1805506 1675505 1561164 1460539 1372746 1297397 1233875 1181333 1139157 1107411
$$ packed form
57099C517043J96698K36465K85349L45423M19145N09797O20765P53474R06266
57090G790425J075256J254875J436931J610226J761586J875991J936508J928615
57082B0670413J847536J698651J488005J216259Q87579N22494J54766j86413m87283
57073B7812007p43653r52234j112146j229397j312971j367135j391100j384914
57065A8318457j352123j297577j226398j145198j061319r80035r03941q34571
57057I517295p72556p16456o63683o12963n64664n19022m75865m35923m00549
57048D355614l69749l41862l15452k90183k65733k41269k16448j92039j69094
57039A953785j48279j30001j14341j00625q7793p5349o3522n2542m2176l1746
$$ plain form
57029 1107411 1087295 1081213 1091708 1119655 1162957 1215875 1268540 1308000 1322533 1307203 1265656
57018 1265656 1206508 1138377 1067671 998708 933848 873728 818484 768857 725672 688749 657039
57007 657039 629567 605570 584004 563759 544442 526361 509723 494308 479919 466601 454228
56996 454228 442231 430015 417496 405098 393292 382365 372672 364881 359589 356679 355548 356212 359745
56983 359745 367007 377135 387693 396172 400923 401152 396912 389173 379212 367854 355720 343926 333644
56970 333644 325015 317414 310858 306203 303696 302343 301244 300823 302299 306646 314557 326718 343328 363579
56956 363579 385897 408315 428363 443326 451217 451415 444292 430924 413411 394649 376934 361006
56944 361006 346749 334331 324143 316215 310357 306691 305543 307043 311241 318391 328783 342577 360060
$$ packed form
57029A107411k0116o082J0495K7947M3302N2918N2665L9460J4533j5330m1547
57018A265656n9148o8131p0706o8963o4860o0120n5244m9627m3185l6923l1710
57007F57039k7472k3997k1566k0245j9317j8081j6638j5415j4389j3318j2373
56996D54228j1997j2216j2519j2398j1806j0927r693p791n292k910j131O64L533
56983C59745P262J0128J0558Q479M751K29m240p739r961j1358j2134j1794j0282
56970C33644q629p601o556m655k507j353j099m21J476M347P911J2161J6610K0251
56956C63579K2318K2418K0048J4963P891J98p123j3368j7513j8762j7715j5928
56944C61006j4257j2418j0188p928n858l666j148J500M198P150J0392J3794J7483
$$ plain form
56931 360060 381591 406723 433416 458421 478301 490242 492687 485922 471857 452841 430704 406855
56919 406855 382693 359462 337983 318810 302317 288446 276777 267025 258967 251764 244162 235878
56907 235878 228142 222292 218398 215704 213783 212532 211633 210924 211002 212645 215733 219402 223094 226960 231480
56892 231480 237245 244885 254616 266156 279671 296400 317394 341732 366714 389733 409174 423669
56880 423669 431730 432752 427789 418805 407442 394757 381715 369410 358842 350715 345366 342818 343021
56867 343021 346194 352919 363963 380175 402506 431951 469253 514424 566154 621359 675309 722469
56855 722469 757627 776977 779172 765915 741280 709912 675571 640969 608236 579000 554316 534958
56843 534958 521694 515026 514993 521668 535812 558797 592083 637031 694828 765817 848455 938609
$$ packed form
56931C60060K1531K5132K6693K5005J9880J1941K445o765j4065j9016k2137k3849
56919D06855k4162k3231k1479j9173j6493j3871j1669r752q058p203p602q284
56907B35878p736n850l894k694j921j251q99p09P8J643L088L669L692L866M520
56892B31480N765P640R731J1540J3515J6729K0994K4338K4982K3019J9441J4495
56880D23669Q061J022m963q984j1363j2685j3042j2305j0568q127n349k548K03
56867C43021L173O725J1044J6212K2331K9445L7302M5171N1730N5205N3950M7160
56855G22469L5158J9350K195j3257k4635l1368l4341l4602l2733k9236k4684j9358
56843E34958j3264o668l3O675J4144K2985L3286M4948N7797P0989Q2638R0154
$$ plain form
56831 938609 1029385 1111461 1174542 1210220 1214882 1190601 1143532 1081288 1011004 938587 868705 804772
56819 804772 748706 700959 661277 629610 606139 590754 583261 584286 595355 617704 651518 696512
56807 696512 752232 816625 884271 946772 995246 1022879 1026359 1006339 967001 914485 854998 793749
56795 793749 734698 680378 631805 589024 551948 520694 495422 476268 463331 456500 455465 460272
56783 460272 471665 490496 516663 548564 583098 615815 641609 656226 657615 645962 622881 590970
56771 590970 553686 514661 476558 440600 407101 376274 348564 324509 304273 287335 272813
56760 272813 260132 249135 239548 230911 223260 217247 213055 209683 205898 201546 197308 193486 189774 186097
56746 186097 182927 180674 179211 178133 177127 176092 175154 174502 174036 173361 172376 171561 171315 171361 171170 170623 169783
$$ packed form
56831I38609R0776Q2076O3081L5678M662k4281m7069o2244p0284p2417o9882o3933
56819H04772n6066m7747l9682l1667k3471j5385p493J025J1069K2349L3814M4994
56807F96512N5720O4393O7646O2501M8474K7633L480k0020l9338n2516n9487o1249
56795G93749n9051n4320m8573m2781l7076l1254k5272j9154j2937o831j035M807
56783D60272J1393J8831K6167L1901L4534L2717K5794J4617J389j1653k3081l1911
56771E90970l7284l9025l8103l5958l3499l0827k7710k4055k0236j6938j4522
56760B72813j2681j0997r587q637p651o013m192l372l785m352m238l822l712l677
56746A86097l170k253j463j078j006j035r38o52m66o75r85q15k46M6j91n47q40
$$ plain form
56729 169783 168492 166767 165287 164745 164955 165287 165762 166947 168834 170631 171714 172190 172424 172622 172910 173308
56713 173308 173571 173553 173644 174309 175277 175886 176181 176936 178462 180066 180894 180779 180127 179543 179723 181108 183331 185408
56695 185408 186678 187224 187422 187576 188042 189089 190418 191315 191457 191188 190943 190886 191181 192001 193103 193933 194360 194771
56677 194771 195288 195513 195352 195425 196217 197328 197978 197907 197379 196732 196303 196458 197148 197711 197528 196765 196151 196217 197017
56658 197017 198289 199480 199902 199399 198820 199335 201211 203561 205379 206451 207098 207389 207030 205978 204766 204025
56642 204025 203929 204304 205083 206249 207382 207775 207135 205791 204049 201789 199039 196518 195132 195131 196107 197583 199172
56625 199172 200440 201142 201509 201880 202147 201884 200870 199182 196967 194541 192418 190864 189577 188241 187062
56610 187062 186340 185915 185575 185550 185868 185732 184509 183036 182813 183959 185092 185326 185268 185732 186480 186784 186474 185900
$$ packed form
56729A69783j291j725j480n42K10L32M75J185J887J797J083M76K34J98K88L98
56713A73308K63j8R1O65R68O09K95P55J526J604Q28j15o52n84J80J385K223K077
56695A85408J270N46J98J54M66J047J329Q97J42k69k45n7K95Q20J102Q30M27M11
56677A94771N17K25j61P3P92J111O50p1n28o47m29J55O90N63j83p63o14O6Q00
56658A97017J272J191M22n03n79N15J876K350J818J072O47K91l59j052j212p41
56642B04025r6L75P79J166J133L93o40j344j742k260k750k521j386jR76J476J589
56625A99172J268P02L67L71K67k63j014j688k215k426k123j554j287j336j179
56610A87062p22m25l40k5L18j36j223j473k23J146J133K34n8M64P48L04l10n74
$$ plain form
56592 185900 185431 185397 186039 187213 188566 190100 192011 193949 195208 195814 196571 197804 198957 199769 200865 202636
56576 202636 204439 205618 206553 207873 209292 210132 210526 211258 212683 214595 216897 219669 222781 226168 230423
56561 230423 236467 244567 254210 264801 275914 286796 296199 303028 306980 308537 308510 307588 306069 303890
56547 303890 300989 297628 294323 291532 289384 287579 285560 283022 280273 277901 276059 274298 272064 269146
56533 269146 265758 262492 260053 258527 257062 254796 252072 250076 249287 249017 248610 248315 248622 249420 250191 250490
56517 250490 249947 248361 246139 244079 242423 240703 238791 237374 236931 236942 236648 235924 234868 233222 230923 228677
56501 228677 227187 226196 225025 223694 222744 222273 221916 221629 221724 222252 222978 223919 225240 226619 227300 226933 226038
56484 226038 225547 225999 227077 227755 227199 225722 224557 224457 224958 225267 225332 225558 225984 226406 227000 228108 229599
$$ packed form
56592A85900m69l4O42J174J353J534J911J938J259O06P57J233J153Q12J096J771
56576B02636J803J179R35J320J419Q40L94P32J425J912K302K772L112L387M255
56561B30423O044Q100R643J0591J1113J0882R403O829L952J557k7r22j519k179
56547C03890k901l361l305k791k148j805k019k538k749k372j842j761k234k918
56533B69146l388l266k439j526j465k266k724j996p89k70m07k95L07P98P71K99
56517B50490n43j586k222k060j656j720j912j417m43J1k94p24j056j646k299k246
56501B28677j490r91j171j331r50m71l57k87R5N28P26R41J321J379O81l67q95
56484B26038m91M52J078O78n56j477j165j00N01L09O5K26M26M22N94J108J491
$$ plain form
56467 229599 230998 232117 233069 233813 234205 234331 234363 234257 233991 233845 234053 234436 234812 235381 236194 236667 236272 235422
56449 235422 234990 235180 235590 236143 237156 238585 239940 240985 241823 242280 241937 240877 239746 238855 237803 236236
56433 236236 234557 233637 234088 235891 238403 240656 241956 242301 242092 241587 240880 240208 239773 239410 238884 238450 238627
56416 238627 239469 240566 241728 243117 244639 245769 246217 246381 246870 247841 248945 249728 249959 249750 249490 249580 250160
56399 250160 251110 252219 253293 254230 255134 256164 257220 257963 258303 258557 259005 259601 260315 261354 262779 264255
56383 264255 265526 266794 268325 270032 271740 273438 274908 275595 275359 274926 275032 275549 276027 276640 277850 279478
56367 279478 280918 282052 283183 284206 284669 284669 284905 285796 287158 288816 290812 292906 294502 295308 295672 296132
56351 296132 296994 298331 299980 301504 302574 303328 304032 304532 304604 304676 305581 307488 309616 311160 312132 313221 315167
$$ packed form
56467B29599J399J119R52P44L92J26L2j06k66j46K08L83L76N69Q13M73l95q50
56449B35422m32J90M10N53J013J429J355J045Q38M57l43j060j131q91j052j567
56433B36236j679r20M51J803K512K253J300L45k09n05p07o72m35l63n26m34J77
56416B38627Q42J097J162J389J522J130M48J64M89R71J104P83K31k09k60R0N80
56399B50160R50J109J074R37R04J030J056P43L40K54M48N96P14J039J425J476
56383B64255J271J268J531J707J708J698J470O87k36m33J06N17M78O13J210J628
56367B79478J440J134J131J023M63%K36Q91J362J658J996K094J596Q06L64M60
56351B96132Q62J337J649J524J070P54P04N00P2P2R05J907K128J544R72J089J946
$$ plain form
56334 315167 318278 322238 326373 330285 334117 338042 341871 345492 349233 353270 357087 360182 362979 366270
56320 366270 369972 373179 375321 376437 376465 375188 373097 371463 371196 372152 373756 375769 378176 380739 383025
56305 383025 384781 386276 388294 391580 396098 401115 406261 411969 418487 425059 430815 435972 441334 446997
56291 446997 452459 457707 463163 468707 473834 478817 484740 492218 500895 510256 520123 530257 540404 550931
56277 550931 562639 575674 589362 603306 617984 634028 651530 670280 690127 710981 732973
56266 732973 756633 782414 810099 839348 870726 905486 944467 987932 1036396 1090731 1151514
56255 1151514 1219271 1295386 1381830 1479813 1589633 1711944 1848139 1999153 2164750 2344215
56245 2344215 2536750 2740752 2953470 3171713 3392118 3610374 3820870 4017512 4194448
$$ packed form
56334C15167L111L960M135L912L832L925L829L621L741M037L817L095K797L291
56320C66270L702L207K142J116K8j277k091j634k67R56J604K013K407K563K286
56305C83025J756J495K018L286M518N017N146N708O518O572N756N157N362N663
56291D46997N462N248N456N544N127M983N923P478Q677R361R867J0134J0147J0527
56277E50931J1708J3035J3688J3944J4678J6044J7502J8750J9847K0854K1992
56266G32973K3660K5781K7685K9249L1378L4760L8981M3465M8464N4335O0783
56255A151514O7757P6115Q6444R7983J09820J22311J36195J51014J65597J79465
56245B344215J92535K04002K12718K18243K20405K18256K10496J96642J76936
$$ plain form
56236 4194448 4346171 4467982 4556767 4610704 4628266 4608543 4552778 4464591 4348400 4208458
56226 4208458 4049445 3876598 3694488 3506522 3316034 3126807 2941954 2763208 2591979
56217 2591979 2430098 2278742 2137434 2004999 1881069 1766062 1660219 1563283 1474695 1393614
56207 1393614 1319160 1250901 1188715 1132113 1080427 1033711 992392 955827 922280 890810 862122
56196 862122 837003 814984 795200 777500 761795 747198 732874 719191 707149 697103 688737 681774
56184 681774 675967 670802 665820 660979 656286 651609 647186 643748 641705 640731 640443 640831 641692 642451 642941 643681
56168 643681 644947 646306 647392 648374 649372 650365 652030 655550 661105 667612 674494 682521 692209 702585 712496
56153 712496 722122 732282 743251 755291 769518 787112 808300 832941 861510 894870 934026 980806
$$ packed form
56236D194448J51723J21811Q8785N3937J7562j9723n5765q8187j16191j39942
56226D208458j59013j72847j82110j87966j90488j89227j84853j78746j71229
56217B591979j61881j51356j41308j32435j23930j15007j05843r6936q8588q1081
56207A393614p4454o8259o2186n6602n1686m6716m1319l6565l3547l1470k8688
56196H62122k5119k2019j9784j7700j5705j4597j4324j3683j2042j0046q366o963
56184F81774n807n165m982m841m693m677m423l438k043r74k88L88Q61P59M90P40
56168F43681J266J359J086R82R98R93J665L520N555O507O882Q027R688J0376R911
56153G12496R626J0160J0969J2040J4227J7594K1188K4641K8569L3360L9156M6780
$$ plain form
56141 980806 1037565 1104945 1180696 1261702 1346113 1432271 1516589 1594353 1662539 1720796 1770275
56130 1770275 1812887 1851318 1888003 1923368 1955521 1981721 1999975 2009887 2012791 2010871 2005602 1997188
56118 1997188 1985357 1969571 1947890 1916854 1873616 1817892 1751546 1677357 1598895 1520356 1445211
56107 1445211 1375487 1312778 1258736 1213634 1175646 1142792 1114719 1091608 1072527 1056256 1042760
56096 1042760 1032502 1025110 1020015 1017511 1017798 1019792 1022229 1025237 1029457 1034465 1039480 1044831 1051169 1057926
56082 1057926 1064118 1070151 1077273 1085711 1094766 1104248 1114453 1125145 1135892 1147030 1159134 1172071
56070 1172071 1185640 1200318 1216163 1231945 1246793 1261823 1278590 1296721 1314674 1332102 1349833
56059 1349833 1368207 1387054 1406609 1426879 1446748 1465250 1482996 1500903 1518519 1535303 1552485
$$ packed form
56141I80806N6759O7380P5751Q1006Q4411Q6158Q4318P7764O8186N8257M9479
56130A770275M2612L8431L6685L5365L2153K6200J8254R912K904j920n269q414
56118A997188j1831j5786k1681l1036m3238n5724o6346p4189p8462p8539p5145
56107A445211o9724o2709n4042m5102l7988l2854k8073k3111j9081j6271j3496
56096A042760j0258p392n095k504K87J994K437L008M220N008N015N351O338O757
56082A057926O192O033P122Q438R055R482J0205J0692J0747J1138J2104J2937
56070A172071J3569J4678J5845J5782J4848J5030J6767J8131J7953J7428J7731
56059A349833J8374J8847J9555K0270J9869J8502J7746J7907J7616J6784J7182
$$ plain form
56048 1552485 1571626 1592195 1612575 1632650 1653366 1674569 1695500 1716785 1739674 1763810 1787888
56037 1787888 1812014 1837287 1863595 1890011 1916958 1945928 1977525 2011786 2049750 2092423 2138797
56026 2138797 2187015 2236900 2289142 2342886 2396545 2450371 2505785 2562891 2621112 2681433 2745340
56015 2745340 2812247 2880642 2950978 3024676 3101298 3179739 3261271 3348062 3439522 3533568 3630757
56004 3630757 3733510 3841941 3954374 4071568 4196358 4329248 4468377 4613878 4768231
55995 4768231 4932189 5104305 5284752 5475719 5677847 5890112 6113417 6350526 6602582
55986 6602582 6869616 7154194 7460246 7788646 8138530 8512679 8916810 9353973 9824829
55977 9824829 10333069 10885022 11484350 12133245 12838875 13612537 14462709 15395647 16422841
$$ packed form
56048A552485J9141K0569K0380K0075K0716K1203K0931K1285K2889K4136K4078
56037A787888K4126K5273K6308K6416K6947K8970L1597L4261L7964M2673M6374
56026B138797M8218M9885N2242N3744N3659N3826N5414N7106N8221O0321O3907
56015B745340O6907O8395P0336P3698P6622P8441Q1532Q6791R1460R4046R7189
56004C630757J02753J08431J12433J17194J24790J32890J39129J45501J54353
55995D768231J63958J72116J80447J90967K02128K12265K23305K37109K52056
55986F602582K67034K84578L06052L28400L49884L74149M04131M37163M70856
55977I824829N08240N51953N99328O48895P05630P73662Q50172R32938J027194
$$ plain form
55968 16422841 17560975 18825145 20230384 21800532 23568250 25567656 27837576 30433766
55960 30433766 33430541 36914388 40992197 45811414 51566513 58495673 66897934 77166884
55952 77166884 89807865 105447647 124864238 148959897 178504508 213598883 253077546
55945 253077546 294194333 332814500 364152811 383940508 389673840 381367791 361361429
55938 361361429 333294379 300907819 267281583 234619648 204325272 177140967 153307491
55931 153307491 132738366 115164665 100226681 87539582 76747718 67548143 59682389
55924 59682389 52927908 47102503 42062730 37689303 33878372 30545477 27625296 25061293
55916 25061293 22800808 20800685 19028800 17456527 16055561 14803538 13685445 12686526
$$ packed form
55968A6422841J138134J264170J405239J570148J767718J999406K269920K596190
55960C0433766K996775L483847M077809M819217N755099O929160Q402261J0268950
55952G7166884J2640981J5639782J9416591K4095659K9544611L5094375L9478663
55945B53077546M1116787L8620167L1338311J9787697N733332q306049k0006362
55938C61361429k8067050l2386560l3626236l2661935l0294376k7184305k3833476
55931A53307491k0569125j7573701j4937984j2687099j0791864r199575p865754
55924E9682389o754481n825405n039773m373427l810931l332895k920181k564003
55916B5061293k260485k000123j771885j572273j400966j252023j118093r98919
$$ plain form
55908 12686526 11789274 10979174 10247428 9585603 8982781 8430271 7924160 7460859 7034396
55899 7034396 6640091 6276655 5942489 5633578 5346753 5081395 4836173 4607687 4394014
55890 4394014 4196198 4014458 3846018 3688424 3542143 3408207 3285825 3173668 3070922
55881 3070922 2975648 2884412 2794760 2706089 2617520 2527638 2437149 2349146 2265548 2185527 2108208
55870 2108208 2034331 1964247 1896845 1831760 1770399 1713651 1660766 1611545 1567397 1529013 1494961
55859 1494961 1463662 1434746 1407358 1379223 1348742 1316421 1283208 1249130 1214440 1180249 1146914
55848 1146914 1113506 1079901 1047637 1017695 989107 960876 933539 907663 882438 857115 832489
55837 832489 809732 788936 769783 752388 736484 721060 705843 691895 679808 668553 657204
$$ packed form
55908A2686526q97252q10100p31746o61825o02822n52510n06111m63301m26463
55899G034396l94305l63436l34166l08911k86825k65358k45222k28486k13673
55890D394014j97816j81740j68440j57594j46281j33936j22382j12157j02746
55881C070922r5274r1236q9652q8671q8569q9882r0489q8003q3598q0021p7319
55870B108208p3877p0084o7402o5085o1361n6748n2885m9221m4148l8384l4052
55859A494961l1299k8916k7388k8135l0481l2321l3213l4078l4690l4191l3335
55848A146914l3408l3605l2264k9942k8588k8231k7337k5876k5225k5323k4626
55837H32489k2757k0796j9153j7395j5904j5424j5217j3948j2087j1255j1349
$$ plain form
55826 657204 646539 637768 630604 623705 616170 607696 598102 587607 576933 566474 556053 545837 536445
55813 536445 527722 518649 509055 500223 493121 487178 481548 476401 472147 468515 465336 463369 463541 466088
55799 466088 470935 477897 485933 493308 499213 504246 508732 511775 512646 511899 510225 507396 503274 498803 494913
55784 494913 491354 487468 483133 477979 470748 460659 448673 436317 424067 412048 401686 395299 394242
55771 394242 398297 406501 417608 429871 441120 449049 451497 447298 437483 424890 411918 399155 386533
55758 386533 374730 364548 355790 347749 340297 333679 327781 322388 317548 312931 307478 300564 292926 285639
55744 285639 278840 272337 266765 262986 260783 259239 258077 257546 257217 255993 253323 249627 245616 241895 239030
55729 239030 237177 235659 233603 230930 228132 225214 221599 216995 211753 206421 201465 197384 194509 192672
$$ packed form
55826F57204j0665q771p164o899p535q474r594j0495j0674j0459j0421j0216r392
55813E36445q723r073r594q832p102n943n630n147m254l632l179j967J72K547
55799D66088M847O962Q036P375N905N033M486L043Q71p47j674k829m122m471l890
55784D94913l559l886m335n154p231j0089j1986j2356j2250j2019j0362o387j057
55771C94242M055Q204J1107J2263J1249P929K448m199r815j2593j2972j2763j2622
55758C86533j1803j0182q758q041p452o618n898n393m840m617n453o914p638p287
55744B85639o799o503n572l779k203j544j162n31l29j224k670l696m011l721k865
55729B39030j853j518k056k673k798k918l615m604n242n332m956m081k875j837
$$ plain form
55715 192672 191450 190749 190845 192075 194857 199708 206670 214767 222402 228245 231626 232490 231463 229632 227726
55700 227726 225569 222599 218633 213808 208187 201940 195563 189414 183290 177053 171414 167464 165458 164634
55686 164634 164214 164073 164347 164918 165618 166723 168867 172326 176527 180531 184058 187657 191599 194941 196254
55671 196254 195100 192250 188703 185180 182383 180768 179893 178875 177686 177140 177344 177178 175820 173947 172841
55656 172841 172989 174109 175839 177761 179350 180547 181931 183841 185893 187780 189820 192138 193961 194423 193539
55641 193539 191772 189182 185621 181273 176368 170909 165262 160360 156590 153043 148670 143696 139126 135380
55627 135380 132265 129881 128596 128277 128296 128186 127804 127161 126533 126246 125876 124303 121237 117947 115689 114106
55611 114106 112176 110026 108555 107719 106615 105096 104000 103690 103513 102848 101699 100111 97909 95270 92771
$$ packed form
55715A92672j222p01R6J230K782M851O962Q097P635N843L381Q64j027j831j906
55700B27726k157k970l966m825n621o247o377o149o124o237n639l950k006q24
55686A64634m20j41K74N71P00J105K144L459M201M004L527L599L942L342J313
55671A96254j154k850l547l523k797j615q75j018j189n46K04j66j358j873j106
55656A72841J48J120J730J922J589J197J384J910K052J887K040K318J823M62q84
55641A93539j767k590l561m348m905n459n647m902l770l547m373m974m570l746
55627A35380l115k384j285l19J9j10l82o43o28k87l70j573l066l290k258j583
55611A14106j930k150j471q36j104j519j096l10j77o65j149j588k202k639k499
$$ plain form
55596 92771 90687 88871 87374 86495 86166 85991 85897 86102 86442 86485 86363 86751 87872 89158 90012 90309 90126 89573
55578 89573 89002 88805 88952 89197 89655 90648 92107 93735 95583 97805 100026 101767 103347 105465 107944 109827
55562 109827 110768 111388 112122 112663 112746 112525 111816 109900 106642 103112 100477 98761 97141 95020 92467 90027
55546 90027 88466 88332 89412 90881 92099 92939 93346 93171 92646 92475 93188 94821 97311 100613 104191 106941
55530 106941 108077 107755 106688 105489 104510 103774 102843 101205 99014 97033 95694 94713 93753 92845 91843 90133
55514 90133 87388 84200 81465 79413 77644 75900 74364 73296 72622 71911 70755 69356 68610 69236 70826
55499 70826 72240 72914 73247 73597 73592 72794 71497 70342 69481 68600 67571 66704 66443 66978 68026 68902 69027 68490
55481 68490 67894 67596 67403 67032 66499 65916 65331 64924 65027 65747 66820 67973 69068 69807 69765 68904 67701 66515
$$ packed form
55596I2771k084j816j497q79l29j75r4K05L40M3j22L88J121J286Q54K97j83n53
55578H9573n71j97J47K45M58R93J459J628J848K222K221J741J580K118K479J883
55562A09827R41O20P34N41Q3k21p09j916l258l530k635j716j620k121k553k440
55546I0027j561j34J080J469J218Q40M07j75n25j71P13J633K490L302L578K750
55530A06941J136l22j067j199r79p36r31j638k191j981j339r81r60r08j002j710
55514I0133k745l188k735k052j769j744j536j068o74p11j156j399p46O26J590
55499G0826J414O74L33L50np98j297j155q61q81j029q67k61N35J048Q76J25n37
55481F8490n96k98j93l71n33n83n85m07J03P20J073J153J095P39m2q61j203j186
$$ plain form
55463 66515 65194 63562 61963 61019 61023 61797 62910 63857 64275 64244 64285 64943 66386 68320 70090 70978 70739 69812
55445 69812 68773 67697 66406 65101 64245 63943 63990 64447 65450 66521 66865 66488 66278 66694 67119 66808 65852
55428 65852 64827 64130 64039 64788 66127 67316 68030 68806 70137 71677 72847 73731 74747 75832 76563 76908 77263
55411 77263 77889 78728 79636 80401 80660 80154 78987 77497 76046 75059 74849 75159 75204 74462 73123 71597 70019
55394 70019 68522 67455 66961 66750 66646 66953 67888 69145 70439 71963 73784 75262 75683 75114 74108 72964
55378 72964 71893 71420 71809 72342 71959 70481 68558 66653 64913 63782 63771 64469 64712 64049 63356 63630 64712
55361 64712 65576 65499 64576 63425 62709 62841 63830 65382 67116 68623 69505 69655 69433 69288 69218 68870 68118 67206
55343 67206 66419 65941 66004 66790 68110 69481 70548 71182 71223 70507 69217 67880 66964 66694 67174 68288 69447
$$ packed form
55463F6515j321j632j599r44MP74J113R47M18l1M1O58J443J934J770Q88k39r27
55445F9812j039j076j291j305q56l02M7M57J003J071L44l77k10M16M25l11r56
55428F5852j025o97r1P49J339J189P14P76J331J540J170Q84J016J085P31L45L55
55411G7263O26Q39R08P65K59n06j167j490j451r87k10L10M5p42j339j526j578
55394G0019j497j067m94k11j04L07R35J257J294J524J821J478M21n69j006j144
55378G2964j071m73L89N33l83j478j923j905j740j131j1O98K43o63o93K74J082
55361F4712Q64p7r23j151p16J32R89J552J734J507Q82J50k22j45p0l48p52r12
55343F7206p87m78O3P86J320J371J067O34M1p16j290j337r16k70M80J114J159
$$ plain form
55326 69447 69863 69350 68598 68503 69324 70623 71799 72572 73021 73259 73043 71845 69550 67040 65724 66251 67852
55309 67852 69141 69503 69512 69956 70709 70843 69855 68402 67565 67620 67987 68285 68870 70216 72233 74410 76202 77061
55291 77061 76616 75204 73792 72970 72407 71692 71240 71701 72866 73922 74614 75360 76173 76304 75186 73238 71469
55274 71469 70670 71099 72496 74130 75161 75262 74761 74108 73435 72725 72135 71947 72297 73053 73901 74555 74955 75206
55256 75206 75295 75095 74784 74935 75809 76800 77036 76406 75583 75153 75146 75349 75556 75502 75033 74393 73983 73836 73710 73640 73839
55235 73839 74088 73822 72985 72203 71920 71871 71725 71728 72312 73389 74416 74917 74748 74170 73869 74531 76048 77471 78088
55216 78088 78282 78933 80218 81439 81844 81233 79859 78174 76639 75457 74457 73513 72946 73163 73901 74266 73686
55199 73686 72585 71938 72350 73626 75049 75903 75938 75588 75627 76356 77145 77073 76038 74943 74584 74694 74411 73477
$$ packed form
55326F9447M16n13p52r5Q21J299J176P73M49K38k16j198k295k510j316N27J601
55309F7852J289L62RM44P53J34r88j453q37N5L67K98N85J346K017K177J792Q59
55291G7061m45j412j412q22n63p15m52M61J165J056O92P46Q13J31j118j948j769
55274G1469p99M29J397J634J031J01n01o53o73p10n90j88L50P56Q48O54M00K51
55256G5206Q9k00l11J51Q74R91K36o30q23m30pK03K07n4m69o40m10j47j26p0J99
55235G3839K49k66q37p82k83m9j46LN84J077J027N01j69n78l01O62J517J423O17
55216G8088J94O51J285J221M05o11j374j685j535j182j000r44n67K17P38L65n80
55199G3686j101o47M12J276J423Q54L5l50L9P29P89p2j035j095l59J10k83r34
$$ plain form
55181 73477 72517 72241 72872 74405 76794 79583 81899 83251 84029 84780 85379 85405 85024 84793 84733 84311 83367 82357
55163 82357 81560 80699 79656 79012 79452 80953 82881 84614 85819 86450 86797 87324 88225 89264 90161 90790 90858
55146 90858 89852 87729 85334 83662 82843 82213 81278 80156 79163 78384 77823 77650 78101 79217 80731 82175
55130 82175 83102 83347 83094 82690 82465 82656 83299 84020 84173 83475 82448 82006 82550 83600 84333 84399 84160 84234 84800
55111 84800 85411 85487 84913 84061 83296 82750 82559 82943 83885 84970 85836 86574 87418 88229 88662 88760 89002 89626 90198
55092 90198 90062 89163 88305 88510 90067 92149 93538 93803 93689 94216 95543 96946 97753 97931 97782 97436 96891
55075 96891 96300 95953 96001 96355 96826 97286 97682 97988 98147 98050 97651 97166 97005 97333 97712 97406 96147 94529 93505
55056 93505 93547 94340 95213 95701 95731 95504 95340 95503 95901 95953 94961 92812 90267 88414 87766 87953 88292 88514 88805
$$ packed form
55181G3477r60k76O31J533K389K789K316J352P78P51N99K6l81k31o0m22r44j010
55163H2357p97q61j043o44M40J501J928J733J205O31L47N27R01J039Q97O29O8
55146I0858j006k123k395j672q19o30r35j122r93p79n61j73M51J116J514J444
55130H2175R27K45k53m04k25J91O43P21J53o98j027m42N44J050P33O6k39P4N66
55111H4800O11P6n74q52p65n46j91L84R42J085Q66P38Q44Q11M33R8K42O24N72
55092I0198j36q99q58K05J557K082J389K65j14N27J327J403Q07J78j49l46n45
55075I6891n91l47M8L54M71M60L96L06J59r7l99m85j61L28L79l06j259j618j024
55056I3505M2P93Q73M88L0k27j64J63L98N2r92k149k545j853o48J87L39K22K91
$$ plain form
55037 88805 89251 89533 89276 88527 87696 87122 86919 87125 87729 88477 89007 89301 89770 90632 91356 91046 89476 87546
55019 87546 86588 87228 88951 90734 92008 92942 93828 94448 94292 93301 92081 91320 91200 91448 91707 91680 91191 90380
55001 90380 89732 89682 90220 90974 91612 92123 92831 94176 96207 98169 98909 97973 96163 94772 94475 95090 96092
54984 96092 96971 97322 97054 96491 96002 95623 95325 95434 96314 97746 99062 99905 100442 100864 101094 101095 101049 101093 101220 101489
54964 101489 102041 102807 103538 104187 104932 105762 106346 106426 106042 105316 104385 103577 103273 103395 103416 103003 102323 101582 100704
54945 100704 99725 99074 99071 99440 99646 99530 99268 98944 98496 97950 97397 96868 96520 96762 97809 99240 100436 101394
54927 101394 102720 104797 107412 110341 113880 118400 123604 128622 132882 136663 140801 146046 152610 159926
54913 159926 166639 171193 172848 172107 169918 166649 162256 157180 152357 148160 144041 139606 135429 132261
$$ packed form
55037H8805M46K82k57p49q31n74k03K06O04P48N30K94M69Q62P24l10j570j930
55019H7546r58O40J723J783J274R34Q86O20j56r91j220p61j20K48K59k7m89q11
55001I0380o48n0N38P54O38N11P08J345K031J962P40r36j810j391k97O15J002
54984I6092Q79L51k68n63m89l79k98J09Q80J432J316Q43N37M22K30Jm6M4J27K69
54964A01489N52P66P31O49P45Q30N84Q0l84p26r31q08l04J22K1m13o80p41q78
54945A00704r79o51lL69K06j16k62l24m48n46n53n29l48K42J047J431J196R58
54927A01394J326K077K615K929L539M520N204N018M260L781M138N245O564P316
54913A59926O713M554J655p41k189l269m393n076m823m197m119m435m177l168
$$ plain form
54899 132261 129913 127638 125282 123253 121497 119406 116875 114738 113811 113960 114396 114484 114075 113393 112881 112926 113567
54882 113567 114652 116276 118738 122057 125916 130141 134865 140168 145901 151924 158109 164026 169061 172885
54868 172885 175430 176362 175138 171753 166940 161539 156087 151007 146568 142451 138016 133251 128838 125066
54854 125066 121441 117739 114657 112822 111794 110706 109320 107774 105843 103240 100387 98101 96744 96222
54840 96222 96487 97342 98025 97757 96590 95155 93803 92657 92246 93119 94854 96246 96632 96357 95886 95218 94418
54823 94418 93980 94222 94779 95138 95308 95639 96245 97021 98020 99459 101256 102790 103286 102549 101236 100262 99925 99883
54805 99883 99960 100486 101644 102997 104103 105134 106301 107121 106985 106243 105927 106466 107441 108531 109830 111067 111480
54788 111480 110885 110257 110631 111833 112789 112831 112278 111888 112042 112477 112689 112641 112983 114312 116255 117722 118186 118341
$$ packed form
54899A32261k348k275k356k029j756k091k531k137r27J49M36Q8m09o82n12M5O41
54882A13567J085J624K462L319L859M225M724N303N733O023O185N917N035L824
54868A72885K545R32j224l385m813n401n452n080m439m117m435m765m413l772
54854A25066l625l702l082j835j028j088j386j546j931k603k853k286j357n22
54840I6222K65Q55O83k68j167j435j352j146m11Q73J735J392L86k75m71o68q00
54823I4418m38K42N57L59J70L31O06P76R99J439J797J534M96p37j313r74l37m2
54805I9883P7N26J158J353J106J031J167Q20j36p42l16N39R75J090J299J237M13
54788A11480n95o28L74J202R56M2n53l90J54M35K12m8L42J329J943J467M64J55
$$ plain form
54770 118341 119363 121825 125479 129715 134021 138279 142842 148172 154325 160950 167701 174232 179813 183503
54756 183503 184949 184595 182887 179765 175223 169862 164389 158869 152954 146625 140272 134311 129213 125737
54742 125737 124405 124624 124859 123988 122216 120518 119486 119012 118815 118785 118847 118831 118696 118678 119056 119881 121082 122702
54724 122702 124788 127257 130225 134398 140552 148374 156300 162897 168092 172594 176369 178334 177579 174322
54710 174322 169507 163893 157873 151918 146732 142834 140063 137625 134735 131251 127609 124299 121612 119829
54696 119829 119069 118812 118108 116668 115261 114586 114260 113527 112527 112033 112217 112596 113012 113689 114277 113971 112830
54679 112830 112034 112323 113033 113186 112814 112526 112380 111941 111107 110151 109216 108321 107680 107473 107457 107266 106967 106945 107341
54660 107341 107941 108447 108590 108173 107305 106382 105614 104845 104087 103756 103968 104076 103530 102850 103009 104038 104972 105204
$$ packed form
54770A18341J022K462L654M236M306M258M563N330O153O625O751O531N581L690
54756A83503J446l54j708l122m542n361n473n520n915o329o353n961n098l476
54742A25737j332K19K35q71j772j698j032m74j97l0O2j6j35j8L78Q25J201J620
54724A22702K086K469K968M173O154P822P926O597N195M502L775J965p55l257
54710A74322m815n614o020n955n186l898k771k438k890l484l642l310k687j783
54696A19829p60k57p04j440j407o75l26p33j000m94J84L79M16O77N88l06j141
54679A12830p96K89P10J53l72k88j46m39q34r56r35q95o41k07j6j91k99k2L96
54660A07341O00N06J43m17q68r23p68p69p58l31K12J08n46o80J59J029R34K32
$$ plain form
54642 105204 105162 105490 106123 106505 106383 106090 106120 106501 106618 105854 104517 103760 104214 105038 104901 103668 102504 102444 103516
54623 103516 105252 107233 108919 109695 109491 108940 108593 108425 108329 108516 109023 109355 109146 108816 108960 109419 109586 109465
54605 109465 109654 110253 110479 109680 108229 107051 106588 106607 106813 107263 108114 109192 109905 109666 108503 107268 106990
54588 106990 107885 109142 109805 109722 109467 109607 110374 111844 113899 115910 116943 116618 115573 114806 114693 114861 114891
54571 114891 114865 115265 116486 118359 119971 120131 118380 115573 113179 111982 111704 111812 112225 112999 113771 113942 113361
54554 113361 112470 111778 111423 111241 111048 110727 110261 109787 109563 109726 110182 110816 111740 113156 114906 116406 117208 117522
54536 117522 117960 118738 119369 119236 118314 117174 116340 115777 115013 113755 112399 111876 112780 114658 116375 117220 117423
54519 117423 117565 117836 118047 118018 117679 117059 116427 116151 116095 115555 114238 112975 112808 113559 114033 113607 112923 112862 113470
$$ packed form
54642A05204m2L28O33L82j22k93L0L81J17p64j337p57M54Q24j37j233j164o0J072
54623A03516J736J981J686P76k04n51l47j68r6J87N07L32k09l30J44M59J67j21
54605A09465J89N99K26p99j451j178m63J9K06M50Q51J078P13k39j163j235k78
54588A06990Q95J257O63q3k55J40P67J470K055K011J033l25j045p67j13J68L0
54571A14891k6M00J221J873J612J60j751k807k394j197k78J08M13P74P72J71n81
54554A13361q91o92l55j82j93l21m66m74k24J63M56O34R24J416J750J500Q02L14
54536A17522M38P78O31j33r22j140q34n63p64j258j356n23R04J878J717Q45K03
54519A17423J42K71K11k9l39o20o32k76n6n40j317j263j67P51M74m26o84o1O08
$$ plain form
54500 113470 114173 114508 114328 113716 113016 112635 112524 112246 111737 111581 112154 112952 113231 113026 112999 113455 114077 114670 115598
54481 115598 117251 119393 121331 122610 123329 123793 124044 123847 123105 122123 121364 121067 121182 121603 122324 123414 124921
54464 124921 126710 128351 129386 129876 130435 131453 132591 133348 133841 134518 135320 135655 135147 133904 132137 130109
54448 130109 128424 127709 127930 128503 129050 129473 129379 128284 126484 124886 123804 122774 121805 121765 123029 124707 125931
54431 125931 127047 128670 130346 131177 131276 131523 132181 132733 132910 132962 133012 133054 133522 134916 136784 137929 137864 137291
54413 137291 136924 136544 135635 134321 133223 132714 132726 133066 133572 134035 134181 133821 133051 132405 132629 134038 136121 138034
54395 138034 139443 140700 142263 144140 145845 146734 146490 145505 144610 144242 144024 143344 142110 140697 139502 138850
54379 138850 139041 140008 141140 141846 142150 142433 142933 143870 145626 148212 150851 152731 153972 155331 157183 159418
$$ packed form
54500A13470P03L35j80o12p00l81j11k78n09j56N73P98K79k05k7M56O22N93R28
54481A15598J653K142J938J279P19M64K51j97p42r82p59k97J15M21P21J090J507
54464A24921J789J641J035M90N59J018J138P57M93O77Q02L35n08j243j767k028
54448A30109j685p15K21N73N47M23r4j095j800j598j082j030r69m0J264J678J224
54431A25931J116J623J676Q31R9K47O58N52J77N2N0M2M68J394J868J145o5n73
54413A37291l67l80r09j314j098n09J2L40N06M63J46l60p70o46K24J409K083J913
54395A38034J409J257J563J877J705Q89k44r85q95l68k18o80j234j413j195o52
54379A38850J91R67J132P06L04K83N00R37J756K586K639J880J241J359J852K235
$$ plain form
54363 159418 162094 165440 169390 173735 178547 183640 187898 190093 190344 189780 188749 186479 182788 178916 176020
54348 176020 173668 170611 166437 161824 157596 154225 151859 150276 148946 147555 146277 145289 144359 143236 142131
54333 142131 141431 141242 141519 142252 143113 143271 142160 140262 138741 138375 139174 140802 142858 144756 145885 146116
54317 146116 145885 145611 145188 144267 142948 141893 141552 141509 140969 139911 139189 139277 139510 139097 138403 138427 139242 139858 139649
54298 139649 139016 138450 137776 136726 135550 134610 133938 133584 133892 134937 136182 137144 137978 138939 139667 139626 138937 138204
54280 138204 137659 136946 135718 134136 132857 132707 134087 136419 138451 139422 139715 140140 140919 141714 142277 142606 142680
54263 142680 142550 142529 142868 143348 143574 143606 143941 144951 146590 148524 150258 151291 151557 151615 152078 152892 153432 153252
54245 153252 152498 151701 151370 151605 151903 151478 150124 148536 147515 147032 146445 145524 144793 144831 145569 146398 146777 146649
$$ packed form
54363A59418K676L346L950M345M812N093M258K195K51n64j031k270l691l872k896
54348A76020k352l057m174m613m228l371k366j583j330j391j278r88r30j123j105
54333A42131p00j89K77P33Q61J58j111j898j521l66P99J628K056J898J129K31
54317A46116k31k74m23r21j319j055l41m3n40j058p22Q8K33m13o94K4Q15O16k09
54298A39649o33n66o74j050j176r40o72l54L08J045J245R62Q34R61P28m1o89p33
54280A38204n45p13j228j582j279j50J380K332K032R71K93M25P79P95N63L29P4
54263A42680j30k1L39M80K26L2L35J010J639J934J734J033K66N8M63Q14N40j80
54245A53252p54p97l31K35K98m25j354j588j021m83n87r21p31L8P38Q29L79j28
$$ plain form
54227 146649 146379 146308 146421 146596 147085 148386 150442 152326 153039 152384 150885 149122 147498 146331 145696 145261 144653
54210 144653 143920 143352 142961 142486 141848 141298 141095 141267 141657 142020 142149 142058 141944 141845 141521 140774 139734 138693 137895
54191 137895 137586 137904 138561 138997 139134 139534 140556 141813 142895 144042 145474 146564 146499 145572 144928 145063 145341
54174 145341 145114 144565 144252 144450 145181 146370 147624 148253 147828 146478 144547 142351 140412 139459 139807 140963
54158 140963 142112 142789 142913 142480 141585 140600 139953 139676 139437 139042 138767 139050 140001 141381 142973 144696 146259
54141 146259 147079 146932 146411 146255 146313 145855 144928 144592 145460 146834 147843 148724 150109 151618 152193 151646 150901 150688
54123 150688 150858 151086 151395 151716 151718 151444 151590 152714 154619 156746 158795 160616 161915 162457 162442 162418 162880 163910
54105 163910 164970 165188 164251 163006 162662 163400 164328 164894 165611 167133 169329 171795 174738 178689 183631 188980
$$ packed form
54227A46649k70p1J13J75M89J301K056J884P13o55j499j763j624j167o35m35o08
54210A44653p33n68l91m75o38n50k03J72L90L63J29r1j14r9l24p47j040j041p98
54191A37895l09L18O57M36J37M00J022J257J082J147J432J090o5r27o44J35K78
54174A45341k27n49l13J98P31J189J254O29m25j350j931k196j939r53L48J156
54158A40963J149O77J24m33q95r85o47k77k39l95k75K83R51J380J592J723J563
54141A46259Q20j47n21j56N8m58r27l36Q68J374J009Q81J385J509N75n47p45k13
54123A50688J70K28L09L21Kk74J46J124J905K127K049J821J299N42j5k4M62J030
54105A63910J060K18r37j245l44P38R28N66P17J522K196K466K943L951M942N349
$$ plain form
54089 188980 194234 199144 203354 206359 207844 207757 206108 203019 198915 194362 189718 185199 181243 178493 177268
54074 177268 177167 177294 176928 176062 175405 175731 177138 178903 180104 180315 179741 178890 178231 178004 178201 178707 179473 180541
54056 180541 181965 183818 186179 188956 191787 194367 196803 199362 201927 203982 205198 205727 205933 206163 206821
54041 206821 208251 210377 212791 215348 218379 222198 226753 231903 237626 243681 249470 254613 259358 264056
54027 264056 268480 272128 275012 277664 280401 283025 285254 287097 288665 289930 290836 291401 291537 290895 289129
54012 289129 286320 282935 279256 274924 269345 262614 255854 250328 246340 243219 240262 237295 234304 231069
53998 231069 227459 223779 220503 217826 215740 214279 213371 212589 211442 209882 208231 206609 204777 202639 200603
53983 200603 199216 198553 198163 197559 196672 195792 195266 195271 195682 196037 195787 194840 193747 193020 192382 191202 189722 189198
$$ packed form
54089A88980N254M910M210L005J485q7j649l089m104m553m644m519l956k750j225
54074A77268j01J27l66q66o57L26J407J765J201K11n74q51o59k27J97N06P66J068
54056A80541J424J853K361K777K831K580K436K559K565K055J216N29K06K30O58
54041B06821J430K126K414K557L031L819M555N150N723O055N789N143M745M698
54027B64056M424L648K884K652K737K624K229J843J568J265R06N65J36o42j766
54012B89129k809l385l679m332n579o731o760n526l988l121k957k967k991l235
53998B31069l610l680l276k677k086j461r08p82j147j560j651j622j832k138k036
53983B00603j387o63l90o04q87q80n26NM11L55k50r47j093p27o38j180j480n24
$$ plain form
53965 189198 190432 192752 195009 197079 199572 202437 204931 207008 209776 214237 220380 227843 236787 247608
53951 247608 260319 274534 289366 302871 312376 316254 315152 310959 305023 297990 290780 284518 279543
53938 279543 275402 272020 270070 269933 270989 272283 273391 274305 274987 275496 276235 277609 279562 281784 284245
53923 284245 287192 290653 294266 297707 301095 304890 309433 314723 320646 327318 335038 343907 353550 363283
53909 363283 372443 380532 387237 392464 396310 398928 400464 401130 401133 400475 399021 396872 394357 391502 387814
53894 387814 382948 377344 371819 366614 361244 355186 348350 340882 332971 324916 316987 309095 300931 292640
53880 292640 285080 279157 275029 272146 269858 267800 265789 263656 261269 258630 255841 252947 249784 246135
53866 246135 242118 238319 235324 233106 231084 228747 226004 222985 219888 217188 215485 214767 214069 212408 209933
$$ packed form
53965A89198J234K320K257K070K493K865K494K077K768M461O143P463Q944J0821
53951B47608J2711J4215J4832J3505R505L878j102m193n936p033p210o262m975
53938B79543m141l382j950j37J056J294J108R14O82N09P39J374J953K222K461
53923B84245K947L461L613L441L388L795M543N290N923O672P720Q869R643R733
53909C63283R160Q089O705N227L846K618J536O66Lo58j454k149k515k855l688
53894C87814m866n604n525n205n370o058o836p468p911q055p929p892q164q291
53880B92640p560n923m128k883k288k058k011k133k387k639k789k894l163l649
53866B46135m017l799k995k218k022k337k743l019l097k700j703p18o98j661k475
$$ plain form
53851 209933 207666 206076 204570 202596 200662 199607 199297 198766 197624 196585 196424 197020 197774 198424 199000 199359
53835 199359 199354 199211 199191 199082 198587 198121 198532 199924 201359 201952 201858 201946 202813 204315 205792 206592 206626 206500 206864
53816 206864 207683 208456 209017 209576 210056 210176 210291 211348 213606 216189 218410 220823 224296 228708 233376 238199
53800 238199 243413 248559 252826 256398 260395 265265 270113 273963 277006 280113 283693 287460 291019 294191
53786 294191 296940 299280 301266 302947 304342 305309 305296 303492 299664 294708 289860 285392 280635 275260 269846
53771 269846 264993 260565 256180 251946 248238 245108 242323 239718 237090 234095 230655 227282 224530 222273
53757 222273 219974 217562 215606 214565 214208 213889 213150 211990 210740 209717 208904 207965 206617 204913 203064
53742 203064 201164 199342 198023 197733 198586 200168 201917 203372 204174 204191 203815 203817 204661 206080 207499 208700 209849
$$ packed form
53851B09933k267j590j506j974j934j055l10n31j142j039j61N96P54O50N76L59
53835A99359nj43k0j09m95m66M11J392J435N93r4Q8Q67J502J477Q00L4j26L64
53816B06864Q19P73N61N59M80J20J15J057K258K583K221K413L473M412M668M823
53800B38199N214N146M267L572L997M870M848L850L043L107L580L767L559L172
53786B94191K749K340J986J681J395R67j3j804l828m956m848m468m757n375n414
53771B69846m853m428m385m234l708l130k785k605k628k995l440l373k752k257
53757B22273k299k412j956j041l57l19p39j160j250j023q13r39j348j704j849
53742B03064j900j822j319k90Q53J582J749J455Q02J7l76KQ44J419J419J201J149
$$ plain form
53725 209849 211038 212115 212971 213690 214345 214919 215563 216726 218771 221578 224676 227684 230481 233083 235554
53710 235554 237896 239827 240780 240498 239594 239209 240058 242057 244864 248335 252344 256592 260880 265282 269736
53695 269736 273740 276801 279039 281049 283261 285635 287914 289892 291422 292253 291976 290304 287654 285237 284019
53680 284019 283612 282772 281128 279658 279103 278813 277861 276560 275842 275570 274703 273061 271707 271331 271263 270591 269496
53663 269496 268879 269138 269859 270402 270412 269967 269443 269090 268602 267462 265792 264442 264072 264516 265285 266240 267483 268933
53645 268933 270364 271666 272853 273986 275216 276674 278267 279854 281587 283706 286011 288102 290142 292677
53631 292677 295547 297804 299159 300757 303821 308053 312075 315134 317737 320881 325232 330799 336812 342097
53617 342097 346045 349064 351733 353976 355650 357410 360071 363356 366295 368858 372177 376909 382242 386947
$$ packed form
53725B09849J189J077Q56P19O55N74O44J163K045K807L098L008K797K602K471
53710B35554K342J931R53k82r04l85Q49J999K807L471M009M248M288M402M454
53695B69736M004L061K238K010K212K374K279J978J530Q31k77j672k650k417j218
53680B84019m07q40j644j470n55k90r52j301p18k72q67j642j354l76o8o72j095
53663B69496o17K59P21N43J0m45n24l53m88j140j670j350l70M44P69R55J243J450
53645B68933J431J302J187J133J230J458J593J587J733K119K305K091K040K535
53631B92677K870K257J355J598L064M232M022L059K603L144M351N567O013N285
53617C42097L948L019K669K243J674J760K661L285K939K563L319M732N333M705
$$ plain form
53603 386947 390710 393960 396894 399278 400915 401910 402550 403176 404005 404953 405847 406848 408354 410322 412104 413134
53587 413134 413414 413097 411991 409893 407133 404355 401817 399251 396406 393429 390740 388622 386999 385503 383855
53572 383855 382176 380768 379587 378191 376374 374610 373606 373568 374092 374691 375165 375549 375906 376197 376312 376310 376605
53555 376605 377616 379059 379921 379511 378318 377453 377396 377768 378200 378844 379843 380865 381523 381942 382633 384044 386485
53538 386485 390172 394906 399897 404367 408378 412767 418310 425201 433261 442181 451496 460755 469962 479551
53524 479551 489735 500216 510768 521719 533471 545823 558294 571068 585060 600966 618637
53513 618637 637541 657417 678220 699698 721434 743310 765714 789171 813815 839186 864440
53502 864440 888770 911680 933018 952973 972104 991150 1010498 1029837 1048595 1066701 1084695
$$ packed form
53603C86947L763L250K934K384J637R95O40O26Q29R48Q94J001J506J968J782J030
53587D13134K80l17j106k098k760k778k538k566k845k977k689k118j623j496j648
53572C83855j679j408j181j396j817j764j004l8N24N99M74L84L57K91J15kK95
53555C76605J011J443Q62m10j193q65n7L72M32O44R99J022O58M19O91J411K441
53538C86485L687M734M991M470M011M389N543O891Q060Q920R315R259R207R589
53524D79551J0184J0481J0552J0951J1752J2352J2471J2774J3992J5906J7671
53513F18637J8904J9876K0803K1478K1736K1876K2404K3457K4644K5371K5254
53502H64440K4330K2910K1338J9955J9131J9046J9348J9339J8758J8106J7994
$$ plain form
53491 1084695 1103046 1121633 1139959 1157676 1174833 1191788 1208994 1226617 1244249 1261230 1277437
53480 1277437 1293541 1310290 1327651 1344763 1360613 1374543 1386282 1395737 1402838 1407523 1409890 1410246
53468 1410246 1408794 1405244 1399044 1390133 1379225 1367216 1354604 1341606 1328456 1315234 1301701 1287683
53456 1287683 1273395 1258861 1243271 1225562 1205755 1185206 1165260 1146063 1126901 1107364 1087839
53445 1087839 1069073 1051540 1035197 1019588 1004294 989516 976204 965437 957617 952343 948987 947145
53433 947145 946463 946358 946257 946138 946593 948254 951282 955469 960611 966626 973503 981411 990765 1001870 1014545
53418 1014545 1028401 1043457 1060110 1078467 1098125 1118761 1140527 1163664 1188096 1213715 1240697
53407 1240697 1269176 1298922 1329796 1362233 1396741 1433070 1470484 1508861 1549028 1591882 1637548
$$ packed form
53491A084695J8351J8587J8326J7717J7157J6955J7206J7623J7632J6981J6207
53480A277437J6104J6749J7361J7112J5850J3930J1739R455P101M685K367L56
53468A410246j452l550o200q911j0908j2009j2612j2998j3150j3222j3533j4018
53456A287683j4288j4534j5590j7709j9807k0549j9946j9197j9162j9537j9525
53445A087839j8766j7533j6343j5609j5294j4778j3312j0767p820n274l356j842
53433I47145o82j05j01j19M55J661L028M187N142O015O877P908R354J1105J2675
53418A014545J3856J5056J6653J8357J9658K0636K1766K3137K4432K5619K6982
53407A240697K8479K9746L0874L2437L4508L6329L7414L8377M0167M2854M5666
$$ plain form
53396 1637548 1685559 1735413 1786710 1838966 1891621 1944264 1996854 2049720 2103153 2156738 2209236
53385 2209236 2259451 2307248 2353413 2398545 2442418 2484402 2523985 2560680 2593854 2622964 2647783
53374 2647783 2668219 2684084 2695302 2702101 2704681 2702724 2695411 2681930 2661915 2635517 2603274 2565943
53362 2565943 2524429 2479775 2433048 2385011 2335968 2286080 2235797 2185838 2136796 2089032 2042851
53351 2042851 1998482 1955857 1914776 1875245 1837213 1799916 1762083 1723181 1684105 1646260 1610222
53340 1610222 1575709 1542550 1511112 1481725 1454230 1428246 1403666 1380758 1359986 1341840 1326648
53329 1326648 1314235 1303661 1293345 1281722 1268066 1252781 1236840 1220993 1205575 1190846 1177031
53318 1177031 1164029 1151625 1140175 1130554 1123071 1116928 1111227 1106166 1102620 1100887 1100535 1101301 1103269 1106135
$$ packed form
53396A637548M8011M9854N1297N2256N2655N2643N2590N2866N3433N3585N2498
53385B209236N0215M7797M6165M5132M3873M1984L9583L6695L3174K9110K4819
53374B647783K0436J5865J1218O799K580j957p313j3481k0015k6398l2243l7331
53362B565943m1514m4654m6727m8037m9043m9888n0283m9959m9042m7764m6181
53351B042851m4369m2625m1081l9531l8032l7297l7833l8902l9076l7845l6038
53340A610222l4513l3159l1438k9387k7495k5984k4580k2908k0772j8146j5192
53329A326648j2413j0574j0316j1623j3656j5285j5941j5847j5418j4729j3815
53318A177031j3002j2404j1450r621p483o143n701n061l546j733l52P66J968K866
$$ plain form
53304 1106135 1109255 1112806 1118124 1126289 1136896 1148839 1161855 1176562 1193244 1211458 1230905 1251916
53292 1251916 1274767 1299061 1324176 1349936 1376409 1403226 1429526 1454509 1477744 1499015 1518200
53281 1518200 1535374 1550716 1564081 1574819 1582166 1585778 1585810 1582604 1576497 1567907 1557412 1545537 1532467
53268 1532467 1517954 1501503 1482698 1461539 1438589 1414740 1390594 1366037 1340537 1313931 1286699
53257 1286699 1259310 1231530 1202810 1173376 1144449 1117138 1091443 1066677 1042542 1019276 996810
53246 996810 974408 951354 927621 903683 879985 856835 834454 812829 791759 771324 752070
53235 752070 734463 718460 703951 691270 680595 671163 661839 652553 644377 637921 632328 626275 619302
53222 619302 611575 602889 592747 581272 569223 556988 544196 530492 516175 501852 487934 474801
$$ packed form
53304A106135L120L551N318Q165J0607J1943J3016J4707J6682J8214J9447K1011
53292A251916K2851K4294K5115K5760K6473K6817K6300K4983K3235K1271J9185
53281A518200J7174J5342J3365J0738P347L612L2l206o107q590j0495j1875j3070
53268A532467j4513j6451j8805k1159k2950k3849k4146k4557k5500k6606k7232
53257A286699k7389k7780k8720k9434k8927k7311k5695k4766k4135k3266k2466
53246I96810k2402k3054k3733k3938k3698k3150k2381k1625k1070k0435j9254
53235G52070j7607j6003j4509j2681j0675r432r324r286q176o456n593o053o973
53222F19302p727q686j0142j1475j2049j2235j2792j3704j4317j4323j3918j3133
$$ plain form
53210 474801 463063 453161 444823 437262 429883 422594 415580 409028 403009 397337 391481 384831 377121 368524
53196 368524 359476 350555 342374 335247 329005 323428 318831 315708 313687 311354 307569 302653 297868 293901
53182 293901 290318 286404 282057 277788 274211 271596 269610 267470 264724 261917 260144 259783 260077 260080 259548 258656
53166 258656 257351 255480 253317 251466 250297 249753 249566 249362 248775 247829 247081 247012 247404 247635 247431 246895 245971
53149 245971 244437 242438 240519 239058 238039 237407 237172 237096 236816 236405 236352 236809 237299 237389 237251 237279 237534 237858
53131 237858 238208 238632 239131 239704 240227 240243 239370 238126 237745 238762 240350 241555 242655 244623 247592 250652
53115 250652 253013 254664 255910 256864 257455 257435 256430 254475 252448 251344 251086 250615 249222 247178 245031 242941
53099 242941 240987 239493 238646 238267 238210 238510 238814 238296 236651 234727 233564 233143 232686 231944 231497 231798 232509
$$ packed form
53210D74801j1738r902q338p561p379p289p014o552o019n672n856o650p710q597
53196C68524r048q921q181p127o242n577m597l123k021k333l785m916m785l967
53182B93901l583l914m347m269l577k615j986k140k746k807j773l61K94Ln32q92
53166B58656j305j871k163j851j169n44j87k04n87r46p48o9L92K31k04n36r24
53149B45971j534j999j919j461j019o32k35p6k80m11n3M57M90R0j38K8K55L24
53131B37858L50M24M99N73N23J6q73j244l81J017J588J205J100J968K969L060
53115B50652K361J651J246R54N91k0j005j955k027j104k58m71j393k044k147k090
53099B42941j954j494q47l79n7L00L04n18j645j924j163m21m57p42m47L01P11
$$ plain form
53082 232509 232929 232718 232146 231917 232659 234234 235611 235795 234860 233694 232849 232138 231315 230533 229915 229256 228436 227649
53064 227649 226909 225796 224130 222467 221455 221041 220889 221175 222191 223340 223505 222639 222127 223107 225105 226942
53048 226942 228365 229979 231806 232910 232598 231283 229821 228542 227388 226582 226585 227441 228561 229223 229066 228152
53032 228152 226820 225559 224784 224583 224713 224872 224954 225054 225279 225604 225866 225947 225939 226066 226469 227159 228147 229400 230595
53013 230595 231252 231358 231589 232537 233864 234693 234797 234884 235542 236425 236824 236613 236172 235583 234518 232918 231364 230524
52995 230524 230501 230883 231238 231400 231434 231517 231807 232274 232691 232946 233359 234508 236608 239128 241184 242363 243052 243925
52977 243925 245253 246873 248677 250732 252864 254499 255215 255274 255316 255668 256239 256908 257595 257993 257740 256985 256331
52960 256331 256014 255578 254666 253688 253239 253146 252694 251678 250557 249567 248313 246490 244522 243091 242421 242322 242592
$$ packed form
53082B32509M20k11n72k29P42J575J377J84r35j166q45p11q23p82o18o59q20p87
53064B27649p40j113j666j663j012m14j52K86J016J149J65q66n12R80J998J837
53048B26942J423J614J827J104l12j315j462j279j154q06LQ56J120O62j57r14
53032B28152j332j261p75k01J30J59Q2J00K25L25K62Q1qJ27M03O90R88J253J195
53013B30595O57J06K31R48J327Q29J04Q7O58Q83L99k11m41n89j065j600j554q40
52995B30524k3L82L55J62L4Q3K90M67M17K55M13J149K100K520K056J179O89Q73
52977B43925J328J620J804K055K132J635P16N9M2L52N71O69O87L98k53p55o54
52960B56331l17m36r12r78m49r3m52j016j121r90j254j823j968j431o70r9K70
$$ plain form
52943 242592 242939 242794 241832 240589 240017 240269 240394 239499 237833 236440 235913 235944 235944 235717 235378 234902 234070 232877
52925 232877 231773 231368 231839 232714 233272 233166 232607 231971 231365 230672 229946 229589 230044 231393 233334 235431 237316
52908 237316 238705 239445 239597 239372 238870 237974 236580 234848 233133 231754 230920 230755 231166 231735 232045 232194 232769
52891 232769 234130 235860 237115 237506 237476 237776 238640 239528 239665 238816 237489 236394 235853 235789 236070 236619 237320 238127
52873 238127 239250 240853 242539 243608 243959 244360 245530 247323 249112 250658 252097 253386 254346 255197 256457
52858 256457 258135 259484 259791 259119 258018 256674 254642 251428 247242 243029 239611 236809 233691 229830 225955
52843 225955 223045 221106 219430 217863 217077 217466 218441 219127 219287 219200 219023 218696 218237 217810 217619 217936 218953
52826 218953 220349 221264 221042 219885 218488 217231 216026 214849 214012 213888 214612 216065 217964 219987 221921
$$ packed form
52943B42592L47j45r62j243n72K52J25q95j666j393n27L1%k27l39m76q32j193
52925B32877j104m05M71Q75N58j06n59o36o06o93p26l57M55J349J941K097J885
52908B37316J389P40J52k25n02q96j394j732j715j379q34j65M11N69L10J49N75
52891B32769J361J730J255L91l0L00Q64Q88J37q49j327j095n41o4K81N49P01Q07
52873B38127J123J603J686J069L51M01J170J793J789J546J439J289R60Q51J260
52858B56457J678J349L07o72j101j344k032l214m186m213l418k802l118l861l875
52843B25955k910j939j676j567p86L89R75O86J60q7j77l27m59m27j91L17J017
52826B18953J396R15k22j157j397j257j205j177q37j24P24J453J899K023J934
$$ plain form
52811 221921 223670 225069 225870 226069 226118 226567 227558 228753 229612 229582 228256 225686 222491 219488 217202 215748
52795 215748 214893 214084 212724 210795 209021 208101 207982 208226 208798 209934 211377 212442 212950 213468 214416 215472
52779 215472 216221 216903 218052 219665 221213 222301 222899 222987 222407 221173 219651 218325 217542 217459 217952 218540 218680
52762 218680 218284 217794 217643 217854 218296 219003 219923 220573 220484 219987 220003 220861 221819 222151 222239 222961 224276 225205 225260 225119
52742 225119 225605 226637 227681 228749 230347 232689 235472 238279 240765 242585 243631 244237 244705 244720 243821 242501
52726 242501 242134 243503 245809 247497 247750 246872 245480 243817 241796 239343 236568 233756 231311 229600 228763
52711 228763 228656 229009 229648 230556 231695 232789 233416 233404 233014 232605 232252 231894 231706 232021 232872 233915 234851 235659
52693 235659 236337 236690 236588 236273 236200 236609 237348 238028 238291 238064 237649 237483 237736 238158 238359 238103 237344 236188 234901
$$ packed form
52811B21921J749J399Q01J99M9M49R91J195Q59l0j326k570l195l003k286j454
52795B15748q55q09j360j929j774r20j19K44N72J136J443J065N08N18R48J056
52779B15472P49O82J149J613J548J088N98Q8n80j234j522j326p83q3M93N88J40
52762B18680l96m90j51K11M42P07R20O50q9m97J6Q58R58L32Q8P22J315R29N5j41
52742B25119M86J032J044J068J598K342K783K807K486J820J046O06M68J5q99j320
52726B42501l67J369K306J688K53q78j392j663k021k453k775k812k445j711q37
52711B28763j07L53O39R08J139J094O27j2l90m09l53l58j88L15Q51J043R36Q08
52693B35659O78L53j02l15p3M09P39O80K63k27m15j66K53M22K01k56p59j156j287
$$ plain form
52674 234901 233779 232819 231684 230193 228793 228344 229330 231368 233510 234998 235723 236016 236147 236131 236036 236238 237127
52657 237127 238704 240675 242940 245649 248709 251588 253818 255436 256639 257221 256719 255143 253217 251759 251011
52642 251011 250633 250153 249287 247987 246448 245070 244213 243899 243862 243936 244327 245332 246929 248801 250766 252992 255664
52625 255664 258576 261169 262907 263530 263122 262024 260636 259140 257483 255712 254169 253229 252892 252831 252745 252475
52609 252475 251920 251119 250378 250002 249884 249700 249540 249974 251220 252576 253052 252448 251509 251025 251097 251338 251501 251707
52591 251707 252160 252900 253877 255110 256640 258329 259830 260795 261109 260939 260612 260435 260511 260735 261031 261560 262527 263722
52573 263722 264483 264284 263239 261916 260798 260051 259556 258958 257855 256262 254784 254002 253815 253698 253530 253650 254066
52556 254066 254119 253204 251551 250022 249298 249424 249908 250100 249660 248848 248187 247751 247055 245873 244885 245116 246838 249296
$$ packed form
52674B34901j122r60j135j491j400m49R86K038K142J488P25K93J31j6r5K02Q89
52657B37127J577J971K265K709L060K879K230J618J203N82n02j576j926j458p48
52642B51011l78m80q66j300j539j378q57l14l7P4L91J005J597J872J965K226K672
52625B55664K912K593J738O23m08j098j388j496j657j771j543r40l37o1q6k70
52609B52475n55q01p41l76j18j84j60M34J246J356M76o04r39m84P2K41J63K06
52591B51707M53P40R77J233J530J689J501R65L14j70l27j77P6K24K96N29R67J195
52573B63722P61j99j045j323j118p47m95n98j103j593j478p82j87j17j68J20M16
52556B54066N3r15j653j529p24J26M84J92m40q12o61m36o96j182r88K31J722K458
$$ plain form
52538 249296 251452 252671 252805 252105 251277 251247 252442 254336 255975 256967 257768 258956 260494 261875 262757 263175
52522 263175 263192 262760 261984 261235 260836 260839 261235 262076 263168 263974 264236 264594 266159 269433 273844 278308 282005 284702
52504 284702 286629 288083 288955 288685 286838 283584 279406 274587 269423 264696 261303 259343 258134 257208 256750
52489 256750 256895 257179 257077 256643 256243 255992 255834 255940 256586 257735 259052 260271 261359 262348 263200 263828 264187
52472 264187 264459 265046 266149 267420 268360 269107 270357 272400 274697 276704 278693 281394 285050 289157 292863
52457 292863 295376 296259 295708 294393 292741 290543 287469 283722 279912 276508 273728 271684 270225 268790 266877
52442 266877 264608 262571 261128 260132 259255 258357 257598 257313 257640 258185 258273 257704 256975 256623 256627 256680 256618 256298 255484
52423 255484 254310 253486 253601 254516 255841 257598 259819 261906 263183 263910 264981 266682 268540 270425 273057
$$ packed form
52538B49296K156J219J34p00q28l0J195J894J639R92Q01J188J538J381Q82M18
52522B63175J7m32p76p49l99LL96Q41J092Q06K62L58J565L274M411M464L697K697
52504B84702J927J454Q72k70j847l254m178m819n164m727l393j960j209r26m58
52489B56750J45K84j02m34m00k51j58J06O46J149J317J219J088R89Q52O28L59
52472B64187K72N87J103J271R40P47J250K043K297K007J989K701L656M107L706
52457B92863K513Q83n51j315j652k198l074l747l810l404k780k044j459j435j913
52442B66877k269k037j443r96q77q98p59k85L27N45Q8n69p29l52MN3o2l20q14
52423B55484j174q24J15R15J325J757K221K087J277P27J071J701J858J885K632
$$ plain form
52408 273057 277246 283287 291306 301503 313614 326498 338598 348533 355208 357874 356524 352021 345547
52395 345547 338036 330126 322360 315233 309169 304456 300973 298104 295270 292603 290729 289921 289823 289988 290205
52380 290205 290290 290046 289667 289763 290811 292863 295835 299613 303843 308105 312461 317318 322605 327621 331940 335838
52364 335838 339531 342546 344370 345208 345550 345378 344374 342664 340799 339215 338219 338266 339614 341707 343461 344243
52348 344243 344255 344045 344062 344641 345923 347612 349208 350646 352445 355140 358789 363195 368307 374146 380475 386858
52332 386858 393180 400020 408326 418578 430339 442759 455476 468849 483363 499166 516304 534943
52320 534943 555024 575906 596675 616710 635731 653535 670114 685961 701944 718794 736819
52309 736819 755883 775358 794283 812029 828834 845360 861775 877610 892496 906565 920009
$$ packed form
52408B73057M189O041Q019J0197J2111J2884J2100R935O675K666j350m503o474
52395C45547p511p910p766p127o064m713l483k869k834k667j874q08r8J65K17
52380B90205Q5k44l79R6J048K052K972L778M230M262M356M857N287N016M319L898
52364C35838L693L015J824Q38L42j72j004j710j865j584r96M7J348K093J754P82
52348C44243J2k10J7N79J282J689J596J438J799K695L649M406N112N839O329O383
52332C86858O322O840Q306J0252J1761J2420J2717J3373J4514J5803J7138J8639
52320E34943K0081K0882K0769K0035J9021J7804J6579J5847J5983J6850J8025
52309G36819J9064J9475J8925J7746J6805J6526J6415J5835J4886J4069J3444
$$ plain form
52298 920009 932726 944615 955831 966363 975559 982388 986109 986584 984155 979446 973114 965532 956773
52285 956773 947097 937250 928039 919729 912181 905500 900055 895805 892136 888714 886206 885734 887704 891513
52271 891513 896382 902172 909343 918371 929305 941617 954367 966692 978324 989571 1000835 1012314
52259 1012314 1024221 1036925 1050593 1064832 1078932 1092446 1105487 1118586 1132305 1146648 1160583
52248 1160583 1172375 1180786 1185816 1188064 1187598 1183916 1176917 1167378 1156424 1144920 1133403 1122062 1110620
52235 1110620 1098609 1086022 1073400 1061138 1049052 1036852 1024655 1012747 1001192 990007 979488
52224 979488 969983 961527 954026 947668 942756 939208 936568 934529 933170 932681 933119 934440 936513 939047 941719
52209 941719 944439 947367 950617 954055 957433 960602 963602 966671 970171 974354 979098 983933 988461 992759
$$ packed form
52298I20009J2717J1889J1216J0532R196O829L721M75k429m709o332p582q759
52285I56773r676r847r211q310p548o681n445m250l669l422k508m72J970L809
52271H91513M869N790P171R028J0934J2312J2750J2325J1632J1247J1264J1479
52259A012314J1907J2704J3668J4239J4100J3514J3041J3099J3719J4343J3935
52248A160583J1792Q411N030K248m66l682o999r539j0954j1504j1517j1341j1442
52235A110620j2011j2587j2622j2262j2086j2200j2197j1908j1555j1185j0519
52224I79488r505q456p501o358m912l548k640k039j359m89M38J321K073K534K672
52209I41719K720K928L250L438L378L169L000L069L500M183M744M835M528M298
$$ plain form
52195 992759 997289 1002325 1007489 1012050 1015806 1019512 1024148 1029758 1035342 1039968 1043664 1046976 1049886 1051521
52181 1051521 1050870 1047545 1041886 1034555 1026131 1016939 1007158 997019 986923 977384 968910 961858 956262 951801
52167 951801 948141 945345 943747 943404 943934 945044 946972 950194 954799 960269 965769 970526 974136 976635 978215
52152 978215 978847 978399 977182 976048 975705 976181 977191 978725 980924 983552 986048 988076 989729 991221 992645
52137 992645 993935 994804 994769 993652 992111 991418 992604 995978 1001512 1009423 1020243 1034379 1051661 1071323
52123 1071323 1092587 1115351 1140153 1167264 1196037 1225447 1255064 1285032 1315200 1344742 1372818
52112 1372818 1399155 1423802 1446605 1467230 1485505 1501505 1515411 1527405 1537601 1545980 1552493 1557292
52100 1557292 1560690 1562856 1563752 1563501 1562475 1560788 1557861 1552833 1545258 1535154 1522426 1506742 1488183
$$ packed form
52195I92759M530N036N164M561L756L706M636N610N584M626L696L312K910J635
52181A051521o51l325n659p331q424r192r781j0139j0096r539q474p052n596m461
52167I51801l660k796j598l43N30J110J928L222M605N470N500M757L610K499J580
52152I78215O32m48j217j134l43M76J010J534K199K628K496K028J653J492J424
52137I92645J290Q69l5j117j541o93J186L374N534P911J0820J4136J7282J9662
52123A071323K1264K2764K4802K7111K8773K9410K9617K9968L0168K9542K8076
52112A372818K6337K4647K2803K0625J8275J6000J3906J1994J0196Q379O513M799
52100A557292L398K166Q96k51j026j687k927n028p575j0104j2728j5684j8559
$$ plain form
52087 1488183 1467715 1446692 1425963 1405725 1386205 1368148 1352475 1339568 1329063 1320259 1312652 1306213
52075 1306213 1301378 1298754 1298681 1301077 1305754 1312779 1322289 1334051 1347461 1361969 1377186 1392524 1407143
52062 1407143 1420569 1433215 1446022 1459587 1473688 1487495 1500122 1511167 1520947 1530150 1539095 1547337
52050 1547337 1554008 1558418 1560291 1559608 1556336 1550181 1540582 1527168 1510308 1490943 1469836 1447356 1424095
52037 1424095 1401176 1379501 1358982 1338937 1319091 1299838 1281743 1265180 1250355 1237203 1225242
$$ packed form
52087A488183k0468k1023k0729k0238j9520j8057j5673j2907j0505q804p607o439
52075A306213m835k624p3K396M677P025R510J1762J3410J4508J5217J5338J4619
52062A407143J3426J2646J2807J3565J4101J3807J2627J1045R780R203Q945Q242
52050A547337O671M410J873o83l272o155r599j3414j6860j9365k1107k2480k3261
52037A424095k2919k1675k0519k0045j9846j9253j8095j6563j4825j3152j1961
$$ [...]
##END NTUPLES=NMR SPECTRUM
##END=
