##TITLE=AC1577_ROEFFECT0023_8271217_zpPn0vTOOk
##JCAMPDX= 6.0         $$ Bruker NMR JCAMP-DX V2.0
##DATA TYPE= NMR SPECTRUM
##DATA CLASS= NTUPLES
##ORIGIN= BRUKER
##OWNER= Administrator
$$ 1.72 TOPSPIN		Version 2.1
$$ 2013-10-18 21:37:02.251 -0700  Administrator@X
$$ Compression mode = diff/dup
##.OBSERVE FREQUENCY= 400.02188249412
##.OBSERVE NUCLEUS= ^1H
##.ACQUISITION MODE= SIMULTANEOUS (DQD)
##.ACQUISITION SCHEME= undefined
##.AVERAGES= 8
##.DIGITISER RES= 22
##SPECTROMETER/DATA SYSTEM= spect
##.PULSE SEQUENCE= zg30
##.SOLVENT NAME= COFFEE_meoh
##.SHIFT REFERENCE= INTERNAL, COFFEE_meoh, 1, 14.98509
##AUDIT TRAIL= $$ (NUMBER, WHEN, WHO, WHERE, PROCESS, VERSION, WHAT)
$$ ##TITLE= Audit trail, TOPSPIN		Version 2.1
$$ ##JCAMPDX= 5.01
$$ ##ORIGIN= Bruker BioSpin GmbH
$$ ##OWNER= Administrator
$$ $$ E:\/data/COFFEE/nmr/AC1577_ROEFFECT0023_8271217_zpPn0vTOOk/10/pdata/1/auditp.txt
$$ ##AUDIT TRAIL=  $$ (NUMBER, WHEN, WHO, WHERE, PROCESS, VERSION, WHAT)
(   1,<2013-10-18 21:36:55.360 -0700>,<Administrator>,<X>,<go>,<TOPSPIN 2.1>,
      <created by zg
	started at 2013-10-18 21:35:49.470 -0700,
	POWCHK enabled, PULCHK disabled,
       configuration hash MD5:
       C8 4E 4E 5D D3 5C D8 9E 9F 52 82 E0 59 8A DE 15
       data hash MD5: 64K
       B8 6C 2B 22 86 84 58 B3 EC C2 91 03 95 C6 2C CC>)
(   2,<2013-10-18 21:36:58.360 -0700>,<Administrator>,<X>,<proc1d>,<TOPSPIN 2.1>,
      <Start of raw data processing
       efp LB = 0 FT_mod = 6 PKNL = 1 PHC0 = 0 PHC1 = 0 SI = 32K 
       data hash MD5: 32K
       19 A1 65 4F 3B AD 9E 55 99 32 D9 14 43 9E 98 2F>)
(   3,<2013-10-18 21:36:58.688 -0700>,<Administrator>,<X>,<proc1d>,<TOPSPIN 2.1>,
      <pk PHC0 = 91.59302 PHC1 = 0 
       data hash MD5: 32K
       6D 57 D9 D6 99 CE D4 7B 72 FF DA 98 C5 EA 9A 41>)
(   4,<2013-10-18 21:36:58.876 -0700>,<Administrator>,<X>,<proc1d>,<TOPSPIN 2.1>,
      <abs ABSG = 1 
       data hash MD5: 32K
       CA 56 9C 83 C5 B5 E6 0D BB EE D5 75 FD E0 BC 21>)
(   5,<2013-10-18 21:36:59.048 -0700>,<Administrator>,<X>,<proc1d>,<TOPSPIN 2.1>,
      <abs ABSG = 2 
       data hash MD5: 32K
       21 F6 94 89 B7 81 E4 65 C0 0C 8D 12 8D 06 C6 FB>)
(   6,<2013-10-18 21:36:59.095 -0700>,<Administrator>,<X>,<proc1d>,<TOPSPIN 2.1>,
      <abs ABSG = 3 
       data hash MD5: 32K
       8D E2 26 8C 19 83 A8 E8 0A FB 2C B4 35 8B 43 26>)
(   7,<2013-10-18 21:36:59.157 -0700>,<Administrator>,<X>,<proc1d>,<TOPSPIN 2.1>,
      <abs ABSG = 4 
       data hash MD5: 32K
       E1 7F 29 DF 4F 93 7F 9F 28 F2 E0 96 A2 7E 20 AC>)
(   8,<2013-10-18 21:36:59.235 -0700>,<Administrator>,<X>,<proc1d>,<TOPSPIN 2.1>,
      <abs ABSG = 5 
       data hash MD5: 32K
       4F 08 E3 5E D8 3D A5 77 00 64 D3 88 C5 EF F6 12>)
$$ ##END=
$$ 
$$ $$ hash MD5
$$ $$ E2 3D 5B 7B 29 24 68 CB 94 82 79 27 7E 65 B1 D9
##$RELAX= 
##$RELAX= 
##$RELAX= 
##$RELAX= 
##$RELAX= 
##$RELAX= 
##$RELAX= 
$$ Bruker specific parameters
$$ --------------------------
##$DU= <E:\>
##$EXPNO= 10
$$ [...]
150 150 150 150 150 150 150 150
##$TP07= 0
##$TPNAME0= <>
##$TPNAME1= <>
##$TPNAME2= <>
##$TPNAME3= <>
##$TPNAME4= <>
##$TPNAME5= <>
##$TPNAME6= <>
##$TPNAME7= <>
##$TPOAL= (0..7)
0.5 0.5 0.5 0.5 0.5 0.5 0.5 0.5
##$TPOFFS= (0..7)
0 0 0 0 0 0 0 0
##$TUNHIN= 0
##$TUNHOUT= 0
##$TUNXOUT= 0
##$USERA1= <user>
##$USERA2= <user>
##$USERA3= <user>
##$USERA4= <user>
##$USERA5= <user>
##$V9= 5
##$VALIST= <valist>
##$VCLIST= <CCCCCCCCCCCCCCC>
##$VD= 0
##$VDLIST= <DDDDDDDDDDDDDDD>
##$VPLIST= <PPPPPPPPPPPPPPP>
##$VTLIST= <TTTTTTTTTTTTTTT>
##$WBST= 1024
##$WBSW= 4
##$XGAIN= (0..3)
0 0 0 0
##$XL= 0
##$YL= 0
##$YMAX_a= 595027
##$YMIN_a= -509871
##$ZGOPTNS= <>
##$ZL1= 120
##$ZL2= 120
##$ZL3= 120
##$ZL4= 120
##$ABSF1= 14.98509
##$ABSF2= -5.573092
##$ABSG= 5
##$ABSL= 3
##$ALPHA= 0
##$AQORDER= 0
##$ASSFAC= 0
##$ASSFACI= 0
##$ASSFACX= 0
##$ASSWID= 0
##$AUNMP= <proc_prof1d_extract_pilot.lims>
##$AXLEFT= 0
##$AXNAME= <>
##$AXNUC= <1H>
##$AXRIGHT= 0
##$AXTYPE= 0
##$AXUNIT= <>
##$AZFE= 0.1
##$AZFW= 0.1
##$BCFW= 0
##$BC_mod= 0
##$BYTORDP= 0
##$COROFFS= 0
##$CY= 15
##$DATMOD= 1
##$DC= 0
##$DFILT= <>
##$DTYPP= 0
##$F1P= 0
##$F2P= 0
##$FCOR= 0.5
##$FTSIZE= 32768
##$FT_mod= 6
##$GAMMA= 0
##$GB= 0
##$INTBC= 1
##$INTSCL= 1
##$ISEN= 128
##$LB= 0
##$LEV0= 0
##$LPBIN= 0
##$MAXI= 10000
##$MC2= 0
##$MEAN= 0
##$ME_mod= 0
##$MI= 0
##$NCOEF= 0
##$NC_proc= -8
##$NLEV= 6
##$NOISF1= 0
##$NOISF2= 0
##$NSP= 0
##$NTH_PI= 0
##$NZP= 0
##$OFFSET= 14.98509
##$PC= 1
##$PHC0= 91.59302
##$PHC1= 0
##$PH_mod= 1
##$PKNL= yes
##$PPARMOD= 0
##$PPDIAG= 0
##$PPIPTYP= 0
##$PPMPNUM= 2147483647
##$PPRESOL= 1
##$PSCAL= 4
##$PSIGN= 0
##$PYNMP= <proc.py>
##$REVERSE= no
##$SF= 400.02
##$SI= 32768
##$SIGF1= 0
##$SIGF2= 0
##$SINO= 400
##$SIOLD= 32768
##$SPECTYP= <>
##$SREGLST= <1H.CDCl3>
##$SSB= 0
##$STSI= 32768
##$STSR= 0
##$SW_p= 8223.68421052631
##$SYMM= 0
##$S_DEV= 0
##$TDeff= 65536
##$TDoff= 0
##$TI= <>
##$TILT= no
##$TM1= 0
##$TM2= 0
##$TOPLEV= 0
##$USERP1= <user>
##$USERP2= <user>
##$USERP3= <user>
##$USERP4= <user>
##$USERP5= <user>
##$WDW= 1
##$XDIM= 32768
##$YMAX_p= 445221072
##$YMIN_p= -678453
##$CURPLOT= <Network HP LaserJet P1505>
##$CURPRIN= <$Network HP LaserJet P1505>
##$DFORMAT= <normdp>
##$LAYOUT= <+/1D_H.xwp>
##$LFORMAT= <normlp>
##$PFORMAT= <normpl>
##$SURQMSG= 1
$$ End of Bruker specific parameters
$$ ---------------------------------
##NTUPLES= NMR SPECTRUM
##VAR_NAME=  FREQUENCY,     SPECTRUM/REAL,   SPECTRUM/IMAG
##SYMBOL=    X,             R,               I
##VAR_TYPE=  INDEPENDENT,   DEPENDENT,       DEPENDENT
##VAR_FORM=  AFFN,          ASDF,            ASDF
##VAR_DIM=   32768,         32768,           32768
##UNITS=     HZ,            ARBITRARY UNITS, ARBITRARY UNITS
##FACTOR=    0.250966925370066, 1,           1
##FIRST=     8223.43324360094, -135101,      -88677
##LAST=      0,             -67968,          -149107
##MIN=       0,             -678453,         0
##MAX=       8223.43324360094, 445221072,    0
$$ Real data points
##PAGE= N=1
##DATA TABLE= (X++(R..R)), XYDATA
$$ [...]
$$ plain form
19552 69494 -120594 179178 -289220 65973 -160933 -170686 -298826 -6228 251765 49869 -552541
19540 -183035 -186179 -110729 104199 -244344 302389 -322659 62940 -132345 -378267 -240792
19530 -240792 -89710 104615 -78260 -357053 -33674 215505 -307819 71064 -146859 130335
19519 95381 53658 -236779 -122541 -70889 311943 -202025 273652 -78820 -199869 -81938
19508 6828 -241069 -52382 57446 -71535 -370048 -297556 -401796 -22934 -35731 12557 -131077
19496 -85078 -241700 111744 -114333 -10503 80795 -106414 -48989 248909 -419864 -114907
19485 2893 -216047 -322376 -114525 -168640 -100198 -235921 104663 103625 8533 31379 -105954
19473 -4376 -25913 -271187 98978 28872 -83040 118926 271388 356120 192787 98693 239747
$$ packed form
19552F9494a20594A79178b89220F5973a60933r753j28140f228B51765D9869e52541
19540a83035l144P5450A04199b44344C02389c22659F2940a32345k45922J37475
19530b40792h9710A04615g8260k78793c3674B15505c07819G1064a46859A30335
19519I5381m1723b36779J14238N1652C11943b02025B73652g8820j21049h1938
19508F828b41069e2382E7446g1535k98513P2492j04240b2934j2797A2557a31077
19496h5078j56622A11744a14333a0503H0795a06414d8989B48909d19864a14907
19485B893b16047j06329a14525n4115O8442j35723A04663j038H533K2846a05954
19473d376k1537k45274I8978B8872h3040A18926J52462Q4732j63333r4094J41054
$$ plain form
19462 239747 -243976 -137572 91403 -254398 -394637 -141378 -65221 155616 -78661 -39496
19452 -39496 58763 95415 -119258 66691 -161471 193470 -359984 -135092 238841 -122398
19441 -13402 179816 132981 -166292 -150566 42444 -104323 -285757 -358922 -133171 -212460 -87213
19429 -62429 12833 30319 -268354 214717 251837 -41247 244826 -50770 -326938 -79197 -198317
19418 -198317 33581 -84858 -100781 -101423 93228 -196313 -24943 161942 104236 35916 -57152
19406 45877 -16453 -7460 -39664 313546 17228 -263841 382765 -73215 -28089 -27897 -221040
19395 -221040 -292026 -313884 -347282 -145872 7219 -374025 -154330 -262294 -247690 -324461 -146220
19383 88825 124117 -156354 -50038 -246556 -603705 52093 -109940 34213 3493 -176807 220711
$$ packed form
19462B39747b43976J06404I1403b54398j40239a41378f5221A55616g8661L9165
19452c9496E8763L6652a19258F6691a61471A93470c59984a35092B38841a22398
19441a3402A79816m6835a66292J5726D2444a04323j81434p3165a33171p9289h7213
19429f2429A2833J7486b68354B14717L7120d1247B44826e0770k76168g9197j19120
19418a98317C3581h4858j5923o42I3228a96313b4943A61942n7706C5916e7152
19406D5877a6453g460l2204C13546A7228b63841C82765g3215b8089J92j93143
19395b21040p0986k1858l3398a45872G219c74025a54330j07964J4604p6771a46220
19383H8825L5292a56354e0038j96518l57149E2093a09940C4213C493a76807B20711
$$ plain form
19371 -118914 -181891 -344782 -287893 -65924 -180614 -354554 -179577 29955 82761 199365
19361 199365 -10541 187506 -57309 -144602 36509 50464 -63018 -91455 -245249 -32191 -346437
19350 -346437 14070 197090 -376416 190968 24070 109180 -119056 55925 58353 142846 -257540
19338 -5254 10361 150469 -139897 -142276 -423099 41066 -220171 -16787 -129861 -106758 -71035
19327 -71035 -194076 -164113 -131601 -12838 9175 156107 -230007 23974 -144806 -446810 -256112
19316 -256112 -174349 151694 49045 -238815 -304943 -82379 113463 -51350 26635 20404 47392
19305 47392 114075 -147742 -61779 -55692 -38657 -7003 -181406 68618 -126973 -112351 30320
19293 44774 31923 -270698 -2835 39786 -267761 113035 -38106 101242 167714 384784 -167704
$$ packed form
19371a18914o2977j62891N6889f5924j14690j73940J74977B9955N2806J16604
19361A99365a0541A87506e7309q7293C6509J3955f3018k8437j53794c2191l14246
19350c46437A4070J83020c76416A90968B4070Q5110a19056E5925K428Q4493b57540
19338e254A0361J40108a39897k379k80823D1066b20171a6787j13074K3103L5723
19327g1035j23041K9963L2512a2838I175J46932b30007B3974a44806l02004J90698
19316b56112Q1763A51694D9045b38815o6128h2379A13463e1350B6635o231K6988
19305D7392O6683a47742f1779O087J7035g003j74403F8618a26973J4622C0320
19293D4774j2851b70698b835C9786b67761A13035c8106A01242O6472K17070a67704
$$ plain form
19281 -278880 -89260 86746 182211 -11574 -220129 -76594 -19454 -141582 19652 61248 -110053
19269 -95145 -46288 -128837 33246 162441 33678 -194988 38836 86056 211241 -140198 27240
19257 -14925 -230754 -239577 -96862 -228595 -363616 171032 87066 74382 -225448 -119478 146118
19245 -194776 66421 92626 -50692 -97350 -46154 17175 -41958 105631 -43471 -81487 -124230
19234 -124230 -172366 287802 -122036 -41920 -69108 162891 -250853 77851 -70512 72280 10487
19222 -97873 51928 -11211 -252758 -104104 -288562 -181338 -116953 -121837 -210232 -36161 287982
19210 -260070 -240813 53695 -246451 36555 -64730 -103135 -165672 -130443 90448 -161341 238016
19198 -152768 113969 -35402 -164900 33462 51981 -236218 -110482 13932 -177125 -11121
$$ packed form
19281b78880h9260H6746R5465a1574k08555g6594a9454j22128A9652M1596a10053
19269i5145d6288q2549C3246J29195C3678a94988C8836M7220J25185a40198B7240
19257a4925k15829q823i6862j31733j35021A71032q3966j2684b25448J05970A46118
19245a94776F6421K6205e0692m6658d6154A7175d1958A05631d3471l8016m2743
19234a24230m8136B87802a22036d1920k7188A62891b50853G7851g0512G2280A0487
19222i7873E1928a1211k41547a04104j84458J07224O4385m884q8395c6161B87982
19210b60070J9257E3695b46451C6555f4730l8405o2537L5229I0448a61341B38016
19198a52768A13969c5402j29498C3462J8519b36218a10482A3932a77125a1121
$$ plain form
19187 -296774 160457 -55184 -107712 -189038 10537 9678 -143598 82558 -181216 76073 5373
19175 284967 -306264 82739 -89046 219926 -312552 341277 72402 -264095 -144304 -192961
19165 -192961 255046 313441 -230358 44197 33442 24173 -418925 140764 -88860 -263839 -117469
19153 -53030 47965 -123621 -2538 -276552 -35496 390156 -423927 223767 -135671 -280086
19143 -280086 -60722 -279456 -408576 -149857 161605 -31171 -71065 55845 43189 -26722 -407056
19132 -407056 -124576 156048 48745 -318943 -161232 -117875 -40517 155008 -335478 152627
19121 238911 -231419 -30554 -97229 171112 229452 -143281 72361 10977 -66573 -147090 -178902
19110 -178902 -139931 -54726 148616 -235968 285208 79566 273288 -1593 -332327 64118 -14373
$$ packed form
19187b96774A60457e5184n2528q1326A0537q59a43598H2558a81216G6073E373
19175B84967c06264H2739h9046B19926c12552C41277G2402b64095J19791m8657
19165a92961B55046N8395b30358D4197j0755r269d18925A40764h8860j74979a17469
19153e3030D7965a23621b538k74014c5496C90156d23927B23767a35671j44415
19143b80086f0722k18734j29120a49857A61605c1171l9894E5845j2656b6722l80334
19132d07056a24576A56048D8745c18943J57711M3357d0517A55008c35478A52627
19121B38911b31419c0554o6675A71112N8340a43281G2361A0977f6573q0517l1812
19110a78902L8971e4726A48616b35968B85208G9566J93722a593l30734F4118a4373
$$ plain form
19098 -150505 33355 264208 -120234 239507 -34594 -226743 -164775 -225236 48930 81471 154243
19087 154243 -95443 -265214 -60361 43336 274288 232045 -118573 344165 151621 17955
19076 -165969 -99599 89925 -469220 236687 -249590 -328607 -125154 191253 -24129 -89512
19066 -89512 -222150 358725 203175 -101578 -233381 208490 -243192 -374235 -273988 9671
19055 -108903 -225885 -73028 -85138 59292 -326175 146783 155094 50674 177724 -149202 -234720
19044 -234720 -156901 183028 -429773 -49478 160868 -295462 -161132 -62994 -422491 251790
19033 264221 100926 562944 -26012 216617 -149409 -194791 154498 -123102 -4583 -63151
19023 -63151 159442 -35048 -2537 245827 -351086 -185306 48550 -92209 -211781 -144506 -91775
$$ packed form
19098a50505C3355K30853a20234B39507c4594j92149O1968o0461D8930L2541P2772
19087A54243i5443j69771f0361D3336K30952m2243a18573C44165A51621A7955
19076a65969O6370H9925d69220B36687b49590p9017a25154A91253b4129o5383
19066h9512j32638C58725j55550a01578j31803B08490b43192j31043J00247I671
19055a08903j16982g3028j2110E9292c26175A46783Q311E0674J27050a49202q5518
19044b34720P7819A83028d29773d9478A60868b95462J34330f2994l59497B51790
19033B64221A00926M62018b6012B16617a49409m5382A54498a23102d583n8568
19023f3151A59442c5048b537B45827c51086J65780D8550i2209j19572O7275N2731
$$ plain form
19012 -91775 -14332 138051 -34007 71843 344413 200721 -43800 -201187 200710 66255 94755
19001 94755 73256 -219947 -77025 -232488 -135440 -155155 -222764 34805 -44137 -65136 -260756
18990 -260756 69699 -300957 -188192 11831 390695 79955 102733 240080 -111086 115254
18979 103767 132044 -46969 -51917 -282742 -363439 -116604 135588 265707 82940 60658 -58669
18967 120892 32161 233727 299201 -250779 -29210 -123474 -215784 -145878 -297716 -278642 -170116
18956 -170116 121387 -148581 262913 91327 53054 -174283 165919 -3401 -20272 44917 43876
18945 43876 384071 -113078 -271836 -89347 -136743 163757 -164955 -294905 -142121 -344655
18935 -344655 33820 -153708 -248903 -40552 80550 455457 -46764 168396 65220 209158 203026
$$ packed form
19012i1775a4332A38051c4007G1843K72570j43692d3800j57387B00710F6255K8500
19001I4755k1499b19947g7025j55463R7048j9715o7609C4805d4137k0999j95620
18990b60756F9699c00957J12765A1831L78864G9955K2778J37347a11086A15254
18979A03767K8277d6969m948k30825q0697a16604A35588J30119H2940k2282e8669
18967A20892C2161K01566O5474b50779b9210r4264r2310O9906j51838J9074J08526
18956a70116A21387a48581B62913I1327l8273a74283A65919c401j6871D4917j041
18945D3876L40195a13078j58758h9347m7396A63757a64955j29950a42121k02534
18935c44655C3820a53708r5195d0552H0550L74907d6764A68396F5220J43938o132
$$ plain form
18924 203026 -246689 -182413 78175 -340400 -162432 -61758 1432 -96514 38899 -56893 -238416
18913 -238416 101055 -212275 -102212 3978 -102071 23691 -41420 208982 -50035 -106156 5374
18901 205049 -197764 139846 -193607 147575 -196466 201432 -133476 32245 -243875 -15967
18890 -286669 216123 179733 -6623 -183970 194611 54070 -453215 -101062 88224 -75268 126993
18878 161539 -130280 -39055 -106476 14011 203703 -139014 -65443 -253032 -631182 -223070
18867 30036 -95299 -229830 28584 -7409 -335510 -270149 -88241 -102434 -266508 54529 -86854
18855 80954 -67148 -121965 268743 -84416 -2482 -265727 -20854 130740 30796 -33426 265690
18843 -13341 177035 -39302 -252414 -133704 -184768 118050 -245285 -92512 -166232 830 -41292
$$ packed form
18924B03026b46689O4276G8175c40400a62432f1758A432i6514C8899e6893j81523
18913b38416A01055b12275a02212C978a02071B3691d1420B08982e0035n6121E374
18901B05049a97764A39846a93607A47575a96466B01432a33476C2245b43875a5967
18890b86669B16123l6390f623j77347A94611E4070d53215a01062H8224g5268A26993
18878A61539a30280c9055o7421A4011J89692a39014f5443j87589l78150b23070
18867C0036i5299j34531B8584g409l28101O5361h8241j4193j64074E4529h6854
18855H0954f7148n4817B68743h4416b482k63245b0854A30740C0796c3426B65690
18843a3341A77035c9302k13112J18710n1064A18050b45285i2512p3720H30d1292
$$ plain form
18831 -330142 -216577 19772 132213 26470 -80453 83407 -247169 -5110 -350845 181757 -219914
18819 -41297 -62042 157042 16460 307597 501994 -63214 518997 324687 -63185 179637
18808 14507 126161 -27522 -68890 9336 108989 -71310 -2384 -19951 -237895 -50450 -402129
18797 -402129 -49276 -105760 -353347 144534 287170 -188157 98708 -225079 -40883 151576
18786 179785 -173954 -325118 15085 332899 -244923 107540 23132 23055 -83902 10508 146241
18775 146241 62734 -421133 -86987 58467 -205863 -242491 111515 -124617 -265658 51821
18764 -139045 -110339 -51370 289243 127446 -290563 196544 -63728 -11026 8899 34325 -318506
18752 -212815 160230 -188986 -16084 42669 183962 -290447 42446 -167944 148177 246154
$$ packed form
18831c30142J13565A9772J12441B6470h0453H3407b47169e110l45735A81757b19914
18819d1297k0745A57042A6460K91137J94397f3214E18997j94310f3185A79637
18808A4507J11654b7522m1368I336R9653g1310b384j7567k17944e0450l51679
18797d02129d9276n6484k47587A44534J42636a88157I8708b25079d0883A51576
18786A79785a73954j51164A5085L17814b44923A07540B3132p7h3902A0508J35733
18775A46241F2734d21133h6987E8467b05863l6628A11515a24617j41041E1821
18764a39045K8706e1370B89243A27446b90563A96544f3728a1026H899K5426c18506
18752b12815A60230a88986a6084D2669J41293b90447D2446a67944A48177R7977
$$ plain form
18742 246154 -138344 281467 -110720 -173232 -308420 175020 -363227 -38315 177484 38278
18731 -219254 38707 -183197 148902 30759 125403 -245560 155791 -64455 -115880 3349 -193208
18719 -192802 -171831 -405119 108594 -464196 259648 -143879 24700 64736 -30162 82870
18708 -249071 24347 172071 -168195 -251995 6566 -25713 -139667 -156057 -178031 -15270 -21531
18697 -21531 -170283 -48568 -222470 -274559 153021 99497 -408775 -148102 -40167 93681 24451
18685 -68502 -251551 74592 -63742 52110 -285475 -210639 221297 -123641 -175334 307944 46448
18673 -442190 133232 -51449 -225794 -124948 -147030 -68990 87596 -238498 139033 -28474
18662 -95412 -338067 159896 161423 -199246 -55899 13061 -65207 -40745 -64104 -6328 14437
$$ packed form
18742B46154a38344B81467a10720o2512j35188A75020c63227c8315A77484C8278
18731b19254C8707a83197A48902C0759R4644b45560A55791f4455n1425C349a93208
18719a92802K0971k33288A08594d64196B59648a43879B4700M0036c0162H2870
18708b49071B4347J47724a68195q3800F566b5713j13954j6390k1974a5270o261
18697b1531j48752d8568j73902n2089A53021n3524d08775a48102d0167I3681B4451
18685f8502j83049G4592f3742E2110b85475P4836B21297a23641n1693C07944D6448
18673d42190A33232e1449j74345J00846k2082f8990H7596b38498A39033b8474
18662i5412k42655A59896J527a99246e5899A3061f5207K4462k3359f328A4437
$$ plain form
18650 -20797 221868 -2752 215619 -245809 -397748 -362068 -61491 -168820 -208793 -11914 -15078
18639 -15078 236641 -125164 -265 -169699 -136438 -110625 -107231 -30129 -73955 -57338 46550 214010
18627 214010 -24436 377432 88455 120454 -48256 -204867 -195249 31291 -176445 -28530 -211023
18616 -211023 -58889 11805 20320 -286302 -78775 120207 101731 42190 122437 115349 19214
18604 -127344 241306 -217250 74563 70095 -167429 -158313 218430 94406 70937 387800 -64650
18592 4662 16824 67800 309157 62415 128728 -198213 -328451 -214984 184714 68296 -178357
18580 -316427 178725 -120076 -129232 -57152 -117147 269318 -194075 73914 -235502 -220575 -70633
18568 -341121 278196 -252218 102971 -214516 -60205 -346057 96945 -80579 -251013 32450
$$ packed form
18650b0797B21868b752B15619b45809j51939L5680f1491j07329l9973a1914l164
18639a5078B36641a25164b65j69434L3261K5813L394c0129m3826J6617D6550J67460
18627B14010b4436C77432H8455L1999d8256j56611R618C1291a76445b8530j82493
18616b11023e8889A1805Q515b86302g8775A20207j8476D2190Q0247p088A9214
18604a27344B41306b17250G4563m468a67429R116B18430I4406k3469L16863f4650
18592D662J2162N0976K41357F2415O6313a98213j30238J13467A84714F8296a78357
18580c16427A78725a20076r156e7152n9995B69318a94075G3914b35502J4927g0633
18568c41121B78196b52218A02971b14516f0205k85852I6945h0579j70434C2450
$$ plain form
18557 24391 -6932 -67824 107431 191265 47225 -53476 -73398 -286948 -85414 50203 -98429
18545 -61223 -43220 427692 245834 -359013 -77070 -94475 -116230 189214 206500 -161445 -295003
18534 -295003 -39313 -86972 177116 -131003 188906 28289 -79504 -178236 -112869 -163229 54686
18522 -20525 -103547 15886 237608 -38447 -408032 -133557 -143337 -201928 -42786 -47853 27836
18510 105577 -170586 151688 73257 -735 -78225 -56297 -140928 -136550 -180681 -443478 -273255
18499 -273255 -113198 -29481 189875 -250783 -72122 -180341 144909 -188921 18427 -4432
18488 -439654 -89289 -195480 -31309 -102705 214230 17596 -158399 212324 -43943 -80111 199106
18476 -72769 -53618 78843 -137188 81778 -391973 296698 -191100 149984 -37104 197430
$$ packed form
18557B4391f932o0892A07431Q3834D7225e3476j9922k13550h5414E0203i8429
18545f1223J8003D27692j81858c59013g7070j7405k1755A89214J7286a61445j33558
18534b95003c9313m7659A77116a31003A88906B8289g9504r8732O5367n0360E4686
18522b0525q3022A5886K21722c8447l69585a33557r780n8591d2786n067B7836
18510A05577a70586A51688G3257g35p7490K1928q4631M378m4131k62797J70223
18499b73255a13198b9481A89875b50783g2122j08219A44909a88921A8427d432
18488d39654h9289j06191c1309p1396B14230A7596a58399B12324d3943l6168A99106
18476g2769J9151G8843a37188H1778c91973B96698a91100A49984c7104A97430
$$ plain form
18465 48870 131637 -279027 -196527 6343 -324673 -22909 -104300 138631 -385209 -7209 -308483
18454 -308483 251648 -302425 -114283 131852 -146648 -132953 225309 125521 -99968 -51416
18444 -51416 -303978 12814 131684 -43269 143410 -122389 -379637 -288307 148652 -400855
18433 13124 -28165 -19213 -202118 -388242 129574 -112424 161234 -203761 27315 -24989 -6359
18421 -252496 -181197 85038 256044 105331 -30116 -121362 10164 11644 -81926 49034 -48499
18409 -137031 40773 -9901 -93963 -111230 -34837 -73124 99979 7857 -241812 -32258 -214466
18398 -214466 11264 217310 -92809 -39574 -158857 244706 134140 289846 -91600 196839
18387 -117405 -41643 -45304 17403 -68779 -217269 -226664 242301 -371576 -101825 79203 -56033
$$ packed form
18465D8870Q2767b79027Q2500F343c24673b2909q1391A38631c85209g209l01274
18454c08483B51648c02425a14283A31852a46648J3695B25309r9788i9968M8552
18444e1416k52562A2814J18870d3269A43410a22389k57248R1330A48652d00855
18433A3124b8165Q952j82905j86124A29574a12424A61234b03761B7315b4989f359
18421b52496P1299H5038J71006A05331c0116r1246A0164J480h1926D9034d8499
18409a37031D0773i901q4062j7267c4837l8287I9979G857b41812c2258j82208
18398b14466A1264K06046i2809c9574j19283B44706j10566J55706i1600A96839
18387a17405d1643l661A7403f8779j48490r395B42301c71576a01825G9203e6033
$$ plain form
18375 -124289 301018 64188 133766 -115946 111519 -62873 -96216 47527 63156 -100003 -183547
18364 -183547 17220 -38678 166402 176831 -333760 -125399 -18171 471700 -323100 -68782
18353 -35900 -102493 -191367 210546 174689 180316 -173427 -198445 70070 -256860 -150434 229576
18341 98632 -236676 -208771 -119679 -351595 26590 -65701 194687 122274 -16892 -173698 122398
18329 -135634 -156467 254760 -98285 -200680 -240714 -419962 -39444 53088 -153852 6657 -6268
18317 -65214 -71574 -241209 61087 4482 -188823 -70672 -65486 -51243 -14947 -262336 58940 -123655
18304 4771 -391026 -30476 -40786 55122 57831 -341170 -55267 -82335 -159710 -64971 -5512 17095
18291 -104974 -228638 -79150 -188860 51111 -39740 152951 -58494 141211 -12885 -160356
$$ packed form
18375a24289C01018F4188O9578a15946A11519f2873l3343D7527J5629a00003q3544
18364a83547A7220c8678A66402J0429c33760a25399a8171D71700c23100f8782
18353c5900o6593q8874B10546l5857N627a73427k5018G0070b56860J06426B29576
18341I8632b36676K7905Q9092k31916B6590f5701A94687p2413a6892j56806A22398
18329a35634k0833B54760i8285j02395m0034j79248c9444E3088a53852F657f268
18317f5214o360j69635F1087D482a88823g0672N186J4243a4947k47389E8940a23655
18304D771c91026c0476j0310E5122K709c41170e5267k7068p7375f4971e512A7095
18291a04974j23664g9150j09710E1111c9740A52951e8494A41211a2885j47471
$$ plain form
18281 -160356 88596 -161622 226731 -266617 -28177 186746 -40763 250945 3638 77351 202976
18270 202976 24838 -13906 -43058 31796 -46912 212679 -267744 180845 -148626 -81279 51256
18258 152838 150546 27193 -38851 110657 -72860 190949 -68556 244677 -1725 -37394 158534
18246 174785 -248988 176784 -73348 66851 -160927 -106489 -282283 162336 -2112 -346493
18236 -346493 165479 -96512 -30555 -18497 -62807 -445287 137223 -36680 -37345 120534 160833
18225 160833 -25867 92580 48930 -69331 62423 -18876 21304 257221 -258554 -373325 5301
18213 52196 -213952 92401 -922 -93323 5188 287914 533656 51078 -202037 28024 60213
18202 60213 240085 -24142 168267 -128524 -162402 -94879 -85637 -211026 44272 -195389 -99750
$$ packed form
18281a60356H8596a61622B26731b66617b8177A86746d0763B50945C638P3713J25625
18270B02976B4838a3906k9152C1796d6912B12679b67744A80845a48626O7347E1256
18258A52838k292B7193c8851A10657g2860A90949f8556B44677a725l5669A58534
18246A74785b48988A76784g3348F6851a60927N4438j75794A62336b112l44381
18236c46493A65479i6512c0555J2058m4310l82480A37223c6680o65A20534M0299
18225A60833b5867I2580m3650f9331F2423a8876B1304K35917b58554j14771E301
18213E2196b13952I2401i22r2401E188K82726K45742E1078b02037B8024L2189
18202F0213J79872b4142A68267a28524l3878O7523R242j25389D4272a95389R5639
$$ plain form
18191 -99750 -217126 9224 25802 -159107 -199301 98894 48499 -46826 -357813 -62905 -306753
18180 -306753 54046 -285809 -176884 90649 -105889 215666 156956 12408 201519 -127153
18169 194382 -27616 -316654 -211568 -210523 73241 7550 -51804 -52143 -374972 14489 -218733
18157 -119448 141172 138512 -7514 -48711 -19380 150948 39972 218895 82537 6753 -98674
18145 -270768 -138545 -163763 -252808 -26377 -306963 47344 66932 16611 -73024 259560 95936
18133 32128 -96496 241981 -125655 -138514 -15821 -172596 62530 -155178 799 -44042 -252458
18122 -252458 90418 139569 -132124 209255 -354271 195189 -269966 107746 42814 -102905
18111 57967 -1047 29979 -254904 132096 345407 -175457 -120655 223821 114457 -264898
$$ packed form
18191i9750j17376I224J6578a59107m0194I8894D8499d6826l10987f2905k43848
18180c06753E4046b85809J08925I0649a05889B15666n8710A2408J89111a27153
18169A94382b7616k89038J05086J045G3241G550e1804l39l22829A4489b18733
18157a19448A41172k660g514m1197a9380A50948C9972J78923H2537F753i8674
18145b70768J32223k5218q9045b6377k80586D7344J9588A6611g3024B59560I5936
18133C2128i6496B41981a25655j2859a5821j56775F2530a55178G99d4042k08416
18122b52458I0418M9151a32124B09255c54271A95189b69966A07746D2814a02905
18111E7967a047B9979b54904A32096K13311a75457N4802B23821j09364b64898
$$ plain form
18100 -63676 331447 -29553 -193318 -311498 -114880 -268576 -127705 19384 -229131 -225379
18090 -225379 292977 131001 190207 45833 90090 -56215 -258722 -218591 -60953 152446 136127
18079 136127 51508 248227 43486 -289703 -93055 -44866 -301947 -289395 -40087 -145365 -198747
18068 -198747 186874 -202871 208824 69717 -39731 -29566 247430 -248345 275625 -261251
18057 -77414 335056 -68157 173280 -54459 42224 -128694 -54154 -59498 176677 -537030 -12777
18045 35385 -163503 170167 255937 -204291 311502 207396 -124683 -32416 192378 -29982
18034 -50809 24199 144930 -65912 -52024 -73052 59879 98932 -171268 -199362 -242707 -120919
18022 74622 190694 75863 -96001 -285976 -93578 -10067 -54900 8171 -50271 8993 -106141
$$ packed form
18100f3676C31447b9553j63765j18180a14880j53696a27705A9384b29131L752
18090b25379B92977A31001N9206D5833M4257e6215k02507M0131f0953A52446j6319
18079A36127E1508J96719D3486b89703i3055d4866k57081J2552d0087j05278n3382
18068a98747A86874b02871B08824F9717c9731J0165B47430b48345B75625b61251
18057g7414C35056f8157A73280e4459D2224a28694e4154n344A76677e37030a2777
18045C5385a63503A70167Q5770b04291C11502j04106a24683c2416A92378b9982
18034e0809B4199J20731f5912J3888k1028E9879L9053a71268k8094m3345a20919
18022G4622J16072G5863i6001j89975i3578a0067m4833H171e0271H993a06141
$$ plain form
18010 -75459 1516 43232 -341044 160690 -142479 -507394 -173772 192894 271534 -56861 -79554
17999 -79554 -14087 -18659 152666 47081 44289 160550 -9871 77648 75602 -245689 -35115 84777
17986 16409 -101897 129631 148584 -56402 -151689 -204260 43497 -252097 -317673 -96638 -100601
17975 -100601 -433043 200253 252847 -192454 394557 -197794 -54214 282227 113632 342495
17965 342495 -32807 -334514 -117934 -47187 -54975 254741 -66433 177674 439330 -36453 -93468
17954 -93468 -87567 -155551 276311 -55328 -26271 -203011 108441 -275659 88671 83481 -69037
17942 -120618 -20620 -236675 -286676 -223056 -79057 -124092 244608 115192 310064 100212
17931 -97986 269320 -36258 -11869 92603 270502 -212615 151858 425566 -210321 109135
$$ packed form
18010g5459A516M1716c41044A60690a42479l64915a73772A92894P8640e6861k2693
17999g9554a4087m572A52666D7081k792J16261i871G7648k046b45689c5115H4777
17986A6409a01897A29631J8953e6402r5287n2571D3497b52097o5576i6638l963
17975a00601l32442B00253N2594a92454C94557a97794e4214B82227A13632K28863
17965C42495c2807l01707a17934d7187p788B54741f6433A77674K61656c6453n7015
17954i3468N901o7984B76311e5328b6271j76740A08441b75659H8671n190f9037
17942a20618b0620k16055n0001O3620g9057m5035B44608A15192J94872A00212
17931i7986B69320c6258a1869I2603J77899b12615A51858K73708b10321A09135
$$ plain form
17920 -52427 326095 38072 -8483 201364 -310222 27237 -10739 103128 -10786 -312911 -56360
17908 -58771 81116 102130 54159 -148632 40703 -118405 269070 -832 -71332 -66364 -300723
17897 -300723 274174 -179506 -248273 -244099 16182 125507 273459 262265 98021 -15901 -49480
17886 -49480 -68515 -135547 -168350 -263975 268874 246269 401899 322213 -317709 -142883 122114
17874 1140 -268606 -85727 243117 -146913 -19683 49427 -273076 60264 191830 18129 -102129
17862 221717 189763 103934 -120261 -48226 -358672 181361 -204710 199636 -185509 -355803
17852 -355803 -46064 212640 -80240 -34194 -76781 114296 -128806 121013 263696 -69768
17841 -6728 -175349 -120975 -16202 -224774 -123414 -40439 52294 91219 -119212 148646 131315
$$ packed form
17920e2427C26095C8072h483B01364c10222B7237a0739A03128a0786l02125e6360
17908e8771H1116K1014m7971a48632D0703a18405B69070h32p0500M968k34359
17897c00723B74174a79506o8767M174A6182J09325J47952j1194I8021a5901l3579
17886d9480j9035o7032l2803r5625B68874k2605J55630p9686c17709a42883A22114
17874A140b68606h5727B43117a46913a9683D9427b73076F0264J31566A8129a02129
17862B21717l1954q5829a20261d8226l10446A81361b04710A99636a85509j70294
17852c55803d6064B12640h0240c4194m2587A14296a28806A21013J42683f9768
17841f728j68621N4374a6202k08572J01360d0439E2294L8925a19212A48646j7331
$$ plain form
17830 131315 20269 -225646 311827 10177 -190528 -52763 -348484 281361 -277023 187821
17819 91527 -122376 -82072 493812 -48056 -238524 56175 -69945 192286 205831 -22785 -48455
17808 -48455 -183944 121799 -48577 104405 7717 43535 -194280 -93328 285075 766 -250789
17796 113020 -113748 52468 92651 35348 -234227 -104736 140898 -80339 -8224 -115850 133677
17784 -17984 -356159 -200545 -282400 -225408 -162832 297569 -81308 19143 146514 -187036 363378
17772 70501 182183 473240 19745 -50526 88284 -200634 93312 -59196 66199 48065 -871
17760 -46323 308203 -197569 55623 -117813 -101362 -65219 13205 -82563 39330 167654 -129798
17748 -200115 -123148 -163281 116203 9400 -102608 68643 -14169 -65554 162648 -173742 104499
$$ packed form
17830A31315B0269b25646C11827A0177a90528e2763k95721B81361b77023A87821
17819I1527a22376M0304D93812d8056j90468E6175f9945A92286J3545b2785k5670
17808d8455j35489A21799d8577A04405G717L5818a94280i3328B85075G66b50789
17796A13020a13748E2468M0183C5348b34227a04736A40898h0339h224j07626A33677
17784a7984l38175J55614q1855N6992O2576B97569h1308A9143J27371a87036C63378
17772G0501J11682K91057A9745e0526H8284b00634I3312e9196F6199j8134h71
17760d6323C08203a97569E5623a17813J6451L6143A3205h2563C9330J28324a29798
17748b00115P6967m0133A16203I400a02608F8643a4169n1385A62648a73742A04499
$$ plain form
17736 -75296 188782 -162562 57797 -120046 102334 252730 -144096 -160173 164542 -87390
17725 -126690 -242260 80736 341216 200185 19797 282047 -64409 -36364 458624 229967
17715 229967 142287 -121973 -156019 -213262 17342 -140124 6250 147855 158452 -57751 85858
17703 -145221 -75706 416211 38987 380825 32316 -181403 382846 -109484 286889 161302
17693 161302 -70521 -210135 -262959 128253 -57189 137275 -176531 -144663 -119020 149568
17682 16656 52207 -43343 -71051 102884 -242122 25239 170283 211915 -422895 -140076 432629
17670 309883 -130810 -55084 -12603 125783 -106138 111488 -125764 -237762 -159475 186972
17659 -253705 -2083 232027 51128 111076 109330 125713 214280 -68745 -179540 141820 -89995
$$ packed form
17736g5296A88782a62562E7797a20046A02334J50396a44096j6077A64542h7390
17725a26690j15570H0736K60480j41031A9797K62250f4409K8045D58624k28657
17715B29967q7680a21973l4046n7243A7342a40124F250J41605J0597e7751H5858
17703a45221O9515D16211C8987L41838C2316a81403C82846a09484B86889j25587
17693A61302g0521j39614n2824A28253e7189A37275a76531L1868K5643A49568
17682A6656L5551d3343k7708A02884b42122B5239J45044M1632d22895a40076D32629
17670C09883a30810e5084a2603A25783a06138A11488a25764j11998P8287A86972
17659b53705b083B32027E1128N9948j746J6383Q8567f8745j10795A41820h9995
$$ plain form
17647 -241760 215462 -17742 16846 -61608 -41419 -176859 287001 -246955 185719 -147430
17636 -83183 338073 -43941 -25337 52530 -169381 187655 293549 -4687 -24439 -178329 -106628
17625 -106628 -376655 -43895 -144910 110548 461656 288856 180191 248238 -168825 66970
17614 135271 198099 307041 255926 -240397 196004 1574 -134970 -47156 -6824 -10227 96164
17602 -1638 124054 -105793 80844 59883 -168534 -358291 -236498 -224656 56104 -188405 275357
17590 -48579 252665 -43481 39243 -106485 -52395 -83372 -94479 -177957 327771 117051 97616
17579 97616 43291 -20154 -168551 -56151 -139916 59157 206283 138214 137534 182518 -189470
17567 110079 333695 70839 -25155 -189252 -43535 195527 320038 51286 247152 121313
$$ packed form
17647b41760B15462a7742A6846f1608K0189j35440B87001b46955A85719a47430
17636h3183C38073d3941J8604E2530a69381A87655J05894d687j9752j53890P1701
17625a06628k70027d3895j01015A10548L51108j72800j08665O8047a68825F6970
17614A35271O2828J08942n1115b40397A96004A574a34970d7156f824l403I6164
17602a638A24054a05793H0844k0961a68534j89757J21793J1842E6104a88405B75357
17590d8579B52665d3481C9243a06485e2395l0977j1107q3478C27771A17051j9435
17579I7616D3291b0154j48397e6151q3765E9157J47126o8069o80M4984a89470
17567A10079K23616G0839b5155j64097d3535A95527J24511E1286J95866A21313
$$ plain form
17556 122467 -105304 -156856 -294416 -31923 622724 -81719 316072 12187 238697 81619
17545 292316 -321844 110920 -178880 -31147 227912 -212884 265613 192253 121020 387436
17535 387436 139106 -102355 45331 -70112 -16293 -75772 174757 -3366 122814 150306 168263
17524 168263 132607 164783 554309 105804 -286990 -87857 -53144 204120 123780 263165
17514 263165 223977 -324652 65260 -32866 -9729 26533 23319 -40407 -239431 -44388 142112
17502 67102 119010 272693 235291 24411 17174 -54114 -372796 252079 347507 -121348 66400
17490 37483 117982 216937 21313 229242 -23431 118298 10804 -154043 103831 334946 253300
17479 253300 223728 86309 142100 186499 214879 280935 150498 139295 145313 157810 91899
$$ packed form
17556A22467a05304n1552j37560c1923F22724h1719C16072A2187K26510H1619
17545B92316c21844A10920a78880c1147B27912b12884B65613p3360p1233K66416
17535C87436A39106a02355D5331g0112a6293n9479A74757c366A22814K7492J7957
17524A68263l5656L2176L89526A05804b86990h7857L4713B04120q0340J39385
17514B63165l9188c24652F5260c2866i729B6533l214d0407j99024d4388A42112
17502F7102N1908J53683l7402B4411p237e4114l18682B52079R5428a21348F6400
17490C7483Q0499R8955B1313K07929b3431A18298A0804a54043A03831K31115q1646
17479B53300k9572H6309N5791M4399K8380O6056j30437j1203O018J2497o5911
$$ plain form
17468 91899 -11035 225799 151717 177968 411562 80883 -19901 -45486 343315 -223207 -71028
17456 68111 -231437 202942 -261443 114755 -112741 109844 434831 -31446 85608 99237
17446 99237 280710 331019 205257 143751 93459 311905 393452 364459 423437 233166 43053
17434 212953 33543 278996 190982 450230 -54658 -13192 208034 406517 100158 15711
17423 186618 272158 198255 -193278 176680 83258 97481 -200146 229793 143817 347488
17413 347488 363710 261616 408524 346566 312739 224386 281660 -162078 218152 -19910 -39435
17402 -39435 398463 -251827 -96525 -185827 104592 179179 22788 121520 348749 133686 41552
17390 82186 81350 -36424 54931 198457 170719 170965 -120848 170561 192669 190738 158242 -186546
$$ packed form
17468I1899a1035B25799p4082K6251K33594H0883a9901k5585C43315b23207g1028
17456F8111b31437B02942b61443A14755a12741A09844L24987c1446H5608J3629
17446I9237J81473N0309j25762o1506n0292K18446Q1547k8993N8978j90271D3053
17434B12953C3543K45453q8014K59248e4658a3192B08034J98483A00158A5711
17423A86618Q5540p3903a93278A76680H3258J4223b00146B29793q5976K03671
17413C47488J6222j02094J46908o1958l3827q8353N7274a62078B18152a9910j9525
17402c9435C98463b51827i6525q9302A04592P4587B2788R8732K27229A33686D1552
17390H2186q36c6424E4931J43526k7738K46a20848A70561K2108j931l2496a86546
$$ plain form
17377 -129786 -195266 253500 -35763 291163 461858 210450 51163 133185 333763 -113836
17366 -32994 140346 78668 49934 52750 6780 -146806 199523 275829 -108223 53925 -245550
17354 38157 189178 206130 99335 209345 76135 192394 262925 134490 -259230 14329 193093
17343 193093 -174093 185610 -49588 289905 202713 302939 -44206 33583 -140243 403697
17332 290714 -65831 -189398 -244935 351376 -72407 129684 240855 346146 -557 201898 255582
17321 255582 171502 355797 -45389 14851 149770 252324 -57602 63531 150588 268555 218849
17310 218849 98065 -147570 264955 242071 58083 216105 214611 -14317 228006 246090 -5161
17298 -74733 143184 -31536 23529 183824 11544 117239 102563 -137461 208897 260004 138512
$$ packed form
17377a29786o5480B53500c5763B91163J70695B10450E1163Q2022K00578a13836
17366c2994A40346o1678k8734K816F780a46806A99523P6306a08223E3925b45550
17354C8157J51021J6952I9335J10010G6135J16259P0531j28435b59230A4329J78764
17343A93093a74093A85610d9588B89905q7192J00226d4206C3583a40243D03697
17332B90714f5831j23567n5537C51376g2407A29684J11171J05291e57B01898N3684
17321B55582q4080J84295d5389A4851J34919J02554e7602F3531Q7057J17967m9706
17310B18849I8065a47570B64955k2884E8083J58022j494a4317B28006J8084e161
17298g4733A43184c1536B3529J60295A1544J05695j4676a37461B08897N1107j21492
$$ plain form
17287 138512 222134 113512 33573 247848 153166 1504 62030 -252300 183199 302632 338087
17276 338087 18685 360464 306826 -64006 236899 -86413 328698 210947 103829 360563
17266 360563 231772 375060 538601 -5718 259868 -60149 146080 361377 5501 253573
17256 253573 448839 -140742 3937 341517 156941 186414 252105 116007 46469 -139801
17245 68119 326972 -96035 378338 -37389 359372 7855 313784 382590 426333 -125143 307452
17233 98157 238075 411239 -227388 41874 558705 403257 351186 177484 450949 361239
17223 361239 243885 -11452 416657 222227 384882 127339 306309 344475 130819 364753
17213 364753 -78704 320303 152764 345095 78520 78774 128935 17446 201578 171159 207392
$$ packed form
17287A38512Q3622j08622C3573K14275r4682A504O0526b52300A83199J19433L5455
17276C38087A8685L41779n3638f4006B36899h6413C28698j17751A03829K56734
17266C60563j28791J43288J63541e718B59868f0149A46080K15297E501K48072
17256B53573J95266a40742C937L37580A56941K9473O5691A16007D6469a39801
17245F8119K58853i6035C78338c7389C59372G855L05929O8806M3743a25143C07452
17233I8157J39918J73164b27388D1874N16831j55448n2071j73702K73465q9710
17223C61239j17354a1452D16657j94430J62655A27339J78970L8166A30819K33934
17213C64753g8704C20303A52764J92331G8520K54N0161A7446J84132l0419L6233
$$ plain form
17202 207392 242806 147068 407351 448942 -28553 280228 15549 331503 419583 59517 180715
17191 180715 405379 87533 83513 301002 422696 -102436 446255 227682 -19755 -80742
17181 -80742 77074 161861 156416 98325 148691 251955 85510 461527 -7936 188500 107943
17170 107943 174143 177345 248350 202943 475283 370596 114559 437241 352166 264521 133162
17159 133162 284801 508832 487186 7306 181798 297253 422676 -243367 -8477 73711 295437
17148 295437 224347 208357 175183 174891 304319 543269 492575 38465 28559 330011 314320
17137 314320 499812 35682 218846 378869 -125602 54525 430307 204902 444609 91849
17126 247680 32163 245462 423380 586122 503948 254412 295558 197762 353816 264628
$$ packed form
17202B07392L5414r5738K60283M1591b8553B80228A5549L15954Q8080E9517J21198
17191A80715K24664H7533m020K17489J21694a02436D46255k18573a9755o0987
17181h0742G7074Q4787n445n8091N0366J03264H5510L76017g936A88500q0557
17170A07943O6200L202P1005m5407K72340j04687A14559L22682q5075q7645j31359
17159A33162J51639K24031k1646G306J74492J15455J25423b43367h477G3711K21726
17148B95437p1090j5990l3174k92J29428K38950n0694C8465r906L01452j5691
17137C14320J85492C5682J83164J60023a25602E4525L75782B04902K39707I1849
17126B47680C2163K13299J77918J62742q2174k49536M1146r7796J56054q9188
$$ plain form
17116 264628 418827 199532 203627 7337 307263 498212 594576 525878 477537 336530 236727
17105 236727 135406 225822 399054 160855 362908 -7768 333363 445995 399405 140084
17094 357986 91340 227943 327643 298002 526125 115836 362367 307324 485159 759789
17084 759789 569400 474393 -28386 579253 413312 91165 558110 304279 190201 257301
17074 257301 452344 444536 470162 523432 275090 542702 715856 549887 345196 267333
17064 267333 246007 593027 287948 602221 185425 536438 768439 569331 640212 526216
17054 526216 614021 535744 434679 611729 505080 447490 678120 780137 512324 243983
17043 349022 478460 407445 123573 331314 250245 604929 373988 763644 423728 505883
$$ packed form
17116B64628J54199A99532M095G337K99926J90949R6364o8698m8341j41007r9803
17105B36727j01321R0416J73232A60855K02053g768C33363J12632m6590A40084
17094C57986I1340J36603R9700k9641K28123A15836K46531n5043J77835K74630
17084G59789j90389r5007b8386E79253j65941I1165M66945k53831j14078O7100
17074B57301J95043p808K5626N3270k48342K67612J73154j65969k04691p7863
17064B67333k1326L47020B87948L14273A85425L51013K32001j99108P0881j13996
17054E26216Q7805p8277j01065J77050j06649n7590K30630J02017k67813B43983
17043C49022J29438p1015A23573K07741q1069L54684k30941L89656l39916Q2155
$$ plain form
17033 505883 544836 516433 511330 768403 409711 649671 778329 684054 718850 453755 716373
17022 716373 500798 662902 620658 625471 494286 355616 182354 448419 599021 400744
17012 400744 565988 430479 966649 395302 719704 328315 721621 630068 649667 919032
17002 919032 492858 774443 594552 704066 606842 589616 641889 504859 773798 548785
16992 548785 887221 559978 834583 541529 810407 459686 564861 824808 591519 832052
16982 832052 1100048 732412 505425 1050061 532811 834318 750858 739615 630961 1045529
16972 1045529 751095 728275 714619 753576 834437 883116 606798 1070207 697997 940043
16962 940043 856237 774148 747843 877216 1158138 1073887 1080649 948132 876491 863047 764480
$$ packed form
17033E05883L8953k8403n103K57073l58692K39960J28658r4275L4796k65095K62618
17022G16373k15575J62104m2244M813j31185j38670j73262K66065J50602j98277
17012D00744J65244j35509N36170C95302L24402C28315L93306r1553J9599K69365
17002I19032m26174K81585j79891J09514r7224j7226N2273j37030K68939k25013
16992E48785L38436l27243K74605k93054K68878l50721J05175K59947k33289K40533
16982H32052K67996l67636k26987N44636n17250L01507q3460j1243j08654M14568
16972A045529k94434k2820j3656L8957Q0861M8679k76318M63409l72210K42046
16962I40043q3806q2089k6305J29373K80922q4251O762j32517p1641j3444r8567
$$ plain form
16951 764480 697962 715773 1158567 1092331 1052386 905020 1188674 902564 1310713 1551465
16941 1551465 979421 1299406 1161424 1134358 957720 865568 1225717 1070233 801266 1104251
16931 1104251 1115061 1084996 1404850 1375382 1232940 1294228 1177719 1407020 1260735 1221166
16921 1221166 994612 1413654 1400499 1217775 1197227 1572500 1881091 1465405 1728761 1586582
16911 1586582 1394946 1365714 1732631 1630948 1671950 1651657 1462574 1438117 1459317 1499702
16901 1499702 1623597 1707351 1670609 1684161 1705831 1741835 2004775 2023017 1954689 1720859 1582847
16890 1582847 1905022 1716668 1799878 1640976 1988901 1716406 1982752 1854524 1843544 2181074
16880 2181074 1947048 1849688 2208786 1847340 2066978 2383883 2186892 2251625 2225465 2107305
$$ packed form
16951G64480o6518J7811M42794o6236l9945j47366K83654k86110M08149K40752
16941A551465n72044L19985j37982k7066j76638r2152L60149j55484k68967L02985
16931A104251J0810l0065L19854k9468j42442O1288j16509K29301j46285l9569
16921A221166k26554M19042j3155j82724k0548L75273L08591m15686K63356j42179
16911A586582j91636k9232L66917j01683M1002k0293j89083k4457K1200M0385
16901A499702J23895Q3754l6742J3552K1670L6004K62940J8242o8328k33830j38012
16890A582847L22175j88354Q3210j58902L47925k72495K66346j28228j0980L37530
16880B181074k34026r7360L59098l61446K19638L16905j96991O4733k6160j18160
$$ plain form
16870 2107305 2224833 2389376 2353144 2412581 2394361 2369382 2539666 2640950 2472158 2587945
16860 2587945 2720760 2767263 2353778 2725755 2893385 2815347 2775369 2751265 2893350 2916312
16850 2916312 3412491 3237922 3124234 3052893 3020665 3239314 3106062 3087956 3526016 3371733
16840 3371733 3582269 3619521 3614985 3334645 3974517 4054451 3973617 4084301 4178316 3965752
16830 3965752 4271746 4250595 4128784 4394276 4183279 4711220 4410823 4571101 4599863 4655358
16820 4655358 5007682 5500657 4855748 5326703 5325048 5403212 5479965 5844553 5965280 5772479
16810 5772479 5968373 6369834 6142934 6494720 6363815 6763516 7125838 6783827 7279323
16801 7279323 7392092 7535066 7749835 7879770 8141820 8114712 8451950 8581715 9013924 9097091
$$ packed form
16870B107305J17528J64543l6232N9437j8220k4979J70284J01284j68792J15787
16860B587945J32815M6503m13485L71977J67630p8038l9978k4104J42085K2962
16850B916312M96179j74569j13688p1341l2228K18649j33252j8106M38060j54283
16840C371733K10536L7252m536k80340O39872P9934q0834J10684R4015k12564
16830C965752L05994k1151j21811K65492k10997N27941l00397J60278K8762N5495
16820D655358L52324M92975o44909M70955j655P8164P6753L64588J20727j92801
16810E772479J95894M01461k26900L51786j30905L99701L62322l42011M95496
16801G279323J12769J42974K14769J29935K62050k7108L37238J29765M32209Q3167
$$ plain form
16791 9097091 9890997 9827628 10146526 10441679 10506862 11054009 10857123 11487544 11787615 12031695
16781 12031695 12426039 12762755 13130761 13263413 13925247 14640740 15044556 15470300 15939395
16772 15939395 16051421 17207553 17543590 18178838 18650850 19203000 19982735 20889035 21624292
16763 21624292 22520834 23410269 24229971 25052658 26395118 27394895 29013636 29578895 31293823
16754 31293823 32571487 34121995 35573403 36769291 38700345 40761882 42793501 44753630
16746 44753630 47149257 49744907 52776246 54958032 58114120 60945471 64359951 68614980
16738 68614980 72089409 76033717 81045558 85454482 90747739 95889115 101579513 107246224
16730 107246224 113549624 119972513 126639762 133310058 140713978 147006561 153700166 159341280
$$ packed form
16791I097091P93906o3369L18898K95153O5183N47147j96886O30421L00071K44080
16781A2031695L94344L36716L68006J32652O61834P15493M03816M25744M69095
16772A5939395J12026J156132L36037O35248M72012N52150P79735R06300P35257
16763B1624292Q96542Q89435Q19702Q22687J342460R99777J618741N65259J714928
16754C1293823J277664J550508J451408J195888J931054K061537K031619J960129
16746D4753630K395627K595650L031339K181786L156088K831351L414480M255029
16738F8614980L474429L944308N011841M408924N293257N141376N690398N666711
16730A07246224O303400O422889O667249O670296P403920O292583O693605N641114
$$ plain form
16722 159341280 165292781 170103615 174203655 177553477 179809920 180377456 180102613 178502582
16714 178502582 175647110 171836568 167510200 161561814 155994407 149282271 142340328 135055716
16706 135055716 128529944 121664849 114792062 108535108 101825896 96411414 90365634 85132844
16698 85132844 80401098 75348709 71145810 67306345 63593359 59734536 56622218 53542828
16690 53542828 50704423 47929607 45656518 43497553 41209027 39123446 36839755 35403612
16682 35403612 33674935 32153805 30625013 29085869 27968542 26535370 25615031 24794724
16674 24794724 23593841 22386632 21097170 20719069 19936014 19245390 18331954 17937382 17219007
16665 17219007 16599502 15931747 15549220 15014226 14263020 13948736 13388727 13114552 12603209
$$ packed form
16722A59341280N951501M810834M100040L349822K256443N67536k74843j600031
16714A78502582k855472l810542m326368n948386n567407o712136o941943p284612
16706A35055716o525772o865095o872787o256954o709212n414482o045780n232790
16698H5132844m731746n052389m202899l839465l712986l858823l112318l079390
16690E3542828k838405k774816k273089k158965k288526k085581k283691j436143
16682C5403612j728677j521130j528792j539144j117327j433172r20339q20307
16674B4794724j200883j207209j289462l78101p83055o90624r13436l94572p18375
16665A7219007o19505o67755l82527n34994p51206l14284n60009k74175n11343
$$ plain form
16656 12603209 12182556 12219356 11444035 10901888 10390785 10699901 10373333 9599800 9615037 9688987
16646 9688987 9038786 8921083 8528733 8054983 7926208 7748155 7695572 7525508 7096806 7251297
16636 7251297 6975742 6875852 6877556 6550472 6460500 6204831 6280006 5754496 5693523 5735159 5740937
16625 5740937 5309433 5188420 5419990 5122437 5114692 4838613 4747754 4539074 4630332 4576572
16615 4576572 4253441 4258521 4624576 4173873 4172192 3798369 3904969 3979284 3622146 3791159
16605 3791159 3420615 3657564 3549627 3235173 3149294 3403472 3327356 3563125 2971374 3002305
16595 3002305 2853812 3043926 2754943 3250730 2925015 2779838 2733139 2537923 2739898 2553840
16585 2553840 2604321 2482664 2480210 2208117 2760916 2712687 2232967 2322421 2616410 2273599
$$ packed form
16656A2603209m20653L6800p75321n42147n11103L09116l26568p73533J5237P3950
16646I688987o50201j17703l92350m73750j28775j78053n2583j70064m28702J54491
16636G251297k75555r9890J704l27084q9972k55669P5175n25510o0973M1636N778
16625E740937m31504j21013K31570k97553p745k76079r0859k08680R1258n3760
16615D576572l23131N080L66055m50703j681l73823J06600P4315l57138J69013
16605C791159l70544K36949j07937l14454q5879K54178p6116K35769n91751L0931
16595C002305j48493J90114k88983M95787l25715j45177m6699j95216K01975j86058
16585B553840N0481j21657k454k72093N52799m8229m79720Q9454K93989l42811
$$ plain form
16575 2273599 2329751 2245949 2063674 1885680 2186722 2112609 2041091 2025491 1984056 1918582 1986724
16564 1986724 1788322 2037493 2327937 1627684 1814217 1661011 1652535 2101738 1627666 1351928
16554 1351928 1552404 1422871 1629709 1866172 1483542 1531224 1487838 1023939 1575077 1587350
16544 1587350 1381445 1670147 1522692 1439927 1407675 1241188 1641252 1129326 1449029 1171021
16534 1171021 1165076 1262629 1194785 1185523 1175437 1329780 1041220 978884 1403967 1024674 961777
16523 961777 1149692 975586 1403334 1250151 993539 1062940 1219626 1346315 936997 1119146
16513 1119146 798108 967564 935088 1328868 1128849 878149 927700 1030253 1106890 747689
16503 747689 837158 498538 943362 700735 686453 889793 405591 1052135 1139439 797177
$$ packed form
16575B273599N6152q3802j82275j77994L01042p4113p1518j5600m1435o5474O8142
16564A986724j98402K49171K90444p00253J86533j53206q476M49203m74072k75738
16554A351928K00476j29533K06838K36463l82630M7682m3386m63899N51138J2273
16544A587350k05905K88702j47455q2765l2252j66487M00064n11926L19703k78008
16534A171021n945R7553o7844r262j0086J54343k88560o2336M25083l79293o2897
16523I61777J87915j74106M27748j53183k56612O9401J56686J26689m09318J82149
16513A119146l21038J69456l2476L93780k00019k50700M9551J02553P6637l59201
16503G47689Q9469l38620M44824k42627j4282K03340D05591O46544Q7304l42262
$$ plain form
16493 797177 1038467 913253 1054849 1043863 784316 714848 437130 714506 613061 1047813
16483 1047813 810143 886061 708774 608217 688490 782058 727518 682830 780362 743488 730206
16472 730206 656557 844281 836855 343592 723936 833757 441310 441338 706721 454453 912903
16461 912903 544932 282022 440758 400553 293505 750237 373249 763994 783080 872545
16451 872545 622340 284492 341056 409837 548910 328726 320497 570984 517232 318332
16441 318332 508664 233438 337560 510239 484050 670597 765613 490235 511770 479001
16431 479001 445380 342824 201157 447407 386122 164246 450160 420631 355198 610689
16421 610689 303173 154216 428383 381712 400908 308946 415260 31503 410646 101356
$$ packed form
16493G97177K41290j25214J41596j0986k59547o9468k77718K77376j01445M34752
16483A047813k37670P5918j77287j00557Q0273R3568n4540m4688R7532l6874j3282
16472G30206p3649J87724p426C43592L80344J09821l92447K8K65383k52268M58450
16461I12903l67971k62910J58736m0205j07048M56732C73249L90745J9086Q9465
16451H72545k50205B84492N6564O8781J39073k20184q229K50487n3752j98900
16441C18332J90332B33438J04122J72679k6189J86547R5016k75378K1535l2769
16431D79001l3621j02556j41667K46250o1285A64246K85914k9529o5433K55491
16421F10689C03173j48957K74167m6671J9196r1962J06314C1503L79143A01356
$$ plain form
16410 681159 631054 112523 113927 414809 221170 404413 217588 12471 240710 44744
16399 512276 19243 530343 325407 465159 422539 230545 404428 210570 383124 589820
16389 589820 34343 302063 202813 153041 400968 327202 128876 87750 235553 270131 126835
16377 61059 101103 593582 641107 234187 269978 536460 476813 110433 568206 537435 57164
16365 375651 401732 177379 339802 257611 328037 479718 480826 284824 64232 -133289 276239
16353 468389 -63804 268548 141897 469826 629674 290503 83909 297470 440125 182865
16342 441749 280858 178943 133058 318106 225461 187552 263708 208597 271293 262311 333746
16331 333746 -46546 158700 449638 275527 16837 21949 469623 -122275 332018 147411
$$ packed form
16410F81159n0105A12523J404L00882j93639J83243j86825A2471K28239D4744
16399E12276A9243N11100k04936J39752m2620j91994J73883j93858J72554K06696
16389E89820C4343K67720r9250m9772K47927p3766A28876m1126J47803L4578A26835
16377F1059M0044M92479M7525B34187L5791K66482n9647A10433M57773l0771E7164
16365C75651K6081A77379J62423q2191P0426J51681J108j96002F4232a33289B76239
16353D68389f3804B68548j26651L27929J59848B90503H3909K13561J42655A82865
16342D41749j60891j01915m5885J85048r2645l7909P6156n5111O2696q982P1435
16331C33746d6546A58700K90938j74111A6837N112M47674a22275C32018A47411
$$ plain form
16320 227035 515183 280370 284830 111544 -66637 213244 266747 323963 241119 -188528 90848
16308 259356 296183 -111827 291132 160349 157845 25014 -30937 223682 269210 544074 -17551
16296 338018 140946 192023 -23866 83692 136347 159640 344709 35455 250799 86703 43171
16284 -31347 139113 155490 -45428 89216 42340 94084 305834 -65731 317472 152113 177277
16273 177277 260451 -300756 -58480 -55433 429860 139298 167771 209230 318722 58076 342194
16262 342194 93803 337559 448093 72293 32109 36684 214253 -14437 130607 107855 130547
16251 130547 4377 93274 186946 -24529 118681 39876 44440 79233 57527 94565 -190279
16239 -88261 76439 309354 -121078 -80237 -154003 247847 366269 -89957 140852 -80155 -139598
$$ packed form
16320B27035K88148k34813M460A11544f6637B13244N3503N7216q2844a88528I0848
16308B59356L6827a11827B91132j30783k504B5014c0937B23682M5528K74864a7551
16296C38018A40946N1077b3866H3692N2655K3293J85069C5455K15344H6703D3171
16284c1347A39113J6377d5428H9216D2340N1744K11750f5731C17472A52113K5164
16273A77277Q3174c00756e8480L047D29860A39298K8473M1459J09492E8076K84118
16262C42194I3803K43756J10534G2293C2109M575J77569a4437A30607k2752K2692
16251A30547D377Q8897R3672b4529A18681C9876M564L4793k1706L7038a90279
16239h8261G6439K32915a21078M0841p3766B47847J18422h9957A40852h0155n9443
$$ plain form
16228 -139598 -95575 -49622 178234 201226 -144917 189600 349378 117420 83310 -95160
16217 85706 221262 192697 244736 -141529 23731 -99667 -62071 141236 -146031 110657 -54220
16205 -31579 233799 -153760 -31818 330717 141152 -106374 69335 22492 -81445 320146
16194 -204990 151093 -186631 94317 -111204 120389 -44401 34088 -106993 -168888 202498
16183 -4081 -53238 86403 260869 -97615 -208552 -76111 33122 -114627 -117473 246246 76478
16171 -1337 4259 172437 161373 -48586 7951 -277338 59838 70618 392816 -82807 20622 -69645
16158 358714 -131775 231138 -91009 153451 343340 412855 29573 -259349 -131659 -33894
16147 187513 53168 -36540 -248185 326508 39596 139219 -274652 238346 321878 70695 34939
$$ packed form
16228a39598M4023M5953A78234K2992a44917A89600J59778A17420l4110i5160
16217H5706J35556k8565N2039a41529B3731i9667L7596A41236a46031A10657e4220
16205c1579B33799a53760c1818C30717A41152a06374F9335B2492h1445C20146
16194b04990A51093a86631I4317a11204A20389d4401C4088a06993o1895B02498
16183d081m9157H6403J74466i7615j10937g6111C3122a14627k846B46246G6478
16171a337D259J68178j1064d8586G951b77338E9838J0780L22198h2807B0622f9645
16158C58714a31775B31138i1009A53451J89889O9515B9573b59349J27690c3894
16147A87513E3168c6540k11645C26508C9596R9623b74652B38346Q3532G0695C4939
$$ plain form
16135 485494 -165416 304448 25551 100446 259780 163016 259238 359695 -166276 -106741
16125 -106741 -42528 75685 312838 122229 11622 205276 87817 250509 -138485 -73928
16115 -73928 -317931 -91412 -153244 254281 -1401 -121030 -147536 154259 -322218 -44199 -194317
16104 -194317 -311538 234049 -39067 -100043 100045 25807 -31482 -179567 -367698 85735
16093 -16728 55370 105081 -149575 -273414 -71338 -4881 -108465 -102078 -12279 -69169 -54817
16082 -54817 222242 -76578 -269058 185026 76155 -80687 -112792 196834 -35112 164210 198810
16071 198810 34375 302975 16246 180568 -186560 -122566 29943 -438270 -352147 59489 168295
16060 168295 101956 -195164 43298 -159089 -138158 183451 49578 230926 -337126 -41625
$$ packed form
16135D85494a65416C04448B5551P4895J59334r6764R6222J00457a66276N9535
16125a06741d2528G5685K37153A22229A1622J93654H7817J62692a38485O4557
16115g3928k44003i1412o1832B54281a401j19629k6506A54259c22218d4199j50118
16104a94317j17221B34049c9067o0976A00045B5807c1482j48085j88131H5735
16093a6728E5370M9711a49575j23839g1338d881j03584O387a2279n6890J4352
16082e4817B22242g6578j92480A85026G6155h0687l2105A96834c5112A64210L4600
16071A98810C4375K68600A6246J64322a86560O3994B9943d38270Q6123E9489J08806
16060A68295o6339a95164D3298a59089K0931A83451D9578J81348c37126d1625
$$ plain form
16049 14042 148155 151274 11382 73608 -78064 73257 -47655 105246 180450 -77063 -278815
16038 -278815 -220740 15196 72751 -84703 90785 131844 -119126 19848 -534495 84491 -45228
16026 75553 122304 -96756 64758 -178539 47108 -177129 166898 -6374 86192 17411 79210
16015 79210 222857 -68207 -330119 732 342960 -52030 80844 85396 -36624 -148041 -236503
16004 -236503 161998 -117200 -208206 -303547 35298 -118652 -246873 156849 -181042 74425
15993 -161413 -159140 -255817 -135456 170030 -157685 190483 -163400 216306 14151 44476
15983 44476 258976 465135 142589 99002 -210686 39909 -168072 173378 110955 -107661
15972 -153581 -171036 230548 -7668 -64935 -115221 61036 -79852 110815 -29945 -110687 394377
$$ packed form
16049A4042J34113L119A1382O2226g8064G3257d7655A05246P5204g7063k01752
16038b78815N8075A5196N7555h4703I0785M1059a19126A9848e34495H4491d5228
16026G5553M6751i6756F4758a78539D7108a77129A66898f374H6192A7411O1799
16015G9210J43647f8207k61912G32L42228e2030H0844M552c6624j11417q8462
16004b36503A61998a17200r1006r5341C5298a18652j28221A56849a81042G4425
15993a61413K273r6677J20361A70030a57685A90483a63400B16306A4151L0325
15983D4476K14500K06159A42589m3587b10686C9909a68072A73378o2423a07661
15972a53581j7455B30548g668n7267n0286F1036g9852A10815b9945q0742C94377
$$ plain form
15960 97787 -14333 12644 19568 91413 -65451 -2182 -122947 -330635 -309391 10556 78355 266040
15948 266040 -20393 -172684 98486 -5360 -68726 -95011 8825 -143814 13778 27889 234073
15937 234073 -1471 -235552 6374 -45201 -11390 257324 -33079 -404363 16448 106742 54599
15926 54599 -131106 -203192 -289522 -112190 -15862 54609 -400296 -88064 156240 -229793 235525
15914 6363 130 -79642 163642 85630 233589 -242885 59264 -423938 124585 91212 -12760
15902 130518 -41967 47134 -80254 -210868 38469 180197 -391221 -91180 -159141 -300949 151413
15890 -2962 -37249 -269944 205449 41921 -417695 59628 -167994 -233765 -85815 -85320 117471
15878 316019 385275 -110795 -137481 -8237 -73062 180770 78348 -148208 -1254 -265038 -228330
$$ packed form
15960I7787a4333A2644O924P1845f5451b182j20765k07688K1244A0556O7799J87685
15948B66040b0393j52291I8486e360o3366k6285H825a43814A3778J4111K06184
15937B34073a471k34081F374d5201a1390B57324c3079l71284A6448R0294n2143
15926E4599a31106p2086q6330a12190a5862E4609d00296h8064A56240b29793B35525
15914F363A30g9642A63642p8012J47959b42885E9264d23938A24585l3373a2760
15902A30518d1967D7134h0254j30614C8469J41728c91221i1180o7961j41808A51413
15890b962l4287k32695B05449D1921d17695E9628a67994o5771h5815M95A17471
15878C16019O9256a10795k6686h237o4825A80770G8348a48208a254k63784L6708
$$ plain form
15867 -228330 -329645 2664 -180982 -186465 -7193 -12708 -59592 -256196 -31131 -104202 -13540 297116
15854 -386978 -140380 51394 55117 207657 144946 -33154 6051 161544 119418 -27162 -154030
15843 -154030 -161176 238833 35032 75250 -22281 245336 -95964 215884 -467272 -288998 395546
15831 -64869 -37248 -157719 -35137 -46213 68584 -134935 96039 100746 151946 -131583 -329469
15820 -329469 200572 20924 193012 215565 96762 -133295 -274795 -163143 -90459 -117618
15810 -117618 172106 9878 -266618 -179589 283311 174961 47174 290592 8498 -115490 -202127
15799 -202127 239302 15117 221336 -48137 117989 67472 -181119 2706 -496136 -114858
15788 -21803 180841 -51941 114401 -81369 120216 -269244 -238372 -190943 47055 -40970 -399058
$$ packed form
15867b28330j01315B664a80982n483g193n515m6884j96604c1131p3071a3540B97116
15854c86978a40380E1394L723J52540o2711c3154F051J55493m2126b7162j26868
15843a54030p146B38833C5032M0218b2281B45336i5964B15884d67272J78274C95546
15831f4869K7621j20471c5137j1076F8584a34935I6039M707N1200a31583j97886
15820c29469B00572B0924J72088K2553I6762a33295j41500J11652P2684k7159
15810a17618A72106I878b66618Q7029B83311j08350D7174K43418H498a15490q6637
15799b02127B39302A5117K06219d8137A17989n0517a81119B706d96136a14858
15788b1803A80841e1941A14401h1369A20216b69244L0872M7429D7055d0970l58088
$$ plain form
15777 -399058 -105199 -436430 114809 -157319 -223988 -150260 171007 -4352 -190364 139956
15766 -200167 -36521 -103584 40813 -173412 -144198 63700 60954 12829 -69730 -19140 263705
15754 -98254 199814 -135796 -322166 205895 69364 149406 285837 -86928 -57631 63546 44719
15743 44719 327797 -83435 -110756 144655 -126204 -145266 150190 -211764 -15238 112326
15732 -307104 -263570 2017 -55081 -10558 -50728 -287560 -415203 -76646 24668 147013 -263740
15720 791 108616 150490 37083 -100674 -202406 393016 -88758 -28239 33555 -52755 191247
15708 59803 -35597 16582 128387 -294694 -78681 -44546 202879 -159799 -142221 -180796 82480
15696 -49918 126133 -58191 155826 68581 -139426 242458 179037 -280179 -193713 -273201 -152815
$$ packed form
15777c99058a05199l31231A14809a57319o6669P3728A71007d352j86012A39956
15766b00167c6521o7063D0813a73412K9214F3700k746A2829f9730a9140B63705
15754i8254A99814a35796j86370B05895F9364Q0042J36431h6928K9297F3546j8827
15743D4719K83078h3435k7321A44655a26204j9062A50190b11764a5238A12326
15732c07104M3534B017e5081a0558m0170k36832j27643g6646B4668J22345b63740
15720G91J07825M1874C7083a00674j01732C93016h8758b8239C3555e2755A91247
15708E9803c5597A6582J11805b94694g8681L4135B02879a59799J7578l8575H2480
15696d9918A26133e8191A55826F8581a39426B42458o3421b80179Q6466p9488J20386
$$ plain form
15685 -152815 43175 -41036 -16275 -27480 -24812 -238728 126740 -94796 -186410 -274508 -93171
15673 103886 51785 129020 -169172 120854 -15273 -146268 -76760 51100 64466 87799 -309158
15661 -808 280419 -312788 -42294 -151406 -27110 1378 -92403 -312904 -44359 168595 -170346
15649 -23658 -21296 223890 18011 -84420 -215583 142881 -100166 -27316 -73277 -170771 -272892
15638 -272892 -93127 64473 39651 48240 -202289 -284241 -62177 253713 123927 6592 57588
15627 57588 166420 -44750 78882 84234 -397646 271936 132481 -103713 -189011 28988 217328
15616 217328 -346028 154713 38815 15904 3404 78834 -56173 -197144 -159933 121151 58581
15604 18330 -273825 90025 -75340 36921 -43776 -108029 -29141 -209674 -18116 -221021 -184721
$$ packed form
15685a52815D3175d1036a6275j1205K668k13916A26740i4796r1614q8098i3171
15673A03886E1785P7235a69172A20854a5273j30995O9508E1100J3366K3333c09158
15661h08B80419c12788d2294j09112b7110A378i2403k20501d4359A68595a70346
15649b3658K362B23890A8011h4420j31163A42881a00166b7316m5961r7494j02121
15638b72892i3127F4473k4822Q589b02289q1952f2177B53713A23927F592N0996
15627E7588J08832d4750G8882N352c97646B71936A32481a03713q5298B8988J88340
15616B17328c46028A54713C8815A5904C404P5430e6173j40971L7211A21151E8581
15604A8330b73825I0025g5340C6921d3776o4253b9141j80533a8116k02905L6300
$$ plain form
15593 -184721 284370 52988 -46675 310661 -177187 -44627 154567 171904 14922 8203 -96119
15581 -12820 -150179 172396 -102544 -107578 -287304 -257395 -163809 -21423 -442329 114179 148029
15570 148029 131643 -150894 -226344 24050 180581 91936 -10749 -218505 -13180 -268902 215138
15558 82224 -91947 -177899 -13082 -197510 57259 253468 118821 113688 22522 194799 48297
15546 -368336 16948 102726 -270900 -211317 -177183 -118173 180085 256578 -93992 339378 389298
15535 389298 -64610 -312651 47852 -219732 -274942 128009 122064 91490 -242294 -87581 368105
15523 -171223 -127331 34864 129569 -12896 -48238 32694 -46743 138354 -56165 -191239 -98737
15512 -98737 64955 170941 25501 135008 506542 -248957 154 169175 177176 -5727 -109691
$$ packed form
15593a84721B84370E2988d6675C10661a77187d4627A54567J7337A4922o719i6119
15581a2820j37359A72396a02544n034j79726K9909R3586b1423m20906A14179L3850
15570A48029j6386a50894p5450B4050J56531q8645a0749k07756a3180k55722B15138
15558H2224i1947q5952a3082j84428E7259J96209A18821n133B2522J72277D8297
15546c68336A6948Q5778b70900N9583L4134N9010A80085P6493i3992C39378M9920
15535C89298f4610k48041D7852b19732n5210A28009n945l0574b42294h7581C68105
15523a71223M3892C4864R4705a2896l5342C2694d6743A38354e6165j35074R2502
15512i8737F4955J05986B5501J09507L71534b48957A54J69021Q001e727j03964
$$ plain form
15501 -109691 -60889 198878 -192085 81688 2315 70175 -286915 -267527 -201872 3396 -15282
15489 117245 -212314 346888 183717 282939 -169464 -113232 34750 -286352 -331019 -143775
15478 -236965 -162348 199681 235886 -105254 -103393 90516 213249 219558 32880 46647 -417204
15466 -298008 163250 -58510 97473 -75165 -131332 -203968 33848 -26657 76269 -220716 25299
15454 383223 -108597 241900 88684 22198 198900 232072 -47695 -59655 -190752 201360
15443 -134307 -286767 107718 244947 -161038 -51078 112396 106271 -311705 62276 -142478
15432 -57275 -140872 -152018 -82691 82950 -360952 246976 -71757 26557 -93049 23206 93572
15421 93572 80809 -54912 -66537 226461 246838 -41507 -46810 -112723 -63560 37493 425026
$$ packed form
15501a09691M8802A98878a92085H1688B315O7860b86915J9388O5655C396a5282
15489A17245b12314C46888j63171R9222a69464N6232C4750b86352m4667a43775
15478b36965P4617A99681L6205a05254J861I0516J22733O309C2880J3767d17204
15466b98008A63250e8510I7473g5165n6167p2636C3848b6657G6269b20716B5299
15454C83223a08597B41900H8684B2198J76702L3172d7695j1960j31097B01360
15443a34307j52460A07718J37229a61038e1078A12396o125c11705F2276a42478
15432e7275q3597j1146O9327H2950c60952B46976g1757B6557i3049B3206P0366
15421I3572j2763e4912j1625B26461K0377d1507n303o5913M9163C7493L87533
$$ plain form
15410 425026 92077 -238424 -366426 -194586 -107053 4680 16135 -34739 -135463 154001 228070
15399 228070 -180741 35802 -144199 121667 -198972 -47883 -432746 -45583 44988 209480
15389 209480 83242 225735 -189316 5124 -119958 47263 35106 176941 -172079 -74271 -159536
15378 -159536 158496 109113 -149803 21234 -279471 -174928 -86633 -51717 -57588 -11747 105189
15366 124438 36341 117055 -76351 217893 201128 -216168 167644 17095 -162405 76988 33709
15354 -102579 166856 129454 -2289 -64146 -14707 -72479 107819 -41808 274696 238658 219744
15343 219744 190851 -103800 242100 -116500 -30539 -26956 24830 228760 -44888 14874 153000
15332 153000 -47038 246722 261772 517553 -119224 150336 -194620 -40548 185899 -98402
$$ packed form
15410D25026I2077b38424j28002J71840Q7533D680J1455c4739j00724A54001P4069
15399B28070a80741C5802a44199A21667a98972d7883l84863d5583D4988J64492
15389B09480H3242J42493a89316E124a19958D7263j2157J41835a72079g4271q5265
15378a59536A58496m9383a49803B1234b79471J04543h6633L4916n871a1747A05189
15366A24438C6341Q0714g6351B17893j6765b16168A67644A7095a62405G6988C3709
15354a02579A66856l7402b289o1857a4707n7772A07819d1808B74696l6038j8914
15343B19744k8893a03800B42100a16500c0539L583B4830K03930d4888A4874J38126
15332A53000d7038B46722J5050K55781a19224A50336a94620d0548A85899i8402
$$ plain form
15321 167568 -63238 105287 369634 24277 -145249 -19936 130331 170855 -43258 -80763 -337733
15310 -337733 -73214 6049 4237 -118617 -55268 50171 104836 -11059 132939 42241 141746
15299 141746 -21364 21578 134214 206856 -133382 -97604 -123630 -114592 194135 109999 -53858
15287 -182796 316938 97650 234516 119120 31357 47583 72914 -52267 -191748 -70486 -79244
15276 -79244 114474 117537 134191 -144536 -26252 -319290 -28676 91231 223384 -58613 78341
15264 42770 13431 -161565 -15921 -136871 23787 117070 48413 -81648 72454 -136560 72646
15252 94707 151219 699773 495686 1226926 1486281 1242625 1625177 770444 293278 81741
15241 125477 14035 133155 462632 -153812 -139914 39020 257880 211073 -25236 196644
$$ packed form
15321A67568f3238A05287K64347B4277a45249a9936A30331M0524d3258l7505k56970
15310c37733g3214F049j812a18617e5268E0171N4665a1059A32939D2241R9505
15299A41746b1364B1578J12636P2642a33382L5778k6026R038A94135q4136e3858
15287a82796C16938I7650J36866j15396C1357J6226K5331e2267j39481g0486q758
15276g9244A14474L063J6654a44536b6252k93038b8676I1231J32153e8613G8341
15264D2770A3431a61565a5921j20950B3787R3283D8413h1648G2454a36560G2646
15252I4707N6512N48554k04087P31240K59355k43656L82552G70444B93278H1741
15241A25477A4035J19120L29477a53812J3898C9020K18860m6807b5236A96644
$$ plain form
15230 25227 -78479 -92399 66737 -300878 291517 250411 -39832 221455 91133 166224 190514
15219 190514 -42397 -100175 -91679 216616 202717 -198067 -183532 171193 385315 237805 -52966
15207 -26510 363073 81889 32737 -68306 239434 -82548 295726 110469 64693 18819 134170
15196 134170 249388 178563 57972 315225 -123754 -172470 266516 46521 -17413 1293 280706
15185 280706 288094 -21890 66889 104411 -52286 221948 -27471 -11788 157929 -88336 -299661
15174 -299661 147431 -111881 -35427 -147895 52411 -2307 139063 141243 99198 -48088 24149
15162 -108540 205473 107900 306680 730857 -166779 -1674 565594 -52366 -3975 -12103 46835
15150 49102 -128790 84855 261838 219728 -115018 308213 14485 326333 139462 -23969
$$ packed form
15230B5227g8479j3920F6737c00878B91517m1106c9832B21455I1133P5091K4290
15219A90514d2397n7778Q496B16616j3899a98067J4535A71193K14122j47510e2966
15207b6510C63073H1889C2737f8306B39434h2548B95726A10469m5776A8819J15351
15196A34170J15218p0825E7972K57253a23754m8716B66516D6521a7413A293K79413
15185B80706P388b1890F6889L7522e2286B21948b7471a1788A57929h8336k11325
15174b99661A47431a11881c5427j12468E2411b307A39063K180m2045d8088B4149
15162a08540B05473r7573J98780M24177a66779a674E65594e2366c975q128D6835
15150D9102a28790H4855J76983m2110a15018C08213A4485L11848A39462b3969
$$ plain form
15139 226820 90196 -128 82512 124189 245108 -318410 82714 307494 300474 -77844 168181
15127 -78001 261131 -197641 136036 142988 50053 -175446 6348 -62110 193835 153249 307688
15116 307688 224151 238121 -139142 -71272 428065 111041 306479 179114 40238 -123209
15105 539431 18404 103567 327423 356785 250543 242702 -53548 229348 235633 275678 429815
15094 429815 384260 -152789 88089 117403 -113844 150410 269867 -108236 -86971 224414
15083 -96660 -146047 514150 -60463 105492 89748 158728 150437 -172081 -1701 399511 340040
15072 340040 287542 9875 155535 295204 -82558 200385 374046 252655 245842 117604 166882
15061 166882 110638 89164 216942 92968 267044 142665 -57696 -208644 145561 387445
$$ packed form
15139B26820I0196a28H2512M1677J20919c18410H2714K24780p020g7844A68181
15127g8001B61131a97641A36036O952E0053a75446F348f2110A93835m0586J54439
15116C07688q3537J3970a39142O7870D28065A11041J95438j27365D0238a23209
15105E39431A8404Q5163K23856K9362j06242p841e3548B29348O285M0045J54137
15094D29815m5555a52789H8089K9314a13844A50410J19457a08236K1265B24414
15083i6660m9387E14150f0463A05492j5744O8980q291a72081a701C99511n9471
15072C40040n2498I875J45660J39669h2558B00385J73661j21391o813A17604M9278
15061A66882n6244k1474J27778I2968J74076j24379e7696j50948A45561K41884
$$ plain form
15051 387445 447662 638546 311376 -25387 187130 -1998 177885 283926 249152 356297
15041 356297 91225 284407 57296 94628 -76907 335527 246413 359029 405258 -65241 1489
15029 554116 136035 394295 101157 79126 -86595 421845 264708 -135831 182674 51689
15018 43992 227709 199292 298193 -81767 314784 418002 281127 -8096 -41930 228637 293948
15007 293948 199867 287093 -116776 380566 291474 94262 469624 -111963 363037 -8915 51824
14995 218139 368093 416465 331512 325942 185947 109599 97759 114781 350470 40745 129677
14984 129677 136326 -48081 64413 173956 -19255 421205 126146 173031 -91117 368644 320215
14973 320215 40176 175588 125056 194159 403424 275356 416100 41459 342755 363232
$$ packed form
15051C87445O0217J90884C11376b5387A87130a998A77885J06041l4774J07145
15041C56297I1225J93182E7296L7332g6907C35527q9114J12616M6229f5241A489
15029E54116A36035K58260A01157k2031h6595D21845j57137a35831A82674E1689
15018D3992J83717k8417R8901h1767C14784J03218j36875h096l3834B28637O5311
15007B93948r4081Q7226a16776C80566q9092I4262L75362a11963C63037h915E1824
14995B18139J49954M8372q4953n570j39995p6348j1840J7022K35689D0745Q8932
14984A29677O649d8081F4413J09543a9255D21205A26146M6885i1117C68644m8429
14973C20215D0176J35412n0532O9103K09265j28068J40744D1459L01296K0477
$$ plain form
14963 363232 266277 265788 546605 132212 265290 113116 -34142 303495 459479 245756
14953 245756 117547 135081 497374 108796 45943 -31110 408031 505451 265760 480422
14943 480422 81492 477060 321432 391570 10345 296133 232093 299399 287158 387298 375988
14932 375988 -90594 392924 247419 229753 236893 197468 396645 -141078 156876 -71197 -73269
14921 -73269 274318 298393 412440 323879 121370 43645 251818 511249 112238 281766
14911 281766 -14079 240434 642817 138930 238370 91321 187936 234338 143135 340138 -48740
14899 329915 211464 322347 242435 353879 460681 141343 245240 372957 354542 243353
14889 243353 544999 397952 311364 221303 146101 247644 264521 54976 183265 70805 431638
$$ packed form
14963C63232r6955m89K80817A32212J33078A13116c4142C03495J55984k13723
14953B45756A17547J7534L62293A08796D5943c1110D08031R7420k39691K14662
14943D80422H1492L95568j55628P0138A0345K85788o4040O7306j2241J00140j1310
14932C75988i0594C92924j45505j7666P140l9425J99177a41078A56876g1197k072
14921g3269B74318K4075J14047q8561A21370D3645K08173K59431A12238J69528
14911B81766a4079B40434M02383A38930R9440I1321R6615M6402r1203J97003d8740
14899C29915j18451J10883p9912J11444J06802A41343J03897J27717j8415j11189
14889B43353L01646j47047q6588r0061p5202J01543J6877E4976J28289G0805L60833
$$ plain form
14878 431638 180867 303839 444231 410650 319747 27502 61357 616827 191342 364153
14868 364153 339440 83358 53852 97388 562931 14511 113247 254375 257502 631385 443215
14857 443215 338729 285999 396713 427753 447822 232006 304292 811244 528324 488509
14847 488509 498724 465103 267826 456713 336768 231093 338581 246692 271626 762750
14837 762750 502535 312263 84116 648995 311053 581464 408575 600434 230574 350918
14827 350918 353418 693928 469938 612323 483967 496293 267711 295865 422496 476406
14817 476406 624956 149032 414093 560825 235330 604813 350436 703851 684963 287025
14806 290063 307726 707679 235581 701388 482424 484732 403993 297679 159213 469511
$$ packed form
14878D31638A80867J22972J40392l3581r0903B7502L3855N55470A91342J72811
14868C64153k4713H3358k9506M3536M65543A4511R8736J41128L127L73883j88170
14857D43215j04486n2730J10714L1040K0069k15816P2286N06952k82920l9815
14847D88509J0215l3621j97277J88887j19945j05675J07488r1889K4934M91124
14837G62750k60215j90272H4116N64879C11053K70411j72889J91859B30574J20344
14827C50918K500L40510k23990J42385j28356J2326k28582K8154J26631N3910
14817D76406J48550A49032K65061J46732B35330L69483k54377L53415j8888B87025
14806B90063J7663L99953B35581M65807k18964K308q0739j06314j38466L10298
$$ plain form
14796 469511 385212 470799 427705 552541 741529 290825 233801 582725 549862 644555 335666
14785 335666 628270 490986 431821 407911 406654 180314 630996 492718 347223 761184
14775 761184 292678 531704 525110 631702 464194 472147 512313 815507 656522 557634 643884
14764 643884 582009 894447 570883 670593 450292 573507 605986 174891 629686 639612
14754 639612 388575 484264 836922 673037 442318 612249 541682 621208 819100 480028
14744 480028 751047 814715 705171 728265 714240 370044 597099 514266 604893 791923
14734 791923 621969 450027 898584 407701 635180 458536 776987 726760 677698 549621
14724 549621 870488 640944 551018 403560 902564 813282 520854 929109 754925 486894
$$ packed form
14796D69511q4299Q5587m3094J24836J88988B90825n7024L48924l2863R4693l08889
14785C35666K92604j37284n9165k3910j257A80314M50682j38278j45495M13961
14775G61184B92678K39026o594J06592j67508P953M0166L03194j58985r8888Q6250
14764F43884o1875L12438l23564R9710k20301J23215L2479A74891M54795R926
14754F39612k51037R5689L52658j63885k30719J69931p0567P9526J97892l39072
14744D80028K71019O3668j09544K3094j4025l44196K27055q2833R0627J87030
14734G91923j69954j71942M48557D07701K27479j76644L18451n0227m9062j28077
14724E49621L20867k29544q9926j47458M99004q9282k92428M08255j74184k68031
$$ plain form
14714 486894 775463 754591 952833 828328 1173350 696129 785675 816370 388182 845701
14704 845701 741269 625614 928546 741848 1012011 1171135 646432 1001412 648525 574233
14694 574233 870812 912367 728824 696739 548861 679954 773487 870573 931078 730292
14684 730292 936379 1132133 694322 668997 784300 1084231 1230819 664633 1319361 607545
14673 928813 863979 648841 543310 967270 1039851 767433 753568 1020975 776993 1150537
14663 1150537 918662 1052531 1001931 992251 1268428 900086 908892 997320 917051 945995 1330508
14652 1330508 1140519 1317855 835993 855932 912348 1481076 1053633 961037 1033818 1191324
14642 1191324 954055 1322765 842083 901037 1244168 947837 1360156 1100364 1054184 1410518
$$ packed form
14714D86894K88569k0872J98242j24505L45022m77221Q9546L0695C88182M57519
14704H45701j04432j15655L02932j86698K70163J59124n24703L54980l52887p4292
14694E74233K96579M1555j83543l2085j47878J31093R3533R7086O0505k00786
14684G30292K06087J95754m37811k5325J15303K99931J46588n66186O54728F07545
14673I28813o4834k15138j05531M23960P2581k72418j3865K67407k43982L73544
14663A150537k31875J33869n0600r680K76177l68342Q806Q8428q0269K8944L84513
14652A330508j89989J77336m81862J9939N6416N68728m27443r2596P2781J57506
14642A191324k37269L68710m80682N8954L43131k96331M12319k59792m6180L56334
$$ plain form
14632 1410518 1578248 1098319 1150833 1272329 1166528 1230911 1379629 1141837 1221915 1288815
14622 1288815 1301319 1054688 1348030 989297 1327746 1507246 1319379 1506642 1395378 1471488
14612 1471488 1469703 1081384 1164150 1418798 1541406 1497925 1544068 1281867 1449244 1178344
14602 1178344 1542249 1458035 1102674 1374401 1699899 1405482 1392906 1543119 1800060 1823675
14592 1823675 1784067 1495957 1639537 1628256 1299213 1444833 1603768 1722449 1757271 1843376
14582 1843376 1919121 1810814 1618817 2059272 1556250 1555972 1681481 1821606 1977079 2021375
14572 2021375 2057552 2067678 2106305 1837809 2293612 2130588 2284066 2349922 2111539 2182239
14562 2182239 2595562 2424896 2295385 2706299 2734118 2988583 3089184 3032678 3669991 3620115
$$ packed form
14632A410518J67730m79929N2514J21496j05801O4383J48718k37792Q0078O6900
14622A288815J2504k46631K93342l58733L38449J79500j87867J87263j11264P6110
14612A471488j785l88319Q2766K54648J22608m3481M6143k62201J67377k70900
14602A178344L63905q4214l55361K71727L25498k94417j2576J50213K56941K3615
14592A823675l9608k88110J43580j1281l29043J45620J58935J18681L4822Q6105
14582A843376P5745j08307j91997M40455n03022k78J25509J40125J55473M4296
14572B021375L6177J0126L8627k68496M55803j63024J53478O5856k38383P0700
14562B182239M13323j70666j29511M10914K7819K54465J00601n6506O37313m9876
$$ plain form
14552 3620115 4223114 4298657 5650167 7334780 11161055 20242910 38676746 39850102
14544 39850102 19189119 8428613 4605290 2688605 2632758 1925473 1753977 2112737 1745701
14535 1745701 2028010 2015522 2036801 1715064 1509192 2040099 2059502 2033501 2485466 2100729
14525 2100729 1990603 2198859 2472166 2000015 2135075 2462274 2206987 2761097 2254413
14516 2254413 2375383 2851891 2427379 2123441 2823609 2177977 2673686 2736804 2660114 2809777
14506 2809777 2552678 2955787 2845952 2576645 2653543 2936316 2982203 2837226 2791304 3009002
14496 3009002 3097315 3144456 3035258 3176226 3159627 3166070 3227176 3244594 3593538 3229548 2894570
14485 2894570 3308529 3599363 3293053 3837166 3487977 3242751 3723851 3600478 3667685 3190626
$$ packed form
14552C620115O02999P5543J351510J684613L826275R081855J8433836J173356
14544C9850102A9189119H428613l823323j916685n5847p07285j71496L58760l67036
14535A745701K82309j2488K1279l21737k05872N30907J9403k6001M51965l84737
14525B100729j10126K08256K73307m72151J35060L27199k55287N54110n06684
14516B254413J20970M76508m24512l03938P00168o45632M95709O3118p6690J49663
14506B809777k57099M03109j09835k69307P6898K82773M5887j44977m5922K17698
14496C009002Q8313M7141j09198J40968j6599O443O1106J7418L48944l63990l34978
14485B894570M13959K90834l06310N44113l49189k45226M81100j23373O7207m77059
$$ plain form
14475 3190626 3719543 4224247 3568896 3785432 3736606 4218220 3992482 4202358 4404333 4437381
14465 4437381 4081982 3895398 4416923 4719659 4665739 4530161 4243917 4720216 4475849 4696003
14455 4696003 4551626 4685843 4792127 5091750 5067868 5061375 5198679 5225671 5279320 5526396
14445 5526396 5458198 5609331 5356802 5701826 5695741 5652263 5728053 5818836 6090885 5987098
14435 5987098 6044387 6016154 6029561 6441233 6469800 6329072 6512884 6344200 6958865 6912601
14425 6912601 6923572 7094395 7079039 6997311 7291173 7518512 7474863 7854974 7649406 7737415
14415 7737415 7973956 7953172 7903368 8074745 8444912 8691468 8953483 8600347 8735145 9217037
14405 9217037 9252030 9270365 9598361 9577737 9865176 9711845 9933582 10328227 10260594 10570185
$$ packed form
14475C190626N28917N04704o55351K16536m8826M81614k25738K09876K01975L3048
14465D437381l55399j86584N21525L02736n3920j35578k86244M76299k44367K20154
14455D696003j44377J34217J06284K99623k3882o493J37304K6992N3649K47076
14445E526396o8198J51133k52529L45024o085m3478P5790R0783K72049j03787
14435E987098N7289k8233J3407M11672K8567j40728J83812j68684O14665m6264
14425F912601J0971J70823j5356q1728K93862K27339m3649L80111k05568Q8009
14415G737415K36541k0784m9804J71377L70167K46556K62015l53136J34798M81892
14405I217037L4993J8335L27996k0624K87439j53331K21737L94645o7633L09591
$$ plain form
14395 10570185 10832560 10947394 11283841 11129934 11511620 11652527 12029905 12198133 12574877
14386 12574877 12653646 12825881 12829726 13276476 13341767 13604238 13556447 14300979 14916087 14794737
14376 14794737 14928503 15293524 15635440 15757602 16304749 16718300 16947983 17246873 17691129
14367 17691129 17950387 18226719 18839791 19026952 19830961 20129597 20421549 21139975 21350022
14358 21350022 21705592 22387300 22667894 23638512 23758047 24316611 25161077 25826150 26217438
14349 26217438 26772893 27701533 28262318 29313512 30186842 30994106 31576240 32363439 33411756
14340 33411756 34419264 35112371 36382712 37483192 38274499 39531383 40353512 42147860
14332 42147860 43018576 44499886 45973702 47265443 48899477 50556717 52718500 53771361
$$ packed form
14395A0570185K62375J14834L36447j53907L81686J40907L77378J68228L76744
14386A2574877P8769J72235L845M46750O5291K62471m7791P44532O15108j21350
14376A4794737J33766L65021L41916J22162N47147M13551K29683K98890M44256
14367A7691129K59258K76332O13072J87161Q04009K98636K91952P18426K10047
14358B1350022L55570O81708K80594R70618J19535N58564Q44466O65073L91288
14349B6217438N55455R28640N60785J051194Q73330Q07264N82134P87199J048317
14340C3411756J007508O93107J270341J100480P91307J256884Q22129J794348
14332D2147860Q70716J481310J473816J291741J634034J657240K161783J052861
$$ plain form
14324 53771361 55612667 57315600 59481724 61494634 64044588 66025667 68596542 71052956
14316 71052956 73726931 77072848 79699063 82878361 86231896 90030599 93870876 97704131
14308 97704131 101875369 106388716 110752715 115771394 121017968 126455039 132371210 138474457
14300 138474457 145378882 152024890 159614958 167418743 175318521 184273631 193321294 203318407
14292 203318407 213564231 224150608 235726085 247307866 259462842 272242201 285875335
14285 285875335 299258010 313505317 327516776 341934409 356154371 370242754 384057369
14278 384057369 397220952 409839705 420852979 430673994 438444025 443648796 445221072
14271 445221072 443191948 440568483 436555467 432595342 427041680 419060536 408743268 397208527
$$ packed form
14324E3771361J841306J702933K166124K012910K549954J981079K570875K456414
14316G1052956K673975L345917K626215L179298L353535L798703L840277L833255
14308I7704131M171238M513347M363999N018679N246574N437071N916171O103247
14300A38474457O904425O646008P590068P803785P899778Q955110R047663R997113
14292B03318407J0245824J0586377J1575477J1581781J2154976J2779359J3633134
14285B85875335J3382675J4247307J4011459J4417633J4219962J4088383J3814615
14278C84057369J3163583J2618753J1013274R821015P770031N204771J572276
14271D45221072k029124k623465m013016l960125n553662p981144j0317268j1534741
$$ plain form
14263 397208527 384498215 370259335 354817956 339339207 323612474 308300877 293151270
14256 293151270 278950236 265421287 251743940 239025030 226778633 215489977 204078935
14249 204078935 193690280 184387082 174869496 166381356 158224445 150828365 143573600 136671170
14241 136671170 130241183 124179494 118933151 113829046 108840440 104221751 99337293 95099587
14233 95099587 91538840 87768829 84495073 81044298 77964298 74740953 71887711 68954168
14225 68954168 66615770 63981268 61713589 59554808 57533695 55510344 53741444 52304045
14217 52304045 50406244 48492492 47283376 46020804 44493242 43229099 41679083 40231255
14209 40231255 39260892 38117897 37754289 36651949 35364221 34121401 33331822 32233190
$$ packed form
14263C97208527j2710312j4238880j5441379j5478749j5726733j5311597j5149607
14256B93151270j4201034j3528949j3677347j2718910j2246397j1288656j1411042
14249B04078935j0388655r303198r517586q488140q156911p396080p254765o902430
14241A36671170o429987o061689n246343n104105m988606m618689m884458m237706
14233I5099587l560747l770011l273756l450775l080000l223345k853242k933543
14225F8954168k338398k634502k267679k158781k021113k023351j768900j437399
14217E2304045j897801j913752j209116j262572j527562j264143j550016j447828
14209D0231255r70363j142995l63608j102340j287728j242820p89579j098632
$$ plain form
14201 32233190 31701098 30992353 30244219 29316505 28258505 27646328 26898755 26770729 26098377
14192 26098377 25216243 24281152 23952838 23138220 22951383 22230750 21788784 21067481 20792327
14183 20792327 20870728 19835362 19594111 19150121 18572946 18627157 17750024 17544538 17141193
14174 17141193 16965944 16461765 16075582 15874954 15948617 15613274 15197761 14594108 14381245
14165 14381245 14489505 13815041 13896898 13491437 13240356 13177278 12706708 12589040 12394166 12269651
14155 12269651 12064162 11863223 11607462 11592215 11291187 11053754 10959209 10783096 10271594 10311577
14145 10311577 10148630 9984570 9580712 9821361 9645058 9506191 9315049 9120142 9001497
14136 9001497 8532196 8745139 8785824 8508368 8473937 8200495 8167360 8048527 8062834 7635529
$$ packed form
14201C2233190n32092p08745p48134r27714j058000o12177p47573j28026o72352
14192B6098377q82134r35091l28314q14618j86837p20633m41966p21303k75154
14183B0792327P8401j035366k41251m43990n77175N4211q77133k05486m03345
14174A7141193j75249n04179l86183k00628P3663l35343m15513o03653k12863
14165A4381245J08260o74464Q1857m05461k51081o3078m70570j17668j94874j24515
14155A2269651k05489k00939k55761j5247l01028k37433r4545j76113n11502L9983
14145A0311577j62947j64060m03858K40649j76303j38867j91142j94907j18645
14136I001497m69301K12943M0685k77456l4431k73442l3135j18833J4307m27305
$$ plain form
14126 7635529 7552262 7502657 7435328 7327981 7399296 6958329 7100814 6745138 6784902 6778656 6652029
14115 6652029 6657828 6650513 6403479 6288768 6434277 6078711 5805665 6100398 5819694 5917533
14105 5917533 5735117 5915213 5533985 5761888 5272184 5309089 5104496 5269308 5385001 5026753
14095 5026753 4665001 5180151 4882100 4654429 5099739 4893616 4877440 4734477 4535411 4559572
14085 4559572 4650271 4705696 5040647 4223422 4542465 4297255 4167477 4463990 4465418 4171175
14075 4171175 4033720 3881401 4092166 4046022 3956990 3928526 3710319 4025242 4068425 3465642
14065 3465642 3598836 4223208 3566340 3870796 3698561 3843968 4123867 3661645 3556644
14056 3556644 3670281 3514522 3420354 3465756 3368403 3131835 3513955 3353794 3098160 3255931
$$ packed form
14126G635529q3267m9605o7329j07347P1315m40967J42485l55676L9764o246j26627
14115F652029N799p315k47034j14711J45509l55566k73046K94733k80704R7839
14105E917533j82416J80096l81228K27903m89704L6905k04593J64812J15693l58248
14095E026753l61752N15150k98051k27671M45310k06123j6176j42963j99066K4161
14085D559572R0699N5425L34951q17225L19043k45210j29778K96513J428k94243
14075D171175j37455j52319K10765m6144q9032k8464k18207L14923M3183o02783
14065C465642J33194O24372o56868L04456j72235J45407K79899m62222j05001
14056C556644J13637j55759r4168M5402r7353k36568L82120j60161k55634J57771
$$ plain form
14046 3255931 3060283 3043367 3171387 2821969 3267589 2944652 2849453 2720595 2884406 2863481
14036 2863481 2719825 2985835 2811768 2837081 2401097 2920708 2887035 2638760 2445146 2428273
14026 2428273 2794316 2675864 2674278 2374372 2523115 2331682 2227884 2261469 2317776 2399167
14016 2399167 2440380 2237597 2169765 2244336 2119502 2494425 2278420 1891498 2072236 2073222
14006 2073222 2625068 2258886 1973500 2139957 2113989 1984243 2231903 1678758 1894861 1596536
13996 1596536 1976748 1809181 2054925 1640780 2271485 2291974 2575532 3930809 6241517
13987 6241517 13552203 31813936 38967689 22832384 12238821 7502616 5403146 4476764
13979 4476764 3666011 3256567 2981839 2774670 2416348 2764157 2540689 2382221 2239125
$$ packed form
14046C255931j95648j6916J28020l49418M45620l22937r5199j28858J63811k0925
14036B863481j43656K66010j74067K5313m35984N19611l3673k48275j93614j6873
14026B428273L66043j18452j586k99906J48743j91433j03798L3585N6307Q1391
14016B399167M1213k02783o7832P4571j24834L74923k16005l86922J80738R86
14006B073222N51846l66182k85386J66457k5968j29746K47660n53145K16103k98325
13996A596536L80212j67567K45744m14145O30705K0489K83558J355277K310708
13987F241517P310686J8261733P153753j6135305j0593563m736205k099470r26382
13979D476764q10753m09444k74728k07169l58322L47809k23468j58468j43096
$$ plain form
13970 2239125 2312511 2220019 2234746 2222301 2150510 1879767 1869461 2041748 1929998 1965359 1918080
13959 1918080 1973346 1823182 2183351 1756284 2136770 1968892 1882027 2039686 1358846 2047531
13949 2047531 1567153 1821877 1780376 1751098 1904726 1528654 1743524 1769145 1417924 1572628
13939 1572628 1457274 1762978 1404905 1692008 1578373 1627446 1628541 1810234 1381029 1764677
13929 1764677 1395475 1358774 1436557 1484183 1241820 1728933 1378270 1344817 1134225 1497899
13919 1497899 1288854 1754181 1425243 1504596 1437945 1252532 1566340 1411117 1518506 1117937
13909 1117937 1312923 1318202 1131240 1515140 1250953 1052688 1272792 1395546 1117815 1078380
13899 1078380 1524877 1309719 1508300 1077871 1172497 1213501 953708 1034897 1379680 1273806
$$ packed form
13970B239125P3386r2492J4727j2445p1791k70743j0306J72287j11750L5361m7279
13959A918080N5266j50164L60169m27067L80486j67878q6865J57659o80840O88685
13949B047531m80378K54724m1501k9278J53628l76072K14870K5621l51221J54704
13939A572628j15354L05704l58073K87103j13635M9073J095J81693m29205L83648
13929A764677l69202l6701P7783M7626k42363M87113l50663l3453k10592L63674
13919A497899k09045M65327l28938P9353o6651j85413L13808j55223J07389m00569
13909A117937J94986N279j86962L83900k64187j98265K20104J22754k77731l9435
13899A078380M46497k15158J98581m30429R4626M1004k59793Q1189L44783j05874
$$ plain form
13889 1273806 1032482 1205723 1166395 1397412 940777 1293579 1285936 1192733 872194 1018268
13879 1018268 830813 1247025 898359 1185957 1029262 1036042 1098245 825919 954645 653579
13869 653579 853422 1179212 970632 948488 674172 1017035 1013812 785876 956519 890888
13859 890888 1133944 964556 919326 1002969 806304 991919 811632 1039381 1168498 958975
13849 958975 1062110 821593 1056351 1048165 860890 1256560 780377 970913 725025 524874
13839 524874 796478 871022 905016 898590 819303 649234 704594 951682 1002386 1150185 1087292
13828 1087292 786862 744899 907479 1262224 716257 712560 1012985 684146 797904 646630
13818 646630 751954 1049341 697362 984494 867750 772111 981967 1043595 967525 419098
$$ packed form
13889A273806k41324J73241l9328K31017m56635L52802p643r3203l20539J46074
13879A018268j87455M16212l48666K87598j56695O780O2203k72326J28726l01066
13869F53579J99843L25790k08580k2144k74316L42863l223k27936J70643o5631
13859H90888K43056j69388m5230Q3643j96665J85615j80287K27749J29117k09523
13849I58975J03135k40517K34758q186j87275L95670m76183J90536k45888k00151
13839E24874K71604P4544L3994o426p9287j70069N5360K47088N0704J47799o2893
13828A087292l00430m1963J62580L54745n45967l697L00425l28839J13758j51274
13818F46630J05324K97387l51979K87132j16744r5639K09856O1628p6070D19098
$$ plain form
13807 923303 911912 1154775 751413 661523 683406 919948 742078 632952 820071 928560
13797 928560 591444 653030 542388 587149 465618 413834 558271 504938 693959 423432
13787 423432 473424 515713 718720 787460 613996 558781 878208 711361 405830 706276
13777 706276 809431 412942 741081 752700 575981 693791 523267 688877 546844 424302
13767 424302 331168 885508 525031 613317 603465 580923 562207 683978 592094 649762 602196
13756 602196 395027 262148 719244 733523 563489 743682 436172 644142 596661 639405
13746 639405 411592 544397 737043 400943 463145 688929 704788 273374 998208 234832
13735 664413 347781 693037 417838 457799 525097 802207 774083 548516 881964 685828
$$ packed form
13807I23303j1391K42863m03362q9890K1883K36542j77870j09126J87119J08489
13797I28560l37116O1586j10642M4761j21531n1784J44437n3333J89021k70527
13787D23432M9992M2289K03007O8740j73464n5215L19427j66847l05531L00446
13777G06276J03155l96489L28139J1619j76719J17810j70524J65610j42033j22542
13767D24302r3134N54340l60477Q8286r852k2542j8716J21771r1884N7668m7566
13756F02196k07169j32879M57096J4279j70034J80193l07510K07970m7481M2744
13746F39405k27813J32805J92646l36100O2202K25784J5859B73374P24834B34832
13735F64413l16632L45256k75199L9961O7298K77110k8124k25567L33448j96136
$$ plain form
13725 685828 777806 617330 517970 355283 571745 558354 517084 417704 228631 466358
13715 466358 531852 343681 495263 573670 582952 340346 708693 484829 494915 254701
13705 254701 349059 383602 477068 343393 474139 587141 694157 403525 323595 520940
13695 520940 282292 561533 376545 454641 299798 617220 162723 259544 420385 305869
13685 305869 354928 391838 398099 477969 387971 116749 305694 485150 644492 431591 506858
13674 506858 569917 289297 497472 262367 372661 320252 501277 307550 516009 607084
13664 607084 190156 430041 452733 481428 481325 289954 514261 154849 296425 505039
13654 505039 863183 506638 336258 -20996 475803 347791 520299 492020 380980 385764
$$ packed form
13725F85828R1978j60476r9360j62687K16462j3391m1270r9380j89073K37727
13715D66358O5494j88171J51582P8407R282k42606L68347k23864J0086k40214
13705B54701R4358L4543R3466j33675J30746J13002J07016k90632p9930J97345
13695E20940k38648K79241j84988P8096j54843L17422A62723R6821J60841j14516
13685C05869M9059L6910O261P9870q9998A16749J88945J79456J59342k12901P5267
13674E06858O3059k80620K08175k35105J10294n2409J81025j93727K08459R1075
13664F07084A90156K39885K2692K8695j03j91371K24307A54849J41576K08614
13654E05039L58144l56545j70380b0996D75803j28012J72508k8279j11040M784
$$ plain form
13644 385764 483008 421086 251840 570474 36499 340327 485472 477773 715072 468479
13634 468479 524852 307884 435221 50897 461531 384180 325164 733549 252932 246250 430698
13623 430698 443534 388300 152267 600633 173632 476720 4316 403808 516257 107727
13612 159727 255436 516018 373843 256274 491118 576349 350745 246424 606419 526802
13602 526802 414419 108254 412478 454634 422616 -47645 229436 778970 471193 419679
13592 419679 237485 194792 428084 387387 629939 56367 322735 381424 133400 355312
13582 355312 337018 313602 263166 159984 83893 439348 333971 322988 277039 188780 236626
13571 236626 128948 330621 312987 270962 462755 401057 162148 416842 309810 -19111
$$ packed form
13644C85764R7244o1922j69246L18634C6499L03828J45145p699K37299k46593
13634D68479N6373k16968J27337E0897M10634p7351n9016M08385B52932o682J84448
13623D30698J2836n5234A52267M48366A73632L03088D316L99492J12449A07727
13612A59727R5709K60582j42175j17569K34844Q5231k25604j04321L59995p9617
13602E26802j12383A08254L04224M2156l2018d7645B29436N49534l07777n1514
13592D19679j82194m2693K33292m0697K42552E6367K66368N8689A33400K21912
13582C55312j8294k3416n0436j03182p6091L55455j05377j0983m5949q8259M7846
13571B36626j07678K01673j7634m2025J91793o1698A62148K54694j07032a9111
$$ plain form
13560 468707 377281 70072 185188 189574 322800 119515 613777 177957 217788 230888 263670
13549 263670 199541 128050 202324 560842 178256 37085 67934 454478 134252 231001 181259
13538 181259 215318 199206 179919 -85138 238488 99968 360969 408661 670002 346916 494766
13527 494766 293836 224186 275145 -20287 427975 -23478 -35368 140221 229890 430480 79231
13515 107270 222506 270469 310563 -66311 85096 100612 378335 120703 -85356 210894 403995
13504 403995 41724 230915 459833 260331 242427 130359 581080 151325 303134 299496
13494 299496 281691 9554 459996 -105310 341994 -7657 349391 96613 214363 23577 402233
13483 402233 62439 356905 272156 290656 310297 199273 360029 14964 168287 201565 326532
$$ packed form
13560D68707r1426G0072J15116M386J33226A19515M94262A77957L9831J3100L2782
13549B63670o4129p1491P4274L58518A78256C7085L0849L86544A34252R6749m9742
13538A81259L4059j6112j9287h5138B38488I9968K61001M7692K61341l23086J47850
13527D94766k00930o9650N0959b0287D27975b3478j1890A40221Q9669K00590G9231
13515A07270J15236M7963M0094f6311H5096J5516K77723A20703h5356B10894J93101
13504D03995D1724J89191K28918j99502j7904j12068M50721A51325J51809l638
13494B99496j7805I554M50442a05310C41994g657C49391I6613J17750B3577L78656
13483D02233F2439K94466q4749J8500J9641j11024J60756A4964J53323L3278J24967
$$ plain form
13472 326532 -33872 421475 255259 322955 186508 177060 -180399 213368 286832 177151
13462 177151 126788 338944 89202 38549 142055 -243373 17317 435338 69988 178265
13452 178265 327471 -37348 376781 498563 338275 443871 213593 131751 298674 -54013
13441 104064 216685 -94990 417348 221229 66246 221134 -191995 378362 113228 336975
13431 336975 209684 23095 319029 190723 295955 304643 144920 41630 199950 492013
13421 492013 -21078 635430 240600 -207212 307952 84869 452329 -56874 -23905 40248
13410 1566 263734 -79872 33356 329240 -33102 307301 443401 329487 80346 407604 199920
13398 -186006 169394 84247 324379 331537 -98063 289477 39993 -148701 71274 208023 -96645
$$ packed form
13472C26532c3872D21475j66216O7696j36447r448a80399B13368P3464j09681
13462A77151n0363K12156H9202C8549J03506b43373A7317M18021F9988J08277
13452A78265J49206c7348C76781J21782j60288J05596B13593q1842J66923e4013
13441A04064J12621i4990D17348j96119F6246J54888a91995C78362A13228K23747
13431C36975j27291B3095K95934j28306J05232Q688A44920D1630J58320K92063
13421D92013b1078F35430B40600b07212C07952H4869L67460e6874b3905D0248
13410A566K62168g9872C3356K95884c3102C07301J36100j13914H0346L27258A99920
13398a86006A69394H4247K40132P158i8063B89477C9993a48701G1274J36749i6645
$$ plain form
13386 234967 -138789 -151896 365862 484811 109196 80898 144100 221064 28147 206601
13376 206601 -52779 128049 149615 108050 32353 176103 218144 243761 195414 213579 532848
13365 532848 17709 241367 147748 87974 395597 279894 72440 82480 424954 152248
13354 -39384 196608 519971 9735 302871 89359 -84145 -62295 180945 299303 211812 512980
13343 512980 198650 156662 426926 -180746 -156865 270380 118822 144628 -86550 364422
13332 37400 170580 436932 -167071 528934 243828 55316 154616 65507 -33621 100636
13321 312836 334105 159037 378439 -89566 -57668 373470 166606 368596 -6337 11277 349548
13310 349548 -11975 48718 253511 279269 107844 32104 50371 98209 208546 550431 -72586
$$ packed form
13386B34967a38789j3107C65862J18949A09196k8298O3202P6964B8147J78454
13376B06601e2779A28049K1566m1565C2353J43750M2041K5617m8347J8165L19269
13365E32848A7709K23658r3619n9774L07623j15703G2440J0040L42474A52248
13354c9384A96608L23363I735K93136H9359h4145K1850A80945J18358q7491L01168
13343E12980A98650m1988K70264a80746K3881B70380A18822K5806h6550C64422
13332C7400J33180K66352a67071E28934B43828E5316R9300F5507c3621A00636
13321C12836K1269A59037K19402h9566L1898C73470A66606K01990f337A1277L38271
13310C49548a1975D8718K04793K5758A07844C2104J8267M7838J10337L41885g2586
$$ plain form
13298 -13222 38203 286300 83430 -110620 -112735 124189 553698 22452 415414 275392 126466
13286 -69137 265594 -161428 154924 -119988 91131 66488 21219 302994 -28381 325348
13275 33182 26167 356366 -65309 280477 150710 248553 235896 -158591 -201174 -17018 42716
13263 414244 21881 137058 -44041 -66789 -223409 107560 183332 142969 217523 69312 460462
13252 460462 -229038 52115 -252147 181577 155741 46583 -38360 -64220 20278 294769 311284
13241 311284 159636 195466 233402 -36685 28971 160005 259156 46245 44694 244941 63311
13229 -215618 224494 -137590 45480 -297536 -233820 209800 7264 260278 12815 -269312
13218 84767 252116 170714 252278 32773 -202605 188031 240458 394344 216447 194610 -289056
$$ packed form
13298a3222C8203K48097H3430a10620k115A24189M29509B2452L92962j40022A26466
13286f9137B65594a61428A54924a19988I1131k4643B1219K81775b8381C25348
13275C3182p015L30199f5309B80477j29767R7843j2657a58591m2583a7018D2716
13263D14244B1881J15177d4041k2748j56620A07560P5772m0363P4554F9312L91150
13252D60462b29038E2115b52147A81577k5836D6583c8360k5860B0278K74491J6515
13241C11284j51648L5830L7936c6685B8971J31034R9151D6245j551K00247F3311
13229b15618B24494a37590D5480b97536O3716B09800G264K53014A2815b69312
13218H4767J67349q1402Q1564C2773b02605A88031N2427J53886j77897k1837b89056
$$ plain form
13206 32072 108095 -75657 21454 246539 198338 443326 358332 127958 95015 -72280 -53744
13195 -53744 16238 -39451 -24898 24603 112713 22 146668 171795 -75364 80464 287593 65655
13182 37384 194664 172465 -256622 141389 33357 77086 113870 -110828 -52100 95805 -98400
13170 68624 30398 148271 218633 177020 -160778 -156941 -7955 -177436 206349 356907 14675
13158 125820 -232944 -32884 183198 26437 7315 174545 201686 10500 119757 -27689 194404
13146 47164 252701 -305678 237061 157119 -28788 -82181 -44559 253030 204973 -154247 -192348
13135 -192348 528018 -42780 315361 307913 174374 95459 -136705 133060 362 -283561 -6182
13123 -127583 56271 -78320 16659 329936 -454221 -10744 19096 -234157 191502 36457 -42811
$$ packed form
13206C2072P6023g5657B1454K25085m8201K44988q4994A27958l2943g2280J8536
13195e3744A6238c9451J4553B4603Q8110B2J46646K5127g5364H0464K07129F5655
13182C7384J57280k2199b56622A41389C3357M3729L6784a10828e2100I5805i8400
13170F8624C0398J17873P0362m1613a60778L837g955j69481B06349J50558A4675
13158A25820b32944c2884A83198B6437G315J67230K7141A0500J09257b7689A94404
13146D7164K05537c05678B37061p9942b8788n3393L7622B53030m8057a54247l8101
13135a92348E28018d2780C15361p448j33539p8915a36705A33060C62b83561f182
13123a27583E6271g8320A6659L13277d54221a0744A9096b34157A91502C6457d2811
$$ plain form
13111 -66655 367924 -35201 253101 -269767 93528 39162 172728 66592 121316 72038 142626
13100 142626 170788 355403 48628 227099 -116498 226257 2423 127681 113219 -97172 -57413
13089 -57413 -97850 17649 173653 260822 292419 -251424 -174901 -44171 13339 -1005 196840
13077 17327 69738 -328146 -34551 -45288 129405 140638 -186333 205177 91517 106664 370906
13066 370906 18924 -28444 360596 -8535 122176 -147417 6105 167341 -62351 429025 14432
13054 71393 55304 3237 113835 69709 100408 155610 -93361 235428 351908 -80790 197589
13042 565698 -162792 -119577 -17916 134106 110254 301369 19138 91304 372698 38459 -186717
13030 -367173 60244 -162007 11511 67581 233948 454948 114787 255193 -100147 299768
$$ packed form
13111f6655C67924c5201B53101b69767I3528C9162J33566F6592N4724m9278P0588
13100A42626K8162J84615D8628J78471a16498B26257B423J25258j4462i7172L9759
13089e7413m0437A7649J56004Q7169L1597b51424P6523d4171A3339a005A96840
13077A7327N2411c28146c4551j0737A29405J1233a86333B05177I1517J5147K64242
13066C70906A8924b8444C60596h535A22176a47417F105J61236f2351D29025A4432
13054G1393j6089C237J10598m4126L0699N5202i3361B35428J16480h0790A97589
13042E65698a62792M3215a7916A34106k3852J91115A9138P2166K81394C8459a86717
13030c67173F0244a62007A1511N6070J66367K21000A14787J40406a00147B99768
$$ plain form
13019 90212 182739 -181493 33242 113195 -22547 134365 -237241 68085 -99352 321801 20251
13007 -7735 90544 -6730 -64189 -14630 -198500 -8680 -3854 -225721 235519 33591 331326 -69226
12994 167902 116568 56838 226185 42815 -222749 105847 335066 -55332 -99075 144737
12983 -10962 -23785 142008 -59876 320726 143907 205949 176345 109856 -48467 167748 -107703
12971 133000 541436 284663 27880 -28363 18195 68206 -75703 219085 -4367 -5779 3848
12959 -5188 27445 -17325 260856 229653 -139250 201757 209842 -139115 -200054 6646 -327421
12947 -113690 13918 -108805 -132577 81497 56989 184012 -7883 -109923 57364 112524 180911
12936 180911 -265492 -150266 221516 -135636 387255 50214 -182258 27312 -77952 152947
$$ packed form
13019I0212R2527a81493C3242P9953b2547A34365b37241F8085i9352C21801B0251
13007g735I0544f730n7459a4630j83870h680c854k21867B35519C3591K97735f9226
12994A67902n1334E6838J69347D2815b22749A05847K29219e5332m3743A44737
12983a0962j2823A42008e9876C20726A43907O2042k9604o6489d8467A67748a07703
12971A33000M08436k56773B7880b8363A8195N0011g5703B19085d367j412C848
12959e188B7445a7325B60856l1203a39250B01757Q085a39115o0939F646c27421
12947a13690A3918a08805k3772H1497k4508J27023g883j02040E7364N5160O8387
12936A80911b65492J15226B21516a35636C87255E0214a82258B7312g7952A52947
$$ plain form
12925 212338 326333 97777 70749 -43506 36819 131881 -97723 15881 -316096 28238 183325
12914 183325 32535 -47990 67325 -237570 46263 -32139 13218 142155 -8226 34613 348965
12903 348965 189188 52083 174019 -208230 118561 335665 97812 -32802 90932 -267965
12892 323328 235526 -168999 27160 192754 -10517 98588 177844 20535 -825 67824 -4288 15724
12879 100882 -66914 257201 -212895 -123855 479171 220152 134383 210099 -39044 -130301 69818
12867 -134390 8639 389441 -199838 122030 318395 -106006 -13693 -124985 93610 -179857
12856 143633 -19132 429791 176194 94390 -32477 -109769 69234 84582 80263 -128794 -301247
12845 -301247 58549 205418 185266 -278208 58250 -95388 217168 179531 241150 -26971 -253372
$$ packed form
12925B12338J13995I7777k7028d3506C6819R5062i7723A5881c16096B8238J55087
12914A83325C2535d7990F7325b37570D6263c2139A3218J28937h226C4613L14352
12903C48965j59777E2083J21936b08230A18561K17104I7812c2802I0932b67965
12892C23328q7802a68999B7160J65594a0517I8588P9256B0535h25F7824d288A5724
12879A00882f6914B57201b12895Q9040D79171B20152q5769P5716c9044r1257F9818
12867a34390H639L80802a99838A22030J96365a06006a3693j11292I3610a79857
12856A43633a9132D29791A76194q1804c2477p7292F9234J5348m319a28794j72453
12845c01247E8549J46869k0152b78208E8250i5388B17168l7637O1619b6971k26401
$$ plain form
12834 -253372 -145785 97140 -227571 484442 20148 -312239 -33488 104023 378029 -79318
12823 38588 87748 42033 -182817 46327 48772 -200706 17098 92800 89594 -122760 83243
12811 -121040 190613 -294007 -392089 -77690 309587 442341 9795 -159066 62940 -261259
12800 -105729 -289837 -118098 93343 -103297 -26705 -393791 -205166 16273 -47379 -113336
12790 -113336 102988 -247442 -107456 243440 -67536 -2644 -95641 -9552 -10119 17213 -31553
12778 -210614 178249 -419770 48381 284581 -307359 -317008 242439 129392 -74757 -137051
12768 -137051 420076 -481333 -2974 -174740 -59358 190546 -156776 167366 314108 30653
12757 -216205 -7717 -59415 -177421 101670 135561 -165205 -48156 64354 62419 253665 71763
$$ packed form
12834b53372J07587I7140b27571D84442B0148c12239c3488A04023K74006g9318
12823C8588M9160D2033a82817D6327K445b00706A7098P5702l206a22760H3243
12811a21040A90613b94007r8082g7690C09587J32754I795a59066F2940b61259
12800a05729j84108a18098I3343a03297b6705l67086J88625A6273d7379o5957
12790a13336A02988b47442a07456B43440f7536b644r2997i552n67A7213c1553
12778b10614A78249d19770D8381K36200c07359r649B42439j13047g4757o2294
12768a37051D20076d81333b974j71766e9358A90546a56776A67366J46742C0653
12757b16205g717n1698j18006A01670L3891a65205d8156F4354j935J91246G1763
$$ plain form
12745 -116855 10951 -41606 -189092 -105840 -110788 63680 -60211 37220 -135691 91333 -166946
12733 219443 102948 163707 -299434 -70197 -64224 84432 116456 33365 -82248 -312325 170878
12721 47830 110371 76360 160895 -287342 297184 -92729 349178 56566 133408 -145798 -38982
12709 88090 84595 -92328 -9734 112390 -49819 -49521 135969 233780 -79971 222189 25331 -156608
12696 -115231 -90780 376167 176567 113888 -2542 13787 -160382 60137 -117885 52590 -367192
12684 60902 40727 385730 423907 2725 22168 289066 164550 -69801 148298 26977 312769
12673 312769 343045 531151 91184 -22339 23533 238547 24360 11935 210830 269739 50418
12661 405626 248643 248059 -128655 241992 202309 53123 106591 337549 331853 90151 -92714
$$ packed form
12745a16855A0951d1606j47486Q3252m948F3680f0211C7220a35691I1333a66946
12733B19443A02948O0759b99434g0197N973H4432L2024C3365h2248k30077A70878
12721D7830O2541l4011Q4535b87342B97184i2729C49178E6566P6842a45798c8982
12709H8090l495i2328i734A12390d9819K98A35969R7811g9971B22189B5331a56608
12696a15231K4451C76167A76567o2679b542A3787a60382F0137a17885E2590c67192
12684F0902k0175L45003L8177B725J9443K66898j24516f9801A48298B6977K85792
12673C12769L0276J88106I1184b2339B3533K15014B4360A1935J98895N8909E0418
12661D05626j56983n84a28655B41992l9683E3123N3468K30958n696I0151i2714
$$ plain form
12649 -164136 215777 102185 -347517 167340 16015 -237622 96830 -1729 141864 364292
12639 364292 146411 323373 -38182 64721 145361 -32407 -358765 126725 269492 229830
12629 229830 203561 184297 577609 127230 -161006 182424 120132 130187 -34787 54877 177098
12618 177098 84497 367680 471648 14622 132448 57147 285209 148167 -143245 76868
12607 46128 -439734 -55979 -303231 -160403 189530 209532 267712 -352902 117384 -281923
12596 175736 -287465 254727 109841 84622 324163 -31166 -69014 489927 223000 -125792
12585 -167727 -11908 -163029 135665 195769 -175493 -170862 58296 -62716 200069 259328 203412
12574 203412 -52798 192151 215818 310550 132576 -97880 -131563 212126 -111278 414493
$$ packed form
12649a64136B15777A02185c47517A67340A6015b37622I6830a729A41864K22428
12639C64292A46411J76962c8182F4721Q0640c2407l26358A26725J42767l9662
12629B29830k6269j9264L93312A27230a61006A82424o2292J0055c4787E4877J22221
12618A77098H4497K83183J03968A4622J17826E7147K28062j37042a43245G6868
12607D6128d39734e5979k47252J42828A89530K0002N8180c52902A17384b81923
12596A75736b87465B54727A09841k5219K39541c1166l7848D89927B23000a25792
12585a67727a1908j51121A35665O0104a75493M631E8296f2716B00069N9259n5916
12574B03412e2798A92151K3667R4732A32576i7880l3683B12126a11278D14493
$$ plain form
12563 -146608 -4326 -206662 -103676 81001 205867 22157 -229480 49489 -481807 63600 211295
12552 211295 281655 -97495 -118133 312746 -82928 13552 -86212 -290869 -359112 -234742 91987
12540 94088 53966 38468 105898 -203840 -57218 -115737 29697 217871 -8435 283228 232605
12529 232605 -193587 95763 114976 60193 -212018 -104493 149535 25093 133469 -262948
12518 32250 -223308 -26338 18799 -196500 118288 374926 -317099 136991 18877 -86514
12507 -217758 -189023 41620 -366188 141603 -223131 35987 252545 202515 56506 -32621 -182592
12496 -182592 154970 19940 -197949 -103158 -171797 -231146 -116886 25213 -53174 104730 291428
12485 291428 593203 -114365 -221852 -325921 -151845 104830 -42870 49783 -53351 -211053
$$ packed form
12563a46608d326k02336J02986H1001J24866B2157b29480D9489d81807F3600J47695
12552B11295P0360i7495k0638C12746h2928A3552h6212k04657o8243J24370I1987
12540I4088m0122j5498O7430b03840e7218n8519B9697J88174h435B83228n0623
12529B32605a93587I5763J9213n4783b12018a04493A49535B5093J08376b62948
12518C2250b23308b6338A8799a96500A18288K56638c17099A36991A8877h6514
12507b17758K8735D1620c66188A41603b23131C5987K16558n0030E6506c2621j49971
12496a82592A54970A9940a97949R4791o8639n9349J14260B5213e3174A04730J86698
12485B91428L01775a14365j07487j04069a51845A04830d2870D9783e3351j57702
$$ plain form
12475 -211053 -222184 -92539 130064 230967 -371541 -201801 -237465 103109 -145169 -187141
12465 -187141 91998 30614 174697 98798 -51407 101915 -251446 64839 -242058 229149
12454 389673 -55643 356887 -40151 119286 12940 -229015 -164834 44773 166831 164895 -93816
12442 -168185 154513 142419 -201980 -150802 -264387 18634 38451 -13483 5390 29335 136335
12431 136335 -67616 192554 22954 44881 404349 -216826 -302428 81896 -50531 96176 -71199
12419 -3791 -175422 28112 -163920 -211923 43313 330444 101791 -37564 60209 -228477 96170
12407 125479 -6342 -195582 -193878 -215147 -63439 30348 187057 -50260 -35879 63877 -96785
12395 31455 -122365 155533 250481 -263729 2293 190834 -464955 -300191 38311 -147794
$$ packed form
12475b11053j1131i2539A30064J00903c71541J69740l5664A03109a45169m1972
12465a87141I1998C0614J44083p5899e1407A01915b51446F4839b42058B29149
12454C89673e5643C56887d0151A19286A2940b29015O4181D4773J22058j936i3816
12442a68185A54513j2094b01980N1178j13585A8634J9817a3483E390K3945J07000
12431A36335f7616A92554B2954K1927L59468b16826q5602H1896e0531I6176g1199
12419c791j71631B8112a63920m8003D3313K87131A01791c7564F0209b28477I6170
12407A25479f342j89240J704k1269f3439C0348J56709e0260J4381F3877i6785
12395C1455a22365A55533R4948b63729B293J88541d64955J64764C8311a47794
$$ plain form
12384 -305538 -292437 -1960 -152959 87489 -89524 -205267 167701 65480 -40417 158076 -2213
12372 105907 122538 145668 -509283 -30038 162175 83792 -314753 145717 70642 -145043
12361 -130051 57127 146215 94103 299944 400556 152114 484050 -227193 -91269 -114213
12351 -114213 50996 -56758 47617 203865 111456 14159 67177 -127868 137025 56423 224734
12340 224734 128600 -107706 341337 70631 299361 -109361 -239042 -189693 254899 47178
12329 -378166 77284 -253542 -65093 -200747 -32903 -83463 68203 -137148 292083 186225
12319 186225 9766 -156358 137486 -59289 -65172 96399 -37254 2389 263203 -274990 33683
12307 -3792 -113162 -36793 325190 72513 -60122 -436582 -176341 -123062 -126632 -185468 159795
$$ packed form
12384c05538J3101a960j50999H7489h9524j15743A67701F5480d0417A58076b213
12372A05907J6631K3130e09283c0038A62175p8383c14753A45717G0642a45043
12361a30051E7127Q9088n2112K05841J00612A52114L31936b27193i1269k2944
12351a14213E0996e6758D7617J56248r2409A4159N3018a27868A37025E6423J68311
12340B24734r6134a07706C41337G0631K28730a09361j29681M9349B54899D7178
12329c78166G7284b53542f5093j35654c2903n0560F8203a37148B92083j05858
12319A86225I766a56358A37486e9289n883I6399c7254B389K60814b74990C3683
12307c792j09370c6793C25190G2513f0122l76460a76341N3279l570n8836A59795
$$ plain form
12295 -269808 347148 181014 138676 -115097 -229944 34261 -4926 243065 139063 -247034
12284 -8179 92283 32793 227578 159150 -165121 -173325 -160059 31021 188194 82370 288747
12273 288747 194478 -142488 174460 -116310 -80526 228099 133950 -2345 176736 -544787
12262 293155 92078 24519 -14957 419569 -24046 -16161 65693 -194392 -19686 80119 246396
12251 246396 228284 -184105 78180 -77087 48112 -68013 -245181 -179954 159683 92588 -31233
12239 306901 -112380 140550 349836 -190259 -125393 132456 53644 223186 -8230 -128404
12229 -128404 306729 377824 91925 272229 -187103 99284 360047 62101 278672 351664
12219 351664 107732 303533 -69324 282391 216230 242356 254682 -139777 435131 -143024
$$ packed form
12295b69808C47148j66134m2338a15097j14847C4261d926B43065j04002b47034
12284h179I2283C2793J94785o8428a65121q204J3266C1021J57173H2370K06377
12273B88747r4269a42488A74460a16310L5784B28099r4149b345A76736e44787
12262B93155I2078B4519a4957D19569b4046P885F5693a94392a9686H0119J66277
12251B46396j8112a84105G8180g7087D8112f8013j77168O5227A59683o7095c1233
12239C06901a12380A40550K09286a90259O4866A32456E3644J69542h230j20174
12229a28404C06729P1095I1925J80304a87103I9284K60763F2101K16571P2992
12219C51664A07732J95801f9324B82391o6161K6126J2326a39777D35131a43024
$$ plain form
12208 133330 -37919 -34563 -242888 26936 31443 438944 263212 237625 -57785 567498 201544
12196 -7029 251621 182853 269384 292025 81010 -42365 132388 312164 158204 124526 70935
12185 70935 -61809 -11408 82103 -20687 -22485 29737 73331 -151669 -124280 -100269 40636 51711
12173 51711 -259557 -4097 398852 137620 -95809 106423 399503 226974 16011 269054
12163 269054 -124369 247663 -38778 -306132 112910 231299 2369 15013 291165 43400
12152 -79789 209806 198888 133415 -255204 -65518 -51320 -244547 197188 114748 -129876 96125
12140 146455 27660 -36504 -190744 123211 156051 370678 -301733 -26086 381120 -134196
12129 194382 80224 -23817 -31437 177857 -517155 224782 138995 114430 -137512 -244117 117832
$$ packed form
12208A33330c7919L356k08325B6936M507M07501j75732k5587e7785E67498B01544
12196g029B51621o8768Q6531K2641H1010d2365A32388J79776j53960l3678n3591
12185G0935f1809a1408H2103b0687j798B9737M3594a51669K7389K4011D0636J1075
12173E1711b59557d097C98852A37620i5809A06423K93080j72529A6011K53043
12163B69054a24369B47663c8778k67354A12910J18389B369J2644K76152D3400
12152g9789B09806j0918o5473b55204f5518J4198j93227A97188q2440a29876I6125
12140A46455B7660c6504j54240A23211L2840K14627c01733b6086C81120a34196
12129A94382H0224b3817p620A77857e17155B24782q5787k4565a37512j06605A17832
$$ plain form
12117 63123 174307 243013 -182875 -43813 105827 7699 103081 84887 126853 -79923 -180815
12106 -180815 -277284 190980 -83326 -19686 264168 -168388 140474 -284528 53717 35462
12096 35462 -66740 -42285 -365763 24697 -14782 270608 238593 263956 324813 44294 -36203
12084 127194 -157747 128425 146015 -130290 32901 284114 182348 -367079 532977 980815
12074 980815 1487868 566448 167334 -334245 87453 164621 -11544 -112963 82908 512055
12064 512055 -275099 -330064 -214527 210858 -140224 -66123 -70467 74239 166806 -56746 3142
12052 301926 -193160 167184 125633 2541 188704 -152398 58578 -78501 107962 -429434
12041 164969 303600 -394539 -40444 32687 -164018 -150329 -131445 65594 -9677 -52936 200045
$$ packed form
12117F3123J11184O8706a82875d3813A05827G699R5382j8194M1966g9923j00892
12106a80815r6469A90980h3326a9686B64168a68388A40474b84528E3717j8255
12096C5462f6740K4455l23478B4697a4782B70608l2015K5363O0857D4294c6203
12084A27194a57747A28425J7590a30290C2901K51213j01766c67079E32977M47838
12074I80815N07053E66448A67334c34245H7453P7168a1544j01419H2908M29147
12064E12055b75099n4965J15537B10858a40224f6123m344G4239R2567e6746C142
12052C01926a93160A67184m1551B541J86163a52398E8578g8501A07962d29434
12041A64969J38631c94539d0444C2687a64018J3689J8884F5594i677m3259B00045
$$ plain form
12029 -2888 -167142 -261449 -3816 189665 75087 139867 -14968 51435 -291283 -201122 23024
12017 -74381 19701 79099 -215546 -67585 164729 14119 -220078 -127933 315141 228 31065
12006 31065 -127869 88547 230694 269310 23900 76069 318137 -173646 -92016 92742 200066
11995 200066 3714 -70513 -88038 -98059 -50406 -197510 -31350 41963 214147 128110 -86923
11983 -16961 -202051 151087 -122333 -30054 140519 215040 48387 -41545 -3845 -30482 113607
11971 -460511 45014 262884 -191135 160451 -39386 -396419 -134783 -261411 -17424 -97114
11961 -97114 -24337 -18754 5249 -537082 -17432 -146638 -285973 -17849 28363 -271667 -273127
11950 -273127 -192203 7075 -47327 288655 -150271 61000 5027 275683 -93161 -80117 -49948
$$ packed form
12029b888j64254r4307c816A89665G5087O4780a4968E1435b91283R0161B3024
12017g4381A9701N9398b15546f7585A64729A4119b20078R2145C15141B28L0837
12006C1065a27869H8547J42147L8616B3900N2169K42068a73646Q1630I2742J07324
11995B00066C714g0513j7525j0021M7653j47104c1350D1963J72184q6037h6923
11983a6961j85090A51087a22333c0054A40519P4521D8387d1545c845k6637A13607
11971d60511D5014K17870a91135A60451c9386l57033a34783j26628a7424p9690
11961i7114b4337N583E249e37082a7432j29206j39335a7849B8363b71667j460
11950b73127Q0924G075d7327B88655a50271F1000E027K70656i3161J3044L0169
$$ plain form
11939 -49948 114568 27959 -67389 -67179 22266 145160 99171 -304203 -73100 -227834 110558
11927 -217345 -136310 140521 -106789 -245173 248931 -13066 -155226 120730 235246 -66439
11916 -247209 180133 -392042 -259866 524806 143935 210439 64775 -48306 -221164 105013
11905 137158 -181413 -63039 312092 15470 138638 -3502 -225221 47567 -107021 -178456 -247229
11894 -247229 2252 -90568 -285103 -356769 79839 79376 356539 -27218 -61785 -289896 -71523
11882 81442 53308 -369697 181847 109264 132184 141540 220616 -107358 -99004 189129 -11578
11870 72301 -149566 -105515 -32808 -29068 6105 -104218 -62348 24954 279886 -138554 75581
11858 -63740 -196423 -315521 78883 -47548 -281999 -382105 -5779 -385738 -37166 -491276 34258
$$ packed form
11939d9948A14568B7959f7389K10B2266J22894m5989c04203g3100j54734A10558
11927b17345Q1035A40521a06789j38384B48931a3066j42160A20730J14516f6439
11916b47209A80133c92042J32176E24806A43935O6504F4775d8306j72858A05013
11905A37158a81413f3039C12092A5470J23168c502k21719D7567a07021p1435o8773
11894b47229B252i0568j94535p1666G9839m63K77163b7218l4567k28111g1523
11882H1442k8134c69697A81847p2583K2920R356P9076a07358Q354A89129a1578
11870G2301a49566M4051c2808L740F105a04218M1870B4954K54932a38554G5581
11858f3740j32683j19098G8883d7548k34451j00106e779l79959c7166m54110C4258
$$ plain form
11846 138467 208964 -58436 139313 -141583 205294 -213261 -193863 -124685 -43584 -270751
11836 -270751 -84501 -153569 192775 -113694 -15275 179490 -136810 -223382 121290 13616
11825 -107347 -153705 36635 -36150 101199 -254828 -91729 -83938 210307 28089 24012 173809
11814 173809 -120689 99946 477 -12673 -353 -73626 -158613 -65226 -97851 -175789 -54859 -67367
11802 -67367 186349 124711 35863 185417 -144321 43387 -189713 -27426 -3103 437416 -55705
11790 79436 -73745 273234 -226739 -273533 -376054 95004 -144004 56445 -374134 -236146
11780 -236146 -198144 -164024 -47484 137588 -155138 -231266 178257 201521 -13229 -429483 -260199
11769 -260199 -13340 125516 77766 21797 -321010 -99260 132956 84361 -139689 199592
$$ packed form
11846A38467P0497e8436A39313a41583B05294b13261J9398O9178d3584k27167
11836b70751h4501o9068A92775a13694a5275A79490a36810q6572A21290A3616
11825a07347m6358C6635c6150A01199b54828i1729P791B10307B8089m077J49797
11814A73809a20689I9946D77a2673c53p3273q4987f5226l2625p7938e4859j2508
11802f7367A86349o1638C5863J49554a44321D3387a89713b7426c103D37416e5705
11790G9436g3745B73234b26739m6794j02521I5004a44004E6445c74134J37988
11780b36146L8002L4120d7484A37588a55138p6128A78257K3264a3229m16254J69284
11769b60199a3340A25516m7750B1797c21010i9260A32956m8595a39689A99592
$$ plain form
11758 38226 -44801 11530 -89511 -34914 -182760 -108777 431200 211519 -251253 50720 -32643
11746 220849 48891 170121 5959 -345341 156827 -170649 160830 341181 78024 -103683
11735 11725 -100287 102256 286074 36870 100493 -193026 173744 -221714 337602 85519
11724 -82160 80862 -6194 295540 115006 -133743 -138133 125160 93742 179853 -42637 3018
11712 -351828 87593 -136871 -48629 102518 -37830 203155 -31619 -180093 -133483 -87046 -124955
11701 -124955 -105740 193143 145193 -140827 -102873 332249 -203931 -295906 610 -113620 24607
11689 199164 -147656 316721 15468 -31463 -12927 63562 192817 16639 -141185 344955
11678 149609 215144 91997 141763 -214163 -9999 -168930 -37999 -195836 -345048 -197135 -62656
$$ packed form
11758C8226d4801A1530h9511c4914j47846P3983D31200B11519b51253E0720c2643
11746B20849D8891J21230E959c45341A56827a70649A60830J80351G8024a03683
11735A1725a00287A02256J83818C6870O3623a93026A73744b21714C37602H5519
11724h2160H0862f194B95540A15006a33743m390A25160l1418Q6111d2637C018
11712c51828H7593a36871d8629A02518c7830B03155c1619j48474M6610M6437l7909
11701a24955J9215A93143m7950a40827L7954C32249b03931r1975F10a13620B4607
11689A99164a47656C16721A5468c1463a2927F3562J29255A6639a41185C44955
11678A49609O5535I1997M9766b14163i999j58931c7999j57837j49212J47913f2656
$$ plain form
11666 13100 -125722 -2409 -214330 60733 50975 104131 -252712 216596 -156206 -113425 430050
11654 -83355 137759 277181 -138209 -36714 -50076 -3015 -128255 279208 91272 -303560 -166193
11643 -166193 116967 -230723 25818 155274 -199067 -224757 -292500 -65872 -87299 31060 238767
11632 238767 -50703 -332827 93408 -91364 -192978 132784 60263 -94591 -123733 -16672 133963
11620 -169887 113057 100762 -300562 308924 245026 -9078 -188982 -75739 352912 173016
11609 -303428 163675 34389 -84480 138222 -91478 -175141 -140463 -187688 17336 -133554 248629
11597 -226153 -3807 -72574 307431 207843 -124638 -95363 -103850 258934 -230379 909 4800 194141
11585 194141 161637 -348502 -295480 60848 226318 353916 13975 296119 113771 142167
$$ packed form
11666A3100a25722b409k11921F0733r758N3156b52712B16596a56206M2781D30050
11654h3355A37759J39422a38209c6714j3362c015j25240B79208I1272c03560J37367
11643a66193A16967b30723B5818J29456a99067k5690o7743f5872k1427C1060K07707
11632B38767e0703k82124I3408i1364j01614A32784F0263i4591k9142a6672A33963
11620a69887A13057j2295c00562C08924o3898i078j79904g5739C52912A73016
11609c03428A63675C4389h4480A38222i1478q3663L4678m7225A7336a33554B48629
11597b26153c807o8767C07431r9588a24638K9275q487B58934b30379I09L891J89341
11585A94141l2504c48502N3022F0848J65470J27598A3975K82144A13771K8396
$$ plain form
11575 142167 -51464 97099 109221 128934 238443 101750 86012 -136509 -85767 115344 166290
11564 166290 172226 250119 -278682 210831 176027 -258342 169732 48559 309736 -143904
11553 211618 -53135 240061 242833 268785 -20199 -244634 -48145 -13208 -170872 222158 -82685
11541 -4690 -82220 135061 -38481 327283 133243 -220827 -244482 172672 249390 132157 -161864
11529 206467 121803 402762 5380 -126767 76845 -4449 96591 -45665 145330 -298290 276886
11517 108558 145474 -56957 61878 196228 151 280305 363868 264330 402304 -215678 -45097
11505 271844 213985 95887 144639 -161074 -333762 47755 402450 -35716 310557 66499 -203208
11493 276601 -414622 299064 -277866 -230390 106316 -83499 15949 -375698 249812 530499
$$ packed form
11575A42167e1464I7099J2122J9713J09509A01750j5738a36509N0742A15344N0946
11564A66290N936P7893b78682B10831l4804b58342A69732D8559K61177a43904
11553B11618e3135B40061K772K5952b0199k24435d8145a3208j57664B22158h2685
11541d690p7530A35061c8481C27283A33243b20827k3655A72672P6718j17233a61864
11529B06467q4664K80959E380a26767G6845d449I6591d5665A45330b98290B76886
11517A08558L6916e6957F1878J34350A51K80154Q3563r9538J37974b15678d5097
11505B71844n7859I5887M8752a61074j72688D7755L54695c5716C10557F6499b03208
11493B76601d14622B99064b77866M7476A06316h3499A5949c75698B49812K80687
$$ plain form
11483 530499 378189 -14047 292217 274254 71541 464554 -342856 -128999 446092 263037
11473 263037 118949 237440 258997 135443 -40214 269524 211780 -14100 -96433 -111674 -294561
11462 -294561 -44511 -273710 36188 195610 188298 111315 248 -28000 182380 313372 -88925
11450 -192810 135178 69094 106966 210978 302826 -178795 30034 161586 -94703 -270020
11440 -270020 122219 360943 54356 542122 -84886 -50384 378956 -18199 207825 -40253
11429 78401 203967 -151095 211824 -100661 -10339 74502 289834 242884 -183669 58142
11418 -306538 115081 143808 62242 -20823 -51403 273379 116670 127780 -221811 195782
11407 -304573 -186271 132539 184854 -108193 30029 174659 -388749 229841 260941 126754
$$ packed form
11483E30499j52310a4047B92217j7963G1541L93013c42856a28999D46092j83055
11473B63037A18949J18491K1557j23554d0214B69524n7744a4100q2333j5241j82887
11462b94561d4511k29199C6188J59422p312p6983B48b8000A82380J30992h8925
11450a92810A35178o6084L7872J04012R1848a78795C0034J31552i4703j75317
11440b70020A22219K38724E4356M87766h4886L4502C78956a8199B07825d0253
11429G8401J25566a51095B11824a00661a0339G4502K15332m6950a83669E8142
11418c06538A15081K8727F2242b0823l0580B73379A16670J1110b21811A95782
11407c04573J18302A32539N2315a08193C0029J44630c88749B29841L1100A26754
$$ plain form
11396 234546 16289 -23775 83456 193171 40183 -155188 178658 -93716 135073 -118217
11385 -108669 -94410 44757 87298 -76475 107875 -191957 -471729 175028 70937 -124374
11374 278447 -257295 -6542 107540 -90632 -51147 -53447 -139639 28243 234056 -21472 -72358
11363 -72358 322098 -81699 -16194 -23799 129028 180459 -113656 162315 -26905 -88376 -43837
11351 -332826 -13506 35243 140575 81150 -170554 -15589 -125291 344444 -750 83423 219318
11340 219318 -76103 -223917 133589 349601 100291 69722 -168039 -470939 45570 -80613
11329 377324 134669 101759 -312456 -265854 3944 -240422 30761 238411 -19510 229656 -16354
11317 -54994 337880 -17807 -115329 -18475 265467 101542 -495053 379879 -190346 22696
$$ packed form
11396B34546A6289b3775H3456J09715D0183a55188A78658i3716A35073a18217
11385a08669J4259D4757M2541g6475A07875a91957k79772A75028G0937a24374
11374B78447b57295f542A07540i0632L9485k300q6192B8243K05813b1472n0886
11363g2358C22098h1699a6194p605A29028N1431a13656A62315b6905o1471d3837
11351c32826a3506C5243J05332n9425a70554a5589j09702C44444g50H3423J35895
11340B19318g6103j47814A33589K16012A00291l0569a68039l02900D5570h0613
11329C77324A34669l2910c12456M6602C944b40422C0761K07650a9510B29656a6354
11317e4994C37880a7807r7522a8475B65467A01542d95053C79879a90346B2696
$$ plain form
11306 372553 -298805 -72025 46743 -241133 -107484 -147251 -51757 -425701 -216568 93974
11295 -292995 -111120 -35270 50270 -206235 -2538 49396 -250868 -212167 302192 -165479 207758
11283 -28129 -371161 -41865 -153098 153469 39264 -399332 -70333 -11863 -107769 253587 234475
11272 234475 -92664 25370 64851 -155609 4681 -248047 307723 -368928 -131322 106600
11261 56663 -98 23547 -307955 -12030 67609 -100574 4568 -75473 145324 -349832 213960
11249 288916 258247 -80408 -176522 75365 262529 185356 -260390 -27672 -63633 -57621 -7339
11237 4253 -113966 -354662 -6463 17743 216756 -38702 49328 -272542 395683 61425 -517148
11225 324173 -199200 73036 -311952 -278995 -130763 -101087 -44282 434878 -386102 -151224
$$ packed form
11306C72553b98805g2025D6743b41133a07484l9767e1757l73944K09133I3974
11295b92995a11120c5270E0270b06235b538D9396b50868L8701C02192a65479B07758
11283b8129l43032d1865j11233A53469C9264c99332g0333a1863r5906B53587j9112
11272B34475i2664B5370L9481a55609D681b48047C07723c68928a31322A06600
11261E6663i8B3547c07955a2030F7609a00574D568g5473A45324c49832B13960
11249B88916l0669h0408r6114G5365J87164p7173b60390b7672l5961O012g339
11237D253a13966k40696f463A7743J99013c8702D9328b72542C95683F1425e17148
11225C24173a99200G3036c11952L2957a30763K9676d4282D34878c86102a51224
$$ plain form
11214 108938 -49552 8526 -310399 -131114 -184725 -120673 -13305 106604 -1611 -40723 172076
11202 -112753 -24795 76211 -190303 -1099 -158125 146209 18161 -308712 81588 -23007 -195129
11191 -195129 -248198 -20011 -252209 -71039 101048 -260018 -74835 -87832 15071 -99283 -155800
11180 -155800 -143560 -145986 146163 42348 -72417 -37396 300300 -125268 156222 4691 109360
11169 109360 -194445 -64651 -90962 -3690 39608 -316542 -34747 -352749 326328 44326 132641
11158 132641 87333 175150 -31039 -50710 -225020 161314 133962 -164298 -108193 32140 181674
11147 181674 15923 -75030 260859 88810 -228308 -111034 -253529 -7610 285459 -136059
11136 -266884 16026 68014 38240 287438 87032 -207038 41392 -199910 47430 -394471 -16122
$$ packed form
11214A08938d9552H526c10399a31114n3611O4052a3305A06604a611l9112A72076
11202a12753b4795G6211a90303a099j57026A46209A8161c08712H1588b3007j72122
11191a95129n3069b0011k32198g1039A01048b60018g4835j2997A5071i9283n6517
11180a55800J2240k426A46163D2348g2417L5021C00300a25268A56222D691J04669
11169A09360a94445f4651k6311c690C9608c16542c4747l18002C26328D4326Q8315
11158A32641m5308Q7817c1039j9671j74310A61314k7352a64298N6105C2140J49534
11147A81674A5923g5030B60859H8810b28308a11034j42495g610B85459a36059
11136b66884A6026N1988k9774K49198H7032b07038D1392a99910D7430c94471a6122
$$ plain form
11124 -35354 -49859 9109 -53334 60079 64313 -170724 203864 161808 350946 79110 21187
11112 122935 -120573 -199098 115396 100726 71244 550304 58030 23085 236760 246951 220683
11101 220683 79221 -57007 258756 -84070 40328 211966 113387 256900 314234 -46661 94154
11089 -82695 213013 117235 50393 152785 155650 148290 231653 184781 151267 107226 181027 312141
11077 312141 111836 206663 221209 36859 371410 375805 516484 469595 389687 295516 204812
11066 204812 569408 803963 523903 100357 518333 301344 134384 463656 460788 373971
11056 373971 489103 711093 568053 615825 403862 667363 740202 804855 273612 685742
11046 685742 703320 715275 883803 742339 933324 763801 882083 650704 404664 721722
$$ packed form
11124c5354j4505I109e3334F0079M234a70724B03864m2056J89138G9110B1187
11112A22935a20573p8525A15396j4670k9482M79060E8030B3085K13675J0191k6268
11101B20683G9221e7007B58756h4070D0328J71638r8579J43513N7334d6661I4154
11089h2695B13013r5778E0393J02392K865p360Q3363m6872l3514m4041P3801J31114
11077C12141A11836R4827J4546C6859L34551M395J40679m6889p9908r4171r0704
11066B04812L64596K34555k80060A00357M17976k16989A34384L29272k868q6817
11056C73971J15132K21990j43040M7772k11963K63501P2839O4653B73612M12130
11046F85742J7578J1955J68528j41464J90985j69523J18282k31379k46040L17058
$$ plain form
11036 721722 564263 618660 403770 523161 553700 683236 602245 399783 612655 722594
11026 722594 522258 1140223 560874 725684 428458 558378 488745 592997 546057 641219
11016 641219 693410 537965 440723 509157 507994 538491 541726 383811 157155 783422 635108
11005 635108 545377 381785 680744 678141 499218 564768 386929 691072 532855 526255 600803
10994 600803 786584 603298 648815 561011 601407 1069394 887450 1142102 1223549 798459
10984 798459 593434 720783 871735 1094581 951269 1135341 1068763 1472244 1723064 2344683
10974 2344683 2073799 2292468 2435947 2536534 2593320 1972440 1764526 1900057 1864199 1668874
10964 1668874 1453211 1357966 991612 1419706 1426091 1509051 1368812 1703568 1728294 1169409
$$ packed form
11036G21722j57459N4397k14890J19391L0539J29536q0991k02462K12872J09939
11026G22594k00336O17965E60874J64810k97226J29920o9633J04252m6940R5162
11016F41219N2191j55445r7242O8434j163L0497L235j57915A57155O26267j48314
11005F35108q9731j63592K98959k603j78923O5550j77839L04143j58217o600P4548
10994F00803J85781j83286M5517q7804M0396M67987j81944K54652Q1447m25090
10984G98459k05025J27349J50952K22846j43312J84072o6578M03481K50820O21619
10974B344683k70884K18669J43479J00587N6786o20880k07914J35531l5858j95325
10964A668874k15663r5245l66354M28094O385Q2960j40239L34756K4726n58885
$$ plain form
10954 1169409 1307293 1197030 793050 822948 279789 449006 230645 691772 523446 478901
10944 478901 532042 345295 -75359 22856 324440 184032 -131462 -78326 -99053 143414
10933 88514 -103831 2575 159548 58122 108548 -61981 453566 122745 -217580 118279 13197
10921 -115004 -42523 -114915 -75929 -140072 158431 -30828 -111059 -58499 -229875 305888 89431
10909 -252223 143338 -90357 38151 -73401 -166841 -214418 298287 -194734 -27426 237253 25687
10897 177850 -300673 -95041 109710 399854 -234941 -109739 -174441 187687 -139607 -244804
10887 -244804 181785 -50661 22863 111079 13301 107700 -43675 19129 14166 -411774 -56501
10875 -110604 281502 -242257 -277890 30993 -221319 -79897 -112709 -2527 -44880 -56721 221506
$$ packed form
10954A169409J37884j10263m03980K9898B79789J69217k18361M61127j68326m4545
10944D78901N3141j86747g5359B2856L01584j40408a31462N3136k0727A43414
10933H8514a03831B575J56973E8122N0426f1981D53566A22745b17580A18279A3197
10921a15004d2523p2392L8986o4143A58431c0828q0231N2560j71376C05888H9431
10909b52223A43338i0357C8151g3401r3440m7577B98287a94734b7426B37253B5687
10897A77850c00673i5041A09710K90144b34941a09739o4702A87687a39607j05197
10887b44804A81785e0661B2863Q8216A3301R4399d3675A9129m963d11774e6501
10875a10604B81502b42257l5633C0993b21319g9897l2812b527m2353j1841B21506
$$ plain form
10863 356603 -37268 -37782 -16020 149002 30348 109128 126938 153924 231266 240683 120860 -70127
10850 47739 64228 -116753 -3482 238520 -40849 393560 88610 -360762 -73392 -11928 345847
10838 67298 -70814 91347 155044 -55427 -93364 -258181 -69495 -80633 -23198 -68859 171321
10826 -67889 -18113 98391 -212714 199770 -91945 -66670 125411 -125504 -314252 58792 -31054
10814 79681 184619 -199696 -296853 187339 219645 165148 -125074 73835 -75798 -88895 -231882
10803 -231882 -174453 70534 -73412 -205841 261219 120869 120333 45542 188739 -60720 596
10791 -117202 133378 -7103 -206751 132141 -209044 62535 -192323 97396 44602 87862 3925
10779 -129949 175355 82525 19876 329104 143807 -475841 186640 -179139 -19825 -344122
$$ packed form
10863C56603c7268n14a6020A49002C0348P8780J7810K6986P7342R417j19823g0127
10850D7739J6489a16753c482B38520d0849C93560H8610c60762g3392a1928C45847
10838F7298g0814I1347O3697e5427l7937j64817f9495j1138b3198m5661A71321
10826f7889a8113I8391b12714A99770i1945K5275A25411a25504j88748E8792c1054
10814G9681J04938a99696r7157A87339L2306n4497a25074G3835g5798j3097j42987
10803b31882N7429G0534g3412j32429B61219A20869n36D5542J43197f0720E96
10791a17202A33378g103j99648A32141b09044F2535a92323I7396D4602M3260C925
10779a29949A75355H2525A9876L09228A43807d75841A86640a79139a9825l24297
$$ plain form
10769 -344122 24292 252241 -143358 -188019 -40235 -190936 120534 -67549 -138119 -30548 -53504
10758 -53504 42443 -224360 -141042 -101094 -275712 -462046 112819 95454 -238070 -226354 43124
10746 244580 -203467 -57047 -13606 -473912 77100 -289908 156782 -47111 10431 -73831 158643
10734 32565 -182057 -187558 -80372 194750 295673 -102051 -104754 -103129 111987 -346191 -11105
10722 65054 -56152 -285785 -30342 -9801 -350130 -83326 -243295 30316 -111213 -155755 -58981
10710 83311 31474 291970 -152909 -265266 -74369 153658 -367918 37493 -156612 122136
10699 7928 -12940 45200 -212711 31567 93711 -89871 228299 84143 -98978 -155799 -75398
10687 133723 226001 11093 -70658 55559 155825 -77270 -113345 69861 168544 162193 52529
$$ packed form
10769c44122B4292K27949a43358m4661d0235j50701A20534f7549p0570c0548k2956
10758e3504D2443b24360Q3318L9948j74618j86334A12819j7365b38070J1716D3124
10746B44580b03467e7047a3606m60306G7100b89908A56782d7111A0431g3831A58643
10734C2565a82057n501h0372A94750J00923a02051k703J625A11987c46191a1105
10722F5054e6152k29633c0342i801l40329h3326j59969C0316a11213m4542e8981
10710H3311C1474K60496a52909j12357g4369A53658c67918C7493a56612A22136
10699G928a2940D5200b12711C1567O2144h9871B28299H4143i8978n6821g5398
10687A33723R2278A1093g0658E5559J00266g7270l6075F9861R8683o351E2529
$$ plain form
10675 -206176 -160964 -2803 55073 -25687 -7170 -190008 215076 -66030 -90729 308787 -298436
10663 -2679 -94648 -81607 -322570 -17335 -26709 -24491 22819 212663 -5533 252675 -88405 198739
10650 -53094 34666 8226 -215855 136543 -27324 180141 -147605 -60980 -81586 -33379 -124007
10639 -124007 24262 87828 -123164 -296209 97815 -399825 84902 -47698 98609 -143454 2199
10627 194439 -18859 -55122 23240 -271496 -218715 -257707 95307 -8316 -518561 -78017 -54162
10616 -54162 -316001 -69498 -294561 51103 -330427 -587904 -103974 160096 -117550 72126
10605 129957 63882 -94670 -123314 -84838 -134400 142632 43889 86742 56536 -230375 -243251
10594 -243251 200651 125716 9901 316095 -367423 -76872 138864 31461 385959 172339
$$ packed form
10675b06176M5212b803E5073b5687g170j82838B15076f6030k4699C08787b98436
10663b679r1969J3041k40963a7335r374K218B2819J89844e533B52675h8405A98739
10650e3094C4666H226b15855A36543b7324A80141a47605f0980k0606c3379r0628
10639a24007B4262O3566a23164j73045I7815c99825H4902d7698I8609a43454B199
10627A94439a8859l6263B3240b71496N2781l8992I5307h316n10245g8017K3855
10616e4162k61839f9498k25063E1103c30427k57477a03974A60096a17550G2126
10605A29957F3882i4670k8644L8476m9562A42632D3889M2853l0206b30375j2876
10594b43251B00651p4935I901L06194c67423g6872A38864C1461L54498A72339
$$ plain form
10583 -97801 -100345 -402748 -33811 -5920 -176994 -145228 -309320 -39916 -154195 199831 60826
10571 115998 -190946 -127960 11501 -249427 -316966 74744 -241019 69582 -55218 -158661 37585
10559 57204 50400 -53525 30612 20199 -326009 -19848 -23854 -206354 -89145 -125588 82220 -105131
10546 -541652 -46045 65537 -124390 332325 -307588 -37844 -123087 -142094 -102871 -142264 -316456
10535 -316456 -215174 60105 -81506 25998 54461 70234 -180093 205797 -318218 82291 8904
10523 -89877 308799 -286525 -126732 -118057 -363386 284260 -22368 220111 -222703 199049
10512 404969 153546 -73446 201940 207972 -196494 -231519 -29171 -86822 31728 195360 61008
10500 109248 218041 -139556 137030 -453794 -364355 280641 -154294 -178336 -136487 -221752
$$ packed form
10583i7801k544l02403c3811e920j71074L1766j64092c9916j14279A99831F0826
10571A15998a90946O2986A1501b49427o7539G4744b41019F9582e5218j03443C7585
10559E7204o804e3525C0612j0413c26009a9848m006j82500h9145l6443H2220a05131
10546e41652d6045F5537a24390C32325c07588c7844q5243j9007L9223l9393j74192
10535c16456J01282F0105h1506B5998K8463J5773a80093B05797c18218H2291H904
10523h9877C08799b86525a26732Q675k45329B84260b2368B20111b22703A99049
10512D04969A53546g3446B01940O032a96494l5025b9171n7651C1728J63632F1008
10500A09248J08793a39556A37030d53794Q9439B80641a54294k4042M1849q5265
$$ plain form
10490 -221752 -33297 -105885 38821 -73412 4225 122788 340579 204555 455998 446052 337161
10479 337161 640802 356413 282422 54658 -96232 -40831 396582 -302985 399123 87381
10468 -138721 126230 -141883 158246 -69403 403597 -99012 141458 -212368 72357 -146432
10457 95008 -135547 -28626 -155974 -96028 -33189 -48912 -211669 122094 -260096 -95152 -285315
10446 -285315 22256 -352782 189671 88943 161308 -73855 76927 -39974 -257682 104394 156948
10435 156948 203674 -310464 162963 -157279 -119722 30794 38678 153602 -71201 217777 -50702
10423 -92558 -282201 1399 193238 -2111 -201318 366141 -228586 431069 -62058 309744 -215565
10411 -166544 -391818 102317 -181161 52445 -141377 -254331 -86276 -38175 21334 -33622
$$ packed form
10490b21752c3297p2588C8821g3412D225J18563K17791j36024K51443r946j08891
10479C37161L03641k84389p3991E4658i6232d0831C96582c02985C99123H7381
10468a38721A26230a41883A58246f9403D03597i9012A41458b12368G2357a46432
10457I5008a35547b8626j27348N9946c3189j5723j62757A22094b60096i5152j90163
10446b85315B2256c52782A89671H8943P2365g3855G6927c9974k17708A04394N2554
10435A56948M6726c10464A62963a57279L7557C0794P884J14924g1201B17777e0702
10423i2558j89643A399J91839b111j99207C66141b28586D31069f2058C09744b15565
10411a66544k25274A02317a81161E2445a41377j12954h6276c8175B1334c3622
$$ plain form
10400 -304548 -403396 35890 116205 113105 67851 22219 65262 6600 60122 273924 -171708
10388 382133 -65779 162177 -123488 190724 257099 -155684 232500 -179898 -31203 287300
10377 124754 490249 290049 242244 224329 331626 351158 545596 117984 305513 368190
10367 368190 313327 52130 219185 319164 -5153 -282 207979 -22786 -16131 274944 -27968 263976
10354 -42944 65171 278478 358150 396363 204391 26205 -21529 322687 299516 312283 270326
10343 270326 407079 -164148 123841 9389 136713 61997 276541 282888 153440 -39653 333536
10331 118872 -342237 75985 -115707 -17803 83579 269422 90963 195786 229268 583407
10321 583407 84246 153034 -145593 38578 106206 69851 -29594 154915 66813 -85868 338516
$$ packed form
10400c04548r8848C5890Q0315l100m5254B2219M3043F600N3522K13802a71708
10388C82133f5779A62177a23488A90724O6375a55684B32500a79898c1203B87300
10377A24754L65495k00200m7805j7915J07297J9532J94438A17984J87529O2677
10367C68190n4863E2130J67055R9979e153b82B07979b2786O655B74944b7968B63976
10354d2944F5171K13307P9672L8213j91972B6205b1529C22687k3171J2767m1957
10343B70326J36753a64148A23841I389J27324F1997K14544O347j29448c9653C33536
10331A18872c42237G5985a15707a7803H3579J85843I0963J04823L3482L54139
10321E83407H4246O8788a45593C8578O7628l6355b9594A54915F6813h5868C38516
$$ plain form
10309 113831 -71149 323382 23883 145547 -104736 40996 72429 99020 154501 109880 -212881
10297 303159 -147292 61488 20486 -58005 -129324 -37149 -146114 -373370 96583 238265 -69671
10285 63058 -48017 40509 42914 -118376 25808 -104613 95492 -117444 61584 116513 -240804
10273 -71707 106419 436575 343140 -206591 3773 133126 -56308 -144204 -109481 -23476 125783
10261 162509 55545 78148 323045 -127167 226131 159879 105708 -149999 213312 -133930
10250 -334279 -68513 -295942 96436 -120148 168676 -496819 168894 299482 102830 -235977
10239 -126114 72536 -32116 35008 96334 -103223 34892 -65261 131290 125447 99971 -39031
10227 63915 -161607 -6496 139746 -226022 -154009 24430 -15404 20487 40960 146055 311328
$$ packed form
10309A13831g1149C23382B3883J21664a04736D0996L1433K6591N5481m4621b12881
10297C03159a47292F1488B0486e8005p1319c7149j08965k27256I6583J41682f9671
10285F3058d8017D0509K405a18376B5808a04613I5492a17444F1584N4929b40804
10273g1707A06419L30156r3435b06591C773J29353e6308q7896L4723b3476A25783
10261A62509E5545K2603K44897a27167B26131o6252n4171a49999B13312a33930
10250c34279f8513k27429I6436a20148A68676d96819A68894J30588A02830b35977
10239a26114G2536c2116C5008O1326a03223C4892f5261A31290n843k5476c9031
10227F3915a61607f496A39746b26022P2013B4430a5404B0487K0473J05095J65273
$$ plain form
10216 311328 -66817 -301912 113847 -127716 -202023 43099 -192921 71351 -62391 186598
10205 46602 -428373 9799 263236 150523 -73589 -331532 41663 -276852 -101654 -289614
10195 -289614 -224921 93064 -356160 -170285 -234569 148123 -79765 101385 -81056 -189708
10185 -189708 -152808 -156571 -171088 -49006 -53243 31670 -195360 -51544 -8162 44368 -220908 -49575
10172 -82303 158719 73649 -169577 58229 -287122 -40742 223569 8242 36751 -180970 -268460
10161 -268460 42503 -90272 -89975 28349 201225 -20839 -173032 407970 18575 -361290 -236547
10150 -236547 26615 -130410 -85251 -16722 323271 44117 -171447 262328 -46864 178365
10139 -137491 -384829 -179309 -215653 186376 18185 -345917 182044 -228102 103868 -123866
$$ packed form
10216C11328f6817k35095A13847a27716p4307D3099a92921G1351f2391A86598
10205D6602d28373I799K53437j12713g3589k57943D1663b76852a01654j87960
10195b89614O4693I3064c56160a70285o4284A48123g9765A01385h1056j08652
10185a89708L6900l763j4517d9006m237C1670a95360e1544h162D4368b20908d9575
10172h2303A58719G3649a69577E8229b87122d0742B23569H242K8509a80970q7490
10161b68460D2503i0272K97B8349J72876b0839j52193D07970A8575c61290J24743
10150b36547B6615a30410M5159a6722C23271D4117a71447B62328d6864A78365
10139a37491k47338a79309l6344A86376A8185c45917A82044b28102A03868a23866
$$ plain form
10128 200473 -2281 -241693 80643 -329871 -64599 -27023 -168375 45966 41055 -114991 28578
10116 103097 -64048 -51671 149973 -391915 93576 -32570 -139063 65001 27269 252442 80124
10104 -51638 84459 52121 -21665 -113697 272066 -224206 -133563 28114 1566 -96767 131450
10092 97119 -41628 -299450 -18376 161192 -203317 -63046 279025 -170086 -271318 -215282
10082 -215282 374895 122181 -217729 12498 -141289 -130468 40803 -46708 108648 65889
10072 65889 -277785 -38556 -188355 -91105 -84622 -60505 -24953 -150801 -18118 52407 -159561
10060 -45951 -97458 11396 20827 116975 -36879 172279 43708 -73922 67627 -3303 -9124 40965
10047 -51225 271883 236252 -171583 -114718 -16564 147911 134088 146999 -54616 122814 -172821
$$ packed form
10128B00473b281k39412H0643c29871f4599b7023j41352D5966m911a14991B8578
10116A03097f4048J2377A49973c91915I3576c2570j06493F5001B7269K25173H0124
10104e1638H4459l2338b1665r2032B72066b24206R0643B8114A566i6767A31450
10092I7119d1628k57822a8376A61192b03317f3046B79025a70086j01232N6036
10082b15282C74895A22181b17729A2498a41289J0821D0803d6708A08648m2759
10072F5889b77785c8556j49799i1105O483K4117b4953j25848a8118E2407a59561
10060d5951n1507A1396R431R6148c6879A72279D3708g3922F7627c303n821D0965
10047e1225B71883l5631a71583N6865a6564A47911j3823J2911e4616A22814a72821
$$ plain form
10035 10368 -44657 -22027 -271856 131388 -378012 -486897 -18180 -16185 203686 -167326 -164066
10024 -164066 -107991 -22396 -153925 88666 -34194 -141641 -111956 -433712 -224841 -43848 58541
10012 -350788 -46423 -303194 199691 -84554 327160 -46204 -4973 217053 8865 9111 -25429
10000 14983 -312875 -146182 66823 -14473 -370035 -268743 -106615 -61786 -489801 -1978 -85707
9989 -85707 153961 37207 -69489 -13267 -273234 -307788 -80223 -183336 -76753 107192 -130026
9977 -75260 -61098 33017 -75853 -173606 -22881 18799 -137738 -64852 125225 69538 -127884
9965 -67560 156289 -140196 -125078 17042 -89994 49455 210938 136292 -65235 330542 141368
9953 2601 -258802 113771 2541 -76778 30715 -20568 -77558 214794 -72243 -43423 26219 98295
$$ packed form
10035A0368d4657b2027k49829A31388c78012j08885a8180J995B03686a67326L260
10024a64066N6075b2396j31529H8666c4194j07447K9685l21756K08871d3848E8541
10012c50788d6423k56771A99691h4554C27160d6204d973B17053H865K46b5429
10000A4983c12875a46182F6823a4473l55562J01292a06615M4829m28015a978q3729
9989h5707A53961C7207f9489a3267k59967l4554h0223j03113g6753A07192a30026
9977g5260J4162C3017g5853r7753b2881A8799a37738f4852A25225n5687a27884
9965f7560A56289a40196J5118A7042h9994D9455J61483p4646f5235C30542A41368
9953B601b58802A13771B541g6778C0715b0568n6990B14794g2243K8820B6219P2076
$$ plain form
9941 98295 -61949 179514 -167211 -282380 -54536 -177085 -92310 -4678 148811 42880 -852
9929 -345069 -143395 86621 36575 -215751 -170238 -42022 -101777 272198 -55249 -450127 138457
9917 -50302 104341 -217826 -137528 -195116 98202 129423 -566567 -299593 158626 -192913 84141
9905 -162646 -181561 -87892 -226456 213812 -232296 -70519 -92720 58359 -440909 -210446 -62092
9893 -158797 58059 240414 7668 54579 -135341 -260844 -72808 76437 102537 -245799 -108654
9881 -79193 -300233 225453 4252 70066 130704 -53033 18500 -70118 101701 -26165 43256
9869 3981 -187591 7107 -93453 131796 -43347 34630 -99331 177922 -305707 23761 -230977
9857 111558 -436845 -176148 -305659 -5785 -30952 -113044 280648 -46778 -142494 -19291 -83273
$$ packed form
9941I8295f1949A79514a67211j15169e4536j22549Q4775d678A48811D2880h52
9929c45069a43395H6621C6575b15751M5513d2022n9755B72198e5249l94878A38457
9917e0302A04341b17826Q0298n7588I8202L1221e66567K66974A58626a92913H4141
9905a62646j8915h7892j38564B13812b32296g0519k2201E8359d40909b10446f2092
9893a58797E8059J82355G668M6911a35341j25503g2808G6437K6100b45799a08654
9881g9193k21040B25453D252O5814O0638e3033A8500g0118A01701b6165D3256
9869C981a87591G107i3453A31796d3347C4630i9331A77922c05707B3761b30977
9857A11558d36845a76148j29511e785k5167q2092B80648d6778r5716a9291o3982
$$ plain form
9846 -83273 -156869 263115 -46152 -71907 -159258 316693 37448 -145048 -74498 -159814 -87857
9835 -87857 -243180 145281 -164901 -180135 125674 -180279 -131970 201022 -351277 36716
9824 -127168 -55058 -191750 -206143 -465301 196531 -54404 -229634 -185434 -382837 132922
9813 50614 -130781 -281830 -34227 61551 127412 37073 -110462 -130589 -293162 -188700 -438874
9802 -438874 -136195 -206669 96873 -160977 212821 -201741 294182 172143 7057 34551 -38185
9790 26956 -334111 208236 144008 -8985 141432 -311719 -444597 -126077 -195791 172430 121330
9779 121330 -183508 -61190 -379619 237040 -168886 -161029 -68127 46369 -36235 -98633 194104
9767 -329643 -59266 -443074 -179524 -235193 -9263 -141152 -27577 49915 65808 -182747 -306390
$$ packed form
9846h3273p3596B63115d6152k5755q7351C16693C7448a45048P0550q5316P1957
9835h7857j55323A45281a64901j5234A25674a80279M8309B01022c51277C6716
9824a27168e5058j36692j4393k59158A96531e4404j75230M4200j97403A32922
9813E0614a30781j51049c4227F1551O5861C7073a10462k0127j62573J04462k50174
9802d38874a36195p0474I6873a60977B12821b01741B94182j22039G057K7494c8185
9790B6956c34111B08236o4228h985A41432c11719j32878a26077o9714A72430n1100
9779A21330a83508f1190l18429B37040a68886P857f8127D6369c6235o2398A94104
9767c29643e9266l83808a79524n5669i263j31889b7577D9915J5893a82747j23643
$$ plain form
9756 -306390 84911 -181687 412909 503002 215092 -112109 -27449 -111505 -60867 1539 -60580
9744 84696 -17345 82241 73540 -49244 31337 -76265 -291025 -19675 -25178 -17239 -315512 312555
9731 -186731 108436 -357750 22274 68897 194409 -31304 -128576 15615 -165367 248536 53180
9719 -140790 188414 24034 -211695 77975 -68469 21809 32794 -163180 159117 -40661 -57128
9708 -57128 -147377 -159736 160450 -176746 92662 -49432 -84665 56602 -11601 -248347 108857
9696 -100543 -94174 -48755 293345 -243253 -181920 260024 -83587 -71847 97374 -251448 236683
9684 24300 -142708 -73171 -208265 -44943 51578 -183386 17721 63390 31933 -18867 234930
9672 -60941 -182477 -281325 -191474 42827 249222 -224171 -3425 -297440 -5290 -65780 -221296
$$ packed form
9756c06390H4911a81687D12909R0093B15092a12109b7449q4056N0638A539f0580
9744H4696a7345H2241q701d9244C1337g6265k14760a9675n503P939k98273C12555
9731a86731A08436c57750B2274M6623J25512c1304r7272A5615a65367B48536E3180
9719a40790A88414B4034b11695G7975f8469B1809J0985a63180A59117d0661j6467
9708e7128r0249j2359A60450a76746I2662d9432l5233E6602a1601k36746A08857
9696a00543O369M5419B93345b43253O1333B60024h3587J1740I7374b51448B36683
9684B4300a42708O9537j35094d4943E1578a83386A7721M5669l1457a8867B34930
9672f0941j21536r8848Q9851D2827K06395b24171c425k94015e290o0490j55516
$$ plain form
9661 -221296 -16094 -176055 -30532 -305812 27493 -58236 20716 -13643 -23710 -85018 -145106
9650 -145106 191885 -199378 -28820 -287949 -39217 -301060 19297 -221918 -36182 -111201 -162125
9639 -162125 -269088 -260921 -120019 -234790 -90554 -153492 127692 -119746 65349 42294 10933
9627 -236745 -60482 -232453 -56911 108238 -221148 226049 -97340 -43107 -302446 -309340 -93530
9615 12356 -218137 83005 -156413 142671 8511 -49297 -354568 185228 -9899 83961 -128548
9603 -37141 -238465 274796 -53651 22376 -763 25763 -77277 -283521 -83846 180650 143417
9592 143417 -94674 -35856 357964 183862 -168942 -177170 44717 -96937 -63793 -435944 -35797
9580 63263 -276385 377882 329572 33501 16696 -38014 65764 -183071 -229633 -188361 130803
$$ packed form
9661b21296a6094j59961c0532k75280B7493e8236B0716a3643j0067o1308o0088
9650a45106A91885a99378b8820k59129c9217k61843A9297b21918c6182p5019n0924
9639a62125j06963Q167a20019j14771i0554o2938A27692a19746F5349k3055A0933
9627b36745f0482j71971e6911A08238b21148B26049i7340d3107k59339o894i3530
9615A2356b18137H3005a56413A42671H511d9297l05271A85228i899H3961a28548
9603c7141k01324B74796e3651B2376g63B5763g7277k06244h3846A80650l7233
9592A43417i4674c5856C57964j74102a68942q228D4717i6937L3144l72151c5797
9580F3263b76385C77882m8310C3501A6696c8014F5764a83071m6562M1272A30803
$$ plain form
9568 -145657 318002 -184668 -219203 -146194 -60413 -343345 -7857 -275179 18117 -261795 -220213
9557 -220213 -203102 -207976 55358 -11451 -253943 52230 -120987 -161664 -267061 -139656 10800
9545 10205 -332502 -217201 -375059 228434 5661 -59824 88287 331371 2271 3021 -107354
9533 32606 -368660 231941 -8502 -96119 21190 -133693 -112088 -51771 100732 -142061 -60414
9521 197254 -101090 -147742 149317 -57041 98046 -33123 -205209 61705 -99694 -121450 32905
9509 164677 26385 -73132 -53623 -67862 47905 -177363 -179633 -172982 -136165 23185 35238 122553
9497 122553 -93476 -74611 -28750 77579 -249969 -180805 -233242 -237181 120266 -48850 -154126
9486 -154126 88415 63635 -41252 -8780 159943 -40264 -61401 -213158 -266725 -213942 -105129
$$ packed form
9568a45657C18002a84668l4535P3009f0413k82932g857k67322A8117b61795M1582
9557b20213J7111m874E5358a1451k42492E2230a20987m0677j05397J27405A0800
9545A0205c32502J15301j57858B28434E661e9824H8287K43084B271P50a07354
9533C2606c68660B31941h502q7617B1190a33693K1605e1771A00732a42061f0414
9521A97254a01090m6652A49317e7041I8046c3123j72086F1705i9694k1756C2905
9509A64677B6385g3132J9509j4239D7905a77363k270O651L6817B3185J2053Q7315
9497A22553i3476J8865b8750G7579b49969O9164n2437l939A20266d8850j05276
9486a54126H8415k4780d1252h780A59943d0264k1137j51757n3567N2783a05129
$$ plain form
9474 -50257 44956 -74646 -18770 -84386 -338 -80552 -50233 -84351 57803 473434 -113754 -418596
9462 -418596 -125316 13774 -271930 -111531 109479 -81258 18381 43764 98983 108456 -21493
9450 -56919 66025 -378564 -296423 111144 -47824 -88226 -275381 -10602 -416903 -218233 -83314
9438 23976 -76785 31498 31933 -221562 -60129 136565 -189285 184271 -342445 -222392 -373324
9427 -373324 178305 -15021 48304 362520 -216366 -110747 -26256 268992 129796 49215
9416 -144524 16372 -130937 206121 99777 267929 -474090 24328 202179 -195756 21232
9405 -170597 -62702 -45106 62234 61402 -82804 -296163 -99146 34385 -21737 -145363 -116394 288710
9392 -181539 63507 -308144 201462 123373 -164644 -344232 131888 -113032 -23768 70188
$$ packed form
9474e0257D4956g4646a8770o5616c38q0214L0319l4118E7803M15631a13754l04842
9462d18596a25316A3774b71930a11531A09479h1258A8381K5383N5219R473b1493
9450e6919F6025c78564Q2141A11144d7824m0402j87155a0602m06301J98670h3314
9438B3976g6785C1498M35b21562f0129A36565a89285A84271c42445J20053j50932
9427c73324A78305a5021D8304L14216b16366J05619b6256B68992A29796D9215
9416a44524A6372a30937B06121I9777J68152d74090B4328J77851a95756B1232
9405a70597f2702J7596F2234q32h2804k13359i9146C4385b1737j23626K8969B88710
9392a81539F3507c08144B01462p8089a64644j79588A31888a13032b3768G0188
$$ plain form
9381 183075 168551 -326338 4785 258435 -233084 129041 50753 -164674 -68353 -49945 -332359
9370 -332359 287533 -143595 52304 86071 -1275 -19092 13636 -74277 -41430 -37910 -295362
9359 -295362 -81367 -162250 130383 -68458 -4187 95116 164932 43270 -163271 -30758 -241341
9348 -241341 58291 -45912 -148278 134260 -303348 98601 19624 125970 -245993 106431
9337 -250510 71696 -81131 -105154 -17806 -128366 -276264 -67808 -285279 -27540 -191199 358250
9325 -233936 26913 370035 169339 -8271 -29369 -191634 -107686 43080 -91591 -70895 -193715
9314 -193715 -96113 32775 76119 -134474 -493069 -285702 -190865 83048 -282546 -271795 -106450
9302 104223 25537 -442924 129330 -107262 193597 -281719 -130890 104675 163338 -12950
$$ packed form
9381A83075j4524c26338D785K53650b33084A29041E0753a64674f8353J8408k82414
9370c32359B87533a43595E2304L3767a275j7817A3636g4277L2847L520k57452
9359b95362h1367q0883A30383f8458d187I5116O9816D3270a63271c0758k10583
9348b41341E8291d5912j02366A34260c03348I8601A9624J06346b45993A06431
9337b50510G1696h1131k4023a7806j10560j47898f7808k17471b7540j63659C58250
9325b33936B6913L43122A69339h271k1098j62265Q3948D3080i1591K0696j22820
9314a93715i6113C2775M3344a34474l58595K07367R4837H3048b82546J0751a06450
9302A04223B5537d42924A29330a07262A93597b81719a30890A04675N8663a2950
$$ plain form
9291 -85903 169360 -35840 99870 -252043 -175402 92312 -141354 -25290 -37551 7142 55473
9280 55473 -41998 -182383 -157700 -379310 -78684 -337553 9894 99159 94839 -50325 -253232
9269 -253232 -66539 -141461 -218986 41012 98514 151294 33434 -127645 -43554 -257616 -74171
9257 -2246 -21759 87811 -30323 18437 -187814 44458 -150347 -21245 -38434 -77925 -212821
9246 -212821 -229059 -486328 -287758 187924 169652 -254279 -147066 282904 -51219 -93376
9236 -93376 102048 -24280 -94640 -296181 -93973 -280688 308058 290362 20142 -89655 -120666
9225 -120666 259650 52287 -148481 -61989 -30711 -202596 -135034 -237109 33400 -117386 -356230
9214 -356230 -236949 -35583 312131 -158317 -98578 41881 128307 253747 -11216 -219168 -79898
$$ packed form
9291h5903A69360c5840I9870b52043P6641I2312a41354b5290j2261G142M8331
9280E5473d1998j40385K4683k21610g8684k58869I894Q9265m320e0325k02907
9269b53232f6539p4922p7525D1012N7502N2780C3434a27645d3554k14062g4171
9257b246j9513H7811c0323A8437a87814D4458a50347b1245j7189l9491j34896
9246b12821j6238k57269J98570A87924j8272b54279J07213B82904e1219m2157
9236i3376A02048b4280p0360k01541i3973j86715C08058j7696B0142h9655l1011
9225a20666B59650E2287a48481f1989c0711j71885O7562j02075C3400a17386k38844
9214c56230J19281c5583C12131a58317N9739D1881Q6426J25440a1216k07952g9898
$$ plain form
9202 -188430 -403575 -296683 -149992 30479 120477 -137681 -94458 -350274 29572 -231270
9191 -222664 -198142 325931 251540 -179548 -149073 16860 49163 71453 -35043 -104782 214226
9179 56863 -65658 55677 -70032 -182959 -80355 -154911 75968 -69342 -56765 -63695 178416 -50840
9166 -74271 -27756 -67680 217496 -449414 152169 -76500 -128798 29993 249192 -26949 -367217
9155 -367217 83867 -67435 -95309 178291 38377 -407386 141853 44899 -30538 3656 -74908
9143 -23266 248653 -128334 196588 -48255 49431 -57418 -61752 -327316 -111373 75462 334543
9132 334543 -114303 -244170 -232864 -259893 -294253 -157514 20766 -210809 223940 -81827 -93645
9121 -93645 143577 -305349 -281388 -144726 -157513 -404844 -85643 -262437 -167353 189745 -316525
$$ packed form
9202a88430k15145J06892J46691C0479Q9998a37681M3223k55816B9572b31270
9191b22664K4522C25931p4391a79548L0475A6860L2303K2290c5043o9739B14226
9179E6863f5658E5677g0032j12927h0355p4556G5968f9342J2577o930A78416e0840
9166g4271b7756l9924B17496d49414A52169g6500n2298B9993K19199b6949l40268
9155c67217H3867f7435k7874A78291C8377d07386A41853D4899c0538C656g4908
9143b3266B48653a28334A96588d8255D9431e7418m334k65564a11373G5462K59081
9132C34543a14303j29867J1306k7029l4360J36739B0766b10809B23940h1827j1818
9121i3645A43577c05349K3961J36662j2787k47331h5643j76794R5084A89745c16525
$$ plain form
9109 128132 -188937 64757 144245 -138458 -191567 245739 -45796 -42739 -4298 -105749 136154
9097 48436 -183197 -16586 -215205 -78199 -170161 -179714 -28472 77634 -87679 -79641 -111238 -340537
9085 -340537 -125104 -245118 49871 -51735 99909 1939 -158050 33537 82432 100112 -136094
9073 -123964 1751 208281 -135382 -43154 -153476 -230979 128063 240 117272 -4584 109629
9061 323203 209817 -100730 -294858 -243275 116691 136139 -329196 -47837 -183678 247824
9050 98251 215168 254736 14844 98001 -151182 103968 -364344 -162552 99097 26486 8370
9038 114272 -112339 12700 97055 27399 320435 -122272 84393 -426320 68076 1034 20659
9027 20659 -131958 186467 -44800 -161612 -112599 252087 27794 -292848 -62915 221290 -88554
$$ packed form
9109A28132a88937F4757P9488a38458n3109B45739d5796L057d298j01451A36154
9097D8436a83197a6586j98619g8199r1962r553b8472G7634h7679Q038l1597k29299
9085c40537a25104j20014D9871e1735I9909A939a58050C3537M8895J7680a36094
9073a23964A751K06530a35382d3154j10322p7503A28063B40J17032d584A09629
9061C23203j13386a00730j94128N1583A16691J9448c29196d7837j35841B47824
9050I8251J16917L9568A4844Q3157a51182A03968c64344a62552I9097B6486H370
9038A14272a12339A2700Q4355B7399K93036a22272H4393d26320F8076A034J9625
9027B0659a31958A86467d4800j16812M9013B52087B7794b92848f2915B21290h8554
$$ plain form
9015 186347 -236627 103551 -78238 -94895 -124207 -403954 -63806 52013 -263777 124286 104138
9004 104138 -206618 -244952 226677 7216 -126497 -109131 -2642 -81868 304323 -430507 -220211
8993 -220211 25245 -69420 -24320 188544 89171 -165450 -421844 13888 -93026 -137427 -594
8981 -248905 3799 85598 39441 167081 -165436 -90504 -13941 -16468 -71965 -286993 -96020
8969 -99894 273551 -19501 -121683 -104416 -226067 -389390 -192871 15072 -199359 81339 -181144
8957 -2474 -335266 -75387 -251965 15408 -123440 -263464 229133 -63369 237681 -209684 249168
8945 -376424 -129563 -228461 138660 30374 202897 -157969 162921 -78419 -73567 399515 216518
8934 216518 196766 -11877 70633 51115 87640 161073 -31819 442160 587459 529875 2292235
$$ packed form
9015A86347b36627A03551g8238j6657k9312k79747f3806E2013b63777A24286k0148
9004A04138b06618l8334B26677G216a26497J7366b642p9226C04323d30507K10296
8993b20211B5245f9420b4320A88544H9171a65450k56394A3888i3026m4401e94
8981b48905C799Q1799C9441J27640a65436P4932a3941k527n5497k15028i6020
8969i9894B73551a9501j02182J7267j21651j63323a92871A5072a99359H1339a81144
8957b474l32792g5387j76578A5408a23440j40024B29133f3369B37681b09684B49168
8945c76424a29563r8898A38660C0374J72523a57969A62921g8419M852C99515j82997
8934B16518j9752a1877G0633j9518L6525P3433c1819D42160J45299n7584J762360
$$ plain form
8923 2292235 7838274 17082832 6128005 1808587 1042796 284413 133813 126943 150079
8914 150079 74106 234232 -18508 -193784 171125 315530 549568 -207234 297277 -171804
8903 267882 -13270 171019 262347 -88296 -174373 93740 -272370 -174039 -90877 -63089 32208
8891 -182972 -88706 36865 33655 -187807 -40350 125104 -129250 169110 42918 57308 93270
8880 93270 -116985 -118276 -16246 72529 72676 -121096 -9679 -118553 22250 -178600 43841 189339
8868 189339 279763 -79357 142343 -199708 316328 -171488 -91060 5415 7443 60873 -183406
8856 -166499 151737 77201 -47137 -208399 -8484 -169529 -61631 187855 -173911 -231278 -346451
$$ packed form
8923B292235N546039R244558F128005A808587p65791B84413A33813o870K3136
8914A50079G4106J60126a8508j75276A71125J44405K34038b07234B97277a71804
8903B67882a3270A71019R1328h8296q6077I3740b72370R8331Q3162K7788C2208
8891a82972h8706C6865l210a87807d0350A25104a29250A69110D2918J4390L5962
8880I3270a16985j291a6246G2529J47a21096i679j08874B2250a78600D3841J45498
8868A89339R0424g9357A42343a99708C16328a71488Q0428E415K028N3430a83406
8856a66499A51737p4536d7137j61262h484j61045f1631A87855a73911n7367j15173
$$ [...]
##END NTUPLES=NMR SPECTRUM
##END=
