##TITLE=AC1577_ROEFFECT0023_8271217_zpPn0vTOOk
##JCAMPDX= 6.0         $$ Bruker NMR JCAMP-DX V2.0
##DATA TYPE= NMR SPECTRUM
##DATA CLASS= NTUPLES
##ORIGIN= BRUKER
##OWNER= Administrator
$$ 1.72 TOPSPIN		Version 2.1
$$ 2013-10-18 21:50:02.753 -0700  Administrator@X
$$ Compression mode = diff/dup
##.OBSERVE FREQUENCY= 400.02188249412
##.OBSERVE NUCLEUS= ^1H
##.ACQUISITION MODE= SIMULTANEOUS (DQD)
##.ACQUISITION SCHEME= undefined
##.AVERAGES= 64
##.DIGITISER RES= 22
##SPECTROMETER/DATA SYSTEM= spect
##.PULSE SEQUENCE= noesygpps1d.comp
##.SOLVENT NAME= COFFEE_meoh
##.SHIFT REFERENCE= INTERNAL, COFFEE_meoh, 1, 14.96052
##AUDIT TRAIL= $$ (NUMBER, WHEN, WHO, WHERE, PROCESS, VERSION, WHAT)
$$ ##TITLE= Audit trail, TOPSPIN		Version 2.1
$$ ##JCAMPDX= 5.01
$$ ##ORIGIN= Bruker BioSpin GmbH
$$ ##OWNER= Administrator
$$ $$ E:\/data/COFFEE/nmr/AC1577_ROEFFECT0023_8271217_zpPn0vTOOk/12/pdata/1/auditp.txt
$$ ##AUDIT TRAIL=  $$ (NUMBER, WHEN, WHO, WHERE, PROCESS, VERSION, WHAT)
(   1,<2013-10-18 21:49:57.690 -0700>,<Administrator>,<X>,<go>,<TOPSPIN 2.1>,
      <created by zg
	started at 2013-10-18 21:38:26.720 -0700,
	POWCHK enabled, PULCHK disabled,
       configuration hash MD5:
       C8 4E 4E 5D D3 5C D8 9E 9F 52 82 E0 59 8A DE 15
       data hash MD5: 64K
       3C 0F E5 B7 07 A5 90 22 EC 88 46 59 1D AA 4C 67>)
(   2,<2013-10-18 21:50:00.737 -0700>,<Administrator>,<X>,<proc1d>,<TOPSPIN 2.1>,
      <Start of raw data processing
       efp LB = 0.3 FT_mod = 6 PKNL = 1 PHC0 = 0 PHC1 = 0 SI = 128K 
       data hash MD5: 128K
       AE 4E 54 E6 68 97 9F AF B3 5D 18 B2 B1 AE E4 04>)
(   3,<2013-10-18 21:50:01.721 -0700>,<Administrator>,<X>,<proc1d>,<TOPSPIN 2.1>,
      <pk PHC0 = -85.67688 PHC1 = 0 
       data hash MD5: 128K
       5F 5D A2 7A 54 99 8F 5F E4 16 9B 06 DA 0A 90 CD>)
(   4,<2013-10-18 21:50:02.143 -0700>,<Administrator>,<X>,<proc1d>,<TOPSPIN 2.1>,
      <abs ABSG = 1 
       data hash MD5: 128K
       DD DE 4E 72 C4 34 0D D0 12 60 4F 5D 5C 5F D2 26>)
(   5,<2013-10-18 21:50:02.268 -0700>,<Administrator>,<X>,<proc1d>,<TOPSPIN 2.1>,
      <abs ABSG = 2 
       data hash MD5: 128K
       63 FA 5A 6B 36 6A 25 A1 08 07 B7 08 1A 76 C5 FB>)
(   6,<2013-10-18 21:50:02.346 -0700>,<Administrator>,<X>,<proc1d>,<TOPSPIN 2.1>,
      <abs ABSG = 3 
       data hash MD5: 128K
       22 9F 49 BB 5C 69 20 25 EB 19 11 74 31 A5 39 81>)
(   7,<2013-10-18 21:50:02.487 -0700>,<Administrator>,<X>,<proc1d>,<TOPSPIN 2.1>,
      <abs ABSG = 4 
       data hash MD5: 128K
       0C 40 3B 09 59 E0 19 54 C8 86 19 40 06 91 C7 0E>)
(   8,<2013-10-18 21:50:02.596 -0700>,<Administrator>,<X>,<proc1d>,<TOPSPIN 2.1>,
      <abs ABSG = 5 
       data hash MD5: 128K
       52 A5 47 1B B7 99 32 06 36 DA 78 1C CD 1E 55 56>)
$$ ##END=
$$ 
$$ $$ hash MD5
$$ $$ 8C 16 14 9F AF 66 33 93 B3 FB 41 EE 42 15 EF 57
##$RELAX= 
##$RELAX= 
##$RELAX= 
##$RELAX= 
##$RELAX= 
##$RELAX= 
##$RELAX= 
##$RELAX= 
$$ Bruker specific parameters
$$ --------------------------
##$DU= <E:\>
##$EXPNO= 12
$$ [...]
150 150 150 150 150 150 150 150
##$TP07= 0
##$TPNAME0= <>
##$TPNAME1= <>
##$TPNAME2= <>
##$TPNAME3= <>
##$TPNAME4= <>
##$TPNAME5= <>
##$TPNAME6= <>
##$TPNAME7= <>
##$TPOAL= (0..7)
0.5 0.5 0.5 0.5 0.5 0.5 0.5 0.5
##$TPOFFS= (0..7)
0 0 0 0 0 0 0 0
##$TUNHIN= 0
##$TUNHOUT= 0
##$TUNXOUT= 0
##$USERA1= <user>
##$USERA2= <user>
##$USERA3= <user>
##$USERA4= <user>
##$USERA5= <user>
##$V9= 5
##$VALIST= <valist>
##$VCLIST= <CCCCCCCCCCCCCCC>
##$VD= 0
##$VDLIST= <DDDDDDDDDDDDDDD>
##$VPLIST= <PPPPPPPPPPPPPPP>
##$VTLIST= <TTTTTTTTTTTTTTT>
##$WBST= 1024
##$WBSW= 4
##$XGAIN= (0..3)
0 0 0 0
##$XL= 0
##$YL= 0
##$YMAX_a= 6157339
##$YMIN_a= -11823696
##$ZGOPTNS= <>
##$ZL1= 120
##$ZL2= 120
##$ZL3= 120
##$ZL4= 120
##$ABSF1= 14.96052
##$ABSF2= -5.597662
##$ABSG= 5
##$ABSL= 3
##$ALPHA= 0
##$AQORDER= 0
##$ASSFAC= 0
##$ASSFACI= 0
##$ASSFACX= 0
##$ASSWID= 0
##$AUNMP= <proc_prof1d_extract.lims>
##$AXLEFT= 0
##$AXNAME= <>
##$AXNUC= <1H>
##$AXRIGHT= 0
##$AXTYPE= 0
##$AXUNIT= <>
##$AZFE= 0.1
##$AZFW= 0.1
##$BCFW= 0
##$BC_mod= 0
##$BYTORDP= 0
##$COROFFS= 0
##$CY= 15
##$DATMOD= 1
##$DC= 0
##$DFILT= <>
##$DTYPP= 0
##$F1P= 0
##$F2P= 0
##$FCOR= 0.5
##$FTSIZE= 131072
##$FT_mod= 6
##$GAMMA= 0
##$GB= 0
##$INTBC= 1
##$INTSCL= 1
##$ISEN= 128
##$LB= 0.3
##$LEV0= 0
##$LPBIN= 0
##$MAXI= 10000
##$MC2= 0
##$MEAN= 0
##$ME_mod= 0
##$MI= 0
##$NCOEF= 0
##$NC_proc= -2
##$NLEV= 6
##$NOISF1= 0
##$NOISF2= 0
##$NSP= 0
##$NTH_PI= 0
##$NZP= 0
##$OFFSET= 14.96052
##$PC= 1
##$PHC0= -85.67688
##$PHC1= 0
##$PH_mod= 1
##$PKNL= yes
##$PPARMOD= 0
##$PPDIAG= 0
##$PPIPTYP= 0
##$PPMPNUM= 2147483647
##$PPRESOL= 1
##$PSCAL= 4
##$PSIGN= 0
##$PYNMP= <proc.py>
##$REVERSE= no
##$SF= 400.02000982741
##$SI= 131072
##$SIGF1= 0
##$SIGF2= 0
##$SINO= 400
##$SIOLD= 131072
##$SPECTYP= <>
##$SREGLST= <1H.CDCl3>
##$SSB= 0
##$STSI= 131072
##$STSR= 0
##$SW_p= 8223.68421052631
##$SYMM= 0
##$S_DEV= 0
##$TDeff= 65536
##$TDoff= 0
##$TI= <>
##$TILT= no
##$TM1= 0
##$TM2= 0
##$TOPLEV= 0
##$USERP1= <user>
##$USERP2= <user>
##$USERP3= <user>
##$USERP4= <user>
##$USERP5= <user>
##$WDW= 1
##$XDIM= 131072
##$YMAX_p= 433820009
##$YMIN_p= -12829
##$CURPLOT= <Network HP LaserJet P1505>
##$CURPRIN= <$Network HP LaserJet P1505>
##$DFORMAT= <normdp>
##$LAYOUT= <+/1D_H.xwp>
##$LFORMAT= <normlp>
##$PFORMAT= <normpl>
##$SURQMSG= 1
$$ End of Bruker specific parameters
$$ ---------------------------------
##NTUPLES= NMR SPECTRUM
##VAR_NAME=  FREQUENCY,     SPECTRUM/REAL,   SPECTRUM/IMAG
##SYMBOL=    X,             R,               I
##VAR_TYPE=  INDEPENDENT,   DEPENDENT,       DEPENDENT
##VAR_FORM=  AFFN,          ASDF,            ASDF
##VAR_DIM=   131072,        131072,          131072
##UNITS=     HZ,            ARBITRARY UNITS, ARBITRARY UNITS
##FACTOR=    0.0627417313425164, 1,          1
##FIRST=     8223.62146879497, 1847,         -63936
##LAST=      0,             4301,            -63292
##MIN=       0,             -12829,          0
##MAX=       8223.62146879497, 433820009,    0
$$ Real data points
##PAGE= N=1
##DATA TABLE= (X++(R..R)), XYDATA
$$ [...]
$$ plain form
63956 768148 807040 851569 903078 962601 1031201 1110423 1202270 1308828 1431994 1573254 1733120
63945 1733120 1910711 2104325 2312627 2535000 2770553 3017009 3270695 3527149 3781308
63936 3781308 4027312 4258698 4469087 4652835 4805448 4923895 5006610 5052916 5062328 5034395
63926 5034395 4968959 4866362 4727805 4556284 4357311 4138033 3905133 3663700 3418133 3173287
63916 3173287 2933908 2703211 2482952 2275024 2082249 1907205 1750814 1612520 1491325
63907 1491325 1386012 1294654 1214863 1144906 1084153 1032242 988214 950714 918628 891071 866996
63896 866996 845344 825514 807227 789817 772171 753604 734486 715656 697471 679816 662845
63885 662845 647180 633284 621128 610669 602229 596118 592238 590514 591456 595672 602891 612090 622725
$$ packed form
63956G68148L8892M4529N1509N9523O8600P9222R1847J06558J23166J41260J59866
63945A733120J77591J93614K08302K22373K35553K46456K53686K56454K54159
63936C781308K46004K31386K10389J83748J52613J18447Q2715M6306R412k7933
63926E034395o5436j02597j38557j71521j98973k19278k32900k41433k45567k44846
63916C173287k39379k30697k20259k07928j92775j75044j56391j38294j21195
63907A491325j05313r1358p9791o9957o0753n1911m4028l7500l2086k7557k4075
63896H66996k1652j9830j8287j7410j7646j8567j9118j8830j8185j7655j6971
63885F62845j5665j3896j2156j0459q440o111l880j724R42M216P219R199J0635
$$ plain form
63872 622725 635297 650413 667774 686462 705808 725483 745038 763953 782057 799429 815952
63861 815952 831410 845893 859485 871554 881021 887514 891646 893836 893498 889834 882965 873724 862700
63848 862700 850025 835807 820117 802665 783150 761900 739598 716352 691653 665350 638098
63837 638098 610695 583570 557163 532202 509087 487397 466478 446260 427062 408944 391828
63826 391828 376114 362498 351076 341110 331831 323090 315080 307778 300901 294205 287534 280806 274161
63813 274161 268065 263048 259288 256474 254013 251375 248449 245693 243765 242859 242476 241992 241335 240894 240822 240685
63797 240685 239857 238137 235907 233784 232153 230915 229581 227672 225143 222453 220139 218329 216727 215140
63783 215140 213920 213703 214644 216074 217044 217165 216762 216312 216012 215861 215825 215754 215372 214589 213704 213074 212647 212014 210884
$$ packed form
63872F22725J2572J5116J7361J8688J9346J9675J9555J8915J8104J7372J6523
63861H15952J5458J4483J3592J2069R467O493M132K190l38l664o869r241j1024
63848H62700j2675j4218j5690j7452j9515k1250k2302k3246k4699k6303k7252
63837F38098k7403k7125k6407k4961k3115k1690k0919k0218j9198j8118j7116
63826C91828j5714j3616j1422r966r279q741q010p302o877o696o671o728o645
63813B74161o096n017l760k814k461k638k926k756j928r06l83m84o57m41p2j37
63797B40685q28j720k230k123j631j238j334j909k529k690k314j810j602j587
63783B15140j220k17R41J430R70J21m03m50l00j51l6p1l82p83q85o30m27o33j130
$$ plain form
63764 210884 209344 207731 206390 205442 204641 203591 202314 201470 201684 202744 203825 204517 205225 206437 207987 209295
63748 209295 210049 210412 210734 211382 212687 214783 217435 220116 222259 223531 224148 224921 226588 228880 230627 231158
63732 231158 231234 232177 234321 236895 239289 241736 244620 247782 250886 254041 257609 261613 265682 269478 272884
63717 272884 275823 278141 279691 280393 280238 279325 277842 275937 273699 271322 269165 267499 266309 265470 264981
63702 264981 264867 264886 264642 264075 263749 264476 266627 269792 273122 276011 278496 281028 283929 287131 290433 293857
63686 293857 297687 302064 306492 309833 311081 310350 308886 307823 307031 305550 303052 300394 298606 297871 297820
63671 297820 298396 299856 302022 304132 305542 306282 306745 307086 307128 306723 305958 304917 303347 300697 296624 291462
63655 291462 286116 281429 277647 274404 271118 267514 263985 261443 260505 260755 261065 260718 260005 259671 260197 261786
$$ packed form
63764B10884j540j613j341r48q01j050j277q44K14J060J081O92P08J212J550J308
63748B09295P54L63L22O48J305K096K652K681K143J272O17P73J667K292J747N31
63732B31158P6R43K144K574K394K447K884L162L104L155L568M004M069L796L406
63717B72884K939K318J550P02j55r13j483j905k238k377k157j666j190q39m89
63702B64981j14J9k44n67l26P27K151L165L330K889K485K532K901L202L302L424
63686B93857L830M377M428L341J248p31j464j063p92j481k498k658j788p35n1
63671B97820N76J460K166K110J410P40M63L41M2m05p65j041j570k650m073n162
63655B91462n346m687l782l243l286l604l529k542r38K50L10l47p13l34N26J589
$$ plain form
63639 261786 264500 267973 271344 274040 276465 279494 283437 287965 292851 298187 303938 309905 316196 323139
63625 323139 330708 338630 347129 356849 367765 378957 389961 401741 415731 432368 451166 471738
63613 471738 493929 517340 541768 568136 597953 631434 666750 701471 734147 764077 790223
63602 790223 811151 825929 834518 837332 834985 828551 819625 809797 800114 790996 782338 773532 763566 751360
63588 751360 736071 717211 694807 669622 643059 616569 591112 567206 545267 525615 508216
63577 508216 492803 479362 468197 459399 452561 447278 443662 442004 442145 443619 446333 450623 456553 463671
63563 463671 471654 480659 490734 501294 511703 522107 533180 545228 558097 571951 587574 605769
63551 605769 626904 651210 679154 711243 747744 788558 832765 877803 919444 953305 976627
$$ packed form
63639B61786K714L473L371K696K425L029L943M528M886N336N751N967O291O943
63625C23139P569P922Q499R720J0916J1192J1004J1780J3990J6637J8798K0572
63613D71738K2191K3411K4428K6368K9817L3481L5316L4721L2676K9930K6146
63602G90223K0928J4778Q589K814k347o434q926r828r683r118q658q806r966j2206
63588G51360j5289j8860k2404k5185k6563k6490k5457k3906k1939j9652j7399
63577E08216j5413j3441j1165q798o838n283l616j658J41J474K714M290N930P118
63563D63671P983R005J0075J0560J0409J0404J1073J2048J2869J3854J5623J8195
63551F05769K1135K4306K7944L2089L6501M0814M4207M5038M1641L3861K3322
$$ plain form
63540 976627 988718 990263 982897 969363 953120 937018 922226 908559 895688 883750 872818 862095
63528 862095 849867 834309 814315 789754 761249 729967 697393 664814 632787 601284 570519
63517 570519 541406 514951 491370 470076 450458 432442 416356 402511 390906 381025 371945 362930
63505 362930 354068 346110 339622 334492 330289 326752 323747 321068 318596 316529 315125 314269 313553 312835 312472
63490 312472 312849 313817 314771 315320 315775 316851 318888 321542 324268 326904 329589 332373 335273 338587 342593
63475 342593 346854 350262 352016 352220 351352 349615 347149 344377 341537 338158 333639 328334 323493 320087 318149
63460 318149 317285 317257 317867 318772 319757 320912 322343 323983 325859 328238 331249 334662 338396 343001 349247 357254
63444 357254 366338 375795 385655 396616 409329 423771 439434 456304 475528 498726 526336 556756
$$ packed form
63540I76627J2091J545p366j3534j6243j6102j4792j3667j2871j1938j0932j0723
63528H62095j2228j5558j9994k4561k8505l1282l2574l2579l2027l1503l0765
63517E70519k9113k6455k3581k1294j9618j8016j6086j3845j1605r881r080r015
63505C62930q862p958o488n130m203l537l005k679k472k067j404q56p16p18l63
63490C12472L77R68R54N49M55J076K037K654K726K636K685K784K900L314M006
63475C42593M261L408J754K04q68j737k466k772k840l379m519n305m841l406j938
63460C18149q64k8O10R05R85J155J431J640J876K379L011L413L734M605O246Q007
63444C57254R084R457R860J0961J2713J4442J5663J6870J9224K3198K7610L0420
$$ plain form
63432 556756 587187 615131 639077 658311 672696 682738 689572 694761 700067 707135 717174 730945
63420 730945 749143 772494 801286 835025 872800 913618 955930 997049 1033637 1062956 1083469
63409 1083469 1094551 1096404 1090461 1079312 1065661 1051343 1037333 1024159 1011851 999559 985664 968479
63397 968479 946939 920845 890685 857322 821780 785217 748828 713562 679876 647905 617882
63386 617882 590277 565582 544080 525765 510353 497467 487010 479236 474236 471501 470319 470483 472218
63373 472218 475545 480300 486775 495640 506964 519907 533764 548814 565696 584397 604475 626046
63361 626046 649912 676797 706930 740306 776841 816125 857295 899101 939787 977070 1008685
63350 1008685 1033110 1049629 1057994 1058536 1052548 1041987 1028618 1013752 998667 984572 971817 959465
$$ packed form
63432E56756L0431K7944K3946J9234J4385J0042O834N189N306P068J0039J3771
63420G30945J8198K3351K8792L3739L7775M0818M2312M1119L6588K9319K0513
63409A083469J1082J853n943j1149j3651j4318j4010j3174j2308j2292j3895j7185
63397I68479k1540k6094l0160l3363l5542l6563l6389l5266l3686l1971l0023
63386F17882k7605k4695k1502j8315j5412j2886j0457p774n000k735j182J64J735
63373D72218L327M755O475Q865J1324J2943J3857J5050J6882J8701K0078K1571
63361F26046K3866K6885L0133L3376L6535L9284M1170M1806M0686L7283L1615
63350A008685K4425J6519Q365N42n988j0561j3369j4866j5085j4095j2755j2352
$$ plain form
63338 959465 945880 929507 909198 884477 855890 824718 791984 758056 723476 689662 658268
63327 658268 630148 605422 584291 567199 554324 545509 540669 539599 541105 542699 541475 535376 523906
63314 523906 508180 490353 472519 455704 439849 424686 410333 397176 385601 375930 368184 361745
63302 361745 355718 349899 344998 341584 339153 336676 333764 330835 328337 326359 324856 323658 322181 319718
63288 319718 316227 312487 309258 306641 304402 302504 301006 299812 298936 298768 299556 300743 301342 301077 300727 301097
63272 301097 301974 302372 301665 300220 299027 298913 300067 302045 304158 306035 307914 310283 313196 316128 318733
63257 318733 321555 325626 331268 337583 343328 348110 352495 357151 362251 367665 373350 379399 386017 393659
63243 393659 402978 414312 427273 441064 455237 470014 485941 503389 522473 543272 565930 590399
$$ packed form
63338I59465j3585j6373k0309k4721k8587l1172l2734l3928l4580l3814l1394
63327F58268k8120k4726k1131j7092j2875q815m840j070J506J594j224o099j1470
63314E23906j5726j7827j7834j6815j5855j5163j4353j3157j1575r671p746o439
63302C61745o027n819m901l414k431k477k912k929k498j978j503j198j477k463
63288C19718l491l740l229k617k239j898j498j194q76j68P88J187N99k65l50L70
63272C01097Q77L98p07j445j193j14J154J978K113J877J879K369K913K932K605
63257C18733K822M071N642O315N745M782M385M656N100N414N685O049O618P642
63243C93659R319J1334J2961J3791J4173J4777J5927J7448J9084K0799K2658K4469
$$ plain form
63231 590399 616044 641655 666094 689001 710774 731893 752507 772764 793154 814193 835919
63220 835919 858025 880374 903071 926086 949092 971588 992742 1011159 1025304 1034391 1038483 1037530
63208 1037530 1030788 1017642 998703 975557 949504 921034 890588 859278 828532 799305 771981
63197 771981 746936 724854 706349 691491 679854 671056 665136 662333 662592 665461 670531 677796 687442
63184 687442 699311 712823 727464 743207 760320 778789 797999 816978 834950 851721 867644
63173 867644 883257 898933 914739 930478 945648 959376 970553 978155 981484 980146 973980 963135
63161 963135 948113 929465 907378 881714 852642 821122 788631 756367 724843 694228 664961
63150 664961 637859 613666 592508 573854 556999 541627 527885 515926 505521 496261 488042 481135
$$ packed form
63231E90399K5645K5611K4439K2907K1773K1119K0614K0257K0390K1039K1726
63220H35919K2106K2349K2697K3015K3006K2496K1154J8417J4145R087M092r53
63208A037530o742j3146j8939k3146k6053k8470l0446l1310l0746k9227k7324
63197G71981k5045k2082j8505j4858j1637q798n920k803K59K869N070P265R646
63184F87442J1869J3512J4641J5743J7113J8469J9210J8979J7972J6771J5923
63173H67644J5613J5676J5806J5739J5170J3728J1177P602L329j338o166j0845
63161I63135j5022j8648k2087k5664k9072l1520l2491l2264l1524l0615k9267
63150F64961k7102k4193k1158j8654j6855j5372j3742j1959j0405r260q219o907
$$ plain form
63138 481135 475763 471789 468816 466400 464071 461482 458747 456511 455466 455822 457346 459708 462681 466239
63124 466239 470630 476126 482383 488321 493077 496947 500902 505294 509539 513110 516226 519340 522516 525659
63110 525659 528934 532511 536155 539509 542544 545407 547998 550108 551810 553273 554297 554528 554144 553828 553886
63095 553886 553769 552753 550871 548893 547552 547081 547407 548398 549745 550866 551319 551368 551864 553417 555916 559057
63079 559057 563107 568645 575611 583170 590723 598622 607531 617414 627535 637272 646540 655588 664856 675082
63065 675082 687177 701794 719052 738627 760029 782979 807739 834989 865245 898515 934612
63054 934612 973538 1015342 1059895 1107137 1157213 1209970 1264567 1320097 1376342 1433337 1490392
63043 1490392 1546287 1600471 1653391 1705571 1757115 1808352 1860229 1913556 1968209 2023236 2077194
$$ packed form
63138D81135n372l974k973k416k329k589k735k236j045L56J524K362K973L558
63124D66239M391N496O257N938M756L870L955M392M245L571L116L114L176L143
63110E25659L275L577L644L354L035K863K591K110J702J463J024K31l84l16N8
63095E53886j17j016j882j978j341m71L26R91J347J121M53M9M96J553K499L141
63079E59057M050N538O966P559P553P899Q909R883J0121R737R268R048R268J0226
63065F75082J2095J4617J7258J9575K1402K2950K4760K7250L0256L3270L6097
63054I34612L8926M1804M4553M7242N0076N2757N4597N5530N6245N6995N7055
63043A490392N5895N4184N2920N2180N1544N1237N1877N3327N4653N5027N3958
$$ plain form
63032 2077194 2128096 2173656 2212142 2242544 2263496 2272748 2268469 2250766 2221143 2180672 2129568 2068570
63020 2068570 1999943 1926775 1851763 1776878 1703765 1634020 1569152 1510394 1458497 1413768 1376510
63009 1376510 1347333 1326672 1314034 1308112 1307821 1312876 1323272 1338584 1358049 1381071 1407251 1436001
62997 1436001 1466455 1497812 1529577 1561455 1593176 1624569 1655639 1686397 1716570 1745590 1772876
62986 1772876 1797849 1819531 1836344 1846697 1849783 1845497 1833575 1813256 1784006 1746281 1701285 1650317
62974 1650317 1594602 1535536 1474657 1413441 1353316 1295613 1241120 1189864 1141710 1097049 1056554
62963 1056554 1020383 988075 959060 932843 908763 886198 865001 845191 826134 806713 786623
62952 786623 766889 748698 732071 716150 700403 685011 670197 655731 641216 626636 612595
$$ packed form
63032B077194N0902M5560L8486L0402K0952R252m279j7703k9623m0471n1104o0998
63020B068570o8627p3168p5012p4885p3113o9745o4868n8758n1897m4729l7258
63009A376510k9177k0661j2638n922k91N055J0396J5312J9465K3022K6180K8750
62997A436001L0454L1357L1765L1878L1721L1393L1070L0758L0173K9020K7286
62986A772876K4973K1682J6813J0353L086m286j1922k0319k9250l7725m4996n0968
62974A650317n5715n9066o0879o1216o0125n7703n4493n1256m8154m4661m0495
62963A056554l6171l2308k9015k6217k4080k2565k1197j9810j9057j9421k0090
62952G86623j9734j8191j6627j5921j5747j5392j4814j4466j4515j4580j4041
$$ plain form
62941 612595 600050 589638 581052 573268 565580 558287 552129 547289 543312 539871 537135 535319 534206 533314
62927 533314 532333 531222 530006 528725 527610 527053 527184 527501 527165 525819 523914 522036 520110 517647 514679
62912 514679 511916 509844 508093 505946 503060 499406 494910 489644 484184 479276 475219 471898 469280 467395
62898 467395 465879 464094 461912 460002 459116 459316 460095 461031 462002 462899 463494 463727 463917 464490 465457 466407 467122
62881 467122 467972 469359 470852 471347 470329 468621 467589 467826 468947 470348 471652 472455 472263 470948 468942
62866 468942 466803 464722 462613 460497 458603 457143 456103 455305 454727 454682 455480 456820 457865 458223 458593 460008
62850 460008 462513 465032 466499 466684 465926 464621 463150 461854 460737 459451 457791 455952 454144 452271 450231
62835 450231 448261 446702 445603 444742 443898 442963 442034 441561 442088 443633 445582 447407 449167 451103 453138 455156
$$ packed form
62941F12595j2545j0412q586p784p688p293o158m840l977l441k736j816j113q92
62927E33314r81j111j216j281j115n57J31L17l36j346j905j878j926k463k968
62912E14679k763k072j751k147k886l654m496n266n460m908m057l321k618j885
62898D67395j516j785k182j910q86K00P79R36R71Q97N95K33J90N73R67R50P15
62881D67122Q50J387J493M95j018j708j032K37J121J401J304Q03j92j315k006
62866D68942k139k081k109k116j894j460j040p98n78m5P98J340J045L58L70J415
62850D60008K505K519J467J85p58j305j471j296j117j286j660j839j808j873k040
62835D50231j970j559j099q61q44r35r29m73N27J545J949J825J760J936K035K018
$$ plain form
62819 455156 457402 460154 463261 466543 470364 475149 480472 485306 489278 493036 497293 502094 507264 512918
62805 512918 519123 525568 532100 539239 547627 557171 567240 577637 588814 601090 614168 627659 641763
62792 641763 657183 674610 694601 717773 744684 775478 809929 848084 890733 939080 993995
62781 993995 1055645 1123751 1197953 1277908 1363206 1453203 1546759 1642022 1736644 1828310 1914985
62770 1914985 1994600 2064673 2122432 2165364 2191699 2200687 2192620 2168502 2129583 2077323 2013761 1941461
62758 1941461 1862722 1779061 1691799 1602840 1514317 1427599 1343289 1262264 1186080 1115967 1051911
62747 1051911 993083 938894 889232 843992 802856 765546 731961 702037 675692 652844 633244
62736 633244 616266 601148 587496 575431 565181 556698 549740 544218 540258 537836 536357 534770 532335
$$ packed form
62819D55156K246K752L107L282L821M785N323M834L972L758M257M801N170N654
62805E12918O205O445O532P139Q388R544J0069J0397J1177J2276J3078J3491J4104
62792F41763J5420J7427J9991K3172K6911L0794L4451L8155M2649M8347N4915
62781I93995O1650O8106P4202P9955Q5298Q9997R3556R5263R4622R1666Q6675
62770A914985P9615P0073N7759M2932K6335Q988q067k4118l8919n2260o3562p2300
62758A941461p8739q3661q7262q8959q8523q6718q4310q1025p6184p0113o4056
62747A051911n8828n4189m9662m5240m1136l7310l3585k9924k6345k2848j9600
62736F33244j6978j5118j3652j2065j0250q483o958n522l960k422j479j587k435
$$ plain form
62723 532335 529351 526994 526336 527535 529958 532952 536439 540938 547118 555291 565269 576821 590187 605929
62709 605929 624283 644982 667874 693375 722062 754113 789601 829137 873721 923803 978771
62698 978771 1037537 1099484 1164756 1233726 1306186 1380855 1455587 1528104 1596511 1659063 1713612
62687 1713612 1757602 1788740 1805676 1808192 1796945 1773012 1737476 1691338 1635829 1572678 1503887
62676 1503887 1431340 1356804 1282182 1209382 1139766 1073874 1011744 953365 898851 848392 802162
62665 802162 760168 722184 687930 657287 630136 605989 584073 563887 545567 529570 516082
62654 516082 504735 494805 485715 477402 470066 463430 456518 448593 440167 432548 426364 421105 416231 412081
62640 412081 409288 407827 407144 406894 406993 407187 407110 406693 406107 405397 404567 403868 403532 403339 402943 402565 402781 403604 404369
$$ packed form
62723E32335k984k357o58J199K423K994L487M499O180Q173R978J1552J3366J5742
62709F05929J8354K0699K2892K5501K8687L2051L5488L9536M4584N0082N4968
62698I78771N8766O1947O5272O8970P2460P4669P4732P2517O8407O2552N4549
62687A713612M3990L1138J6936K516j1247k3933l5536m6138n5509o3151o8791
62676A503887p2547p4536p4622p2800o9616o5892o2130n8379n4514n0459m6230
62665H02162m1994l7984l4254l0643k7151k4147k1916k0186j8320j5997j3488
62654E16082j1347r930r090q313p336o636o912p925q426p619o184n259m874m150
62640D12081k793j461o83k50R9J94p7m17n86p10q30o99l36j93l96l78K16Q23P65
$$ plain form
62621 404369 404686 404917 405469 406226 407104 408663 411631 416050 421388 427312 433818 440728 447617 454352 461339
62606 461339 469107 477941 488033 499707 513320 529131 547394 568450 592594 619989 650820 685331
62594 685331 723565 765114 809270 855290 902302 948947 993340 1033617 1068538 1097571 1120425
62583 1120425 1136567 1145173 1145464 1137096 1120353 1096098 1065567 1030093 991010 949708 907619 865877
62571 865877 825060 785495 747806 712843 680936 651558 623978 598085 574274 552828 533820
62560 533820 517485 504078 493255 484098 475980 469006 463372 458706 454442 450532 447260 444549 442047
62547 442047 439915 438922 439448 440778 441781 442119 442403 443203 444257 444815 444514 443672 442814 442178 441804 441872 442694 444395
62529 444395 446874 450142 454473 460126 467139 475544 485573 497407 510910 525926 542789 562268 585031
$$ packed form
62621D04369L17K31N52P57Q78J559K968M419N338N924O506O910O889O735O987
62606D61339P768Q834J0092J1674J3613J5811J8263K1056K4144K7395L0831L4511
62594F85331L8234M1549M4156M6020M7012M6645M4393M0277L4921K9033K2854
62583A120425J6142Q606K91q368j6743k4255l0531l5474l9083m1302m2089m1742
62571H65877m0817l9565l7689l4963l1907k9378k7580k5893k3811k1446j9008
62560E33820j6335j3407j0823r157q118o974n634m666m264l910l272k711k502
62547D42047k132r93N26J330J003L38K84Q00J054N58l01q42q58o36l74O8Q22J701
62529D44395K479L268M331N653P013Q405J0029J1834J3503J5016J6863J9479K2763
$$ plain form
62516 585031 611378 641392 674974 711654 750675 791426 833620 876991 920948 964480 1006091
62505 1006091 1043794 1075591 1100268 1117635 1127945 1131355 1128061 1118646 1104028 1085249 1063493 1040061
62493 1040061 1016111 992587 970620 951658 936843 926414 920094 918002 920935 929805 944995 966089
62481 966089 991940 1021136 1052812 1087001 1123933 1162951 1202183 1239038 1270864 1295616 1312595
62470 1312595 1322514 1326250 1323409 1312513 1292535 1263787 1227406 1184751 1137495 1087565 1036461 984955
62458 984955 933744 883991 836900 793165 753194 717426 686029 658768 635669 617374 604115
62447 604115 594629 586939 580222 575192 572599 572080 572815 574607 577778 582399 588201 595045 602829 610799 617433
62432 617433 621445 622716 621851 618801 612469 602089 588674 574460 560886 547767 534565 521590 509406
$$ packed form
62516E85031K6347L0014L3582L6680L9021M0751M2194M3371M3957M3532M1611
62505A006091L7703L1797K4677J7367J0310L410l294r415j4618j8779k1756k3432
62493A040061k3950k3524k1967j8962j4815j0429o320k092K933Q870J5190K1094
62481I66089K5851K9196L1676L4189L6932L9018L9232L6855L1826K4752J6979
62470A312595R919L736k841j0896j9978k8748l6381m2655m7256m9930n1104n1506
62458I84955n1211m9753m7091m3735l9971l5768l1397k7261k3099j8295j3259
62447F04115r486p690o717n030k593n19P35J792L171M621N802O844P784P970O634
62432F17433M012J271q65l050o332j0380j3415j4214j3574j3119j3202j2975j2184
$$ plain form
62419 509406 497751 486035 474618 464574 456196 448635 441290 434703 429675 426094 423152 420234 417120
62406 417120 413758 410390 407578 405552 403800 401871 400346 400319 401930 404071 405731 407100 409053 411929 415153
62391 415153 417869 419658 420759 421797 423256 425085 426938 428817 431312 435059 440070 445813 451846 458162
62377 458162 464943 472187 479754 487690 496357 506189 517280 529260 541628 554316 567939 583362 601015
62364 601015 620759 642533 667005 695322 728247 765808 807842 854514 905994 961845 1021073
62353 1021073 1082529 1144672 1204878 1259669 1306131 1343045 1370503 1388787 1398045 1398722 1391699 1377818
62341 1377818 1357565 1331335 1299763 1263695 1224066 1181956 1138699 1095747 1054397 1015563 979776
62330 979776 947439 919101 895319 876089 860531 847291 835163 823176 810364 796016 780191
$$ packed form
62419E09406j1655j1716j1417j0044q378p561p345o587n028l581k942k918l114
62406D17120l362l368k812k026j752j929j525k7J611K141J660J369J953K876L224
62391D15153K716J789J101J038J459J829J853J879K495L747N011N743O033O316
62377D58162O781P244P567P936Q667R832J1091J1980J2368J2688J3623J5423J7653
62364F01015J9744K1774K4472K8317L2925L7561M2034M6672N1480N5851N9228
62353A021073O1456O2143O0206N4791M6462L6914K7458J8284R258O77p023j3881
62341A377818k0253k6230l1572l6068l9629m2110m3257m2952m1350l8834l5787
62330I79776l2337k8338k3782j9230j5558j3240j2128j1987j2812j4348j5825
$$ plain form
62319 780191 763516 746218 727717 707426 685687 663539 641741 620414 599607 579820 561795
62308 561795 546020 532552 521163 511503 503216 496051 489899 484663 480128 476024 472234 468847 465967
62295 465967 463534 461461 459960 459529 460471 462521 465133 468035 471296 474893 478623 482547 487150 492782 499127
62280 499127 505565 511866 518217 524689 531125 537587 544501 552192 560599 569643 579602 590889 603635 617811
62266 617811 633722 652076 673511 698196 725990 757002 791985 832140 878389 930784 988650
62255 988650 1051263 1118131 1188396 1260188 1330785 1397408 1457721 1509775 1551916 1583015 1602718
62244 1602718 1611442 1610173 1600080 1581949 1555763 1520965 1477248 1425159 1366098 1302058 1235429 1168645
62232 1168645 1103588 1041269 982235 927225 877205 832740 793530 758698 727528 699868 675903
$$ packed form
62319G80191j6675j7298j8501k0291k1739k2148k1798k1327k0807j9787j8025
62308E61795j5775j3468j1389r660q287p165o152n236m535m104l790l387k880
62295D65967k433k073j501m31R42K050K612K902L261L597L730L924M603N632O345
62280D99127O438O301O351O472O436O462O914P691Q407R044R959J1287J2746J4176
62266F17811J5911J8354K1435K4685K7794L1012L4983M0155M6249N2395N7866
62255I88650O2613O6868P0265P1792P0597O6623O0313N2054M2141L1099J9703
62244A602718Q724j269j0093j8131k6186l4798m3717n2089n9061o4040o6629o6784
62232A168645o5057o2319n9034n5010n0020m4465l9210l4832l1170k7660k3965
$$ plain form
62221 675903 655626 638584 624082 611524 600451 590446 581236 572926 565837 559970 554831 549945 545363
62208 545363 541428 538162 535255 532597 530520 529416 529397 530393 532319 534934 537757 540420 543082 546341 550726
62193 550726 556319 562781 569675 576819 584418 592768 601806 611122 620496 630224 640730 651991 663579
62180 663579 675067 686042 695838 703835 710210 716104 722745 730615 739658 750089 762706 778502 798216
62167 798216 822198 850519 883210 920481 962429 1008181 1055404 1101024 1142481 1178168 1206963
62156 1206963 1228046 1241372 1247835 1248520 1243948 1234213 1219497 1200083 1176071 1147529 1114933 1079269
62144 1079269 1041857 1004307 968415 935648 906670 881595 860544 843558 830115 819310 810671
62133 810671 804394 800573 798577 797363 796089 794257 791611 788223 784496 780889 777898 776382 777428 781395
$$ packed form
62221F75903k0277j7042j4502j2558j1073j0005r210q310p089n867n139m886m582
62208E45363l935l266k907k658k077j104j9R96J926K615K823K663K662L259M385
62193E50726N593O462O894P144P599Q350R038R316R374R728J0506J1261J1588
62180F63579J1488J0975R796P997O375N894O641P870R043J0431J2617J5796J9714
62167G98216K3982K8321L2691L7271M1948M5752M7223M5620M1457L5687K8795
62156A206963K1083J3326O463O85m572r735j4716j9414k4012k8542l2596l5664
62144A079269l7412l7550l5892l2767k8978k5075k1051j6986j3443j0805q639
62133H10671o277l821j996j214j274j832k646l388l727l607k991j516J046L967
$$ plain form
62119 781395 787328 793665 799289 803524 805474 804235 799971 794212 788725 784246 780390 776373 771476 764996
62105 764996 756248 744883 731241 716387 701733 688487 677252 667965 660180 653559 648346 645333 645038
62092 645038 646852 649408 652026 655383 660320 666397 672285 677445 682688 688934 696086 703490 711065 719552
62078 719552 729846 742380 756962 773015 790080 808270 828038 849393 871608 893897 916230
62067 916230 939310 963984 990838 1020107 1051598 1084697 1118496 1151823 1183134 1210699 1233164
62056 1233164 1249814 1260284 1264394 1262424 1255156 1243334 1227307 1207442 1184361 1158269 1128466 1094260
62044 1094260 1056284 1016264 975542 934470 893303 852882 814157 777645 743739 712953 685358
62033 685358 660180 636533 614373 594218 576196 559926 545256 532421 521283 510998 500770
$$ packed form
62119G81395N933O337N624M235J950j239m264n759n487m479l856m017m897o480
62105G64996q748j1365j3642j4854j4654j3246j1235r287p785o621n213l013k95
62092F45038J814K556K618L357M937O077N888N160N243O246P152P404P575Q487
62078G19552J0294J2534J4582J6053J7065J8190J9768K1355K2215K2289K2333
62067I16230K3080K4674K6854K9269L1491L3099L3799L3327L1311K7565K2465
62056A233164J6650J0470M110j970p268j1822j6027j9865k3081k6092k9803l4206
62044A094260l7976m0020m0722m1072m1167m0421l8725l6512l3906l0786k7595
62033F85358k5178k3647k2160k0155j8022j6270j4670j2835j1138j0285j0228
$$ plain form
62022 500770 490631 481208 472956 465913 459884 454403 448631 441820 434097 426479 419920 414571 410117 406558
62008 406558 404284 403469 403756 404689 406257 408830 412652 417492 422820 428278 433895 439787 445684 450961 455171
61993 455171 458303 460382 461149 460457 458722 456484 453674 449881 445334 440883 436812 432280 426392 419349 412100
61978 412100 405285 399081 393763 389683 386670 384014 381129 377938 374711 371917 370162 369702 369936 369858 369229
61963 369229 368900 369734 371469 372894 372994 371796 370226 369239 369031 369075 369042 369518 371485 375123 379460 383305 386305
61946 386305 389046 392441 397105 403044 409825 417256 425852 436279 448325 460808 472638 483629 494122
61933 494122 504266 513960 523167 531899 540018 547289 553527 558554 562225 564595 565819 565745 563975 560538
61919 560538 556189 551783 547619 543650 540038 537210 535668 536033 538918 544331 551483 559641 568906 579681
$$ packed form
62022E00770j0139r423q252p043o029n481n772o811p723p618o559n349m454l559
62008D06558k274q15K87R33J568K573L822M840N328N458N617N892N897N277M210
61993D55171L132K079P67o92j735k238k810l793m547m451m071m532n888p043p249
61978D12100o815o204n318m080l013k656k885l191l227k794j755m60K34p8o29
61963C69229l29Q34J735J425J00j198j570r87k08M4l3M76J967L638M337L845L000
61946C86305K741L395M664N939O781P431Q596J0427J2046J2483J1830J0991J0493
61933D94122J0144R694R207Q732Q119P271O238N027L671K370J224p4j770l437
61919E60538m349m406m164l969l612k828j542L65K885N413P152Q158R265J0775
$$ plain form
61905 579681 591630 603768 615335 625905 634746 640908 644150 645150 644531 642213 637981 632092 624911
61892 624911 616391 606499 595919 585802 576801 568677 560849 553094 545712 539260 534089 529954 525968 521066
61878 521066 514602 506626 497748 488826 480632 473590 467744 462925 458863 455217 451753 448668 446567 445922
61864 445922 446600 448058 449965 452456 455832 460217 465646 472399 481037 491964 504979 519360 534443
61851 534443 550025 566242 583308 601450 620845 641218 661592 680784 698154 713634 727059
61840 727059 737850 745426 749555 750128 747029 740595 731920 722360 712814 703772 695851 689891 686504 685875
61826 685875 687989 692728 699668 708080 717318 727017 736749 745618 752374 755903 755559 751159 742837 730971
61812 730971 716216 699501 681793 663755 645674 627878 611078 596027 582791 570628 558798
$$ packed form
61905E79681J1949J2138J1567J0570Q841O162L242J000o19k318m232n889p181
61892F24911q520r892j0580j0117r001q124p828p755p382o452n171m135l986m902
61878E21066o464p976q878q922q194p042n846m819m062l646l464l085k101o45
61864D45922O78J458J907K491L376M385N429O753Q638J0927J3015J4381J5083
61851E34443J5582J6217J7066J8142J9395K0373K0374J9192J7370J5480J3425
61840G27059J0791P576M129N73l099o434q675r560r546r042p921n960l387o29
61826F85875K114M739O940Q412R238R699R732Q869O756L529l44m400q322j1866
61812G30971j4755j6715j7708j8038j8081j7796j6800j5051j3236j2163j1830
$$ plain form
61801 558798 547330 536833 527724 519826 512577 505418 498092 490900 484595 479696 475797 471920 467678 463700
61787 463700 460641 458137 455268 451887 448842 446763 445172 443088 440129 436667 433223 430128 427653 425965
61773 425965 424914 424145 423501 423079 422927 422904 422918 423046 423400 424081 425273 427171 429718 432641 435765 439078 442477
61756 442477 445779 449063 452630 456439 459887 462411 464040 465060 465376 464584 462523 459416 455585 451386 447347
61741 447347 443898 440910 437857 434563 431460 429008 427163 425649 424509 424088 424569 425743 427204 428648 429996
61726 429996 431313 432614 433754 434621 435416 436482 437761 438715 439007 439113 439893 441657 443949 446244 448426 450392
61710 450392 451575 451280 449448 446791 444082 441538 438931 435995 432513 428275 423332 418327 414129 410951
61696 410951 408059 404626 400657 396769 393225 389655 385753 381715 377745 373640 369319 365400 362577 360545
$$ packed form
61801E58798j1468j0497r109p898p249p159p326p192o305m899l899l877m242l978
61787D63700l059k504k869l381l045k079j591k084k959l462l444l095k475j688
61773D25965j051p69o44m22j52k3J4J28L54O81J192J898K547K923L124L313L399
61756D42477L302L284L567L809L448K524J629J020L16p92k061l107l831m199m039
61741D47347l449k988l053l294l103k452j845j514j140m21M81J174J461J444J348
61726D29996J317J301J140Q67P95J066J279R54K92J06P80J764K292K295K182J966
61710D50392J183k95j832k657k709k544k607k936l482m238m943n005m198l178
61696D10951k892l433l969l888l544l570l902m038l970m105m321l919k823k032
$$ plain form
61682 360545 358288 355553 353334 352461 352287 351481 349801 348319 347865 347974 347665 346675 345450 344309 343243 342468
61666 342468 342544 343657 345116 345948 345995 346091 347018 348490 349490 349636 349859 351462 354706 358650 362219 364975 366833
61649 366833 367659 367484 366760 365984 365304 364813 364947 366148 368278 370745 373076 374989 376101 376207 375783 375624 375888
61632 375888 376058 375899 375775 375739 375110 373456 371426 369906 368733 366984 364324 361375 358838 356946 355807 355545
61616 355545 355860 356029 355648 354942 354096 352741 350510 347722 345023 342537 339793 336432 332560 328401 324027
61601 324027 319568 315377 311777 308750 305995 303162 300023 296560 293100 290204 288190 286771 285356 283722
61587 283722 282205 281157 280441 279645 278643 277703 277092 276814 276694 276485 275961 275219 274913 275750 277561 279201 279684
61570 279684 279133 278328 277676 277103 276772 277217 278577 280195 281303 281846 282374 283250 284272 285101 285887 287288 289740
$$ packed form
61682C60545k257k735k219q73j74q06j680j482m54J09l09r90j225j141j066p75
61666C42468P6J113J459Q32M7R6R27J472J000J46K23J603L244L944L569K756J858
61649C66833Q26j75p24p76o80m91J34J201K130K467K331J913J112J06m24j59K64
61632C75888J70j59j24l6o29j654k030j520j173j749k660k949k537j892j139k62
61616C55545L15J69l81p06q46j355k231k788k699k486k744l361l872m159m374
61601C24027m459m191l600l027k755k833l139l463l460k896k014j419j415j634
61587B83722j517j048p16p96j002r40o11k78j20k09n24p42l06Q37J811J640M83
61570B79684n51q05o52n73l31M45J360J618J108N43N28Q76J022Q29P86J401K452
$$ plain form
61553 289740 292792 295384 296886 297586 298023 298255 298176 298222 298997 300218 300707 299776 298164 297300 297920 299655 301628
61536 301628 303127 303942 304352 304755 305234 305687 306293 307386 308667 309171 308383 306970 305927 305360 304645 303518 302353
61519 302353 301486 300802 300044 299052 297696 296033 294522 293629 293210 292729 292089 291781 292171 293133 294478 296176 297857
61502 297857 298680 298170 296920 296033 296056 296795 297950 299443 301069 302221 302248 301098 299510 298434 298200 298336 298357
61485 298357 298500 299311 300635 301573 301659 301556 302280 304090 306474 308878 311021 312722 313913 314717 315152 314949 314076
61468 314076 313275 313424 314373 315007 314646 313864 313621 314049 314515 314576 314432 314530 315155 316360 317979 319596 320745 321258
61450 321258 321346 321351 321540 322068 322961 324091 325355 326908 328983 331360 333214 333783 333201 332501 332780 334425 337021
61433 337021 339699 341532 341980 341314 340517 340449 341069 341605 341448 340689 339801 339127 338823 339015 339703 340583 341204 341383
$$ packed form
61553B89740L052K592J502P00M37K32p9M6P75J221M89r31j612q64O20J735J973
61536C01628J499Q15M10M03M79M53O06J093J281N04p88j413j043n67p15j127j165
61519C02353q67o84p58r92j356j663j511q93m19m81o40l08L90R62J345J698J681
61502B97857Q23n10j250q87K3P39J155J493J626J152K7j150j588j076k34J36K1
61485B98357J43Q11J324R38Q6j03P24J810K384K404K143J701J191Q04M35k03q73
61468C14076q01J49R49O34l61p82k43M28M66O1j44R8O25J205J619J617J149N13
61450C21258Q8NJ89N28Q93J130J264J553K075K377J854N69n82p00K79J645K596
61433C37021K678J833M48o66p97o8O20N36j57p59q88o74l04J92O88Q80O21J79
$$ plain form
61415 341383 341397 341763 342849 344545 346224 347129 346950 346049 345020 344074 342939 341313 339314 337510 336561 336737
61399 336737 337658 338503 338617 337938 336911 336092 335901 336467 337456 338179 338150 337612 337259 337480 338103 338899 339969 341455
61381 341455 343160 344775 346327 348034 349769 351059 351785 352562 354121 356428 358776 360743 362686 365122 367889
61366 367889 370252 371673 372170 372002 371412 370727 370339 370395 370797 371626 373246 375762 378797 382129 386302 392095
61350 392095 399534 407818 416114 423972 431021 436843 441304 444642 447116 448920 450489 452396 454779 457302
61336 457302 459859 462809 466170 469096 470709 471198 471538 472255 472953 472939 471820 469547 466486 463527 461595 460843
61320 460843 460695 460865 461879 464319 467907 471828 475719 479936 484949 490974 498210 506985 517406 529111
61306 529111 541637 554928 569260 584672 600642 616253 630509 642505 651540 657340 660156 660548
$$ packed form
61415C41383J4L66J086J696J679R05j79r01j029r46j135j626j999j804r49J76
61399C36737R21Q45J14o79j027q19j91N66R89P23k9n38l53K21O23P96J070J486
61381C41455J705J615J552J707J735J290P26P77J559K307K348J967J943K436K767
61366C67889K363J421M97j68n90o85l88N6M02Q29J620K516L035L332M173N793
61350C92095P439Q284Q296P858P049N822M461L338K474J804J569J907K383K523
61336D57302K557K950L361K926J613M89L40P17O98j4j119k273l061k959j932p52
61320D60843j48J70J014K440L588L921L891M217N013O025P236Q775J0421J1705
61306E29111J2526J3291J4332J5412J5970J5611J4256J1996R035N800K816L92
$$ plain form
61294 660548 658968 655502 649889 641829 631479 619729 607792 596285 584834 572896 560867 549988
61282 549988 541076 533769 527256 521400 516738 513571 511533 510141 509413 509778 511521 514435 517911 521266 524009
61267 524009 525873 526723 526627 526064 525824 526484 528121 530688 534386 539336 545003 550430 555050 558917 562131 564562
61251 564562 566294 567831 569478 570845 571453 571616 572163 573338 574414 574605 573980 573261 572968 573025 573090 572937 572487
61234 572487 571703 570648 569591 568938 569022 570054 572248 575801 580692 586572 593025 599899 607270 615132 623243
61219 623243 631280 639062 646699 654639 663418 673108 683078 692559 701437 710105 718526 725865 731309 734902
61205 734902 737307 739082 740585 742336 744977 748833 753843 759877 766872 774785 783800 794546 807593 822493
61191 822493 837587 850949 861356 868402 872164 873128 872168 870148 867421 863900 859595 854889 850238 845657
$$ packed form
61294F60548j580l466n613q060j0350j1750j1937j1507j1451j1938j2029j0879
61282E49988q912p307o513n856m662l167k038j392p28L65J743K914L476L355K743
61267E24009J864Q50r6n63k40O60J637K567L698M950N667N427M620L867L214K431
61251E64562J732J537J647J367O08J63N47J175J076J91o25p19k93N7O5j53m50
61234E72487p84j055j057o53Q4J032K194L553M891N880O453O874P371P862Q111
61219F23243Q037P782P637P940Q779R690R970R481Q878Q668Q421P339N444L593
61205G34902K405J775J503J751K641L856N010O034O995P913R015J0746J3047J4900
61191H22493J5094J3362J0407P046L762R64r60k020k727l521m305m706m651m581
$$ plain form
61177 845657 840607 834428 826966 818747 810506 802546 794633 786385 777619 768362 758778 749073 739257 728953
61163 728953 717674 705375 692525 679599 666791 654318 642646 632128 622640 613892 605971 599288
61151 599288 594078 590255 587727 586540 586648 587645 588706 588704 586563 581933 575585 568894 562802 557404 552487
61136 552487 548129 544603 542016 540354 539820 540820 543582 547920 553464 559964 567324 575483 584522 594843
61122 594843 607041 621357 637443 654864 673741 694543 717229 740968 764965 789231 814212
61111 814212 839891 865664 890943 915430 938811 960716 981136 1000429 1018599 1034836 1048049
61100 1048049 1057703 1063887 1066816 1066589 1063331 1057156 1047948 1035508 1020054 1002351 983194 962908 941528
61087 941528 919335 896994 875140 854072 833907 814884 797292 781176 766256 752193 738859
$$ packed form
61177H45657n050o179p462q219q241p960p913q248q766r257r584r705r816j0304
61163G28953j1279j2299j2850j2926j2808j2473j1672j0518r488q748p921o683
61151E99288n210l823k528j187J08R97J061kk141m630o348o691o092n398m917
61136E52487m358l526k587j662n34J000K762M338N544O500P360Q159R039J0321
61122E94843J2198J4316J6086J7421J8877K0802K2686K3739K3997K4266K4981
61111H14212K5679K5773K5279K4487K3381K1905K0420J9293J8170J6237J3213
61100A048049R654O184K929k27l258o175r208j2440j5454j7703j9157k0286k1380
61087I41528k2193k2341k1854k1068k0165j9023j7592j6116j4920j4063j3334
$$ plain form
61076 738859 726413 715256 705896 698577 692971 688441 684744 682261 681325 681604 682485 683902 686367 690177
61062 690177 695019 700532 706866 714450 723386 733362 744106 755717 768551 782833 798390 814735 831509
61049 831509 848925 867722 888602 911703 936604 962839 990397 1019690 1050960 1083820 1117631
61038 1117631 1152392 1188952 1228198 1270352 1315295 1363146 1414058 1467755 1523829 1582207 1642651
61027 1642651 1704066 1765247 1826421 1889318 1955657 2026527 2103444 2188784 2284307 2389855 2504191
61016 2504191 2626700 2758056 2900422 3058191 3238162 3448314 3697117 3994824 4354648
61007 4354648 4791989 5324328 5974397 6773580 7761727 8985974 10499484 12346312 14516046
60998 14516046 16884463 19196246 21134817 22453479 23081036 23134474 22850880 22501394 22324768
$$ packed form
61076G38859j2446j1157r360p319n606m530l697k483r36K79Q81J417K465L810
61062F90177M842N513O334P584Q936R976J0744J1611J2834J4282J5557J6345J6774
61049H31509J7416J8797K0880K3101K4901K6235K7558K9293L1270L2860L3811
61038A117631L4761L6560L9246M2154M4943M7851N0912N3697N6074N8378O0444
61027A642651O1415O1181O1174O2897O6339P0870P6917Q5340R5523J05548J14336
61016B504191J22509J31356J42366J57769J79971K10152K48803K97707L59824
61007D354648M37341N32339O50069P99183R88147J224247J513510J846828K169734
60998A4516046K368417K311783J938571J318662O27557N3438k83594l49486j76626
$$ plain form
60989 22324768 22469134 22931580 23530233 23957355 23907313 23205589 21861612 20030953 17932852
60980 17932852 15776179 13717068 11846753 10201237 8782094 7575433 6561175 5715608
60972 5715608 5013885 4433305 3954152 3558275 3228761 2951352 2714992 2510830 2331726
60963 2331726 2172891 2031705 1906102 1793589 1692091 1600931 1520208 1449457 1387384 1332633
60953 1332633 1284229 1241151 1201800 1164167 1126747 1089375 1053078 1018947 987173 957302 929150
60942 929150 903097 879531 858390 839302 821859 805583 789842 773968 757460 740177 722539
60931 722539 705404 689422 674419 659692 645046 631333 619755 610705 603373 596424 588957 580905
60919 580905 572762 565160 558662 553607 549831 546641 543428 540311 537876 536299 535183 534331 534090 534654 535582
$$ packed form
60989B2324768J44366M62446N98653M27122n0042p01724j343977j830659k098101
60980A7932852k156673k059111j870315j645516j419143j206661j014258q45567
60972E715608p01723n80580m79153l95877l29514k77409k36360k04162j79104
60963B331726j58835j41186j25603j12513j01498r1160q0723p0751o2073n4751
60953A332633m8404m3078l9351l7633l7420l7372l6297l4131l1774k9871k8152
60942I29150k6053k3566k1141j9088j7443j6276j5741j5874j6508j7283j7638
60931G22539j7135j5982j5003j4727j4646j3713j1578r050p332o949p467q052
60919E80905q143p602o498n055l776l190l213l117k435j577j116q52k41N64R28
$$ plain form
60904 535582 536499 537807 540084 543032 545734 547847 549840 551974 553693 554294 553784 552763 551628 550127 547650
60889 547650 543930 539480 535168 531264 527114 521947 515739 508942 501703 493898 485716 477631 469802 462016
60875 462016 454227 446700 439667 433323 428119 424486 422207 420512 418852 417124 415251 413249 411739 411596
60861 411596 412822 414426 415705 416996 418837 421078 423291 425479 427810 430123 432234 434366 436734 439098
60847 439098 441187 443182 445246 446995 448084 448945 450173 451431 451779 451032 449903 448681 446617 443040 438459
60832 438459 434052 430396 427248 424324 421782 419857 418392 416970 415406 413949 412958 412495 412306 412118 411826
60817 411826 411408 410858 410148 409033 406897 403188 398166 392923 388393 384569 380860 376982 373209 369913 367163
60802 367163 364673 361941 358586 354741 350937 347460 344112 340866 338364 337276 337303 337322 336548 335188 333958
$$ packed form
60904E35582R17J308K277K948K702K113J993K134J719O01n10j021j135j501k477
60889E47650l720m450m312l904m150n167o208o797p239p805q182q085p829p786
60875D62016p789p527p033o344n204l633k279j695j660j728j873k002j510j43
60861D11596J226J604J279J291J841K241K213K188K331K313K111K132K368K364
60847D39098K089J995K064J749J089Q61J228J258L48p47j129j222k064l577m581
60832D38459m407l656l148k924k542j925j465j422j564j457r91m63j89j88k92
60817D11826m18n50p10j115k136l709n022n243m530l824l709l878l773l296k750
60802C67163k490k732l355l845l804l477l348l246k502j088K7J9p74j360j230
$$ plain form
60787 333958 333294 333107 333047 332889 332803 333240 334398 335904 337221 338268 339406 340918 342691 344402 345850 347210
60771 347210 349107 352176 356286 360480 364011 367172 370666 374413 377572 379615 380713 381055 380566 379569 379043
60756 379043 379615 380549 380270 377904 374079 370266 367588 366242 365820 365916 366335 366859 367162 367056 366638 365985 364879
60739 364879 363053 360473 357249 353452 349326 345317 341516 337343 332354 327163 322932 320014 317719 315434
60725 315434 313269 311458 309862 308364 307223 306632 306345 306084 305928 305965 305936 305613 305216 305094 305262 305623 306400 307896
60707 307896 309947 311993 313717 315353 317365 319955 322873 325677 328191 330598 332913 334615 335322 335741 337233
60692 337233 340234 343711 346484 348473 350210 351851 353373 355208 357782 360577 362496 363181 363304 363557 364062
60677 364062 364885 366459 369035 372125 374815 376424 376744 375955 374538 373019 371571 369939 367851 365321 362487
$$ packed form
60787C33958o64j87o0j58q6M37J158J506J317J047J138J512J773J711J448J360
60771C47210J897L069M110M194L531L161L494L747L159K043J098L42m89r97n26
60756C79043N72R34k79k366l825l813k678j346m22R6M19N24L03j06m18o53j106
60739C64879j826k580l224l797m126m009l801m173m989n191m231k918k295k285
60725C15434k165j811j596j498j141n91k87k61j56L7k9l23l97j22J68L61P77J496
60707C07896K051K046J724J636K012K590K918K804K514K407K315J702P07M19J492
60692C37233L001L477K773J989J737J641J522J835K574K795J919O85J23K53N05
60677C64062Q23J574K576L090K690J609L20p89j417j519j448j632k088k530k834
$$ plain form
60662 362487 359330 355735 351746 347680 344059 341368 339748 338912 338459 338246 338345 338822 339772 341472 344140 347576
60646 347576 351294 354967 358427 361339 363301 364268 364412 363489 360900 356642 351768 347493 344161 341442 339193
60631 339193 337589 336544 335612 334658 334204 334830 336366 337865 338379 337736 336654 336147 336734 338117 339556 340496
60615 340496 340818 340658 340212 339740 339585 339980 340786 341527 341809 341740 341827 342383 343197 343938 344734 345964 347529 348758
60597 348758 349322 349902 351539 354445 357811 360703 362806 364305 365446 366362 366989 367017 366185 364844 363926 364032
60581 364032 364785 365421 365889 366901 368911 371570 374399 377580 381686 386848 392679 399046 406466 415561 426378
60566 426378 438484 451471 464943 477999 489131 496963 501005 501587 499197 494187 487098 478894 470677
60553 470677 463256 457144 452740 450298 449731 450646 452606 455292 458527 462314 466835 472291 478810 486606 496075
$$ packed form
60662C62487l157l595l989m066l621k691j620q36m53k13R9M77R50J700K668L436
60646C47576L718L673L460K912J962R67J44r23k589m258m874m275l332k719k249
60631C39193j604j045r32r54m54O26J536J499N14o43j082n07N87J383J439R40
60615C40496L22j60m46m72j55L95Q06P41K82o9Q7N56Q14P41P96J230J565J229
60597C48758N64N80J637K906L366K892K103J499J141R16O27K8q32j341r18J06
60581C64032P53O36M68J012K010K659K829L181M106N162N831O367P420R095J0817
60566D26378J2106J2987J3472J3056J1132P832M042N82k390n010p089q204q217
60553D70677p421o112m404k442n67R15J960K686L235L787M521N456O519P796R469
$$ plain form
60538 496075 507451 520536 535077 551256 569243 588200 606265 621782 634127 643198 648726 650552
60526 650552 649116 645075 638719 630351 620938 611652 602823 594011 585184 577197 570912 566409 563267 561125
60512 561125 559732 558887 558590 558939 559747 560750 562446 566235 573356 584054 598139 615916 638001 664454
60498 664454 694641 727855 763684 801813 841786 882870 923778 962685 997885 1028495 1054296
60487 1054296 1075042 1090338 1100102 1104699 1104407 1098908 1087308 1068480 1041645 1007007 966029 920888
60475 920888 873672 826110 779793 736092 695789 659078 626037 596852 571578 549899 531246
60464 531246 514995 500640 487950 476936 467423 458772 450329 442132 434869 429107 424771 421259 417754
60451 417754 413520 408439 403324 399258 396510 394472 392662 391203 390129 388911 387193 385479 384513 384261 384126
$$ packed form
60538D96075J1376J3085J4541J6179J7987J8957J8065J5517J2345R071N528J826
60526F50552j436m041o356q368r413r286q829q812q827p987o285m503l142k142
60512E61125j393q45k97L49Q08J003J696L789P121J0698J4085J7777K2085K6453
60498F64454L0187L3214L5829L8129L9973M1084M0908L8907L5200L0610K5801
60487A054296K0746J5296R764M597k92n499j1600j8828k6835l4638m0978m5141
60475I20888m7216m7562m6317m3701m0303l6711l3041k9185k5274k1679j8653
60464E31246j6251j4355j2690j1014r513q651q443q197p263n762m336l512l505
60451D17754m234n081n115m066k748k038j810j459j074j218j718j714r66k52j35
$$ plain form
60436 384126 383941 384047 384461 384627 384143 383180 381918 380128 377651 374955 372771 371360 370548 370354 371090 372799
60420 372799 375010 377238 379427 381597 383337 384085 383973 383924 384668 385878 386649 386693 386648 387127 387872 388190 388010 388069
60402 388069 388962 390378 391491 391947 392230 393111 394926 397410 400076 402704 405544 409024 413109 416986 419703
60387 419703 421249 422685 424949 427749 430056 431541 432947 434980 437396 439565 441482 443678 446283 448730
60373 448730 450469 451582 452515 453470 454336 455078 455929 457134 458640 460165 461567 463001 464645 466434 468273
60358 468273 470487 473722 478302 483926 490192 497176 505253 514467 524338 534186 543426 551561 558101 562517
60344 562517 564267 563022 559014 553036 545940 538274 530427 522784 515533 508658 502471 497717 494643 492248
60330 492248 489100 484843 480296 476184 472478 469012 465923 463182 460416 457620 455473 454464 454179 454060 454504
$$ packed form
60436C84126j85J06M14J66m84r63j262j790k477k696k184j411q12j94P36J709
60420C72799K211K228K189K170J740P48j12m9P44J210P71M4m5M79P45L18j80N9
60402C88069Q93J416J113M56K83Q81J815K484K666K628K840L480M085L877K717
60387D19703J546J436K264K800K307J485J406K033K416K169J917K196K605K447
60373D48730J739J113R33R55Q66P42Q51J205J506J525J402J434J644J789J839
60358D68273K214L235M580N624O266O984Q077R214R871R848R240Q135O540M416
60344E62517J750j245m008n978p096p666p847p643p251o875o187m754l074k395
60330D92248l148m257m547m112l706l466l089k741k766k796k147j009k85j19M44
$$ plain form
60315 454504 456612 461052 467663 475999 485633 496058 506938 518654 532083 547616 564756 582769
60303 582769 601216 619382 635557 647511 653897 654879 651264 643328 630834 614048 594349 573687
60291 573687 553708 535468 519618 506499 496186 488660 483840 481176 479526 477900 476202 474772 473378
60278 473378 471357 468713 466242 464280 462106 459088 455725 452857 450356 447409 443818 440170 436878 433857
60264 433857 431165 429162 427799 426466 424845 423373 422492 421925 421083 419845 418510 417283 416261 415766 416221
60249 416221 417635 419486 421152 422298 422938 423404 424205 425604 427235 428328 428461 427982 427625 427833 428572 429660
60233 429660 431114 433089 435608 438428 441146 443416 445118 446403 447534 448672 449864 451230 453011 455302
60219 455302 457864 460500 463563 467757 473326 479711 486186 492595 499211 506116 513059 519836 526451 532834
$$ packed form
60315D54504K108M440O611Q336R634J0425J0880J1716J3429J5533J7140J8013
60303E82769J8447J8166J6175J1954O386R82l615p936j2494j6786j9699k0662
60291E73687j9979j8240j5850j3119j0313p526m820k664j650j626j698j430j394
60278D73378k021k644k471j962k174l018l363k868k501k947l591l648l292l021
60264D33857k692k003j363j333j621j472q81n67q42j238j335j227j022m95M55
60249D16221J414J851J666J146O40M66Q01J399J631J093J33m79l57K08P39J088
60233D29660J454J975K519K820K718K270J702J285J131J138J192J366J781K291
60219D55302K562K636L063M194N569O385O475O409O616O905O943O777O615O383
$$ plain form
60205 532834 538769 544279 549876 556194 563372 570860 577855 583955 589447 594976 600856 606640 611346 614105
60191 614105 614743 613902 612604 611477 610279 608268 605083 601046 596560 591577 585953 580039 574501 569611 565113
60176 565113 560758 556607 552725 548879 544730 540201 535600 531473 528243 525809 523559 520995 518228 515624
60162 515624 513201 510803 508770 507802 507979 508493 508651 508702 509298 510454 511510 511884 511523 510766 510160 510258 511228 512730
60144 512730 514452 516593 519410 522457 524823 526242 527554 529951 534059 539771 546528 553548 560173 566342
60130 566342 572501 578790 584527 588836 591675 593932 596561 599822 603307 606421 608862 610860 612953 615358
60116 615358 617698 619584 621333 623638 626504 629089 630834 632193 633736 634958 634751 632960 630672 628738
60102 628738 626656 623393 618864 614003 609616 605739 602130 598847 596119 594061 592724 592195 592370 592776 592853
$$ packed form
60205E32834N935N510N597O318P178P488O995O100N492N529N880N784M706K759
60191F14105O38q41j298j127j198k011l185m037m486m983n624n914n538m890m498
60176E65113m355m151l882l846m149m529m601m127l230k434k250k564k767k604
60162E15624k423k398k033r68J77N14J58N1N96J156J056L74l61p57o06R8R70J502
60144E12730J722K141K817L047K366J419J312K397M108N712O757P020O625O169
60130E66342O159O289N737M309K839K257K629L261L485L114K441J998K093K405
60116F15358K340J886J749K305K866K585J745J359J543J222k07j791k288j934
60102F28738k082l263m529m861m387l877l609l283k728k058j337n29J75M06P7
$$ plain form
60087 592853 592441 591850 591484 591460 591522 591247 590358 588912 587236 585725 584676 584166 583837 582904 580672 577163 573009
60070 573009 568611 563642 557563 550364 542555 534598 526675 518963 511764 505303 499655 494858 490879 487397
60056 487397 483936 480323 476842 473852 471516 470002 469552 470088 471029 471905 473040 475226 478795 483335 488277
60041 488277 493407 498735 504272 510076 516188 522298 527743 532053 535352 538029 540203 541656 542085 541218 538930
60026 538930 535547 531895 528708 525996 523182 519728 515376 509910 503172 495371 487093 478829 470709 462793
60012 462793 455386 448914 443528 438940 434677 430576 427039 424605 423204 422155 421080 420403 420552 421057 421124
59997 421124 420842 420997 421686 422086 421852 421814 422799 424563 426579 429191 433090 438043 443001 447286 450881 453756
59981 453756 455794 457376 459161 461084 462232 461961 460523 458435 455927 453279 451042 449452 448099 446594
$$ packed form
60087E92853m12n91l66k4O2k75q89j446j676j511j049n10l29r33k232l509m154
60070E73009m398m969o079p199p809p957p923p712p199o461n648m797l979l482
60056D87397l461l613l481k990k336j514m50N36R41Q76J135K186L569M540M942
60041D88277N130N328N537N804O112O110N445M310L299K677K174J453M29q67k288
60026E38930l383l652l187k712k814l454m352n466o738p801q278q264q120p916
60012D62793p407o472n386m588m263m101l537k434j401j049j075o77J49N05O7
59997D21124k82J55O89M00k34l8R85J764K016K612L899M953M958M285L595K875
59981D53756K038J582J785J923J148k71j438k088k508k648k237j590j353j505
$$ plain form
59967 446594 445153 444074 443099 441865 440687 440292 440895 442022 443226 444525 446119 448024 450026 451721 452632
59952 452632 452549 451772 450787 449772 448650 447546 446815 446609 446749 447109 447821 448900 449904 450175 449372 447718 445809
59935 445809 444242 443270 442753 442461 442446 442935 443964 445284 446709 448317 450332 453045 456938 462516 469696 477509
59919 477509 484642 490233 494043 496166 496978 497221 497608 498170 498349 497923 497589 498406 500855 504660 509281 514248
59903 514248 519114 523442 526997 529791 531917 533430 534356 534761 534894 535390 537067 540131 543717 546664 548854
59888 548854 551343 555057 559816 564888 569987 575215 580302 584566 587649 589873 591809 593865 596315 599254
59874 599254 602357 604928 606394 606567 605451 603143 600082 596959 594084 591056 587474 583801 581052 579621
59860 579621 578794 577560 575676 573776 572648 572661 573804 576132 580125 586530 595668 606717 617857 627350
$$ packed form
59967D46594j441j079r75j234j178l95O03J127J204J299J594J905K002J695R11
59952D52632q3p77r85j015j122j104p31k06J40L60P12J079J004K71q03j654j909
59935D45809j567r72n17k92j5M89J029J320J425J608K015K713L893N578P180P813
59919D77509P133N591L810K123Q12K43L87N62J79m26l34Q17K449L805M621M967
59903E14248M866M328L555K794K126J513R26M05J33M96J677L064L586K947K190
59888E48854K489L714M759N072N099N228N087M264L083K224J936K056K450K939
59874E99254L103K571J466J73j116k308l061l123k875l028l582l673k749j431
59860E79621q27j234j884j900j128J3J143K328L993O405R138J1049J1140R493
$$ plain form
59846 627350 634448 639174 641520 641383 639296 636632 634690 633860 633845 634175 634003 631859 626513 618267 608794 599599
59830 599599 591085 583138 575812 569160 563053 557678 553661 551163 549336 547319 545265 543652 542022 539417
59816 539417 535968 532985 531201 529808 527586 524313 520580 516846 513267 510110 507672 505853 504217 502501
59802 502501 500885 499789 499465 499661 499663 498895 497546 496322 495540 494841 493882 492862 492064 491344 490480 489699 489343 489207
59784 489207 488678 487499 486045 484820 483969 483272 482427 481385 480501 480180 480243 479944 478955 478031 478259 479804 481871
59767 481871 483797 485591 487414 489168 490923 493267 496768 501253 505953 510299 514363 518635 523627 529685
59753 529685 536942 545294 554430 563920 573321 582328 590862 598962 606556 613391 619238 624099 628179 631728
59739 631728 634988 638102 640955 643136 644301 644626 644688 644771 644452 643122 640841 638387 636394 634698 632615 629674
$$ packed form
59846F27350P098M726K346j37k087k664j942q30j5L30j72k144n346q246r473r195
59830E99599q514p947p326o652o107n375m017k498j827k017k054j613j630k605
59816E39417l449k983j784j393k222l273l733l734l579l157k438j819j636j716
59802E02501j616j096l24J96Kp68j349j224p82o99r59j020p98p20q64p81l56j36
59784D89207n29j179j454j225q51o97q45j042q84l21O3k99r89r24K28J545K067
59767D81871J926J794J823J754J755K344L501M485M700M346M064M272M992O058
59753E29685P257Q352R136R490R401R007Q534Q100P594O835N847M861M080L549
59739F31728L260L114K853K181J165L25O2Q3l19j330k281k454j993j696k083k941
$$ plain form
59723 629674 625925 621788 617812 614426 611636 609047 606338 603590 600948 598249 595356 592648 590625 589094
59709 589094 587314 585058 582943 581475 580294 578809 577205 576333 576732 578153 580004 581954 584108 586797 590198
59694 590198 594060 597841 601184 604103 606656 608643 609724 609669 608436 606304 604038 602574 602244 602463 602390 601692
59678 601692 600515 599033 597306 595347 592973 589773 585501 580382 574828 569097 563488 558550 554713 551901
59664 551901 549808 548336 547414 546661 545735 544939 545003 546268 548393 550769 552908 554656 556461 559253 563533 568567
59648 568567 572915 575735 577197 577788 577722 576997 575411 572468 567832 562021 556153 550812 545684 540449 535539
59633 535539 531640 528811 526465 524054 521560 519433 518162 517676 517167 515771 513457 510925 508604 506195 503283
59618 503283 499893 496165 491901 486852 481248 475768 471071 467512 465128 463774 463406 464239 466406 469477 472588
$$ packed form
59723F29674l749m137l976l386k790k589k709k748k642k699k893k708k023j531
59709E89094j780k256k115j468j181j485j604q72L99J421J851J950K154K689L401
59694E90198L862L781L343K919K553J987J081n5j233k132k266j464l30K19p3o98
59678F01692j177j482j727j959k374l200m272n119n554n731n609m938l837k812
59664E51901k093j472r22p53r26p96O4J265K125K376K139J748J805K792M280N034
59648E68567M348K820J462N91o6p25j586k943m636n811n868n341n128n235m910
59633E35539l899k829k346k411k494k127j271m86n09j396k314k532k321k409k912
59618E03283l390l728m264n049n604n480m697l559k384j354l68Q33K167L071L111
$$ plain form
59603 472588 475036 476438 476505 475299 473765 473258 474186 475644 476726 477606 478939 480758 482587 484237 485818
59588 485818 487174 487857 487593 486400 484407 481928 479496 477425 475520 473585 471891 470704 469652 468169 466325
59573 466325 464610 463027 461143 459026 457412 456739 456557 456196 455583 455145 455165 455454 455521 454978 453931 453017 452868
59556 452868 453592 454888 456435 457897 458795 458911 458730 459031 460121 461904 464479 468062 472431 477244 482943
59541 482943 490592 500745 513327 528754 547903 570068 591697 608229 617068 618290 613159 603132
59529 603132 590190 576856 565243 556389 550664 548213 548754 551373 554972 558850 562650 565998 568415 569553
59515 569553 569361 567990 565561 562074 557673 552918 548482 544403 539988 534708 528881 523141 517608 512083
59501 512083 506695 501685 496734 491369 486106 482310 480620 480215 480039 479998 480426 481003 481058 480660 480571 481149 481980
$$ packed form
59603D72588K448J402O7j206j534n07R28J458J082Q80J333J819J829J650J581
59588D85818J356O83k64j193j993k479k432k071j905j935j694j187j052j483j844
59573D66325j715j583j884k117j614o73j82l61o13m38K0K89O7n43j047r14j49
59556D52868P24J296J547J462Q98J16j81L01J090J783K575L583M369M813N699
59541D82943P649J0153J2582J5427J9149K2165K1629J6532Q839J222n131j0027
59529F03132j2942j3334j1613q854n725k451N41K619L599L878L800L348K417J138
59515E69553j92j371k429l487m401m755m436m079m415n280n827n740n533n525
59501E12083n388n010m951n365n263l796j690m05j76m1M28N77N5l98q9N78Q31
$$ plain form
59484 481980 482669 483507 485168 488080 492229 497280 502805 508556 514551 520802 527099 533221 539096 544416 548356
59469 548356 550190 550119 549045 547637 546162 545118 545239 546589 548313 549694 550995 552857 555338 558151 561504
59454 561504 566041 572006 579004 586617 594808 603612 612832 622157 631204 639230 645079 647759 647055 643478
59440 643478 637743 630445 622221 613916 606380 600080 594943 590632 586900 583595 580459 577135 573492 569961
59426 569961 567486 567076 569207 573573 579515 586866 596267 608445 623347 640304 658979 679860 703845
59413 703845 731620 763151 796912 829168 854694 869125 871149 862795 848076 831317 815906 803851
59401 803851 796449 795301 801826 815017 830098 840418 841166 831360 813033 789466 764121 739967 718860
59388 718860 701427 687541 676657 667878 660289 653527 647743 643030 639261 636486 634886 634178 633583 632682
$$ packed form
59484D81980O89Q38J661K912M149N051N525N751N995O251O297O122N875N320L940
59469E48356J834p1j074j408j475j044J21J350J724J381J301J862K481K813L353
59454E61504M537N965O998P613Q191Q804R220R325R047Q026N849K680p04l577
59440F43478n735p298q224q305p536o300n137m311l732l305l136l324l643l531
59426E69961k475m10K131M366N942P351R401J2178J4902J6957J8675K0881K3985
59413G03845K7775L1531L3761L2256K5526J4431K024q354j4719j6759j5411j2055
59401H03851p402j148O525J3191J5081J0320P48r806j8327k3567k5345k4154k1107
59388G18860j7433j3886j0884q779p589o762n784m713l769k775j600p08n95r01
$$ plain form
59374 632682 631870 631710 632210 633050 634059 635097 635766 635766 635327 634886 634423 633535 632176 630963 630688 631782 634261
59357 634261 637969 642700 648219 654345 661118 668862 677966 688500 700106 712395 725360 739252 754107
59344 754107 769631 785443 801173 816354 830566 843680 855629 865905 873714 878782 881596 882635
59332 882635 881660 878018 871378 861937 850136 836459 821410 805507 789353 773687 759040 745256
59320 745256 731702 718115 704894 692473 680860 670070 660556 652747 646488 641290 636871 633100 629815
59307 629815 627190 626046 627267 631146 637789 647791 661584 677946 693801 705750 711548 710280 702109
59294 702109 688386 671490 653831 636841 621001 606533 593754 582964 574365 568069 563926 561331
59282 561331 559480 557968 557109 557576 559722 563249 567568 572444 578232 585473 594383 604826 616623 629714
$$ packed form
59374F32682q12j60N00Q40J009J038O69%m39m41m63q88j359j213k75J094K479
59357F34261L708M731N519O126O773P744R104J0534J1606J2289J2965J3892J4855
59344G54107J5524J5812J5730J5181J4212J3114J1949J0276P809N068K814J039
59332H82635r75l642o640r441j1801j3677j5049j5903j6154j5666j4647j3784
59320G45256j3554j3587j3221j2421j1613j0790r514p809o259n198m419l771l285
59307F29815k625j144J221L879O643J0002J3793J6362J5855J1949N798j268q171
59294G02109j3723j6896j7659j6990j5840j4468j2779j0790q599o296m143k595
59282E61331j851j512q59M67K146L527M319M876N788P241Q910J0443J1797J3091
$$ plain form
59268 629714 643945 658813 673463 687055 699271 710443 720948 730332 737317 740849 740997 738600 734292
59255 734292 728300 721060 713496 706429 699970 693722 687524 681856 677555 675097 674141 673866 673849 674435 676059
59240 676059 678432 680819 683043 685706 689302 693587 698104 702833 707905 712887 716972 719808 721622 722363
59226 722363 721261 717649 711918 705141 697842 689647 680183 669831 659263 648732 638246 628165 619082
59213 619082 611203 604303 598199 592750 587490 581937 576395 571849 568788 566780 565461 565182 566109 567335 567744
59198 567744 567456 567558 568583 570141 571970 574387 577402 580198 582024 583173 584653 587211 590988 595751 601057
59183 601057 606388 611483 616396 621054 625046 628111 630530 632632 634170 634742 634720 635183 636708 638704 640173
59168 640173 640848 641282 642082 643505 645662 648537 651596 653789 654428 653957 653496 653571 653554 652410 649689 645592 640323
$$ packed form
59268F29714J4231J4868J4650J3592J2216J1172J0505R384O985L532J48k397m308
59255G34292n992p240p564p067o459o248o198n668m301k458r56k75j7N86J624
59240F76059K373K387K224K663L596M285M517M729N072M982M085K836J814P41
59226G22363j102l612n731o777p299q195r464j0352j0568j0531j0486j0081r083
59213F19082p879o900o104n449n260n553n542m546l061k008j319k79R27J226M09
59198E67744k88J02J025J558J829K417L015K796J826J149J480K558L777M763N306
59183F01057N331N095M913M658L992L065K419K102J538N72k2M63J525J996J469
59168F40173O75M34Q00J423K157K875L059K193O39m71m61P5j7j144k721m097n269
$$ plain form
59151 640323 633688 625389 615531 604758 593921 583611 574069 565486 558127 551951 546326 540518 534460
59138 534460 528691 523580 519050 515144 512231 510388 509072 507861 507052 507057 507616 508252 509238 511380 514907 519146
59122 519146 523382 527465 531515 535654 540262 546001 553271 561807 571006 580373 589594 598458 606898 614893
59108 614893 622213 628467 633511 637633 641271 644722 648090 651235 653691 654944 654909 654008 652717 651210 649408
59093 649408 647186 644580 642029 640302 639787 639908 639657 638770 637895 637478 637014 635675 633294 630297 626876 622693
59077 622693 617402 611221 604906 599189 594228 589605 584897 580099 575352 570458 565110 559533 554436 550242
59063 550242 546713 543467 540471 537850 535557 533498 531719 530276 529176 528543 528465 528484 527651 525489 522659 520350
59047 520350 519172 518967 519399 520234 521076 521360 520823 519831 519134 519316 520437 522047 523525 524514 525079 525505 526065
$$ packed form
59151F40323o635q299r858j0773j0837j0310r542q583p359o176n625n808o058
59138E34460n769n111m530l906k913j843j316j211q09NN59O36R86K142L527M239
59122E19146M236M083M050M139M608N739P270Q536R199R367R221Q864Q440P995
59108F14893P320O254N044M122L638L451L368L145K456J253l5r01j291j507j802
59093F49408k222k606k551j727n15J21k51q87q75m17m64j339k381k997l421m183
59077F22693n291o181o315n717m961m623m708m798m747m894n348n577n097m194
59063E50242l529l246k996k621k293k059j779j443j100o33p8J9q33k162k830k309
59047E20350j178k05M32Q35Q42K84n37r92o97J82J121J610J478R89N65M26N60
$$ plain form
59030 526065 526977 528470 530815 534329 539267 545491 552357 559289 566551 575101 585589 597770 610930 624420
59016 624420 637439 648811 657556 663593 667406 669153 668616 666064 662595 659248 656114 652729 649166 646269
59002 646269 644723 644321 644446 645040 646646 649551 653327 657331 661288 665149 668737 671835 674463 676746 678660
58987 678660 680099 681003 681292 680973 680514 680599 681197 681456 681189 681827 685022 690676 697487 705154 714715 726553
58971 726553 739543 752795 766977 782904 799701 815443 829220 841584 853187 863919 873349 881358
58959 881358 888185 894182 899405 903152 904122 901391 895042 885652 873603 859309 843609 827335 810714
58946 810714 793724 776771 760451 744979 730466 717515 706868 698585 692230 687683 685006 683527
58934 683527 681919 679550 677222 676256 677144 679236 681420 682897 683533 683720 683875 684112 684368 684574 684441 683439
$$ packed form
59030E26065R12J493K345L514M938O224O866O932P262Q550J0488J2181J3160J3490
59016F24420J3019J1372Q745O037L813J747n37k552l469l347l134l385l563k897
59002F46269j546m02J25N94J606K905L776M004L957L861L588L098K628K283J914
58987F78660J439R04K89l19m59Q5N98K59k67O38L195N654O811P667R561J1838
58971G26553J2990J3252J4182J5927J6797J5742J3777J2364J1603J0732R430Q009
58959H81358O827N997N223L747R70k731o349r390j2049j4294j5700j6274j6621
58946H10714j6990j6953j6320j5472j4513j2951j0647q283o355m547k677j479
58934F83527j608k369k328r66Q88K092K184J477O36J87J55K37K56K06j33j002
$$ plain form
58918 683439 681372 678787 676406 674367 672462 670897 670216 670532 671361 672255 673171 674312 676130 679413 684785
58903 684785 692036 700460 709873 720754 733307 746930 760747 774105 786452 797361 807026 816294
58891 816294 825931 836215 847426 860180 874880 891155 908181 925265 941809 957059 970363 981554
58879 981554 990757 997901 1002669 1004825 1004374 1001433 996136 988649 979279 968665 957793 947452 937642 927898
58865 927898 918346 910029 903822 899336 895296 890831 885936 880697 874593 866844 857238 846372 835048 823652
58851 823652 812189 800797 789987 780260 771701 764089 757265 751127 745348 739390 732867 725736 718143
58838 718143 710267 702287 694248 685932 677101 667970 659271 651832 646188 642490 640404 639074 637625 635924
58824 635924 634682 634633 635866 638133 641463 646030 651516 657066 662095 666887 672146 678017 683814 688754 692674
$$ packed form
58918F83439k067k585k381k039j905j565o81L16Q29Q94R16J141J818L283N372
58903F84785P251Q424R413J0881J2553J3623J3817J3358J2347J0909R665R268
58891H16294R637J0284J1211J2754J4700J6275J7026J7084J6544J5250J3304J1191
58879I81554R203P144M768K156m51k941n297p487r370j0614j0872j0341r810r744
58865I27898r552q317o207m486m040m465m895n239o104p749r606j0866j1324j1396
58851H23652j1463j1392j0810r727q559p612o824o138n779n958o523p131p593
58838G18143p876p980q039q316q831r131q699p439n644l698k086j330j449j701
58824F35924j242m9J233K267L330M567N486N550N029M792N259N871N797M940L920
$$ plain form
58809 692674 695838 698278 699699 699942 699071 696891 692896 687017 680081 673067 666123 658703 650532 641993 633607
58794 633607 625554 617768 610185 602849 595986 589905 584644 579830 575191 571103 568309 567175 567546 569211
58780 569211 572107 576096 580892 586195 591589 596434 600269 603180 605295 606075 604715 601258 596667 591679
58766 591679 586252 580343 574499 569174 563978 558224 551997 546235 541879 539281 538289 538524 539578 541168 543207
58751 543207 545686 548557 551727 554981 557958 560371 562308 564099 565951 567958 570420 573783 578212 583520
58737 583520 589500 595966 602487 608588 614272 619876 625336 630140 634217 638253 642814 647626 652147 656361
58723 656361 660519 664414 667478 669559 671240 673428 676744 681137 685972 690760 695873 702130 709552 717008
58709 717008 723437 728827 733482 736789 737458 734813 729232 721417 711769 700514 687923 674222 659553
$$ packed form
58809F92674L164K440J421K43q71k180l995n879o936p014o944p420q171q539q386
58794F33607q053p786p583p336o863o081n261m814m639m088k794j134L71J665
58780E69211K896L989M796N303N394M845L835K911K115P80j360l457m591m988
58766E91679n427n909n844n325n196n754o227n762m356k598r92K35J054J590K039
58751E43207K479K871L170L254K977K413J937J791J852K007K462L363M429N308
58737E83520N980O466O521O101N684N604N460M804M077M036M561M812M521M214
58723F56361M158L895L064K081J681K188L316M393M835M788N113O257P422P456
58709G17008O429N390M655L307O69k645n581p815r648j1255j2591j3701j4669
$$ plain form
58696 659553 644086 627998 611468 594977 579533 566214 555421 546752 539523 533205 527493 522319
58684 522319 517801 513911 510219 506213 501872 497660 494001 490936 488312 486042 484179 482898 482421 482845 484101
58669 484101 486176 489270 493601 499160 505842 513666 522653 532536 542726 552430 560664 566406 569081 568920
58655 568920 566712 563196 558762 553554 547714 541650 536113 531755 528448 525356 521844 518096 514668 511844
58641 511844 509732 508502 507994 507431 506219 504887 504620 505860 507940 510114 512358 515027 518147 521274 523699
58626 523699 524781 524493 523706 523429 523688 523595 522702 521682 521381 521814 522629 524107 526917 531001 535430 539583 543873
58609 543873 548995 554767 560118 564111 566677 568409 569971 571815 574148 576799 579159 580562 580847 580388 579499
58594 579499 578104 576192 574281 573051 572584 572408 572380 573106 575334 579239 584533 590972 598439 606735 615723
$$ packed form
58696F59553j5467j6088j6530j6491j5444j3319j0793q669p229o318n712n174
58684E22319m518l890l692m006m341m212l659l065k624k270j863j281m77M24J256
58669D84101K075L094M331N559O682P824Q987R883J0190R704Q234N742K675j61
58655E68920k208l516m434n208n840o064n537m358l307l092l512l748l428k824
58641E11844k112j230n08n63j212j332k67J240K080K174K244K669L120L127K425
58626E23699J082k88p87k77K59r3q93j020l01M33Q15J478K810M084M429M153M290
58609E43873N122N772N351L993K566J732J562J844K333K651K360J403K85m59q89
58594E79499j395j912j911j230m67j76k8P26K228L905N294O439P467Q296Q988
$$ plain form
58579 615723 625572 636370 647384 657172 664775 670680 676363 682964 690584 698698 706970 715585 725094 736087
58565 736087 748970 764007 781486 801652 824366 848988 874798 901359 928153 954035 977470
58554 977470 997322 1013048 1024215 1030420 1031888 1029632 1024810 1018336 1011262 1004752 999181 993784 987806
58541 987806 981469 975046 967418 956586 941595 923220 902756 880971 858392 835801 814080 793994
58529 793994 776336 761765 750330 741531 734890 729918 725547 720451 714344 708364 703786 700694 698156
58516 698156 695181 691176 686106 680718 676272 673526 672140 671254 670343 669318 668256 667399 666993 666803 666169 664889
58500 664889 663683 663346 663824 664497 665062 665665 666437 667355 668420 669659 671117 673054 675866 679555 683666 688074
58484 688074 693417 700355 708727 717920 727754 738513 750366 763326 777696 794000 812212 831176
$$ packed form
58579F15723R849J0798J1014R788P603N905N683O601P620Q114Q272Q615R509J0993
58565G36087J2883J5037J7479K0166K2714K4622K5810K6561K6794K5882K3435
58554I77470J9852J5726J1167O205J468k256m822o474p074o510n571n397n978
58541I87806o337o423p628j0832j4991j8375k0464k1785k2579k2591k1721k0086
58529G93994j7658j4571j1435q799o641m972m371n096o107n980m578l092k538
58516F98156k975m005n070n388m446k746j386q86r11j025j062q57m06j90o34j280
58500F64889j206l37M78O73N65O03P72R18J065J239J458J937K812L689M111M408
58484F88074N343O938Q372R193R834J0759J1853J2960J4370J6304J8212J8964
$$ plain form
58472 831176 848778 862819 872113 876943 878248 876323 870757 861662 850331 838418 827110 817399 810368
58459 810368 806510 805242 805868 808679 814487 823340 834315 846392 858959 871597 883859 895121 904327
58446 904327 910215 912202 910758 906524 899561 889975 878809 867560 857097 847630 839459 833025 828469
58433 828469 825727 824823 825477 826742 827800 828898 830903 834175 838650 844666 852768 862618 872892 882269
58419 882269 889934 895217 897637 897465 895583 892594 888497 883263 877126 870265 862728 854798 847077 840153
58405 840153 834456 830223 827208 824660 822060 819710 818174 817531 817738 819269 822562 827075 831790 836510 841760
58390 841760 847481 852766 857067 860889 865026 869706 874628 879331 883411 886826 890069 893702 897830 902346
58376 902346 907319 912613 917522 921484 924924 928710 933141 938200 944328 951971 960737 970054 980357 992457
$$ packed form
58472H31176J7602J4041R294M830J305j925n566r095j1331j1913j1308r711p031
58459H10368l858j268O26K811N808Q853J0975J2077J2567J2638J2262J1262R206
58446I04327N888J987j444m234o963r586j1166j1249j0463r467q171o434m556
58433H28469k742r04O54J265J058J098K005L272M475O016Q102R850J0274R377
58419H82269P665N283K420j72j882k989m097n234o137o861p537p930p721o924
58405H40153n697m233l015k548k600k350j536o43K07J531L293M513M715M720N250
58390H41760N721N285M301L822M137M680M922M703M080L415L243L633M128M516
58376I02346M973N294M909L962L440L786M431N059O128P643Q766R317J0303J2100
$$ plain form
58362 992457 1005968 1019685 1033444 1048178 1063991 1079624 1094237 1108409 1122733 1136476 1148286
58351 1148286 1157457 1164016 1168441 1171835 1175613 1180435 1185894 1191460 1197047 1202561 1207877 1213666 1221325 1231456
58337 1231456 1243073 1254858 1266646 1279348 1293941 1310874 1329880 1350026 1370361 1390611 1410737
58326 1410737 1429908 1446782 1460904 1472966 1483584 1492704 1500420 1507356 1513964 1520326 1526909 1534595 1543670
58313 1543670 1553700 1564619 1576899 1590387 1604199 1618244 1633642 1651017 1669463 1687992 1706979
58302 1706979 1727275 1748715 1770469 1792303 1814584 1837442 1860620 1883983 1907755 1932434 1958566
58291 1958566 1986140 2014219 2041836 2069247 2097494 2126823 2156587 2186735 2218132 2251149 2285223
58280 2285223 2320229 2357039 2396197 2437291 2480263 2526165 2575882 2629153 2685509 2745095 2807806
$$ packed form
58362I92457J3511J3717J3759J4734J5813J5633J4613J4172J4324J3743J1810
58351A148286R171O559M425L394L778M822N459N566N587N514N316N789P659J0131
58337A231456J1617J1785J1788J2702J4593J6933J9006K0146K0335K0250K0126
58326A410737J9171J6874J4122J2062J0618R120P716O936O608O362O583P686R075
58313A543670J0030J0919J2280J3488J3812J4045J5398J7375J8446J8529J8987
58302A706979K0296K1440K1754K1834K2281K2858K3178K3363K3772K4679K6132
58291A958566K7574K8079K7617K7411K8247K9329K9764L0148L1397L3017L4074
58280B285223L5006L6810L9158M1094M2972M5902M9717N3271N6356N9586O2711
$$ plain form
58269 2807806 2872664 2938872 3006665 3076452 3147954 3220849 3295404 3371863 3450021 3529869 3611817
58258 3611817 3695887 3781632 3869117 3958862 4050526 4142996 4236285 4332021 4431579 4534980 4642092
58247 4642092 4753496 4869650 4990600 5117018 5250067 5389862 5535766 5688679 5851206
58238 5851206 6024900 6209186 6403662 6609395 6827161 7056490 7297564 7552222 7822279
58229 7822279 8108827 8413898 8740455 9089888 9461975 9858242 10282680 10738149 11225129
58220 11225129 11745507 12304569 12907692 13558305 14261200 15024861 15858583 16770470 17770441
58211 17770441 18872164 20090140 21438553 22935365 24604089 26469891 28559102 30906563
58203 30906563 33560997 36583363 40048650 44056490 48739019 54260442 60821658 68676192
$$ packed form
58269B807806O4858O6208O7793O9787P1502P2895P4555P6459P8158P9848Q1948
58258C611817Q4070Q5745Q7485Q9745R1664R2470R3289R5736R9558J03401J07112
58247D642092J11404J16154J20950J26418J33049J39795J45904J52913J62527
58238E851206J73694J84286J94476K05733K17766K29329K41074K54658K70057
58229G822279K86548L05071L26557L49433L72087L96267M24438M55469M86980
58220A1225129N20378N59062O03123O50613P02895P63661Q33722R11887R99971
58211A7770441J101723J217976J348413J496812J668724J865802K089211K347461
58203C0906563K654434L022366L465287M007840M682529N521423O561216P854534
$$ plain form
58195 68676192 78142542 89606953 103533863 120487913 141139997 166233918 196487664
58188 196487664 232328990 273340325 317526683 360917567 398083660 423608996 433820009
58181 433820009 427848880 407589539 376785175 339815394 300668125 262345008 226730219
58174 226730219 194781148 166822498 142788364 122383591 105197800 90787120 78720909
58167 78720909 68604670 60095274 52907835 46809269 41607605 37147314 33306027 29985766
58159 29985766 27104397 24593838 22399366 20474164 18775091 17265390 15917879 14711756
58151 14711756 13628254 12651791 11772080 10981079 10269009 9625799 9044415 8519799 8045758
58142 8045758 7615135 7221518 6858550 6519144 6197879 5893215 5605455 5333727 5076710
$$ packed form
58195F8676192R466350J1464411J3926910J6954050K0652084K5093921L0253746
58188A96487664L5841326M1011335M4186358M3390884L7166093K5525336J0211013
58181D33820009n971129k0259341l0804364l6969781l9147269l8323117l5614789
58174B26730219l1949071k7958650k4034134k0404773j7185791j4410680j2066211
58167G8720909j0116239q509396p187439o098566n201664m460291l841287l320261
58159B9985766k881369k510559k194472j925202j699073j509701j347511j206123
58151A4711756j083502r76463q79711p91001p12070o43210n81384n24616m74041
58142H045758m30623l93617l62968l39406l21265l04664k87760k71728k57017
$$ plain form
58133 5076710 4834755 4608951 4398851 4202907 4020188 3849956 3690421 3539622 3396931
58124 3396931 3262375 3135326 3015118 2902041 2796395 2697359 2603894 2515815 2432909 2354114
58114 2354114 2278787 2207676 2141314 2078511 2017741 1959044 1903227 1850143 1799146 1750348 1704003
58103 1704003 1659463 1616235 1575415 1538684 1506372 1477677 1451991 1428645 1405989 1382391 1357957
58092 1357957 1334035 1311209 1288871 1266522 1244328 1222484 1200889 1179427 1157958 1136251 1114426
58081 1114426 1092946 1071717 1049893 1027202 1004700 983433 963153 943149 923512 904552 885841
58070 885841 867032 848927 832483 817318 802508 788344 775902 765129 754779 744210 733995
58059 733995 724657 715847 706966 697708 687854 677339 666686 656711 647672 639189 630958 622996 615257 607581
$$ packed form
58133E076710k41955k25804k10100j95944j82719j70232j59535j50799j42691
58124C396931j34556j27049j20208j13077j05646r9036r3465q8079q2906p8795
58114B354114p5327p1111o6362o2803o0770n8697n5817n3084n0997m8798m6345
58103A704003m4540m3228m0820l6731l2312k8695k5686k3346k2656k3598k4434
58092A357957k3922k2826k2338k2349k2194k1844k1595k1462k1469k1707k1825
58081A114426k1480k1229k1824k2691k2502k1267k0280k0004j9637j8960j8711
58070H85841j8809j8105j6444j5165j4810j4164j2442j0773j0350j0569j0215
58059G33995r338q810q881r258r854j0515j0653r975r039q483q231p962p739p676
$$ plain form
58045 607581 599996 592662 585628 578984 572958 567434 561753 555460 548917 542653 536550 530246 523855 517649
58031 517649 511460 505120 499033 493470 487678 480533 471873 462456 452934 443684 435348 428482 422734 417233
58017 417233 411773 406902 402879 399350 396048 393054 390304 387510 384695 382252 380419 379121 378260 377698 377126
58002 377126 376477 376301 377148 378731 380290 381543 382589 383095 382394 380406 377726 374773 371487 367843 363977
57987 363977 359814 355247 350735 347034 344295 342047 340103 338735 337856 336718 334672 331735 328309 324959
57973 324959 322492 321496 321489 321219 320157 319160 319309 320637 322417 324121 325514 326230 326037 325518 325849 327623 330124
57956 330124 331969 332368 331620 330460 329198 327640 325691 323631 321744 319921 317807 315180 312175 309367 307644
57941 307644 307647 309246 311943 315811 321396 328522 335947 342757 349542 357492 366691 375887 383555 388521 389961
$$ packed form
58045F07581p585p334p034o644o026n524n681o293o543o264o103o304o391o206
58031E17649o189o340o087n563n792p145q660r417r522r250q336o866n748n501
58017D17233n460m871m023l529l302k994k750k794k815k443j833j298q61n62n72
58002C77126o49j76Q47J583J559J253J046N06p01j988k680k953l286l644l866
57987C63977m163m567m512l701k739k248j944j368q79j138k046k937l426l350
57973C24959k467r96pk70j062r97J49J328J780J704J393P16j93n19L31J774K501
57956C30124J845L99p48j160j262j558j949k060j887j823k114k627l005k808j723
57941C07644LJ599K697L868N585P126P425O810O785P950R199R196P668M966J440
$$ plain form
57926 389961 387737 382786 376522 369756 362578 355104 347676 340422 333211 326085 319233 312609 306123 300203
57912 300203 295644 292839 291565 291438 292190 293564 295404 297707 300216 302208 303264 304018 305495 307774 309891
57897 309891 310985 310927 310059 309058 308975 310546 313306 316030 318120 319947 321847 323561 324827 325755 326367 326428
57881 326428 325957 325282 324348 322644 320106 317478 315346 313301 310502 306774 302802 299441 297006 295049 292828
57866 292828 290225 288122 287390 287664 287773 287367 287455 289167 292630 297232 302326 307417 312236 316990 322117 327547
57850 327547 332662 337099 341077 344751 347837 350115 351724 352678 352668 351613 349913 347883 345473 342785 340288
57835 340288 338207 336289 334410 332750 331057 328558 325109 321696 319099 316703 313478 309718 306897 305919
57821 305919 306262 306832 307065 307124 307468 308352 309506 310213 309728 307560 303438 297382 289892 281738 273478 265499
$$ packed form
57926C89961k224m951o264o766p178p474p428p254p211p126o852o624o486n920
57912C00203m559k805j274j27P52J374J840K303K509J992J056P54J477K279K117
57897C09891J094n8q68j001q3J571K760K724K090J827J900J714J266R28O12O1
57881C26428m71o75r34j704k538k628k132k045k799l728l972l361k435j957k221
57866B92828k603k103p32K74J09m06Q8J712L463M602N094N091M819M754N127N430
57850C27547N115M437L978L674L086K278J609R54j0j055j700k030k410k688k497
57835C40288k081j918j879j660j693k499l449l413k597k396l225l760k821r78
57821C05919L43N70K33N9L44Q84J154P07m85k168m122o056p490q154q260p979
$$ plain form
57805 265499 258428 252852 248547 244740 241296 238850 237443 236068 234180 232813 233245 235124 236861 237506 237344
57790 237344 236977 236773 237130 238450 240700 243541 246867 250779 255173 259854 264868 270277 275837 281380 287176
57775 287176 293330 299182 304017 308067 311967 315448 317527 317973 317651 317287 316737 315707 314389 312961 311107
57760 311107 308429 304960 301036 297008 293321 290457 288524 287260 286528 286438 286834 287084 286693 285889 285363 285615
57744 285615 286604 287823 288634 288764 288491 288175 287746 286956 286003 285458 285631 286446 287904 290083 292641 294882 296593
57727 296593 298429 301179 304852 308592 311307 312473 312644 313113 314678 316797 318334 318980 319387 320012 320574 320680
57711 320680 320164 318604 315424 310928 306550 303383 300967 298165 294740 291335 288168 284684 280595 276609
57697 276609 273740 272199 271268 270156 268780 267613 266894 266230 265138 263774 262734 262263 262094 262138 262803 264399
$$ packed form
57805B65499p071n576m305l807l444k446j407j375j888j367M32J879J737O45j62
57790B37344l67k04L57J320K250K841L326L912M394M681N014N409N560N543N796
57775B87176O154N852M835M050L900L481K079M46l22l64n50j030j318j428j854
57760C11107k678l469l924m028l687k864j933j264p32r0L96K50l91q04n26K52
57744B85615R89J219Q11J30k73l16m29p90r53n45J73Q15J458K179K558K241J711
57727B96593J836K750L673L740K715J166J71M69J565K119J537O46M07O25N62J06
57711C20680n16j560l180m496m378l167k416k802l425l405l167l484m089l986
57697B76609k869j541r31j112j376j167p19o64j092j364j040m71j69M4O65J596
$$ plain form
57681 264399 266684 269369 272826 277955 285517 295817 308921 325062 345042 370377 402783 443411
57669 443411 492751 550940 616941 686457 750977 800009 825296 823857 798195 754417 699791 640904
57657 640904 582957 529829 483875 445387 412942 384995 361120 341551 326094 314112 305128 298660
57645 298660 293651 288948 284409 280858 278834 278050 278166 279197 280791 281891 281833 281321 281572 282700 283644 283649 283106
57628 283106 282725 282470 281808 280738 280014 280262 281191 281903 281783 280844 279358 277531 275660 274233 273518 273201 272702
57611 272702 271856 271013 270498 270275 270210 270353 270741 271160 271397 271630 272181 272871 272958 271991 270485 269387 268935 268437 267273
57592 267273 265616 263906 262003 259437 256305 253339 251079 249530 248729 248976 250210 251662 252618 253132 253555
57577 253555 253735 253214 252029 250709 249607 248772 248409 248823 249792 250536 250559 250151 249873 249890 250075 250426 251073 252007
$$ packed form
57681B64399K285K685L457N129P562J0300J3104J6141J9980K5335L2406M0628
57669D43411M9340N8189O6001O9516O4520M9032K5287j439k5662m3778n4626n8887
57657F40904n7947n3128m5954l8488l2445k7947k3875j9569j5457j1982q984o468
57645B98660n009m703m539l551k024p84J16J031J594J100n8n12K51J128R44Nn43
57628B83106l81k55o62j070p24K48R29P12j20r39j486j827j871j427p15l17m99
57611B72702q46q43n15k23o5J43L88M19K37K33N51O90Q7r67j506j098m52m98j164
57592B67273j657j710j903k566l132k966k260j549q01K47J234J452R56N14M23
57577B53555J80n21j185j320j102q35l63M14R69P44K3m08k78J7J85L51O47R34
$$ plain form
57559 252007 253079 254198 255410 256764 258242 259773 261289 262775 264270 265838 267633 269949 272890 275821
57545 275821 277538 277429 276383 276132 277722 280931 284955 289079 292695 295331 296987 298054 298722 298797 298260 297572
57529 297572 297234 297389 298049 299258 300804 302279 303795 306178 309982 314576 318682 321552 323309 324503 325873
57514 325873 328252 332009 336554 340862 344430 347424 350097 352594 355154 357864 360200 361435 361632 361697 362319
57499 362319 363326 364205 364736 364871 364472 363529 362415 361647 361558 362189 363271 364279 364919 365610 367016 369001 370660
57482 370660 371634 372779 375065 378364 381896 385418 389253 393364 397212 400470 403210 405323 406466 406811 407320
57467 407320 408935 411774 415351 419179 422943 426418 429617 432846 436249 439407 441727 443206 444553 446558
57453 446558 449546 453435 457975 462742 467161 470917 474340 478080 482294 486404 489902 493181 497273 502766
$$ packed form
57559B52007J072J119J212J354J478J531J516J486J495J568J795K316K941K931
57545B75821J717j09j046k51J590L209M024M124L616K636J656J067O68P5n37o88
57529B97572l38J55O60J209J546J475J516K383L804M594M106K870J757J194J370
57514C25873K379L757M545M308L568K994K673K497K560K710K336J235J97O5O22
57499C62319J007Q79N31J35l99r43j114p68q9O31J082J008O40O91J406J985J659
57482C70660R74J145K286L299L532L522L835M111L848L258K740K113J143L45N09
57467D07320J615K839L577L828L764L475L199L229L403L158K320J479J347K005
57453D46558K988L889M540M767M419L756L423L740M214M110L498L279M092N493
$$ plain form
57439 502766 509299 516052 522417 528132 533216 538033 543123 548673 554332 559706 564781 569675 574352 578959
57425 578959 584102 590219 596828 602945 608194 613020 617867 622725 627528 632395 637268 641863 646281 651202
57411 651202 657126 663795 670662 677560 684502 691239 697551 703776 710478 717634 724594 730932 736999 743599
57397 743599 751353 760375 770250 780241 789713 798488 806786 814981 823566 833168 844214 856536 869513
57384 869513 882587 895444 907761 919191 929783 940149 950954 962269 973564 984360 994744
57373 994744 1005169 1015777 1026098 1035602 1044503 1053759 1064194 1075741 1087639 1099128 1109920 1120253
57361 1120253 1130733 1141874 1153581 1165272 1176681 1188240 1200387 1212907 1225430 1238294 1252293
57350 1252293 1267652 1283893 1300678 1318094 1335980 1353620 1370450 1386640 1402693 1418915 1435546
$$ packed form
57439E02766O533O753O365N715N084M817N090N550N659N374N075M894M677M607
57425E78959N143O117O609O117N249M826M847M858M803M867M873M595M418M921
57411F51202N924O669O867O898O942O737O312O225O702P156O960O338O067O600
57397G43599P754R022R875R991R472Q775Q298Q195Q585R602J1046J2322J2977
57384H69513J3074J2857J2317J1430J0592J0366J0805J1315J1295J0796J0384
57373I94744J0425J0608J0321R504Q901R256J0435J1547J1898J1489J0792J0333
57361A120253J0480J1141J1707J1691J1409J1559J2147J2520J2523J2864J3999
57350A252293J5359J6241J6785J7416J7886J7640J6830J6190J6053J6222J6631
$$ plain form
57339 1435546 1452906 1470974 1489122 1506745 1524004 1541564 1559853 1578920 1598787 1619427 1640396
57328 1640396 1660922 1680479 1699094 1717161 1735219 1753831 1773270 1793268 1813328 1833403 1854064
57317 1854064 1875893 1898850 1922347 1945832 1969253 1992965 2017196 2041606 2065510 2088650 2111610
57306 2111610 2135231 2159711 2184506 2209118 2233653 2258542 2283971 2309854 2336212 2363318 2391308
57295 2391308 2419775 2447924 2475263 2502100 2529304 2557601 2587200 2617992 2649780 2682197 2714695
57284 2714695 2746905 2778903 2810941 2843137 2875672 2909093 2943908 2979851 3015975 3051708 3087530
57273 3087530 3124362 3162462 3201185 3239729 3277814 3315674 3353636 3391849 3430270 3468721 3507032
57262 3507032 3545209 3583442 3621808 3660052 3697879 3735446 3773249 3811359 3849159 3886178 3922965
$$ packed form
57339A435546J7360J8068J8148J7623J7259J7560J8289J9067J9867K0640K0969
57328A640396K0526J9557J8615J8067J8058J8612J9439J9998K0060K0075K0661
57317A854064K1829K2957K3497K3485K3421K3712K4231K4410K3904K3140K2960
57306B111610K3621K4480K4795K4612K4535K4889K5429K5883K6358K7106K7990
57295B391308K8467K8149K7339K6837K7204K8297K9599L0792L1788L2417L2498
57284B714695L2210L1998L2038L2196L2535L3421L4815L5943L6124L5733L5822
57273C087530L6832L8100L8723L8544L8085L7860L7962L8213L8421L8451L8311
57262C507032L8177L8233L8366L8244L7827L7567L7803L8110L7800L7019L6787
$$ plain form
57251 3922965 3960600 3999376 4038513 4077282 4115925 4155184 4195448 4236719 4278952 4321878 4364687
57240 4364687 4406514 4447212 4487273 4527023 4566259 4604552 4641475 4676660 4710196 4743057 4776537
57229 4776537 4810984 4845431 4878749 4910855 4942590 4974728 5007397 5040311 5073296 5106555 5140533
57218 5140533 5175469 5211173 5247401 5284317 5322222 5360857 5399495 5437796 5476084 5514512 5552497
57207 5552497 5589409 5625417 5661091 5696437 5730946 5764534 5797819 5831293 5864644 5897065 5927965
57196 5927965 5957242 5985150 6012119 6038503 6064307 6089161 6112625 6134458 6154623 6173147 6190042
57185 6190042 6205290 6218970 6231477 6243520 6255666 6267864 6279610 6290615 6301143 6311595 6321940
57174 6321940 6331714 6340518 6348355 6355391 6361438 6365720 6367240 6365427 6360318 6352081 6340479 6324920 6304983
$$ packed form
57251C922965L7635L8776L9137L8769L8643L9259M0264M1271M2233M2926M2809
57240D364687M1827M0698M0061L9750L9236L8293L6923L5185L3536L2861L3480
57229D776537L4447L4447L3318L2106L1735L2138L2669L2914L2985L3259L3978
57218E140533L4936L5704L6228L6916L7905L8635L8638L8301L8288L8428L7985
57207E552497L6912L6008L5674L5346L4509L3588L3285L3474L3351L2421L0900
57196E927965K9277K7908K6969K6384K5804K4854K3464K1833K0165J8524J6895
57185F190042J5248J3680J2507J2043J2146J2198J1746J1005J0528J0452J0345
57174F321940R774Q804P837P036O047M282J520j813n109q237j1602j5559j9937
$$ plain form
57161 6304983 6280791 6252953 6222199 6188942 6153114 6114641 6074277 6033737 5994708 5957935 5923674
57150 5923674 5892739 5866327 5844704 5826872 5811979 5800367 5792531 5787472 5782956 5777288 5769987 5760518
57138 5760518 5747217 5727997 5701717 5668487 5629046 5584437 5536092 5485599 5434249 5383015 5332794
57127 5332794 5284159 5236724 5189130 5139872 5088057 5033507 4976589 4918152 4859322 4801211 4745136
57116 4745136 4693139 4647667 4610122 4579934 4555508 4536011 4521802 4513439 4511127 4515591 4529118 4555376
57104 4555376 4598488 4662558 4751972 4871830 5028206 5228352 5481075 5797332 6190997 6679305
57094 6679305 7282288 8021078 8915854 9984075 11238690 12685797 14321876 16131324 18084885
57085 18084885 20139303 22238528 24316359 26299725 28111661 29674012 30910933 31754612
$$ packed form
57161F304983k4192k7838l0754l3257l5828l8473m0364m0540l9029l6773l4261
57150E923674l0935k6412k1623j7832j4893j1612p836n059m516n668p301r469
57138E760518j3301j9220k6280l3230l9441m4609m8345n0493n1350n1234n0221
57127E332794m8635m7435m7594m9258n1815n4550n6918n8437n8830n8111n6075
57116D745136n1997m5472l7545l0188k4426j9497j4209q363k312M464J3527K6258
57104D555376M3112O4070Q9414J19858J56376K00146K52723L16257L93665M88308
57094F679305O02983P38790Q94776J068221J254615J447107J636079J809448J953561
57085A8084885K054418K099225K077831J983366J811936J562351J236921Q43679
$$ plain form
57077 31754612 32153859 32084186 31555416 30611981 29323971 27772338 26035073 24179618 22262126
57068 22262126 20330275 18425814 16585060 14838008 13207487 11708878 10350044 9131497
57060 9131497 8047605 7089102 6245719 5507548 4865167 4309461 3831550 3422512 3073082
57051 3073082 2773892 2516320 2293258 2099260 1930143 1782372 1652557 1537571 1435204
57042 1435204 1344392 1264365 1193666 1130460 1073744 1023612 980272 943468 913231 890577 877056
57031 877056 874278 884483 910470 952734 1005443 1055845 1088939 1093890 1067521 1013816 941402 860622
57019 860622 780528 706640 640786 582885 532641 489748 453329 422109 395226 372428 353350
57008 353350 337040 322524 309603 298647 289639 281858 274643 268054 262428 257542 252788 248175 244572
$$ packed form
57077C1754612L99247o9673n28770r43435j288010j551633j737265j855455j917492
57068B2262126j931851j904461j840754j747052j630521j498609j358834j218547
57060I131497j083892r58503q43383p38171o42381n55706m77911m09038l49430
57051C073082k99190k57572k23062j93998j69117j47771j29815j14986j02367
57042A435204r0812q0027p0699o3206n6716n0132m3340l6804l0237k2654j3521
57031H77056k778J0205K5987M2264N2709N0402L3094M951k6369n3705p2414q0780
57019H60622q0094p3888o5854n7901n0244m2893l6419l1220k6883k2798j9078
57008C53350j6310j4516j2921j0956r008p781p215o589n626m886m754m613l603
$$ plain form
56995 244572 242639 241884 241212 240259 239775 240728 243419 247519 252644 258673 265730 273945 283082 292265 300187
56980 300187 305551 307189 304028 295615 282989 268513 254354 241213 228766 216929 206215 197120
56968 197120 189814 184419 181040 179469 179443 181362 186267 194853 206886 221750 239072 258328 278127
56955 278127 296240 310265 318159 318664 311816 299081 282603 264324 245860 228788 214358 202836
56943 202836 193592 186056 180373 177048 176222 177588 180989 187031 196985 211906 231749 255383 281424
56930 281424 308587 334953 357273 371803 376073 369825 354516 332525 306794 280396 255656 233647
56918 233647 214613 198590 185419 174500 165046 156606 149190 142953 138001 134336 131698 129498 127239
56905 127239 125066 123607 123211 123603 124430 125836 128237 131736 136121 141355 147722 155390 164162 173822 184533
$$ packed form
56995B44572j933p55o72r53m84R53K691M100N125O029P057Q215R137R183P922
56980C00187N364J638l161q413j2626j4476j4159j3141j2447j1837j0714r095
56968A97120p306n395l379j571k6J919M905Q586J2033J4864J7322J9256J9799
56955B78127J8113J4025P894N05o848j2735j6478j8279j8464j7072j4430j1522
56943B02836r244p536n683l325q26J366L401O042R954J4921J9843K3634K6041
56930B81424K7163K6366K2320J4530M270o248j5309k1991k5731k6398k4740k2009
56918B33647j9034j6023j3171j0919r454q440p416o237m952l665k638k200k259
56905A27239k173j459l96L92Q27J406K401L499M385N234O367P668Q772R660J0711
$$ plain form
56890 184533 196750 211026 228069 248616 272600 298289 322558 342234 355252 360801 358947 350485
56878 350485 336953 320468 303304 287347 273648 262491 254096 249209 248709 252715 260567 271810 286797
56865 286797 306191 330499 360503 397622 443017 496065 553708 610914 661548 699509 720313
56854 720313 722408 707300 678711 641638 601342 562048 526201 495069 469806 451434 440126 435421
56842 435421 437352 446749 464283 490004 524297 568789 625751 696604 780795 874982 972091 1061282
56830 1061282 1130275 1169400 1174719 1148337 1096456 1027049 948362 867954 791734 723213 663701
56819 663701 613397 572327 540455 517550 503449 498284 502186 515073 537196 569663 613755 669493
56807 669493 734717 804798 872312 927486 960752 966492 944909 900841 841343 773922 705220 639750
$$ packed form
56890A84533J2217J4276J7043K0547K3984K5689K4269J9676J3018N549j854q462
56878C50485j3532j6485j7164j5957j3699j1157q395m887n00M006P852J1243J4987
56865B86797J9394K4308L0004L7119M5395N3048N7643N7206N0634L7961K0804
56854G20313K095j5108k8589l7073m0296l9294l5847l1132k5263j8372j1308m705
56842D35421J931R397J7534K5721L4293M4492N6962P0853Q4191R4187R7109Q9191
56830A061282O8993L9125N319k6382n1881o9407p8687q0408p6220o8521n9512
56819F63701n0304m1070l1872k2905j4101n165L902J2887K2123L2467M4092N5738
56807F69493O5224P0081O7514N5174L3266N740k1583m4068n9498o7421o8702o5470
$$ plain form
56795 639750 579654 525929 479634 441698 412135 390073 374416 364226 358870 358349 363450 375275
56783 375275 394620 421591 455125 492334 528554 558502 577570 582545 572280 548437 515008 476284
56771 476284 435243 393981 354763 319629 289179 262661 239246 218660 200712 185032 171361
56760 171361 159515 149009 139308 130543 123409 118132 114031 110254 106564 103212 100449 98396 97073 96318
56746 96318 95760 95028 93995 92895 92310 92775 94073 95076 94662 92746 90203 88009 86786 86788 87694 88555 88575
56729 88575 87976 87605 87818 88404 89466 91455 94193 96631 97942 98248 98031 97525 97038 97152 98057 99182 99968
56712 99968 100522 101026 101074 100271 99125 98595 98981 99910 101218 103057 105133 106527 106502 105134 103150 101560 101386
56695 101386 103087 106068 109175 111800 114071 115939 116765 116273 115355 115306 116424 117855 118710 118858 118683 118516
$$ packed form
56795F39750o0096n3725m6295l7936k9563k2062j5657j0190n356n21N101J1825
56783C75275J9345K6971L3534L7209L6220K9948J9068M975j0265k3843l3429l8724
56771D76284m1041m1262l9218l5134l0450k6518k3415k0586j7948j5680j3671
56760A71361j1846j0506r701q765p134n277m101l777l690l352k763k053j323p55
56746I6318n58p32j033j100n85M65J298J003m14j916k543k194j223KR06Q61K0
56729H8575n99l71K13N86J062J989K738K438J311L06k17n06m87J14R05J125P86
56712I9968N54N04M8q03j146n30L86R29J308J839K076J394k5j368j984j590j74
56695A01386J701K981L107K625K271J868Q26m92r18m9J118J431Q55J48j75j67
$$ plain form
56679 118516 118504 118655 118829 118904 119087 119833 121277 122937 124181 124820 125082 125201 125306 125590 126209 126960 127305 126865
56661 126865 125790 124640 124011 124218 125137 126303 127302 128125 129072 130415 132244 134363 136049 136283 134778 132650
56645 132650 131362 131004 130372 128898 127591 127561 128484 129315 129827 130439 130936 130562 129402 128594 128860 129667 130273 130895
56627 130895 132280 134469 136578 137654 137463 136514 135530 134855 134297 133593 132863 132395 132079 131456 130328 128916 127442
56610 127442 125936 124484 123216 121975 120511 119137 118656 119351 120503 121216 121313 121113 120766 120296 120001 120281 121193
56593 121193 122544 124275 126348 128314 129490 129653 129299 129097 129321 129849 130475 131017 131254 131022 130480 130106 130277
56576 130277 130901 131696 132765 134558 137135 139911 142449 145128 148552 152591 156622 160554 164933 170078 175854
56561 175854 182471 190711 200956 212432 223692 233289 239849 242376 241273 238571 236337 234922 233252
$$ packed form
56679A18516j2J51J74P5J83P46J444J660J244O39K62J19J05K84O19P51L45m40
56661A26865j075j150o29K07R19J166R99Q23R47J343J829K119J686K34j505k128
56645A32650j288l58o32j474j307l0R23Q31N12O12M97l74j160q08K66Q07O06O22
56627A30895J385K189K109J076j91r49r84o75n58p04p30m68l16o23j128j412j474
56610A27442j506j452j268j241j464j374m81O95J152P13R7k00l47m70k95K80R12
56593A21193J351J731K073J966J176J63l54k02K24N28O26N42K37k32n42l74J71
56576A30277O24P95J069J793K577K776K538K679L424M039M031L932M379N145N776
56561A75854O617Q240J0245J1476J1260R597O560K527j103k702k234j415j670
$$ plain form
56548 233252 230556 227163 223749 220593 217738 215347 213540 212083 210449 208127 204894 200878 196449 192035
56534 192035 188089 185066 183105 181775 180523 179473 179292 180037 180729 180553 179976 179980 180500 180462 179384 178112 177652
56517 177652 177850 177649 176371 174330 172299 170686 169304 167774 166000 164225 162740 161728 161356 161730 162624
56502 162624 163523 164143 164703 165483 166352 166966 167234 167244 166960 166348 165660 165158 164658 163756 162494 161421 160959 161093
56484 161093 161691 162702 163925 164953 165570 165954 166381 166904 167447 167951 168329 168538 168827 169678 171266 173159 174719
56467 174719 175656 176021 175847 175083 173917 172934 172795 173717 175188 176280 176381 175692 174863 174167 173330 172291 171760
56450 171760 172529 174358 176070 176935 177499 178765 180919 183305 185386 187090 188301 188683 188251 187627 187334 187230
56434 187230 186949 186548 186324 186311 186478 187154 188624 190431 191615 191679 190832 189385 187512 185590 184133 183210 182482
$$ packed form
56548B33252k696l393l414l156k855k391j807j457j634k322l233m016m429m414
56534A92035l946l023j961j330j252j050j81P45O92j76n77MN20l8j078j272m60
56517A77652J98k01j278k041k031j613j382j530j774j775j485j012l72L74Q94
56502A62624Q99O20N60P80Q69O14K68J0k84o12o88n02n00r02j262j073m62J34
56484A61093N98J011J223J028O17L84M27N23N43N04L78K09K89Q51J588J893J560
56467A74719R37L65j74p64j166r83j39R22J471J092J01o89q29o96q37j039n31
56450A71760P69J829J712Q65N64J266K154K386K081J704J211L82m32o24k93j04
56434A87230k81m01k24j3J67O76J470J807J184O4q47j447j873j922j457r23p28
$$ plain form
56417 182482 181972 182219 183458 185219 187010 188811 190542 191614 191582 190854 190273 190287 190859 191832 192847 193298 192934
56400 192934 192354 192395 193144 194022 194669 195253 196018 197000 198170 199442 200537 201224 201712 202466 203627 204953 206272
56383 206272 207654 209057 210116 210456 210111 209600 209679 210908 213211 215895 218197 219780 220688 221114 221371 221830
56367 221830 222625 223596 224711 226239 228213 230067 231244 231995 233035 234513 235867 236784 237810 239695 242404
56352 242404 245071 246901 247939 248915 250334 251846 252654 252483 251911 251716 252182 253125 254261 255431 256725 258604
56336 258604 261601 265662 270057 274075 277551 280606 283288 285733 288261 290974 293674 296478 300079 304849
56322 304849 309983 314097 316519 317598 317949 317925 317686 317338 316946 316725 317106 318349 320206 322195 324088 326013
56306 326013 328353 331669 336271 341667 346885 351671 356795 362773 368927 374345 379233 384507 390446 396575
$$ packed form
56417A82482n10K47J239J761J791J801J731J072l2p28n81J4N72R73J015M51l64
56400A92934n80M1P49Q78O47N84P65R82J170J272J095O87M88P54J161J326J319
56383B06272J382J403J059L40l45n11P9J229K303K684K302J583R08M26K57M59
56367B21830P95R71J115J528J974J854J177P51J040J478J354R17J026J885K709
56352B42404K667J830J038R76J419J512Q08j71n72j95M66R43J136J170J294J879
56336B58604K997M061M395M018L476L055K682K445K528K713K700K804L601M770
56322C04849N134M114K422J079L51k4k39l48l92k21L81J243J857J989J893J925
56306C26013K340L316M602N396N218M786N124N978O154N418M888N274N939O129
$$ plain form
56292 396575 402652 408963 415685 422601 429430 435947 442045 448200 455585 464983 475848 487069 498432
56279 498432 510549 523594 537011 550421 563945 577715 591917 607338 624948 644747 665776
56268 665776 687481 710365 735222 762500 792635 826242 863650 904791 949896 999769 1055240
56257 1055240 1116862 1185407 1262139 1348359 1445063 1553217 1673908 1808003 1955882 2117428
56247 2117428 2291833 2477416 2672020 2873471 3079101 3284867 3485571 3675963 3851163
56238 3851163 4006227 4136164 4236595 4303997 4335605 4330110 4288733 4214907 4112651 3985732
56228 3985732 3838244 3674962 3500632 3319406 3135053 2950969 2769753 2593465 2424500
56219 2424500 2265376 2117254 1979386 1850619 1730917 1620975 1520851 1429557 1345818 1268826
$$ packed form
56292C96575O077O311O722O916O829O517O098O155P385R398J0865J1221J1363
56279D98432J2117J3045J3417J3410J3524J3770J4202J5421J7610J9799K1029
56268F65776K1705K2884K4857K7278L0135L3607L7408M1141M5105M9873N5471
56257A055240O1622O8545P6732Q6220R6704J08154J20691J34095J47879J61546
56247B117428J74405J85583J94604K01451K05630K05766K00704J90392J75200
56238C851163J55064J29937J00431O7402L1608n495m1377p3826j02256j26919
56228C985732j47488j63282j74330j81226j84353j84084j81216j76288j68965
56219B424500j59124j48122j37868j28767j19702j09942j00124r1294q3739p6992
$$ plain form
56209 1268826 1198339 1134292 1076320 1023716 975952 932891 894189 858864 826119 796276 770157
56198 770157 747694 727914 710088 694026 679358 665556 652759 641623 632228 623967 616637 610658
56186 610658 606021 601965 597904 593844 589678 585088 580368 576345 573192 570291 567627 566235 566786 568706
56172 568706 571223 574314 578044 581917 585583 589392 593598 597766 601574 605496 610058 615155 620724 627354
56158 627354 635565 645067 655383 666664 679301 693221 708147 724111 741382 760442 782331 808434
56146 808434 839645 876450 919950 971761 1032418 1100798 1175396 1254939 1336980 1417093 1490632
56135 1490632 1554894 1609149 1653766 1690409 1722218 1752275 1781773 1809890 1834746 1853949 1865291
56124 1865291 1868212 1864450 1856591 1846344 1834362 1820487 1802998 1778308 1742748 1694808 1635474 1567343
$$ packed form
56209A268826p0487o4047n7972n2604m7764m3061l8702l5325l2745k9843k6119
56198G70157k2463j9780j7826j6062j4668j3802j2797j1136r395q261p330n979
56186F10658m637m056m061m060m166m590m720m023l153k901k664j392N51J920
56172E68706K517L091L730L873L666L809M206M168L808L922M562N097N569O630
56158F27354Q211R502J0316J1281J2637J3920J4926J5964J7271J9060K1889K6103
56146H08434L1211L6805M3500N1811O0657O8380P4598P9543Q2041Q0113P3539
56135A490632O4262N4255M4617L6643L1809L0057K9498K8117K4856J9203J1342
56124A865291K921l762p859j0247j1982j3875j7489k4690l5560m7940n9334o8131
$$ plain form
56112 1567343 1494251 1420860 1351075 1286661 1227919 1175292 1129631 1091275 1059739 1034160 1013618
56101 1013618 997287 984737 975766 969705 965497 962726 961812 962774 964630 966598 969081 972843 977970 984235
56087 984235 991714 1000323 1009425 1018537 1027812 1037379 1047016 1056927 1067878 1079981 1092332 1104486 1117210
56074 1117210 1131089 1145529 1159953 1174897 1190996 1207928 1225338 1243772 1263636 1284168 1304419
56063 1304419 1324434 1344611 1364930 1385683 1407777 1431256 1454638 1476855 1498746 1521480 1544653
56052 1544653 1567225 1589272 1611421 1633549 1655383 1677524 1700597 1724285 1748360 1773602 1800475
56041 1800475 1828014 1855410 1883597 1913891 1946157 1979735 2015028 2052669 2092340 2133997 2179191
56030 2179191 2229411 2284003 2341222 2400292 2460903 2521895 2582287 2642733 2704390 2767319 2831422
$$ packed form
56112A567343p3092p3391o9785o4414n8742n2627m5661l8356l1536k5579k0542
56101A013618j6331j2550q971o061m208k771r14R62J856J968K483L762N127O265
56087I84235P479Q609R102R112R275R567R637R911J0951J2103J2351J2154J2724
56074A117210J3879J4440J4424J4944J6099J6932J7410J8434J9864K0532K0251
56063A304419K0015K0177K0319K0753K2094K3479K3382K2217K1891K2734K3173
56052A544653K2572K2047K2149K2128K1834K2141K3073K3688K4075K5242K6873
56041A800475K7539K7396K8187L0294L2266L3578L5293L7641L9671M1657M5194
56030B179191N0220N4592N7219N9070O0611O0992O0392O0446O1657O2929O4103
$$ plain form
56019 2831422 2897671 2966798 3038016 3110674 3185888 3264922 3347463 3433191 3523341 3618762 3718167
56008 3718167 3820403 3926691 4038451 4154803 4274721 4399760 4531953 4670798 4815125
55999 4815125 4966204 5126006 5294116 5469476 5653479 5848202 6053289 6268022 6494746
55990 6494746 6736743 6994334 7266728 7556016 7865498 8195731 8546349 8920269 9321964
55981 9321964 9753116 10214230 10709060 11243124 11819577 12441172 13114778 13849340 14651249
55972 14651249 15526660 16486600 17544939 18713813 20006938 21445659 23056744 24867783
55964 24867783 26911979 29235710 31896486 34959400 38506208 42647952 47526009 53312145
55956 53312145 60223914 68541542 78607473 90826361 105687715 123786007 145796410
$$ packed form
56019B831422O6249O9127P1218P2658P5214P9034Q2541Q5728R0150R5421R9405
56008C718167J02236J06288J11760J16352J19918J25039J32193J38845J44327
55999D815125J51079J59802J68110J75360J84003J94723K05087K14733K26724
55990F494746K41997K57591K72394K89288L09482L30233L50618L73920M01695
55981I321964M31152M61114M94830N34064N76453O21595O73606P34562Q01909
55972A4651249Q75411R59940J058339J168874J293125J438721J611085J811039
55964B4867783K044196K323731K660776L062914L546808M141744M878057N786136
55956E3312145O911769Q317628J0065931J2218888J4861354J8098292K2010403
$$ plain form
55949 145796410 172388151 204013953 240441890 280053351 319352952 353338441 376897173
55942 376897173 386548976 381514764 363617053 336326100 303603585 268997953 235145650
55935 235145650 203672869 175388136 150567729 129168752 110948558 95553867 82601495
55928 82601495 71724396 62583250 54875136 48346675 42793139 38044622 33959964 30429661
55920 30429661 27370787 24713942 22398135 20374042 18602129 17045638 15670506 14450806
55912 14450806 13367570 12402151 11535899 10755406 10052201 9417196 8840087 8313601 7833387
55903 7833387 7393820 6988233 6612921 6266698 5946767 5648868 5371018 5113209 4873810
55894 4873810 4649918 4440818 4247406 4068538 3901483 3745588 3602076 3470539 3348961
$$ packed form
55949A45796410K6591741L1625802L6427937L9611461L9299601L3985489K3558732
55942C76897173R651803n034212j7897711k7290953l2722515l4605632l3852303
55935B35145650l1472781k8284733k4820407k1398977j8220194j5394691j2952372
55928H2601495j0877099r141146p708114o528461n553536m748517m084658l530303
55920C0429661l058874k656845k315807k024093j771913j556491j375132j219700
55912A4450806j083236r65419q66252p80493p03205o35005n77109n26486m80214
55903G833387m39567m05587l75312l46223l19931k97899k77850k57809k39399
55894D873810k23892k09100j93412j78868j67055j55895j43512j31537j21578
$$ plain form
55885 3348961 3236630 3133385 3036050 2939230 2840071 2739516 2639082 2539605 2443117 2352527
55875 2352527 2268592 2189642 2114598 2043789 1976661 1911330 1846996 1784651 1725026 1667970 1614071
55864 1614071 1564766 1520357 1479649 1441823 1406994 1374882 1344688 1316404 1290670 1267316 1245539
55853 1245539 1225328 1207058 1189809 1171688 1151767 1130282 1107277 1082638 1057144 1031881 1006943
55842 1006943 982136 958371 936600 915917 894631 872865 852214 833250 815311 798444 783412
55831 783412 769904 756744 743833 732057 721363 710865 700726 691946 684183 675783 666101 655920
55819 655920 645452 633889 621256 608826 597315 586270 575592 565960 557498 549634 542562 537200
55807 537200 533395 529885 526379 524010 523291 523338 523653 525041 528051 531911 535692 539261 542555 545186 547217
$$ packed form
55885C348961j12331j03245r7335r6820r9159j00555j00434r9477r6488r0590
55875B352527q3935p8950p5044p0809o7128o5331o4334o2345n9625n7056n3899
55864A614071m9305m4409m0708l7826l4829l2112l0194k8284k5734k3354k1777
55853A245539k0211j8270j7249j8121j9921k1485k3005k4639k5494k5263k4938
55842A006943k4807k3765k1771k0683k1286k1766k0651j8964j7939j6867j5032
55831G83412j3508j3160j2911j1776j0694j0498j0139q780p763q400r682j0181
55819F55920j0468j1563j2633j2430j1511j1045j0678r632q462p864p072n362
55807E37200l805l510l506k369p19M7L15J388L010L860L781L569L294K631K031
$$ plain form
55792 547217 549078 550272 549530 546774 543654 541531 540109 538425 535819 531361 523811 513121 500938 488780
55778 488780 476693 464404 452895 444050 439528 440531 447646 459846 474070 486560 494549 496677 492711
55765 492711 483458 470480 455387 439537 424286 410807 399488 390074 382388 376297 371075 365567 359027
55752 359027 351149 341550 330250 318537 308203 299769 292367 285371 279078 273806 269533 266625 265724 266570
55738 266570 267882 268630 268506 267092 263795 258989 254119 250254 247361 245099 243246 241107 237720 233088 228274
55723 228274 223978 220017 216370 213504 211362 209299 207448 206958 208352 210913 214246 219179 226264 234446
55709 234446 242025 248057 252181 254132 254259 253581 252513 250281 246274 241078 235405 228959 221356 213386 206323
55694 206323 200467 195235 190229 185486 181140 177517 175109 173823 172780 171471 170551 170849 172221 174115 176654
$$ packed form
55792E47217J861J194p42k756l120k123j422j684k606m458p550j0690j2183j2158
55778D88780j2087j2289j1509q845m522J003P115J2200J4224J2490P989K128l966
55765D92711r253j2978j5093j5850j5251j3479j1319r414p686o091n222n508o540
55752C59027p878r599j1300j1713j0334q434p402o996o293n272m273k908r01Q46
55738B66570J312P48j24j414l297m806m870l865k893k262j853k139l387m632m814
55723B28274m296l961l647k866k142k063j851m90J394K561L333M933P085Q182
55709B34446P579O032M124J951J27o78j068k232m007n196n673o446p603p970p063
55694B06323n856n232n006m743m346l623k408j286j043j309r20K98J372J894K539
$$ plain form
55679 176654 180254 184545 188579 191917 194826 197541 199912 201594 202158 201195 198778 195624 192430 189284 186019
55664 186019 182877 180478 179328 179485 180428 181227 181285 180969 181021 181452 181732 182050 183363 185917 188642 190441 191261
55647 191261 191535 191486 191466 192024 192983 193224 191999 189695 186733 182609 176866 170223 163868 158218 153203 149143
55631 149143 146418 144631 142908 140790 138276 135471 132824 131179 130893 131346 131861 132538 133483 133893 132834 130527
55615 130527 128053 126060 124445 122917 121201 119066 116798 115210 114544 113921 112526 110766 109463 108568 107571
55600 107571 106576 105907 105138 103696 101992 100835 100008 98636 96739 95150 93982 92486 90507 88872 88124
55585 88124 87951 88092 88697 89508 89760 89327 89070 89594 90550 91572 92989 95022 97094 98678 100207 102419 105209
55568 105209 107859 110066 112018 113666 114590 114646 114211 113667 112950 111812 110298 108758 107366 105863 103974 102041
$$ packed form
55679A76654L600M291M034L338K909K715K371J682N64r63k417l154l194l146l265
55664A86019l142k399j150J57R43P99N8l16N2M31K80L18J313K554K725J799Q20
55647A91261K74m9k0N58R59K41j225k304k962m124n743o643o355n650n015m060
55631A49143k725j787j723k118k514k805k647j645k86M53N15O77R45M10j059k307
55615A30527k474j993j615j528j716k135k268j588o66o23j395j760j303q95r97
55600A07571r95o69p69j442j704j157q27j372j897j589j168j496j979j635p48
55585H8124j73J41O05Q11K52m33k57N24R56J022J417K033K072J584J529K212K790
55568A05209K650K207J952J648R24N6m35n44p17j138j514j540j392j503j889j933
$$ plain form
55552 102041 100828 100513 100253 99120 97179 95219 93725 92708 92341 92922 94145 95124 95415 95426 95628 95970 96389
55535 96389 97264 98827 100564 101774 102463 103136 103938 104495 104486 103838 102415 100122 97422 95197 93869 92991 91936
55518 91936 90606 89198 87669 85913 84151 82603 80917 78575 75902 73927 73050 72526 71676 70961 71186 72134
55502 72134 72788 72644 71981 71020 69758 68688 68704 69904 71219 71651 71331 71007 71049 71389 71906 72366 72377 71926 71624
55483 71624 71973 72753 73522 74331 75390 76350 76616 76206 75722 75488 75284 74955 74742 74878 75157 75119 74463 73245 71828
55464 71828 70622 69709 68766 67503 66074 64899 64120 63502 62835 62316 62425 63409 64879 66043 66453 66457 66705 67357
55446 67357 68100 68746 69336 69710 69574 69135 69051 69517 69921 69704 69047 68333 67392 65778 63582 61584 60681 61282
55428 61282 63000 64816 65866 66188 66386 66672 66837 67100 68104 69844 71480 72627 73917 75730 77290 77830
$$ packed form
55552A02041j213l15k60j133j941j960j494j017l67N81J223R79K91J1K02L42M19
55535I6389Q75J563J737J210O89O73Q02N57ro48j423k293k700k225j328q78j055
55518I1936j330j408j529j756j762j548j686k342k673j975q77n24q50p15K25R48
55502G2134O54j44o63r61j262j070J6J200J315M32l20l24M2L40N17M60J1m51l02
55483G1624L49P80P69Q09J059R60K66m10m84k34k04l29k13J36K79l8o56j218j417
55464G1828j206r13r43j263j429j175p79o18o67n19J09R84J470J164M10MK48O52
55446F7357P43O46N90L74j36m39q4M66M04k17o57p14r41j614k196j998r03O01
55428F1282J718J816J050L22J98K86J65K63J004J740J636J147J290J813J560N40
$$ plain form
55412 77830 77787 77886 77766 76694 75143 74361 74497 74395 73279 71650 70274 69215 68159 67012 65814 64548
55396 64548 63325 62422 62034 62227 63016 64158 65073 65426 65615 66203 67055 67678 68106 68724 69351 69408 69072 69335 70627
55377 70627 72104 72688 72240 71280 70096 68667 67177 66111 65824 66219 66808 67037 66661 65952 65466 65584 66291
55360 66291 67278 68159 68719 69045 69292 69316 68910 68429 68689 69905 71226 71703 71236 70177 68640 66846 65613
55343 65613 65573 66206 66511 66425 66614 67059 66979 66285 66026 66938 68375 69209 69196 68915 68803 68820 68852 68977 69314 69819 70268
55322 70268 70444 70389 70336 70292 69923 69052 68051 67430 67329 67634 68212 68620 68108 66531 64900 64307 64578 64726 64379
55303 64379 63916 63419 62591 61689 61525 62280 63156 63462 63301 63048 62882 63066 63893 65084 65905 66100 66089 66057 65662
55284 65662 64903 64518 65075 66265 67441 68243 68442 67876 66958 66615 67253 68279 68991 69411 69872 70449 71160 72171
$$ packed form
55412G7830m3R9j20j072j551p82J36j02j116j629j376j059j056j147j198j266
55396F4548j223r03l88J93P89J142R15L53J89N88Q52O23M28O18O27N7l36K63J292
55377G0627J477N84m48r60j184j429j490j066k87L95N89K29l76p09m86J18P07
55360F6291R87Q81N60L26K47K4m06m81K60J216J321M77m67j059j537j794j233
55343F5613m0O33L05q6J89M45q0o94k59R12J437Q34j3k81j12J7L2J25L37N05M49
55322G0268J76n5n3m4l69q71j001o21j01L05N78M08n12j577j631n93K71J48l47
55303F4379m63m97q28r02j64P55Q76L06j61k53j66J84Q27J191Q21J95j1l2l95
55284F5662p59l85N57J190J176Q02J99n66r18l43O38J026P12M20M61N77P11J011
$$ plain form
55266 72171 73280 73737 73118 71946 71032 70590 70398 70356 70416 70389 70275 70351 70587 70450 69759 69209 69438 70051 70185 69691
55246 69691 69063 68584 68229 68247 68985 70086 70561 69871 68540 67473 66964 66588 65931 65211 65095 65916 67176 67980
55228 67980 67861 66965 65662 64408 63895 64669 66403 68067 69018 69544 70157 70924 71725 72587 73356 73544 72979 72253
55210 72253 72122 72751 73869 75252 76601 77287 76831 75534 74236 73466 73069 72556 71638 70518 69719 69478 69399
55193 69399 69048 68754 69197 70185 70621 69974 69041 68825 69331 69995 70624 71283 71715 71597 71047 70357 69553 68765 68640
55174 68640 69777 71914 74181 75921 76874 76971 76473 76022 75976 75983 75607 75054 74768 74750 74806 75008 75277 75014 73930
55155 73930 72819 72620 73008 72882 72039 71358 71317 71371 71001 70515 70497 71127 72309 73866 75389 76431 77050 77672
55137 77672 78341 78705 78820 79279 80250 81030 80905 79981 78846 77910 77386 77454 77973 78396 78423 78451 78986 79824 80293 80150
$$ packed form
55266G2171J109M57o19j172r14m42j92m2O0k7j14P6K36j37o91n50K29O13J34m94
55246F9691o28m79l55J8P38J101M75o90j331j067n09l76o57p20j16Q21J260Q04
55228F7980j19q96j303j254n13P74J734J664R51N26O13P67Q01Q62P69J88n65p26
55210G2253j31O29J118J383J349O86m56j297j298p70l97n13r18j120p99k41p9
55193F9399l51k94M43R88M36o47r33k16N06O64O29O59M32j18n50o90q04p88j25
55174F8640J137K137K267J740R53R7m98m51m6Pl76n53k86j8N6K02K69k63j084
55155G3930j111j99L88j26q43o81m1N4l70m86j8O30J182J557J523J042O19O22
55137G7672O69L64J15M59R71P80j25r24j135r36n24O8N19M23K7K8N35Q38M69j43
$$ plain form
55117 80150 79798 79534 79016 77762 76043 74953 75356 76932 78553 79612 80523 81736 82746 82679 81590 80515
55101 80515 80207 80377 80296 79702 78957 78687 79393 81086 83146 84820 85905 86640 86983 86554 85429 84422 84167
55084 84167 84340 84245 83851 83758 84286 85077 85643 85933 86253 86919 88140 89976 92144 93929 94581 93983 92835 91985
55066 91985 91631 91344 90814 90257 89964 89769 89323 88732 88545 89019 89684 89774 88955 87584 86319 85574 85346 85482 85948
55047 85948 86711 87475 87805 87575 87023 86368 85600 84765 84118 83790 83587 83317 83118 83261 83853 84870 86186 87366
55029 87366 87819 87450 86798 86235 85429 84034 82532 81766 81897 82416 82983 83663 84411 84967 85247 85319 85051 84295 83375
55010 83375 82784 82432 81819 80996 80701 81337 82468 83508 84325 84940 85215 85214 85326 85670 85848 85685 85694 86343 87288 87937
54990 87937 88433 89419 91007 92633 93930 95102 96334 97440 98312 99206 100164 100563 99776 98163 96824 96292
$$ packed form
55117H0150l52k64n18j254j719j090M03J576J621J059R11J213J010o7j089j075
55101H0515l08J70q1n94p45k70P06J693K060J674J085P35L43m29j125j007k55
55084H4167J73r5l94r3N28P91N66K90L20O66J221J836K168J785O52n98j148q50
55066I1985l54k87n30n57k93j95m46n91j87M74O65R0q19j371j265p45k28J36M66
55047H5948P63P64L30k30n52o55p68q35o47l28k03k70j99J43N92J017J316J180
55029H7366M53l69o52n63q06j395j502p66J31N19N67O80P48N56K80P2k68p56r20
55010H3375n91l52o13q23k95O36J131J040Q17O15K75jJ12L44J78j63RO49R45O49
54990H7937M96R86J588J626J297J172J232J106Q72Q94R58L99p87j613j339n32
$$ plain form
54974 96292 95943 95001 93684 92881 92892 93085 92891 92560 92674 93261 93808 93898 93512 92877 92370 92415 93136 94127 94841 95122
54954 95122 95134 94933 94439 93748 93092 92524 91951 91484 91431 91894 92594 93147 93345 93203 92913 92678 92481 92163 91843 91918
54934 91918 92409 92765 92791 93314 95181 97845 99821 100495 100691 101358 102658 104633 107780 112330 117616 122887
54918 122887 128309 134481 141215 147500 152513 156147 158599 159985 160362 159651 157501 153615 148311 142446 136680
54903 136680 131086 125601 120542 116461 113619 111797 110547 109456 108252 106910 105790 105450 106072 107102 107684
54888 107684 107459 106726 105815 104714 103546 103014 103907 106288 109577 113302 117407 121934 126908 132567 139162
54873 139162 146315 152973 158221 161883 164182 165089 164227 161287 156442 150559 144925 140375 136551 132353 127327
54858 127327 122264 118220 115257 112503 109273 105818 102990 101372 100753 100380 99692 98745 97810 96775 95281
$$ packed form
54974I6292l49r42j317q03J1J93j94l31J14N87N47R0l86o35n07M5P21R91P14K81
54954I5122J2k01m94o91o56n68n73m67n3M63P00N53J98j42k90k35j97l18l20P5
54934I1918M91L56K6N23J867K664J976O74J96O67J300J975L147M550N286N271
54918A22887N422O172O734O285N013L634K452J386L77p11k150l886n304n865n766
54903A36680n594n485n059m081k842j822j250j091j204j342j120l40O22J030N82
54888A07684k25p33r11j101j168n32Q93K381L289L725M105M527M974N659O595
54873A39162P153O658N248L662K299R07q62k940m845n883n634m550l824m198n026
54858A27327n063m044k963k754l230l455k828j618o19l73o88r47r35j035j494
$$ plain form
54843 95281 93438 91914 91180 90987 90815 90481 90103 89703 89154 88404 87574 86956 86954 87741 88872 89496 89203 88390 87669
54824 87669 87219 86982 87100 87700 88425 88685 88440 88329 88874 89799 90332 90108 89619 89762 90977 92890 94760 96129
54806 96129 96868 96789 95695 93942 92569 92434 93290 94065 94105 93892 94382 95803 97373 98233 98333 98174 97968 97581
54788 97581 97284 97818 99341 100873 101379 101026 100707 100644 100286 99510 98925 98836 98770 98436 98411 99363 101157 103315 105902
54769 105902 109342 113607 118186 122698 127104 131426 135728 140370 145881 152451 159588 166209 171052 173280
54755 173280 172908 170534 166600 161218 154758 148128 142161 137048 132618 128786 125417 122190 119067 116486
54741 116486 114638 112955 110949 109263 109034 110259 111576 111879 111470 111329 111818 112566 113208 113675 113887 113724 113488
54724 113488 114039 116155 119811 124341 129328 135001 141508 148124 153629 157448 159958 161636 162384 161871 159972
$$ packed form
54843I5281j843j524p34j93j72l34l78m00n49p50q30o18kP87J131O24k93q13p21
54824H7669m50k37J18O00P25K60k45j11N45R25N33k24m89J43J215J913J870J369
54806I6129P39p9j094j753j373j35Q56P75M0k13M90J421J570Q60J00j59k06l87
54788I7581k97N34J523J532N06l53l19o3l58p76n85q9o6l34k5R52J794K158K587
54769A05902L440M265M579M512M406M322M302M642N511O570P137O621M843K228
54755A73280l72k374l934n382o460o630n967n113m430l832l369l227l123k581
54741A16486j848j683k006j686k29J225J317L03m09j41M89P48O42M67K12j63k36
54724A13488N51K116L656M530M987N673O507O616N505L819K510J678P48n13j899
$$ plain form
54709 159972 156602 151624 145430 139205 134015 129773 125614 121184 117017 113691 111140 108957 106967 105335
54695 105335 104259 103703 103313 102721 102031 101790 102241 102846 102960 102737 102836 103346 103674 103580 103631 104259 104908 104644 103346
54676 103346 101809 100773 100301 100090 99981 100007 100164 100366 100475 100279 99545 98304 97041 96408 96651 97481 98467 99416
54658 99416 100278 100924 101246 101334 101292 101038 100493 99843 99315 98808 98094 97261 96521 95687 94454 93251 93118 94444 96382
54639 96382 97884 98801 99587 100396 101074 101688 102437 103200 103719 104097 104638 105240 105418 104884 103749 102236 100570 99102
54621 99102 98177 97837 97929 98346 98893 99121 98757 98182 98085 98606 99226 99442 99213 98797 98549 98805 99585 100428 100884 101112
54601 101112 101591 102349 102924 103046 102830 102334 101472 100426 99602 99038 98422 97844 97921 98861 99907 100179 99734 99399
54583 99399 99777 100778 101924 102755 103021 102786 102356 101972 101598 101120 100596 100216 100079 100149 100378 100787 101449 102329 103127
$$ packed form
54709A59972l370m978o194o225n190m242m159m430m167l326k551k183j990j632
54695A05335j076n56l90n92o90k41M51O05J14k23R9N10L28r4N1O28O49k64j298
54676A03346j537j036m72k11j09K6J57K02J09j96p34j241j263o33K43Q30R86R49
54658I9416Q62O46L22Q8m2k54n45o50n28n07p14q33p40q34j233j203j33J326J938
54639I6382J502R17P86Q09O78O14P49P63N19L78N41O02J78n34j135j513j666j468
54621I9102r25l40R2M17N47K28l64n75r7N21O20K16k29m16k48K56P80Q43M56K28
54601A01112M79P58N75J22k16m96q62j046q24n64o16n78P7R40J046K72m45l35
54583I9399L78J001J146Q31K66k35m30l84l74m78n24l80j37P0K29M09O62Q80P98
$$ plain form
54564 103127 103436 103256 103132 103504 104094 104329 104221 104305 104741 105081 105086 105147 105614 106183 106377 106252 106262 106654 107319 107982
54544 107982 108328 108253 108294 109406 111855 114662 116575 117372 117712 118008 118089 117859 117531 117086 116111 114454 112592 111064
54526 111064 109912 108929 108080 107348 106452 105188 103922 103345 103745 104771 105854 106584 106713 106235 105589 105420 105871
54509 105871 106328 106169 105608 105434 105986 106779 107266 107566 108145 108994 109526 109296 108531 107825 107482 107323 107025 106563 106273
54490 106273 106546 107464 108719 109860 110605 110935 111019 111094 111373 111921 112592 113084 113129 112698 112121 111930 112479 113657 115077
54471 115077 116460 117709 118693 119284 119692 120419 121658 122939 123645 123705 123577 123665 123977 124280 124379 124271 124190 124309 124336
54452 124336 123682 122229 120552 119049 117300 114933 112771 112209 113371 114795 115271 115230 115771 116995 118035 118363
54436 118363 118216 117829 117051 115889 114819 114225 113989 113935 114329 115489 117088 118263 118442 117800 116927 116336 116340 117022
$$ packed form
54564A03127L09j80j24L72N90K35j08Q4M36L40NO1M67N69J94j25J0L92O65O63
54544A07982L46p5M1J112K449K807J913P97L40K96Q1k30l28m45r75j657j862j528
54526A11064j152r83q49p32q96j264j266n77M00J026J083P30J29m78o46j69M51
54509A05871M57j59n61j74N52P93M87L00N79Q49N32k30p65p06l43j59k98m62k90
54490A06273K73R18J255J141P45L30Q4P5K79N48O71M92M5m31n77j91N49J178J420
54471A15077J383J249R84N91M08P27J239J281P06O0j28Q8L12L03R9j08q1J19K7
54452A24336o54j453j677j503j749k367k162n62J162J424M76m1N41J224J040L28
54436A18363j47l87p78j162j070n94k36n4L94J160J599J175J79o42q73n91MO82
$$ plain form
54418 117022 118088 118941 119211 119086 118923 118612 117759 116496 115680 116005 117209 118455 119359 120221 121312 122360 122993
54401 122993 123405 124260 125940 128128 130249 132121 133950 135740 137048 137528 137505 137627 138004 138059 137318 136021 134743
54384 134743 133746 132991 132563 132629 132998 133129 132746 132232 132247 133004 134079 134934 135505 136189 137296 138731 140304 142116
54366 142116 144402 147206 150583 154912 160434 166417 171452 174872 177387 179913 182175 182933 181388 177903
54352 177903 173496 169039 164885 160976 157250 154027 151732 150190 148581 146397 144045 142151 140659 139103
54338 139103 137363 135589 133658 131414 129323 128179 128120 128468 128559 128274 127779 127345 127437 128429 130048 131440 131848
54321 131848 131032 129208 127103 125809 125865 126462 126275 125154 124285 124547 125481 126135 126198 125795 124855 123276 121406
54304 121406 119780 118576 117654 116969 116598 116571 116936 117787 118949 119877 120107 119714 119124 118635 118338 118285 118558 119211
$$ packed form
54418A17022J066Q53K70j25j63l11q53j263q16L25J204J246R04Q62J091J048O33
54401A22993M12Q55J680K188K121J872J829J790J308M80k3J22L77N5p41j297j278
54384A34743r97p55m28O6L69J31l83n14J5P57J075Q55N71O84J107J435J573J812
54366A42116K286K804L377M329N522N983N035L420K515K526K262P58j545l485
54352A77903m407m457m154l909l726l223k295j542j609k184k352j894j492j556
54338A39103j740j774j931k244k091j144n9L48R1k85m95m34R2R92J619J392M08
54321A31848q16j824k105j294N6N97j87j121q69K62R34O54O3m03r40j579j870
54304A21406j626j204r22o85l71k7L65Q51J162R28K30l93n90m89k97n3K73O53
$$ plain form
54286 119211 120280 121719 123378 125123 126956 128759 130074 130496 130280 130159 130491 131033 131604 132489 133963 135659
54270 135659 136621 135977 133762 131265 130229 131200 132879 133691 133656 133952 134964 135939 136576 137575 139190 140450 140589
54253 140589 140179 140046 139948 139348 138769 139176 140413 141339 141364 140892 140347 139670 138804 137920 137050 136117 135312 134928 134823
54234 134823 134600 134285 134283 134708 135316 135996 136769 137300 137074 136136 135123 134368 133468 131907 129732 127509 125951 125619
54216 125619 126574 128130 129358 129946 130339 130937 131513 131577 131022 130177 129378 128639 127759 126664 125658 125170 125231 125427
54198 125427 125459 125520 125857 126276 126450 126522 127007 128201 129977 132003 133783 134674 134401 133538 133083 133503 134483 135550
54180 135550 136482 137086 137068 136358 135400 134925 135399 136609 137748 138153 138045 138225 138838 138950 137776 135890 134535
54163 134535 134021 133617 132937 132560 133071 134198 135273 136004 136409 136383 135793 134796 133757 132950 132507 132540 133119 134152
$$ packed form
54286A19211J069J439J659J745J833J803J315M22k16j21L32N42N71Q85J474J696
54270A35659R62o44k215k497j036R71J679Q12l5K96J012R75O37R99J615J260J39
54253A40589m10j33r8o00n79M07J237R26K5m72n45o77q66q84q70r33q05l84j05
54234A34823k23l15kM25O08O80P73N31k26r38j013p55r00j561k175k223j558l32
54216A25619R55J556J228N88L93N98N76O4n55q45p99p39q80j095j006m88O1J96
54198A25427L2O1L37M19J74P2M85J194J776K026J780Q91k73q63m55M20R80J067
54180A35550R32O04j8p10r58m75M74J210J139M05j08J80O13J12j174j886j355
54163A34535n14m04o80l77N11J127J075P31M05k6n90r97j039q07m43L3N79J033
$$ plain form
54145 134152 135328 136150 136161 135394 134541 134359 134876 135428 135480 135129 134786 134659 134664 134659 134650 134846 135457 136322 136866 136621 135740
54124 135740 134833 134500 135250 137504 141141 145151 148254 149940 150574 150598 150147 149412 148824 148674 148960 149663 150783
54107 150783 152023 152901 153338 153724 154227 154510 154382 154326 155019 156609 158764 161194 163801 166492 169210 172171
54091 172171 175783 180211 185086 189584 192819 194202 193624 191385 188027 184177 180276 176380 172389 168597
54077 168597 165747 164285 163830 163645 163401 163102 162606 161760 160922 160745 161387 162382 163344 164329 165424 166426 167116
54060 167116 167537 167865 168293 169108 170601 172836 175719 179250 183422 187894 192181 196160 200048 203859 207273
54045 207273 210031 212185 213958 215680 217716 220075 222269 224067 226171 229465 233733 237879 241397 244765
54031 244765 248277 251458 253944 256131 258482 260881 263129 265333 267346 268539 268809 269123 270276 271552 271485
$$ packed form
54145A34152J176Q22J1p67q53j82N17N52N2l51l43j27NnrJ96O11Q65N44k45q81
54124A35740r07l33P50K254L637M010L103J686O34K4m51p35n88j50K86P03J120
54107A50783J240Q78M37L86N03K83j28n6O93J590K155K430K607K691K718K961
54091A72171L612M428M875M498L235J383n78k239l358l850l901l896l991l792
54077A68597k850j462m55j85k44k99m96q46q38j77O42R95R62R85J095J002O90
54060A67116M21L28M28Q15J493K235K883L531M172M472M287L979L888L811L414
54045B07273K758K154J773J722K036K359K194J798K104L294M268M146L518L368
54031B44765L512L181K486K187K351K399K248K204K013J193K70L14J153J276o7
$$ plain form
54016 271485 269660 267001 264437 262050 259455 256284 252186 246996 241126 235488 230816 227205 224257 221469
54002 221469 218471 215191 211854 208787 206273 204493 203272 201858 199468 196270 193396 191627 190530 189269
53988 189269 187843 186860 186430 186015 185327 184762 184804 185417 186115 186339 185737 184403 182840 181499 180406 179435 178741
53971 178741 178624 179095 180003 181438 183631 186376 188956 190742 191736 192543 193960 196446 199746 203122 206274
53956 206274 209945 215393 223411 234070 247069 261689 276365 288892 297426 301208 300406 295710 288318
53943 288318 279907 272084 265680 260648 256692 253901 252649 252906 253965 255108 256343 258012 259814 260912
53929 260912 261236 261978 264244 267696 271188 274362 277878 282250 287229 292413 297788 303481 309516 316049 323292
53914 323292 330987 338381 345066 351451 357988 364190 368888 371460 372417 372736 372834 372402 371083 369028 366686
$$ packed form
54016B71485j825k659k564k387k595l171m098n190n870n638m672l611k948k788
54002B21469k998l280l337l067k514j780j221j414k390l198k874j769j097j261
53988A89269j426r83m30m15o88n65M2O13O98K24o02j334j563j341j093r71o94
53971A78741j17M71R08J435K193K745K580J786R94Q07J417K486L300L376L152
53956B06274L671N448Q018J0659J2999J4620J4676J2527Q534L782q02m696p392
53943B88318q411p823o404n032l956k791j252K57J059J143J235J669J802J098
53929B60912L24P42K266L452L492L174L516M372M979N184N375N693O035O533P243
53914C23292P695P394O685O385O537O202M698K572R57L19R8m32j319k055k342
$$ plain form
53899 366686 364267 361677 358944 356297 353641 350255 345346 338837 331413 323874 316617 309583 302511 295331
53885 295331 288433 282388 277314 272719 268138 263652 259605 256159 253370 251251 249283 246337 241759 236315
53871 236315 231415 227572 224335 221539 219612 218505 217259 215108 212330 209548 206839 204070 201571 199725
53857 199725 198187 196230 193779 191553 190160 189504 189108 188604 187868 187061 186629 186900 187548 187748 187039 185828 184874
53840 184874 184497 184470 184492 184443 184195 183571 182708 182227 182698 183903 184861 184755 183745 182772 182692 183691 185369 187117 188409
53821 188409 189015 189128 189293 190047 191510 193233 194487 194863 194710 194859 195866 197607 199692 202046 204937 208606
53805 208606 213128 218528 224682 231102 237137 242463 247222 251591 255494 258861 262006 265483 269466 273390
53791 273390 276351 277968 278802 279766 281135 282348 282823 282612 282031 280938 278794 275335 270882 266021 261215
$$ packed form
53899C66686k419k590k733k647k656l386m909o509p424p539p257p034p072p180
53885B95331o898o045n074m595m581m486m047l446k789k119j968k946m578n444
53871B36315m900l843l237k796j927j107j246k151k778k782k709k769k499j846
53857A99725j538j957k451k226j393o56l96n04p36q07m32K71O48K00p09j211r54
53840A84874l77k7K2m9k48o24q63m81M71J205R58j06j010r73q0R99J678J748J292
53821A88409O06J13J65P54J463J723J254L76j53J49J007J741K085K354K891L669
53805B08606M522N400O154O420O035N326M759M369L903L367L145L477L983L924
53791B73390K961J617Q34R64J369J213M75k11n81j093k144l459m453m861m806
$$ plain form
53776 261215 256599 251875 246576 240796 235498 231606 228822 225899 222172 218301 215357 213741 213202 213312 213431
53761 213431 212688 210640 207796 205025 202595 200238 197992 196353 195544 195145 194664 194048 193431 192755 191923 191122
53745 191122 190646 190558 190801 191541 193006 194916 196407 196743 195966 194668 193272 191845 190562 189939 190331 191374
53729 191374 192269 192626 192807 193411 194664 196396 198349 200283 201942 203204 204259 205435 206916 208838 211571
53714 211571 215433 219981 223981 226495 227790 228791 229879 230782 231568 232976 235426 238373 241196 244283 248491
53699 248491 253718 258804 262932 266423 269825 272821 274583 274973 274889 275401 276719 278067 278504 277945 277289 277343
53683 277343 277739 277300 275511 273102 270993 269206 267226 265061 263338 262492 262256 261964 261109 259680 258226 257472
53667 257472 257635 258167 258280 257565 256046 254085 252502 252326 253775 255749 256890 257088 257383 258448 259795 260567
$$ packed form
53776B61215m616m724n299n780n298l892k784k923l727l871k944j616n39J10J19
53761B13431p43k048k844k771k430k357k246j639q09l99m81o16o17o76q32q01
53745A91122m76q8K43P40J465J910J491L36p77j298j396j427j283o23L92J043
53729A91374Q95L57J81O04J253J732J953J934J659J262J055J176J481J922K733
53714B11571L862M548M000K514J295J001J088R03P86J408K450K947K823L087M208
53699B48491N227N086M128L491L402K996J762L90q4N12J318J348M37n59o56N4
53683B77343L96m39j789k409k109j787j980k165j723q46k36k92q55j429j454p54
53667B57472J63N32J13p15j519j961j583j76J449J974J141J98K95J065J347P72
$$ plain form
53651 260567 260540 260103 259718 259710 260263 261256 262206 262636 262554 262560 263474 265719 268869 271919 274219 276038 278000 280235
53633 280235 282416 284439 286497 288545 290298 291899 294058 297239 301128 305179 309382 314100 319372 324683
53619 324683 329392 333233 336431 339403 342303 344839 346677 348041 349672 352173 355526 359269 362929 366318
53605 366318 369613 373182 377096 380790 383499 385054 386023 387057 388363 389806 391122 391963 392065 391573 390892
53590 390892 390133 388982 387287 385450 383988 382940 381951 380789 379552 378428 377388 376125 374320 372036 369759
53575 369759 367895 366311 364641 362916 361568 360914 360980 361740 362977 363936 363755 362464 361018 360118 359568 359073
53559 359073 359101 360299 362453 364574 365893 366323 366168 365891 366067 367037 368514 369874 370932 372195 374281 377248
53543 377248 380570 383704 386686 390125 394440 399135 403195 406395 409832 414890 421950 430417 439642 449317
$$ packed form
53651B60567k7m37l85qN53R93R50M30q2OR14K245L150L050K300J819J962K235
53633B80235K181K023K058K048J753J601K159L181L889M051M203M718N272N311
53619C24683M709L841L198K972K900K536J838J364J631K501L353L743L660L389
53605C66318L295L569L914L694K709J555R69J034J306J443J316Q41J02m92o81
53590C90892p59j151j695j837j462j048r89j162j237j124j040j263j805k284k277
53575C69759j864j584j670j725j348o54O6P60J237R59j81j291j446r00n50m95
53559C59073K8J198K154K121J319M30j55k77J76R70J477J360J058J263K086K967
53543C77248L322L134K982L439M315M695M060L200L437N058P060Q467R225R675
$$ plain form
53529 449317 459137 468790 478427 488651 499851 511810 524146 536828 550052 563824 577980 592550
53517 592550 607861 624244 641801 660503 680328 701195 722869 745148 768095 791868 816269
53506 816269 840698 864690 888252 911487 934127 955794 976475 996364 1015347 1033122 1049837
53495 1049837 1066181 1082725 1099555 1116563 1133687 1150745 1167456 1183831 1200197 1216728 1233293
53484 1233293 1249879 1266759 1283998 1301147 1317590 1332837 1346386 1357779 1367025 1374492 1380155 1383407
53472 1383407 1383906 1382073 1378397 1372858 1365504 1356980 1347718 1337007 1323724 1307900 1290911 1274188 1258273
53459 1258273 1242993 1227801 1211931 1194842 1176763 1158399 1140100 1121724 1103288 1085155 1067459
53448 1067459 1049788 1031697 1013272 995157 978333 963841 952274 943377 936456 931188 927655 925579
$$ packed form
53529D49317R820R653R637J0224J1200J1959J2336J2682J3224J3772J4156J4570
53517E92550J5311J6383J7557J8702J9825K0867K1674K2279K2947K3773K4401
53506H16269K4429K3992K3562K3235K2640K1667K0681J9889J8983J7775J6715
53495A049837J6344J6544J6830J7008J7124J7058J6711J6375J6366J6531J6565
53484A233293J6586J6880J7239J7149J6443J5247J3549J1393R246P467N663L252
53472A383407M99j833l676n539p354q524r262j0711j3283j5824j6989j6723j5915
53459A258273j5280j5192j5870j7089j8079j8364j8299j8376j8436j8133j7696
53448A067459j7671j8091j8425j8115j6824j4492j1567q897o921n268l533k076
$$ plain form
53436 925579 924143 922861 922225 923105 925655 929070 932349 935163 938047 941861 947002 953232 960403 969139 980378
53421 980378 994253 1009917 1026577 1044340 1063785 1085103 1108017 1132258 1157751 1184370 1211909
53410 1211909 1240386 1270138 1301510 1334484 1368684 1403737 1439648 1476859 1515988 1557532 1601744
53399 1601744 1648550 1697448 1747660 1798596 1850156 1902373 1954888 2007050 2058542 2109625 2160613
53388 2160613 2211230 2260639 2308081 2353434 2397099 2439254 2479252 2515911 2548450 2576908 2601525
53377 2601525 2622058 2638034 2649469 2656834 2660279 2659235 2652821 2640365 2621482 2596049 2564336 2527104
53365 2527104 2485442 2440526 2393434 2344951 2295453 2245076 2194061 2142868 2092056 2042143 1993600
53354 1993600 1946840 1902257 1860190 1820577 1782558 1744852 1706868 1669156 1632423 1596488 1560745
$$ packed form
53436I25579j436j282o36Q80K550L415L279K814K884L814N141O230P171Q736J1239
53421I80378J3875J5664J6660J7763J9445K1318K2914K4241K5493K6619K7539
53410A211909K8477K9752L1372L2974L4200L5053L5911L7211L9129M1544M4212
53399A601744M6806M8898N0212N0936N1560N2217N2515N2162N1492N1083N0988
53388B160613N0617M9409M7442M5353M3665M2155L9998L6659L2539K8458K4617
53377B601525K0533J5976J1435P365L445j044o414j2456j8883k5433l1713l7232
53365B527104m1662m4916m7092m8483m9498n0377n1015n1193n0812m9913m8543
53354A993600m6760m4583m2067l9613l8019l7706l7984l7712l6733l5935l5743
$$ plain form
53343 1560745 1525396 1491438 1459460 1429172 1400328 1373445 1349240 1327828 1308785 1291661 1276088
53332 1276088 1261791 1248806 1237388 1227287 1217381 1206415 1194005 1180671 1167061 1153549 1140455
53321 1140455 1128250 1117398 1108127 1100328 1093608 1087585 1082353 1078508 1076512 1076104 1076575 1077545 1079188 1081793
53307 1081793 1085409 1090004 1095649 1102366 1110033 1118729 1129083 1141987 1157846 1176250 1196445 1217895
53295 1217895 1240300 1263304 1286563 1310161 1334586 1360093 1386214 1412023 1436663 1459459 1479777
53284 1479777 1497195 1511849 1524273 1534748 1542843 1547720 1548878 1546625 1541796 1534989 1526115 1514823 1501195
53271 1501195 1485715 1468572 1449471 1428338 1405702 1382054 1357241 1331005 1303875 1276947 1250811
53260 1250811 1225137 1199204 1172492 1144908 1116967 1089714 1063980 1039636 1015880 992170 968471
$$ packed form
53343A560745l5349l3958l1978l0288k8844k6883k4205k1412j9043j7124j5573
53332A276088j4297j2985j1418j0101r906j0966j2410j3334j3610j3512j3094
53321A140455j2205j0852r271p799o720o023n232l845j996m08M71R70J643K605
53307A081793L616M595N645O717P667Q696J0354J2904J5859J8404K0195K1450
53295A217895K2405K3004K3259K3598K4425K5507K6121K5809K4640K2796K0318
53284A479777J7418J4654J2424J0475Q095M877J158k253m829o807q874j1292j3628
53271A501195j5480j7143j9101k1133k2636k3648k4813k6236k7130k6928k6136
53260A250811k5674k5933k6712k7584k7941k7253k5734k4344k3756k3710k3699
$$ plain form
53249 968471 944796 921167 897941 875486 853488 831276 808937 787390 767103 747489 727977
53238 727977 708925 691009 674381 659152 646127 636152 628871 622840 616890 610850 605033 599519 593972
53225 593972 587712 579936 570301 559338 547926 536280 523828 510205 496008 482305 469589 457502
53213 457502 445569 434023 423743 415345 408430 401884 394854 387278 379605 372355 365957 360517 355455
53200 355455 349728 342828 335387 328513 322672 317522 312591 307688 302708 297502 292126 286956 282484 278986
53186 278986 276397 274325 272297 270173 268195 266469 264556 261916 258710 255732 253484 251602 249404 246801
53172 246801 244433 242957 242367 242058 241485 240659 240032 239943 240280 240609 240465 239486 237527 234838 232089 230020 228969
53155 228969 228766 229011 229415 229870 230296 230524 230424 230102 229702 229008 227574 225568 224172 224604 226768 229314 231009
$$ packed form
53249I68471k3675k3629k3226k2455k1998k2212k2339k1547k0287j9614j9512
53238G27977j9052j7916j6628j5229j3025r975p281o031n950o040n817n514n547
53225E93972o260p776r635j0963j1412j1646j2452j3623j4197j3703j2716j2087
53213D57502j1933j1546j0280q398o915o546p030p576p673p250o398n440n062
53200C55455n727o900p441o874n841n150m931m903m980n206n376n170m472l498
53186B78986k589k072k028k124j978j726j913k640l206k978k248j882k198k603
53172B46801k368j476n90l09n73q26o27q9L37L29j44r79j959k689k749k069j051
53155B28969k03K45M04M55M26K28j00l22m00o94j434k006j396M32K164K546J695
$$ plain form
53138 231009 231554 231084 229657 227602 225776 224888 224789 224850 224787 224774 225042 225771 227130 228961 230553 231227 231104 230984
53120 230984 231509 232718 234213 235440 235955 235848 235814 236429 237428 238039 237915 237333 236568 235583 234382 233153 231924
53103 231924 230448 228620 226709 225074 223855 223021 222476 222059 221672 221470 221665 222107 222329 222025 221291 220343 219323
53086 219323 218408 217757 217266 216653 215980 215766 216380 217515 218487 218947 219079 219219 219464 219664 219643 219342 218796 218060 217260
53067 217260 216635 216286 215832 214636 212624 210586 209352 208847 208333 207404 206326 205439 204769 204297 204161 204457 205178
53050 205178 206378 208046 209765 210922 211383 211577 211831 212054 212205 212480 212761 212468 211402 210246 209729 209697 209624
53033 209624 209665 210434 211802 212799 212863 212566 212773 213599 214515 215094 215220 214875 214224 213809 214228 215546 217280 218961
53015 218961 220426 221555 222091 221937 221440 221087 221062 221274 221703 222345 222840 222583 221454 220168 219595 219806 220060 219659
$$ packed form
53138B31009N45m70j427k055j826q88r9O1o3j3K68P29J359J831J592O74j23j20
53120B30984N25J209J495J227N15j07l4O15R99O11j24n82p65r85j201j229j229
53103B31924j476j828j911j635j219q34n45m17l87k02J95M42K22l04p34r48j020
53086B19323r15o51m91o13o73k14O14J135R72M60J32J40K45K00k1l01n46p36q00
53067B17260o25l49m54j196k012k038j234n05n14r29j078q87o70m72j36K96P21
53050B05178J200J668J719J157M61J94K54K23J51K75K81k93j066j156n17l2p3
53033B09624M1P69J368R97O4k97K07Q26R16N79J26l45o51m15M19J318J734J681
53015B18961J465J129N36j54m97l53k5K12M29O42M95k57j129j286n73K11K54m01
$$ plain form
52997 219659 218544 217072 215634 214643 214593 215713 217583 219301 220200 220403 220636 221546 223161 224958 226383 227296
52981 227296 227982 228854 230199 232095 234412 236833 238972 240599 241818 242966 244214 245267 245623 245254 244852
52966 244852 245136 246027 246810 247102 247193 247391 247509 247293 246874 246393 245538 244016 242237 240896 239957 238660 236666
52949 236666 234677 233653 233720 234032 233485 231564 228778 226345 225112 224768 224395 223713 223240 223222 223104 222383 221405
52932 221405 220836 220742 220714 220621 220689 220991 221315 221503 221512 221179 220334 219166 218181 217687 217551 217457 217221 216849 216464 216208 216124
52911 216124 216207 216633 217692 219300 220798 221561 221646 221557 221505 221325 221010 220833 220807 220526 219773 219003 218905 219664 220841
52892 220841 221892 222584 222990 223276 223528 223673 223537 223022 222267 221618 221385 221537 221647 221277 220470 219752 219574 219932
52874 219932 220620 221642 223132 225038 227169 229395 231537 233190 234092 234635 235601 237304 239354 241312 243118
$$ packed form
52997B19659j115j472j438r91n0J120J870J718Q99K03K33R10J615J797J425R13
52981B27296O86Q72J345J896K317K421K139J627J219J148J248J053L56l69m02
52966B44852K84Q91P83K92R1J98J18k16m19m81q55j522j779j341r39j297j994
52949B36666j989j024O7L12n47j921k786k433j233l44l73o82m73j8j18p21r78
52932B21405n69r4k8r3O8L02L24J88Rl33q45j168r85m94j36r4k36l72l85k56q4
52911B16124Q3M26J059J608J498P63Q5q9n2j80l15j77k6k81p53p70r8P59J177
52892B20841J051O92M06K86K52J45j36n15p55o49k33J52J10l70q07p18j78L58
52874B19932O88J022J490J906K131K226K142J653R02N43R66J703K050J958J806
$$ plain form
52859 243118 244734 245872 246360 246418 246217 245500 243998 241894 239417 236253 231977 226962 222218 218306 214989
52844 214989 212067 209901 208776 208302 207963 207835 208180 208573 208154 206797 205406 204830 204959 205164 205230 205427 205907
52827 205907 206498 207010 207303 207052 205908 204131 202709 202486 203302 204305 205034 205805 206926 207977 208244 207757 207504
52810 207504 208491 210805 213710 216359 218196 218933 218589 217611 216547 215484 214054 212133 210195 208688 207331
52795 207331 205490 203116 200897 199468 198891 198948 199500 200280 200760 200597 200116 200062 200932 202711 205052 207473 209464
52778 209464 210709 211148 210748 209430 207503 205921 205605 206480 207551 207977 207680 206907 205704 204096 202454 201336
52762 201336 201078 201653 202682 203457 203383 202714 202545 203621 205384 206653 207059 207281 207977 209090 210287 211460 212532
52745 212532 213334 214114 215736 218775 222581 225738 227498 228394 229395 230820 232183 232814 232457 231440 230472 230236
$$ packed form
52859B43118J616J138M88N8k01p17j502k104k477l164m276n015m744l912l317
52844B14989k922k166j125m74l39j28L45L93m19j357j391n76J29K05O6J97M80
52827B05907N91N12K93k51j144j777j422k23Q16J003P29P71J121J051K67m87k53
52810B07504R87K314K905K649J837P37l44r78j064j063j430j921j938j507j357
52795B07331j841k374k219j429n77N7N52P80M80j63m81n4Q70J779K341K421J991
52778B09464J245M39m00j318j927j582l16Q75J071M26k97p73j203j608j642j118
52762B01336k58N75J029P75p4o69j69J076J763J269M06K22O96J113J197J173J072
52745B12532Q02P80J622L039L806L157J760Q96J001J425J363O31l57j017r68k36
$$ plain form
52729 230236 230974 232394 233977 235343 236325 236766 236425 235164 233174 230881 228565 226263 224149 222815 222815 223869
52713 223869 224896 225009 224322 223652 223626 224267 225170 225785 225637 224611 223098 221712 220871 220667 220886 220961 220189 218414
52695 218414 216452 215463 215895 217254 218787 220034 220788 221049 221171 221673 222673 223698 224211 224074 223422 222380
52679 222380 221098 219868 219056 218984 219855 221540 223436 224827 225488 225659 225469 224803 223813 223034 222725 222541 222206
52662 222206 222097 222755 224124 225714 227308 229059 231066 233263 235625 238080 240326 242079 243370 244285 244570
52647 244570 243950 242719 241521 240523 239228 237200 234648 232205 230418 229556 229588 230233 231143 232096 232905 233293 233130
52630 233130 232754 232821 233830 235937 238994 242463 245422 247094 247396 246760 245543 243969 242439 241342 240486 239193
52614 239193 237097 234576 232384 231145 231099 231901 232709 232963 233062 233774 235019 235924 236181 236535 237561 238731 239259
$$ packed form
52729B30236P38J420J583J366R82M41l41j261j990k293k316k302k114j334%J054
52713B23869J027J13o87o70k6O41R03O15j48j026j513j386q41k04K19P5p72j775
52695B18414j962r89M32J359J533J247P54K61J22N02J000J025N13j37o52j042
52679B22380j282j230q12p2Q71J685J896J391O61J71j90o66r90p79l09j84l35
52662B22206j09O58J369J590J594J751K007K197K362K455K246J753J291R15K85
52647B44570o20j231j198r98j295k028k552k443j787q62L2O45R10R53Q09L88j63
52630B33130l76O7J009K107L057L469K959J672L02o36j217j574j530j097q56j293
52614B39193k096k521k192j239m6Q02Q08K54R9P12J245R05K57L54J026J170N28
$$ plain form
52597 239259 239344 239823 240895 241895 242271 242198 242161 242399 242888 243622 244678 246040 247365 248019 247606 246566 246017 246732
52579 246732 248393 249949 250567 250184 249378 248808 248620 248335 247566 246742 246644 247205 247456 246846 245923 245254 244418 242814
52561 242814 240855 239439 238586 237607 236514 236164 236824 237593 237650 237296 237216 237443 237646 237962 238770 239905 240785 241244
52543 241244 241580 241825 241626 241031 240741 241229 242048 242505 242695 243279 244390 245383 245806 245967 246274 246582 246657 246862 247713
52524 247713 248990 249922 250204 250178 250035 249550 248762 248200 248108 248130 248138 248731 250321 252299 253902 255543 258452 263010
52506 263010 268165 272513 275379 276721 276604 275076 272290 268507 264140 259744 255717 252022 248493 245398
52492 245398 243316 242440 242321 242367 242285 242002 241499 240843 240200 239707 239470 239604 240121 240917 242060 243824 246074 247912
52474 247912 248500 248101 247703 247727 247821 247978 248970 251312 254506 257774 260995 264373 267663 270405 272712 275154
$$ packed form
52597B39259Q5M79J072J000L76p3l7K38M89P34J056J362J325O54m13j040n49P15
52579B46732J661J556O18l83q06n70j88k85p69q24r8N61K51o10r23o69q36j604
52561B42814j959j416q53r79j093l50O60P69N7l54q0K27K03L16Q08J135Q80M59
52543B41244L36K45j99n95k90M88Q19M57J90N84J111R93M23J61L07L08P5K05Q51
52524B47713J277R32K82k6j43m85p88n62r2K2QN93J590J978J603J641K909M558
52506B63010N155M348K866J342j17j528k786l783m367m396m027l695l529l095
52492B45398k082q76j19M6q2k83n03o56o43m93k37J34N17P96J143J764K250J838
52474B47912N88l99l98K4R4J57R92K342L194L268L221L378L290K742K307K442
$$ plain form
52458 275154 277831 279939 280381 278629 275158 271199 267874 265296 262662 259419 256060 253419 251460 249251
52444 249251 246164 242668 239885 238616 238889 240199 241947 243679 245010 245600 245400 244856 244577 244708 244909 244996
52428 244996 245217 245720 246147 246084 245591 245032 244683 244871 246048 248232 250640 252434 253646 254886 256398 258095
52412 258095 260358 263907 268785 274261 280091 287210 296659 308189 320211 330746 338192 341687 341366 338069
52398 338069 332519 324992 316032 306968 299201 293185 288582 285157 282934 281628 280652 279791 279358 279553 280083
52383 280083 280554 280878 281136 281392 281812 282642 283922 285455 287179 289244 291692 294467 297889 302562 308460 314549
52367 314549 319820 324308 328515 332138 334152 334216 333300 332654 332639 332788 332573 331756 330326 328547 326958 326054 325992
52350 325992 326703 328129 330164 332577 335181 337981 341000 344141 347413 351089 355334 359867 364384 369219
$$ packed form
52458B75154K677K108M42j752l471l959l325k578k634l243l359k641j959k209
52444B49251l087l496k783j269K73J310J748J732J331N90k00n44k79J31K01Q7
52428B44996K21N03M27o3m93n59l49J88J177K184K408J794J212J240J512J697
52412B58095K263L549M878N476N830P119R449J1530J2022J0535P446L495l21l297
52398C38069n550p527q960r064p767o016m603l425k223j306r76q61m33J95N30
52383B80083M71L24K58K56M20Q30J280J533J724K065K448K775L422M673N898O089
52367C14549N271M488M207L623K014O4r16o46j5J49k15q17j430j779j589r04o2
52350C25992P11J426K035K413K604K800L019L141L272L676M245M533M517M835
$$ plain form
52336 369219 375124 382318 390169 398018 406060 415177 426116 439046 453721 469752 486777 504658 523561
52323 523561 543668 564769 586323 607914 629405 650496 670428 688545 705123 721252 737674
52312 737674 754060 769661 784496 799421 815017 830834 845939 859921 872990 885262 896359
52301 896359 905885 914057 921632 929197 936589 943021 947600 949685 948843 944842 937919 928961 919093 909027
52287 909027 898998 889329 880624 873150 866358 859519 852811 847438 844577 844507 846830 851171 857306 864789
52273 864789 872972 881597 891090 901953 913968 926344 938634 951101 963947 976612 988300 999021
52261 999021 1009630 1020846 1032682 1044785 1056754 1068056 1078288 1087837 1097673 1107989 1117485 1124534
52249 1124534 1128708 1130645 1130782 1128905 1124735 1118216 1109236 1097796 1084519 1070397 1055954 1041200 1026461
$$ packed form
52336C69219N905P194P851P849Q042R117J0939J2930J4675J6031J7025J7881J8903
52323E23561K0107K1101K1554K1591K1491K1091J9932J8117J6578J6129J6422
52312G37674J6386J5601J4835J4925J5596J5817J5105J3982J3069J2272J1097
52301H96359R526Q172P575P565P392O432M579K085q42m001o923q958r868j0066
52287I09027j0029r669q705p474o792o839o708n373k861p0K323M341O135P483
52273H64789Q183Q625R493J0863J2015J2376J2290J2467J2846J2665J1688J0721
52261I99021J0609J1216J1836J2103J1969J1302J0232R549R836J0316R496P049
52249A124534M174J937J37j877m170o519q980j1440j3277j4122j4443j4754j4739
$$ plain form
52236 1026461 1012519 999668 987281 974729 962212 950383 939620 930135 922243 915943 910501 905071
52224 905071 899616 894787 891012 888136 885903 884371 883812 884441 886229 888800 891653 894703 898373 902894 907754
52209 907754 912296 916599 921184 925930 930008 933010 935539 938328 941332 944139 946921 950370 954778 959698
52195 959698 964550 969137 973406 977150 980312 983429 987291 992063 997014 1001263 1004489 1006624 1007115 1005056
52181 1005056 1000157 993206 985387 977407 969423 961419 953320 945002 936633 928882 922359 916993 912321 908328
52167 908328 905471 903886 903145 903035 904080 906885 911255 916310 921213 925463 928787 931270 933478 935963 938539
52152 938539 940394 940994 940583 939805 939241 939378 940570 942700 945193 947618 950014 952340 953990 954424 954156 954508
52136 954508 956269 959098 962416 966406 971840 979318 989038 1001061 1015373 1031841 1050430 1071415 1095038
$$ packed form
52236A026461j3942j2851j2387j2552j2517j1829j0763r485p892o300n442n430
52224I05071n455m829l775k876k233j532n59O29J788K571K853L050L670M521M860
52209I07754M542M303M585M746M078L002K529K789L004K807K782L449M408M920
52195I59698M852M587M269L744L162L117L862M772M951M249L226K135M91k059
52181A005056m899o951p819p980p984q004q099q318q369p751o523n366m672l993
52167I08328k857j585p41j10J045K805M370N055M903M250L324K483K208K485K576
52152I38539J855O00m11p78n64J37J192K130K493K425K396K326J650M34k68L52
52136I54508J761K829L318L990N434P478R720J2023J4312J6468J8589K0985K3623
$$ plain form
52123 1095038 1121108 1149196 1179045 1210327 1242136 1273297 1303291 1332401 1360767 1387784 1412676
52112 1412676 1435250 1455663 1473725 1488826 1500391 1508144 1512174 1513128 1512197 1510528 1508639 1506571 1504314
52099 1504314 1501677 1497952 1492344 1484842 1476166 1466740 1456171 1443894 1429868 1414334 1397340 1378959
52087 1378959 1359714 1340381 1321512 1303646 1287779 1275005 1265534 1258513 1253083 1249327 1247982 1249477
52075 1249477 1253559 1259678 1267472 1276911 1288181 1301362 1316059 1331426 1346740 1361914 1377238 1392682
$$ packed form
52123A095038K6070K8088K9849L1282L1809L1161K9994K9110K8366K7017K4892
52112A412676K2574K0413J8062J5101J1565P753M030R54r31j669j889k068k257
52099A504314k637l725n608p502q676r426j0569j2277j4026j5534j6994j8381
52087A378959j9245j9333j8869j7866j5867j2774r471p021n430l756j345J495
52075A249477M082O119P794R439J1270J3181J4697J5367J5314J5174J5324J5444
$$ [...]
##END NTUPLES=NMR SPECTRUM
##END=
