##TITLE=AC1578_ROEFFECT0024_8271437_sAAOSwmTXq
##JCAMPDX= 6.0         $$ Bruker NMR JCAMP-DX V2.0
##DATA TYPE= NMR SPECTRUM
##DATA CLASS= NTUPLES
##ORIGIN= BRUKER
##OWNER= Administrator
$$ 1.72 TOPSPIN		Version 2.1
$$ 2013-10-18 22:10:54.473 -0700  Administrator@X
$$ Compression mode = diff/dup
##.OBSERVE FREQUENCY= 400.02188249412
##.OBSERVE NUCLEUS= ^1H
##.ACQUISITION MODE= SIMULTANEOUS (DQD)
##.ACQUISITION SCHEME= undefined
##.AVERAGES= 8
##.DIGITISER RES= 22
##SPECTROMETER/DATA SYSTEM= spect
##.PULSE SEQUENCE= zg30
##.SOLVENT NAME= COFFEE_meoh
##.SHIFT REFERENCE= INTERNAL, COFFEE_meoh, 1, 14.98509
##AUDIT TRAIL= $$ (NUMBER, WHEN, WHO, WHERE, PROCESS, VERSION, WHAT)
$$ ##TITLE= Audit trail, TOPSPIN		Version 2.1
$$ ##JCAMPDX= 5.01
$$ ##ORIGIN= Bruker BioSpin GmbH
$$ ##OWNER= Administrator
$$ $$ E:\/data/COFFEE/nmr/AC1578_ROEFFECT0024_8271437_sAAOSwmTXq/10/pdata/1/auditp.txt
$$ ##AUDIT TRAIL=  $$ (NUMBER, WHEN, WHO, WHERE, PROCESS, VERSION, WHAT)
(   1,<2013-10-18 22:10:47.473 -0700>,<Administrator>,<X>,<go>,<TOPSPIN 2.1>,
      <created by zg
	started at 2013-10-18 22:09:41.801 -0700,
	POWCHK enabled, PULCHK disabled,
       configuration hash MD5:
       C8 4E 4E 5D D3 5C D8 9E 9F 52 82 E0 59 8A DE 15
       data hash MD5: 64K
       08 09 C5 AF CF 00 A4 E0 08 38 98 89 A3 11 30 E3>)
(   2,<2013-10-18 22:10:50.504 -0700>,<Administrator>,<X>,<proc1d>,<TOPSPIN 2.1>,
      <Start of raw data processing
       efp LB = 0 FT_mod = 6 PKNL = 1 PHC0 = 0 PHC1 = 0 SI = 32K 
       data hash MD5: 32K
       89 7C 28 3E 06 E9 E3 67 D4 23 48 EB AE F6 D9 B9>)
(   3,<2013-10-18 22:10:50.801 -0700>,<Administrator>,<X>,<proc1d>,<TOPSPIN 2.1>,
      <pk PHC0 = 93.79578 PHC1 = 0 
       data hash MD5: 32K
       92 23 9B E3 02 BB 84 1E C4 FC D7 EE 58 FF 3B C2>)
(   4,<2013-10-18 22:10:51.004 -0700>,<Administrator>,<X>,<proc1d>,<TOPSPIN 2.1>,
      <abs ABSG = 1 
       data hash MD5: 32K
       A3 4E 52 80 C9 C4 85 DD 36 42 B3 C6 28 A3 D2 11>)
(   5,<2013-10-18 22:10:51.114 -0700>,<Administrator>,<X>,<proc1d>,<TOPSPIN 2.1>,
      <abs ABSG = 2 
       data hash MD5: 32K
       DC 43 A5 57 39 E9 1B 75 B6 81 D1 60 73 FB 85 D8>)
(   6,<2013-10-18 22:10:51.208 -0700>,<Administrator>,<X>,<proc1d>,<TOPSPIN 2.1>,
      <abs ABSG = 3 
       data hash MD5: 32K
       A5 8D CB 30 2E 5C F9 6D 19 A3 A4 80 B7 F9 31 A2>)
(   7,<2013-10-18 22:10:51.254 -0700>,<Administrator>,<X>,<proc1d>,<TOPSPIN 2.1>,
      <abs ABSG = 4 
       data hash MD5: 32K
       E3 0E 20 46 43 3A 10 83 64 F5 F0 90 98 53 F6 59>)
(   8,<2013-10-18 22:10:51.301 -0700>,<Administrator>,<X>,<proc1d>,<TOPSPIN 2.1>,
      <abs ABSG = 5 
       data hash MD5: 32K
       50 6E 12 10 77 56 24 85 4E 86 41 9C 72 74 48 78>)
$$ ##END=
$$ 
$$ $$ hash MD5
$$ $$ 40 36 62 13 FF AB 93 C0 3E D0 FC 14 71 68 05 F8
##$RELAX= 
##$RELAX= 
##$RELAX= 
##$RELAX= 
##$RELAX= 
##$RELAX= 
##$RELAX= 
$$ Bruker specific parameters
$$ --------------------------
##$DU= <E:\>
##$EXPNO= 10
$$ [...]
150 150 150 150 150 150 150 150
##$TP07= 0
##$TPNAME0= <>
##$TPNAME1= <>
##$TPNAME2= <>
##$TPNAME3= <>
##$TPNAME4= <>
##$TPNAME5= <>
##$TPNAME6= <>
##$TPNAME7= <>
##$TPOAL= (0..7)
0.5 0.5 0.5 0.5 0.5 0.5 0.5 0.5
##$TPOFFS= (0..7)
0 0 0 0 0 0 0 0
##$TUNHIN= 0
##$TUNHOUT= 0
##$TUNXOUT= 0
##$USERA1= <user>
##$USERA2= <user>
##$USERA3= <user>
##$USERA4= <user>
##$USERA5= <user>
##$V9= 5
##$VALIST= <valist>
##$VCLIST= <CCCCCCCCCCCCCCC>
##$VD= 0
##$VDLIST= <DDDDDDDDDDDDDDD>
##$VPLIST= <PPPPPPPPPPPPPPP>
##$VTLIST= <TTTTTTTTTTTTTTT>
##$WBST= 1024
##$WBSW= 4
##$XGAIN= (0..3)
0 0 0 0
##$XL= 0
##$YL= 0
##$YMAX_a= 653781
##$YMIN_a= -555166
##$ZGOPTNS= <>
##$ZL1= 120
##$ZL2= 120
##$ZL3= 120
##$ZL4= 120
##$ABSF1= 14.98509
##$ABSF2= -5.573092
##$ABSG= 5
##$ABSL= 3
##$ALPHA= 0
##$AQORDER= 0
##$ASSFAC= 0
##$ASSFACI= 0
##$ASSFACX= 0
##$ASSWID= 0
##$AUNMP= <proc_prof1d_extract_pilot.lims>
##$AXLEFT= 0
##$AXNAME= <>
##$AXNUC= <1H>
##$AXRIGHT= 0
##$AXTYPE= 0
##$AXUNIT= <>
##$AZFE= 0.1
##$AZFW= 0.1
##$BCFW= 0
##$BC_mod= 0
##$BYTORDP= 0
##$COROFFS= 0
##$CY= 15
##$DATMOD= 1
##$DC= 0
##$DFILT= <>
##$DTYPP= 0
##$F1P= 0
##$F2P= 0
##$FCOR= 0.5
##$FTSIZE= 32768
##$FT_mod= 6
##$GAMMA= 0
##$GB= 0
##$INTBC= 1
##$INTSCL= 1
##$ISEN= 128
##$LB= 0
##$LEV0= 0
##$LPBIN= 0
##$MAXI= 10000
##$MC2= 0
##$MEAN= 0
##$ME_mod= 0
##$MI= 0
##$NCOEF= 0
##$NC_proc= -8
##$NLEV= 6
##$NOISF1= 0
##$NOISF2= 0
##$NSP= 0
##$NTH_PI= 0
##$NZP= 0
##$OFFSET= 14.98509
##$PC= 1
##$PHC0= 93.79578
##$PHC1= 0
##$PH_mod= 1
##$PKNL= yes
##$PPARMOD= 0
##$PPDIAG= 0
##$PPIPTYP= 0
##$PPMPNUM= 2147483647
##$PPRESOL= 1
##$PSCAL= 4
##$PSIGN= 0
##$PYNMP= <proc.py>
##$REVERSE= no
##$SF= 400.02
##$SI= 32768
##$SIGF1= 0
##$SIGF2= 0
##$SINO= 400
##$SIOLD= 32768
##$SPECTYP= <>
##$SREGLST= <1H.CDCl3>
##$SSB= 0
##$STSI= 32768
##$STSR= 0
##$SW_p= 8223.68421052631
##$SYMM= 0
##$S_DEV= 0
##$TDeff= 65536
##$TDoff= 0
##$TI= <>
##$TILT= no
##$TM1= 0
##$TM2= 0
##$TOPLEV= 0
##$USERP1= <user>
##$USERP2= <user>
##$USERP3= <user>
##$USERP4= <user>
##$USERP5= <user>
##$WDW= 1
##$XDIM= 32768
##$YMAX_p= 446563150
##$YMIN_p= -707520
##$CURPLOT= <Network HP LaserJet P1505>
##$CURPRIN= <$Network HP LaserJet P1505>
##$DFORMAT= <normdp>
##$LAYOUT= <+/1D_H.xwp>
##$LFORMAT= <normlp>
##$PFORMAT= <normpl>
##$SURQMSG= 1
$$ End of Bruker specific parameters
$$ ---------------------------------
##NTUPLES= NMR SPECTRUM
##VAR_NAME=  FREQUENCY,     SPECTRUM/REAL,   SPECTRUM/IMAG
##SYMBOL=    X,             R,               I
##VAR_TYPE=  INDEPENDENT,   DEPENDENT,       DEPENDENT
##VAR_FORM=  AFFN,          ASDF,            ASDF
##VAR_DIM=   32768,         32768,           32768
##UNITS=     HZ,            ARBITRARY UNITS, ARBITRARY UNITS
##FACTOR=    0.250966925370066, 1,           1
##FIRST=     8223.43324360094, -26519,       -37610
##LAST=      0,             -54157,          -287343
##MIN=       0,             -707520,         0
##MAX=       8223.43324360094, 446563150,    0
$$ Real data points
##PAGE= N=1
##DATA TABLE= (X++(R..R)), XYDATA
$$ [...]
$$ plain form
19534 46135 -34097 -183053 -204624 -175925 -201812 -150781 -87307 210327 -336423 -7878 78384
19522 66469 196120 139831 78770 -47407 100738 -140941 -268486 -202270 -333202 -74662 37180
19510 193109 -152342 -187762 91495 -332025 -234474 123329 -126261 99226 -49132 -112547 -52082
19498 144632 -167413 -57648 194563 1103 204991 -214173 -91371 -3034 -58153 -100472 -95778
19487 -95778 -43624 -269280 53732 16586 -105456 -322590 129735 117377 -215166 188404
19476 42986 11431 -14650 -83355 -40749 -46524 -30251 -128948 -185505 -65845 -119090 -181897 -405246
19464 -405246 -68048 8760 -21003 -111578 -28119 -156553 234192 -96619 -61866 -354977 -56827
19452 247727 -52296 -183983 147698 -89631 -260597 -301582 -42509 480101 -110513 -116481 -47344
$$ packed form
19534D6135c4097j48956k1571K8699k5887N1031O3474B10327c36423g878G8384
19522F6469J29651n6289o1061d7407A00738a40941j27545O6216j30932g4662C7180
19510A93109a52342l5420I1495c32025R7551A23329a26261I9226d9132o3415e2082
19498A44632a67413e7648A94563A103K03888b14173i1371c034n5119m2319M694
19487i5778d3624k25656E3732A6586a05456k17134A29735j2358b15166A88404
19476D2986A1431a4650o8705d0749n775J6273r8697n6557f5845n3245o2807k23349
19464d05246f8048H760b1003r0575b8119j28434B34192i6619L4753k93111e6827
19452B47727e2296j31687A47698h9631j70966m0985d2509D80101a10513n968d7344
$$ plain form
19440 -43512 -99520 -175293 130275 -290191 71244 48922 -245734 98027 60626 -116671 33455
19428 29479 -14680 -49781 -247295 161626 -81875 266039 -221454 -185142 164369 -175285
19417 -149647 17520 193942 -716 -69297 -51197 46028 200058 -25125 -68040 -167417 -73566
19405 33349 -87551 -193142 -51956 102301 -71629 -58606 172994 4206 -125216 -88543 -114085
19394 -114085 -80174 -40899 69900 -58341 -63760 142163 -135781 1218 19096 97134 232603
19383 232603 -255578 -28413 -34784 234658 84598 -94496 -82938 -158544 -472 -22115 -184993
19372 -184993 -164051 164912 -409776 -165407 -220212 -67775 13443 135887 210080 44072 4518
19360 292392 -161488 -289287 -41523 -142665 -85244 211605 47402 -505815 163435 -192848
$$ packed form
19440d3512n6008p5773A30275b90191G1244k2322b45734I8027l7401a16671C3455
19428B9479a4680l5101j97514A61626h1875B66039b21454L6312A64369a75285
19417a49647A7520J76422g16o8581J8100D6028J54030b5125m2915r9377g3566
19405C3349h7551j05591e1956A02301g1629J3023A72994D206a25216L6673k5542
19394a14085L3911L9275F9900e8341n419A42163a35781A218J7878P8038J35469
19383B32603b55578b8413o371B34658H4598i4496J1558p5606d72k1643j62878
19372a84993K0942A64912d09776a65407n4805f7775A3443J22444P4193D4072D518
19360B92392a61488j27799d1523j01142N7421B11605D7402e05815A63435a92848
$$ plain form
19349 -107656 -142822 -154796 -307986 -286431 301706 -235513 -284996 173731 -172684 -304941
19339 -304941 -11697 -321091 -58878 -234175 16690 -223527 118753 182959 71580 181151
19329 181151 -412648 97283 -73225 151909 5434 -243946 -49378 24134 -354228 207280 -248817
19317 51572 -134178 82835 -64457 -51466 -114702 161820 -111854 -359001 -100236 174890
19306 -233454 174142 18061 62103 -462678 -177002 -93459 -75759 -107732 -167063 28448 118364
19295 118364 256945 -234546 -136418 217863 -92768 114616 253771 147930 20377 40742
19285 40742 -120168 -143789 -258684 127606 84128 83028 53201 87934 71636 136944 -441447
19273 231198 73157 -17914 -389239 -212934 -135388 -319477 198017 53459 -87287 104677
$$ packed form
19349a07656l5166j1974j53190K1555C01706b35513m9483A73731a72684j32257
19339c04941a1697l09394e8878j75297A6690b23527A18753O4206G1580J09571
19329A81151d12648I7283g3225A51909E434b43946d9378B4134c54228B07280b48817
19317E1572a34178H2835f4457J2991o3236A61820a11854k47147a00236A74890
19306b33454A74142A8061M4042d62678a77002Q3543J7700l1973n9331B8448Q9916
19295A18364J38581b34546R8128B17863i2768A14616J39155j05841B0377K0365
19285D0742a20168k3621j14895A27606m3478j100k9827L4733j6298O5308d41447
19273B31198G3157a7914l71325J76305P7546j84089A98017E3459h7287A04677
$$ plain form
19262 167442 -39014 151255 -44183 94389 -137020 -92249 -42883 -51897 -232901 45722 -8350
19250 147607 50086 -207132 70627 -81114 -121957 -24873 -355299 -1042 -5153 -99832 266473
19238 32490 -124927 -231461 -95762 -124480 -163398 -256098 -529088 -226464 -76756 272330 -288800
19226 -142632 3404 -144795 146358 -10097 -214417 -426925 -116784 53366 102349 -168408
19215 -172271 213384 -373184 -148683 -191962 -208700 -211274 -62462 19171 184614 -205307 60871
19203 163986 -322322 371129 153439 79757 -390785 176842 -243834 -27705 -87082 -188176
19193 -188176 126310 82950 -256618 -2688 48341 -182885 -139720 38205 -37334 190241 -18648
19181 -95001 -25900 -123962 71190 130397 -245391 -368480 -382900 59911 -57228 15069 75549
$$ packed form
19262A67442c9014A51255d4183I4389a37020M4771d2883r014j81004D5722h350
19250A47607E0086b07132G0627h1114m0843b4873l30426a042m111r4679B66473
19238C2490a24927j06534i5762k8718l8918r2700k72990b26464g6756B72330b88800
19226a42632C404a44795A46358a0097k04320k12508a16784E3366M8983a68408
19215a72271B13384c73184a48683m3279j6738k574f2462A9171J65443b05307F0871
19203A63986c22322C71129A53439p3682c90785A76842b43834b7705n9377j01094
19193a88176A26310m3360b56618b688D8341a82885M3165C8205c7334A90241a8648
19181i5001b5900r8062G1190N9207b45391j23089j4420E9911e7228A5069O0480
$$ plain form
19170 75549 -82158 19330 -34996 -29062 -114508 337843 -57635 65834 94021 -315135 -395401
19159 -395401 -149256 2143 -158622 119018 44837 -35045 -58430 -91298 -140765 -207052 53968
19147 85045 131012 -325791 371574 -180790 -77075 172211 1257 170496 251190 -133102 -201703
19136 -201703 106788 -7383 112322 -32988 242681 157385 -79730 41226 -97698 81546 -227639
19124 -225953 78828 177042 -427186 -106092 9851 -238162 21697 -89221 209522 -6883 -59681
19113 -59681 -145423 326264 -121893 -1449 -202101 -51868 36725 216491 -220095 97475 -194006
19101 7303 -134072 -126070 -322695 -263807 44850 -40747 -88228 46185 -267210 -161782 -266933
19090 -266933 -24245 -16547 -165676 -412940 182773 39748 96298 101971 -56034 -224727 248092
$$ packed form
19170G5549h2158A9330c4996N934q5446C37843e7635F5834K8187c15135q0266
19159c95401a49256B143a58622A19018D4837c5045k3385l2868m9467o6287E3968
19147H5045M5967c25791C71574a80790g7075A72211A257J69239Q0694a33102o8601
19136b01703A06788g383A12322c2988B42681q5296g9730D1226i7698H1546b27639
19124b25953G8828R8214d27186a06092I851b38162B1697h9221B09522f883n2798
19113e9681q5742C26264a21893a449k00652e1868C6725J79766b20095I7475a94006
19101G303a34072Q002j96625N8888D4850d0747m7481D6185b67210J05428j05151
19090b66933b4245P698j49129k47264A82773C9748N6550N673e6034j68693B48092
$$ plain form
19078 -335589 -52004 153879 15160 -232952 -161058 172718 124384 222200 -26095 -150346 -207188
19067 -207188 120756 -47658 -306661 -49711 -323975 273505 -60473 -173558 184736 126866
19057 126866 -57189 -172896 -42951 25516 106580 -74871 81653 -177023 137550 -40218 129374
19045 117269 -19904 22794 -141328 -14927 -43052 37634 -129883 400519 65602 -20506 111237
19033 50789 171251 -146804 -166450 33460 107984 28790 -215778 240379 -8498 43152 -36577
19021 31791 145412 -60946 -17935 -128964 191680 -158419 -389332 -13687 -56455 -69272 246858
19009 -136293 235762 90316 -176684 -197063 195086 148920 -55498 181069 20014 58044 -159361
18997 -207550 -246827 122318 149677 183846 -208961 164578 -218284 272448 208476 -172488
$$ packed form
19078c35589e2004A53879A5160b32952P1894A72718m8334R7816b6095j24251n6842
19067b07188A20756d7658k59003d9711k74264B73505f0473j13085A84736n7870
19057A26866e7189j15707d2951B5516Q1064g4871H1653a77023A37550d0218A29374
19045A17269a9904B2794a41328a4927k8125C7634a29883D00519F5602b0506A11237
19033E0789J20462a46804j9646C3460P4524B8790b15778B40379h498D3152c6577
19021C1791J13621f0946a7935j11029A91680a58419k30913a3687m2768j2817B46858
19009a36293B35762I0316a76684k0379A95086m6166e5498A81069B0014L8030a59361
18997b07550l9277A22318K7359L4169b08961A64578b18284B72448o3972a72488
$$ plain form
18986 179969 37903 -65822 217571 -222440 -414593 -5422 404131 -68302 -184153 -288631
18976 -288631 -145949 -156817 92499 -281315 -63878 -8101 -92027 -4901 -14091 42217 -332439
18964 -7655 32221 -94422 -72048 10838 52659 -62378 -116845 -324006 -216488 -66123 140609
18952 318986 -184334 -157374 -43318 -291056 174322 -175652 -250455 72234 199781 -18705
18941 -41327 239142 -234616 83502 -351704 -128633 375793 49025 -13229 -103772 -549733
18931 -549733 67187 -132413 -10136 -17691 -219709 340780 -98243 141094 -226371 -220571 -86754
18919 -246735 -41890 -171456 -182810 151044 -169303 -38530 -205583 37352 134680 131031 -357025
18907 400019 -44801 -134071 -220120 -93429 385134 -140193 -123105 -127679 -233952 39390 -195504
$$ packed form
18986A79969C7903f5822B17571b22440j92153e422D04131f8302j15851j04478
18976b88631J42682j0868I2499b81315f3878h101q3926d901r190D2217c32439
18964g655C2221i4422K2374A0838M1821f2378n4467k07161J07518f6123A40609
18952C18986a84334K6960d3318k47738A74322a75652p4803G2234J27547a8705
18941d1327B39142b34616H3502c51704a28633C75793D9025a3229r0543m45961
18931e49733F7187a32413a0136p555k02018C40780i8243A41094b26371N800h6754
18919b46735d1890j29566j1354A51044a69303c8530j67053C7352R7328l649c57025
18907D00019d4801q9270q6049i3429C85134a40193J7088m574j06273C9390a95504
$$ plain form
18895 -360518 -224095 -209184 -152231 10230 -145581 -315778 -147740 -24483 -22813 -145079 -202762
18884 -202762 160471 64324 -4140 68376 -131464 -258636 73156 -217024 -190789 -133182 294878
18872 187327 -55950 93972 126904 -53059 -296908 -279349 -40261 57975 333945 -81435 -112017
18861 -112017 -30661 312692 97556 -125146 131976 -210876 1834 164883 -15658 109762
18850 -188794 2490 263852 -190289 -172711 -215265 207925 -149803 -24697 -143053 92133 -68
18838 -69426 -130336 -36283 104475 -203026 51000 -262272 175190 -290361 -48171 -178679
18828 -178679 42327 178524 -301231 528727 -258229 -175309 105040 120820 128251 45315 113495
18817 113495 -82481 11818 -79790 36992 151890 110716 285523 -25839 228698 -19463 134776
$$ packed form
18895c60518J36423J4911N6953A0230a45581j70197a47740b4483J670j22266n7683
18884b02762A60471F4324d140F8376a31464j27172G3156b17024K6235N7607B94878
18872A87327e5950I3972L2932e3059k43849J7559d0261E7975K75970h1435l0582
18861a12017c0661C12692I7556a25146A31976b10876A834J63049a5658A09762
18850a88794B490K61362a90289J7578m2554B07925a49803b4697j18356I2133f8
18838f9426o0910c6283A04475b03026E1000b62272A75190b90361d8171j30508
18828a78679D2327J36197c01231E28727b58229Q2920A05040J5780P431D5315O8180
18817A13495h2481A1818g9790C6992J14898m1174J74807b5839B28698a9463A34776
$$ plain form
18805 -194128 151638 -43518 -245086 -80878 -163495 -110350 -130832 101680 -5572 -42790 31141
18793 -254211 -86017 100367 -88348 -56892 -85796 40656 -146182 82295 -184338 -76921 -270200
18782 -270200 36508 306537 21395 -78235 79210 231761 -207065 -225093 -431913 -161775
18771 -125231 22136 74210 10885 31657 50969 23370 -225871 45751 -441877 390184 211338
18760 211338 -134753 -55522 235911 -34383 -208267 -58573 65863 -79438 18835 -451147 81083
18748 -56112 50189 90054 21841 -156591 10421 -219861 -67155 -223684 -231306 -52469 -431001
18737 -431001 -59511 -22278 -131056 269042 173476 138920 135802 -178613 30406 17373 142412
18726 142412 -183071 -144522 377417 -209804 -76442 50269 44165 -216910 -75811 -50445 -131940
$$ packed form
18805a94128A51638d3518k01568h0878q2617N3145k0482A01680e572l7218C1141
18793b54211h6017A00367h8348L1456k8904D0656a46182H2295a84338g6921j93279
18782b70200C6508K70029B1395g8235G9210J52551b07065j8028k06820a61775
18771a25231B2136N2074A0885K0772J9312B3370b25871D5751d41877C90184j78846
18760B11338a34753e5522B35911c4383j73884e8573F5863g9438A8835d51147H1083
18748e6112E0189L9865B1841a56591A0421b19861f7155j56529p622e2469l78532
18737d31001e9511b2278j08778B69042r5566l4556l118a78613C0406j3033J25039
18726A42412a83071L8549C77417b09804g6442E0269o104b16910g5811K5366q1495
$$ plain form
18715 -131940 111326 -50995 -295176 43028 208377 26688 298253 -9773 48522 -6836 125756
18703 191846 -190641 200692 -193587 41046 -124103 31210 102044 75040 -231368 -105666
18692 -154167 -6720 60198 -192624 -202116 -436246 -34414 -393939 258277 -227223 -120883 -265605
18681 -265605 44884 -254996 -201199 146675 -152042 133306 -126480 -242822 55288 -308247
18670 -28177 -191212 -207465 228266 -142746 128367 -106101 -318511 56700 -280377 10931
18659 -2767 -106540 -300351 -268417 -468209 -38229 46502 225238 246728 -11009 -401901 -112151
18647 190177 37696 -134457 103378 -422311 -382525 50700 139087 -95241 -145668 24778 -46594
18635 -239828 -122109 -103198 -32736 131655 -117271 93187 -104911 -201901 117552 -182668
$$ packed form
18715a31940A11326e0995k44181D3028J65349B6688K71565i773D8522f836A25756
18703A91846a90641B00692a93587D1046a24103C1210P0834k7004b31368a05666
18692a54167f720F0198a92624r492k34130c4414l59525B58277b27223J06340j44722
18681b65605D4884b54996N3797A46675a52042A33306a26480j16342E5288c08247
18670b8177j63035j6253B28266a42746A28367a06101k12410E6700b80377A0931
18659b767j03773j93811L1934j99792c8229D6502J78736K1490a1009l90892a12151
18647A90177C7696a34457A03378d22311L9786E0700Q8387i5241n0427B4778d6594
18635b39828J17719J8911c2736A31655a17271I3187a04911r6990A17552a82668
$$ plain form
18624 41350 -1836 -41704 132672 -18894 -16047 8515 -291028 -76173 -219877 -127994 -261815
18613 -261815 -71879 54430 -111451 28582 -286502 -41895 -151248 -103276 -63494 -251157 208916
18601 125320 38564 -169323 387345 -99624 -170834 133392 62329 64154 -49235 -152909 -30499
18589 -436091 -275793 171697 -68775 149096 -270649 -86952 -166570 -113630 -10381 25170 -232880
18577 -134732 198192 -214032 -79785 -13635 -135734 -191837 -98431 -311013 61787 -31422 -240818
18566 -240818 -94470 47040 8600 -125709 -187967 74075 113467 -189628 -209815 -294510 -33599
18554 -303399 -62705 48963 11403 182578 -40441 91608 256795 -113994 -515678 -45616 -165587
18543 -165587 -366993 -86436 246033 -110671 -89908 222506 -77018 -153322 -101432 129923
$$ packed form
18624D1350a836l9868A32672a8894K847H515b91028g6173j43704R1883j33821
18613b61815g1879E4430a11451B8582b86502d1895j09353M7972L9782j87663B08916
18601A25320C8564a69323C87345i9624p1210A33392F2329J825d9235j03674c0499
18589d36091J60298A71697f8775A49096b70649h6952p9618N2940a0381B5170b32880
18577a34732A98192b14032g9785a3635j22099n6103R3406k12582F1787c1422k09396
18566b40818i4470D7040H600a25709o2258G4075L9392a89628k0187q4695c3599
18554c03399f2705D8963A1403J71175d0441I1608J65187a13994m01684d5616j19971
18543a65587k01406h6436B46033a10671K0763B22506g7018p6304N1890A29923
$$ plain form
18532 24099 -16776 -10083 140582 97034 281703 274753 -121160 158524 14283 62423 -363695
18520 83627 -337772 202282 -15956 -342383 129269 -140331 -257565 434316 -229052 86624
18509 255659 35590 31923 149348 151017 -34733 1439 -129702 -111519 -536412 89256 34682
18497 198559 -116098 -40558 -7221 205732 -36796 169781 -260848 -40914 -37473 138248 271845
18486 271845 10066 -7370 61952 -127408 -316158 -28487 156295 421883 -415247 -8841 -147868
18475 -147868 -291476 -104917 -195896 -141325 257306 -154056 -42021 -327747 -234648 90765
18464 -110934 93328 -259373 -27785 -247944 -226926 18771 -67474 84293 346359 296823 344937
18453 344937 95025 320078 -121754 99949 195561 128909 -234227 -276290 198006 -423955
$$ packed form
18532B4099a6776O693A40582m3548J84669o950a21160A58524A4283M8140c63695
18520H3627c37772B02282a5956l26427A29269a40331j17234D34316b29052H6624
18509B55659C5590l667J17425J669c4733A439a29702J8183m24893H9256C4682
18497A98559a16098d0558g221B05732c6796A69781b60848d0914L441A38248J33597
18486B71845A0066g370F1952a27408j88750b8487A56295K65588d15247h841j39027
18475a47868j43608a04917r0979N4571B57306a54056d2021k85726R3099I0765
18464a10934I3328b59373b7785k20159K1018A8771f7474H4293K62066m9536M8114
18453C44937I5025K25053a21754I9949R5612o6652b34227m2063A98006d23955
$$ plain form
18442 43357 93311 -190665 70884 16565 -283742 70198 -126786 139995 3638 -110878 -146818
18431 -146818 -77224 -42350 -21656 -55307 -6589 224427 139192 -190763 -220654 -335145 -399554
18420 -399554 47375 -68325 124098 -180476 -186229 179206 -63731 46589 29346 91008 486322
18409 486322 171533 172576 -258362 -99198 196351 262783 -274503 -108394 12491 204686
18399 204686 -19296 -170732 3860 -56192 -66141 202916 96597 -75049 17036 -17715 211157
18387 76375 38012 -23667 -404668 -12480 72118 383525 -124538 -81141 15991 -121846 -253562
18376 -253562 -438178 -251014 356119 -119682 -202442 -30279 89595 -213330 180564 -244154
18365 -110690 -286545 -82540 -86312 151310 -104675 -47281 -181296 -62442 101539 30414 -8011
$$ packed form
18442D3357M9954a90665G0884A6565b83742G0198a26786A39995C638a10878l5940
18431a46818O9594L4874K0694l3651f589B24427q5235a90763k9891j14491o4409
18420c99554D7375f8325A24098a80476n753A79206f3731D6589j7243O1662L95314
18409D86322A71533J043b58362i9198A96351O6432b74503a08394A2491J92195
18399B04686a9296j51436C860e6192r949B02916I6597g5049A7036a7715B11157
18387G6375C8012b3667l81001a2480G2118L11407a24538M3397A5991a21846j31716
18376b53562j84616J87164C56119a19682q2760c0279H9595b13330A80564b44154
18365a10690j75855h2540l772A51310a04675d7281j34015f2442A01539C0414h011
$$ plain form
18353 -305868 -60906 27428 -37326 191836 113615 94861 -315744 -22746 -187134 -335924 437362
18341 -82255 -146091 -3035 -60289 91248 6892 -5688 -399273 -339653 -14925 -103200 390890 -134640
18328 -345615 -240658 43523 -139658 -147745 126198 -51074 29611 -178918 -308794 -119739
18317 -7966 41576 -29203 187213 -64963 -192064 -85565 -221354 -326155 10653 207336 -123207
18305 -178025 -319152 138692 -4417 -293055 119673 -328485 -130674 80859 -116741 -175183
18295 -175183 -77937 142216 34895 -135136 75217 170392 110465 -183930 -120967 -35160 44895
18283 -218362 24166 87518 -126774 -113933 -176002 -44822 -68280 -200217 -178768 225541 -31629
18271 370485 97160 -167167 135323 63082 134416 -28903 -61908 164558 55274 -107695 -177787
$$ packed form
18353c05868f0906B7428c7326A91836p8221j8754c15744b2746j64388j48790D37362
18341h2255o3836c035n7254I1248F892e688l93585N9620a4925q8275C90890a34640
18328c45615J04957D3523a39658q087A26198e1074B9611a78918j29876a19739
18317g966D1576b9203A87213f4963j27101h5565j35789j04801A0653J96683a23207
18305a78025j41127A38692d417k88638A19673c28485a30674H0859a16741n8442
18295a75183g7937A42216C4895a35136G5217R5175n9927a83930O2963c5160D4895
18283b18362B4166O3352a26774J2841o2069d4822k3458j31937K1449B25541c1629
18271C70485I7160a67167A35323F3082P1334b8903l3005A64558E5274a07695p0092
$$ plain form
18260 -177787 99681 -201704 21238 125761 -177322 52157 237197 25366 -7735 -366330 53995
18248 441283 -194004 -443291 133624 288416 47662 -83729 3538 -86341 9776 13736 142938
18237 142938 89420 123401 -58168 90255 -98127 -266304 -253348 -173841 -15539 -203489 -282630
18226 -282630 -14916 -105098 -23897 -5444 16037 377549 -432535 -167341 36729 60972 76754
18215 76754 -78200 -191519 252225 -360741 106058 32085 59482 -218179 -8808 52251 326292
18204 326292 82983 -241923 -43166 13510 10015 -74559 -202779 -421672 9916 71716 57659
18193 57659 -259772 42822 58743 -5512 -310812 -237277 100369 -31111 -356730 -39589 61313
18181 168642 -124915 -403288 -219618 -172867 -51989 -9970 92722 -53941 -8827 -155585 162370
$$ packed form
18260a77787I9681b01704B1238J04523a77322E2157J85040B5366g735l58595E3995
18248D41283a94004k49287A33624J54792D7662h3729C538h6341I776L960J29202
18237A42938n3518L3981e8168I0255i8127j68177J2956P9507a5539j87950p9141
18226b82630a4916r0182b3897e444A6037L61512d32535a67341C6729K4243J5782
18215G6754g8200j13319B52225c60741A06058C2085K7397b18179h808E2251K74041
18204C26292H2983b41923d3166A3510l495g4559j28220k18893I916O1800j4057
18193E7659b59772D2822J5921e512l05300P3535A00369c1111l25619c9589F1313
18181A68642a24915k78373J83670M6751e1989i970I2722e3941h827j46758A62370
$$ plain form
18169 -61818 -52185 -351391 -73303 40616 -67534 60517 -171421 227505 -11759 52542 -47938
18157 211974 -32394 182420 -185764 -183407 -257758 -143934 72051 80077 40437 -126346 70506
18145 185291 155417 18594 -83950 -123687 324479 2043 211556 38929 -137960 118553 -16254
18133 -307437 -251953 23227 260920 53830 -272719 -20832 137347 226743 -44240 392264 -211361
18121 84409 -140891 -263011 2199 77539 11776 142653 259538 -334240 -179603 -220034 -175210
18110 -175210 -57088 -5567 -50198 -288782 214183 -174962 281354 92955 -134820 23255 -146180
18098 -6472 178194 -118295 303001 -222836 94495 69578 69188 286362 -11001 94397 67816
18087 67816 -186033 44599 -23852 -144785 425950 13129 200194 274760 -432747 -270202
$$ packed form
18169f1818R633k99206g3303D0616f7534F0517a71421B27505a1759E2542d7938
18157B11974c2394A82420a85764K357p4351J13824G2051Q026l9640a26346G0506
18145A85291k9874A8594h3950l9737C24479B043K09513C8929a37960A18553a6254
18133c07437N5484B3227K37693E3830b72719b0832A37347Q9396d4240C92264b11361
18121H4409a40891j22120B199P5340A1776J30877J16885c34240J54637m0431M4824
18110a75210e7088e567m4631k38584B14183a74962B81354I2955a34820B3255a46180
18098f472A78194a18295C03001b22836I4495k4917l90K17174a1001I4397k6581
18087F7816a86033D4599b3852j20933D25950A3129J87065P4566d32747J62545
$$ plain form
18077 -270202 -661 78781 100694 -153531 96565 -29473 -192013 -116665 -60179 174687 -273266
18065 -347736 47836 -402029 111317 345374 220174 68559 -318020 -21016 -106233 -21910
18054 157946 292786 -136267 -259023 28432 -161591 143910 56640 137059 250698 -224769
18043 -266816 -163502 112603 -76635 -533499 -114390 -130674 -39604 -91082 2619 -151567 147282
18031 68435 -151438 -129569 135649 110002 -254418 135669 130487 21086 -157823 137750 198897
18020 198897 -181836 69350 -138499 178359 -156435 -108323 188796 -133012 100555 162093
18010 162093 126185 -89226 116817 -32253 -311213 3461 -97833 91020 27471 323929 98279
17998 264117 -237647 285327 -6995 30155 -114741 -46938 -97541 -165351 -134337 240976 84577
$$ packed form
18077b70202f61G8781K1913a53531I6565b9473j62540P5348N6486A74687b73266
18065c47736D7836d02029A11317K34057j25200F8559c18020b1016q5217b1910
18054A57946J34840a36267j22756B8432a61591A43910E6640Q0419J13639b24769
18043b66816J03314A12603g6635m56864a14390j6284c9604n1478B619a51567A47282
18031F8435a51438K1869A35649k5647b54418A35669n182B1086a57823A37750O1147
18020A98897a81836F9350a38499A78359a56435M8112A88796a33012A00555O1538
18010A62093l5908h9226A16817c2253k78960C461i7833I1020B7471K96458I8279
17998B64117b37647B85327f995C0155a14741d6938n0603o7810L1014B40976H4577
$$ plain form
17986 -264825 -118658 80147 -216110 -221529 222276 -66446 -89197 48302 -311892 -109267 237968
17974 -19431 188768 -109464 196825 71520 -49390 40995 -43767 228181 -42257 309384 37802
17962 -53457 94299 -167440 -443828 -6703 34407 187572 93321 -117762 -193482 246880 -42724
17950 6326 -137969 9680 -140547 133136 -142940 49864 111488 81847 33492 -174438 -126019
17939 -126019 363220 -175604 -164562 -54012 94279 -70635 -136953 35651 34944 -450415 -80391
17927 -90914 115976 268956 127007 -12184 -280543 -148037 -153208 -108361 326954 75146 63368
17916 63368 -19806 153920 330703 -121785 289519 -17104 -190976 14539 -104567 270920
17905 21621 185505 356945 -383430 230615 121047 -31764 20269 90386 83855 411311 79834
$$ packed form
17986b64825a18658H0147b16110n419B22276f6446k2751D8302c11892a09267B37968
17974a9431A88768a09464A96825G1520d9390D0995d3767B28181d2257C09384C7802
17962e3457I4299a67440k76388f703C4407J53165I3321a17762p5720B46880d2724
17950F326a37969I680a40547A33136a42940D9864O1624k9641C3492a74438M8419
17939a26019C63220a75604J1042e4012I4279g0635o6318C5651p07d50415h0391
17927i0914A15976J52980A27007a2184k68359J32506n171M4847C26954G5146j1778
17916F3368a9806A53920J76783a21785B89519a7104j73872A4539a04567B70920
17905B1621J63884J71440c83430B30615j09568c1764B0269P0117o531L27456G9834
$$ plain form
17893 123505 -250008 -44699 -66068 -17072 113013 -25968 61557 -61083 -500537 44597 171786
17882 171786 29224 4697 -32394 -180060 -260637 -111248 25790 13106 -270734 -5898 306300
17870 -46213 -49710 -172505 81940 60122 -243239 -86400 163724 193082 213308 124401 -68838
17858 171329 250123 -179397 -288803 328616 117607 24729 303570 -417837 -96584 -26190
17847 72113 214028 95557 -34148 -310338 -105073 -221231 396125 -289456 -206340 -210452 -154444
17836 -154444 248917 -98699 126688 95935 -120905 -256576 136795 112817 -209339 -60170
17825 47269 10789 -58081 148484 -284097 -123322 261340 242522 -28433 2824 -10114 -255148
17814 -255148 -307183 173640 -199025 93319 -205983 -189204 -69602 108539 -96118 -68564 -189451
$$ packed form
17893A23505b50008d4699k1369a7072A13013b5968F1557f1083m39454D4597J27189
17882A71786B9224D697c2394j47666q0577a11248B5790j2684b70734e898C06300
17870d6213l497j22795H1940k1818b43239h6400A63724K9358K0226q8907f8838
17858A71329P8794a79397j09406C28616A17607B4729K78841d17837i6584b6190
17847G2113J41915I5557c4148k76190a05073j16158C96125b89456Q3116m112N6008
17836a54444B48917i8699A26688l0753a20905j35671A36795k3978b09339f0170
17825D7269A0789e8081A48484b84097a23322B61340j8818b8433B824a0114k45034
17814b55148n2035A73640a99025I3319b05983J6779f9602A08539i6118K7554j20887
$$ plain form
17803 -189451 205780 -15615 -326426 50767 -67678 -3728 150871 -123459 -76845 185720 18278
17791 347453 286647 111760 -2270 140525 -313974 139093 -72350 55125 47758 -310435 -124781
17779 129116 88613 20718 -239301 124091 -237299 132817 198247 70230 -10046 260481
17768 166922 204324 -483020 -1419 71187 149090 380945 -13122 148876 -77855 -63587 111009
17756 -452529 -117953 320416 -173549 -373979 3237 -156739 -38280 232696 -59333 192246
17745 286831 -69225 94930 -118438 -122741 -87843 -22680 42711 124673 -45762 66724 -127489
17733 19440 -11631 154882 -413846 112871 23209 -212798 -61067 199573 73893 245799
17723 245799 -111438 -78110 386805 -151270 -134201 -67720 134946 -20589 -8279 -110206 -88380
$$ packed form
17803a89451B05780a5615l10811E0767f7678c728A50871a23459M6614A85720A8278
17791C47453o0806A11760b270A40525c13974A39093g2350E5125p367c10435a24781
17779A29116m0503B0718b39301A24091b37299A32817O5430G0230a0046B60481
17768A66922L7402d83020a419G1187P7903K31855a3122A48876g7855J4268A11009
17756d52529a17953C20416a73549k00430C237a56739c8280B32696e9333A92246
17745B86831f9225I4930a18438m303L4898b2680D2711Q1962d5762F6724a27489
17733A9440a1631A54882d13846A12871B3209b12798f1067A99573G3893J71906
17723B45799a11438L3328C86805a51270J7069O6481A34946b0589h279j01927K1826
$$ plain form
17712 -88380 2046 11897 -12043 182535 -211108 117178 -16481 17199 130567 178494 483600
17701 483600 -149495 51047 -36791 -170542 509965 -286262 -69482 21123 -19752 -133539
17691 -133539 -147184 11132 2309 -194179 -12160 -31635 177113 264592 -156734 138165 -83813
17679 41163 -227624 145128 -11425 71000 216829 -130001 87355 124315 2391 -30882 182640
17667 -310994 7409 56323 -67939 -19732 -264415 -8715 60882 -130279 83930 -41399 289634
17655 200172 -112159 -214564 -128100 101567 116862 -109667 -252516 426854 150582 181246
17645 181246 -37448 -179423 234191 -126317 231856 126050 5311 -187366 -161234 -37382
17634 -84826 -179629 403001 100319 329649 172064 119883 2275 -55820 133889 37102 -96974
$$ packed form
17712h8380B046R851a2043A82535b11108A17178a6481A7199J13368M7927L05106
17701D83600a49495E1047c6791j33751E09965b86262f9482B1123a9752j13787
17691a33539j3645A1132B309a94179a2160j9475A77113Q7479a56734A38165h3813
17679D1163b27624A45128a1425G1000J45829a30001H7355L6960B391c0882A82640
17667c10994G409M8914f7939a9732k44683h715F0882a30279H3930d1399B89634
17655B00172a12159j02405Q6464A01567J5295a09667j42849D26854A50582L0664
17645A81246c7448j41975B34191a26317B31856j05806E311a87366K6132c7382
17634h4826r4803D03001A00319K29330j57585n2181B275e5820A33889C7102i6974
$$ plain form
17622 -47787 -171902 311388 -80235 -3823 45518 -76864 338896 42624 -59515 -55080 -126217
17611 -126217 251236 399810 200556 -202858 97210 6980 -201295 -58135 14384 70365 -66798
17599 -14212 72627 144359 -134275 -46665 47004 -12825 -314323 139780 -17260 116223 -96850
17587 282619 -54307 -100191 -121811 197302 33079 -145519 338371 76054 -141433 132501
17576 293443 -30422 -48132 -121650 -111204 122075 -270507 161296 298050 195236 171116
17566 171116 373929 57942 -47784 158798 -185299 -78085 -230711 -67811 57709 -308287
17555 13455 -73201 -23785 46054 196190 241331 -59169 -101209 -165424 -67187 72509 173882
17544 173882 -285364 -343259 306618 137510 47795 -24945 77741 -125845 -216387 77404 358980
$$ packed form
17622d7787j24115C11388h0235c823D5518g6864C38896D2624e9515M435p1137
17611a26217B51236J48574j99254b02858I7210F980b01295e8135A4384N5981f6798
17599a4212G2627P1732a34275d6665D7004a2825l01498A39780a7260A16223i6850
17587B82619e4307m5884k1620A97302C3079a45519C38371G6054a41433A32501
17576B93443c0422j7710p3518J0446A22075b70507A61296J36754j02814k4120
17566A71116K02813E7942d7784A58798a85299g8085j52626f7811E7709c08287
17555A3455g3201b3785D6054J50136M5141e9169m2040o4215f7187G2509J01373
17544A73882b85364n7895C06618A37510D7795b4945G7741a25845r0542G7404K81576
$$ plain form
17533 358980 117274 129434 265492 -77884 188450 -92203 347340 94159 -15081 263736
17522 114835 91757 -92342 38665 45821 226884 42081 -41905 100971 295276 289556 -30762
17510 213715 -5042 269641 214594 165597 285205 60738 116136 -6393 407433 -124307 -89544
17499 -89544 -117109 -97601 231002 255774 1907 156788 -110030 246991 114443 44528 -51945
17487 -218987 9275 31680 280702 33818 281427 -99434 348519 192598 -36918 -77899 -20994
17475 104106 11786 140723 390615 302070 -44232 -144657 -60596 140521 356454 391253
17465 391253 -1757 206580 198813 266852 -9445 179146 341755 277664 -185957 279979 199259
17454 199259 134460 -4763 231062 11387 -143022 141158 443478 119488 304951 226670
$$ packed form
17533C58980A17274J2160J36058g7884A88450i2203C47340I4159a5081B63736
17522A14835k3078i2342C8665P156J81063D2081d1905A00971J94305n720c0762
17510B13715e042B69641n5047m8997J19608F0738N5398f393D07433a24307L4763
17499h9544k7565J9508B31002K4772A907J54881a10030B46991A14443D4528e1945
17487b18987I275K2405K49022C3818K47609i9434C48519j55921c6918m0981b0994
17475A04106A1786J28937K49892q8545d4232j00425f0596A40521K15933L4799
17465C91253a757B06580p767O8039i445A79146J62609o4091a85957B79979q0720
17454A99259o4799d763B31062A1387a43022A41158L02320A19488J85463p8281
$$ plain form
17444 226670 33586 352406 293807 584991 42258 248640 309572 347298 198405 -238373
17433 233643 400742 223232 50611 385953 318955 424384 248369 274686 249865 523020
17423 523020 288110 260265 -47376 -193103 109184 233298 -117270 451961 149184 113443
17413 113443 436941 388971 229318 349591 412357 66799 -16467 212487 368949 75311
17402 98869 -48301 461210 40229 98392 262005 123602 147281 197557 -9161 439177 -195015
17390 -153676 -97821 462958 312810 288151 70307 177619 250725 91860 653178 365739
17380 365739 268823 7400 239900 5981 -154480 182327 136308 4646 96468 222502 105945
17368 29555 -29691 136996 136165 79952 -156690 357256 -39624 449681 304532 82988 52878
$$ packed form
17444B26670C3586L18820n8599K91184D2258K06382O0932L7726j48893b38373
17433B33643J67099j77510E0611L35342o6998J05429j76015K6317k4821K73155
17423E23020k34910k7845d7376j45727A09184J24114a17270D51961A49184l5741
17413A13443L23498m7970j59653J20273O2766F6799a6467B12487J56462G5311
17402I8869d8301D61210D0229N8163J63613A23602K3679N0276i161D39177a95015
17390a53676N5855D62958j50148k4659G0307J07312P3106I1860N61318k87439
17380C65739r6916G400K32500E981a54480A82327m6019D646R1822J26034A05945
17368B9555b9691A36996q31n6213a56690C57256c9624D49681j45149H2988l0110
$$ plain form
17357 52878 -200192 158870 67465 168190 100002 -131979 -13054 166937 187078 174400 41993
17345 261047 271043 250115 48078 328679 196160 197650 55883 330501 194047 186580 -107631
17333 184093 -218018 582413 128057 115929 102271 232048 150878 111804 175252 14496 234338
17322 234338 214240 7628 73715 -52778 264484 18919 -181598 284165 331518 410989 172389
17310 141610 77676 294569 170423 -162571 86255 3356 105506 75373 69191 84335 115054
17299 115054 365089 -3790 66864 756652 201414 76473 127864 -230837 73714 423024 138122
17287 243352 193982 401391 300789 131605 57646 54778 80656 16435 272032 -155494 270215
17275 89913 369264 51299 108790 -42322 179965 186484 36414 268313 114659 244449 302189
$$ packed form
17357E2878b00192A58870F7465J00725o8188a31979a3054A66937K0141j2678D1993
17345B61047R996k0928D8078K80601j32519J490E5883K74618j36454p467a07631
17333A84093b18018E82413A28057j2128j3658J29777q1170l9074O3448A4496K19842
17322B34338k0098G628O6087e2778B64484A8919a81598B84165M7353P9471A72389
17310A41610o3934K16893j24146a62571H6255C356J02150l0133o182J5144L0719
17299A15054K50035c790F6864O89788B01414G6473N1391b30837G3714L49310A38122
17287B43352m9370K07409j00602A31605E7646k868K5878A6435K55597a55494B70215
17275H9913K79351E1299N7491d2322A79965O519C6414K31899A14659J29790N7740
$$ plain form
17264 302189 84904 27828 346180 297071 163215 265564 370839 374236 -14091 78565 176030
17253 176030 444906 211307 253432 242695 37224 62473 336246 166403 99941 198333 146064
17242 146064 218348 282052 256293 471726 19756 79601 54780 339078 21765 128913 549727
17231 549727 27553 263143 34501 267368 184646 73310 455201 161077 179505 94183 17831
17219 248964 210342 265918 79955 -1237 -208899 151224 247217 8871 112612 45419 72075
17208 72075 191289 12868 11091 162887 273370 259018 506289 333804 190205 337830
17198 337830 229780 158899 445283 245593 281447 -250669 -46283 270148 185858 131837
17188 131837 225177 -20301 124779 192445 -25710 494519 446238 19814 366175 451173 561233
$$ packed form
17264C02189H4904B7828L18352m9109j33856J02349J05275L397a4091G8565R7465
17253A76030K68876B11307M2125j0737C7224K5249K73773A66403o6462R8392n2269
17242A46064P2284O3704k5759K15433A9756N9845k4821K84298B1765J07148M20814
17231E49727B7553K35590C4501K32867q2722G3310L81891A61077J8428q5322A7831
17219B48964l8622N5576G9955a237k07662A51224R5993H871J03741D5419K6656
17208G2075J19214A2868j777J51796J10483j4352K47271j72485j43599J47625
17198C37830j08050p0881K86384j99690L5854b50669d6283B70148q4290n4021
17188A31837R3340b0301A24779O7666b5710D94519m8281A9814L46361Q4998J10060
$$ plain form
17177 561233 -185388 146516 336523 299574 349320 271720 590094 223154 267565 56990
17166 300782 49232 12870 267950 362196 221377 74765 469087 229975 162075 315698
17156 315698 160188 143605 441339 22988 321762 -102808 101469 427909 425130 464984
17146 464984 121939 201958 384273 307926 268722 348172 111526 261633 412871 418262 363707
17135 363707 491717 279509 609882 86693 396248 381249 -156893 166159 333933 200561
17125 200561 486939 51810 478132 169083 539519 397560 397506 430376 404273 549322 277487
17114 277487 509108 451426 -88380 662075 411786 110621 94233 317598 255940 63406
17103 524482 431569 407467 475552 407263 217726 274067 368144 136696 292360 389773 279292
$$ packed form
17177E61233a85388A46516J90007l6949M9746p7600L18374B23154M4411E6990
17166C00782D9232A2870K55080R4246j40819G4765L94322B29975o7900J53623
17156C15698j55510j6583K97734B2988K98774a02808A01469L26440k779L9854
17146D64984A21939Q0019J82315p6347l9204P9450A11526J50107J51238N391n4555
17135C63707J28010k12208L30373H6693L09555j4999a56893A66159J67774j33372
17125B00561K86378E1810M26322A69083L70436j41959n4L2870k6103J45049k71835
17114B77487K31621n7682h8380F62075k50289A10621j6388K23365o1658F3406
17103E24482r2913k4102O8085o8289j89537N6341R4077A36696J55664R7413j10481
$$ plain form
17092 279292 165776 532626 228939 536256 686509 300124 306068 255931 399937 679522
17082 679522 608237 283222 232298 632641 137182 418439 303553 466354 405476 307109
17072 307109 293510 510463 339714 383979 442237 556577 408613 826237 342439 406973
17062 406973 554926 314434 470989 89835 322071 460128 363806 513012 956123 456436
17051 519701 412673 521570 463967 726474 447002 782265 734284 685504 502052 397761
17041 397761 514682 758078 365226 554688 662250 434677 725055 451002 417374 283979
17031 283979 144552 355923 601222 629948 608097 338134 599383 833340 1073885 787238
17021 787238 750924 653169 875269 555397 823580 657036 547295 475183 731784 600326
$$ packed form
17092B79292j13516L66850B28939L07317J50253C00124N944n0137J44006K79585
17082F79522p1285B83222n0924M00343A37182K81257j14886J62801o0878r8367
17072C07109j3599K16953j70749M4265N8258J14340j47964M17624C42439O4534
17062D06973J47953k40492J56555H9835K32236J38057r6322J49206M43111D56436
17051E19701j07028J08897n7603K62507k79472L35263m7981m8780j83452j04291
17041C97761J16921K43396C65226J89462J07562k27573K90378k74053l3628j33395
17031B83979j39427K11371K45299K8726k1851k69963K61249K33957K40545k86647
17021G87238l6314r7755K22100l19872K68183j66544j09741p2112K56601j31458
$$ plain form
17011 600326 836123 586512 556905 969657 837871 1006640 727289 816744 637507 647124
17001 647124 648200 720411 814315 934512 581908 1036638 341805 508883 744911 793142
16991 793142 312245 470726 819643 726030 609949 597231 561851 896002 646492 915220
16981 915220 869123 769716 887718 805273 845498 888170 849460 807022 957669 769162 775575
16970 775575 1008222 854732 1039397 1183391 585262 820144 1115109 1062763 1034775 908258
16960 908258 1100342 1058467 1022189 1084381 1068848 803619 1512339 1113802 886083 1109825
16950 1109825 963262 1111579 959452 1319364 1132789 1108417 1051327 1247962 1148808 981837
16940 981837 1084364 1334701 901031 1082404 1377447 1149961 1225879 1169731 1314835 1446409
$$ packed form
17011F00326K35797k49611k9607M12752j31786J68769k79351Q9455j79237R617
17001F47124J076P2211R3904J20197l52604M54730C41805J67078K36028M8231
16991G93142C12245J58481L48917r3613j16081j2718l5380L34151k49510K68728
16981I15220m6097r9407J18002q2445M0225M2672l8710m2438J50647j88507O413
16970G75575K32647j53490J84665J43994E85262K34882K94965n2346k7988j26517
16960I08258J92084m1875l6278O2192j5533k65229P08720l98537k27719K23742
16950A109825j46563J48317j52127L59912j86575k4372n7090J96635r9154j66971
16940I81837J02527K50337m33670J81373K95043k27486P5918n6148J45104J31574
$$ plain form
16930 1446409 1374819 1342644 1263075 1129066 1126471 1246570 1341098 1225098 1115353 1340070
16920 1340070 1346787 1340816 1412473 1707035 1231021 1357877 1563853 1407612 1374590 1241875
16910 1241875 1645887 1605895 1720819 1305514 1657605 1358474 1542317 1553140 1531651 1499689
16900 1499689 1563782 1795929 1763022 1332709 1729982 1984048 1871247 1593729 2060242 1867417
16890 1867417 1634489 1899331 1885033 1888711 1801542 1985854 1876613 2266826 2139896 2015665
16880 2015665 2120726 1986409 2157953 2040917 1933929 2383861 2332988 2344092 2256543 2184457
16870 2184457 2259750 2306319 2515598 2481887 2594047 2629258 2799351 2881042 2402110 2818515
16860 2818515 2552066 2593425 2929578 2848664 2625578 3012165 3181747 3146327 3095765 2547569
$$ packed form
16930A446409p1590l2175p9569j34009k595J20099R4528j16000j09745K24717
16920A340070O717n971P1657K94562m76014J26856K05976j56241l3022j32715
16910A241875M04012l9992J14924m15305L52091k99131J83843J0823k1489l1962
16900A499689O4093K32147l2907m30313L97273K54066j12801k77518M66513j92825
16890A867417k32928K64842j4298L678q7169J84312j09241L90213j26930j24231
16880B015665J05061j34317J71544j17036j06988M49932n0873J1104q7549p2086
16870B184457P5293M6569K09279l3711J12160L5211J70093Q1691m78932M16405
16860B818515k66449M1359L36153q0914k23086L86587J69582l5420n0562n48196
$$ plain form
16850 2547569 3186647 3164075 3381255 3425317 3406273 3507168 3569798 3591895 3335083 3875231
16840 3875231 3759456 3685945 3433316 3949415 3864585 4232380 4170871 4255350 4133217 4298616
16830 4298616 4281406 4541496 4706695 4452615 4851971 4643149 5151441 5075010 4952443 5091833
16820 5091833 5200235 5424697 5778901 6068523 5855331 5940389 6041881 6233989 6425781 6559805
16810 6559805 6611065 6922233 6926158 7209101 7006405 7025441 7135625 7763834 8037620 8038112 7977286
16799 7977286 8127127 8748824 8879568 8737475 9054220 9534370 9524654 10190544 10423367 10408344
16789 10408344 10764587 11140866 11587081 11720054 11888411 12414729 12910890 13086932 13566178
16780 13566178 14104510 14270029 14640663 15396353 15858127 16331937 16719136 17474971 17879955
$$ packed form
16850B547569O39078k2572K17180M4062j9044J00895O2630K2097k56812N40148
16840C875231j15775p3511k52629N16099q4830L67795o1509Q4479j22133J65399
16830D298616j7210K60090J65199k54080L99356k08822N08292p6431j22567J39390
16820E091833J08402K24462L54204K89622k13192Q5058J01492J92108J91792J34024
16810F559805N1260L11168L925K82943k02696J9036J10184O28209K73786M92o0826
16799G977286J49841O21697J30744j42093L16745M80150r716O65890K32823j5023
16789A0408344L56243L76279M46215J32973J68357N26318M96161J76042M79246
16780A3566178N38332J65519L70634P55690M61774M73810L87199P55835M04984
$$ plain form
16771 17879955 18755877 19359942 19767996 20605827 21615839 22437730 23234018 24254056 25473715
16762 25473715 26042097 27258107 28126045 29774066 31218279 32549520 33589345 35469930
16754 35469930 37295329 38895418 40909458 42907233 44698374 47439447 49959198 52362364
16746 52362364 55650189 58592971 61877148 65489989 69300397 73321273 77983668 82955468
16738 82955468 87718479 92951445 98496915 104761380 111200681 117872007 124948551 132251564
16730 132251564 139958256 147705456 155584562 163195063 170366575 177258419 183398160 189072180
16722 189072180 193368915 197091266 198907446 199373476 198738618 196573767 193160619 188576238
16714 188576238 182782752 176646031 169736340 162279835 154817868 147258269 139360626 132138643
$$ packed form
16771A7879955Q75922O04065M08054Q37831J010012Q21891P96288J020038J219659
16762B5473715N68382J216010Q67938J648021J444213J331241J039825J880585
16754C5469930J825399J600089K014040J997775J791141K741073K519751K403166
16746E2362364L287825K942782L284177L612841L810408M020876M662395M971800
16738H2955468M763011N232966N545470O264465O439301O671326P076544P303013
16730A32251564P706692P747200P879106P610501P171512O891844O139741N674020
16722A89072180M296735L722351J816180M66030o34858k164851l413148m584381
16714A88576238n793486o136721o909691p456505p461967p559599p897643p221983
$$ plain form
16706 132138643 125005265 117887496 111201531 104816137 99069310 93457754 87956778 82670131
16698 82670131 78351792 74132440 69355421 66243229 62802809 58993751 56478960 53004008
16690 53004008 50580594 48257988 45658264 43510407 41391731 39448826 37494220 35862321
16682 35862321 34307823 32498777 31383174 29751630 28602382 27426454 26437593 25468877
16674 25468877 24189465 23544073 22297539 21552785 20579924 19507452 19314851 18761771 17806843
16665 17806843 17360965 16469621 15820580 15225388 14996481 14431346 13916760 13498343 12808457
16656 12808457 12600156 12153530 11864725 11450989 11039077 10822320 10608607 9900875 9815908
16647 9815908 9409139 9381456 9002465 8876252 8927438 8218351 8273764 7860035 7713245 7300268
$$ packed form
16706A32138643p133378p117769o685965o385394n746827n611556n500976n286647
16698H2670131m318339m219352m777019l112192l440420l809058k514791l474952
16690E3004008k423414k322606k599724k147857k118676j942905j954606j631899
16682C5862321j554498j809046j115603j631544j149248j175928r88861r68716
16674B5468877j279412o45392j246534p44754r72861j072472j92601n53080r54928
16665A7806843m45878q91344o49041n95192k28907n65135n14586m18417o89886
16656A2808457k08301m46626k88805m13736m11912k16757k13713p07732q4967
16647I815908m06769k7683l78991j26213N1186p09087N5413m13729j46790m12977
$$ plain form
16637 7300268 7248215 7065944 6828499 6789235 6519205 6385824 6380179 6086628 6030034 6110722
16627 6110722 5923738 5380736 5318386 5360018 5159733 4853312 4925773 4936778 4829169 4989154
16617 4989154 4817392 4422459 4697557 4430385 4314104 4160816 3897122 3941243 3949314 3828947
16607 3828947 3890875 3576152 3620482 3376840 3489404 3539731 3278606 3077908 3403610 3313242
16597 3313242 2985944 3544279 3241219 3248283 2922167 3140998 2652233 2755284 3090499 3085512
16587 3085512 2813178 2725172 2446238 2598330 2539208 2373806 2455762 2547613 2141383 1978797
16577 1978797 2196707 2143961 2135033 2130357 1996666 2015661 1937737 2234727 1945791 2068801 1995089
16566 1995089 1558068 1930784 1885864 1727333 1682305 1465308 1522217 1804622 1547885 1494514
$$ packed form
16637G300268n2053j82271k37445l9264k70030j33381n645k93551n6594Q0688
16627F110722j86984n43002o2350M1632k00285l06421P2461J1005j07609J59985
16617D989154j71762l94933K75098k67172j16281j53288k63694M4121Q071j20367
16607C828947O1928l14723M4330k43642J12564N0327k61125k00698L25702r0368
16597C313242l27298N58335l03060P064l26116K18831m88765J03051L35215m987
16587C085512k72334q8006k78934J52092n9122j65402Q1956R1851m06230j62586
16577A978797K17910n2746q928m676j33691J8995p7924K96990k88936J23010p3712
16566A995089m37021L72716m4920j58531m5028k16997N6909K82405k56737n3371
$$ plain form
16556 1494514 1760995 1520456 1788185 1535713 1380132 1480579 1722431 1556229 1312148
16547 1312148 1369198 1831535 1610271 1230721 1306524 1282455 1527905 1347189 1507242 1407424
16537 1407424 871055 1273617 1585874 1306127 1423855 1250850 1048463 1466682 1143315
16528 1143315 1068525 1283436 944006 1199653 1205598 1107112 1357422 767640 1127376 1090803
16518 1090803 1172655 1091826 858290 771421 926461 1065752 960512 918048 750255 727565
16508 727565 624673 1079853 701670 848777 564574 742163 886067 914034 822380 899191
16498 899191 874253 970473 711531 456716 406957 906295 882397 397993 986543 760604
16488 760604 678337 624499 652445 749757 693938 580464 747882 474931 532162 737543 592552
$$ packed form
16556A494514K66481k40539K67729k52472j55581J00447K41852j66202k44081
16547A312148N7050M62337k21264l79550P5803k4069K45450j80716J60053r9818
16537A407424n36369M02562L12257k79747J17728j73005k02387M18219l23367
16528A143315p4790K14911l39430K55647N945r8486K50310n89782L59736l6573
16518A090803Q1852q0829k33536q6869J55040J39291j05240m2464j67793k2690
16508G27565j02892M55180l78183J47107k84203J77589J43904K7967r1654P6811
16498H99191k4938R6220k58942k54815m9759M99338k3898C97993N88550k25939
16488G60604q2267n3838K7946R7312n5819j13474J67418k72951N7231K05381j44991
$$ plain form
16477 592552 610463 886358 672517 707940 992251 730220 817475 503910 595104 573854
16467 573854 586111 443506 676500 454877 622951 280020 770984 458304 305007 612421
16457 612421 514052 659559 411264 728908 409713 327649 471019 763239 247309 275913
16447 275913 440684 676760 157235 642534 487315 559191 336415 384411 552114 361521
16437 361521 401059 260625 624131 440526 518086 551823 452260 170684 353446 726866
16427 726866 129692 323623 552926 612423 171799 429971 347779 294763 400196 381165
16417 381165 192148 160197 196070 312110 609326 454333 529829 410103 207214 345905
16407 345905 284751 449312 163882 447847 610531 197284 312034 295581 326888 544660
$$ packed form
16477E92552J7911K75895k13841L5423K84311k62031Q7255l13565R1194k1250
16467E73854J2257j42605K32994k21623J68074B80020M90964l12680j53297L07414
16457F12421r8369J45507k48295L17644l19195q2064J43370K92220B47309K8604
16447B75913J64771K36076A57235M85299j55219P1876k22776M7996J67703j90593
16437C61521L9538j40434L63506j83605P7560L3737r9563A70684J82762L73420
16427G26866A29692J93931K29303N9497A71799K58172q2192n3016J05433j9031
16417C81165j89017l1951L5873J16040K97216j54993P5496j19726k02889J38691
16407C45905o1154J64561A63882K83965J62684A97284J14750j6453L1307K17772
$$ plain form
16397 544660 394679 -25605 84398 266235 295106 388970 67552 84585 455461 569553 45853
16385 509874 359038 161744 223450 207063 368483 154523 541942 460088 289568 439921
16375 439921 524316 203884 471077 396527 229506 492217 466996 188797 110368 242993
16365 242993 593441 344255 167816 -69619 273186 184212 226518 351588 392934 335357
16355 335357 320445 277724 55447 394429 280077 296035 -153220 112959 208718 274977 -131859
16343 121016 103946 72208 408522 279104 350954 506975 -192113 268777 319708 108808
16332 320781 107334 -238798 262093 -169979 205615 259406 318194 175357 -7009 645624
16321 48814 128347 277728 99104 -74878 675346 310422 -214762 16739 129296 -62971 299502
$$ packed form
16397E44660j49981b5605H4398J81837K8871R3864F7552J7033L70876J14092D5853
16385E09874j50836A61744O1706j6387J61420A54523L87419q1854j70520J50353
16375D39921Q4395B03884K67193p4550j67021K62711k5221A88797p8429J32625
16365B42993L50448k49186A67816f9619B73186q8974M2306J25070M1346n7577
16355C35357j4912m2721E5447L38982j14352J5958a53220A12959R5759O6259a31859
16343A21016j7070l1738L36314j29418P1850J56021a92113B68777N0931A08808
16332C20781A07334b38798B62093a69979B05615N3791N8788j42837g009F45624
16321D8814P9533J49381I9104g4878F75346C10422b14762A6739J12557f2971B99502
$$ plain form
16309 469246 110280 35936 215454 83804 221354 274534 -54920 58987 328121 213931
16299 213931 99241 35937 132054 -83223 28821 -27930 308585 106374 329079 249793 -36454
16287 226026 179456 -42328 184971 -192101 5498 6962 359826 -21990 88111 -8654 113857
16275 -2282 49793 49682 158274 211334 274174 231969 320943 160672 143352 -54884 -192639 -248129
16263 -248129 -167897 70709 -59671 713854 38223 -154664 358854 -170684 226722 -79807
16252 -205519 -3193 121420 241473 -98101 565830 32864 32699 345644 -26904 -14824 104332
16240 98370 -177827 233500 -196740 62491 -145994 12135 24616 38983 -57143 -36170 144223
16228 101207 -170481 136626 247050 -130332 -116043 -204400 -203076 72016 -18753 -191768 -180215
$$ packed form
16309D69246A10280C5936J79518H3804J37550N3180e4920E8987K69134j14190
16299B13931I9241C5937R6117h3223B8821b7930C08585A06374K22705p9286c6454
16287B26026m6570d2328A84971a92101E498J464L52864b1990H8111h654A13857
16275b282D9793j11J08592N3060O2840m2205Q8974j60271j7320e4884j37755n5490
16263b48129Q0232G0709e9671G13854C8223a54664C58854a70684B26722g9807
16252b05519c193A21420J20053i8101E65830C2864j65L12945b6904J2080A04332
16240I8370a77827B33500a96740F2491a45994A2135J2481J4367e7143K0973A44223
16228A01207a70481A36626J10424a30332J4289q8357J324G2016a8753j73015J1553
$$ plain form
16217 -180215 93058 -132765 127406 -16764 358037 282857 -210166 198626 85222 58477
16207 58477 271975 -176275 -96255 17025 264983 50787 -286291 -222067 -113043 5868 264244
16196 264244 51170 214354 40032 94558 200565 -34304 -105719 -21205 198048 159864 -141853
16184 24419 55116 127154 78852 132203 54312 169331 -44043 89704 -242487 177497 -16248
16172 -55375 -351768 -315285 -204742 266486 -103348 42179 89843 143489 93670 -148173 324469
16160 109685 382151 -184003 280249 -251170 -188741 23578 178079 -12582 -53398 175542
16149 442983 -272503 38732 261416 -8700 189911 25216 -18914 128629 106612 46887 5540
16137 97133 63814 -141218 -204116 5077 113700 -140816 39775 -200022 -129394 194786 164117
$$ packed form
16217a80215I3058a32765A27406a6764C58037p5180b10166A98626H5222k6745
16207E8477K13498a76275Q0020A7025K47958E0787b86291O4224J09024E868K58376
16196B64244E1170J63184D0032N4526J06007c4304p1415b1205A98048l8184a41853
16184B4419L0697P2038m8302N3351E4312J15019d4043H9704b42487A77497a6248
16172e5375k96393L6483J10543B66486a03348D2179M7664N3646m9819a48173C24469
16160A09685K72466a84003B80249b51170O2429B3578J54501a2582m0816A75542
16149D42983b72503C8732K22684h700A89911B5216a8914A28629k2017D6887E540
16137I7133l3319a41218o2898E077J08623a40816C9775b00022P0628A94786l0669
$$ plain form
16126 164117 3193 85138 -143045 73226 -271018 190957 119077 -207366 -13002 237149 -146986
16114 -96611 164457 -166945 276543 184561 79079 22421 -81715 50495 6539 -8812 -87938
16103 -87938 265910 28144 43322 264627 254992 54154 196290 22733 -105849 138607 136158
16092 136158 385962 206733 -33367 77941 -212478 156617 -165904 -126503 -5278 37583 101673
16081 101673 255919 -421390 134540 -338930 -58757 -384179 -41815 152059 -82687 139366
16070 208416 -118830 -172429 -139100 -140204 -248782 38173 78490 383167 -132868 408388 -21001
16058 -183597 -19725 -19020 -272009 48218 25780 -246337 -10654 -304826 284606 -143419 -103748
16047 -103748 -600264 -120925 -3770 -244403 -173419 304423 -80050 25638 28219 67674 102589
$$ packed form
16126A64117C193Q1945a43045G3226b71018A90957p1880b07366a3002B37149a46986
16114i6611A64457a66945B76543r1982G9079B2421h1715E0495F539h812p9126
16103h7938B65910B8144J5178K21305r635E4154J42136B2733a05849A38607k449
16092A36158K49804j79229c3367G7941b12478A56617a65904L9401e278C7583O4090
16081A01673J54246d21390A34540c38930e8757l25422d1815A52059h2687A39366
16070B08416a18830n3599L3329j104j08578C8173M0317L04677a32868D08388b1001
16058a83597a9725P05k52989D8218k2438b46337a0654k94172B84606a43419L9671
16047a03748m96516a20925c770k40633P0984C04423h0050B5638K581L9455L4915
$$ plain form
16036 102589 -46788 -34707 141269 -240864 231096 20267 99200 -115749 -120448 -283630 -165335
16025 -165335 -71138 -123089 247345 213750 -26182 -340912 61388 188438 -246281 -272103 -135294
16013 292873 -221176 -120342 336105 254555 -131384 -249601 265170 -3313 37300 -70610
16002 -18538 -29366 117262 134610 -166117 -114121 121083 174958 217145 199218 55094 -247691
15990 -47533 257739 57517 -103546 81052 64164 -168389 31270 41489 -170017 -36414 21726
15978 236248 275036 193308 452437 -161639 21049 50270 259933 -335827 -167249 -87001
15968 -87001 -123607 80490 -24677 -225386 -368977 -13053 42224 293357 -133741 -498014 -287164
15957 -287164 160540 187560 -275183 -333938 -31943 -135156 -253981 -189056 377389 -310578
$$ packed form
16036A02589d6788J2081A41269b40864B31096B0267P8933a15749m699j63182J18295
16025a65335g1138n1951B47345l3595b6182l14730F1388J27050b46281k5822a35294
16013B92873b21176J00834C36105q1550a31384j18217B65170c313C7300g0610
16002a8538j0828A17262J7348a66117N1996A21083N3875M2187j7927E5094b47691
15990d7533B57739E7517a03546H1052j6888a68389C1270J0219a70017c6414B1726
15978B36248L8788q1728K59129a61639B1049K9221K09663c35827a67249Q0248
15968h7001l6606H0490b4677k00709j43591a3053D2224K51133a33741l64273K10850
15957b87164A60540K7020b75183n8755c1943j03213j18825O4925C77389c10578
$$ plain form
15946 -130154 127944 139690 -97884 -243883 66976 -12440 -186793 -236295 213209 -179318
15935 -112225 110577 264290 -25792 57030 119430 -30515 -351364 -184203 -232392 163042
15924 309172 209623 -157260 -421286 171776 -223161 -102594 10968 87702 212748 -107427
15913 209481 36870 -177662 -190622 188708 -215863 45061 -65514 5550 251936 131952 50592
15901 173702 -353811 -124401 88635 -187908 -56753 -148302 -187242 245350 237690 225959 -61863
15889 -213611 -91557 -284329 200525 123547 316668 -91791 120911 115372 33900 -8871 -59507
15878 -59507 -186662 83888 -58739 -390508 -209371 59699 -241883 -113989 100217 267716
15868 267716 -57237 -247214 -255405 -201359 -209983 -5629 -236048 152894 68245 -131503 -139729
$$ packed form
15946a30154A27944J1746i7884j45999F6976a2440j74353m9502B13209a79318
15935a12225A10577J53713b5792E7030O2400c0515l20849J67161m8189A63042
15924C09172r9549a57260k64026A71776b23161a02594A0968P6734J25046a07427
15913B09481C6870a77662j2960A88708b15863D5061f5514E550K46386j19984E0592
15901A73702c53811a24401H8635a87908e6753r1549l8940B45350p660j1731f1863
15889b13611i1557j92772B00525p6978J93121i1791A20911n539C3900h871n0636
15878e9507j27155H3888e8739l31769J81137E9699b41883a13989A00217J67499
15868B67716e7237j89977q191N4046q624e629k30419A52894F8245a31503q226
$$ plain form
15857 -139729 181610 -69272 -336357 332393 30353 408344 -184842 -183570 77363 155596 -23507
15845 -60578 -91613 -237023 -97431 -139391 -84485 207807 -111210 -92973 -284269 129053 337545
15834 337545 -114834 968 86043 9064 180203 49356 -156782 -30550 -46098 -141528 -130373
15823 -130373 -241646 38163 -15501 -218482 -172824 -152054 -123044 99058 109356 275186 -227748
15811 51030 -340358 -147211 -72568 -34760 122979 -231723 200569 76805 -120054 134430
15800 -91931 -4271 110278 93576 -257674 157953 237067 -274716 279964 -291802 239297
15789 260318 57505 207846 -283376 -161467 -169953 39675 -122488 -57952 -137600 -147825 124135
15777 -226385 190990 -334294 30878 -51705 127118 123472 42062 -37502 -267541 20969 410975
$$ packed form
15857a39729A81610f9272k67085C32393C0353L77991a84842J272G7363P8233b3507
15845f0578l1035j45410i7431m1960N4906B07807a11210J8237j91296A29053K08492
15834C37545a14834I68Q5075I064J71139D9356a56782c0550j5548r5430J1155
15823a30373j11273C8163a5501k02981M5658K0770K9010I9058J0298J65830b27748
15811E1030c40358a47211g2568c4760A22979b31723B00569G6805a20054A34430
15800i1931d271A10278j6702b57674A57953P9114b74716B79964b91802B39297
15789B60318E7505J50341b83376J21909q486C9675a22488e7952p9648j0225A24135
15777b26385A90990c34294C0878e1705A27118l646D2062c7502k30039B0969L90006
$$ plain form
15766 410975 95844 176383 -50158 -147966 168733 111230 -253691 -41338 173358 -4160 -92962
15755 -92962 -60747 106196 -77552 205686 684 -23936 206073 86906 -55058 159197 -122809
15743 -46540 -143098 117196 -72043 -139278 -380797 -68496 -21606 117865 -20449 -61803 -47277
15732 -47277 -277826 -209996 -269365 92372 216175 -32479 236238 -47996 -405015 27857 262328
15721 262328 1307 -169779 -218001 -232240 -8014 -164370 -3857 76816 80349 -130914 129101
15709 -335508 109568 -267006 -268576 -118388 -92262 218685 84744 283940 307803 -147665
15698 78224 124051 -79295 22713 5778 157244 24437 -86686 27787 -188787 162037 36581
15686 -59484 43416 -329829 230103 70919 -17203 -164491 79749 16282 -240335 75439 -257848
$$ packed form
15766D10975I5844Q0539e0158r7808A68733n7503b53691d1338A73358d160q8802
15755i2962L2215A06196g7552B05686F84b3936B06073H6906e5058A59197a22809
15743d6540r6558A17196g2043o7235k41519f8496b1606A17865b0449m1354J4526
15732d7277k30549O7830n9369I2372J23803c2479B36238d7996l57019B7857K34471
15721B62328A307a69779m8222j4239h014j56356c857G6816L533a30914A29101
15709c35508A09568b67006j570a18388K6126B18685H4744J99196K3863a47665
15698G8224M5827g9295B2713E778J51466B4437h6686B7787a88787A62037C6581
15686e9484D3416c29829B30103G0919a7203j47288G9749A6282b40335G5439b57848
$$ plain form
15674 1034 41447 105435 -62500 134338 365367 -232600 -245690 -4699 251829 -58570 -282108
15663 -282108 -145384 120105 200265 -120535 82465 -146461 27954 -98922 -311424 237292
15652 -208224 52864 -24682 22563 -225616 226052 191623 163789 298220 37558 -27825 126091
15640 -50503 -65670 -31045 -115470 -55981 -344448 25748 129787 129363 -376126 -190798 130839
15628 -228232 138375 145857 312771 -92784 -313340 143402 -269256 -266089 259125 -13776 264897
15616 -162041 -144117 22819 -38752 284489 -33982 -196026 -84191 -79689 -37359 -17200 62061
15604 -79252 -75890 102245 289915 -255198 -63288 72295 197803 -66536 124070 -25157 -191017
15593 -191017 231286 -92624 28959 44639 -194442 -256020 270751 99157 -265765 29565 55582
$$ packed form
15674A034M0413O3988f2500A34338K31029b32600j3090d699B51829e8570k23538
15663b82108J36724A20105Q0160a20535H2465a46461B7954i8922k12502B37292
15652b08224E2864b4682B2563b25616B26052l4429k7834J34431C7558b7825A26091
15640e0503j5167c1045q4425e5981k88467B5748J04039m24c76126J85328A30839
15628b28232A38375P482J66914i2784k20556A43402b69256L167B59125a3776B64897
15616a62041J7924B2819c8752B84489c3982j62044h4191M502c7359a7200F2061
15604g9252L362A02245J87670b55198f3288G2295J25508f6536A24070b5157j65860
15593a91017B31286i2624B8959J5680a94442o1578B70751I9157b65765B9565K6017
$$ plain form
15582 55582 -137779 -291047 -8401 -121505 9828 -92428 60042 197323 -123854 -6369 -54409
15571 -54409 135444 -8046 -66824 -127465 -77171 172513 2577 -231882 -147551 175129 -19 193877
15558 78415 115404 -245857 61506 -84369 -133196 103502 -184382 -51644 257210 -118845 132629
15546 -283696 -251744 43644 145143 107110 -2295 20191 151103 -53626 46778 -81694 -163368
15535 -163368 -161487 -11156 134827 -119952 -44013 69204 40910 -24295 211967 -21425 75089
15523 205028 129310 57153 -170053 -2984 73232 38404 304349 236560 160776 584835 78872
15511 79622 248874 -201217 125582 141967 -242937 -924 188571 -35991 -266077 -313259 -84370
15499 -190806 95357 -47250 -79028 91838 -135145 130215 34760 79159 -88279 -35263 121582
$$ packed form
15582E5582a37779j53268h401j13104I828i2428F0042J37281a23854f369m8040
15571e4409A35444h046n8778o0641N0294A72513B577b31882Q4331A75129a9A93877
15558G8415L6989b45857F1506h4369m8827A03502a84382e1644B57210a18845A32629
15546b83696L1952D3644J01499l8033b295B0191J30912e3626D6778h1694q1674
15535a63368J881a1156A34827a19952d4013F9204k8294b4295B11967b1425G5089
15523B05028p5718E7153a70053b984G3232l4828K65945o7789p5784M24059G8872
15511G9622J69252b01217A25582J6385b42937i24A88571c5991k30086m7182h4370
15499a90806I5357d7250l1778I1838a35145A30215C4760M4399h8279c5263A21582
$$ plain form
15487 -153114 -103221 -106633 -403530 -189166 136888 125764 70825 -256340 -59631 -2315 4591
15475 -142161 -196221 142017 -185861 175652 -159041 -2451 -68536 -88139 -269755 -148398
15465 -148398 89203 -32502 77864 -130005 172529 -12950 80392 293630 173779 313195
15455 313195 441869 101723 375030 -228122 -86225 -347930 -404684 -179560 -652 281663
15444 -16911 87216 -12131 -151934 -55667 -195635 126719 66180 -171419 157831 60652 388798
15433 388798 38558 -298437 91129 -228374 111953 137236 126440 146758 -463747 215169
15422 -452909 -63305 -71087 38177 -115994 55543 144183 -113308 -382017 37007 5200 -295922
15410 -16306 -203657 -271273 151692 -72139 112260 -242579 6883 -153609 83788 317646 71146
$$ packed form
15487a53114M9893l412k96897a89166A36888j1124n4939b56340e9631b315D591
15475a42161n4060A42017a85861A75652a59041b451o6085j9603j81616J21357
15465a48398H9203c2502G7864a30005A72529a2950H0392K13238j19851J39416
15455C13195J28674A01723K73307b28122h6225k61705n6754a79560f52B81663
15444a6911H7216a2131j39803e5667j39968A26719o0539a71419A57831F0652L28146
15433C88798C8558b98437I1129b28374A11953K5283j0796K0318d63747B15169
15422d52909f3305p782C8177a15994E5543Q8640a13308k68709C7007E200b95922
15410a6306j87351o7616A51692g2139A12260b42579F883a53609H3788K33858G1146
$$ plain form
15398 304740 165569 44757 324867 71744 -70035 -23746 -288040 -120338 -199722 159101
15387 266324 18142 111077 -111945 -291336 -49594 18946 -125620 80016 -39529 -240051 77678
15375 279901 -285838 181831 258919 190093 -43342 256980 138338 92823 130814 179907 222732
15364 222732 10632 132881 215586 181105 -30328 75903 -174995 117715 100128 54651 56365
15353 56365 -79569 206497 -66399 -228119 -170201 43319 -146148 -34150 -334285 -149555 115740
15341 -293299 225342 -253568 515941 -329981 -76360 7806 29992 136279 14952 -124804
15330 142719 -166769 407932 373565 -330202 -58864 200004 271500 24926 82149 -53117 66015
15318 49375 27663 -26710 -79404 -77777 217425 95303 182856 -110949 19933 -126998 -64173
$$ packed form
15398C04740j39171D4757K80110G1744g0035b3746k64294a20338p9384A59101
15387B66324A8142R2935a11945j79391d9594A8946a25620H0016c9529k00522G7678
15375B79901b85838A81831P7088o8826d3342B56980j18642m5515L7991M9093M2825
15364B22732A0632J22249Q2705l4481c0328G5903a74995A17715j7587m5477J714
15353E6365g9569B06497f6399j61720N7918D3319a46148c4150l00135a49555A15740
15341b93299B25342b53568E15941c29981g6360G806K2186J06287A4952a24804
15330A42719a66769D07932l4367c30202e8864B00004P1496B4926N7223e3117F6015
15318D9375k1712b6710n2694J627B17425I5303Q7553a10949A9933a26998O2825
$$ plain form
15307 -64173 395724 304920 23146 97687 80709 -297032 -62168 -29522 316471 262918 35479
15295 87047 116475 -204122 -252971 223182 18738 65992 -228744 -86269 -154416 -29841 32259
15283 173765 242026 -28579 51776 159969 -69161 -58785 -74319 221112 -152905 188555 135203
15272 135203 407569 257610 -79206 -7822 -55454 73150 -91687 -214775 245483 76899 77768
15261 77768 -62308 168737 191846 110168 -17890 148320 448940 -53867 38808 588652 322214
15250 322214 455845 517869 660539 808815 1319760 1276457 1133772 852524 289118 215013
15240 215013 164147 120292 153235 138383 287499 -45139 58827 239102 71953 -179932 132481
15228 10450 320109 120088 53375 -57678 -50017 170756 216683 58556 221007 87248 3086
$$ packed form
15307f4173C95724r0804B3146P4541j6978b97032f2168b9522C16471n3553C5479
15295H7047K9428b04122m8849B23182A8738M7254b28744h6269o8147b9841C2259
15283A73765O8261b8579E1776J08193f9161J0376j5534B21112a52905A88555n3352
15272A35203K72366j49959g9206g822m7632G3150i1687j23088B45483G6899Q69
15261G7768f2308A68737K3109q1678a7890A48320L00620e3867C8808N49844k66438
15250C22214J33631O2024J42670J48276N10945m3303j42685k81248B89118p4105
15240B15013n0866m3855L2943j4852J49116d5139E8827J80275G1953a79932A32481
15228A0450L09659A20088E3375e7678P661A70756M5927E8556J62451H7248C086
$$ plain form
15216 29771 -202387 341893 -111270 155912 80852 123432 11528 -249673 453541 238638
15206 238638 140177 9387 3973 241678 -87699 126412 56921 46479 -33548 -83962 -90190 -121075
15194 -121075 23737 204842 193048 151715 249798 293930 -92232 181842 -158304 201152 196937
15183 196937 404385 455125 37494 77088 -1000 89845 131470 71299 -115811 280689 49196
15171 38641 122526 149999 365669 10053 102593 191437 52068 -35337 177603 330029 168374
15160 168374 47823 286146 123640 -116578 39548 367939 -72432 140257 54628 190557
15150 190557 302905 66450 108098 205531 57368 -48255 -246575 212523 143124 582805 296361
15139 296361 63952 73794 586348 109936 -186563 -55408 12737 424963 -213319 -68470 -207994
$$ packed form
15216B9771b02387C41893a11270A55912p5060M2580A1528b49673D53541k14903
15206B38638r8461I387C973K37705h7699A26412E6921j0442c3548n0414o228l0885
15194a21075B3737J81105j1794m1333R8083M4132i2232A81842a58304B01152m215
15183A96937K07448N0740C7494L9594a000H9845M1625o0171a15811B80689D9196
15171C8641Q3885K7473K15670A0053R2540Q8844E2068c5337A77603J52426j61655
15160A68374D7823K38323A23640a16578C9548L28391g2432A40257E4628J35929
15150A90557J12348F6450M1648R7433E7368d8255j98320B12523o9399M39681k86444
15139B96361F3952R842N12554A09936a86563e5408A2737M12226b13319f8470j39524
$$ plain form
15128 -207994 82299 107639 270539 130051 86614 270414 -60407 273104 79847 392807
15118 392807 41448 -33791 -35293 -53717 -207364 246167 -163267 99501 174261 -54398 -254608
15107 -254608 82376 76133 -23825 132251 321664 4537 -191528 282808 55632 34691 262693
15096 262693 57916 48042 -179624 145531 -3337 78944 296904 182 124285 305172 -23440
15084 249170 -151947 -114638 234357 256992 149376 90711 432916 102701 399774 348656
15074 348656 66176 -97251 384232 108721 -72469 71973 337381 142371 123934 22319 -213280
15062 -26680 259678 452087 238147 261869 -204478 254050 432598 -5578 270081 156229
15052 156229 -1320 247220 -39538 115152 165424 154750 213141 440747 284885 489677 212081
$$ packed form
15128b07994H2299K5340J62900A30051m3437J83800f0407B73104G9847L12960
15118C92807D1448c3791j502j8424j53647B46167a63267I9501P4760e4398k00210
15107b54608H2376o243b3825A32251J89413D537a91528B82808E5632k0941K28002
15096B62693E7916r874a79624A45531c337G8944K17960A82J24103J80887b3440
15084B49170a51947L7309B34357K2635j07616n8665L42205A02701K97073n1118
15074C48656F6176i7251C84232A08721g2469G1973K65408A42371j8437B2319b13280
15062b6680B59678J92409k13940K3722b04478B54050J78548e578B70081j13852
15052A56229a320B47220c9538A15152N0272j0674N8391K27606j55862K04792B12081
$$ plain form
15040 -66060 155084 154173 1287 153552 75987 -103771 193784 459870 522705 56211 116478
15029 116478 222912 72710 -6891 222883 228039 156137 265255 351225 118117 165150 38649
15017 304234 297381 216372 227902 175568 227619 190201 249113 430634 8003 211498 472177
15006 472177 285764 18810 204788 154456 398461 -22748 229185 -22759 573836 577951 511278
14995 511278 441345 521304 370974 195742 -92320 129377 -38060 134648 355568 363399 361212
14984 361212 294670 144214 165545 248780 459920 50471 487020 418054 151509 200305 272999
14973 272999 54662 343969 -54332 160358 266903 459746 438869 41031 -53986 173180
14962 26839 -151998 128570 19787 334504 162986 423279 149587 212078 185490 295636
$$ packed form
15040f6060A55084r11A287J52265G5987a03771A93784K66086O2835E6211O0267
15029A16478J06434G2710f891B22883N156p1902J09118Q5970A18117M7033C8649
15017C04234o853q1009J1530n2334N2051l7418N8912J81521H003K03495K60679
15006D72177j86413A8810J85978n0332K44005b2748B29185b2759E73836M115o6673
14995E11278o9933P9959j50330j75232i2320A29377c8060A34648K20920P831k187
14984C61212o6542A44214K1331Q3235K11140E0471M36549o8966A51509M8796P2694
14973B72999E4662K89307e4332A60358J06545J92843k0877D1031e3986A73180
14962B6839a51998A28570A9787L14717A62986K60293A49587O2491k6588J10146
$$ plain form
14952 295636 -5662 341956 411574 346231 407770 206565 176540 328856 255426 172754 482965
14941 482965 336215 235715 278935 366234 421356 99131 508751 405423 91315 78600 364248
14930 364248 244527 285042 401891 58614 246200 428745 166124 365597 570889 314965
14920 314965 54536 32816 415586 269483 79213 278112 227873 421816 231604 338268
14910 338268 491075 117577 177715 382325 306835 319244 546659 293454 418894 382965
14900 382965 532607 189718 277970 280588 509229 400060 323539 130535 190554 466954
14890 466954 131952 387825 365958 232691 272067 259666 185777 359162 335484 528631
14880 528631 385471 163500 385975 440222 84170 620720 494189 358919 549357 253087
$$ packed form
14952B95636e662C41956O9618o5343O1539k01205l0025J52316p3430q2672L10211
14941D82965j46750j00500M3220Q7299N5122I9131M09620j03328I1315j2715K85648
14930C64248j19721M0515J16849E8614J87586J82545A66124J99473K05292k55924
14920C14965E4536k1720L82770j46103G9213J98899n0239J93943j90212J06664
14910C38268J52807A17577O0138K04610p5490J2409K27415k53205J25440l5929
14900C82965J49642A89718Q8252K618K28641j09169p6521A30535O0019K76400
14890D66954A31952K55873k1867j33267L9376j2401p3889J73385k3678J93147
14880E28631j43160A63500K22475N4247H4170N36550j26531j35270J90438B53087
$$ plain form
14869 550726 199638 280322 435557 667129 243599 239066 521497 134363 448726 330983
14859 330983 822036 486646 310640 370327 5678 418443 435853 362680 552205 133137
14848 540320 127023 374506 574924 460608 294411 264418 589863 270805 520979 321147
14838 321147 627215 544723 509887 307418 502261 522263 251712 487167 581324 172456
14827 598020 599345 597364 676979 605372 498280 398226 477887 717879 630657 581221 379281
14816 379281 500467 679861 287182 761818 530111 716748 621509 242679 843359 511960
14806 511960 676308 492305 346297 768180 566581 747874 440831 616435 524767 533729
14796 533729 212690 554648 594653 566998 749150 468651 589295 590670 294834 434091
$$ packed form
14869E50726A99638Q0684J55235K31572B43599m533K82431A34363L14363j17743
14859C30983M91053l35390j76006N9687E678M12765J7410p3173J89525A33137
14848E40320A27023K47483K00418j14316j66197k9993L25445B70805K50174j99832
14838C21147L06068q2492l4836k02469J94843K0002B51712K35455R4157A72456
14827E98020J325j981P9615p1607j07092j00054P9661K39992q7222m9436k01940
14816C79281J21186J79394B87182M74636k31707J86637r5239B42679O00680l31399
14806E11960J64348j84003j46008M21883k01599J81293l07043J75604r1668Q962
14796E33729B12690L41958M0005k7655J82152k80499J20644J375B94834J39257
$$ plain form
14786 434091 429035 304169 622120 211535 705576 430011 485608 518806 313397 515891
14776 515891 680240 472497 439766 500130 381167 664074 341086 768519 573422 475019
14766 475019 665880 497879 679424 286541 494643 533418 732779 637190 454476 606801
14756 606801 553989 671626 339367 896865 464187 494804 817468 838649 681463 817564
14746 817564 678584 716709 896680 986212 782355 447643 777817 657632 875928 871705
14736 871705 659786 759114 803655 618594 758517 361428 957749 853309 532604 742622
14726 742622 887637 683153 511813 778986 846247 743572 786278 453556 668873 809525
14716 809525 564638 582313 977353 871761 743545 833353 816967 878611 647203 927674
$$ packed form
14786D34091n056j24866L17951B11535M94041k75565N5597L3198k05409K02494
14776E15891J64349k07743l2731O0364j18963K82907l22988M27433j95097r8403
14766D75019J90861j68001J81545B86541K08102L8775J99361r5589j82714J52325
14756F06801n2812J17637l32259N57498m32678L0617L22664K1181j57186J36101
14746H17564j38980L8125J79971Q9532k03857l34712L30174j20185K18296m223
14736H71705k11919R9328M4541j85061J39923C61428N96321j04440l20705K10018
14726G42622J45015k04484j71340K67173O7261j02675M2706l32722K15317J40652
14716H09525k44887J7675L95040j05592j28216Q9808j6386O1644k31408K80471
$$ plain form
14706 927674 853419 755037 976289 637746 686958 522214 919927 652323 659886 962209
14696 962209 669056 889828 642205 1204363 815606 952713 665750 999833 1015992 931400
14686 931400 942031 1009516 1159897 862028 873927 1221102 751424 709681 984816 1010732
14676 1010732 1186048 1120741 1004424 1085945 820288 1181952 1262055 1005077 1055117 1633666
14666 1633666 1325603 674800 976364 1286181 1351866 893996 1092136 1399090 1115111 1133557
14656 1133557 1160496 1282552 1131015 1100660 787397 966843 1088793 1048058 1324815 1072937
14646 1072937 1369275 982565 1267803 1250939 1180887 1353893 1234955 1246004 1489742 1503283
14636 1503283 1089623 1326230 1564604 1303069 1405990 1466067 1358680 1477325 1041118 1465799
$$ packed form
14706I27674p4255r8382K21252l38543M9212j64744L97713k67604P563L02323
14696I62209k93153K20772k47623N62158l88757J37107k86963L34083J6159q4592
14686I31400J0631O7485J50381k97869J1899L47175m69678m1743K75135K5916
14676A010732J75316o5307j16317Q1521k65657L61664Q0103k56978N0040N78549
14666A633666l08063o50803L01564L09817O5685m57870J98140L06954k83979J8446
14656A133557K6939J22056j51537l0355l13263J79446J21950m0735K76757k51878
14646A072937K96338l86710K85238j6864p0052J73006j18938J1049K43738J3541
14636A503283m13660K36607K38374k61535J02921O0077j07387J18645m36207M24681
$$ plain form
14626 1465799 1383255 1485461 1675640 1294697 1084812 1438840 1495371 1622468 1499557 1402737
14616 1402737 1426576 1491883 1818413 1392258 1404209 1479839 1860444 1639803 1611533 1566719
14606 1566719 1476675 1606356 1788189 1447778 1432126 1370500 1409806 1727838 1536418 1671148
14596 1671148 1678027 1925457 1627063 1909092 1825815 1844781 1755897 1966455 1557914 1840435
14586 1840435 2352629 1982484 1920051 1675972 2098678 2158719 2067989 2153333 2373913 2121729
14576 2121729 2195515 2190363 2296591 2414936 2075434 2206418 2150178 2597940 2409892 2508127
14566 2508127 2508966 2477021 2591746 2861865 2798567 3199705 3027465 2968318 3317902 3812998
14556 3812998 4138859 3631702 4266569 4781531 5278480 6396218 7913944 10436932 13935641
$$ packed form
14626A465799q2544J02206J90179l80943k09885L54028N6531J27097j22911r6820
14616A402737K3839O5307L26530m26155J1951P5630L80605k20641k8270m4814
14606A566719r0044J29681J81833l40411j5652o1626L9306L18032j91420J34730
14596A671148O879K47430k98394K82029q3277J8966q8884K10558m08541K82521
14586A840435N12194l70145o2433k44079M22706O0041r0730Q5344K20580k52184
14576B121729P3786n152J06228J18345l39502J30984n6240M47762j88048R8235
14566B508127Q39l1945J14725K70119o3298M01138j72240n9147L49584M95096
14556C812998L25861n07157O34867N14962M96949J117738J517726K522988L498709
$$ plain form
14547 13935641 20349537 27489063 24918716 18290160 12813025 9013241 6341418 5022645
14539 5022645 4079249 3583715 2975458 3135069 2679160 2710605 2716466 2573744 2429707 2215827
14529 2215827 2672185 2749303 2476543 2406334 2807410 2482137 2689045 2894446 2903670 2762385
14519 2762385 2590530 2686201 3179461 2733022 2794503 3114079 2665773 3026219 3028809 2836419
14509 2836419 3230812 2907301 2883179 2697015 3233978 3047016 3354708 2951417 3210790 3209734
14499 3209734 3394420 3242541 3105144 3465737 3520417 3791242 3462209 3506099 3541955 3472348
14489 3472348 3569503 3791366 3818561 3889540 3839745 3647404 3991654 3852761 3903985 4006000
14479 4006000 4192433 3945217 4325864 4155564 4283656 4364109 4253250 4498747 4310973 4526000
$$ packed form
14547A3935641O413896P139526k570347o628556n477135l799784k671823j318773
14539E022645r43396m95534o08257J59611m55909L1445N861j42722j44037k13880
14529B215827M56358P7118k72760p0209M01076l25273K06908K05401R224j41285
14519B762385j71855R5671M93260m46439O1481L19576m48306L60446K590j92390
14509B836419L94393l23511k4122j86164N36963j86962L07692m03291K59373j056
14499C209734J84686j51879j37397L60593N4680K70825l29033M3890L5856o9607
14489C472348R7155K21863K7195P0979m9795j92341L44250j38893N1224J02015
14479D006000J86433k47216L80647j70300J28092Q0453j10859K45497j87774K15027
$$ plain form
14469 4526000 4434313 4614883 4799796 4756428 4476992 4858886 4913207 4858331 5114416 4715557
14459 4715557 5238238 5285504 5057158 5625510 5165595 5278437 5283240 5287260 5271413 5747556
14449 5747556 5570276 5846322 5742458 5551336 5626926 6174794 5752974 6234535 6249500 6252247
14439 6252247 6496234 6576879 6425545 6457391 6448095 6629746 6942438 7039414 6916231 7359117
14429 7359117 7335969 7115331 7614112 7600918 7504172 7662171 7655072 7910629 8108130 8033805
14419 8033805 8503740 8339867 8327311 8468216 8947778 8821088 9305780 8904296 9145811 9686153
14409 9686153 9736912 9737782 9984333 10126755 9996495 10178876 10346250 10837295 10806232 11226019
14399 11226019 11326720 11248726 11490429 11818376 11946187 12107617 12656014 12601888 13120630 13141316
$$ packed form
14469D526000r1687J80570J84913m3368k79436L81894N4321n4876K56085l98859
14459D715557N22681M7266k28346N68352m59915J12842M803M020j5847M76143
14449E747556j77280K76046j03864j91122P5590N47868m21820M81561J4965K747
14439F252247K43987Q0645j51334L1846r296J81651L12692R6976j23183M42886
14429G359117k3148k20638M98781j3194r6746J57999p099K55557J97501p4325
14419H033805M69935j63873j2556J40905M79562j26690M84692m01484K41515N40342
14409I686153N0759Q70K46551J42422j30260J82381J67374M91045l1063M19787
14399A1226019J00701p7994K41703L27947J27811J61430N48397n4126N18742K0686
$$ plain form
14389 13141316 13110664 13347888 13857459 14033352 14119442 14707683 14715618 15217718 15293031 15492534
14379 15492534 16222599 16234851 16588497 16787550 17043302 17790390 18066147 18494633 18281961
14370 18281961 18885014 19493059 19715063 19963371 20555530 20940551 21565843 21793640 22106630
14361 22106630 23106023 23482021 24264606 24800325 25190034 25903282 25933148 27138715 27502612
14352 27502612 28093729 28801581 29739641 30271172 30889575 31567660 32773005 33498646 34422635
14343 34422635 35129312 36284560 36972690 38130612 39314712 40299370 41241355 42305387 43911587
14334 43911587 44532845 46182912 47590391 49164964 50836554 52501907 53887087 55516348
14326 55516348 57526944 59340008 61681478 63702164 65737577 67897045 70418855 72979885
$$ packed form
14389A3141316l0652K37224N09571J75893Q6090N88241P935N02100P5313J99503
14379A5492534P30065J2252L53646J99053K55752P47088K75757M28486k12672
14370A8281961O03053O08045K22004K48308N92159L85021O25292K27797L12990
14361B2106630R99393L75998P82585N35719L89709P13248K9866J205567L63897
14352B7502612N91117P07852R38060N31531O18403O78085J205345P25641R23989
14343C4422635P06677J155248O88130J157922J184100R84658R41985J064032J606200
14334D3911587O21258J650067J407479J574573J671590J665353J385180J629261
14326E5516348K010596J813064K341470K020686K035413K159468K521810K561030
$$ plain form
14318 72979885 75592770 78408034 81472593 84719633 87593719 91339685 94919139 98476252
14310 98476252 102431504 106710149 111441154 116054007 120834478 126231768 131794501 138114482
14302 138114482 144035149 150823604 157781119 165012802 173056426 181253883 190066217 199395960
14294 199395960 209128447 219327247 229958964 240877958 252766685 264472831 276702282
14287 276702282 289038210 301695679 314665532 328233014 341734414 355643603 369103004
14280 369103004 382744946 395622354 407809541 419136736 429439670 436126508 439718717
14273 439718717 443153600 445576561 446379807 446563150 441933778 432882120 425123199 416248262
14265 416248262 407373102 398027351 386697081 374773279 361983286 348587429 335822026
$$ packed form
14318G2979885K612885K815264L064559L247040K874086L745966L579454L557113
14310I8476252L955252M278645M731005M612853M780471N397290N562733O319981
14302A38114482N920667O788455O957515P231683Q043624Q197457Q812334R329743
14294A99395960R732487J0198800J0631717J0918994J1888727J1706146J2229451
14287B76702282J2335928J2657469J2969853J3567482J3501400J3909189J3459401
14280C69103004J3641942J2877408J2187187J1327195J0302934O686838L592209
14273D39718717L434883K422961Q03246J83343m629372r051658p758921q874937
14265D16248262q875160r345751j1330270j1923802j2789993j3395857j2765403
$$ plain form
14258 335822026 323188802 310163419 297337199 285325202 273769476 262799079 252199059
14251 252199059 241821696 231864000 221759198 212365589 203204028 194842687 186695682 178594196
14243 178594196 171073994 163835078 156991705 150382633 144189493 138499195 132720821 127265842
14235 127265842 122205021 117549743 112832785 108653079 104421186 100768031 96907700 93293181
14227 93293181 89552600 86510469 83685183 80665129 78176996 75722412 73346662 70791695
14219 70791695 68647939 66201339 63926927 61253265 59642038 58155839 56421832 54178609
14211 54178609 52495571 51408814 49636288 47988046 46943060 45842738 44289793 42747355
14203 42747355 42051908 40822208 39468855 38658957 37571232 36153979 35558615 34528698
$$ packed form
14258C35822026j2633224j3025383j2826220j2011997j1555726j0970397j0600020
14251B52199059j0377363r957696j0104802r393609r161561q361341q147005q101486
14243A78594196p520202p238916o843373o609072o193140n690298n778374n454979
14235A27265842n060821m655278m716958m179706m231893l653155l860331l614519
14227I3293181l740581l042131k825286l020054k488133k454584k375750k554967
14219G0791695k143756k446600k274412k673662j611227j486199j734007k243223
14211E4178609j683038j086757j772526j648242j044986j100322j552945j542438
14203D2747355o95447j229700j353353q09898j087725j417253n95364j029917
$$ plain form
14195 34528698 33566197 32687625 32126258 31430756 30522564 29599554 28832158 28382292 27438232
14186 27438232 27153851 26402478 25350469 25163784 24710802 24240036 23732477 23169669 22556858
14177 22556858 22033873 21605832 21380853 20721550 20201918 19803033 19718629 19003505 18943221 18113813
14167 18113813 18189130 17685373 17415422 17259064 16407526 16016912 16049981 16049893 15834870 15094442
14157 15094442 14909899 14750846 14377908 14245914 13841108 13688353 13622740 13599880 13242593 12747951
14147 12747951 12806261 12603138 12674025 12130757 11921210 11484564 11533845 11818938 11343276 11098749
14137 11098749 10940239 10790123 10684689 10471045 10361792 10355727 10074444 9651872 9880185 9619429
14127 9619429 9294444 9519492 9043439 9027572 8929021 8725880 8679943 8664277 8525807 8286146
$$ packed form
14195C4528698r62501q78572n61367o95502r08192r23010p67396m49866r44060
14186B7438232k84381p51373j052009j86685m52982m70766n07559n62808o12811
14177B2556858n22985m28041k24979o59303n19632l98885q4404p15124o0284q29408
14167A8113813P5317n03757k69951j56358q51538l90614L3069q8k15023p40428
14157A5094442j84543j59053l72938j31994m04806j52755o5613k2860l57287m94642
14147A2747951N8310k03123P0887n43268k09547m36646M9281K85093m75662k44527
14137A1098749j58510j50116j05434k13644j09253o065k81283m22572K28313k60756
14127I619429l24985K25048m76053j5867r8551k03141m5937j5666j38470k39661
$$ plain form
14117 8286146 8415279 7918614 8017948 7681809 7865739 7501012 7294513 7650524 7453819 7422343
14107 7422343 7339610 7148451 6791220 6680910 6632161 6885288 6704871 6872465 6558683 6240339
14097 6240339 6450443 6614804 6267932 6425635 6111579 6011798 5906247 5924852 5796110 5627253
14087 5627253 5644303 5543770 5583513 5529812 5328190 5349138 5216971 4780925 5263766 5151281
14077 5151281 5254533 5420829 4990698 4592455 4836594 4639898 4838659 4697135 4597688 4196829
14067 4196829 4375089 4212500 4703409 4157022 4576025 4315555 4211381 4329845 4443290
14058 4443290 4323080 4239751 4098197 3940199 3571318 4168523 3774026 3812142 3911134 4065805
14048 4065805 3884576 3596023 3618082 3883752 3407174 3572904 3421128 3340442 3372975 3386209
$$ packed form
14117H286146J29133m96665R9334l36139J83930l64727k06499L56011j96705l1476
14107G422343q2733j91159l57231j10310m8749K53127j80417J67594l13782l18344
14097F240339K10104J64361l46872J57703l14056r9781j05551J8605j28742j68857
14087E627253J7050j00533L9743n3701k01622K0948j32167m36046M82841j12485
14077E151281J03252J66296m30131l98243K44139j96696J98761j41524r9447m00859
14067D196829J78260j62589M90909n46387M19003k60470j04174J18464J13445
14058D443290j20210q3329j41554j57998l68881N97205l94497L8116R8992J54671
14048D065805j81229k88553K2059K65670m76578J65730j51776q0686L2533J3234
$$ plain form
14038 3386209 3397880 3153559 3369287 3278317 3327018 3200333 3135287 3421640 2921940 3394850
14028 3394850 2915408 3378115 3269593 2813903 3214340 3419940 2906960 3172900 3175721 3180701
14018 3180701 2977949 2659374 3061020 2610764 3048726 2885752 2804674 2557254 2676531 2875810
14008 2875810 2403496 2686227 2554831 2408633 2517016 2980576 2554915 2741166 2751015 2606876
13998 2606876 2681105 2574078 2781321 2764331 3156589 2753257 3472196 4044741 4912935 6686704
13988 6686704 10303362 16268514 24522236 25183507 19808161 14065206 10451399 8322892
13980 8322892 6351088 5527756 5226703 4385594 4354350 3725010 4092003 3342764 3420358 2946373
13970 2946373 2892838 2809391 2950862 2604238 2687101 2770479 2710611 2673878 2447579 2403793 2448068
$$ packed form
14038C386209J1671k44321K15728r0970M8701j26685o5046K86353m99700M72910
14028C394850m79442M62707j08522m55690M00437K05600n12980K65940K821M980
14018C180701k02752l18575M01646m50256M37962j62974q1078k47420J19277J99279
14008B875810m72314K82731j31396j46198J08383M63560m25661J86251R849j44139
13998B606876P4229j07027K07243j6990L92258m03332P18939N72545Q68194J773769
13988F686704L616658N965152Q253722O61271n375346n742955l613807k128507
13980H322892j971804q23332l01053q41109l1244o29340L66993p49239P7594m73985
13970B946373n3535q3447J41471l46624Q2863Q3378n9868l6733k26299m3786M4275
$$ plain form
13959 2448068 2400646 2557124 2343247 2500590 2106006 2167201 2451748 2301383 2275546 2645342
13949 2645342 2198377 1492361 1892354 2039170 1981065 1746527 2040496 1864752 1714001 1858431
13939 1858431 1871284 1856651 1515088 1851014 1742787 1640331 1550976 1581462 1736764 1786411
13929 1786411 1923320 1798460 1805857 1684732 1604790 1488155 1712053 1655569 1576143 1674671
13919 1674671 1853590 1740734 1775895 1486727 1438062 1534900 1746229 1669453 1650299 1605980
13909 1605980 1231533 1740319 1421635 1243343 1453449 1502922 1432792 1762444 1528841 1060312
13899 1060312 1594260 1379332 1164659 1468524 1504784 1473973 1594263 1440309 1383195 1261595
13889 1261595 1269511 1481288 1202524 1525328 1518246 1516677 1079919 1317259 1087619 1426992
$$ packed form
13959B448068m7422J56478k13877J57343l94584O1195K84547j50365k5837L69796
13949B645342m46965p06016L99993J46816n8105k34538K93969j75744j50751J44430
13939A858431J2853j4633l41563L35926j08227j02456q9355L0486J55302M9647
13929A786411J36909j24860P397j21125p9942j16635K23898n6484p9426R8528
13919A674671J78919j12856L5161k89168m8665R6838K11329p6776j9154m4319
13909A605980l74447N08786l18684j78292K10106M9473p0130L29652k33603m68529
13899A060312N33948k14928k14673L03865L6260l0811J20290j53954n7114j21600
13889A261595P916K11777k78764L22804p082j569m36758K37340k29640L39373
$$ plain form
13879 1426992 1284638 1057776 1126558 1301488 715388 1217810 1320212 1414113 1193379 1087616
13869 1087616 1445815 1183307 1195568 1152400 1167059 1409477 1188113 1262579 1111252 1353375
13859 1353375 1163659 1464162 889617 1139830 1324236 1393757 915732 1196208 1136255 1163726
13849 1163726 1043725 979218 1095450 826169 1212231 875276 1182129 852077 1128143 1227671
13839 1227671 943854 1037532 787094 1209228 982719 1125848 1101008 897702 998836 851315
13829 851315 973967 1080217 942049 859457 800964 1135142 1002070 965781 1117392 1611372
13819 1611372 907505 1131495 1229379 1245430 1099913 863192 734351 868549 1011340 1076077
13809 1076077 901186 771183 591285 922294 835365 780074 663276 916450 952210 679203
$$ packed form
13879A426992j42354k26862O8782J74930n86100N02422J02402R3901k20734j05763
13869A087616L58199k62508J2261m3168J4659K42418k21364P4466j51327K42123
13859A353375j89716L00503n74545K50213J84406O9521m78025K80476n9953K7471
13849A163726j20001o4507J16232k69281L86062l36955L06853l30052K76066R9528
13839A227671k83817R3678k50438M22134k26509J43129k4840k03306J01134j47521
13829H51315J22652J06250j38168q2592n8493L34178j33072l6289J51611M93980
13819A611372p03867K23990R7884J6051j45517k36721j28841J34198J42791O4737
13809A076077j74891j30003j79898L31009q6929n5291j16798K53174L5760k73007
$$ plain form
13799 679203 698045 707597 685852 772472 568895 860788 1112309 826846 861515 846747 780266
13788 780266 596467 453172 1013714 964875 1029837 828364 914493 446221 799074 1080775
13778 1080775 579451 631537 664810 511160 764510 604326 813096 572600 360325 789299
13768 789299 840444 661065 530379 885106 723269 613839 583189 692104 766002 985066
13758 985066 935566 830127 651613 670794 717985 450946 708566 922895 631472 843508
13748 843508 715705 1025593 735034 574420 637934 739865 860262 570828 378534 548087
13738 548087 589107 541777 402947 290808 775329 484649 752716 898725 680034 536662
13728 536662 632725 516586 581490 355545 406091 726231 831048 758716 531002 954461
$$ packed form
13799F79203J8842R552k1745Q6620k03577K91893K51521k85463L4669j4768o6481
13788G80266j83799j43295N60542m8839O4962k01473Q6129D46221L52853K81701
13778A080775n01324N2086L3273j53650K53350j60184K08770k40496k12275M28974
13768G89299N1145j79379j30686L54727j61837j09430l0650J08915P3898K19064
13758I85066m9500j05439j78514J9181M7191k67039K57620K14329k91423K12036
13748H43508j27803L09888k90559j60614O3514J01931J20397k89434j92294J69553
13738E48087M1020m7330j38830j12139M84521k90680K68067J46009k18691j43372
13728E36662R6063j16139O4904k25945N0546L20140J04817p2332k27714M23459
$$ plain form
13718 954461 545219 506452 505759 617830 663161 777475 693139 691616 909694 543430 687211
13707 687211 548562 927113 620986 367079 534062 114272 559697 593918 472589 692331
13697 692331 516593 514972 557583 410160 587926 387683 421098 756336 717083 710732 525462
13686 525462 708841 8045 469565 440464 515296 685098 802334 504333 631786 316505
13676 316505 636119 699744 718027 572905 644837 609017 333497 481521 599312 554467
13666 554467 746309 291351 405480 608283 658457 468947 427926 578079 204218 581265
13656 581265 718877 542584 378987 448337 402504 449148 383423 404019 647820 451386
13646 451386 549092 205271 160861 398052 717052 241222 492300 466567 320264 657568
$$ packed form
13718I54461m09242l8767o93J12071M5331J14314q4336j523K18078l66264J43781
13707F87211j38649L78551l06127k53907J66983A14272M45425L4221j21329K19742
13697F92331j75738j621M2611j47423J77766k00243L3415L35238l9253o351j85270
13686E25462J83379H045M61520k9101P4832J69802J17236k98001J27453l15281
13676C16505L19614O3625J8283j45122P1932l5820k75520J48024J17791m4845
13666E54467J91842B91351J14129K02803N0174j89510m1021J50153B04218L77047
13656E81265J37612j76293j63597O9350m5833M6644o5725K0596K43801j96434
13646D51386R7706B05271m4410K37191L19000B41222K51078k5733j46303L37304
$$ plain form
13636 657568 592538 495992 567522 596967 532224 265837 286154 664324 524547 391916 526594
13625 526594 606013 283253 661191 368791 734775 426195 561955 383434 588687 350106
13615 350106 301989 557613 206208 524526 533735 -47679 469820 506612 498623 174248 352332
13604 352332 615047 310165 117270 422681 229116 590882 580162 570256 475491 162632
13593 325223 245276 490211 225358 182767 110001 605840 436685 320002 459475 354444
13583 354444 531677 328061 587722 472154 412269 204446 322160 6371 507960 364058
13573 364058 155953 241042 280431 386039 447858 171130 354371 453514 147300 361399
13563 361399 270497 340529 410027 140431 308789 302533 244812 94402 -47630 413801 299291
$$ packed form
13636F57568o5030r6546P1530K9445o4743B65837K0317L78170j39777j32631J34678
13625E26594P9419B83253L77938k92400L65984l08580J35760j78521K05253k38581
13615C50106m8117K55624B06208L18318R209d7679D69820L6792p989A74248J78084
13604C52332K62715l04882A17270L05411j93565L61766j0720r906r4765A62632
13593C25223p9947K44935B25358m2591p2766M95839j69155j16683J39473j05031
13583C54444J77233k03616K59661j15568n9885B04446J17714F371N01589j43902
13573C64058A55953Q5089L9389J05608O1819A71130J83241R9143A47300K14099
13563C61399r0902P0032O9498A40431J68358o256n7721I4402d7630D13801j14510
$$ plain form
13552 299291 391575 293577 213036 510122 294969 175209 500699 523514 180824 207207
13542 207207 397432 339392 114974 234513 404642 498563 92429 489423 337320 250186
13532 250186 223641 353220 429361 320050 -93104 274527 302341 413560 418304 550468 334556
13521 334556 377156 466692 135155 238448 317485 458847 303355 354608 331864 205747
13511 205747 373997 419879 134064 404801 396505 482604 572648 157254 439733 376036 200619
13500 200619 72986 299241 68832 223016 70325 376806 83903 559887 241026 -258956
13489 262825 312019 229742 350600 96254 632244 1059 443159 408557 322410 292979 54546
13477 186328 384245 198520 200043 30030 316203 284739 335789 27600 -78920 312978 126559
$$ packed form
13552B99291R2284r7998q0541K97086k15153j19760L25490K2815A80824K6383
13542B07207J90225n8040A14974J19539J70129R3921I2429L96994j52103q7134
13532B50186k6545J29579P6141j09311i3104B74527K7814J11219M744J32164k15912
13521C34556M2600Q9536A35155J03293P9037J41362j55492N1253k2744j26117
13511B05747J68250M5882A34064K70737q296Q6099R0044A57254K82479o3697j75417
13500B00619G2986K26255F8832J54184G0325L06481H3903M75984B41026b58956
13489B62825M9194q2277J20858I6254N35990A059M42100l4602q6147k9431E4546
13477A86328J97917j85725J523C0030K86173l1464N1050B7600g8920C12978A26559
$$ plain form
13465 613068 243817 320259 260768 284179 -362779 451809 236172 334103 382028 11558 446717
13454 446717 189703 128148 236511 365987 144311 151269 206081 287391 -43988 360920 901924
13443 901924 221448 52340 117098 367332 460266 307975 -6586 321785 106242 150354 142657
13432 142657 15731 36328 345084 253258 304833 380567 310673 49862 293589 94281 156505
13421 156505 137877 367054 213060 99145 114531 465899 228452 13496 69308 80938 201987
13410 201987 267040 65488 147887 231213 337059 451742 514919 150627 416431 304481
13400 304481 148080 160182 690118 256440 329487 -138663 167801 53874 94362 49039
13390 49039 364333 328925 179023 178295 34510 266943 29869 366282 325718 43921 244021
$$ packed form
13465F13068B43817P6442n9491K3411c62779D51809k15637R7931M7925A1558M35159
13454D46717A89703o1555J08363J29476A44311O958N4812Q1310d3988C60920N41004
13443I01924B21448E2340O4758K50234R2934j52291f586C21785A06242M4112p697
13432A42657A5731K0597L08756r1826N1575P5734o9894D9862K43727I4281O2224
13421A56505j8628K29177j53994I9145J5386L51368B28452A3496N5812J1630J21049
13410B01987O5053F5488Q2399Q3326J05846J14683O3177A50627K65804j11950
13400C04481A48080J2102N29936B56440P3047a38663A67801E3874M0488m5323
13390D9039L15294l5408j49902p28C4510K32433B9869L36413m0564D3921K00100
$$ plain form
13379 244021 94491 194489 170753 343988 241429 357534 100060 212873 32747 249551
13369 249551 143755 74765 59867 294735 312881 -49726 555858 271549 406229 201219
13358 163040 -64240 380444 177336 242035 -80053 320909 425546 265419 225587 226991 161311
13347 161311 322818 158164 62283 219925 576197 85518 99942 358644 99894 286051
13337 286051 237983 62873 -230252 308728 390720 325946 206659 532932 311033 221645
13327 221645 308272 443661 248548 207593 -10 269425 -43917 282693 296261 162245 38879
13315 280821 538047 148461 134053 118335 -329971 456769 138882 366868 -93591 124472
13304 71353 227706 58709 106458 438903 152340 101771 213585 125649 99623 196929 229823
$$ packed form
13379B44021I4491R9998k3736J73235j02559J16105A00060J12813C2747K16804
13369B49551j05796o8990j4898K34868J8146d9726E55858B71549J34680B01219
13358A63040f4240C80444A77336O4699h0053C20909J04637j60127l9832J404o5680
13347A61311J61507A58164F2283J57642L56272H5518J4424K58702I9894J86157
13337B86051m8068F2873b30252C08728Q1992o4774j19287L26273k21899q9388
13327B21645Q6627J35389j95113m0955a0B69425d3917B82693J3568j34016C8879
13315B80821K57226A48461j4408j5718c29971D56769A38882K27986i3591A24472
13304G1353J56353E8709M7749L32445A52340n0569J11814q7936k6026R7306L2894
$$ plain form
13293 229823 448771 443534 -69253 309925 102444 327651 154627 356198 351174 116687
13282 435199 -62011 114951 121186 340168 90361 46710 130342 -71228 -16509 -34594 140625
13270 198150 103828 339260 92097 -10312 -180822 -34043 -302437 -23413 5900 -120079 67639
13258 -115285 -247425 -224541 -27241 156726 199606 53346 290405 373615 207491 6752 279480
13247 279480 73658 -144866 -59950 -365630 138705 46751 180614 177240 65393 260927 162048
13236 162048 321828 43116 180869 414133 97390 65722 -169694 232808 194983 -193180
13225 459977 7662 273843 51956 113540 -111228 79483 420712 195647 125632 65883 327168
13214 327168 318328 154220 298355 261956 165490 149713 32730 -62462 160112 -172891 -46997
$$ packed form
13293B29823K18948n237f9253C09925A02444K25207A54627K01571n024A16687
13282D35199f2011A14951O235K18982I0361m3651Q3632g1228a6509j8085A40625
13270A98150r4322K35432I2097a0312j70510c4043k68394b3413E900a20079F7639
13258a15285j32140K2884b7241A56726M2880E3346K37059Q3210j66124F752K72728
13247B79480G3658a44866e9950l05680A38705D6751J33863l374F5393J95534r8879
13236A62048J59780D3116J37753K33264I7390l1668a69694B32808l7825a93180
13225D59977G662K66181E1956O1584a11228G9483L41229A95647p0015n9749K61285
13214C27168q840A54220J44135l6399r6466j5777C2730f2462A60112a72891d6997
$$ plain form
13202 60535 71362 179564 -216573 -16915 14569 66708 -114517 117378 -160654 47778 101739
13191 101739 100356 -49917 272451 127046 -37382 235283 -41064 194380 138598 -61145 1885
13179 -337953 12437 256454 233431 365242 261887 -65456 216981 84662 -71038 10800 23776
13168 23776 320868 -114064 213960 -229575 -124824 -112583 -188099 -76787 125136 459479
13158 459479 -137454 67635 314733 -161288 -190037 462323 61313 -334837 54716 130649
13148 130649 204350 -143205 233980 -30289 104427 -113468 -171412 -35101 335530 267053
13138 267053 -198970 92471 -80743 196796 -257620 35675 138660 240637 216652 337656
13128 337656 -39423 344352 439211 166145 59395 270856 1880 210425 -34235 -44531 100091
$$ packed form
13202F0535J0827J08202b16573a6915A4569N2139a14517A17378a60654D7778N3961
13191A01739j383d9917B72451A27046c7382B35283d1064A94380n5782f1145A885
13179c37953A2437K44017k3023J31811j03355f5456B16981H4662g1038A0800J2976
13168B3776K97092a14064B13960b29575J04751J2241p5516g6787A25136L34343
13158D59479a37454F7635K47098a61288k8749D62323F1313c34837E4716P5933
13148A30649P3701a43205B33980c0289A04427a13468n7944c5101C35530o8477
13138B67053a98970I2471h0743A96796b57620C5675J02985J01977k3985J21004
13128C37656c9423C44352R4859A66145E9395K11461A880K08545c4235j0296A00091
$$ plain form
13116 -62376 23503 91710 -189910 -91967 289070 -18113 -381532 223913 254909 207387 -262758
13104 -109385 -154426 -105275 -124092 -170134 240869 44508 -49984 219381 342475 -74873 38152
13092 183682 -234612 -94919 317034 -46570 -119682 -43553 284450 -138364 21265 -117083
13081 -397130 35182 -125166 50344 268783 88128 119145 94577 340078 81491 135907 197040
13070 197040 -195948 307731 42514 257792 53653 108149 111676 -185134 -188779 182878 94719
13059 94719 -8707 58044 329174 160046 242874 -96770 114083 -51627 213974 409491 -16739
13047 -15527 184783 131326 594120 354852 11949 51305 190896 543387 -130765 426623
13036 153388 188723 93027 260587 358984 -8456 192300 110797 58089 4386 121432 11469
$$ packed form
13116f2376B3503O8207a89910i1967B89070a8113l63419B23913L0996m7522b62758
13104a09385m5041M9151j8817m6042B40869D4508d9984B19381J23094g4873C8152
13092A83682b34612i4919C17034d6570p3112d3553B84450a38364B1265a17083
13081c97130C5182a25166E0344K18439H8128L1017k4568K45501H1491N4416O1133
13070A97040a95948C07731D2514K15278E3653N4496L527a85134l645A82878q8159
13059I4719h707E8044K71130A60046Q2828i6770A14083e1627B13974J95517a6739
13047a5527A84783n3457M62794k39268A1949L9356J39591L52491a30765D26623
13036A53388L5335I3027J67560R8397h456A92300q1503n2708D386J17046A1469
$$ plain form
13024 642390 358240 -44605 120507 -66165 -47662 60516 20511 713592 66098 247697 220656
13013 220656 193393 94249 633389 -194006 -94982 -64336 -41769 7438 -66739 -89307 31026
13001 209826 152056 131556 -137592 -45027 176649 -44117 -250309 -200338 106148 208311
12991 208311 599061 23686 -105697 279504 38605 -266773 -103857 333159 502353 -99235
12980 113476 217925 114517 -139619 193309 -127252 96964 41331 34581 71165 271942
12970 271942 -259180 68470 90097 -171952 133043 126839 -67524 83953 -32802 30188 -8246
12958 73058 110833 -266786 122245 -388549 144220 137471 3687 388620 -13581 155933 290022
12947 290022 -296030 -128948 213410 75434 158558 155564 102649 26469 -73606 -187659 238495
$$ packed form
13024F42390k84150d4605A20507f6165J8503F0516B0511O93081F6098J81599k7041
13013B20656k7263I4249N39140a94006i4982L0646K2567G438f6739k2568C1026
13001B09826n7770k0500a37592d5027A76649d4117k06192M9971A06148J02163
12991B08311L90750B3686a05697B79504C8605b66773a03857C33159J69194i9235
12980A13476J04449j03408a39619A93309a27252I6964D1331o750L6584K00777
12970B71942b59180F8470K1627a71952A33043o204f7524H3953c2802C0188h246
12958G3058L7775b66786A22245c88549A44220o749C687L84933a3581A55933J34089
12947B90022b96030a28948B13410G5434Q3124k994n2915B6469g3606j14053B38495
$$ plain form
12935 382170 56051 25076 149917 189340 -49425 -136149 174199 218110 126050 -27460 -3128
12923 91916 180465 89329 152201 -134534 45819 255479 -54270 455445 -318679 38191 -166291
12911 -12421 300251 163979 -232615 136107 -18898 -216483 -16110 -29031 289244 336095
12901 336095 -120157 -76488 -43806 -119265 37657 -44222 166540 40958 57860 -414334 261476
12889 -61965 218065 17276 190846 207490 150393 270107 158723 -216065 -296691 -22141 177178
12877 -188806 3207 -85198 162685 165823 -70960 136433 -60730 -164429 85452 -240957 -80352
12865 -216897 193608 -288962 277400 -129095 -29155 27482 94015 67966 175353 -33771
12854 229883 64033 -196378 61539 -178126 140604 -139897 -112205 50209 -54752 201978
$$ packed form
12935C82170E6051B5076J24841L9423d9425q6724A74199M3911r2060b7460c128
12923I1916Q8549H9329O2872a34534D5819K09660e4270D55445c18679C8191a66291
12911a2421C00251j36272b32615A36107a8898j97585a6110j2921B89244M6851
12901C36095a20157M3669L2682p5459C7657d4222A66540D0958J6902d14334B61476
12889f1965B18065A7276J73570J6644n7097J19714j11384b16065q0626b2141A77178
12877a88806C207h5198A62685L138g0960A36433f0730j03699H5452b40957h0352
12865b16897A93608b88962B77400a29095b9155B7482O6533k6049J07387c3771
12854B29883F4033a96378F1539a78126A40604a39897K7692E0209e4752B01978
$$ plain form
12843 -125085 51686 167296 249081 168028 -6227 3980 -341918 139406 -133678 -28504 395348
12831 143990 58771 54037 -182686 267491 47296 -274386 53820 -203585 -552 274279 160302
12820 160302 17634 226540 -214017 334056 424249 -76470 246962 74634 -127962 -14206
12809 -241356 256883 -140318 26882 93837 83554 -61959 90513 94806 198578 -319765 530490
12797 144295 -94478 57487 -285219 110623 11817 68541 -25317 -174075 84593 -25899 343774
12785 -30542 -208547 -152065 145709 116387 51751 -6896 -9996 -128294 -251074 -224018 4512
12773 -112392 -49689 -164282 -328457 -138106 -186461 10389 -152602 270972 -3809 -27103 5384
12761 56598 58563 -169769 122959 52304 -136981 283364 -194861 23219 -418132 202004
$$ packed form
12843a25085E1686J15610Q1785q1053f227C980c41918A39406a33678b8504C95348
12831A43990E8771m734a82686B67491D7296b74386E3820b03585e52B74279j13977
12820A60302A7634K08906b14017C34056R0193g6470B46962G4634a27962a4206
12809b41356B56883a40318B6882O6955j0283f1959I0513M293J03772c19765E30490
12797A44295i4478E7487b85219A10623A1817N6724b5317j48758H4593b5899C43774
12785c0542j78005N6482A45709k9322E1751f896l100j18298j22780K7056D512
12773a12392d9689j14593j64175a38106m8355A0389a52602B70972c809k3294E384
12761E6598J965a69769A22959E2304a36981B83364a94861B3219d18132B02004
$$ plain form
12750 -54230 -72005 -228729 72230 -8797 -14669 -86060 32303 188096 100771 96908 -21727 -116513
12738 -116513 24702 121179 -162795 -204092 44022 266651 185617 59950 26435 65946 206366
12727 206366 214313 195045 109655 13537 236049 228285 135572 -95334 21783 73280 -53924 101803
12714 -42511 -35984 -124524 -54110 53762 -131992 198893 466497 -45145 243714 -12548 68688
12702 477932 261034 35149 -108834 235408 -42023 -120814 -11696 -31369 322230 146856
12691 -135209 -46873 86000 277395 325801 115160 179641 -3005 -35092 -303815 160200 -241659
12679 286744 170013 15863 -123517 5309 176838 115490 172143 -117185 225507 131409 -340875
12667 -119632 6781 236314 -89162 287564 119072 52648 103910 -152253 42957 -59061 -69654
$$ packed form
12750e4230j7775j56724G2230h797n872p1391C2303J55793q7325l863b1727r4786
12738a16513B4702R6477a62795m1297D4022K22629q1034E9950B6435L9511J40420
12727B06366P947j9268q5390A3537K22512p764r2713i5334B1783N1497e3924A01803
12714d2511O527q8540e4110E3762a31992A98893K67604d5145B43714a2548F8688
12702D77932k16898C5149a08834B35408d2023p8791a1696j9673C22230A46856
12691a35209d6873H6000J91395M8406A15160O4481c005l2087k68723A60200b41659
12679B86744j16731A5863a23517E309J71529o1348N6653a17185B25507r4098c40875
12667a19632F781K29533h9162B87564A19072E2648N1262a52253D2957e9061j0593
$$ plain form
12656 -69654 238943 267607 94462 -58927 239679 134127 -102753 8454 131577 -53106 218335
12644 167336 -87307 -44438 224622 183906 -68311 80333 -136930 37667 70273 278626 209003
12633 209003 60741 21343 115438 224179 295770 84219 -10008 4364 430839 -27508 140835
12621 159798 29686 -84842 -4555 463848 52366 250617 -53895 -88295 216962 359611 -145938
12609 45267 35554 132899 -18633 136562 -121134 258436 -42205 110333 99570 -34998 -73656
12598 -73656 -65597 246604 -244577 206070 200750 215630 -26641 -38467 120092 52782 91620
12587 91620 4638 310956 231256 118467 253491 93909 141930 256788 249611 54745 317835
12576 317835 -43297 231132 167716 127005 -66576 209131 135713 -84579 -362447 -59048 104672
$$ packed form
12656f9654B38943K8664I4462e8927B39679j05552a02753H454J23123e3106B18335
12644A67336h7307M2869B24622m0716f8311H0333a36930C7667L2606K08353o9623
12633B09003F0741B1343R4095J08741P1591H4219a0008D364M26475b7508A40835
12621A59798B9686h4842d555D63848E2366J98251e3895l4400B16962J42649a45938
12609D5267r713R7345a8633A36562a21134B58436d2205A10333j0763c4998l8658
12598g3656Q059B46604b44577B06070n320J4880b6641j1826A20092E2782L8838
12587I1620D638L06318p9700j12789J35024I3909M8021J14858p177E4745K63090
12576C17835d3297B31132o3416m0711f6576B09131p3418h4579k77868e9048A04672
$$ plain form
12564 -369985 195746 131116 -79878 -199524 73567 -206799 107511 188705 68274 -362589
12553 309733 -156947 99285 -5039 -122194 -214821 -293339 76422 279426 444124 64873 -70934
12541 -23747 -236983 74024 155851 198907 47200 -163751 -122787 144136 246097 173434 306780
12530 306780 108957 128990 -42772 6119 8736 -87275 -214732 -11108 -173917 209027 260
12518 114677 -70134 87064 -155143 -127690 8017 179690 3501 121946 27187 65311 32624
12506 319253 128186 80339 76832 -44585 324646 54455 -144818 -63450 -120827 -223184 74071
12494 -321293 109965 -49447 277680 131018 -7614 -65440 -35688 126120 -242702 -177921 -151789
12483 -151789 -184482 179024 -20020 -187846 17556 52253 -171301 36365 -138856 262328
$$ packed form
12564c69985A95746o4630g9878j19646G3567b06799A07511Q1194F8274c62589
12553C09733a56947I9285e039j17155r2627p8518G6422K03004J64698F4873g0934
12541b3747k13236G4024Q1827M3056D7200a63751M0964A44136J01961p2663J33346
12530C06780A08957K0033d2772F119K617h7275j27457a1108j62809B09027B60
12518A14677g0134H7064a55143K7453H017J71673C501J18445B7187L8124C2624
12506C19253A28186m7847l507d4585C24646E4455a44818f3450n7377j02357G4071
12494c21293A09965d9447B77680A31018g614n7826K9752A26120b42702O4781K6132
12483a51789l2693A79024b0020j67826A7556L4697a71301C6365a38856B62328
$$ plain form
12472 -141100 327664 135356 59121 -86759 -347449 59167 -432351 5905 -87129 -118095 -149511
12461 -149511 71325 -12390 -41188 179855 -114276 12961 -198578 988 138433 -90267 -19450
12449 -194805 -11271 -529340 48662 -27033 2373 -434273 145221 164519 -258934 90621 -87121
12437 -108919 21204 319512 81826 40270 -192026 -144592 -176953 -36367 -82418 1610 -50435
12425 47951 -300561 -226965 -145279 117046 -162765 3531 187440 281912 167677 21998 21741
12414 21741 -454 -256686 241092 28208 -139326 -91539 123508 -154582 242413 186050 170708
12403 170708 -35112 -5208 97718 -109921 -18961 -150689 96941 -214341 300415 -231235 -18576
12391 -58418 163552 52251 -36740 141194 406293 -235096 156834 320826 131378 76785
$$ packed form
12472a41100C27664A35356E9121h6759k60690E9167d32351E905h7129l0966l1416
12461a49511G1325a2390k8798A79855a14276A2961a98578I88J37445i0267a9450
12449a94805a1271n18069D8662b7033B373d34273A45221J9298b58934I0621h7121
12437a08919B1204K98308H1826D0270a92026M7434l2361c6367m6051A610e0435
12425D7951c00561P3596Q1686A17046a62765C531J83909R4472j14235B1998k57
12414B1741d54k56232B41092B8208a39326M7787A23508a54582B42413n6363j5342
12403A70708c5112e208I7718a09921a8961j31728I6941b14341C00415b31235a8576
12391e8418A63552E2251c6740A41194K65099b35096A56834J63992A31378n4593
$$ plain form
12381 76785 -150915 -41261 -82083 -78906 314346 300585 132584 -24520 -146532 -330546 -125380
12369 165623 -106710 253233 -176751 -145595 -241354 -234202 180745 -190777 6760 -228239 207492
12357 -119100 93800 60626 -57306 313873 -12790 -165817 -101615 17379 7288 -174203 122213
12345 229348 -33691 -187659 -13945 -114003 -139121 -90650 211866 -247417 -145920 -140800 84870
12333 -66618 157189 214908 237680 -97894 -137676 272293 45971 -264322 120756 35435 -237067
12321 137938 -259277 354613 -67290 277182 -196798 94404 135618 -71473 186908 -56583
12310 40960 26376 172604 70397 183692 -119524 163332 -71457 -143969 128501 -39123 -1686
12298 450 192485 58099 -78242 236667 -385301 5090 -54375 141982 -58696 239318 -300312
$$ packed form
12381G6785a50915d1261m0822L177C14346j3761A32584b4520j22012j84014a25380
12369A65623a06710B53233a76751L1156r5759P152A80745a90777F760b28239B07492
12357a19100I3800l3174e7306C13873a2790j53027O4202A7379G288a74203A22213
12345B29348c3691j53968a3945j00058k5118M8471B11866b47417J01497N120H4870
12333f6618A57189N7719K2772i7894l9782B72293D5971b64322A20756C5435b37067
12321A37938b59277C54613f7290B77182a96798I4404M1214g1473A86908e6583
12310D0960j4584J46228G0397J13295a19524A63332g1457p2512A28501c9123a686
12298D50J92035E8099g8242B36667c85301E090e4375A41982e8696B39318c00312
$$ plain form
12286 123231 417613 186670 -48917 258551 -293041 -300429 -120736 -61677 145230 -120741
12275 -118325 134120 262728 177483 190213 614764 -6668 279815 22505 144287 -54181 281188
12263 191018 152811 125349 98304 -44240 -31001 -17124 335934 226648 -60126 72764 250293
12252 250293 264548 216404 20618 180769 239502 253032 326604 -17569 64098 132098 57438
12240 -57143 400992 36021 31842 -211624 -78855 -93262 155064 197699 -222894 3211 -40403
12228 294944 187527 -28890 247412 366254 57012 132278 337789 208878 5373 158902
12218 158902 237820 453267 191163 336972 254130 234610 -155544 -142625 -16041 268280
12207 395243 -74804 375144 133960 6671 365071 262521 7496 250543 -17029 159774 394068
$$ packed form
12286A23231K94382A86670d8917B58551b93041p388a20736N9059A45230a20741
12275a18325A34120J28608q5245J2730M24551f668B79815B2505J21782e4181B81188
12263A91018l8207k7462k7045d4240J3239J3877C35934j09286f0126G2764J77529
12252B50293J4255m8144B0618J60151N8733J3530P3572a7569F4098O8000E7438
12240e7143D00992C6021m179b11624g8855j4407A55064M2635b22894C211d0403
12228B94944j07417b8890B47412J18842E7012P5266K05511j28911E373J53529
12218A58902P8918K15447A91163J45809q2842j9520a55544J2919a6041B68280
12207C95243g4804C75144A33960F671L58400j02550G496K43047a7029A59774K34294
$$ plain form
12196 394068 43438 207002 104932 347992 61805 -162318 -95546 233773 105209 44777
12185 136721 422109 115011 85284 -53214 114521 119774 132263 -83594 6209 14436 -145201
12173 -104481 139606 350785 -260192 220760 240364 7344 56897 -250523 141563 276022
12163 276022 -99729 30988 374141 31760 -55418 444662 -316166 171190 12463 -61712 -57529
12152 -57529 104916 -156982 19597 -72568 188049 217625 -1740 -30093 -613 19589 -38914 8995
12139 187644 -73787 -181086 19084 -121337 244353 184552 112307 -255748 -12859 -144555
12129 -144555 199822 -85160 -112632 73590 245712 -270659 162324 153798 257887 -84204 66073
12117 -65910 -193626 -5793 -93845 118467 199211 176202 -89783 -159337 -130259 152510 42012
$$ packed form
12196C94068D3438J63564j02070K43060F1805a62318O6772B33773A05209D4777
12185A36721K85388A15011k9727e3214A14521N253J2489h3594F209Q227a45201
12173a04481A39606K11179b60192B20760J9604G344M9553b50523A41563J34459
12163B76022i9729C0988L43153C1760e5418D44662c16166A71190A2463f1712M183
12152e7529A04916a56982A9597g2568A88049K9576a740k8353f13A9589c8914H995
12139A87644g3787j07299A9084a21337B44353n9801p2245b55748a2859j31696
12129a44555A99822h5160k7472G3590J72122b70659A62324q526J04089h4204F6073
12117f5910j27716e793q8052A18467Q0744k3009h9783o9554K9078A52510D2012
$$ plain form
12105 -43270 -52795 113629 -198888 -267743 117809 -118807 -287975 -274113 202190 -160254
12094 -109240 -279235 -166423 106153 -137797 -120932 -68689 5843 -150875 71556 -114849
12083 80030 -13819 105320 252969 342092 -58335 -129317 -139491 251328 35882 -232985 -407217
12072 -407217 -267795 153304 39243 168778 -122876 -89901 75287 165754 392298 1132546
12062 1132546 923120 732550 339113 148847 510032 180638 -15223 -107097 -36397 -197696
12052 -197696 -90883 -7881 -117102 -18299 16234 -270724 -12581 -48794 -165810 62391 28153
12040 -297030 -7835 144482 -45836 343247 -164182 -199111 225422 -111584 225835 11220
12029 -30576 -256338 -1093 360141 52246 -158355 265526 341757 204954 62830 47057 1333
$$ packed form
12105d3270r525A13629a98888o8855A17809a18807j69168J3862B02190a60254
12094a09240j69995J12812A06153a37797J6865N2243E843a50875G1556a14849
12083H0030a3819A05320J47649Q9123e8335p0982j0174B51328C5882b32985j74232
12072d07217J39422A53304C9243J29535a22876L2975G5287R0467K26544P40248
12062A132546k09426j90570C39113A48847L61185A80638a5223r1874c6397j61299
12052a97696i0883g881j09221a8299A6234b70724a2581l6213j17016F2391B8153
12040b97030g835A44482d5836C43247a64182l4929B25422a11584B25835A1220
12029c0576k25762a093C60141E2246a58355B65526P6231j36803F2830j5773A333
$$ plain form
12017 -121273 -6098 -137766 -124236 460978 29688 52633 147224 137941 240328 49733 70058
12006 70058 -218229 -10294 -328661 -251291 133266 1460 -88133 65768 157299 -141956 64237
11994 184715 -83808 -236071 -157507 19312 -272665 162426 -366411 -34416 -364867 -64492
11983 44050 95505 60357 118744 -141426 -101049 -282359 -296833 -275900 348 -306851 -104118
11971 -102790 -66728 263460 135757 55058 84466 156254 232717 163609 -173339 1103 76463
11960 76463 120715 242375 -41696 2640 -61061 407648 -104188 -22794 140113 -126978 46515
11948 -117537 -241373 197373 224893 55475 21335 107426 -176810 -506903 28402 185786
11938 185786 -9627 143620 42476 72474 -39617 53344 -63107 -25652 -224149 173750 -218776
$$ packed form
12017a21273f098j31668J3530D60978B9688K2945R4591r283J02387D9733K0325
12006G0058b18229a0294l18367P7370A33266A460h8133F5768R1531a41956F4237
11994A84715h3808j52263P8564A9312b72665A62426c66411c4416l30451f4492
11983D4050N1455l5148N8387a41426M0377j81310j4474K0933C48c06851a04118
11971a02790L6062B63460j27703E5058K9408P1788P6463o9108a73339A103P5360
11960G6463M4252J21660d1696B640f1061D07648a04188b2794A40113a26978D6515
11948a17537j23836A97373K7520E5475B1335Q6091a76810l30093B8402J57384
11938A85786i627A43620D2476K9998c9617E3344f3107b5652j98497A73750b18776
$$ plain form
11926 44336 -41339 -5368 -50228 -160706 -68447 -203979 -81091 10433 -98552 257769 83715
11914 118095 12270 20892 -7118 -238954 50339 106832 -173084 -51941 -340636 132440 -47386
11902 247872 -306052 169551 -80816 -167546 -85698 -196585 -118634 66207 -247677 35511 85413
11891 85413 143150 146109 66957 16874 53198 83615 288168 -29822 -372229 190545 -76369
11879 98020 -291010 -1777 -21657 86628 157388 -100793 152627 -269434 53004 14567 167584
11868 167584 -92315 101959 -220497 110944 23694 -179838 -41785 118825 5837 -166040
11857 -71187 -93883 -194643 87164 223757 -89586 -38764 -26089 30653 -36908 -443386 63167
11845 45500 143332 -23528 262617 -236501 169703 -240308 67175 38092 -398615 27838 110842
$$ packed form
11926D4336d1339e368m4860j10478f8447j35532h1091A0433i8552B57769H3715
11914A18095A2270Q622g118k31836E0339N6493a73084e1941k88695A32440d7386
11902B47872c06052A69551h0816q6730Q1848j10887P7951F6207b47677C5511M9902
11891H5413N7737K959F6957A6874L6324L0417K04553b9822l42407A90545g6369
11879I8020b91010a777j9880H6628P0760a00793A52627b69434E3004A4567J53017
11868A67584i2315A01959b20497A10944B3694a79838d1785A18825E837a66040
11857g1187k2696j00760H7164J36593h9586c8764J2675C0653c6908m06478F3167
11845D5500R7832b3528B62617b36501A69703b40308F7175k9083c98615B7838Q3004
$$ plain form
11834 110842 320784 108929 -96999 -276031 -277506 -106035 -99424 141453 -93851 72058 -54244
11822 71605 -5898 -284732 262920 -70634 56387 175644 19037 -274525 -166986 111509 268200
11811 268200 -40529 -216161 18384 -197454 142109 116947 -2844 -38749 39747 9879 -126963
11799 -17937 -9161 -272533 72509 -8368 -83274 97712 20344 26765 364246 -210681 -115043 -213464
11787 -213464 241372 39017 -58413 147951 223298 -293170 -100507 166846 170750 174607 -103085
11775 27597 -81136 -203800 -201847 53394 -169298 65149 -212080 114614 -31781 -169173 -8521
11763 -181365 111108 -251534 -293924 459992 44558 298739 49976 -116373 -165023 9825 51662
11752 51662 83662 -161739 11593 -316788 387264 -252472 -10756 -231835 -38361 137481
$$ packed form
11834A10842K09942A08929i6999j79032j475a06035O611A41453i3851G2058e4244
11822G1605e898k78834B62920g0634E6387J19257A9037b74525J07539A11509J56691
11811B68200d0529j75632A8384a97454A42109k5162b844l5905C9747I879a26963
11799a7937Q776k63372G2509h368p4906I7712B0344O421L37481b10681R5638r8421
11787b13464B41372C9017e8413A47951P5347b93170a00507A66846L904L857a03085
11775B7597h1136j22664J953E3394a69298F5149b12080A14614c1781j37392h521
11763a81365A11108b51534m2390D59992D4558K54181D9976a16373m8650I825M1837
11752E1662L2000a61739A1593c16788C87264b52472a0756k21079c8361A37481
$$ plain form
11741 -231781 78242 -133502 -259263 31 217629 -2631 -44587 126433 156113 -295263 191596
11729 61406 -18883 2808 224761 -47454 1013 216532 82643 139991 248549 291601 -326189
11717 262658 195160 -153634 -5810 165460 74615 -157474 276565 37417 -43681 -40117 238206
11705 -273099 57767 -28814 20957 53616 -91680 -27468 147355 20736 98265 331457 65283
11693 -53901 145816 52141 43952 -161830 -23218 44326 190567 81291 -126193 96713 189235
11682 189235 454812 301436 290653 -2287 167010 -142010 276522 61117 431403 73257
11671 -136233 -44000 -1164 159002 461 -115852 -7865 134704 80759 446388 -69110 -14995
11659 -140537 123795 211196 -63790 -124835 239524 108060 -68262 200705 -153655 186149
$$ packed form
11741b31781G8242a33502j25761C1K17598b631m1956A26433K9680b95263A91596
11729F1406a8883B808K21953d7454A013K15519H2643N7348J08558M3052c26189
11717B62658o7498a53634e810A65460G4615a57474B76565C7417d3681L564B38206
11705b73099E7767b8814B0957L2659i1680b7468A47355B0736P7529K33192F5283
11693e3901A45816E2141q189a61830b3218D4326J46241H1291a26193I6713R2522
11682A89235K65577j53376j0783b287A67010a42010B76522F1117L70286G3257
11671a36233d4000a164A59002D61a15852g865A34704n3945L65629f9110a4995
11659a40537A23795Q7401f3790o1045B39524A08060f8262B00705a53655A86149
$$ plain form
11648 92290 375436 265657 39497 -35361 -292535 138742 127280 75963 -96589 -103889 197827
11636 -189215 23851 7938 -314000 82416 -215772 -297311 138093 -217317 -174965 101603 200436
11625 200436 224990 99450 158532 211250 264390 -37496 -55721 -261795 -179351 23621 152640
11614 152640 105230 253086 157035 -118917 43536 -97674 -175914 -426793 -54297 215305 -290469
11602 301836 40101 70987 -50333 14787 25457 324255 -18978 159324 -205537 -334646 123222
11590 -11387 173362 130304 346619 -546964 -213682 301480 -135825 226119 -203685 -218647
11580 -218647 54124 88295 71226 119016 -137994 88472 89186 324096 83964 -21694 195844
11568 -177662 392749 141782 269481 254123 54419 -147294 231289 -151946 371329 136738
$$ packed form
11648I2290K83146j09779C9497c5361k57174A38742j1462n1317i6589p300A97827
11636a89215B3851G938c14000H2416b15772q1539A38093b17317M2352A01603R8833
11625B00436K4554I9450N9082N2718N3140c7496j8225k06074Q2444B3621J29019
11614A52640m7410J47856r6051a18917D3536i7674p8240k50879e4297B15305b90469
11602C01836D0101L0886e0333A4787J0670K98798a8978A59324b05537j29109A23222
11590a1387A73362m3058K16315e46964b13682C01480a35825B26119b03685j4962
11580b18647E4124L4171j7069M7790a37994H8472P14K34910H3964b1694A95844
11568a77662C92749A41782J27699j5358E4419a47294B31289a51946C71329A36738
$$ plain form
11557 186190 -729 198163 36000 -87479 133044 284960 31597 3472 -66537 136293 -181251
11545 157193 -29420 -103871 110131 -87664 -250032 24953 -80564 138709 87512 262165 249253
11534 249253 -57939 111000 21256 -63864 -139918 -16039 285782 -210370 142960 218300 194740
11523 194740 -181200 30292 -244489 232691 366577 -125195 114596 -135179 -33505 326288
11512 139078 159000 90938 123483 -25411 -221376 127880 -55611 -142196 236090 54114 327925
11501 327925 -85821 146620 -31910 -115599 79010 204533 62456 89747 118963 -123273 -53852
11489 321299 290644 -82623 465384 263276 114330 120976 332043 331777 273684 123401 27262
11477 235926 288867 21170 58908 149311 221871 140134 60616 226304 -72107 156956 -48249
$$ packed form
11557A86190g29A98163C6000h7479A33044J51916C1597C472f6537A36293a81251
11545A57193b9420p4451A10131h7664j62368B4953h0564A38709n1197J74653j2912
11534B49253e7939A11000B1256f3864p6054a6039B85782b10370A42960P5340k3560
11523A94740a81200C0292b44489B32691J33886a25195A14596a35179c3505C26288
11512A39078J9922o8062L2545b5411j95965A27880e5611q6585B36090E4114K73811
11501C27925h5821A46620c1910q3689G9010J25523F2456K7291K9216a23273e3852
11489C21299l0655h2623D65384k02108A14330O646K11067k66n8093A23401B7262
11477B35926N2941B1170L7738R0403P2560q1737F0616J65688g2107A56956d8249
$$ plain form
11465 277827 -835 500888 315727 8515 264800 171002 -235093 113667 272145 -84409 -204653
11454 -204653 20792 -149814 -173604 67235 99629 -54330 145520 343194 -108286 149905
11443 6151 78281 191847 19875 16026 290142 -107741 -114625 -104526 95136 -18103 -55864 -165847
11431 -165847 -49139 -97197 365206 -138991 226782 -41320 -22423 215038 3274 -55543 271384
11419 -129330 185984 -104080 -290257 224117 200250 95476 133134 -134552 162646 -196607
11408 -260304 317157 -55983 -157701 59922 176836 -123371 -115732 -212152 -7314 81116 -33879
11396 151834 307871 -287286 283310 194549 174260 -218839 -173280 -135236 -112288 -256020
11386 -256020 305744 46345 -9298 -4991 190724 232921 -22260 -46672 316631 115653 102013
$$ packed form
11465B77827h35E00888j85161H515K56285r3798b35093A13667J58478h4409j20244
11454b04653B0792a49814k3790F7235L2394e4330A45520J97674a08286A49905
11443F151P2130J13566A9875l849K74116a07741o884J0099I5136a8103l7761j09983
11431a65847d9139m8058C65206a38991B26782d1320J8897B15038C274e5543B71384
11419a29330A85984a04080j86177B24117k3867I5476L7658a34552A62646a96607
11408b60304C17157e5983j01718E9922J16914a23371P639r6420g314H1116c3879
11396A51834J56037b87286B83310q8761k0289b18839M5559L8044K2948j43732
11386b56020C05744D6345i298M307A90724M2197b2260k4412C16631A15653j3640
$$ plain form
11375 102013 197004 -3391 279116 -27568 403315 128030 52286 89087 -376784 115826 -144837
11363 242460 393572 60446 79668 120881 -166349 198833 267851 271411 -93555 100653 2411
11351 244617 -292638 106971 -161345 450400 -228288 -72603 -80640 93531 58194 58687 32040
11340 32040 94552 123865 82431 -196066 23878 84418 144899 109167 -168446 131597 93673
11329 93673 -370950 78853 -101798 -159311 -272705 16729 -67961 -312574 89939 192502 -63401
11317 -203337 101782 44304 -16539 -141876 -13796 51740 -26563 53204 296879 -128415 -111012
11306 -111012 -3847 -32888 -140998 73338 -319548 -103011 -134052 -126473 27838 -61470 -30533
11294 110568 -98786 -62318 -117907 132349 254730 -309288 -189699 -223191 -192133 -30272 -148653
$$ packed form
11375A02013R4991c391B79116b7568D03315A28030E2286L6801c76784A15826a44837
11363B42460J51112F0446J9222M1213a66349A98833O9018L560i3555A00653B411
11351B44617b92638A06971a61345D50400b28288g2603q037I3531l5337M93k6647
11340C2040O2512K9313m1434a96066B3878O0540O0481l5732a68446A31597l7924
11329I3673c70950G8853a01798n7513j13394A6729f7961k44613H9939J02563f3401
11317b03337A01782D4304a6539j25337a3796E1740b6563E3204K43675a28415J7403
11306a11012c847k9041j08110G3338c19548a03011l1041P579B7838f1470c0533
11294A10568i8786L6468n5589A32349J22381c09288J19589l3492L1058c0272j18381
$$ plain form
11283 -148653 -221826 -68282 2075 51194 -124169 265166 -257791 -157299 -260792 96589 191686
11272 191686 33056 48283 -273233 -223155 109821 -140763 189576 187800 -128748 58717 -133737
11260 133359 44936 147478 -160858 284150 -149016 -100881 -305369 -4507 -182343 13758
11249 -350244 154433 10082 101738 -39633 51992 59057 -346433 37688 -388133 -178982 123968
11237 -84605 203848 236012 -304609 -80585 -147834 123349 -133421 82289 175277 10285 118779
11226 118779 -41679 54211 47580 -197994 -62509 -456803 -250929 -215534 -360850 -377224 -99554
11214 -15677 95370 -32805 66795 305179 -217884 -273383 -31120 33087 -247982 -24073 87863
11202 242684 -93872 141718 123782 102750 96850 63650 295339 -100991 82504 -5042 137794
$$ packed form
11283a48653p3173f8282B075M9119a24169B65166b57791J00492j03493I6589R5097
11272A91686C3056J5227b73233N0078A09821a40763A89576j776a28748E8717a33737
11260A33359D4936J02542a60858B84150a49016M8135k04488d507j77836A3758
11249c50244A54433A0082R1656c9633E1992P065c46433C7688c88133a78982A23968
11237h4605B03848L2164c04609h0585o7249A23349a33421H2289R2988A0285J08494
11226A18779d1679E4211o631a97994f2509l94294K05874L5395j45316j6374i9554
11214a5677I5370c2805F6795K38384b17884n5499c1120C3087b47982b4073H7863
11202B42684i3872A41718j7936k1032n900l3200K31689a00991H2504e042A37794
$$ plain form
11190 80810 -339513 -182369 -54805 -480406 -417886 -108877 72369 -490061 -96222 311979
11179 -369696 229874 311254 8226 -154442 4890 2293 8099 65259 -37226 111607 140917 188867
11167 188867 -170381 -312706 312900 -54788 65104 -395041 -92420 -40868 -113208 -250548
11157 -250548 412243 234834 -311868 -83825 -27762 -244936 104142 -298449 -54756 275443
11146 177077 -299458 53491 -57020 -443775 -233100 173528 28871 -332368 149903 71889
11135 253629 9034 -18080 140509 87467 135710 135977 -378108 170371 -219969 62413 27255
11123 368826 -49452 -81385 -83120 128448 163515 -44591 -77725 -129138 -166751 64054 91294
11112 91294 240319 267370 -86858 223667 148695 -170212 85296 -10140 179481 198067 445908
$$ packed form
11190H0810c39513J57144e4805m25601O2520a08877G2369d90061i6222C11979
11179c69696B29874Q1380H226a54442D890B293N806N7160c7226A11607K9310M7950
11167A88867a70381j42325C12900e4788F5104c95041i2420d0868p2340j37340
11157b50548D12243j77409c11868h3825b7762k17174A04142b98449e4756B75443
11146A77077b99458E3491e7020l86755K10675A73528B8871c32368A49903G1889
11135B53629I034a8080A40509n3042M8243K67c78108A70371b19969F2413B7255
11123C68826d9452l1933j735A28448L5067d4591l3134n1413l7613F4054K7240
11112I1294J49025K7051h6858B23667p4972a70212H5296a0140A79481J8586K47841
$$ plain form
11101 445908 284426 221802 157318 13847 201600 21743 -7477 372728 354118 161427 233
11089 286974 285265 104401 55861 -38124 138829 288744 13571 154533 264892 73178 206119
11078 206119 243493 402095 274388 508579 240043 314972 504859 196093 341836 127469
11067 535945 117996 368483 612493 290460 510113 248249 803377 419046 409540 563324
11057 563324 797324 698286 537053 286475 603970 407644 675083 801081 613026 852800
11047 852800 1003986 872087 858659 727769 860652 639856 709141 561211 752374 788809
11037 788809 804044 635555 475034 109333 532718 318045 739817 595351 495308 1015486
11027 1015486 544069 561350 893368 631013 861603 701679 744713 754877 734579 767890
$$ packed form
11101D45908j61482o2624o4484A3847J87753B1743g477C72728j8610A61427B33
11089B86974j709A04401m8540c8124A38829J49915A3571J40962J10359G3178J32941
11078B06119L7374J58602j27707K34191B40043P4929J89887A96093J45743A27469
11067E35945A17996K50487K44010B90460K19653B48249N55128l84331r506J53784
11057E63324K34000r9038j61233k50578L17495j96326K67439J25998j88055K39774
11047H52800J51186j31899j3428j30890J32883k20796O9285j47930J91163L6435
11037G88809J5235j68489j60521A09333M23385k14673M21772j44466j00043N20178
11027A015486m71417J7281L32018k62355K30590j59924M3034J0164k0298L3311
$$ plain form
11017 767890 900359 691848 663177 892347 1005099 526513 426648 762749 705419 598318
11007 598318 561740 362249 383073 884631 485836 924235 781648 715630 577923 941544
10997 941544 737344 904179 853448 739120 615850 837339 686231 933815 808964 629496
10987 629496 1280636 1070336 982922 1243172 1254126 1293724 1224546 1353667 1582015 1643896
10977 1643896 1690446 1882684 2111571 2312304 2215960 2071829 2496695 2707785 2797029 2221217
10967 2221217 2199662 2200348 2292002 2051832 1604838 1920561 1547232 1819698 1576030 1597363
10957 1597363 1863702 1475962 1670915 1948911 1657978 1266960 1002795 1209766 1008486
10948 1008486 475992 431588 756056 379886 221232 120567 234266 478935 251715 339871
$$ packed form
11017G67890J32469k08511k8671K29170J12752m78586r9865L36101n7330j07101
11007E98318l6578j99491K0824N01558l98795M38399j42587o6018j37707L63621
10997I41544k04200J66835n0731j14328j23270K21489j51108K47584j24851j79468
10987F29496O51140k10300q7414K60250J0954L9598o9178J29121K28348O1881
10977A643896M6550J92238K28887K00733r6344j44131M24866K11090Q9244n75812
10967B221217k1555O86R1654k40170m46994L15723l73329K72466k43668K1333
10957A597363K66339l87740J94953K77996k90933l91018k64165K06971k01280
10948A008486D75992m4404L24468l76170j58654j00665J13699K44669k27220Q8156
$$ plain form
10938 339871 304846 309858 299824 -148654 -157386 263191 23524 102972 384274 61848 -54818
10926 133386 140371 29433 -157521 66848 235620 213220 -123522 226963 13161 306001 21336
10914 150213 54019 83408 -254900 -458672 -71416 122873 210949 19881 18543 -59479 -3712
10902 -14691 189975 42984 4890 76331 -8975 -31349 300749 -172608 -228303 290471 192688
10891 192688 -175303 120665 199215 29920 64564 -349542 20897 -288160 97822 -122204
10880 257689 268825 240899 240245 324590 -226029 43821 -439038 -282493 50298 127816 137226
10869 137226 176826 -68401 -34761 -185284 72758 188971 -53576 -90820 -14881 228610 159040
10858 159040 150601 153619 65332 -93697 140107 -124176 -68115 -408432 -43762 -41883 -163285
$$ packed form
10938C39871l5025N012j0034a48654q732B63191B3524P9448K81302F1848e4818
10926A33386O985B9433a57521F6848J68772k2400a23522B26963A3161K92840B1336
10914A50213E4019K9389b54900k03772g1416A22873Q8076A9881j338e9479c712
10902a4691A89975D2984D890P1441h975k2374C00749a72608n5695B90471r7783
10891A92688a75303A20665P8550B9920L4644c49542B0897b88160I7822a22204
10880B57689J1136k7926o54Q4345b26029D3821d39038J56545E0298P7518R410
10869A37226L9600f8401L3640j50523G2758J16213e3576l7244a4881B28610o9570
10858A59040q439L018F5332i3697A40107a24176N6061l40317d3762J879j21402
$$ plain form
10847 -163285 -125748 209814 -183341 73471 -116138 -74004 109356 88622 33781 -91048 151374
10835 -122508 -302679 -29566 -34402 150003 -13324 -26591 -89845 105612 -425632 -5928 110132
10823 76403 -82628 120 -34120 -141345 -219122 23040 -80346 114848 5023 228932 -41182 169062
10810 157367 55290 208628 -40552 236843 370275 37022 -48373 -169008 140442 -47485
10799 -76475 152823 -102072 211819 147459 -234721 -6607 -75655 -29452 -185720 -7276 96845
10787 54564 125253 -282917 92379 -545925 -54696 -135854 -315039 180889 -173692 130050
10776 -155755 67252 300087 -200923 -104339 99357 -18338 139421 -191489 -110887 -135167 9377
10764 172439 -29208 -115114 -128316 -44641 -449 198905 -268867 265216 14975 950 -254118
$$ packed form
10847a63285L7537B09814a83341G3471a16138M2134A09356k0734C3781i1048A51374
10835a22508j80171b9566m836A50003a3324j3267o3254A05612d25632e928A10132
10823G6403h2628A20c4120j07225p7777B3040h0346A14848E023K23909d1182A69062
10810A57367E5290J53338d0552B36843J33432C7022d8373j20635A40442d7485
10799g6475A52823a02072B11819o4360b34721f607o9048b9452j56268g276I6845
10787E4564P0689b82917I2379e45925e4696q1158j79185A80889a73692A30050
10776a55755F7252K32835b00923R6584I9357a8338A39421a91489Q0602k4280I377
10764A72439b9208q5906j3202d4641d49A98905b68867B65216A4975I50b54118
$$ plain form
10752 114284 29141 -170819 -321187 -256168 180941 7843 -445638 -283952 75433 18125 -65485
10740 -98171 -94789 -373027 -63273 241876 -53257 -214730 -11106 294171 110645 -247742 204520
10728 -142631 -80011 -92520 -98047 -95558 -327551 -187506 172714 -16583 -15803 43745 -105828
10716 31517 -20368 -39924 -147995 -81728 14686 -250921 -23873 -258706 55310 15874 -123443
10704 -522328 154585 -211767 -126158 -59346 172802 -163176 190280 40772 -27345 193602
10693 -59875 183841 143366 29004 147614 60536 -33928 262681 -165020 315839 -271074
10682 -124944 -510421 52956 -63681 143546 75913 -265961 -81938 -219174 -219933 -360643 184678
10670 197480 104566 -252957 -205604 97948 76274 -175502 -109452 150860 245192 -272314 -134441
$$ packed form
10752A14284B9141a70819j50368O5019A80941G843d45638J61686G5433A8125f5485
10740i8171L382k78238f3273B41876e3257j61473a1106B94171A10645b47742B04520
10728a42631O2620j2509n527K489k31993J40045A72714a6583P80D3745a05828
10716C1517b0368j9556j08071O6267A4686b50921b3873k34833E5310A5874a23443
10704e22328A54585b11767Q5609e9346A72802a63176A90280D0772b7345A93602
10693e9875A83841m0475B9004J18610F0536c3928B62681a65020C15839b71074
10682a24944l85477E2956f3681A43546o7633b65961h1938j37236p59j40710A84678
10670A97480r2914b52957M7353I7948k1674a75502O6050A50860R4332b72314a34441
$$ plain form
10658 -208162 57439 76333 22411 59852 108680 -19871 -155687 -49493 -26879 -32839 -268467
10647 -268467 -95156 236511 -217120 -37546 3911 118343 72724 259997 130426 -175217
10636 -45562 -143054 -410634 -86653 271068 -485831 44716 29445 -106849 -441834 -34048 100064
10624 2200 -209475 -23038 -31918 -108592 -417320 -13377 -340769 -269887 143224 229638 -328379
10612 -288541 15334 -8687 136215 175283 -168121 -22820 99562 -168580 2047 -259523 -3404
10600 40212 -123469 62343 132435 -245106 196240 46982 124862 -278593 -306073 -198897 71589
10588 323940 100065 -510352 -82290 161957 144777 103596 262468 -398911 389736 -94581
10577 -159630 -159781 -310540 191281 25765 115931 57109 17731 -6523 -261914 55098 -58764
$$ packed form
10658b08162E7439J8894B2411L7441M8828a9871j35816d9493K2614n960k35628
10647b68467i5156B36511b17120c7546C911J14432m5619J87273j29571a75217
10636d5562r7492k67580h6653B71068d85831D4716j5271a06849l34985c4048A00064
10624B200b09475b3038q880p6674l08728a3377l27392P0882A43224Q6414c28379
10612b88541A5334h687A36215L9068a68121b2820I9562a68580B047b59523c404
10600D0212a23469F2343P0092b45106A96240D6982P7880b78593k7480J07176G1589
10588C23940A00065e10352h2290A61957j7180m1181J58872c98911C89736i4581
10577a59630j51j50759A91281B5765R0166E7109A7731f523k55391E5098e8764
$$ plain form
10565 -158655 -92370 -299999 -60945 -72649 -247391 -58392 -42131 -206197 -185526 -62848 -97172
10554 -97172 41708 -225064 -405808 -72058 -83054 48855 261694 -134580 16109 -50815 -140761
10543 -140761 -248129 159672 -226145 -122166 -312070 -23491 -33674 41131 116261 -135654
10532 196417 232880 291262 -155167 -88697 -226750 -68672 -294449 64285 85296 178617 35643
10520 533589 -251491 -196602 -181391 183925 181426 -72943 149942 53783 -197456 -110840 -225769
10509 -225769 -304384 1303 -202722 -25821 -52004 -205572 -154478 19388 -130541 -250805 47756
10497 133537 -170774 -133237 90040 -181736 -222975 -365148 37460 -175008 215683 130458
10487 130458 -19241 -50897 35552 134370 179861 178259 229532 374545 438688 320534 153661
$$ packed form
10565a58655O6285k07629f0945j1704j74742e8392J6261j64066K0671f2848l4324
10554i7172D1708b25064j80744g2058j0996D8855K12839a34580A6109e0815q9946
10543a40761j07368A59672b26145J03979j89904b3491j0183D1131P5130a35654
10532A96417L6463N8382a55167O6470j38053f8672k25777F4285K1011R3321C5643
10520E33589b51491N4889J5211A83925k499g2943A49942E3783a97456Q6616j14929
10509b25769p8615A303b02722b5821k6183j53568N1094A9388a30541j20264D7756
10497A33537a70774L7537I0040a81736m1239j42173C7460a75008B15683q5225
10487A30458a9241l1656C5552R8818M5491j602N1273J45013O4143j18154A53661
$$ plain form
10475 481882 394549 160498 98248 -147124 215913 3682 -150756 101633 -1318 202199 -15260
10463 -172724 -109590 -39920 180201 -83013 -92661 161779 -301890 -68152 128753 212774 31706
10451 -376363 223506 -48404 103383 38236 91073 -128888 -300256 -27015 107036 139477
10441 139477 213443 103051 283 109979 -94647 -22905 288318 144875 -33444 -208093 -23288
10429 -74120 -188747 139233 -136728 -163757 111354 34441 65232 -221876 201858 176192
10419 176192 -104571 -240463 -29425 -238049 -187306 -53404 53083 88210 66525 31280 -76991
10407 38146 -127843 -120122 -50580 84705 -81091 -249990 -189926 51245 216011 -186333 -69853
10395 56527 323863 111537 112489 -132993 -35209 -173935 -35189 -86416 -152314 -103907 247025
$$ packed form
10475D81882q7333A60498o2250a47124B15913C682a50756A01633a318B02199a5260
10463a72724O3134c9920A80201h3013r648A61779c01890f8152A28753Q4021C1706
10451c76363B23506d8404A03383C8236N2837a28888j71368b7015A07036L2441
10441A39477P3966A03051B83J09696i4647b2905B88318j43443c3444j74649b3288
10429g4120j14627A39233a36728k7029A11354C4441L0791b21876B01858k5666
10419A76192a04571j35892b9425k08624N0743e3404E3083L5127k1685C1280g6991
10407C8146a27843P721e0580H4705h1091j68899O0064E1245J64766a86333f9853
10395E6527K67336A11537R52a32993c5209j38726c5189n1227o5898M8407B47025
$$ plain form
10383 420431 75852 277911 -101347 -78312 90544 64177 394737 112566 539070 -25059
10372 159540 65139 168410 363029 71314 587069 531497 429943 97653 448240 429846
10362 429846 248611 157488 170785 589188 154535 439800 239777 76617 306200 530260
10352 530260 643306 566808 121322 -24732 441391 523148 6576 332867 341500 -14453 80850
10340 263149 260695 59980 222814 241188 285439 97776 285652 -47089 -23461 34674 129540
10329 129540 557020 126891 155002 -20630 213021 -95211 155941 39530 125064 464683
10319 464683 141991 -46283 144637 -21387 199939 396184 37783 62814 -151694 65045
10308 270591 -12217 -123848 13839 62827 7845 81570 -87519 -13166 106332 73351 158511
$$ packed form
10383D20431G5852K02059a01347K3035I0544k6367L30560A12566M26504b5059
10372A59540F5139J03271J94619G1314N15755n5572j01554I7653L50587j8394
10362D29846j81235r1123J3297M18403A54535K85265k00023G6617K29583K24060
10352E30260J13046p6498A21322b4732D41391Q1757F576L26291Q633a4453H0850
10340B63149k454E9980J62834J8374M4251I7776J87876d7089b3461C4674R4866
10329A29540M27480A26891K8111b0630B13021i5211A55941C9530Q5534L39619
10319D64683A41991d6283A44637b1387A99939J96245C7783K5031a51694F5045
10308B70591a2217j11631A3839M8988G845P3725h7519a3166A06332l2981Q5160
$$ plain form
10297 158511 220386 -117691 -60089 71230 -90716 -220734 356860 244988 185004 246318 221535
10286 221535 76272 -4082 -117116 -353296 -123051 -1481 -25090 49089 61099 -332011 -143708
10274 -17202 190982 -92352 414628 -95763 -15029 -34454 -110330 318838 -108823 125909 47860
10262 102280 3765 127362 89170 164570 295133 497474 111639 473190 175607 -99032
10251 35825 63161 -111768 157964 126683 12225 -28192 -168663 -78290 173014 -150512 -14439
10239 -89532 -321890 90644 -314625 99878 38910 -308929 -169153 -10822 -274373 59610 72818
10228 72818 -27371 19383 108022 -180841 105604 96020 -240444 -94190 31015 -99815 -268591
10217 -268591 71536 -36431 -20687 -213895 -247979 102039 -146257 -179910 -328850 -248771 -111409
$$ packed form
10297A58511O1875a17691N7602G1230i0716j30018C56860j11872n9984O1314k4783
10286B21535G6272d082j13034k36180a23051a481k3609D9089J2010c32011a43708
10274a7202A90982i2352D14628i5763a5029j9425p5876C18838a08823A25909D7860
10262A02280C765J23597l8192P5400J30563K02341A11639L61551A75607i9032
10251C5825K7336a11768A57964l1281A2225b8192j40471g8290A73014a50512a4439
10239h9532k32358I0644c14625I9878C8910c08929J39776a0822k63551E9610J3208
10228G2818b7371A9383Q8639a80841A05604r584b40444i4190C1015i9815j68776
10217b68591G1536c6431J5744j93208l4084A02039a46257l3653j48940Q0079a11409
$$ plain form
10205 53065 -18126 18192 -145901 261521 63817 143396 16141 -443615 -187987 -272909 26706
10193 -205902 -106998 -305566 316383 -20273 -133130 -22108 -175282 -111557 -5875 -226032 -44436
10181 -107019 -244022 16306 107880 -114359 26871 -125578 63513 -1113 -48180 -159723 -51799
10169 -105614 233074 -20616 156716 74153 -204260 -101004 -40896 -145818 -115851 70919
10158 -2815 -110533 20646 -51542 -21010 50350 -303861 -60319 -30896 -426 -162487 -57095 -265975
10146 -265975 68643 -286140 -123013 60436 141060 -117232 -103586 -13505 -97485 100284 -18386
10134 -25697 -12264 142521 -255695 94908 -32318 -229600 -64514 -359743 -131718 20745 322120
10123 322120 -129072 129740 54925 45326 -80278 -122690 46447 -532573 -240837 133153 133347
$$ packed form
10205E3065a8126A8192a45901B61521F3817P9579A6141d43615a87987q4922B6706
10193b05902R8904j98568C16383b0273j12857b2108j53174O3725e875k20157d4436
10181a07019j37003A6306R1574a14359B6871a25578F3513a113m7067j11543e1799
10169a05614B33074b0616A56716G4153b04260a01004d0896j04922K9967G0919
10158b815j07718B0646e1542b1010E0350c03861f0319K9423d26j62061e7095k08880
10146b65975F8643b86140a23013F0436Q0624a17232J3646a3505q3980A00284a8386
10134b5697a2264A42521b55695I4908c2318j97282f4514k95229a31718B0745L01375
10123C22120a29072A29740E4925r599h0278m2412D6447e32573b40837A33153J94
$$ plain form
10112 133347 -8492 -15046 -337435 -202477 -110545 -19807 106086 -59537 -123703 -70265 -155513
10101 -155513 -149202 -32646 128518 105983 -100469 -12045 26586 308626 -410987 -204939 5633
10089 106407 -251749 27087 13576 3113 -190225 -161602 162152 116260 85741 158149 -309863
10077 370857 -205770 -118727 268833 -141312 -103312 34721 9501 106842 -264563 -387392 252420
10065 109254 62991 -144490 163293 -256154 -271666 8057 -174729 -353323 283771 134853
10054 -335726 50266 -193703 -220630 -134599 -145915 -381695 133585 -69800 -208471 136674
10043 -113479 -105686 -281274 -59890 -162924 97621 -127580 -76023 252822 45672 -137514 114480
10031 304856 4471 -470358 -280705 56919 78739 -13219 -121445 -191676 -420074 -15405 -37066
$$ packed form
10112A33347h492o554l22389J34958R1932a9807A06086e9537o4166N3438q5248
10101a55513O311c2646A28518k2535a00469a2045B6586K82040d10987b04939E633
10089A06407b51749B7087j3511C113a90225K8623A62152m5892l0519P2408c09863
10077C70857b05770Q7043B68833a41312L8000C4721I501R7341b64563j22829B52420
10065A09254m6263a44490A63293b56154j5512H057a74729j78594B83771A34853
10054c35726E0266a93703k6927Q6031j1316k35780A33585f9800j38671A36674
10043a13479P793j75588e9890j03034I7621a27580N1557B52822D5672a37514A14480
10031C04856D471d70358J89653E6919K1820a3219j08226p0231k28398a5405k1661
$$ plain form
10020 -37066 -374915 -174167 -406203 66842 45969 -91584 99443 -231917 -86810 67156 -119191
10008 -100523 -295206 -51535 -21187 -50005 -7525 103055 -279683 -76621 105542 -189606 -435570
9997 -435570 34429 -52750 -15551 87953 25783 -167768 -227727 -247894 5691 -189551 -63632
9985 -191162 -170270 127817 -27357 -2087 -1490 132943 -167661 18600 -151740 -230967 -403861
9974 -403861 -272071 -7364 -394079 -90371 -193797 -404673 -177012 -165657 -14357 113326 308310
9963 308310 63627 -68568 -83651 -277135 -28932 -217394 -33192 -107962 -153344 8969 72739
9952 72739 46251 -27293 -403822 -144192 -361695 186411 -82218 -47633 -66889 199041 -343114
9940 -360447 525 -110701 237344 -118802 -71273 -267277 83940 -180336 -417476 -174296 359168
$$ packed form
10020c7066l37849a74167k32036F6842k0873i1584I9443b31917h6810F7156a19191
10008a00523j94683e1535b1187k8818g525A03055b79683g6621A05542a89606k45964
9997d35570C4429e2750a5551H7953B5783a67768n9959k0167E691a89551f3632
9985a91162K0892A27817b7357b087N97A32943a67661A8600a51740p9227j72894
9974d03861J31790g364l86715i0371j03426k10876a77012J1355a4357A13326J94984
9963C08310F3627f8568j5083j93484b8932j88462c3192p4770m5382H969O3770
9952G2739k6488b7293l76529a44192k17503A86411h2218L4585j9256A99041c43114
9940c60447E25a10701B37344a18802M7529j96004H3940a80336k37140a74296C59168
$$ plain form
9928 -52686 174066 130896 -104304 77947 -23239 -210357 -285911 -59185 7600 -158312 -73055
9916 84350 203571 136321 273282 -290647 19191 64147 -118761 -466971 -26366 -186570 115157
9904 -129815 10694 80223 -119623 -251560 -210976 -152238 204802 28593 -353502 -98169 166939
9892 -2927 -200496 -170749 238765 -187320 40590 -143815 11487 26252 -147780 -22759 -292047
9881 -292047 15928 32211 -201609 -25350 14389 129560 -139099 -176808 98318 -266469 199105
9869 -13981 -176214 -291837 -269484 -60788 198580 -177552 468431 -603 61019 -315314 -125763
9857 -277922 -60113 -113858 -324879 223427 -112229 -26714 118000 -14034 11565 -83809 -189791
9846 -189791 -18761 143652 -108106 -473718 -61667 -707520 -199759 -116641 64619 -204578
$$ packed form
9928e2686A74066m3170a04304G7947b3239j87118p5554e9185G600a58312g3055
9916H4350J19221o7250J36961b90647A9191M4956a18761l48210b6366j60204A15157
9904a29815A0694O9529a19623j31937M0584N8738B04802B8593c53502i8169A66939
9892b927j97569K9747B38765a87320D0590a43815A1487J4765a47780b2759k69288
9881b92047A5928J6283b01609b5350A4389J15171a39099l7709I8318b66469A99105
9869a3981j62233j15623K2353f0788A98580a77552D68431f03F1019c15314a25763
9857b77922f0113n3745k11021B23427a12229b6714A18000a4034A1565h3809j05982
9846a89791a8761A43652a08106l65612f1667o45853a99759Q3118F4619b04578
$$ plain form
9835 195395 -83233 83250 -59430 122080 -62465 -353452 -268993 63905 -49889 -299266 -211816
9824 -211816 241206 -169603 234610 108759 230750 64360 -303395 -94348 170027 -289235
9813 -74545 280646 -333977 -314994 -44057 -268351 -77131 9312 -126693 -201842 87005 -181901
9801 40378 -189594 131363 -32879 134022 51159 222505 17050 85973 -156601 58690 107803
9790 107803 -107357 347769 1024 8817 257619 80501 -184876 -162643 -92851 -49598 -124346
9779 -124346 61199 -320876 -301999 -27512 -76501 -307272 -60491 -171276 -98689 136353 -68654
9767 -92321 69395 115141 62974 134825 136244 -153833 -34473 -278295 -11532 -294687 -156142
9756 -156142 -452872 -25968 -81293 -125551 68084 50167 -305583 27193 -195247 62470 116963
$$ packed form
9835A95395h3233H3250e9430A22080f2465k90987Q4459F3905d9889k49377Q7450
9824b11816B41206a69603B34610A08759J21991F4360c03395i4348A70027b89235
9813g4545B80646c33977J8983d4057k24294g7131I312a26693p5149H7005a81901
9801D0378a89594A31363c2879A34022E1159J71346A7050O8923a56601E8690M9113
9790A07803a07357C47769A024P793K48802H0501a84876K2233O9792M3253p4748
9779a24346F1199c20876J8877b7512m8989k30771f0491j10785P2587A36353f8654
9767i2321F9395M5746n2167P1851J419a53833c4473k43822a1532k83155J38545
9756a56142k96730b5968n5325m4258F8084j7917c05583B7193a95247F2470N4493
$$ plain form
9745 116963 -32589 44102 66388 -58094 80706 -154041 -56509 -67704 47648 -231468 137170
9733 -101908 75658 88298 -407931 -310426 243370 -166888 96612 -11765 113217 -6466 -214677
9722 -214677 -234864 11982 -130347 180034 -112404 -141272 -250847 -384071 98487 -86606 168570
9710 78860 35582 -229417 -90238 -28691 -320818 -333567 -221175 95298 -403451 -265677 -159948
9699 -159948 101531 -106140 -115755 135509 3880 -61312 -333703 114646 -162526 99097 -199930
9687 -96225 -579979 158849 -163926 -320235 -381378 -266704 113389 -172403 -24096 -263660
9677 -263660 268766 -59541 -183182 -207348 15847 -95342 -26604 -179938 -59453 -257721 -178707
9666 -178707 -347988 111897 -103864 -107462 -149975 -244514 -111446 -82861 -26526 10749 155687
$$ packed form
9745A16963c2589D4102K2286e8094H0706a54041e6509j1195D7648b31468A37170
9733a01908G5658J2640d07931R7505B43370a66888I6612a1765A13217f466k08211
9722b14677k0187A1982a30347A80034a12404k8868j09575j33224I8487h6606A68570
9710G8860C5582b29417i0238b8691k92127j2749J12392I5298d03451J37774J05729
9699a59948A01531a06140r615A35509C880f1312k72391A14646a62526I9097a99930
9687i6225m83754A58849a63926j56309o1143J14674A13389a72403b4096k39564
9677b63660B68766e9541j23641k4166A5847i5342b6604j53334e9453j98268P9014
9666a78707j69281A11897a03864l598m2513r4539a11446K8585b6526A0749J44938
$$ plain form
9655 155687 41094 -125843 -48643 37451 235924 11292 1046 216673 185801 43551 65432
9644 65432 -349528 238940 -309251 -29332 7135 189380 60466 81501 -23609 111371 -101014
9632 -99108 145317 -619795 -185901 130811 159567 -525825 -83498 -83437 -290977 28735 168092
9621 168092 -224146 -14745 -27196 101395 -99021 43110 150091 43913 -108574 122901 5920
9609 -169253 -190874 -52953 -332972 -150696 92733 110571 -80290 -44820 -36448 -201836 -3643
9597 -107660 -47238 -217006 -89346 -104754 -131312 -82649 -76346 -329054 34140 -277329 -50051
9585 -212050 304374 277570 -336391 -288049 -80650 -357405 -153518 -251734 365129 -166368
9574 51782 63426 -226414 184566 -243244 45415 25198 -297743 -168661 93272 -84531 324457
$$ packed form
9655A55687D1094a25843d8643C7451J98473A1292A046K15627l0872D3551K1881
9644F5432c49528B38940c09251b9332G135J82245F0466K1035b3609A11371a01014
9632i9108A45317f19795a85901A30811K8756e25825h3498O1k07540B8735J39357
9621A68092b24146a4745j2451A01395i9021D3110J06981D3913a08574A22901E920
9609a69253k1621e2953k80019a50696I2733J7838h0290L5470Q372j65388c643
9597a07660d7238j69768h9346j5408k6558M8663O303k52708C4140b77329e0051
9585b12050C04374k6804c36391M8342h0650k76755a53518r8216C65129a66368
9574E1782J1644b26414A84566b43244D5415k0217b97743J29082I3272h4531C24457
$$ plain form
9562 286906 -432545 160709 -398051 192695 22346 54613 -39613 -217215 -187680 -83952 -70611
9551 -70611 -41979 169968 -385118 -178562 -127995 77896 22643 106168 243127 169700 -181869
9539 -5070 38863 21107 -184067 -153476 4468 -241016 -4409 -267966 -109467 -105683 100474 -22682
9526 15696 -59222 76912 -273731 67088 -186759 -127292 -373336 -54588 -215007 247302 260044
9515 260044 -99710 -6279 81632 100848 -269658 -112037 49926 -387982 -18096 -47974 62042
9503 -115967 -229658 13097 -241383 -108772 99376 -61175 -105217 133654 -117481 -103710 -210394
9492 -210394 -479156 -36335 125703 57799 23780 28735 167794 -121144 -66858 -202646 218857
9480 -236088 118538 -356629 -277319 -162972 -196641 98642 -47536 81505 91902 185369 73112
$$ packed form
9562B86906d32545A60709c98051A92695B2346L2267c9613j77602K9535h3952J3341
9551g0611K8632A69968c85118a78562N0567G7896B2643Q3525J36959p3427a81869
9539e070C8863j7756a84067L0591D468b41016d409k63557a09467L784A00474b2682
9526A5696e9222G6912b73731F7088a86759N9467k46044e4588j60419B47302J2742
9515B60044i9710f279H1632J9216b69658a12037D9926c87982a8096k9878F2042
9503a15967j13691A3097b41383a08772I9376f1175m4042A33654a17481J3771j06684
9492b10394k68762c6335A25703E7799B3780M955J39059a21144N4286j35788B18857
9480b36088A18538c56629P9310J14347l3669I8642d7536H1505J0397R3467G3112
$$ plain form
9468 15712 29923 -123742 195709 -198694 5311 -135915 -187563 -126331 -23022 -152366 81592
9456 110412 -250514 -331363 -87642 20227 754 307706 -170300 -62063 41634 -117743 60721
9444 39940 -113799 153344 290044 -91646 -180486 -73767 -82424 -68776 -327831 -136000 -280088
9433 -280088 106841 -60093 -419124 -286574 39622 348455 -20193 -24869 32179 -18483 -1524
9421 -117727 94642 -201014 221687 -114770 -60089 -239123 29324 -486740 -106880 218781
9410 10292 -114624 -95754 -343292 93249 -128374 103364 -130920 190659 -112287 -302001
9400 -302001 -223071 35207 39551 -18701 -111999 62310 -121199 -401590 -315100 -128101 -339615
9389 -339615 -180134 66260 -213509 -139981 37356 -15120 -42266 -14167 -56162 -201915 -210923
$$ packed form
9468A5712J4211a23742A95709a98694E311a35915n1648O1232b3022j29344H1592
9456A10412b50514q0849h7642B0227G54L06952a70300f2063D1634a17743F0721
9444C9940a13799A53344J36700i1646q8840g3767q657J3648k59055a36000j44088
9433b80088A06841f0093l59031J32550C9622L08833b0193m676C2179a8483a524
9421a17727I4642b01014B21687a14770N4681j79034B9324d86740a06880B18781
9410A0292a14624J8870k47538I3249a28374A03364a30920A90659a12287j89714
9400c02001P8930C5207M344a8701r3298F2310a21199k80391Q6490a28101k11514
9389c39615J59481F6260b13509P3528C7356a5120k7146a4167m1995j45753r008
$$ plain form
9378 -210923 71309 -261192 235971 68511 -238137 -71800 250136 380442 -352149 3114 -106223
9366 -268807 -166829 -17154 377459 -29657 -165420 56510 -235438 113981 33063 89299 103052
9355 103052 124787 193055 -10 77893 174084 -52609 -197941 -265171 -103839 -166820 507134 -193480
9342 130186 -112631 39987 121632 183547 -480920 125156 -291381 -155474 -288495 -156842
9332 -156842 890 -312353 -336070 45606 -277079 105656 -302221 -29605 -80154 14817 -42081
9320 237110 -151348 8257 1276 -110922 49252 -159748 33976 104562 -270424 167271 -29796
9308 -188781 -114596 -159157 -74592 -102601 -185386 -78197 -24278 -201400 156448 -145021 -197354
9297 -197354 -263077 -80178 -90797 -343433 281597 161196 268101 -321944 -185243 -152396
$$ packed form
9378b10923G1309b61192B35971F8511b38137g1800B50136J30306c52149C114a06223
9366b68807J01978a7154C77459b9657j35763E6510b35438A13981C3063N6236J3753
9355A03052K1735O8268a0G7893R6191e2609j45332o7230a03839o2981E07134a93480
9342A30186a12631C9987Q1645O1915d80920A25156b91381J35907j33021J31653
9332a56842H90c12353k3717D5606b77079A05656c02221b9605n0549A4817d2081
9320B37110a51348H257A276a10922D9252a59748C3976P0586b70424A67271b9796
9308a88781P4185m4561g4592k8009q2785g8197b4278j77122A56448a45021n2333
9297a97354o5723h0178j0619k52636B81597j20401J06905c21944J36701L2847
$$ plain form
9287 -152396 -238000 -124768 -188447 225200 108193 -13616 -54517 -98841 -206920 -1127 -267121
9276 -267121 -241262 -242857 231928 249411 234796 -36282 -69080 -30842 -225159 -38239 -322782
9265 -322782 357630 -216687 113560 -15979 -248912 -150590 -95992 -124893 -146868 -47403 -145246
9254 -145246 12318 -65589 -204197 -169578 -209618 -84913 71347 -329627 -176529 67939 -163492
9242 91558 -280776 -183827 32360 -113340 -95722 -231126 193131 62979 -36412 192164 -2708
9230 256259 224179 -22312 -69934 193612 -11072 -106311 -232508 62519 -201643 22292 98886
9219 98886 -170698 -81548 96583 72735 171646 -328540 -30210 48590 272999 -251190 -113918
9207 181281 -305300 -91955 148898 21635 202282 22186 -88851 -194076 208463 72035 -183812
$$ packed form
9287a52396q5604J13232o3679B25200A08193a3616m0901m4324j08079a127k65994
9276b67121K5859j595B31928J7483j4615c6282l2798c0842j94317c8239k84543
9265c22782C57630b16687A13560a5979k32933R8322N4598k8901k1975d7403r7843
9254a45246A2318f5589j38608L4619m0040h4913G1347c29627J53098F7939a63492
9242I1558b80776R6949C2360a13340J7618j35404A93131F2979c6412A92164b708
9230B56259l2080b2312m7622A93612a1072r5239j26197F2519b01643B2292P6594
9219I8886a70698h1548I6583k3848R8911c28540c0210D8590K24409b51190a13918
9207A81281c05300i1955A48898B1635J80647B2186h8851j05225B08463G2035a83812
$$ plain form
9195 -244599 -156090 -32154 -222137 -168861 -69987 -235458 157615 -177397 -260510 -97717 39310
9183 -285988 -221295 -354905 167559 79816 -193157 37853 87367 74907 254080 -141333 -144508
9172 -144508 -154577 19869 -103931 -127648 147927 -176890 -87818 -97394 -241435 -208579 22920
9160 -437999 -163675 -143121 10780 -189133 -160807 -4666 54833 -138338 77496 -201467 -136636
9149 -136636 -7053 -234425 -318848 58015 -166366 325018 -196013 -58254 -167191 -50494 26619
9137 5221 -86537 -294354 -135276 -17644 -52195 219604 -178125 -77670 -94285 115952 123882
9126 123882 2208 19940 -229171 -102720 -58163 -174113 219466 121364 -178489 175499 -277734
9114 -98504 84786 -217294 2325 -27554 66179 -91801 831 -299349 -102069 -189044 -37113 -66628
$$ packed form
9195b44599Q8509c2154j89983N3276f9987j65471A57615a77397q3113i7717C9310
9183b85988O4693j33610A67559G9816a93157C7853M9514j2460J79173a41333l175
9172a44508j0069A9869a03931k3717A47927a76890h7818r576j44041L2856B2920
9160d37999a63675K0554A0780a89133K8326d666E4833a38338G7496b01467O4831
9149a36636g053k27372q4423E8015a66366C25018a96013e8254j08937e0494B6619
9137E221h6537k07817a35276a7644l4551B19604a78125g7670j6615A15952P930
9126A23882B208J7732b29171a02720M4557j15950B19466r8102a78489A75499b77734
9114i8504H4786b17294B325b7554F6179i1801H31b99349a02069q6975c7113k9515
$$ plain form
9102 -66628 139015 -351763 -38334 20005 -101658 -29460 -282845 245001 -139959 84998 -204659
9090 58387 -187807 193141 125003 110524 -351935 100245 155741 -27187 -227634 -87221 207240
9078 -145909 40417 -292628 -59700 221698 -167823 -146973 144276 27636 -106029 -294588
9068 -294588 -120320 159175 87279 107871 10762 -59691 -70474 -82775 -225109 -233307 85003
9056 -39958 -148484 29186 -206909 317559 -257966 120834 52800 -209346 -197669 -114538 29217
9044 -417137 -62924 141365 -63554 -229844 -531159 -49331 -342289 244002 378824 -1311 -46241
9033 -46241 46890 52033 -212721 -99091 154069 -126447 -49275 -255329 -410007 49227 -59335
9021 -218221 -99184 -588229 46650 115620 -205448 -105977 -303829 -436290 -58957 -84791 90009
$$ packed form
9102f6628A39015c51763c8334B0005a01658b9460k53385B45001a39959H4998b04659
9090E8387a87807A93141o8138j4479c51935A00245N5496b7187k00447h7221B07240
9078a45909D0417b92628e9700B21698a67823K0850A44276B7636a06029j88559
9068b94588a20320A59175p1896K0592A0762e9691j0783j2301j42334q198H5003
9056c9958j08526B9186b06909C17559b57966A20834E2800b09346J1677Q3131B9217
9044d17137f2924A41365f3554j66290l01315d9331k92958B44002J34822a311m4930
9033d6241D6890N143b12721i9091A54069a26447d9275k06054j54678D9227e9335
9021b18221i9184m89045D6650O8970b05448R9471j97852j32461e8957k5834I0009
$$ plain form
9009 277795 -100026 -53305 97193 -409665 48743 194450 -171942 51299 -30209 224490 199737
8998 199737 -194320 -138543 -103789 -4340 -111269 270307 -94184 -30716 84644 -63917 -244922
8987 -244922 -88731 492660 -127940 1841 -26601 15139 -93842 40453 45218 -272637 41479
8975 -335536 -135862 -62458 -96911 32528 112487 116554 -14684 -166772 -46873 15601 153666
8964 153666 -172406 59967 -176426 83125 -77385 -52121 -5592 -114391 -193636 144654 -222743
8952 -151043 -192399 38264 98204 233387 15371 -170344 -152135 -95737 -276062 -271135 -72442
8940 135106 -156370 284999 100356 159992 -139523 113492 299642 281118 324805 131323
8929 219889 486620 183245 830767 1007953 1137981 2055766 3989258 6593804 4877969
$$ packed form
9009B77795a00026M6721I7193d09665D8743J45707a71942E1299c0209B24490k4753
8998A99737a94320N5777L4754d340j06929B70307i4184c0716H4644f3917j81005
8987b44922h8731D92660a27940A841b6601A5139i3842D0453M765b72637D1479
8975c35536a35862f2458l4453C2528P9959M067a4684j52088d6873A5601J38065
8964A53666a72406E9967a76426H3125g7385K5264e592j08799p9245A44654b22743
8952a51043m1356C8264N9940J35183A5371a70344J8209N6398j80325M927g2442
8940A35106a56370B84999A00356N9636a39523A13492J86150j8524M3687A31323
8929B19889K66731A83245O47522J77186J30028R17785J933492K604546j715835
$$ plain form
8920 4877969 3430382 2058725 1137333 859007 550066 383282 362277 306879 -118278 532006
8909 -143817 71551 -6877 -58291 3073 -1839 22572 -129846 59251 340617 -113321 333319
8897 112645 41357 84044 -57949 -373969 90844 78734 -99349 -155697 70752 -122331 182307
8885 -136331 370615 3746 112257 -111164 -13945 2647 82432 52213 -298202 263436 -369794
8873 92115 178196 127760 500378 11994 23353 -419573 62427 -22554 -139121 9610 -63769
8861 6326 116255 -42652 -77902 -300460 -77580 4087 -208501 264541 137282 -164850 -144402
$$ packed form
8920D877969j447587j371657r21392k78326l08941j66784k1005n5398a18278E32006
8909a43817G1551f877n1414C073a839B2572a29846E9251K81366a13321C33319
8897A12645D1357M2687e7949l16020I0844j2110i9349n6348G0752a22331A82307
8885a36331C70615C746J08511a11164a3945B647P9785l0219b98202B63436c69794
8873I2115Q6081n0436L72618A1994J1359d19573F2427b2554j16567I610f3769
8861F326J09929d2652l5250k22558g7580D087b08501B64541j27259a64850K0448
$$ [...]
##END NTUPLES=NMR SPECTRUM
##END=
