##TITLE=AC1578_ROEFFECT0024_8271437_sAAOSwmTXq
##JCAMPDX= 6.0         $$ Bruker NMR JCAMP-DX V2.0
##DATA TYPE= NMR SPECTRUM
##DATA CLASS= NTUPLES
##ORIGIN= BRUKER
##OWNER= Administrator
$$ 1.72 TOPSPIN		Version 2.1
$$ 2013-10-18 22:23:54.115 -0700  Administrator@X
$$ Compression mode = diff/dup
##.OBSERVE FREQUENCY= 400.02188249412
##.OBSERVE NUCLEUS= ^1H
##.ACQUISITION MODE= SIMULTANEOUS (DQD)
##.ACQUISITION SCHEME= undefined
##.AVERAGES= 64
##.DIGITISER RES= 22
##SPECTROMETER/DATA SYSTEM= spect
##.PULSE SEQUENCE= noesygpps1d.comp
##.SOLVENT NAME= COFFEE_meoh
##.SHIFT REFERENCE= INTERNAL, COFFEE_meoh, 1, 14.96088
##AUDIT TRAIL= $$ (NUMBER, WHEN, WHO, WHERE, PROCESS, VERSION, WHAT)
$$ ##TITLE= Audit trail, TOPSPIN		Version 2.1
$$ ##JCAMPDX= 5.01
$$ ##ORIGIN= Bruker BioSpin GmbH
$$ ##OWNER= Administrator
$$ $$ E:\/data/COFFEE/nmr/AC1578_ROEFFECT0024_8271437_sAAOSwmTXq/12/pdata/1/auditp.txt
$$ ##AUDIT TRAIL=  $$ (NUMBER, WHEN, WHO, WHERE, PROCESS, VERSION, WHAT)
(   1,<2013-10-18 22:23:49.006 -0700>,<Administrator>,<X>,<go>,<TOPSPIN 2.1>,
      <created by zg
	started at 2013-10-18 22:12:18.958 -0700,
	POWCHK enabled, PULCHK disabled,
       configuration hash MD5:
       C8 4E 4E 5D D3 5C D8 9E 9F 52 82 E0 59 8A DE 15
       data hash MD5: 64K
       E7 C8 4D D5 3E EB 1E C5 21 AB 20 33 6E 08 6D 2D>)
(   2,<2013-10-18 22:23:51.990 -0700>,<Administrator>,<X>,<proc1d>,<TOPSPIN 2.1>,
      <Start of raw data processing
       efp LB = 0.3 FT_mod = 6 PKNL = 1 PHC0 = 0 PHC1 = 0 SI = 128K 
       data hash MD5: 128K
       20 0A 98 A9 83 C6 E9 6B 04 A2 4A 0D 1C E5 43 CF>)
(   3,<2013-10-18 22:23:52.944 -0700>,<Administrator>,<X>,<proc1d>,<TOPSPIN 2.1>,
      <pk PHC0 = -83.77075 PHC1 = 0 
       data hash MD5: 128K
       3D E5 BF 1A 0D F3 82 D1 98 E8 F8 DA E7 B2 93 7E>)
(   4,<2013-10-18 22:23:53.444 -0700>,<Administrator>,<X>,<proc1d>,<TOPSPIN 2.1>,
      <abs ABSG = 1 
       data hash MD5: 128K
       7F 3D 26 B6 D3 30 70 DD 4B 1F E3 02 4C B1 87 C9>)
(   5,<2013-10-18 22:23:53.553 -0700>,<Administrator>,<X>,<proc1d>,<TOPSPIN 2.1>,
      <abs ABSG = 2 
       data hash MD5: 128K
       DF F7 C4 1F 0A 69 23 D4 DA 82 E8 2C 61 50 BB 4F>)
(   6,<2013-10-18 22:23:53.662 -0700>,<Administrator>,<X>,<proc1d>,<TOPSPIN 2.1>,
      <abs ABSG = 3 
       data hash MD5: 128K
       04 BA 76 2E B5 E7 B7 5A 56 2D 96 1F DF 72 B4 81>)
(   7,<2013-10-18 22:23:53.740 -0700>,<Administrator>,<X>,<proc1d>,<TOPSPIN 2.1>,
      <abs ABSG = 4 
       data hash MD5: 128K
       B3 A9 6B 85 92 35 F3 D2 41 9B 4D D1 93 A0 54 C2>)
(   8,<2013-10-18 22:23:53.850 -0700>,<Administrator>,<X>,<proc1d>,<TOPSPIN 2.1>,
      <abs ABSG = 5 
       data hash MD5: 128K
       AE 39 35 FC 59 FB DD 87 EB B8 74 99 9A F3 AD 92>)
$$ ##END=
$$ 
$$ $$ hash MD5
$$ $$ 7C 26 30 FC 6F 46 B7 6C 4D 78 A4 74 A2 7A 24 33
##$RELAX= 
##$RELAX= 
##$RELAX= 
##$RELAX= 
##$RELAX= 
##$RELAX= 
##$RELAX= 
##$RELAX= 
$$ Bruker specific parameters
$$ --------------------------
##$DU= <E:\>
##$EXPNO= 12
$$ [...]
##$TP07= 0
##$TPNAME0= <>
##$TPNAME1= <>
##$TPNAME2= <>
##$TPNAME3= <>
##$TPNAME4= <>
##$TPNAME5= <>
##$TPNAME6= <>
##$TPNAME7= <>
##$TPOAL= (0..7)
0.5 0.5 0.5 0.5 0.5 0.5 0.5 0.5
##$TPOFFS= (0..7)
0 0 0 0 0 0 0 0
##$TUNHIN= 0
##$TUNHOUT= 0
##$TUNXOUT= 0
##$USERA1= <user>
##$USERA2= <user>
##$USERA3= <user>
##$USERA4= <user>
##$USERA5= <user>
##$V9= 5
##$VALIST= <valist>
##$VCLIST= <CCCCCCCCCCCCCCC>
##$VD= 0
##$VDLIST= <DDDDDDDDDDDDDDD>
##$VPLIST= <PPPPPPPPPPPPPPP>
##$VTLIST= <TTTTTTTTTTTTTTT>
##$WBST= 1024
##$WBSW= 4
##$XGAIN= (0..3)
0 0 0 0
##$XL= 0
##$YL= 0
##$YMAX_a= 7621031
##$YMIN_a= -15205577
##$ZGOPTNS= <>
##$ZL1= 120
##$ZL2= 120
##$ZL3= 120
##$ZL4= 120
##$ABSF1= 14.96088
##$ABSF2= -5.597301
##$ABSG= 5
##$ABSL= 3
##$ALPHA= 0
##$AQORDER= 0
##$ASSFAC= 0
##$ASSFACI= 0
##$ASSFACX= 0
##$ASSWID= 0
##$AUNMP= <proc_prof1d_extract.lims>
##$AXLEFT= 0
##$AXNAME= <>
##$AXNUC= <1H>
##$AXRIGHT= 0
##$AXTYPE= 0
##$AXUNIT= <>
##$AZFE= 0.1
##$AZFW= 0.1
##$BCFW= 0
##$BC_mod= 0
##$BYTORDP= 0
##$COROFFS= 0
##$CY= 15
##$DATMOD= 1
##$DC= 0
##$DFILT= <>
##$DTYPP= 0
##$F1P= 0
##$F2P= 0
##$FCOR= 0.5
##$FTSIZE= 131072
##$FT_mod= 6
##$GAMMA= 0
##$GB= 0
##$INTBC= 1
##$INTSCL= 1
##$ISEN= 128
##$LB= 0.3
##$LEV0= 0
##$LPBIN= 0
##$MAXI= 10000
##$MC2= 0
##$MEAN= 0
##$ME_mod= 0
##$MI= 0
##$NCOEF= 0
##$NC_proc= -3
##$NLEV= 6
##$NOISF1= 0
##$NOISF2= 0
##$NSP= 0
##$NTH_PI= 0
##$NZP= 0
##$OFFSET= 14.96088
##$PC= 1
##$PHC0= -83.77075
##$PHC1= 0
##$PH_mod= 1
##$PKNL= yes
##$PPARMOD= 0
##$PPDIAG= 0
##$PPIPTYP= 0
##$PPMPNUM= 2147483647
##$PPRESOL= 1
##$PSCAL= 4
##$PSIGN= 0
##$PYNMP= <proc.py>
##$REVERSE= no
##$SF= 400.020009685261
##$SI= 131072
##$SIGF1= 0
##$SIGF2= 0
##$SINO= 400
##$SIOLD= 131072
##$SPECTYP= <>
##$SREGLST= <1H.CDCl3>
##$SSB= 0
##$STSI= 131072
##$STSR= 0
##$SW_p= 8223.68421052631
##$SYMM= 0
##$S_DEV= 0
##$TDeff= 65536
##$TDoff= 0
##$TI= <>
##$TILT= no
##$TM1= 0
##$TM2= 0
##$TOPLEV= 0
##$USERP1= <user>
##$USERP2= <user>
##$USERP3= <user>
##$USERP4= <user>
##$USERP5= <user>
##$WDW= 1
##$XDIM= 131072
##$YMAX_p= 520234804
##$YMIN_p= -21968
##$CURPLOT= <Network HP LaserJet P1505>
##$CURPRIN= <$Network HP LaserJet P1505>
##$DFORMAT= <normdp>
##$LAYOUT= <+/1D_H.xwp>
##$LFORMAT= <normlp>
##$PFORMAT= <normpl>
##$SURQMSG= 1
$$ End of Bruker specific parameters
$$ ---------------------------------
##NTUPLES= NMR SPECTRUM
##VAR_NAME=  FREQUENCY,     SPECTRUM/REAL,   SPECTRUM/IMAG
##SYMBOL=    X,             R,               I
##VAR_TYPE=  INDEPENDENT,   DEPENDENT,       DEPENDENT
##VAR_FORM=  AFFN,          ASDF,            ASDF
##VAR_DIM=   131072,        131072,          131072
##UNITS=     HZ,            ARBITRARY UNITS, ARBITRARY UNITS
##FACTOR=    0.0627417313425164, 1,          1
##FIRST=     8223.62146879497, 2541,         -138727
##LAST=      0,             6359,            -139004
##MIN=       0,             -21968,          0
##MAX=       8223.62146879497, 520234804,    0
$$ Real data points
##PAGE= N=1
##DATA TABLE= (X++(R..R)), XYDATA
$$ [...]
64299 577830 570829 562429 553874 545878 538212 530853 524293 518700 513880 510178 508365 508443 509501 511050 513593
64284 513593 517507 522181 526705 530689 534014 536503 538437 540835 544655 550030 556601 564080 572109 580172
64270 580172 588188 596684 605796 614559 621838 627610 632614 637003 640096 641359 640896 639038 636313 633989
64256 633989 633726 635856 638391 638529 635349 630499 625990 621801 616271 608601 600019 592052 584607 576647 568246
64241 568246 560697 554657 549443 544503 540373 537544 535377 532985 530361 527732 524647 520911 517881 517395
64227 517395 519456 522177 524024 525023 525604 525558 524668 523456 522606 522130 521609 520775 519552 518017 516589 515783 515480
64210 515480 515032 514303 513835 513534 512010 508143 502966 499206 498937 501972 506223 509257 509976 509470 510076 513093
64194 513093 517619 521958 525724 529983 535773 543270 552080 561464 570486 579000 588499 600889 616108 631853
64180 631853 645952 658064 668598 677142 682916 686016 687048 685974 682422 676932 670638 663563 654365
64167 654365 642371 629085 616954 607062 598635 590498 582315 574442 567244 560898 555645 551864 549705
64154 549705 548683 547795 546279 544209 542154 540296 538347 536475 535854 537800 542486 548803 555317 561056 565666
64139 565666 569356 572703 576050 579028 581082 582439 583967 585952 587590 588004 587244 585870 584030 581579 578899
64124 578899 577054 577058 579263 583336 588508 593924 599152 604350 609855 615785 622266 629665 638113 647070 655995
64109 655995 665349 676323 689399 703654 717533 729886 740298 749034 756870 764497 771916 778775 785307
64096 785307 792263 799754 806986 813547 820249 828024 836516 844519 851471 857598 862690 865576 865153 861521
64082 861521 855831 849256 842236 834506 825732 816085 806080 795887 785188 773884 762503 751551 740929
64069 740929 730574 721326 714322 709547 705697 701558 696993 692545 688884 686937 687767 691685 697715 704359
64055 704359 710699 716594 722252 728056 734524 741853 749521 756717 763240 769813 777551 787257 798956 811721
64041 811721 824045 834873 844506 854284 865323 877689 890704 903561 915325 924757 930851 933757
64029 933757 934722 934806 933889 931307 927141 922311 917434 912350 907092 902578 899600 897539 894950 891395 887900
64014 887900 885363 883257 880353 876251 871583 866876 861811 855778 848835 841896 836033 831612 828134 824792
64000 824792 821144 817309 813827 811421 810609 811237 812569 814146 816324 819592 823689 828028 832783 838719 845939
63985 845939 853748 861964 871324 882134 893617 905449 918924 935232 953206 970335 985972 1002034
63973 1002034 1020256 1040284 1061200 1083499 1108213 1134888 1161996 1189273 1218417 1251257 1288194
63962 1288194 1328690 1372224 1418196 1465831 1515367 1569033 1629741 1698491 1773842 1854198 1939967
63951 1939967 2033043 2134978 2246677 2369586 2505909 2657224 2823587 3004484 3200017 3410529
63941 3410529 3635507 3873619 4123635 4384540 4654708 4931596 5212309 5493792 5772262
63932 5772262 6043020 6301210 6542392 6762145 6955735 7118786 7248126 7341674 7397808 7415350
63922 7415350 7394025 7334508 7238118 7106912 6944060 6753674 6540102 6307488 6059856 5801230
63912 5801230 5535598 5266961 4999356 4736592 4481979 4238421 4008365 3793125 3592493
63903 3592493 3405787 3233388 3076605 2935878 2809875 2696643 2594923 2503753 2421581 2346762
63893 2346762 2278816 2218301 2165330 2118766 2076940 2038632 2003298 1970863 1941559 1915627 1892977
63882 1892977 1873326 1856554 1842570 1830930 1821287 1814421 1812253 1816377 1826830 1842627 1863173 1888700
63870 1888700 1919452 1954892 1993913 2035711 2080433 2128844 2181283 2237027 2294891 2354295 2415358
63859 2415358 2477949 2541127 2603481 2663442 2719201 2769153 2812953 2851511 2885315 2913180 2933313
63848 2933313 2945212 2949697 2947289 2937452 2919528 2893488 2859296 2816166 2763122 2700369 2629877 2554627
63836 2554627 2477214 2398886 2319676 2239430 2158663 2078511 2000111 1924193 1851009 1780266 1711284
63825 1711284 1643640 1577824 1515098 1456694 1403147 1354225 1309303 1267870 1229666 1194124 1159839
63814 1159839 1125367 1090848 1058157 1028954 1003206 980063 959235 940549 923042 905979 890245
63803 890245 876980 864928 851039 834223 816878 801914 789700 778933 769066 760306 752068 743173
63791 743173 733504 724262 716496 710295 705299 701009 696442 690398 682527 673790 665634 658926 653629 649158
63777 649158 644980 640981 637212 633336 628847 624046 620158 617895 616362 614044 610549 606674 603002 599265
63763 599265 595173 591244 588573 587914 588909 590006 589522 587110 583879 580719 577187 572676 568038 564896 563570
63748 563570 562838 561874 561453 562896 566442 570900 574431 575620 574529 572943 573010 575284 578368 580516 581263 581597
63732 581597 583064 586670 592126 598108 603605 608853 614550 620551 626150 631291 636491 641803 647054 652985
63718 652985 660699 669528 676905 681128 683168 684988 687127 688953 690294 691498 692287 691843 690013 687540 685149
63703 685149 683093 681497 680432 679700 679099 678883 679450 680713 682287 684152 686610 689671 693061 696713 700762
63688 700762 705121 709593 714337 719662 725390 730923 735883 740069 742814 743271 741793 740449 741440 745020 749364
63673 749364 752461 753821 754234 754346 754065 753469 753618 755731 759616 763585 766142 767219 767584 767708 767633 767340 766516
63656 766516 764370 760409 755191 749614 743687 736931 730046 725189 723995 725824 728382 729778 729653 728704 727798
63641 727798 727589 728561 731104 735514 741847 749693 758217 766681 775036 783760 792999 802101 810437 818601 828169
63626 828169 839978 853078 865792 877449 888648 900282 913066 927645 944152 961705 979373
63615 979373 997712 1018318 1041701 1066917 1093716 1123551 1157414 1193892 1230882 1268495 1308701
63604 1308701 1352290 1397510 1441690 1483086 1521181 1556282 1589073 1619741 1647330 1670424 1688220
63593 1688220 1700284 1705877 1704848 1698960 1690851 1681557 1670357 1657099 1642906 1627976 1610312 1587811
63581 1587811 1560675 1530860 1500124 1469560 1439991 1411558 1383540 1355685 1329184 1305329 1283874
63570 1283874 1263951 1246094 1231867 1221694 1214526 1209726 1207875 1209257 1212748 1216900 1221465 1227375 1235728
63557 1235728 1247095 1261145 1276672 1292618 1309370 1328482 1350840 1375847 1402847 1432548 1466367
63546 1466367 1504850 1547394 1593026 1640882 1690370 1741565 1794912 1849550 1902193 1948741 1986981
63535 1986981 2016813 2037940 2048847 2048758 2039593 2025005 2007992 1990146 1972394 1955053 1937129 1916717
63523 1916717 1892636 1865106 1834678 1801147 1763872 1722576 1677388 1628667 1577432 1525703 1475686
63512 1475686 1428456 1383704 1340754 1299526 1260541 1224319 1190964 1160254 1132025 1106347 1083149
63501 1083149 1061695 1040815 1019898 999485 980672 964175 950148 938578 929284 921535 914071 905785
63489 905785 896421 886738 878073 871516 867311 865103 864690 866067 868606 870950 872374 873814 876734 881131
63475 881131 885480 888542 890428 891773 892845 893875 895501 898145 901257 903765 905187 905995 907014 908765
63461 908765 911271 914193 917084 919499 920878 920630 918832 916835 916596 919058 923393 927951 931675 934595 937604
63446 937604 942143 949612 960466 973895 988721 1004513 1021603 1040248 1060139 1080839 1102519 1126206
63434 1126206 1153200 1184114 1218631 1256529 1298721 1346530 1399604 1455009 1508641 1557219 1598934
63423 1598934 1633216 1660786 1683506 1703170 1720316 1734740 1747211 1760104 1776257 1797558 1824580
63412 1824580 1856883 1893278 1932120 1971770 2010800 2047653 2080371 2107080 2126982 2140666 2149125
63401 2149125 2152425 2149660 2140375 2125616 2107221 2086463 2063874 2039833 2014135 1985101 1950580 1910529
63389 1910529 1867583 1824272 1780598 1735365 1689067 1643870 1601024 1559829 1519498 1480807 1445274
63378 1445274 1413570 1385423 1360563 1339147 1321511 1307942 1298492 1292718 1289847 1289445 1291704 1296977 1305466
63365 1305466 1317553 1333862 1354405 1377963 1402984 1429115 1457383 1488905 1524004 1562704 1605337
63354 1605337 1651923 1701268 1751548 1801949 1853020 1904999 1956380 2004749 2048493 2086795 2118284
63343 2118284 2141079 2154671 2160822 2161875 2158764 2151213 2139165 2123126 2103597 2081220 2057303 2033081
63331 2033081 2008111 1980140 1946982 1908286 1865499 1820643 1775308 1730324 1686029 1642938 1602172
63320 1602172 1565020 1532016 1502665 1476085 1451806 1430046 1411209 1394821 1378759 1360054 1336893
63309 1336893 1309485 1278808 1245314 1209695 1174015 1140612 1109959 1080864 1052805 1026750 1003466
63298 1003466 982397 962833 945003 929234 915060 902115 891089 882626 875775 868609 860264 851505
63286 851505 843399 836194 829519 823022 816715 811104 806907 804252 802342 800360 798450 797299 796938 796674 796165
63271 796165 795926 796610 798361 801033 804559 808804 813354 817724 821643 825078 828201 831450 835417 840474 846593
63256 846593 853561 861260 869666 878761 888588 899401 911595 925244 939679 953783 967052 980251
63244 980251 994666 1010743 1027975 1046183 1066198 1088723 1113015 1137413 1161095 1184829 1210106
63233 1210106 1238074 1269259 1303551 1340062 1377422 1414731 1452131 1490122 1528440 1565928 1601668
63222 1601668 1635994 1670244 1705630 1742496 1780381 1818273 1854693 1888149 1918134 1945519 1971476
63211 1971476 1996035 2018016 2036173 2049815 2058358 2061060 2057510 2047936 2032772 2012319 1986986 1957461
63199 1957461 1924478 1888930 1852306 1816332 1781877 1748842 1717488 1689134 1664991 1644928 1628086
63188 1628086 1614291 1604253 1598782 1598283 1602453 1609850 1618565 1628287 1640983 1658363 1679194 1700644 1721967
63175 1721967 1745006 1770701 1796835 1820284 1840316 1858571 1876453 1893653 1908878 1921184 1930656
63164 1930656 1938247 1944681 1949024 1948646 1941133 1926098 1904854 1878838 1848985 1816207 1781427 1744894
63152 1744894 1706042 1664453 1620861 1577115 1535224 1496240 1459776 1424706 1390646 1358686 1330375
63141 1330375 1306013 1284316 1263792 1244120 1226075 1210482 1197562 1187041 1178373 1170736 1163209 1155298
63129 1155298 1147348 1140353 1135366 1133032 1133290 1135184 1137242 1138639 1140037 1142789 1147197 1152126 1156473 1160368
63115 1160368 1164523 1169123 1174056 1179643 1186226 1193253 1199626 1204948 1209741 1214617 1219950 1226146 1233215 1240053
63101 1240053 1245143 1248250 1250665 1253625 1257378 1261873 1267113 1272432 1276607 1279500 1282615 1287193 1292648 1297840
63087 1297840 1302939 1308762 1314990 1320536 1325438 1330934 1337612 1344757 1351688 1358532 1365347 1371754 1378132 1386264
63073 1386264 1397797 1412416 1428241 1443846 1459543 1476890 1497279 1520832 1546486 1573260 1601444
63062 1601444 1632126 1665665 1701444 1739475 1781346 1828757 1881566 1938256 1998106 2061812 2129902
63051 2129902 2201624 2276154 2354099 2436821 2524422 2615287 2707617 2800643 2894136 2987640 3080917
63040 3080917 3174566 3269293 3364675 3459312 3552135 3642801 3730891 3815650 3896725 3974196 4047293
63029 4047293 4113819 4171570 4219759 4258354 4286598 4303121 4307165 4298656 4277169 4241894 4192898 4131669
63017 4131669 4060231 3980526 3894956 3806614 3718162 3630779 3544735 3460775 3380536 3305958 3238898
63006 3238898 3181236 3134617 3099489 3074538 3057550 3047112 3043352 3046778 3056679 3071282 3089532 3111948
62994 3111948 3139174 3170226 3202832 3235132 3266428 3296721 3326407 3356131 3385795 3413711 3437710
62983 3437710 3457206 3473045 3485122 3491345 3489533 3479233 3460888 3434181 3398275 3353111 3299510 3238393
62971 3238393 3170692 3097713 3020782 2940822 2858938 2776948 2696519 2618180 2542061 2469174 2400764
62960 2400764 2336597 2275052 2215034 2156808 2100921 2047467 1996746 1949544 1906160 1865832 1827510
62949 1827510 1790477 1753948 1717083 1680107 1644632 1612069 1582195 1553895 1526755 1501175 1477376
62938 1477376 1455146 1434233 1414226 1394377 1374442 1355515 1339060 1325029 1311780 1298024 1284104
62927 1284104 1271102 1259453 1248902 1239276 1230764 1223666 1218192 1214221 1210986 1207376 1202924 1198201 1193845
62914 1193845 1189594 1184843 1179963 1176308 1174702 1174473 1174226 1173165 1171274 1168615 1165139 1161152 1157313 1153723
62900 1153723 1149440 1143500 1136413 1130100 1126099 1124178 1122951 1121554 1120299 1119875 1120392 1121265 1121553 1120335 1117208
62885 1117208 1112783 1108395 1105017 1102633 1100909 1100045 1100421 1101536 1102065 1101241 1099683 1098493 1097963 1097593 1097071 1096610
62869 1096610 1096349 1096074 1095716 1095563 1095540 1094662 1091804 1087050 1081835 1077621 1074734 1072653 1071051 1070154 1070146 1070599 1070637
62852 1070637 1069599 1067540 1065295 1064070 1064684 1066855 1069213 1070271 1069614 1068151 1067179 1067262 1067976 1068535 1068517 1068145
62836 1068145 1068127 1069179 1071457 1074362 1077052 1079218 1081148 1083060 1084669 1085664 1086408 1087819 1090610 1094886 1100395
62821 1100395 1106762 1113316 1119089 1123553 1127532 1132983 1141395 1152244 1163319 1172831 1181061 1189738 1200137
62808 1200137 1212334 1226034 1241062 1256622 1271186 1284146 1297113 1312458 1330685 1350297 1370190
62797 1370190 1390936 1413447 1437720 1463757 1492626 1525425 1561745 1600341 1641038 1684799 1732051
62786 1732051 1782293 1835764 1894437 1960611 2034926 2116211 2202851 2293950 2389553 2490340 2596988
62775 2596988 2709494 2827035 2948402 3072284 3197069 3320842 3441777 3558150 3667813
62766 3667813 3768134 3856833 3932423 3993423 4037608 4062691 4067686 4053167 4020390 3970657 3905371
62755 3905371 3826068 3734255 3631702 3520922 3404861 3285872 3165342 3044481 2925043 2808857
62745 2808857 2696882 2589121 2485474 2386462 2293117 2206290 2126128 2052137 1983707 1920570 1862805
62734 1862805 1810458 1763251 1720536 1681446 1645232 1611672 1581128 1554066 1530572 1510521 1493995
62723 1493995 1481034 1470945 1462482 1455131 1449864 1448051 1449683 1453134 1456845 1460881 1466711 1475766 1488597
62710 1488597 1505243 1525795 1550324 1578463 1609516 1643098 1679545 1719691 1764412 1814325 1869651
62699 1869651 1930153 1995358 2064864 2138133 2213894 2290422 2367200 2446047 2529461 2617289 2705698
62688 2705698 2790099 2868669 2942175 3010597 3071005 3119136 3152313 3170384 3174515 3165927 3145472 3113333
62676 3113333 3068806 3011140 2941201 2862116 2777861 2691228 2603244 2514101 2424209 2334576 2246754
62665 2246754 2162458 2082779 2007568 1935913 1867385 1802585 1742377 1686839 1635188 1586501 1540369
62654 1540369 1497034 1457109 1421104 1388996 1360264 1334306 1310642 1288704 1267758 1247326 1227556
62643 1227556 1209029 1192201 1177042 1162954 1149031 1134794 1121022 1109619 1102183 1098553 1096825 1094776
62631 1094776 1091385 1087275 1083888 1082049 1081258 1080544 1079733 1079188 1078271 1075281 1069759 1064010 1061108 1061642 1063589
62616 1063589 1065367 1067733 1072332 1079470 1088002 1096768 1105459 1114458 1124375 1135603 1148085 1161803 1177497
62603 1177497 1196272 1218225 1242185 1267240 1293997 1323780 1357107 1393500 1432282 1472925 1515079
62592 1515079 1559119 1606462 1658416 1714580 1772867 1831087 1888042 1943257 1996388 2046962 2093952
62581 2093952 2135312 2168455 2191606 2204497 2207668 2201549 2186571 2163740 2134520 2099909 2059896 2014096
62569 2014096 1963017 1908596 1853326 1798895 1745778 1693951 1643540 1594847 1548247 1504260 1463189
62558 1463189 1424609 1387940 1353802 1323878 1298771 1276876 1256342 1237340 1221102 1207310 1194215
62547 1194215 1181287 1169938 1160953 1152821 1143751 1134363 1127124 1123508 1122683 1122741 1122466 1121981 1122260 1123975 1126651
62532 1126651 1129228 1131591 1134838 1139687 1145395 1150992 1156976 1164902 1175690 1189167 1204951 1222792 1242248
62519 1242248 1263015 1285721 1311567 1341037 1373617 1408784 1446541 1486918 1529824 1575597 1624850
62508 1624850 1677368 1731826 1787031 1842832 1899293 1955524 2009803 2060339 2105408 2143372 2173530
62497 2173530 2196948 2215700 2231009 2242408 2248725 2249625 2246258 2240759 2235271 2231289 2229779 2231568 2237246
62484 2237246 2246750 2259718 2276478 2298019 2324479 2354214 2385045 2415971 2446817 2476562 2503159
62473 2503159 2524989 2541367 2551276 2552782 2544509 2527012 2501863 2469674 2429741 2381382 2325004 2262000
62461 2262000 2194173 2123131 2049835 1974909 1899860 1827523 1760404 1698591 1640266 1584509 1532820
62450 1532820 1487381 1448406 1413922 1381968 1352499 1327029 1306680 1290754 1277327 1265137 1254512
62439 1254512 1246178 1239770 1234292 1229708 1226914 1225907 1225107 1223110 1220224 1217611 1215629 1213734 1211221 1207096
62425 1207096 1199886 1188872 1175377 1161781 1149273 1137304 1125041 1112383 1099660 1087386 1076288
62414 1076288 1066603 1057384 1047585 1037808 1029683 1023426 1017495 1011061 1005193 1000759 996712 991699 986139 981215
62400 981215 976886 972627 969489 969375 972210 975558 977480 978493 980271 983600 988211 993663 999530 1005223
62386 1005223 1010388 1015472 1021605 1029898 1040602 1052612 1064047 1073920 1083219 1093864 1106849 1121982
62374 1121982 1138989 1157726 1177371 1196681 1215459 1234894 1256131 1279335 1304351 1331202 1359414
62363 1359414 1387923 1416518 1446747 1480738 1519667 1563791 1613123 1667340 1725675 1787696 1853617
62352 1853617 1923249 1995394 2068970 2143825 2219308 2292677 2360140 2419152 2468854 2509016 2539966
62341 2539966 2563063 2579483 2588441 2587987 2577635 2558773 2532408 2498295 2456930 2410728 2362107 2311505
62329 2311505 2258390 2203357 2148186 2094551 2043601 1995994 1951051 1906501 1860543 1814121 1769961
62318 1769961 1729312 1690725 1652191 1613401 1575438 1539184 1504673 1471532 1439394 1408027 1377453
62307 1377453 1347915 1319721 1293433 1270181 1251187 1236498 1224499 1213228 1202163 1192401 1185097 1180127
62295 1180127 1176425 1173179 1170191 1167181 1163529 1159146 1155221 1153306 1153642 1154980 1156229 1157698 1160469 1165155
62281 1165155 1171682 1179752 1188841 1198110 1206992 1215692 1224558 1233204 1240981 1248188 1256024 1265303 1276027 1288345
62267 1288345 1302961 1320160 1339195 1359406 1381504 1407069 1437050 1471447 1510373 1554597 1604661
62256 1604661 1659853 1718514 1779482 1843146 1911071 1984469 2062805 2143645 2223742 2300357 2371795
62245 2371795 2436975 2494652 2543249 2581553 2609418 2627391 2635555 2633172 2619727 2595744 2562083 2518861
62233 2518861 2465838 2403728 2334488 2260432 2183797 2107063 2032686 1962130 1895680 1833230 1774565
62222 1774565 1718930 1665460 1614519 1567685 1525886 1488299 1453607 1421443 1392048 1365452 1341780
62211 1341780 1321400 1303718 1286691 1268823 1251007 1235175 1221696 1209559 1198598 1189715 1182943 1177108
62199 1177108 1171815 1168235 1167395 1168982 1172439 1177910 1185339 1193819 1202653 1212111 1222365 1232778 1243158
62186 1243158 1254718 1268635 1284407 1300808 1317796 1336332 1356809 1378826 1402044 1425968 1449243
62175 1449243 1470599 1490530 1510892 1532820 1556187 1581086 1608495 1639111 1672760 1709476 1750177
62164 1750177 1795719 1846166 1901456 1961680 2025948 2092031 2158219 2224765 2292113 2358095 2418346
62153 2418346 2469595 2511350 2544215 2568027 2582485 2588371 2586733 2577296 2559055 2532406 2499372 2461382
62141 2461382 2418148 2369597 2317895 2266250 2216200 2167369 2119742 2074771 2034108 1998537 1968581
62130 1968581 1944766 1926421 1911363 1897887 1886368 1877984 1872708 1869716 1868935 1870657 1874061 1877758 1881687
62117 1881687 1886918 1893477 1899994 1905818 1911932 1919170 1926883 1933984 1939931 1943896 1944430 1941195 1935977 1930750
62103 1930750 1925600 1919803 1914000 1909782 1907622 1906676 1906338 1906605 1907205 1907834 1909229 1912636 1918141 1924730 1931870
62088 1931870 1939663 1947504 1954342 1960613 1968183 1977694 1987635 1996982 2007220 2020415 2036571 2054423 2073884
62075 2073884 2095947 2120708 2147127 2174481 2202597 2230886 2258752 2286951 2316919 2348439 2379459
62064 2379459 2408723 2437176 2466114 2495241 2523629 2551611 2580571 2611276 2643159 2674677 2703646
62053 2703646 2727859 2746361 2759827 2768989 2773171 2771124 2762621 2748111 2727167 2698541 2661705 2617246
62041 2617246 2565800 2507822 2444577 2378068 2309522 2239026 2167187 2095982 2027181 1960897 1896731
62030 1896731 1835482 1778410 1725253 1674534 1626035 1581617 1542934 1509092 1477353 1445785 1414554
62019 1414554 1384808 1357114 1331325 1307550 1286495 1268560 1252991 1238376 1223943 1209982 1197034
62008 1197034 1185192 1174459 1165303 1158352 1153642 1150429 1147791 1145390 1143783 1143979 1146383 1150140 1153890 1157138
61994 1157138 1160373 1163805 1166770 1168730 1170094 1171397 1172210 1171558 1169021 1164821 1159225 1152530 1145149 1136975
61980 1136975 1127182 1115608 1103862 1093808 1085188 1076077 1065731 1055491 1046504 1038057 1029110 1020391 1013701
61967 1013701 1009630 1006957 1004075 1000233 995572 990747 986682 984225 983716 984768 986288 986801 985333 982232
61953 982232 978840 976277 975062 975869 979646 986450 994908 1003627 1012685 1023080 1035192 1048555 1062774
61940 1062774 1077749 1093180 1108770 1124967 1142703 1162145 1182259 1201868 1220772 1239655 1259251
61929 1259251 1279721 1300553 1320910 1340237 1358513 1375715 1391240 1404233 1414425 1422274 1428259 1432419
61917 1432419 1434592 1434737 1432940 1429512 1425366 1422112 1421454 1424360 1430717 1439705 1450584 1463204 1477819 1494425
61903 1494425 1512425 1530884 1548847 1565397 1579807 1591876 1601864 1609857 1615420 1617974 1617182 1612797 1604617
61890 1604617 1592954 1578725 1562675 1545003 1526238 1507943 1491690 1477451 1463708 1449089 1433317
61879 1433317 1416743 1399745 1382727 1366082 1349965 1334515 1320227 1307552 1296209 1285655 1276350
61868 1276350 1269701 1266404 1265580 1266045 1267782 1271490 1277182 1284073 1291740 1300618 1311235 1323676 1338177 1355681
61854 1355681 1377155 1402466 1430496 1460405 1492141 1525441 1559127 1592246 1625460 1660234 1696591
61843 1696591 1732810 1767536 1800934 1833053 1862181 1886084 1904251 1917674 1926853 1931323 1931103 1927407
61831 1927407 1921684 1914824 1907352 1899487 1890959 1881768 1873310 1867738 1865851 1866447 1868068 1870439 1873761 1877512
61817 1877512 1880597 1882073 1881154 1877047 1869237 1857455 1841105 1819382 1792356 1761239 1727256 1691049
61805 1691049 1653619 1616790 1581893 1548744 1516786 1486490 1458570 1432421 1406650 1380991 1356627
61794 1356627 1334614 1314973 1297441 1282150 1269140 1257757 1247022 1236526 1226867 1219129 1213568 1208734
61782 1208734 1202553 1194701 1187299 1182629 1180775 1180273 1180281 1180803 1181315 1180869 1179789 1179769 1181693 1184543 1187091 1189511
61766 1189511 1192446 1195432 1197528 1199112 1201871 1206935 1213743 1220762 1226682 1230901 1233516 1235126 1236321 1237213
61752 1237213 1237635 1237719 1237892 1238323 1238740 1238851 1238528 1237483 1235273 1231792 1227352 1222031 1215563 1208362 1202106 1198333
61736 1198333 1196498 1194286 1190110 1184684 1179964 1177330 1177157 1179184 1182371 1184958 1185732 1185225 1184985 1185843 1187466
61721 1187466 1189195 1190417 1190449 1189296 1188474 1189717 1192532 1194277 1193261 1190665 1188686 1187775 1186637 1184260 1180918
61706 1180918 1177547 1174828 1172483 1168991 1162622 1153410 1143447 1134570 1126468 1117834 1108517 1099468 1091416 1084918
61692 1084918 1081000 1080071 1080411 1079349 1076032 1071745 1067569 1063297 1058805 1054774 1051284 1047108 1041367 1034945
61678 1034945 1029417 1025311 1022102 1019208 1016251 1012887 1009038 1004928 1000450 995115 989006 983195 978699 975601
61664 975601 973567 972460 971926 971181 969977 969164 969470 970223 970119 968815 966982 965118 963163 961071 958935 956660
61648 956660 954246 952391 952131 953734 956273 958354 959122 958901 959126 961195 964951 968645 970908 972194 973661
61633 973661 975223 975731 974783 973211 971775 970357 968591 966273 962875 957626 950729 943797 938324 934037 929306
61618 929306 923012 915578 908391 902733 899194 897544 896857 895906 893775 890254 885708 880572 875055 869309 863573
61603 863573 857780 851199 843096 833918 825191 817913 811622 805567 800084 795916 792503 788149 782019 775081
61589 775081 768718 763163 757734 751953 745922 739981 734549 730008 726273 722622 718372 713588 708763 703959
61575 703959 698704 692873 687289 683235 681311 680884 680676 679887 678650 677375 675893 673595 670441 667534 666400
61560 666400 667587 669940 671283 670118 666946 663888 662718 663382 664641 665884 667668 670357 673005 674206
61546 674206 673816 673283 674120 676369 678780 680339 681297 682546 684224 685430 685432 684750 684626 685728 687758 690102
61530 690102 692291 693938 694862 695339 695689 695574 694275 691827 689205 687091 685112 682735 680294 678502 677335
61515 677335 676043 674051 671257 667765 663971 660807 659174 659019 659445 659781 659998 660084 659590 658064 655577 652626
61499 652626 649816 647706 646575 646171 646070 646349 647395 648809 649127 647278 644063 641582 641175 642365 643782
61484 643782 644674 645333 646409 648089 649878 651097 651684 652437 654285 657257 660434 662946 664721 666139 667332
61469 667332 668180 668698 668947 668680 667755 667020 668140 671987 677467 682464 685770 687655 688692 688782 687582 685338
61453 685338 682884 681114 680724 682052 684719 687706 690370 693265 697357 702404 706743 708918 709035 708208 707230
61438 707230 706407 706397 708349 712788 718681 724012 727314 728630 729150 730163 732379 735930 740544 745500 749708
61423 749708 752336 753553 754373 755656 757469 759651 762580 766834 772142 777227 780944 783260 784918 786495
61409 786495 788133 789929 791991 793853 794254 791979 787104 781264 776522 773924 773124 773224 773664 774180 774284 773365
61393 773365 771471 769647 769121 770164 771914 773263 773731 773543 773143 772797 772586 772619 773220 774902 777978 782111
61377 782111 786203 788927 789645 789014 788702 790278 794122 799339 804755 809998 815578 821942 828541 833951 837010
61362 837010 837936 838320 839952 843626 848987 855333 862279 869755 877740 886183 894943 903653 911830 919329 926575
61347 926575 934182 942604 952275 963644 976556 989799 1001901 1012370 1021599 1029575 1035524 1039276 1042347
61334 1042347 1046911 1053826 1062153 1070363 1077370 1082494 1085353 1086336 1086765 1087957 1090083 1092234 1093551 1093954 1093789
61319 1093789 1093208 1092244 1091347 1091474 1093618 1098305 1105446 1114367 1124004 1133556 1143256 1154255 1167310 1181650
61305 1181650 1195559 1208193 1220491 1234091 1249563 1265924 1281762 1296511 1310494 1323796 1335380
61294 1335380 1343593 1347641 1348310 1347057 1344701 1341324 1337071 1332297 1326837 1319890 1311026 1300889 1290486 1280120
61280 1280120 1269506 1258775 1248956 1241508 1237505 1237066 1239218 1242417 1245405 1247536 1248445 1248127 1247680 1249295
61266 1249295 1254524 1262657 1271468 1279486 1286924 1294547 1302603 1311133 1320469 1330822 1341818 1352970 1364364
61253 1364364 1376389 1388874 1400819 1411097 1419391 1426444 1433148 1439137 1442635 1442339 1439324 1436268 1434713
61240 1434713 1433934 1432660 1430693 1428152 1424409 1419159 1413887 1410666 1409577 1408747 1407136 1405913 1406564 1408888 1411822
61225 1411822 1415368 1420538 1427738 1436241 1445218 1454585 1464802 1476387 1489641 1504284 1519296 1533595
61213 1533595 1547052 1560441 1574261 1587941 1600430 1611359 1621411 1631597 1642283 1652915 1662654
61202 1662654 1671307 1679608 1688597 1698878 1710563 1723740 1738874 1756807 1778274 1803000 1829185 1854545
61190 1854545 1878406 1902357 1928139 1955210 1981109 2004039 2024152 2042263 2058393 2072062 2083275
61179 2083275 2092530 2100277 2106747 2111938 2115417 2116655 2115927 2114262 2111995 2107951 2100752 2090417 2077984 2063975
61165 2063975 2048199 2030662 2011608 1990715 1967356 1941926 1915957 1890589 1865641 1840518 1815237
61154 1815237 1790128 1765319 1741225 1719017 1699742 1683143 1668048 1653944 1641603 1631913 1624468 1617666
61142 1617666 1610187 1602094 1594272 1587002 1579659 1571999 1564960 1559520 1555250 1551083 1547370 1545999 1548166 1553126
61128 1553126 1559693 1568052 1579267 1593740 1611092 1631182 1654293 1680518 1709761 1742177 1777800 1815798
61116 1815798 1854927 1894979 1937232 1983204 2033256 2086364 2140797 2194931 2247837 2299350 2349378
61105 2349378 2397206 2441786 2482712 2520450 2555485 2587516 2615569 2638589 2655767 2666637 2671218
61094 2671218 2670005 2663627 2652376 2636114 2614640 2588184 2557424 2523003 2485169 2444135 2400692 2356173
61082 2356173 2311850 2268687 2227476 2188584 2151446 2114981 2078872 2043975 2011299 1981176 1953739
61071 1953739 1929388 1908156 1889290 1872285 1857832 1846980 1839754 1835470 1833945 1835346 1839059 1843913
61059 1843913 1849684 1857468 1868329 1882248 1898515 1916492 1935930 1957196 1981309 2009125 2040510 2074926
61047 2074926 2112559 2153905 2198348 2244489 2292159 2342909 2397926 2456555 2517602 2581198 2648502
61036 2648502 2720262 2796475 2876904 2961048 3048072 3137609 3230453 3327736 3429668 3535697 3645688
61025 3645688 3760247 3880013 4005230 4136043 4272793 4416005 4566374 4724737 4892167
61016 4892167 5070688 5264097 5477229 5713757 5975285 6263506 6582858 6940074 7341246
61007 7341246 7790238 8289943 8844078 9457450 10135524 10884942 11715043 12639224 13675135
60998 13675135 14843355 16164898 17658174 19335179 21196034 23222937 25377048 27599755
60990 27599755 29815156 31931727 33848905 35476174 36759824 37698940 38337031 38736582
60982 38736582 38955773 39036419 38996239 38819553 38454383 37827687 36875711 35571556 33935101
60973 33935101 32025720 29927503 27734074 25535124 23406034 21402338 19558621 17889862
60965 17889862 16394609 15060577 13871354 12811084 11865606 11021733 10267005 9590372 8982801
60956 8982801 8436898 7945633 7501505 7097437 6728552 6392355 6086664 5808145 5553382
60947 5553382 5320299 5107201 4911046 4728301 4557196 4397504 4248024 4106151 3970388
60938 3970388 3841485 3720160 3605149 3494654 3388454 3287242 3190775 3098130 3009301 2925243
60928 2925243 2846477 2772663 2703389 2638537 2577906 2521057 2467424 2416279 2367093 2320267 2276804
60917 2276804 2236701 2198525 2161325 2126111 2094360 2065724 2038355 2011043 1983947 1957663 1932747
60906 1932747 1909814 1888885 1868827 1848507 1828296 1809334 1791558 1773687 1755107 1736559 1718905
60895 1718905 1702286 1686481 1671093 1655404 1639209 1623688 1610144 1597757 1583962 1567517 1550053
60884 1550053 1534166 1520876 1509351 1498171 1486450 1474475 1463457 1453977 1444888 1434976 1425483 1419244
60872 1419244 1416995 1416325 1414970 1413218 1411998 1410593 1408275 1406863 1409135 1414960 1421128 1425367 1428833 1434120
60858 1434120 1442224 1452286 1463283 1474731 1486046 1496230 1504486 1510711 1515166 1518085 1520085 1522678 1527471
60845 1527471 1534422 1541642 1547619 1553012 1559147 1565325 1569264 1570276 1570164 1570226 1569043 1564685 1558070 1552419 1549744
60830 1549744 1549319 1549475 1549553 1549784 1550385 1551526 1553735 1557823 1564334 1572956 1582388 1591136 1598951 1607289 1617961
60815 1617961 1631382 1646449 1661832 1676942 1691976 1707684 1724950 1743977 1763846 1783416 1802631
60804 1802631 1822284 1842397 1861625 1878677 1893805 1908186 1922027 1934048 1943149 1950066 1956835 1964666
60792 1964666 1972732 1979011 1981858 1980689 1975841 1968302 1959231 1949270 1938506 1927231 1916101 1904982 1892338
60779 1892338 1876687 1858283 1838492 1818035 1796952 1775801 1755412 1735474 1714905 1693782 1673447
60768 1673447 1654409 1635664 1616519 1597573 1579249 1560994 1542790 1525907 1510917 1496323 1480459
60757 1480459 1463613 1446951 1430438 1413413 1396317 1380210 1365102 1350148 1335014 1319856 1304573
60746 1304573 1289349 1275146 1262289 1249471 1235869 1223389 1214631 1208869 1202175 1191613 1177639 1162533
60734 1162533 1148483 1137316 1129877 1124891 1119918 1113916 1107485 1100566 1091997 1081983 1072908 1066542 1062083
60721 1062083 1057986 1054141 1050957 1047820 1044042 1040226 1037054 1033548 1028198 1021385 1015150 1010634 1006819 1001768
60707 1001768 994344 984954 975419 967984 963684 961593 959886 957332 953687 949445 945756 943671 942700 940819
60693 940819 936697 931272 926320 922277 918579 915360 913281 911925 909892 906760 903761 902135 901717 901659 901763
60678 901763 902494 904003 905745 907187 908670 911272 915467 920124 923447 925085 926560 929169 932251 934223
60664 934223 934706 934688 935055 935977 937604 940236 943639 946997 949821 952446 955529 959453 964208 969378 974371
60649 974371 979088 984232 990403 997107 1003297 1008677 1013633 1017915 1020381 1020380 1018712 1016761 1015054 1012975 1009651
60634 1009651 1004944 999749 995229 991478 987175 981079 973763 967264 963014 960648 958758 956110 952115 946992
60620 946992 941872 938140 936271 935573 935131 934412 932912 930046 925891 921485 917859 915055 912412 909417 906046
60605 906046 902815 900813 901063 903273 905663 906635 906344 906130 906865 908563 911162 914611 918140 920469 921160 921199
60589 921199 921850 923423 925518 927899 930495 932856 934416 935399 936765 938930 941006 941923 942075 943164 946267
60574 946267 950648 954878 958618 962657 967498 972871 978787 986186 995941 1007753 1020712 1034599 1049784
60561 1049784 1065885 1081373 1094884 1106443 1117042 1127335 1137048 1145332 1151253 1154206 1154368 1152759 1150529
60548 1150529 1148240 1146096 1144622 1144464 1145466 1146739 1148065 1150734 1156337 1164975 1175249 1185926 1196980
60535 1196980 1208958 1221989 1235761 1250053 1264757 1279403 1292965 1304179 1312035 1316228 1317460 1317256
60523 1317256 1317079 1317294 1316938 1314760 1310765 1306734 1304874 1305691 1307408 1307747 1306112 1303780 1302286 1302143 1303085 1304907
60507 1304907 1307956 1313073 1321024 1331655 1343848 1356896 1371601 1389148 1409165 1430273 1452707 1478824
60495 1478824 1510221 1545787 1583749 1624317 1668611 1715812 1763302 1809292 1853434 1894811 1931266
60484 1931266 1961155 1984064 1999012 2003563 1995831 1976249 1946381 1907240 1860113 1808052 1754779 1702279
60472 1702279 1650595 1599653 1549974 1501869 1455463 1411739 1372243 1337233 1305172 1274672 1246156
60461 1246156 1220939 1199287 1180030 1161631 1143116 1124384 1106241 1089893 1075816 1063299 1051496
60450 1051496 1040625 1031489 1023913 1016461 1008039 999340 992237 987776 985022 981942 977330 971806 966918 963448
60436 963448 960784 957936 954699 951535 948499 944799 939591 933014 926291 920839 917315 915494 914933 915519 917135
60421 917135 918915 919429 918035 915785 914506 915030 916733 918690 920682 922877 925143 927163 928972 930936 933243
60406 933243 935703 937982 939843 941240 942365 943512 944749 945888 946994 948666 951466 955197 959085 962675
60392 962675 966251 970323 974909 979306 982536 984292 985664 988523 993615 999478 1003896 1006359 1008350 1011184
60378 1011184 1014488 1017222 1019376 1021857 1025131 1028747 1032121 1035227 1038484 1042349 1046876 1051412 1054957 1057302
60364 1057302 1059598 1063225 1068134 1072862 1076227 1078501 1080885 1084406 1089440 1095669 1102088 1107506 1111579 1115183
60350 1115183 1119475 1124759 1130584 1136656 1143259 1150941 1160195 1171255 1183701 1196387 1208409 1220113 1232353
60337 1232353 1244499 1254051 1258971 1259737 1258154 1254553 1247479 1236290 1222826 1209881 1198936 1190024 1182926
60324 1182926 1177325 1172258 1166591 1160120 1153477 1147182 1141612 1137662 1136189 1136594 1137129 1137110 1137836 1140774 1145713
60309 1145713 1151511 1157915 1165692 1175376 1186901 1200395 1216408 1235048 1255311 1275672 1295333 1314818
60297 1314818 1335036 1355490 1373834 1387938 1398180 1406614 1413886 1418401 1418955 1416461 1411889 1404040 1391275
60284 1391275 1374651 1357256 1340556 1323253 1303943 1283172 1262463 1242874 1225188 1210103 1197287
60273 1197287 1185266 1173128 1161457 1150864 1140562 1129543 1118459 1109061 1101927 1095852 1089606 1083441
60261 1083441 1078510 1075239 1072613 1068947 1063242 1055837 1047939 1040814 1035539 1032976 1033256 1035317 1037578 1039158
60247 1039158 1040044 1040342 1040166 1040131 1040869 1041913 1042139 1041694 1042379 1045472 1050063 1054274 1057278 1059448 1061360 1063621
60231 1063621 1066880 1070939 1074373 1076131 1077123 1079243 1083174 1088254 1094119 1101102 1108918 1116235 1122053 1126796
60217 1126796 1131728 1137811 1145328 1153984 1163141 1172272 1181261 1190045 1198297 1206002 1213963 1222951 1232676 1242421
60203 1242421 1252391 1263281 1274595 1284758 1293146 1300697 1307980 1314024 1318039 1321247 1325683 1331626 1337353
60190 1337353 1341325 1343584 1344960 1345768 1345588 1343831 1340269 1335361 1330227 1325961 1322730 1319610 1315443 1309777
60176 1309777 1303061 1296072 1289283 1282740 1276402 1270436 1265124 1260648 1257078 1254400 1252390 1250700 1249344 1248864
60162 1248864 1249549 1250698 1251222 1250890 1250367 1249987 1249220 1247615 1245649 1244305 1244250 1245661 1248303 1251501 1254687 1258388
60146 1258388 1263943 1271558 1279300 1284975 1288688 1292639 1298552 1306375 1315534 1326205 1338639 1351949 1364516
60133 1364516 1375541 1385732 1396437 1408438 1421434 1434208 1445093 1452612 1456210 1456665 1455747 1455201 1455798
60120 1455798 1457180 1458503 1459113 1458828 1458001 1457438 1457876 1459191 1460330 1460384 1459635 1459138 1459326 1459396 1458161 1455228 1451220
60103 1451220 1447096 1443465 1440390 1437599 1434777 1431692 1428250 1424652 1421494 1419355 1418009 1416366 1413639 1410469
60089 1410469 1408475 1408693 1410887 1414326 1418584 1423276 1427724 1431632 1435863 1441742 1449372 1457139 1463185 1466981
60075 1466981 1469087 1469645 1467773 1462636 1454614 1444964 1434486 1422978 1410043 1395873 1380926 1365185 1348426
60062 1348426 1331204 1314981 1300806 1288174 1275687 1262819 1250648 1240690 1233296 1227406 1221658 1215443
60050 1215443 1209037 1203181 1198734 1196345 1196023 1196990 1198183 1199000 1199585 1200707 1203585 1209412 1218234 1228219 1236811
60035 1236811 1243137 1248757 1255484 1262791 1268159 1269830 1268488 1266127 1264062 1262333 1260335 1257325 1252613 1245908
60021 1245908 1237525 1227960 1217348 1205625 1193018 1180031 1167009 1154095 1141606 1130063 1119780 1110726
60009 1110726 1102855 1096252 1090818 1086144 1081998 1078739 1076914 1076466 1076665 1076966 1077722 1079757 1083223 1087201 1090676
59994 1090676 1093799 1097746 1103195 1109273 1114376 1117982 1121356 1126388 1133835 1142690 1151106 1157888 1163171 1167759
59980 1167759 1172084 1176088 1179974 1184371 1189287 1193434 1195275 1194576 1192297 1189124 1184996 1180220 1176125 1174023
59966 1174023 1173942 1174901 1176004 1176791 1176843 1175801 1173961 1172494 1172889 1176007 1181363 1187236 1191816 1194497 1195831 1196149
59950 1196149 1194810 1191187 1185962 1180884 1177392 1175709 1174933 1173698 1171215 1168116 1165887 1165057 1164508 1163108 1161226
59935 1161226 1159679 1157874 1154483 1149751 1145676 1143544 1142481 1140849 1138119 1135037 1132894 1132949 1135481 1138919
59921 1138919 1140962 1141259 1142000 1145092 1149728 1153702 1156250 1158466 1161554 1165888 1171456 1177989 1184797 1191445
59907 1191445 1198478 1206585 1215294 1223463 1230909 1238457 1246334 1253621 1259565 1264526 1269237 1273863 1278128 1281727
59893 1281727 1284271 1285456 1285773 1286604 1289195 1293647 1299069 1304446 1309320 1313985 1319182 1325353 1332178 1338982
59879 1338982 1345500 1351950 1358584 1365502 1372660 1379675 1385931 1391309 1396264 1400543 1402493 1400767 1396298 1391340
59865 1391340 1386734 1381452 1374713 1366992 1358765 1349887 1340725 1332385 1325112 1317934 1310691 1304884 1301458 1299182
59851 1299182 1296623 1294476 1294327 1296102 1298504 1301296 1305360 1310981 1317847 1326353 1336923 1348146 1357538 1364530
59837 1364530 1370909 1377904 1384605 1389939 1394386 1398620 1401841 1402864 1401886 1399912 1397104 1392836 1386890 1379551
59823 1379551 1370944 1361126 1350348 1338370 1324205 1307727 1291014 1276667 1264931 1253893 1242541 1231967
59811 1231967 1223057 1214648 1205323 1196037 1189326 1186056 1184315 1181814 1178222 1174565 1171204 1167417 1162602 1156834
59797 1156834 1150189 1142558 1134578 1127916 1123654 1120705 1116798 1111106 1105074 1100391 1097015 1093801 1090403 1087546
59783 1087546 1085561 1083667 1081062 1078126 1075997 1075202 1075156 1074919 1074087 1072924 1071952 1071541 1071616 1071606 1071013 1070295 1070944
59766 1070944 1074169 1079554 1085500 1091110 1097059 1104359 1112845 1121470 1129724 1138047 1146889 1156026 1164957 1173587
59752 1173587 1182380 1192108 1203393 1216136 1229485 1242707 1255932 1269517 1282947 1295210 1306297 1317226
59740 1317226 1328148 1337324 1342839 1344808 1345133 1345371 1345566 1345065 1343790 1342593 1342617 1344237 1346417 1347445 1346597
59725 1346597 1344781 1343226 1342081 1340895 1339847 1339466 1339342 1338209 1335558 1332298 1329463 1327018 1324451 1322016
59711 1322016 1320759 1321424 1323677 1326334 1328159 1328642 1328188 1327533 1327046 1326704 1326531 1326650 1326972 1327277 1327565 1327837 1327664
59694 1327664 1326694 1325683 1326150 1328478 1331078 1332148 1331879 1332030 1333415 1334692 1334017 1331427 1328948 1328277 1328837 1328641
59678 1328641 1326910 1325032 1324357 1323839 1320979 1314981 1307753 1301482 1296428 1291681 1286912 1282204 1276966 1270404
59664 1270404 1262890 1255704 1249415 1243537 1237890 1233324 1230706 1229924 1230115 1230327 1229765 1228075 1225715 1223554 1221948
59649 1221948 1220765 1220330 1221429 1223909 1226151 1226688 1225793 1224742 1223900 1222377 1219385 1215179 1210591 1206270 1202466
59634 1202466 1199147 1196189 1193701 1192067 1191384 1191035 1190287 1189224 1188584 1188740 1189351 1190073 1190963 1191924 1192271 1191291 1189007
59617 1189007 1186100 1183251 1180732 1178414 1175956 1173261 1170941 1170013 1170755 1172200 1173232 1173978 1175427 1177715 1179524
59602 1179524 1179534 1177952 1176104 1174837 1173890 1172730 1171428 1170553 1170476 1170982 1171429 1171180 1170014 1168234 1166348 1164667
59586 1164667 1163185 1161602 1159347 1155864 1151336 1146992 1144149 1142851 1141800 1139731 1136476 1132702 1129200 1126565
59572 1126565 1124959 1123828 1122432 1121003 1120729 1121994 1123339 1123075 1121469 1120269 1120289 1120696 1120816 1121454 1123769 1127670
59556 1127670 1131973 1135592 1138082 1139481 1140384 1141873 1144697 1148447 1151963 1154632 1157127 1160858 1166745 1174459
59542 1174459 1182818 1190998 1199220 1208185 1218267 1229808 1243748 1260939 1280674 1300815 1319743 1337391
59530 1337391 1354040 1369029 1381368 1390940 1398345 1404010 1408169 1411290 1413839 1415999 1418148 1421071 1424934
59517 1424934 1428609 1430938 1432173 1433139 1433294 1430875 1424955 1416192 1405474 1393018 1379166 1364891 1350811
59504 1350811 1336519 1321623 1306961 1294073 1283703 1275322 1267916 1260829 1253941 1247311 1240796 1234206 1228048
59491 1228048 1223763 1222561 1224040 1226641 1229607 1233703 1239765 1247320 1255284 1263411 1272212 1281633 1290595 1298110
59477 1298110 1304458 1311048 1319302 1329827 1342545 1357124 1372902 1388538 1402455 1413953 1423433 1431287
59465 1431287 1437215 1441243 1444613 1448612 1453003 1456887 1460943 1467417 1477676 1491021 1506213 1522867 1540881
59452 1540881 1559824 1579683 1601027 1623585 1645898 1667476 1690023 1714768 1739239 1758594 1770132
59441 1770132 1774993 1775382 1771812 1763677 1751140 1735345 1717326 1697582 1676547 1654985 1634008 1614815
59429 1614815 1598099 1583530 1570156 1557564 1546411 1537740 1532087 1529458 1529872 1533643 1541197 1552650 1567462
59416 1567462 1584584 1603234 1623552 1646203 1671203 1697339 1722848 1746553 1768221 1787848 1804603
59405 1804603 1816544 1821613 1819087 1810053 1796507 1780300 1762900 1745554 1729136 1714091 1700838 1689784
59393 1689784 1680323 1670146 1656494 1638206 1616079 1591306 1564379 1535728 1506572 1478476 1452485
59382 1452485 1429126 1408920 1392224 1378718 1367621 1358467 1351224 1345605 1340885 1336811 1334245 1334265 1336596
59369 1336596 1339601 1342036 1344372 1347987 1353519 1360563 1368664 1377770 1387653 1397731 1407935 1419292 1433218
59356 1433218 1450278 1469751 1490151 1510191 1529683 1549682 1571426 1595064 1619884 1645627 1672795
59345 1672795 1701522 1731052 1760731 1790652 1820624 1849245 1874835 1896861 1915727 1931590 1944054
59334 1944054 1952640 1956823 1955953 1949835 1939054 1924160 1905043 1881873 1856059 1829281 1801982 1773852
59322 1773852 1745346 1717487 1690400 1663468 1637102 1613054 1592609 1575458 1560652 1547589 1535833
59311 1535833 1525010 1515465 1508115 1503134 1499588 1496811 1495282 1495524 1496959 1498636 1500581 1503719 1508829 1516113
59297 1516113 1525363 1535975 1547151 1558591 1570786 1584183 1598264 1611692 1623041 1631187 1635457 1635871
59285 1635871 1633020 1627484 1619694 1610457 1601086 1592658 1585516 1579750 1575686 1573599 1573445 1575250 1579366 1586092
59271 1586092 1595386 1607185 1621411 1637367 1653671 1669230 1683809 1697279 1708868 1717727 1723739 1727212
59259 1727212 1728090 1725910 1720220 1710681 1697163 1680223 1661094 1640834 1619955 1599269 1580375 1564514
59247 1564514 1551366 1539781 1529396 1520751 1514067 1508730 1504038 1499819 1496345 1494181 1494076 1496429 1500774
59234 1500774 1506217 1512352 1519297 1526778 1533589 1538110 1539224 1536891 1532085 1526122 1519773 1513016 1505517 1496943
59220 1496943 1486733 1474256 1459678 1444149 1428653 1413165 1397574 1382902 1370664 1361184 1353405 1346386
59208 1346386 1340211 1335271 1331376 1327957 1324894 1322787 1322402 1323728 1325574 1326530 1326597 1327465 1330753 1336332 1342816
59193 1342816 1349237 1355556 1361934 1368395 1375089 1382066 1388785 1394522 1399344 1403950 1408521 1412337 1414664 1415512
59179 1415512 1415617 1416302 1419227 1425249 1433189 1440548 1445969 1450627 1456902 1466156 1477979 1490880 1503273 1514389
59165 1514389 1524952 1536756 1551021 1567119 1583127 1597454 1609628 1619667 1627175 1631318 1631673 1628968
59153 1628968 1624718 1619911 1614065 1605764 1594054 1579241 1562624 1545767 1529802 1514941 1500740 1487140
59141 1487140 1474866 1464218 1453852 1441942 1428699 1416699 1408195 1402834 1398593 1394181 1389758 1385890
59129 1385890 1382874 1380961 1380392 1381069 1382758 1385539 1389409 1393441 1396196 1397344 1398380 1401341 1407252 1416095
59115 1416095 1427609 1441299 1455939 1469960 1482512 1493636 1503464 1511980 1519717 1527767 1536543 1545125
59103 1545125 1552427 1558469 1563823 1568437 1571868 1574178 1575457 1574825 1571340 1565851 1560464 1555905 1550995 1545303
59089 1545303 1540619 1538519 1537697 1535275 1530090 1523308 1516300 1509305 1502012 1494156 1485506 1476136 1466601 1457056
59075 1457056 1446657 1434799 1422420 1410813 1399651 1387750 1375480 1364653 1355908 1348042 1340259 1333145
59063 1333145 1326692 1319240 1309732 1299694 1291639 1286425 1283425 1282326 1283182 1285158 1286529 1285913 1282745 1277108
59049 1277108 1270173 1264329 1261558 1261566 1262329 1262377 1261784 1261264 1261387 1262605 1264928 1267357 1268644 1268939 1269900 1272822 1277412
59032 1277412 1282782 1288932 1296562 1305822 1315894 1325865 1335708 1346339 1358721 1372748 1387093 1400461
59020 1400461 1413066 1426604 1442622 1461055 1480197 1497772 1512078 1522651 1530222 1535837 1539864 1542002
59008 1542002 1542235 1541329 1540089 1538525 1536229 1533523 1531739 1532222 1535329 1540577 1547522 1556126 1566315 1577543
58994 1577543 1589040 1600401 1611713 1623125 1634490 1645398 1655344 1663748 1670032 1673964 1675936 1676771 1677085
58981 1677085 1676882 1675892 1674346 1673255 1673663 1675697 1678662 1682207 1687083 1694459 1704731 1717367 1731777 1747885
58967 1747885 1765807 1785313 1805773 1826455 1846854 1866828 1886328 1904873 1921514 1935607 1947383
58956 1947383 1957266 1964750 1968391 1966807 1959259 1945561 1926350 1903592 1879850 1856503 1833153 1809147
58944 1809147 1784988 1761646 1739150 1716872 1695038 1674976 1657588 1642307 1628001 1614494 1602605
58933 1602605 1592884 1584952 1578324 1573371 1570825 1570368 1570349 1569215 1566820 1564012 1561368 1558883 1556534 1554368 1552080
58918 1552080 1549257 1546227 1544155 1544023 1545823 1548717 1551633 1553824 1555524 1558147 1563210 1570877 1580068 1590010
58904 1590010 1601081 1614109 1629648 1648139 1669836 1694204 1720178 1747455 1776686 1807970 1840076
58893 1840076 1871826 1903372 1935387 1967878 2000826 2035142 2071651 2109553 2147184 2184047 2220731
58882 2220731 2256807 2290110 2318408 2340862 2357606 2368984 2375563 2377905 2375708 2367828 2353676 2334020
58870 2334020 2310061 2282502 2252132 2220547 2189215 2158033 2125773 2092125 2058617 2027330 1999186
58859 1999186 1973738 1950089 1927443 1905040 1882338 1859648 1838220 1819177 1802331 1786312 1769898
58848 1769898 1752981 1736279 1720503 1705910 1692173 1678344 1663310 1646802 1629911 1614205 1600311
58837 1600311 1587557 1574890 1561814 1548409 1534867 1521312 1508023 1495631 1484905 1476284 1469682 1464763
58825 1464763 1461151 1458178 1454735 1450003 1444450 1439670 1437080 1437148 1439769 1444593 1450674 1456510 1461146 1464904
58811 1464904 1468564 1472196 1475306 1477728 1479724 1481443 1482897 1484347 1486016 1487363 1487152 1484422 1479235 1472582
58797 1472582 1465851 1460112 1455469 1451121 1446363 1441303 1436244 1430667 1423489 1414395 1404491 1395649 1389459 1386606
58783 1386606 1386734 1388779 1391695 1394881 1397961 1400590 1402777 1404894 1406837 1407654 1406638 1404398 1402003 1399434
58769 1399434 1395849 1391271 1386806 1382952 1378770 1373343 1367327 1362381 1359432 1358014 1357029 1355780 1354471 1354042
58755 1354042 1355343 1358333 1362276 1366779 1372153 1378519 1385034 1390537 1394856 1399061 1404338 1410844 1417753 1424401
58741 1424401 1431185 1439124 1448521 1458426 1467677 1476222 1485087 1495285 1507051 1519794 1532194 1542657 1550554
58728 1550554 1557123 1564486 1573615 1583897 1594651 1606036 1617945 1629049 1637998 1645243 1652683 1661484 1671016
58715 1671016 1680004 1687984 1695325 1702403 1709260 1715757 1721516 1725831 1728120 1728505 1727521 1725109 1720252 1711771
58701 1711771 1699149 1682446 1661982 1638545 1613528 1588151 1562763 1537432 1512915 1490121 1468767
58690 1468767 1447664 1426540 1406543 1388494 1371695 1355201 1339423 1325575 1314111 1304537 1296181 1288260
58678 1288260 1279718 1270136 1260684 1253238 1248508 1245722 1243988 1243135 1243308 1244563 1247020 1250868 1256150 1262875
58664 1262875 1271105 1280452 1289832 1298439 1306649 1315270 1324176 1332439 1339422 1344840 1348144 1349006 1348190 1346679
58650 1346679 1344072 1339305 1333077 1327967 1325397 1323767 1320467 1314832 1308272 1302252 1297219 1293093 1289901 1287923
58636 1287923 1287668 1289658 1293896 1299658 1305869 1311520 1315836 1318714 1321147 1324644 1329816 1335847 1341525 1346519
58622 1346519 1351583 1357862 1365958 1375334 1384716 1393532 1402673 1413283 1425178 1437312 1449366 1461611 1473346
58609 1473346 1482965 1489940 1495505 1500912 1506153 1510868 1515333 1519808 1523868 1526933 1528531 1527646 1523188 1516009
58595 1516009 1509263 1505578 1504795 1505459 1507343 1510999 1515805 1520425 1525045 1531410 1540480 1551456 1563448 1576802
58581 1576802 1592256 1609742 1628654 1648547 1668898 1688655 1706830 1723485 1739748 1756695 1774387
58570 1774387 1792082 1809354 1826835 1845672 1866406 1888740 1912371 1937664 1965347 1995883 2029127
58559 2029127 2064108 2098997 2131849 2161588 2187898 2210145 2227182 2238508 2244846 2247114 2245465 2239915
58547 2239915 2231368 2221457 2211690 2202997 2195339 2187209 2176254 2161290 2143305 2123877 2103185 2080431
58535 2080431 2055688 2030212 2005005 1980055 1955164 1930780 1907728 1886638 1867932 1852078 1839543
58524 1839543 1830353 1823679 1818178 1813286 1810026 1809758 1811972 1814253 1814840 1814263 1813859 1813731 1813287 1812982 1813957 1816098
58508 1816098 1817724 1817466 1815503 1812726 1809492 1805633 1801086 1796136 1791317 1787296 1784481 1782462 1780064 1776393
58494 1776393 1771936 1768434 1767246 1767784 1768047 1767090 1766394 1768036 1772037 1776706 1781338 1787006 1794495 1803237 1813066
58479 1813066 1825364 1841066 1858770 1876347 1893546 1911388 1929611 1946372 1960257 1971063 1978747
58468 1978747 1983090 1984473 1983597 1980260 1973778 1964981 1956597 1951029 1948584 1948263 1949334 1951561 1954763 1959006
58454 1959006 1964907 1973069 1983282 1994509 2005542 2015538 2024145 2031344 2037159 2041489 2044180 2045014 2043491
58441 2043491 2039015 2031757 2023308 2016152 2012345 2012392 2014838 2016963 2016728 2014585 2013019 2014122 2018222 2024967 2034488
58426 2034488 2046698 2060469 2074691 2089478 2105258 2121279 2136238 2149937 2162940 2174814 2184083
58415 2184083 2190019 2193361 2195157 2195849 2195525 2193993 2190460 2184168 2175621 2166286 2156921 2147133 2136892 2127464
58401 2127464 2120165 2114874 2110498 2106582 2103826 2103025 2103940 2105530 2107278 2109948 2114545 2120638 2126405 2130517
58387 2130517 2133198 2135196 2136896 2139213 2144159 2152952 2164052 2174630 2183955 2193993 2206468 2220648 2234558
58374 2234558 2247432 2260272 2274430 2290272 2307182 2324647 2343166 2363787 2386727 2411017 2435761
58363 2435761 2461095 2487404 2514254 2540896 2567452 2594813 2623593 2653616 2683999 2713173 2739421
58352 2739421 2762202 2782743 2802826 2823370 2844332 2865142 2884794 2902617 2919737 2938668 2960512
58341 2960512 2983597 3005917 3027715 3050428 3074393 3099381 3126354 3156584 3189403 3222771 3255886
58330 3255886 3289656 3324774 3360932 3397775 3435039 3471732 3506566 3539293 3570552 3600744 3630148
58319 3630148 3659595 3689579 3719233 3747651 3775800 3805611 3837689 3871486 3907165 3945417 3985799
58308 3985799 4027137 4069438 4113765 4160456 4209092 4259841 4313064 4368011 4423680 4480530 4539523
58297 4539523 4600107 4661260 4723916 4789964 4859296 4930262 5002645 5077525 5154524 5232132 5310883
58286 5310883 5393270 5480179 5570131 5662423 5758171 5857835 5960556 6066676 6178056 6295086
58276 6295086 6416066 6540362 6669378 6803489 6940873 7080649 7224542 7374230 7529594
58267 7529594 7690895 7860025 8037984 8223402 8414992 8613276 8818569 9029733 9246630
58258 9246630 9471555 9706264 9949310 10198050 10451902 10712267 10980615 11257863 11544464
58249 11544464 11840331 12145968 12463939 12797581 13148276 13516125 13903204 14313317 14748170
58240 14748170 15206746 15689105 16197942 16735791 17303692 17903446 18538232 19210295 19921091
58231 19921091 20674350 21475772 22329160 23236206 24200431 25227344 26320336 27481009 28714663
58222 28714663 30031086 31439088 32945266 34559491 36296668 38171967 40200146 42401657
58214 42401657 44804003 47435590 50325086 53510186 57041631 60976737 65376635 70314170
58206 70314170 75877345 82157914 89236902 97178870 106030732 115823226 126583044 138351388
58198 138351388 151193831 165208547 180554864 197486040 216335166 237443344 261075881
58191 261075881 287345676 316110058 346852944 378644914 410212528 440001564 466155619
58184 466155619 486568851 499245846 502904275 497424380 483827394 463865746 439550328
58177 439550328 412821422 385353164 358427760 332871711 309063767 287007233 266461374
58170 266461374 247114314 228732765 211219080 194581507 178885349 164223312 150687952
58163 150687952 138335346 127163836 117121918 108125956 100071333 92845127 86344335
58156 86344335 80484775 75194531 70407272 66064933 62119445 58527144 55245700 52238652
58148 52238652 49477349 46935494 44586291 42407139 40382376 38498953 36743344 35104183
58140 35104183 33573381 32142573 30802324 29546146 28370871 27271300 26238555 25265130
58132 25265130 24347209 23480286 22656982 21871569 21122863 20410427 19731325 19082466 18462656
58123 18462656 17870208 17301811 16755810 16233520 15735352 15258406 14799485 14357538 13931722
58114 13931722 13520397 13123865 12744827 12383958 12037852 11703265 11380398 11070003 10770399
58105 10770399 10479960 10199803 9931107 9671993 9419818 9174828 8938926 8712145 8492689
58096 8492689 8279357 8071943 7870319 7674900 7487074 7307693 7135947 6970680 6811591
58087 6811591 6658331 6509939 6366106 6227327 6092959 5961141 5831712 5707087 5588760
58078 5588760 5474946 5363371 5254479 5149949 5049546 4951518 4854959 4760002 4666591 4574761
58068 4574761 4485439 4399583 4317208 4238181 4163019 4091895 4023930 3958404 3895505 3834997 3775450
58057 3775450 3715945 3657345 3600866 3546640 3494591 3445047 3397211 3348581 3297626 3245968 3196401
58046 3196401 3149749 3105155 3062395 3022027 2983730 2946069 2907934 2869396 2831343 2794779 2759890
58035 2759890 2725472 2690167 2654535 2620624 2588966 2557499 2524243 2489635 2455331 2422203 2390566
58024 2390566 2360777 2332242 2303249 2273250 2244082 2217428 2192299 2166651 2140368 2114888 2090762
58013 2090762 2067545 2045550 2025830 2008464 1992310 1976413 1960613 1944936 1929482 1914773 1901368
58002 1901368 1889181 1877659 1866230 1854243 1841203 1827629 1814816 1803165 1791583 1779065 1765807
57991 1765807 1752224 1738165 1723885 1710426 1698151 1686367 1675418 1667332 1662789 1659065 1652995 1644705
57979 1644705 1636261 1627758 1617348 1604701 1591959 1581033 1572011 1564457 1558394 1553489 1548781 1543822 1539058
57966 1539058 1534793 1530756 1526890 1523500 1520349 1516491 1511327 1505292 1499469 1495007 1492658 1492148 1492146 1491484 1490166
57951 1490166 1488676 1486898 1484607 1482434 1481231 1480745 1479952 1478479 1476770 1475088 1473274 1471303 1469251 1467069
57937 1467069 1465272 1465349 1468208 1472463 1475544 1476635 1477385 1479492 1482530 1484494 1483833 1480726 1476836 1473891 1472072
57922 1472072 1469832 1465523 1458882 1450633 1441291 1431070 1420468 1410069 1399920 1389721 1379402 1369038
57910 1369038 1358639 1348537 1339491 1331813 1324899 1318145 1311758 1306209 1301693 1298634 1297557 1297585 1296170 1291466
57896 1291466 1284073 1275429 1265738 1254943 1244563 1236524 1230781 1225796 1220855 1216133 1211061 1204725 1197675
57883 1197675 1191327 1185581 1178975 1171256 1163858 1157494 1151172 1144144 1137087 1130704 1124590 1118124 1111273 1104084
57869 1104084 1096601 1089584 1083887 1078818 1072684 1065436 1059199 1055546 1053779 1052655 1052151 1052455 1052723 1052264 1052012
57854 1052012 1053522 1057143 1062110 1067733 1073567 1079090 1084147 1089161 1094178 1098335 1101046 1103016 1105399 1108545
57840 1108545 1112127 1115549 1117550 1116659 1113333 1110651 1111256 1114074 1115709 1114854 1113607 1114216 1116292 1118089 1119320
57825 1119320 1121398 1125275 1130126 1134270 1136799 1138062 1138930 1139928 1141007 1141807 1141887 1140809 1138434 1135316 1132531
57810 1132531 1130764 1129511 1127425 1123536 1117969 1111328 1103528 1093724 1081746 1069195 1058419 1050270 1043459
57797 1043459 1036441 1029299 1023305 1019129 1016163 1013382 1010231 1006865 1004034 1002621 1002876 1004326 1006793 1010948
57783 1010948 1017122 1023943 1029136 1031672 1032549 1033620 1036292 1041090 1047459 1053912 1059188 1063470 1067966 1073387
57769 1073387 1079426 1085419 1090554 1093568 1093379 1090255 1085498 1079826 1072900 1064526 1055324 1046001 1036939 1028794
57755 1028794 1022398 1017600 1013171 1008443 1004141 1000940 998076 994338 989887 986224 984553 984766 985744 986061 984636
57740 984636 981394 977435 974224 972478 971711 970706 968559 965662 963662 964016 966494 969427 971311 971799 971373
57725 971373 970844 971079 972410 974093 975050 975255 975727 977089 978918 980674 982354 983927 984937 985195 985219 985541
57709 985541 986053 986328 986111 985295 983939 982458 981354 980719 980563 981352 983313 985483 986754 987924 991103 996641
57693 996641 1002226 1005961 1008948 1013553 1020057 1026467 1031171 1034579 1038424 1044412 1053512 1065799 1080844 1098438
57679 1098438 1118616 1140867 1164107 1187906 1213123 1240952 1272073 1307222 1347645 1394101 1445942
57668 1445942 1501735 1560040 1619019 1676278 1729995 1779206 1821747 1852706 1866572 1861041 1837944
57657 1837944 1801100 1754496 1702198 1648145 1595132 1544488 1496975 1453570 1415385 1383253 1357211
57646 1357211 1335936 1317112 1299193 1282705 1269190 1259097 1251415 1245147 1240272 1237252 1236290 1237082 1238746
57633 1238746 1240135 1240855 1241917 1244752 1249595 1255393 1261094 1266376 1271150 1275121 1278090 1280289 1282286 1284765
57619 1284765 1288178 1292282 1296312 1300106 1304750 1311477 1319917 1328044 1333996 1337763 1341092 1345894 1352580 1359944
57605 1359944 1366899 1374037 1382717 1392841 1402769 1411665 1420466 1429862 1438906 1446798 1454679 1464020 1474243
57592 1474243 1483637 1491772 1499201 1505527 1509989 1513752 1519387 1527828 1537567 1547022 1555863 1563931 1571043 1578457
57578 1578457 1588471 1601537 1615411 1628045 1639656 1651055 1661886 1671967 1682596 1694629 1706568
57567 1706568 1716647 1725911 1737061 1750632 1764498 1777118 1789228 1801900 1814760 1827010 1838948
57556 1838948 1851505 1865043 1879423 1894652 1910787 1927608 1944992 1963384 1983363 2004882 2027197
57545 2027197 2049352 2070538 2090302 2108818 2126971 2145998 2166954 2190301 2215585 2241492 2266787
57534 2266787 2291537 2317055 2344333 2372946 2401921 2431227 2461527 2492623 2523211 2552583 2581745
57523 2581745 2612167 2643997 2676282 2708503 2740967 2773826 2806646 2838971 2870482 2900576 2928826
57512 2928826 2956023 2983676 3012057 3039949 3066971 3094787 3124668 3154886 3182389 3206815 3231115
57501 3231115 3257901 3286482 3314053 3338844 3361495 3384074 3408162 3433408 3457623 3478821 3497370
57490 3497370 3515606 3535298 3556157 3576978 3597236 3617106 3636761 3656394 3676458 3697204 3718225
57479 3718225 3738948 3759324 3779750 3800530 3821668 3842837 3863341 3882557 3900686 3918686 3937218
57468 3937218 3956132 3975170 3994506 4014208 4033814 4052963 4071787 4090110 4106954 4121867 4136285
57457 4136285 4152505 4171314 4191544 4211906 4232177 4252301 4271439 4288786 4304898 4321330 4339024
57446 4339024 4357552 4375933 4393639 4410723 4427437 4444155 4461394 4479472 4498096 4516653 4534954
57435 4534954 4553466 4572763 4592959 4613740 4634527 4654527 4673134 4690620 4707918 4725322 4741925
57424 4741925 4757021 4771613 4787637 4805796 4825011 4843948 4862184 4879794 4896794 4913293 4929416
57413 4929416 4944800 4959050 4973053 4988739 5006816 5025628 5043165 5059438 5075762 5092196 5107236
57402 5107236 5120200 5132751 5147295 5164300 5181649 5196640 5208556 5219329 5231568 5245978 5261096
57391 5261096 5275671 5290393 5306589 5323837 5340106 5354197 5366956 5379880 5393525 5407793 5422821
57380 5422821 5438744 5455064 5471120 5487029 5503336 5519646 5534293 5545887 5554956 5563745 5574396 5587424
57368 5587424 5601759 5615973 5629385 5642299 5655417 5668995 5682469 5694988 5706487 5718051 5730919
57357 5730919 5745165 5759630 5773121 5785295 5796351 5806454 5815838 5825099 5834954 5845871 5858120 5871857
57345 5871857 5886719 5901688 5915892 5929462 5943022 5956389 5968406 5978223 5986395 5994428 6003491 6013627
57333 6013627 6023999 6033791 6043122 6053031 6064308 6076393 6087870 6098128 6108019 6118736 6130495 6142582
57321 6142582 6154200 6164944 6174974 6185210 6196850 6210052 6223492 6235949 6247974 6261019 6275156
57310 6275156 6288819 6300962 6312161 6323119 6333445 6342908 6352862 6364891 6378455 6391297 6402230 6412304
57298 6412304 6423028 6434570 6446109 6457126 6467846 6479040 6491558 6505343 6518787 6530115 6539820
57287 6539820 6550662 6564563 6580447 6595935 6610182 6623903 6637477 6650625 6663796 6678455 6695631
57276 6695631 6715017 6735581 6756410 6777046 6797814 6819715 6843140 6866763 6888769 6909185 6929890
57265 6929890 6952105 6975072 6997770 7020846 7045846 7073157 7101599 7129841 7157572 7185375 7213914
57254 7213914 7243268 7272884 7302308 7331997 7363078 7396212 7430947 7466235 7501186 7535449 7569460
57243 7569460 7604453 7641632 7681090 7721988 7763763 7806497 7850075 7893979 7938165 7983090 8028315
57232 8028315 8072177 8113844 8154909 8197801 8243058 8289327 8335745 8382837 8430828 8478320 8523574
57221 8523574 8566554 8608836 8651565 8694072 8734730 8772858 8809513 8846489 8884925 8925013 8966680
57210 8966680 9010054 9055301 9102376 9151014 9200659 9250593 9300551 9351212 9403515 9457525 9512547
57199 9512547 9568400 9625826 9685322 9746128 9806727 9866023 9923968 9981791 10041938 10107139 10178914
57188 10178914 10257161 10341214 10430621 10524721 10622373 10722817 10826293 10933460 11044934 11161918
57178 11161918 11286385 11419651 11561097 11708981 11862112 12020199 12183390 12352521 12529297
57169 12529297 12714889 12908359 13107478 13311179 13520336 13736056 13958297 14186697 14422425
57160 14422425 14669125 14932765 15220756 15539807 15891940 16269870 16654644 17018306 17331647
57151 17331647 17573176 17734378 17819523 17842183 17820682 17772987 17712075 17644597 17573526 17501391 17430790
57140 17430790 17363028 17297544 17232361 17164592 17091651 17013553 16933953 16857822 16787941 16723861 16663199
57129 16663199 16602826 16539683 16472409 16402396 16332287 16263731 16197830 16137334 16086725 16050110 16030577
57118 16030577 16031518 16056734 16108918 16190001 16303873 16457249 16657005 16908366 17217071 17592244
57108 17592244 18045955 18591217 19242439 20018061 20942106 22044056 23358766 24926632 26792663
57099 26792663 29004647 31612133 34666876 38223960 42342472 47084247 52509064 58665925
57091 58665925 65581234 73244101 81590173 90490284 99752524 109139931 118398000 127286755
57083 127286755 135615068 143266021 150189224 156347205 161642432 165880116 168800579 170159288
57075 170159288 169798758 167675186 163847292 158458554 151731915 143970513 135545546 126859745
57067 126859745 118292121 110143512 102604389 95755139 89592448 84065408 79106725 74652667
57059 74652667 70651611 67063403 63853376 60986571 58426339 56136987 54086868 52249349
57051 52249349 50601984 49125303 47801957 46616445 45555301 44607158 43762156 43011242
57043 43011242 42346160 41759748 41245498 40796581 40405633 40065561 39770365 39515469 39297926
57034 39297926 39116330 38969759 38856352 38773222 38717901 38689495 38688445 38715949 38773952 38864727 38989154
57023 38989154 39145011 39327231 39529877 39747604 39975227 40206215 40432123 40643944 40834096
57014 40834096 40996798 41126373 41216267 41261280 41261396 41222762 41154456 41064561 40959155 40843401 40721623
57003 40721623 40595821 40464977 40326686 40179858 40026153 39869291 39713346 39561507 39415738
56994 39415738 39276583 39142731 39011086 38877947 38740483 38597264 38447916 38292710 38131981
56985 38131981 37965063 37789737 37603225 37403671 37190270 36962518 36720603 36466813 36205626
56976 36205626 35941932 35679429 35420458 35166171 34916388 34670097 34426665 34186127 33948198
56967 33948198 33711898 33476458 33241832 33008177 32775947 32546921 32323786 32107738 31897463
56958 31897463 31691358 31489684 31293315 31101335 30911453 30722246 30533247 30343001 30148910
56949 30148910 29949674 29746827 29543202 29340646 29139684 28940626 28744172 28551139 28362088
56940 28362088 28177320 27997060 27821494 27650521 27483682 27320915 27163441 27012914 26868911
56931 26868911 26727772 26584697 26436684 26282676 26121522 25951183 25770108 25578433 25377760
56922 25377760 25170981 24962824 24759595 24567279 24389818 24229175 24086351 23961726 23854669
56913 23854669 23763384 23685212 23616873 23554417 23493152 23427904 23353791 23267216 23166345 23050831 22921323
56902 22921323 22779104 22625609 22461882 22288906 22108841 21925595 21743723 21567034 21398425
56893 21398425 21240213 21093558 20957725 20830737 20710975 20597956 20491879 20392637 20298074 20201592
56883 20201592 20091497 19954478 19781413 19570926 19328711 19064547 18789185 18511722 18238284
56874 18238284 17972989 17719904 17483222 17265488 17066568 16884885 16719270 16569650 16436736
56865 16436736 16321097 16221632 16134633 16055176 15979932 15908017 15838930 15770476 15699090 15621327 15534752
56854 15534752 15438438 15333500 15222663 15108750 14994110 14881627 14774870 14676133 14585089 14500536
56844 14500536 14422896 14353822 14293743 14241230 14194830 14154433 14120599 14093453 14072550 14057080 14045748
56833 14045748 14036670 14027251 14013610 13990430 13952638 13897964 13827547 13743964 13649501 13546820 13440342
56822 13440342 13335607 13236909 13145857 13062230 12985595 12915860 12852780 12795736 12744477 12699918 12663774
56811 12663774 12637110 12619240 12608080 12601237 12596385 12590728 12580716 12562658 12533537 12491350 12435311 12366327
56799 12366327 12287166 12201580 12113030 12024280 11937869 11856120 11780246 11709883 11644185 11583315 11528442
56788 11528442 11480325 11438458 11401667 11369001 11339758 11313224 11288860 11266381 11245082 11223192 11198423
56777 11198423 11169134 11134601 11094281 11047323 10993060 10931881 10865706 10797648 10730743 10666414 10604365
56766 10604365 10544303 10487252 10434365 10384861 10336496 10288391 10242163 10199503 10159589 10119968 10079452
56755 10079452 10039047 10000170 9963094 9927389 9892971 9860014 9828072 9795868 9762195 9727138 9692379
56744 9692379 9659951 9630330 9601824 9572142 9540435 9507452 9474004 9440036 9405326 9370198 9334923
56733 9334923 9298898 9261202 9221849 9181865 9142085 9102443 9062547 9022374 8982132 8941950 8902099
56722 8902099 8863088 8825073 8787514 8750022 8713292 8678470 8645533 8613068 8579896 8546454 8514283
56711 8514283 8484520 8456994 8430302 8402609 8373029 8342537 8312993 8284878 8256567 8226361 8194609
56700 8194609 8163131 8133099 8104344 8076360 8048805 8020990 7991939 7961444 7930496 7900291 7871183
56689 7871183 7842811 7814870 7787443 7760659 7734116 7706663 7677189 7646054 7615447 7587664 7562974
56678 7562974 7539560 7515427 7489934 7463728 7437920 7413349 7390031 7367167 7343903 7319883 7294797
56667 7294797 7268145 7240350 7213474 7189499 7168059 7147110 7125660 7104304 7083140 7061165 7038357
56656 7038357 7016469 6996540 6977149 6956576 6935428 6915387 6896327 6876666 6856137 6836246 6817816
56645 6817816 6799779 6780868 6761155 6741337 6721646 6702168 6683355 6665348 6647371 6628604 6609389
56634 6609389 6590902 6573670 6556922 6539548 6521380 6503235 6485715 6468295 6449840 6429882 6408880
56623 6408880 6387268 6365053 6342761 6321941 6303672 6286842 6268951 6248827 6227720 6207433 6188157
56612 6188157 6168760 6148691 6128642 6109205 6089620 6068560 6046017 6023703 6003190 5984142 5965069
56601 5965069 5945489 5926395 5908517 5891282 5873962 5856803 5840098 5822920 5804006 5783629 5763454
56590 5763454 5744514 5726279 5707729 5688548 5669158 5650468 5633719 5619580 5607012 5593816 5578873
56579 5578873 5563228 5548490 5534815 5521170 5507103 5493380 5480926 5469826 5459412 5448802 5437273
56568 5437273 5424653 5411739 5400093 5390972 5384292 5378672 5372465 5364855 5356271 5348070 5341751 5337981 5336039
56555 5336039 5334258 5331181 5326140 5318738 5308400 5295161 5280581 5266834 5254570 5242266 5228043 5211550
56543 5211550 5193758 5175618 5157561 5139833 5122509 5105233 5087416 5068629 5048657 5027663 5006569
56532 5006569 4986638 4968125 4949977 4931592 4914098 4898795 4884917 4870463 4855017 4840064 4826218
56521 4826218 4811856 4795369 4777393 4759615 4742298 4724391 4705575 4686815 4669005 4652202 4636270
56510 4636270 4621120 4606094 4590178 4573432 4557385 4543256 4530391 4517202 4503169 4488905 4474549
56499 4474549 4459369 4443306 4427682 4413592 4400300 4386209 4370950 4355457 4340272 4324975 4309503
56488 4309503 4294968 4282614 4272541 4263756 4254896 4244716 4232691 4219620 4207081 4195851 4185399 4175026
56476 4175026 4164590 4153698 4141416 4127737 4114471 4103477 4094470 4085522 4075195 4063250 4049966 4036031
56464 4036031 4022761 4011120 4000761 3991085 3982616 3975876 3969383 3960749 3949789 3938578 3928058 3916742
56452 3916742 3903672 3890657 3880021 3871492 3862924 3853128 3842375 3830811 3818181 3804982 3792416 3780978
56440 3780978 3770175 3759706 3749934 3741015 3732422 3723533 3713989 3703412 3691690 3679808 3669532 3661585
56428 3661585 3654595 3646474 3636582 3626023 3616015 3606627 3597252 3587690 3578215 3568778 3558835 3548138 3537230
56415 3537230 3526760 3516653 3506472 3496361 3486982 3478377 3469500 3459208 3447508 3435586 3424746 3415379
56403 3415379 3406840 3398300 3389703 3381645 3374148 3366059 3356212 3344932 3333759 3323914 3315711 3309223 3304500
56390 3304500 3301014 3297779 3294278 3290497 3286024 3280096 3272919 3265849 3259639 3253368 3245837 3237288 3229007 3221898
56376 3221898 3216280 3212390 3209946 3207420 3202768 3195117 3185378 3175307 3166368 3159172 3153385 3148143 3142864 3137501
56362 3137501 3131966 3125851 3119077 3112189 3105508 3098563 3090972 3083306 3076339 3070037 3064151 3059322 3056451 3055165
56348 3055165 3053942 3051795 3049014 3046258 3043827 3041758 3039669 3036443 3031072 3024261 3018347 3015192 3014650 3015290
56334 3015290 3015877 3015795 3014807 3013084 3011136 3009146 3006690 3003493 3000190 2997858 2996977 2997170 2997705 2997854 2996951 2994692
56318 2994692 2991566 2988706 2987067 2986664 2986556 2985519 2982838 2978726 2974172 2970355 2967926 2966664 2965856 2965192 2965182
56303 2965182 2966458 2968850 2971577 2974335 2977611 2981729 2986229 2990516 2994605 2998801 3003217 3008211 3014648 3022768
56289 3022768 3031145 3037837 3042661 3047455 3053995 3062522 3072508 3083858 3096712 3110794 3125686 3141441 3158311
56276 3158311 3176132 3194524 3213605 3233998 3256161 3280104 3305770 3333360 3363212 3395702 3431387
56265 3431387 3471051 3515387 3564633 3618622 3677136 3740240 3808382 3882330 3962918 4050649 4145455
56254 4145455 4247123 4356108 4473735 4601256 4738910 4886318 5043618 5211489 5389916
56245 5389916 5577629 5773057 5974962 6181385 6388705 6592965 6791965 6984788 7168897
56236 7168897 7338832 7488528 7614264 7714551 7787836 7831726 7844700 7827473 7781969 7709588
56226 7709588 7611337 7489347 7347307 7189214 7018356 6837706 6650499 6459838 6268217 6077911
56216 6077911 5891291 5710052 5534695 5365756 5205160 5055094 4915463 4783799 4658111
56207 4658111 4538783 4427154 4323387 4226643 4136513 4053154 3976462 3905958 3841225 3781649 3726148
56196 3726148 3673949 3625324 3580718 3539410 3500039 3462362 3427490 3396280 3368299 3342669 3319301
56185 3319301 3298851 3281740 3267393 3254290 3240948 3227153 3214059 3202763 3193104 3184337 3176443 3169895
56173 3169895 3164388 3158941 3153390 3148825 3146094 3144662 3143431 3142156 3141513 3142264 3144911 3149899 3157481 3167342
56159 3167342 3178765 3191363 3205433 3221435 3239255 3258246 3278077 3299238 3322481 3348176 3376872
56148 3376872 3410255 3450326 3497017 3547473 3598771 3651151 3707864 3772087 3844823 3925625 4014171
56137 4014171 4110469 4214062 4323746 4438091 4555777 4675153 4793598 4907836 5015273 5114888
56127 5114888 5206517 5289681 5363850 5429569 5488093 5539592 5582697 5616124 5639650 5653048 5655390
56116 5655390 5646508 5628119 5602310 5569484 5528710 5479255 5420581 5351731 5272387 5184412 5091224
56105 5091224 4996024 4901678 4811558 4728651 4653882 4586684 4527160 4476135 4433169 4396213 4363749
56094 4363749 4336031 4313839 4297090 4284945 4276211 4269451 4263922 4260823 4262474 4269708 4280826 4293410
56082 4293410 4306341 4319883 4334825 4351965 4371638 4393339 4416303 4440510 4466522 4494623 4524900
56071 4524900 4557800 4593562 4631404 4670445 4711071 4754073 4798839 4844090 4890132 4938492 4989363
56060 4989363 5041503 5094863 5151032 5210398 5271086 5331713 5393187 5456508 5520747 5584875 5650088
56049 5650088 5718436 5790074 5863573 5938369 6015404 6095658 6179264 6266037 6356061 6449711 6547417
56038 6547417 6649131 6754113 6861968 6973808 7091327 7214611 7342105 7472948 7607942
56029 7607942 7748002 7893338 8044899 8204886 8374596 8552798 8737154 8926333 9120246
56020 9120246 9319580 9525996 9741497 9966591 10199987 10440762 10689736 10948136 11216329
56011 11216329 11494712 11784562 12087026 12402311 12730666 13073204 13431270 13806145 14199841
56002 14199841 14614849 15052778 15514667 16002772 16520191 17068344 17646883 18256628 18900648
55993 18900648 19582070 20303280 21067883 21880853 22745749 23664204 24638926 25674545 26774854
55984 26774854 27942667 29183868 30508525 31926600 33445886 35075823 36829964 38723118
55976 38723118 40770249 42990943 45411774 48062337 50973429 54182496 57737554 61693697
55968 61693697 66111281 71062441 76635188 82924321 90016534 97982479 106876488 116740722
55960 116740722 127616049 139556313 152636148 166958115 182677442 200034053 219348080
55953 219348080 240960682 265153690 292071029 321616350 353326382 386299805 419241469
55946 419241469 450550179 478349386 500531646 515014237 520234804 515619025 501715257
55939 501715257 479967900 452345053 421003702 388017575 355148219 323694651 294459863
55932 294459863 267811218 243785763 222214723 202847105 185436376 169770585 155668598
55925 155668598 142974215 131552435 121280241 112038737 103716143 96214423 89448563
55918 89448563 83342106 77826493 72841107 68329514 64237346 60516033 57125422 54029901
55910 54029901 51194645 48588065 46184656 43962420 41900025 39979163 38186892 36512595
55902 36512595 34944728 33473048 32091393 30795001 29576692 28428331 27344437 26321819
55894 26321819 25357032 24446455 23587344 22776413 22008503 21278709 20584843 19926095 19300537
55885 19300537 18705462 18138744 17598159 17080939 16585831 16114111 15666474 15239968 14829822
55876 14829822 14433210 14049550 13678274 13318196 12968210 12626933 12292540 11964381 11643843
55867 11643843 11332143 11028349 10731178 10441672 10162321 9894289 9637037 9389873 9152290
55858 9152290 8923465 8703018 8491696 8289967 8096621 7910126 7730598 7558900 7394347
55849 7394347 7234842 7079005 6926875 6778860 6635173 6495948 6360878 6229084 6100217
55840 6100217 5975202 5855105 5739965 5629487 5523896 5423028 5325501 5230026 5136823 5046680
55830 5046680 4959520 4875064 4793895 4716320 4641034 4566580 4493576 4423816 4357553 4293184 4229389
55819 4229389 4166020 4103118 4040696 3979654 3921570 3867140 3815564 3765501 3716000 3666872 3619091
55808 3619091 3574500 3534155 3497126 3461751 3427662 3395680 3366236 3339046 3313922 3290726 3268711
55797 3268711 3247029 3225659 3204791 3183566 3160603 3135579 3109137 3081414 3051934 3020996 2989980
55786 2989980 2959995 2931033 2902456 2873485 2843380 2812130 2781058 2751786 2724422 2697433 2669302
55775 2669302 2639710 2609357 2579561 2551932 2527532 2506177 2487110 2470106 2455260 2442015 2429303
55764 2429303 2416435 2402947 2387809 2369838 2348848 2325566 2300542 2273920 2246055 2217457 2188374
55753 2188374 2159261 2131233 2104983 2079665 2054146 2029017 2005793 1984285 1962528 1939623 1917025
55742 1917025 1896330 1877262 1858731 1840751 1824245 1809566 1796042 1782667 1768824 1754675 1741061
55731 1741061 1728499 1716238 1702961 1688453 1673735 1659458 1645156 1630322 1615263 1600527 1586465
55720 1586465 1573661 1562693 1552917 1542688 1531568 1521334 1513734 1508156 1502712 1497023 1492482 1489803 1487711
55707 1487711 1484463 1479740 1474400 1469021 1463416 1457416 1451261 1444957 1437786 1429119 1419494 1410159 1401496 1392682
55693 1392682 1383127 1373264 1363348 1352573 1340595 1329151 1320633 1315301 1311353 1307648 1304812 1303448 1302949
55680 1302949 1302713 1303052 1303964 1304170 1302544 1299627 1296665 1293774 1290135 1285539 1280664 1276006 1271434 1266667 1261467
55665 1261467 1255496 1248736 1242077 1236814 1233422 1231069 1228334 1224284 1219154 1214324 1211345 1210594 1211084 1211720 1212245
55650 1212245 1212565 1211828 1209065 1204572 1199928 1196514 1194317 1192048 1188060 1181461 1172892 1164075 1156085 1148196
55636 1148196 1138905 1127799 1115857 1104163 1093224 1083437 1075148 1067858 1060298 1051867 1043392 1035950 1029581
55623 1029581 1023864 1019086 1015719 1013011 1009265 1003751 997317 990740 983408 974391 964102 954045 945381
55610 945381 938459 933350 929752 926493 922130 916208 909313 902032 894752 888328 883609 880055 876073 871224
55596 871224 866809 863621 860480 856127 851327 847597 844653 840794 835451 829839 825154 821564 818953 817359
55582 817359 816384 815198 813331 810748 807351 803420 800308 799337 799997 800531 800368 800574 801695 802740 802908 802943
55566 802943 803887 805485 806589 806449 805186 803714 803296 804060 803912 800515 794669 789752 787071 783940 777911
55551 777911 770830 766442 765354 765009 763898 762988 762937 762559 760951 759123 758271 757664 755465 751106 746152 743189
55535 743189 744037 748281 753139 755411 754070 750636 747107 744257 742000 740263 738844 737112 734509 731008
55521 731008 726744 721736 716412 711783 708481 705977 703337 700397 697508 694402 690197 684732 679187 674862
55507 674862 671593 667943 663013 657621 653289 650284 647247 643032 638420 635415 634989 636061 636790 636290 634873
55492 634873 633193 631703 630730 630372 630178 629262 626996 623468 619217 614810 610824 607932 606584 606623 607426 608281
55476 608281 608396 606899 603638 600066 598523 599993 602954 604851 604407 602216 599644 597780 596925 596256 594333
55461 594333 590781 587242 585750 586316 587065 586644 585334 583774 581962 580059 578999 579435 580698 581461 581010 579489
55445 579489 577464 575543 573836 571575 568024 563880 560808 559273 558030 556205 554518 553612 552532 550151
55431 550151 547083 544844 543845 543482 543471 543675 543247 541498 539223 537699 536742 535314 533737 533448 534473 535061
55415 535061 534388 533936 535303 537965 540255 541559 542412 542957 542450 540280 536813 533071 529777 526782 523525
55400 523525 520099 517424 515992 514939 513133 510795 509129 508550 508310 507836 507295 506745 505812 504514 503458 502865
55384 502865 502219 501182 500038 499022 498071 497412 497420 497607 496860 495122 493705 493364 493112 491684 489161 486339 483446
55367 483446 480501 478093 476666 475522 473635 471134 469021 467718 466767 465805 465013 464755 465416 467319 470079
55352 470079 472309 472761 471649 470220 469207 468391 467454 466468 465651 465230 465399 465836 465670 464623 463665 463490 462868
55335 462868 460063 455751 452713 452195 452358 451264 449738 449731 451138 452237 452604 453321 454355 454044 451942 450103
55319 450103 450098 450394 448623 445472 444002 445282 446983 446875 445729 445558 446405 446469 444629 441412 437801 434419
55303 434419 431801 430267 429321 428038 426254 424809 424546 425638 427743 430128 431693 431740 430822 430196 430338 430613
55287 430613 430372 429643 428704 427792 427315 427543 427956 427679 426675 425698 424984 424041 422949 422728 423938 425858 427535
55270 427535 428604 428613 426757 423235 419824 417990 417159 415986 414602 414314 415467 416990 417935 418319 418358 417886 416773
55253 416773 415169 413249 411349 410335 410974 412741 413925 413202 410755 407888 406055 406167 408013 410090 410650
55238 410650 409375 407671 407032 407420 407522 406328 404176 402388 402158 403714 406318 408964 411072 412682 414092
55223 414092 415335 415920 415233 413422 411709 411425 412677 414340 415288 415133 413819 411315 408062 405068 403126
55208 403126 402439 403216 405776 409378 411680 410437 405725 399864 395261 392721 391585 390930 390622 391418 393880
55193 393880 397201 399709 400666 400682 400048 397909 394012 390045 387765 386503 384214 380754 378412 378939 381544
55178 381544 384287 386190 387334 387913 388073 388154 388399 388682 388877 389209 389977 391121 392218 392684 392065 390452 388570
55161 388570 387145 386390 386445 387815 390597 393516 394655 393246 390130 386568 383329 380820 379201 378223 377645
55146 377645 377823 379106 380745 381394 380798 380033 379839 379647 378626 376912 375372 374803 375632 377701 380060 381519
55130 381519 381749 381372 380994 380747 380682 380760 380514 379639 378872 379156 379964 379789 378535 377911 378947 380560 381264 380860
55112 380860 379570 376943 372954 369142 367278 367530 368949 370970 373376 375628 377478 379527 381990 383716
55098 383716 383738 383012 383008 383203 381753 378429 375081 373126 372283 372096 373000 375156 377506 378889 379310 379534 380045
55081 380045 380871 381826 382501 382460 381744 380728 379462 377695 375563 373578 371954 370705 370357 371578 373847 375477
55065 375477 375380 374107 372804 371979 371673 372029 372984 373909 374174 373843 373571 374062 375641 377724 378766 377648 375315
55048 375315 373984 374289 374352 372454 369524 367843 368028 368658 368507 367745 366880 365807 364296 362575 360977 359527
55032 359527 358207 357204 356656 356531 356881 357806 359057 360106 360766 361285 361618 361173 359749 358331 358279 359737 361387
55015 361387 362017 361883 362128 362980 363121 361261 358017 355636 355591 356888 357225 355663 353576 352833 353564 354267 353895
54998 353895 353165 353479 354982 356357 356508 355843 355561 356142 357183 358482 360511 363584 367096 369945 371430 371517
54982 371517 370666 369753 369753 370848 371908 371451 369224 366444 364384 363170 362190 361180 360376 359804 359037 357864 356796
54965 356796 356584 357400 358837 360669 363198 366564 369992 372163 372396 371262 370024 369738 370911 373520 376867
54950 376867 379566 380307 379042 377218 376535 377331 378285 377682 374939 371003 367554 365977 366843 369877 374139 378476
54934 378476 382168 385290 388333 391511 394542 397068 399048 400673 402127 403616 405501 408099 411359 414877
54920 414877 418438 422507 428017 435441 444032 452208 458877 464259 469245 474161 478513 481763 483718 484005
54906 484005 481830 476795 469729 462228 455428 449515 444112 438748 433042 426880 420418 413688 406577 399617
54892 399617 394308 391653 390612 389243 387611 388122 392154 397602 401059 401675 401422 402112 403890 406598 410657
54877 410657 415945 421312 426162 431293 437174 442583 446299 449224 453174 458028 461720 462971 462436 460875
54863 460875 457877 453115 447608 442674 438329 433537 427520 420102 411464 402464 394792 389748 386753 383793
54849 383793 379488 374317 369712 366386 363696 360501 356483 352551 349815 348328 347289 346399 346216 346883 347402
54834 347402 346891 345917 345651 346134 346407 346143 346033 346456 346835 346585 345789 344511 342414 339810 338351 339561 342762
54817 342762 345386 345547 343721 341655 340289 339381 338685 338424 338290 337037 334158 331485 331796 335520 340025 342767
54801 342767 344032 345596 347674 348781 348185 346901 346091 345880 346071 346761 347701 348199 348371 349465 352106 355041
54785 355041 356544 356303 355079 353359 351595 351141 353312 357541 361841 365349 369146 374181 379609 383998 387345
54770 387345 390937 395599 400970 406399 411874 417916 424849 432339 439581 446014 451823 457485 462856 467193
54756 467193 470277 472917 475811 478221 478308 474722 467532 457944 447742 438724 431783 426274 420902 415433
54742 415433 410943 408066 405773 402503 397954 392996 388218 383544 379181 375942 374319 373984 374481 375713 377399
54727 377399 378870 380110 382335 386726 392972 399958 407457 415944 424741 431803 436015 438714 442101 446730
54713 446730 451470 455376 458465 460694 461309 459670 455971 450696 443948 435923 427684 420664 415384 411166
54699 411166 407195 403334 399728 396125 392089 387660 383406 379880 377316 375648 374400 372689 369944 366722
54685 366722 364211 362745 361397 359391 357247 355837 354803 352895 349779 346573 344314 342653 340613 338101
54671 338101 335967 334697 333660 331917 329459 327300 326258 325901 324966 322791 319922 317210 314883 312899 311783
54656 311783 312399 315025 319166 324035 328569 331297 331261 329222 327004 325438 323844 321792 320134 319587 319311
54641 319311 317958 315491 312958 311037 309871 309859 311278 313259 314451 314848 315803 317962 320248 321349 321208
54626 321208 320573 320036 320161 321616 324273 326842 328383 329644 331850 334605 336212 336045 335286 334993 334657 333376
54610 333376 331534 330263 329741 329070 327791 326566 326152 326342 326280 325334 323430 321033 319178 319018 320729 323096
54594 323096 324708 325424 326136 327291 328358 328761 328549 327873 326640 325170 324537 325389 326747 326806 324882 321949
54578 321949 319339 317705 317271 318139 319793 321029 321193 321194 322510 325262 327958 329334 329889 331162 333766 336553
54562 336553 337728 336560 333881 331062 328728 326679 324956 324430 325837 328391 330080 329606 327525 325176 323149
54547 323149 321603 321500 324085 328790 332868 334056 332982 332097 332689 333856 334146 333121 331324 329813 329975
54532 329975 332681 337019 340639 342089 342264 342935 344455 345835 346622 347541 349165 350846 351437 350552 348778 346914
54516 346914 345279 343621 341481 338640 335216 331450 327692 324679 323335 323893 325510 327218 328954 331132
54502 331132 333470 335035 335352 334697 333316 331238 329145 328391 329415 330712 330169 327279 323521 320821 320196
54487 320196 321642 324543 327994 331149 333471 334608 334303 332846 331327 330702 330551 329539 327394 325665 325894
54472 325894 327669 329367 330562 332504 335994 339856 342211 342604 342063 341541 341360 342073 344603 348936 353354
54457 353354 355720 355357 353386 351521 350757 350774 350164 347616 343423 339522 337605 337441 337588 337300 336891 336433 335320
54440 335320 333479 331998 331820 332349 332153 330766 329089 328022 327407 326568 325447 324699 324744 325126 325106 324817 325506
54423 325506 328440 333590 339523 344467 347360 348090 347195 345512 343891 342938 342903 343787 345509 347891 350465 352404
54407 352404 352945 352156 351040 350455 350032 348828 347050 346190 347046 348541 349362 349989 351962 355563 359525 362825
54391 362825 365396 367000 366899 365246 363573 363097 363458 363856 364456 365695 366933 367006 365768 364101 362656 361496
54375 361496 360780 360845 361590 362550 363557 364613 365249 364970 364397 364997 367231 369729 370782 370176 369130 368791 369193
54358 369193 369427 368522 366447 364432 363968 365219 366789 367291 366771 366238 366260 366681 367407 368646 370263 371626 372465
54341 372465 373417 375293 378177 381659 385620 390061 394291 397135 398251 398646 399546 401303 403898 407746 413101
54326 413101 419073 424422 429249 434656 440360 443977 443549 439957 435762 432261 428848 424941 421121 418049
54312 418049 415374 412334 408777 404927 400616 395513 390009 385189 381725 379162 376541 373459 370212 367140
54298 367140 364404 362449 361982 362946 363943 363489 361653 359683 358087 356225 354010 352754 353471 355275 356598
54283 356598 357351 358662 360728 362336 362667 362489 363072 364527 365658 365167 362967 360649 360444 363065 366702 368845
54267 368845 369009 368869 369792 371392 372754 373914 375383 376874 377301 375811 372530 368654 365937 365498 366878
54252 366878 368826 370967 373736 376617 377921 377143 376208 377098 379104 379925 378916 377598 377119 376911 376267 375749
54236 375749 376184 377197 377668 377095 375795 374126 372312 370927 370856 372463 375033 377286 378495 379009 379624 380526
54220 380526 381182 381233 381030 380962 380738 379891 378711 378041 378169 378480 378147 376693 373955 370161 366137 362839 360492
54203 360492 358649 357107 356145 355689 355021 353768 352655 352770 354440 357314 361034 365180 368804 370867 371327
54188 371327 371275 371691 372368 372378 371427 370377 370291 371230 372275 372625 372276 371639 371106 371221 372555 374716 376018 375133
54170 375133 372891 371358 371176 371057 370065 368974 368610 368136 366228 363116 360238 358444 357811 358749 361684 365603
54154 365603 368362 368896 368142 367554 367645 368254 369139 369759 369409 368177 366965 366073 364775 362904 361766 362356 363515
54137 363515 363233 361306 359401 358748 359119 360056 361613 363645 365620 367719 370861 374902 377873 378113 376510
54122 376510 375498 376190 377540 378208 378058 377595 376887 375721 374355 373558 373998 375795 378463 381131 383085 384386
54106 384386 385727 387416 388691 388544 387163 385995 386134 387057 387510 387365 387829 389587 391529 392025 391099 390399
54090 390399 391001 392159 392592 392224 391901 392002 392279 392892 394487 396940 398921 399407 399101 399627 401477 403461 404216
54073 404216 403539 401976 399819 397346 395784 396964 401394 407159 411462 413237 413743 414626 416082 417128 417076
54058 417076 416208 415378 415477 417038 419867 423166 426429 430006 434280 438661 442319 445863 451122 458695 466631
54043 466631 472504 476379 480682 487160 494933 501963 507718 513673 521392 530869 541002 551189 561721
54030 561721 572652 583205 592952 603065 615273 629526 643648 655740 666060 676037 686356 696987
54018 696987 708381 721244 735302 749456 763169 776437 788193 796099 798624 796292 790156 780109
54006 780109 765721 747859 728192 707616 686497 666146 648407 633588 620195 607148 594939
53995 594939 584002 573351 562111 551508 543796 539472 536853 534441 532356 530937 529125 525357 519757
53982 519757 514458 511426 510429 509430 506780 502664 498422 494965 492287 490212 488849 488101 487350 486135 484752
53967 484752 483674 482759 481581 480250 479211 478530 478087 478251 479418 480945 481674 481736 482715 485585 489584 493869
53951 493869 499013 505615 512251 516509 517955 518612 520325 523011 526013 529827 535454 542713 550270 557158
53937 557158 563445 569495 575301 580813 586424 592769 600125 608112 615917 622662 627701 630809 632363 633311
53923 633311 634728 637226 640932 646045 653015 661785 671202 679757 687000 693825 701413 710311 720470 731466
53909 731466 742404 752127 760067 766676 772688 778126 782356 785033 786687 788310 790368 792248 792764 791397
53895 791397 788841 786048 782991 778942 773966 769310 765998 763646 761064 757435 752317 744998 734817 722307
53881 722307 709382 698050 689039 681651 674748 667786 661118 655438 651115 648101 646201 644974 643495 640977
53867 640977 637979 636394 637710 641614 646717 652248 658449 665595 673420 681598 690269 699874 710806 723441
53853 723441 738299 755830 775768 796717 816758 834668 850003 861411 865732 860367 846571 828715
53841 828715 809746 789039 765543 740987 718078 697031 676290 655986 638090 623330 610496
53830 610496 599170 590570 584748 579250 572071 564293 558229 554312 551401 548984 547253 545734 543642 541368
53816 541368 540090 539978 539981 539355 538318 537298 536627 536919 538697 541489 544233 546726 549889 554515 560369 566602
53800 566602 572395 577257 581352 585656 591274 598574 607198 616463 625244 632182 636999 641149 646014 650822
53786 650822 653648 654217 654227 654856 655630 656051 656599 657245 656443 652811 646917 640459 634512 629396 625231 621387
53770 621387 616241 608934 600920 594445 589761 585188 579759 574366 570006 566275 562304 558288 555306 554050
53756 554050 554274 555097 555395 554251 551538 548080 544960 542755 541516 541104 541144 540822 539260 536366 533084 530538
53740 530538 529018 528016 527186 526783 526987 527244 526801 525669 524453 523377 522211 521177 521027 521830 522548 522584 523097
53723 523097 525815 530711 535773 539245 541425 544014 548163 553515 558916 563643 567703 571208 573993 576263
53709 576263 579095 583298 587792 590257 589848 588365 588131 589776 592929 597848 604804 612568 619333 625056 631212
53694 631212 638157 644455 649190 653306 657839 662246 665487 667650 669435 670936 672031 673213 674928 676653
53680 676653 677599 677864 677960 677801 677264 677046 677667 678100 676979 675033 674607 676488 678807 679609 679022 677998 676301
53663 676301 673156 669129 665858 664042 662821 661154 658856 656286 653934 652650 653414 656281 659919 662630
53649 662630 663669 663399 662641 662361 663621 666963 671647 676019 679033 681098 683154 685297 686897 687891 689303
53634 689303 692180 696506 701445 706330 711035 715591 719924 724035 728185 732758 737869 742975 746959 749127
53620 749127 750366 752844 758034 765207 772346 778234 783119 787651 792153 797060 803101 810431 818159 825306
53606 825306 831899 838557 845288 851309 856049 859851 863593 867924 872903 878122 883109 887817 892721 898166
53592 898166 903585 907628 909235 908488 906374 903981 902083 901163 901276 901674 901028 898593 895189 892619 891861 892064
53576 892064 891602 889845 887548 885662 884339 883304 882677 882935 884066 885196 885327 884494 884069 885681 889677 894707
53560 894707 899020 902178 905363 910059 916660 924386 932252 939882 947508 955356 963148 970172 975797 979857
53546 979857 982646 984774 987061 990195 994225 998626 1003068 1007785 1012848 1017662 1021949 1026920 1034502 1045381
53532 1045381 1058647 1073496 1090153 1108668 1127771 1145927 1163161 1181159 1201724 1225466 1251465
53521 1251465 1277735 1302626 1326509 1351681 1379969 1410867 1442787 1475464 1509925 1546402 1583836
53510 1583836 1621694 1660946 1702615 1746410 1791523 1837870 1885611 1933931 1981278 2026704 2070352
53499 2070352 2112805 2154584 2196171 2237829 2279205 2319463 2357972 2394751 2430341 2465553 2501214
53488 2501214 2537762 2574928 2612060 2648770 2685017 2720495 2754268 2785392 2813886 2840827 2867260
53477 2867260 2893058 2917102 2938519 2957366 2973866 2987525 2997636 3004489 3009253 3012533 3013688 3011876
53465 3011876 3007074 2999645 2989531 2976557 2961000 2943079 2922223 2897917 2871197 2844311 2818538 2793109
53453 2793109 2766685 2739152 2711343 2683609 2655570 2627180 2599112 2571843 2544910 2517529 2489792
53442 2489792 2462927 2438442 2417194 2399205 2384180 2372004 2362732 2356204 2351823 2348833 2346827 2345929 2346528
53429 2346528 2348956 2353416 2360014 2368778 2379714 2392939 2408624 2426735 2447070 2469756 2495541 2525135
53417 2525135 2558187 2593322 2629422 2666695 2706357 2749608 2797108 2848993 2904731 2963079 3022752
53406 3022752 3083370 3145532 3209990 3277157 3347374 3421084 3498420 3578912 3661913 3747107 3834493
53395 3834493 3924124 4015918 4109437 4203700 4297626 4390860 4483671 4575828 4666087 4753284 4837512
53384 4837512 4919695 5000272 5078780 5154345 5225902 5292256 5352750 5407789 5457904 5502342 5539382
53373 5539382 5568079 5588758 5601619 5605971 5601474 5589214 5570515 5545141 5511613 5469198 5418821 5362038
53361 5362038 5299732 5231959 5158596 5079985 4997233 4912007 4825885 4739822 4654162 4568846 4483576
53350 4483576 4398280 4313724 4231230 4151367 4073478 3997044 3922851 3851867 3783468 3716024 3649159
53339 3649159 3584081 3521469 3460462 3400419 3342493 3288433 3238646 3192498 3149803 3110711 3074441
53328 3074441 3039554 3005670 2973816 2944657 2917317 2890466 2863894 2838363 2814281 2791190 2768495
53317 2768495 2746173 2724760 2704892 2687019 2671481 2658710 2649148 2642801 2639025 2637022 2636531 2637882 2641484
53304 2641484 2647555 2656159 2667111 2679881 2694170 2710613 2730346 2753655 2779545 2806924 2835698 2866239
53292 2866239 2898252 2930883 2963810 2997595 3032725 3068702 3104285 3138474 3171076 3202312 3232021
53281 3232021 3259381 3283503 3304137 3321432 3335105 3344371 3348860 3349088 3345584 3337961 3325524 3308631
53269 3308631 3288761 3266966 3242687 3214408 3181354 3144361 3105190 3065108 3024092 2981189 2935566
53258 2935566 2887244 2837134 2786602 2736823 2688085 2639556 2590125 2539665 2489210 2439837 2391729
53247 2391729 2344576 2298375 2253350 2209470 2166516 2124417 2083023 2041772 2000086 1958012 1916081
53236 1916081 1874866 1835138 1798084 1764485 1733718 1704294 1675399 1647252 1620041 1593457 1567420
53225 1567420 1542385 1518557 1495566 1473238 1451762 1430640 1408403 1384264 1359261 1334841 1310951
53214 1310951 1286779 1262869 1240877 1221017 1201282 1180013 1158126 1137757 1119328 1101239 1082324
53203 1082324 1063424 1046123 1030730 1016142 1001267 985963 970761 956188 942388 928981 915297
53192 915297 901094 887008 873898 861815 850136 838714 828122 818547 809315 800045 791453 784242
53180 784242 777844 771238 764529 758671 754011 750248 747520 746037 744677 741616 736804 732258 729192 726364
53166 726364 722298 717664 713941 710799 706675 701515 697117 694701 693653 692881 692095 691281 690007 687920 685299
53151 685299 682701 680570 679328 679104 679102 677968 675130 671267 667263 663477 660367 658864 659250 660124 659388 656267
53135 656267 651856 647801 645036 643744 643838 644956 646214 646529 645516 643931 642982 643192 644115 645001 645269 644331
53119 644331 641870 638825 637298 638456 640863 641912 640819 639177 638493 638358 637493 635559 633242 631185 629558
53104 629558 628292 627120 625641 623714 621472 618757 615068 610451 605843 601974 598514 594975 591977 590614
53090 590614 590743 590897 590090 588936 588526 588796 588635 587526 586485 586951 588927 590722 590812 589563 588575 588552 588637 587950
53072 587950 586854 586212 586125 586122 586092 586220 586309 585929 585170 584543 584169 583717 583169 583036 583586 584368 584808 585040 585967 588509
53052 588509 592654 597088 600005 600704 600317 600661 602511 605277 608048 610307 611719 611939 610864 608740 606009
53037 606009 603349 601674 601390 601659 601117 599509 597874 596842 595568 592965 589306 585714 582463 578882 574986
53022 574986 572122 571364 571901 571844 570515 569250 569758 572223 575288 577426 577917 576960 575665 575839 578720 583489
53006 583489 587727 589911 590854 592059 593338 593138 591003 588478 587309 587599 588124 587843 586699 585484 585310 586779
52990 586779 589256 591312 592130 592106 591967 591979 592380 593812 596540 599677 602108 604003 606568 610241 613922 616257
52974 616257 617154 617651 618689 620388 622333 624150 625741 627213 628775 630676 632977 635219 636512 636356 635361
52959 635361 634661 634485 633772 631552 628284 625470 624304 625067 627338 630159 632300 633153 633268 633309 632695 630208
52943 630208 625980 621835 619292 618127 617396 616846 616447 615350 612671 609156 606883 607006 608594 609910 610128
52928 610128 609441 608186 606483 604462 602310 600181 598312 597037 596398 595992 595499 595134 595233 595605 595827 596054 596972
52911 596972 598795 600742 601706 601131 599174 596562 594565 594465 596265 598118 597827 595102 591851 590083 589964
52896 589964 590108 589220 587084 584411 582311 581676 582537 584002 585176 586001 586836 587415 586918 585089 582696 580633
52880 580633 579161 578288 578328 579576 581645 583574 584518 584282 583582 583930 586582 590980 594735 595934 595242 594941
52864 594941 596166 598078 599673 601155 602996 604697 605442 605457 605773 606892 608436 609990 611409 612125 610937
52849 610937 607161 601787 596905 593736 591436 588221 583692 579572 577701 577669 577245 575117 572181 569735 567522
52834 567522 564624 561632 560508 562118 564991 566833 566578 564688 562386 561215 562590 566632 571348 573757
52820 573757 572430 568940 566494 566994 569392 571033 570492 568787 567806 568108 568693 568472 567317 565895 565184 566100
52804 566100 568852 572562 576037 578911 581458 583446 584138 583537 582466 580955 577649 571731 564701 559251 556678
52789 556678 556143 555983 554943 552471 548903 545419 543093 541931 541363 541477 542948 545798 548969 551281 552286
52774 552286 552192 551643 551632 552874 554957 556569 556674 555095 552205 548855 546606 546884 549445 552393 554139 554637
52758 554637 554464 553826 553298 554427 558196 563287 567157 568772 569136 569209 568690 567246 565715 565284 566295 568578
52742 568578 572153 576571 580142 581060 579284 576478 574107 572561 572028 572943 575088 577398 579397 581909 585423
52727 585423 588680 590170 590454 591484 593775 595891 596924 597787 599301 600575 600505 599765 599770 600318 599913 598203 596529
52710 596529 595754 594989 593157 590797 589437 589605 590261 590113 589045 588183 588638 590235 591617 591707 590736 589444 587788
52693 587788 585337 582723 581535 582363 583883 584461 583941 583199 582671 582354 582928 585623 590575 596036 599777 601091
52677 601091 601154 601654 603379 605990 608628 610446 610859 609847 608139 606781 606251 606164 605907 605284 604482 603869 604021
52660 604021 605279 606926 607615 607344 608207 611923 617108 620484 620812 620143 620892 623179 625644 627431 628333 628074
52644 628074 626766 625423 624905 624696 623686 621777 619849 618535 617987 618449 619996 621831 622851 622971 623124 623974
52628 623974 625410 627228 629466 631952 634240 636146 637865 639621 641685 644358 647113 648061 645429 639637
52614 639637 632990 627289 622794 619483 617782 617446 617079 615804 614560 614819 616652 618968 620988 622466 622990
52599 622990 622223 620725 619505 618771 618010 617230 617138 617972 619045 619745 620221 620722 621061 621312 622349 624914 628507
52582 628507 631938 634805 637636 640547 642711 643677 644593 647240 651867 656555 659005 658488 655868 652262 648330
52567 648330 644705 642163 640944 640344 639521 638486 637844 637730 637655 637449 637684 638752 639989 640262 639249 637645
52551 637645 636267 635436 635118 634948 634082 631897 629242 628131 629422 631439 631907 630819 630087 630406 630079 627554
52535 627554 623793 620950 619673 619114 619125 620700 624010 627510 629824 631492 633908 637165 640092 642174 644227
52520 644227 646781 648733 648462 645981 643233 642154 643075 645214 647979 651177 654394 657188 659918 663409 667465
52505 667465 670564 671634 671436 671420 671777 671681 671090 670957 671448 671213 669209 666456 664985 665320 665852 664774 662032
52488 662032 659111 657327 656707 656424 655902 655329 655158 655406 655545 654980 653620 652141 651677 652932 655386 657562
52472 657562 658415 658417 659079 661543 665779 670956 676252 681334 686212 690679 694075 695989 697175 699099 702296
52457 702296 705742 708114 708912 707892 704575 699441 694723 692378 691632 690104 687209 684672 683417 681925 678557
52442 678557 673945 669850 666825 664237 661734 659408 657158 655083 654018 654576 656127 657787 659858 662949
52428 662949 666043 667020 665298 662663 661126 661035 661641 662483 663499 664504 665295 665978 666894 668489 671442 676430
52412 676430 683383 691269 698913 705926 712697 719634 726596 733102 739270 746459 756343 768879 781704 792203
52398 792203 799855 805846 810837 814181 815122 813608 809879 804379 798198 792462 786962 780602 773637 768135
52384 768135 765419 764253 762650 760422 758687 757656 756546 755378 755287 756848 759264 761534 763551 765781 768753
52369 768753 773161 779648 788003 796994 805320 812447 818475 823698 828353 832267 834724 835334 835052 835534 837264
52354 837264 839162 840394 841617 843773 846457 848438 849364 850184 852129 856028 862278 870558 879539 887706 894691
52339 894691 901297 908276 915721 923699 932739 943366 955712 969862 986070 1004178 1023171 1041788
52327 1041788 1059656 1077790 1098059 1121950 1149350 1178441 1207309 1235834 1265471 1296999 1329105
52316 1329105 1359758 1388536 1416938 1446540 1477415 1508383 1538387 1567545 1597066 1628180 1661074
52305 1661074 1694980 1729220 1763649 1797888 1830840 1861617 1890536 1918345 1944759 1968691 1989989
52294 1989989 2009936 2029634 2048578 2065319 2078947 2089344 2096530 2100544 2101881 2101292 2099018 2094854 2089244
52281 2089244 2083799 2080065 2077885 2075661 2072473 2069329 2067741 2067594 2067419 2066864 2067816 2072435 2080793 2091163 2102119
52266 2102119 2113491 2125660 2138946 2153785 2170662 2189667 2210551 2233143 2257204 2282056 2307097
52255 2307097 2332495 2358501 2384161 2407743 2428586 2447477 2465049 2480977 2495193 2508524 2521243
52244 2521243 2532029 2539457 2543898 2546886 2549060 2549629 2547393 2541445 2531318 2517570 2502035 2486592 2471717
52231 2471717 2456817 2441584 2426108 2410067 2393067 2375873 2360144 2346622 2334298 2321603 2307759
52220 2307759 2292954 2278061 2264465 2253391 2244920 2238205 2232860 2229541 2228784 2229839 2231185 2231942 2232501 2234047
52206 2234047 2237585 2243113 2249571 2255887 2262092 2268973 2276619 2283951 2290026 2295237 2300752 2307089 2313747 2320031
52192 2320031 2325695 2330753 2335203 2339441 2344699 2352308 2361972 2371236 2377556 2380830 2382905 2384474 2383837 2379471
52178 2379471 2372504 2365185 2357779 2348833 2338179 2327757 2319128 2311790 2304598 2297570 2291541 2287024 2284049
52165 2284049 2282324 2281075 2279609 2278561 2279657 2283676 2289415 2295088 2299876 2303700 2306585 2308891 2311180 2313204
52151 2313204 2314195 2314782 2317180 2322324 2328150 2332214 2334887 2338386 2343598 2349744 2356441 2364003 2372006 2379502
52137 2379502 2386454 2393018 2397698 2398714 2397631 2399072 2405718 2415591 2425584 2435782 2448595 2465213 2485157
52124 2485157 2508510 2536328 2568750 2604277 2641178 2678552 2716086 2753985 2793228 2834690 2877710
52113 2877710 2920429 2961935 3003132 3044961 3086504 3125675 3161492 3194896 3227165 3257920 3285218
52102 3285218 3307858 3327331 3346878 3368321 3390312 3410033 3426045 3438809 3449064 3456948 3462700 3466885
52090 3466885 3469353 3468839 3464288 3455963 3444585 3430068 3412033 3391308 3369969 3349732 3330807 3312387
52078 3312387 3293772 3275099 3257482 3242552 3231316 3223329 3217375 3212981 3210814 3211670 3215773 3223244 3234372
52065 3234372 3248798 3264987 3281296 3297359 3313880 3331284 3349166 3366901 3384118 3400627 3416537
52054 3416537 3432468 3448871 3464930 3478806 3489470 3497839 3505598 3513093 3518794 3520708 3517951 3511060 3501259
52041 3501259 3489585 3476404 3461289 3443304 3421721 3396883 3370348 3343840 3317909 3292006 3265992
52030 3265992 3240907 3217633 3195376 3172454 3148523 3125070 3103490 3083530 3063926 3043758 3022639
52019 3022639 3000335 2977089 2953998 2932331 2912406 2893458 2874449 2854762 2834417 2814036 2794343
52008 2794343 2775241 2755537 2734019 2710702 2686594 2662262 2636970 2609292 2578427 2544882 2509964
51997 2509964 2474498 2438160 2400328 2361485 2323258 2286933 2252460 2219035 2186032 2153063 2119857
51986 2119857 2086689 2054452 2023741 1994255 1965598 1938169 1912696 1889276 1867398 1846447 1825630
51975 1825630 1804015 1781506 1759258 1738170 1717378 1695328 1672265 1650537 1632360 1618098 1606851
51964 1606851 1597946 1591549 1588255 1588070 1589629 1590940 1591509 1592957 1596541 1600819 1603231 1603426 1603162 1602946 1600873
51949 1600873 1595338 1587064 1577597 1567524 1557349 1548637 1542714 1539187 1537171 1537176 1540247 1545803 1551986 1557994
51935 1557994 1564594 1572200 1579746 1585882 1590233 1592987 1594032 1593161 1590596 1586571 1580440 1570716 1556317 1537629
51921 1537629 1516054 1492588 1467392 1441083 1415671 1393245 1373967 1356476 1340220 1326010 1314048
51910 1314048 1302951 1291702 1281279 1273045 1266473 1259954 1253399 1248641 1247410 1250126 1256547 1266275 1278280
51897 1278280 1290904 1302802 1313442 1322647 1330204 1335882 1339347 1340103 1338060 1333979 1328860 1323116 1316845
51884 1316845 1310468 1304429 1298839 1294378 1293027 1296593 1304783 1315982 1329741 1347006 1367770 1390137 1412194
51871 1412194 1433438 1453713 1472061 1487376 1499045 1506126 1507092 1501576 1491499 1479161 1464825 1447412
51859 1447412 1427164 1406158 1386062 1366511 1346246 1325370 1306086 1291163 1281633 1275875 1271241 1266476
51847 1266476 1262024 1258038 1253317 1246918 1239781 1233542 1228261 1222490 1215276 1206942 1198078 1188992 1180263 1172651
51833 1172651 1166151 1160072 1154455 1150488 1149071 1149664 1150926 1151755 1151322 1149055 1145362 1141731 1139199 1137057 1133785
51818 1133785 1128940 1123448 1118425 1114526 1112144 1111206 1110727 1109524 1107677 1106561 1107196 1109261 1111963 1114912 1117618
51803 1117618 1119013 1118485 1116866 1115337 1113542 1109962 1104249 1098126 1093417 1089909 1085830 1080019 1073028 1066390
51789 1066390 1061430 1058668 1057705 1057412 1056570 1054605 1051764 1048710 1046097 1044389 1043767 1044071 1044876 1045677 1046040 1045757
51773 1045757 1045000 1044304 1044341 1045655 1048447 1052436 1057154 1062806 1070661 1081916 1095989 1110598 1123849 1135630
51759 1135630 1146498 1155994 1162920 1166869 1168549 1168711 1167504 1164708 1159778 1151790 1140424 1127184 1114703
51746 1114703 1104400 1095615 1087500 1080911 1077576 1077876 1080272 1082856 1084918 1087027 1090221 1095391 1103220 1114212
51732 1114212 1128377 1144663 1161050 1175731 1188236 1199110 1208628 1216411 1222232 1226456 1229474 1231384
51720 1231384 1232639 1234359 1237345 1241088 1244141 1245239 1243837 1240127 1235016 1229727 1224914 1220408 1216162 1212794
51706 1212794 1210499 1207862 1202787 1194780 1185770 1178517 1174538 1173454 1173765 1174126 1174225 1174664 1175887 1177430 1178447
51691 1178447 1178764 1179018 1179850 1181304 1182914 1183993 1183969 1182755 1180735 1178141 1174731 1170376 1165457 1160126 1153674
51676 1153674 1145600 1137102 1130451 1126796 1125570 1126095 1128582 1133027 1138361 1143704 1149648 1157183 1165889 1174453
51662 1174453 1182780 1192196 1203198 1213987 1221904 1225709 1225914 1223468 1218839 1212197 1203848 1194418 1184958 1176780
51648 1176780 1170823 1167244 1165893 1166852 1169827 1173118 1174150 1171484 1165817 1158594 1150179 1139856 1127180 1112687
51634 1112687 1097527 1082952 1069805 1057855 1045895 1033327 1021499 1012646 1007525 1004846 1002876 1000637
51622 1000637 997604 993572 989294 986170 984710 984230 984475 986323 990135 994608 998361 1001596 1004926 1007634
51608 1007634 1008749 1009094 1010318 1012173 1012795 1011919 1011877 1014749 1020093 1026313 1032867 1039959 1047108 1053397 1058839
51593 1058839 1064647 1072427 1083515 1098436 1116210 1134572 1151575 1166766 1180447 1192412 1202222 1210293
51581 1210293 1217788 1225439 1233194 1241184 1250583 1263262 1280680 1302973 1328950 1357143 1387252 1420595
51569 1420595 1459026 1503376 1552807 1605408 1659457 1714455 1770933 1829003 1887294 1943885 1998215
51558 1998215 2051369 2104561 2158178 2212316 2266948 2320888 2371411 2415677 2451876 2478551 2493705
51547 2493705 2495501 2483169 2456496 2415310 2360650 2295865 2225155 2151172 2075023 1998165 1922802
51536 1922802 1850364 1781046 1715272 1654455 1599614 1550170 1504959 1463919 1428009 1397492 1370900
51525 1370900 1345911 1321257 1297662 1276656 1258425 1241263 1223476 1205316 1188526 1174386 1162872
51514 1162872 1153268 1144752 1136583 1128637 1121632 1116044 1110996 1105189 1098711 1092835 1088006 1083301 1078041 1072672
51500 1072672 1067570 1062164 1055933 1049385 1043357 1038079 1033498 1029802 1027017 1024737 1022812 1021668 1021556 1022188
51486 1022188 1023426 1025304 1026976 1026951 1025254 1024025 1024712 1025750 1024577 1021162 1017840 1016261 1016361 1018071 1021765
51471 1021765 1026396 1029064 1027676 1023241 1018688 1015949 1014633 1012876 1009010 1002953 996395 991195 987544 984342
51457 984342 981258 979181 978270 976935 973845 970040 967797 967843 968943 970207 972610 977769 985883 995483 1005020
51442 1005020 1014426 1025091 1038555 1055300 1074760 1096006 1117956 1139091 1157707 1172807 1184408
51431 1184408 1192868 1198352 1201108 1201698 1200583 1197946 1194138 1189681 1184435 1177435 1168258 1158083 1148687 1140756
51417 1140756 1133957 1128322 1124577 1123000 1122675 1122077 1120003 1116107 1111242 1107341 1106220 1108164 1111982 1116434
51403 1116434 1121166 1126325 1131942 1137907 1144101 1150443 1157251 1165546 1176460 1190231 1206336 1224491 1244728
51390 1244728 1266545 1289181 1313281 1341236 1374940 1413919 1456580 1502781 1554136 1612083 1676672
51379 1676672 1747212 1823169 1904208 1989946 2079793 2172579 2266401 2359223 2449304 2534302 2610224
51368 2610224 2672415 2717821 2745426 2754522 2743874 2713275 2664785 2601414 2525269 2438140 2343373
51357 2343373 2245659 2148671 2053720 1960937 1871005 1785408 1705769 1633403 1568985 1511984 1460734
51346 1460734 1413731 1370864 1332960 1300114 1271008 1244125 1219232 1197151 1178076 1160612 1142902
51335 1142902 1124578 1107171 1092427 1080572 1070504 1061399 1053473 1047088 1041757 1036582 1031402 1026762 1022652
51322 1022652 1018019 1012124 1005960 1001437 999038 997123 994048 990315 987768 987057 986919 985995 984244 982158 979634
51307 979634 976551 973774 972409 972220 971724 969948 967253 964328 961315 958267 955609 953499 951273 948187 944384
51292 944384 940604 937304 934658 933035 932661 932806 932185 930517 929238 930290 934370 940495 946961 952649 957734
51277 957734 963458 971033 980493 990577 999757 1007259 1013152 1017749 1021121 1023041 1023280 1022008 1019902 1017635
51263 1017635 1015277 1012525 1009525 1006902 1004724 1001985 997788 992818 988939 987222 986801 985836 983195 979059
51249 979059 974236 969223 963854 957668 950675 943720 937859 933412 929857 926665 923776 921176 918672 916520
51235 916520 915803 917393 920639 923781 925806 927299 929169 931124 932008 931385 930145 929419 929379 929419 929178 928947 929127
51218 929127 929769 930908 932968 936379 940878 945558 949722 953351 956603 959222 960772 961360 961886 963525 966861
51203 966861 971292 975231 977325 977682 977653 978321 979621 981098 982807 984917 986999 988521 989695 991002 992221
51188 992221 992858 993304 994378 995722 996022 995208 995080 996971 999891 1001995 1003044 1004322 1006623 1009403 1011610
51173 1011610 1012487 1011900 1010667 1010103 1010221 1008906 1004118 996754 990009 985919 983832 982353 981177 980465 979900
51158 979900 979461 980168 982802 986369 988834 989160 987905 986094 984297 982771 981802 981737 982836 984925 986986 987524
51142 987524 985832 982800 980132 978937 979212 980312 981539 982571 983618 984944 986049 985855 984026 981588 979805
51127 979805 979008 979063 980319 983234 987362 991590 995298 998751 1002635 1007760 1014696 1022820 1030050 1034539 1036572
51112 1036572 1037880 1039306 1040255 1040354 1040310 1040783 1041502 1041995 1042323 1042596 1042616 1042414 1042374 1042453 1042227 1042158 1043734 1047632 1052715
51093 1052715 1057673 1062689 1068393 1074128 1078575 1081495 1083437 1084218 1083368 1081990 1082347 1085135 1088567 1090881 1092552
51078 1092552 1095167 1099116 1103446 1107437 1111225 1115012 1118424 1120793 1121819 1122160 1123529 1127705 1134970 1143808
51064 1143808 1152600 1161266 1170864 1181992 1194266 1207142 1220602 1235055 1251046 1268927 1288322 1307942
51052 1307942 1326415 1343252 1358765 1373361 1387567 1402387 1418763 1436580 1454980 1473652 1492894
51041 1492894 1512204 1529906 1544696 1556689 1566286 1572950 1576107 1576544 1575593 1573212 1568069 1559436 1547769
51028 1547769 1533348 1515787 1495502 1474450 1454411 1435330 1416289 1397539 1380445 1365831 1353632
51017 1353632 1344196 1338625 1337382 1339464 1343575 1349419 1357176 1366423 1376584 1388194 1402499 1419482 1437101
51004 1437101 1453070 1466985 1480277 1494593 1510874 1529605 1550821 1573509 1595868 1616885 1637425
50993 1637425 1659278 1683363 1709387 1737001 1766445 1797821 1830334 1862748 1894330 1925039 1955002
50982 1955002 1984247 2012978 2041788 2071347 2101804 2132619 2163162 2193521 2224494 2256636 2289599
50971 2289599 2322794 2356431 2391471 2428820 2469280 2514206 2565217 2622872 2686365 2754996 2829222
50960 2829222 2909648 2995572 3085293 3177441 3271161 3365382 3458830 3550708 3640525 3727176 3809022
50949 3809022 3884989 3954945 4018747 4075651 4124905 4166334 4199981 4225609 4243035 4252728 4255893 4254149
50937 4254149 4249075 4241582 4231437 4217630 4199227 4175650 4146344 4110948 4069962 4024701 3976368 3925576
50925 3925576 3872731 3818036 3760866 3700038 3635228 3567451 3497512 3424670 3347738 3267128 3185115
50914 3185115 3104239 3026051 2951012 2878844 2809146 2742392 2680168 2623678 2572068 2523152 2475946
50903 2475946 2431747 2392438 2358324 2327975 2299589 2272066 2245171 2219372 2195591 2174719 2157096
50892 2157096 2142419 2130135 2120009 2112264 2107103 2104098 2102344 2101322 2101350 2103001 2106436 2111646 2118969 2128855
50878 2128855 2141257 2155733 2171971 2189753 2208555 2227805 2247664 2269091 2293031 2319789 2349106
50867 2349106 2380497 2413722 2449418 2489089 2533939 2583904 2638411 2697763 2762832 2833606 2909379
50856 2909379 2990728 3079972 3178809 3286407 3400824 3521794 3651156 3790893 3941703 4103365
50846 4103365 4275520 4457841 4649929 4851233 5060715 5276609 5496820 5719528 5942994
50837 5942994 6164804 6381696 6590323 6787964 6972311 7140550 7288716 7412488 7509332 7580082
50827 7580082 7627816 7654902 7661703 7648455 7617580 7573418 7520286 7461641 7400524 7339465 7279804
50816 7279804 7221856 7165652 7110624 7054657 6994628 6928216 6854411 6772045 6678932 6573039 6453795
50805 6453795 6321724 6177570 6022531 5858876 5689476 5516708 5342142 5167156 4993757
50796 4993757 4825010 4664458 4514272 4373942 4241770 4117960 4004993 3904336 3814156 3731566
50786 3731566 3656029 3588937 3530633 3479866 3435921 3399025 3368057 3339726 3311186 3282449 3255336
50775 3255336 3231005 3209204 3188897 3168544 3146519 3122302 3096759 3070461 3042553 3012347 2981236
50764 2981236 2951444 2923231 2894947 2865821 2837023 2809587 2782976 2756623 2731602 2709432 2690007
50753 2690007 2672180 2656151 2643997 2637606 2636933 2640595 2647500 2657593 2671624 2690663 2715457 2745868
50741 2745868 2781174 2821342 2867717 2921814 2983472 3050863 3122649 3199594 3283436 3374554 3471580
50730 3471580 3573349 3680219 3792772 3909850 4028837 4147802 4266549 4385412 4503728
50721 4503728 4619860 4732196 4839637 4941320 5036180 5122473 5197484 5258039 5301775 5327899
50711 5327899 5336606 5328353 5304364 5267555 5222033 5171332 5117550 5062237 5007372 4954902 4905832 4860420
50699 4860420 4819176 4782887 4751381 4722609 4693235 4660144 4621635 4577647 4528972 4475772 4416588
50688 4416588 4349295 4273496 4191648 4107295 4022514 3937775 3853903 3772842 3696173 3624157 3557195
50677 3557195 3497442 3447755 3409234 3380756 3360851 3349095 3345602 3350082 3361765 3379588 3402111 3427753
50665 3427753 3455443 3484797 3515565 3547387 3580048 3613319 3646403 3678302 3708950 3739232 3769648
50654 3769648 3799794 3829596 3859995 3891616 3923771 3955940 3989547 4026751 4067664 4110210 4153034
50643 4153034 4197319 4245252 4297687 4354112 4414273 4478926 4549039 4624753 4705090 4788362 4872821
50632 4872821 4957125 5040332 5121648 5200383 5276188 5349116 5419354 5486725 5550000 5606437 5652286
50621 5652286 5684280 5700733 5701162 5685424 5653905 5608509 5552938 5491896 5430069 5371234 5317417 5268785
50609 5268785 5224879 5185812 5151770 5121704 5093486 5065369 5036316 5004717 4967861 4923354 4870391
50598 4870391 4809195 4739728 4661512 4574318 4478772 4376725 4271168 4165037 4059663 3954994
50588 3954994 3851644 3751821 3657684 3569641 3487159 3410487 3340502 3277368 3220530 3169923 3126092
50577 3126092 3089094 3058165 3032556 3011918 2995799 2983590 2975161 2970869 2970687 2973916 2979870 2988170 2998183
50564 2998183 3008900 3019829 3031635 3045668 3063221 3085212 3111825 3142035 3174141 3207370 3242722
50553 3242722 3281961 3326145 3375280 3428659 3484845 3541852 3598242 3654028 3710010 3766438 3822959
50542 3822959 3879676 3937419 3996811 4057854 4120861 4187269 4258929 4336825 4421024 4511818 4610363
50531 4610363 4717883 4834501 4959297 5091702 5232552 5383327 5544312 5713980 5890375
50522 5890375 6072539 6259828 6450130 6639719 6825158 7004521 7176399 7338479 7487907
50513 7487907 7622391 7739970 7837918 7913219 7964477 7992479 7998308 7981649 7941716 7879543 7798650
50502 7798650 7703522 7597967 7485050 7368104 7251340 7139221 7035164 6941062 6858330 6789127
50492 6789127 6735786 6698791 6675930 6663669 6658661 6657475 6655609 6647759 6628930 6594934 6542561 6470237
50480 6470237 6378267 6267574 6138524 5991905 5830696 5659618 5482970 5304004 5126166 4953049
50470 4953049 4786400 4625550 4469882 4320962 4181265 4051660 3931295 3819449 3716299
50461 3716299 3622001 3536076 3457939 3387430 3324666 3269640 3221988 3180943 3145641 3115486 3089943
50450 3089943 3068144 3049427 3034346 3024201 3019158 3017694 3018390 3021279 3026745 3034203 3043028 3053903 3067870
50437 3067870 3084434 3101818 3118674 3134382 3148202 3159708 3169958 3180787 3192822 3205450 3218692
50426 3218692 3233613 3250671 3269254 3289301 3311866 3337376 3364734 3393033 3422983 3455683 3491213
50415 3491213 3529720 3572908 3622888 3679963 3742972 3811656 3887173 3970112 4059220 4152562 4249008
50404 4249008 4347856 4447571 4545711 4640053 4729326 4812646 4888486 4954510 5008472 5049137 5076243
50393 5076243 5089805 5089829 5076431 5049659 5009153 4954628 4887099 4809329 4724810 4636519 4546667 4457118
50381 4457118 4369685 4286302 4209036 4139567 4078467 4025528 3981147 3946851 3923846 3911146 3905382
50370 3905382 3902153 3897279 3887354 3870028 3844200 3809892 3767846 3718960 3663632 3601478 3532159 3456625
50358 3456625 3377051 3295333 3212226 3128342 3045357 2965489 2890043 2819042 2752031 2688735 2629116
50347 2629116 2573265 2521143 2472178 2425556 2381365 2341017 2305888 2275830 2249582 2226195 2205214
50336 2205214 2185928 2167713 2151233 2138141 2129153 2123256 2119224 2116968 2116641 2117262 2117376 2116928 2117491 2120508
50322 2120508 2126060 2133476 2142309 2152143 2162089 2171443 2180721 2191172 2203126 2215646 2228157 2241448 2256154
50309 2256154 2271042 2284318 2296501 2310410 2327692 2346644 2364400 2380159 2394975 2409023 2420639
50298 2420639 2428047 2430732 2428969 2423277 2414833 2405385 2395982 2386490 2377082 2369491 2365812 2366219 2368860 2372085
50284 2372085 2375977 2381388 2388221 2395270 2401366 2405841 2407826 2405807 2398434 2385680 2369065 2350860 2333145
50271 2333145 2317151 2303022 2290233 2278471 2267994 2259077 2251547 2245324 2240919 2238647 2237664 2236677 2235417
50258 2235417 2234391 2233241 2230737 2226780 2223084 2221050 2220066 2218963 2218203 2219209 2221997 2224915 2226689 2227659 2228838
50243 2228838 2230649 2232636 2233703 2232648 2229271 2225027 2221812 2220080 2218884 2217723 2217499 2219425 2223742 2229746
50229 2229746 2236401 2242734 2248352 2253814 2260017 2267118 2274723 2283151 2293547 2306501 2321463 2337942 2356330
50216 2356330 2376854 2398551 2420275 2442240 2465506 2490116 2514642 2537781 2559707 2581552 2603956
50205 2603956 2626404 2647741 2667066 2684177 2699327 2712634 2723578 2730780 2732182 2725749 2710428 2686603
50193 2686603 2655666 2619420 2579971 2539541 2499651 2460572 2422184 2385272 2351385 2321335 2294429
50182 2294429 2269231 2244590 2219895 2194923 2169638 2143709 2116248 2086565 2055173 2023408 1992100
50171 1992100 1961328 1931437 1903254 1877141 1852854 1830781 1812193 1797562 1785547 1774558 1764581
50160 1764581 1756534 1750424 1745300 1740741 1737340 1735657 1735525 1736453 1738090 1740217 1742732 1745669 1748956 1752356
50146 1752356 1756064 1761008 1767887 1775961 1783348 1788432 1790661 1790229 1787714 1783992 1779864 1775564 1771013 1766634
50132 1766634 1763585 1763146 1765995 1771858 1779450 1787008 1793444 1799220 1805837 1814524 1825518 1838316 1852198
50119 1852198 1866626 1881548 1897341 1914389 1932998 1953776 1977461 2003863 2031537 2059197 2087170
50108 2087170 2116907 2149514 2185411 2224945 2268367 2315508 2366404 2422032 2483278 2549261 2617846
50097 2617846 2687909 2759866 2833748 2908136 2981709 3054624 3127370 3199205 3268961 3336796 3403784
50086 3403784 3469826 3533105 3591812 3645343 3693160 3732967 3760799 3773170 3769069 3750018 3718430
50075 3718430 3676113 3624223 3564165 3498010 3427941 3355635 3282382 3209510 3138384 3070017 3004828
50064 3004828 2942839 2884095 2828877 2777476 2729685 2684716 2641727 2600262 2560073 2520844 2482491
50053 2482491 2445497 2410499 2377715 2347241 2319677 2295776 2275543 2258316 2243709 2231751 2222098
50042 2222098 2213973 2207230 2202679 2200941 2201600 2203938 2207872 2213573 2220690 2228584 2237073 2246421 2256841 2268335
50028 2268335 2280613 2292772 2303624 2312919 2321751 2330987 2339645 2345666 2348080 2347583 2345100 2340828 2334926
50015 2334926 2328135 2321031 2313069 2303098 2290783 2277172 2263723 2250869 2237696 2223074 2207038 2190745
50003 2190745 2175093 2159986 2145347 2132344 2122902 2118187 2118342 2123621 2134794 2151948 2173597 2197609
49991 2197609 2222720 2248617 2274878 2300628 2325517 2350470 2376891 2405094 2433950 2462183 2489649
49980 2489649 2516927 2543992 2570046 2594720 2618695 2642749 2666823 2690525 2713981 2737398 2760301
49969 2760301 2782147 2803487 2825438 2847927 2869362 2888252 2904164 2916621 2923964 2924087 2915858 2899243
49957 2899243 2874535 2842252 2803618 2760428 2714326 2666568 2618549 2572293 2530261 2494488 2465434
49946 2465434 2441516 2420200 2399978 2381080 2364135 2348676 2333359 2317159 2299699 2280763 2260217
49935 2260217 2238296 2215243 2190668 2163856 2134769 2104082 2072133 2038450 2002611 1965129 1927266
49924 1927266 1890388 1855775 1824533 1797178 1773352 1752299 1733652 1717645 1704658 1694615 1686714
49913 1686714 1679821 1673367 1667871 1664290 1662828 1662767 1663628 1666180 1671985 1682001 1695640 1711023 1726275 1740940
49899 1740940 1756258 1773785 1793746 1815045 1836638 1858110 1878846 1897681 1913860 1927520 1938426
49888 1938426 1945090 1946185 1942367 1935441 1925932 1912767 1895488 1875434 1854235 1832236 1809180 1785434
49876 1785434 1761447 1736651 1710177 1682663 1656311 1632889 1612352 1593656 1576269 1560484 1546730
49865 1546730 1535166 1525869 1519015 1514745 1512979 1513482 1516159 1521221 1528871 1538720 1549797 1561514 1574558
49852 1574558 1590394 1609723 1631635 1654322 1676328 1697092 1716791 1735933 1754730 1772355 1787046
49841 1787046 1797359 1803283 1805848 1805843 1803364 1798367 1790909 1780817 1767914 1752776 1736561 1719737 1701913
49828 1701913 1683652 1667540 1656048 1648601 1642193 1635193 1629263 1626972 1628735 1633172 1639564 1648514 1660342
49815 1660342 1674206 1689189 1705433 1723654 1744067 1766152 1789108 1812072 1834030 1853859 1870593
49804 1870593 1883782 1893779 1901528 1907696 1911966 1913549 1912354 1909201 1904614 1897873 1887635 1873403 1856074
49791 1856074 1837134 1817529 1797347 1776426 1755084 1734201 1714620 1696632 1680068 1664688 1650372
49780 1650372 1637190 1625405 1615087 1605547 1595702 1585489 1576476 1570367 1567258 1566149 1566801 1569945 1575666
49767 1575666 1582903 1590996 1600567 1612138 1624805 1637163 1648865 1660287 1671054 1679908 1686080 1690137
49755 1690137 1693471 1697210 1701233 1703744 1702245 1695577 1684847 1671914 1657453 1641177 1623370 1605138
49743 1605138 1587279 1569943 1553446 1538563 1525823 1515246 1506786 1500297 1495036 1490080 1485410 1481785
49731 1481785 1479446 1477948 1477557 1479558 1484307 1489972 1494432 1497990 1502910 1510274 1518603 1526169 1533783 1544176
49717 1544176 1558780 1576063 1593552 1610759 1629125 1649069 1668198 1683218 1693077 1699444 1704335 1708114
49705 1708114 1709809 1708472 1703922 1696748 1688004 1678617 1668895 1658775 1648360 1637764 1626641 1614627 1602313
49692 1602313 1591000 1581365 1573157 1566352 1561589 1559040 1557786 1557060 1557365 1559612 1563913 1570123 1578922 1591085
49678 1591085 1605903 1621527 1637055 1653295 1671286 1690925 1711411 1732284 1753424 1774321 1793790
49667 1793790 1810386 1823045 1831655 1837274 1841677 1846440 1852223 1858501 1863821 1866672 1866623 1864522 1861195 1856123
49653 1856123 1847776 1835012 1817623 1795867 1770350 1742390 1713541 1684462 1655048 1626066 1599724
49642 1599724 1577874 1560231 1545153 1531696 1520048 1510316 1502001 1494623 1487849 1480893 1472960 1464750 1458390
49629 1458390 1454904 1452422 1447991 1440715 1431961 1422731 1412399 1400529 1388573 1378620 1371130 1364998 1359520
49616 1359520 1355162 1352271 1350050 1347376 1344191 1341540 1340261 1339939 1339258 1337428 1335143 1333829 1333987 1334722 1335105
49601 1335105 1335336 1336027 1336951 1337444 1337756 1338951 1341359 1343970 1345546 1345640 1344518 1342891 1341911 1342433 1343925 1345000
49585 1345000 1345473 1346970 1350880 1356592 1362540 1368153 1373705 1378852 1382715 1385476 1388857 1394595 1402816 1412079
49571 1412079 1420806 1428804 1437506 1448403 1461213 1474342 1487401 1502089 1519678 1538600 1555957 1570869
49559 1570869 1584670 1597936 1609054 1616249 1619571 1620151 1618631 1615282 1610961 1606812 1603136 1599248 1594467
49546 1594467 1589023 1584078 1580976 1580282 1581467 1583718 1586847 1590959 1595575 1599953 1604302 1609646 1616175 1622774
49532 1622774 1628775 1635310 1644061 1655294 1668022 1681757 1697160 1715072 1735654 1758433 1782466 1806412
49520 1806412 1829145 1850645 1871990 1894276 1917640 1941191 1963494 1983161 1999504 2012991 2025001
49509 2025001 2037025 2049901 2063534 2076992 2088988 2098641 2105767 2110242 2111157 2107082 2097308 2082497 2063842
49496 2063842 2041944 2016982 1989880 1962629 1937082 1913716 1891980 1871556 1852712 1835548 1819766
49485 1819766 1805488 1793515 1784178 1776467 1769060 1761924 1756043 1751734 1748149 1744524 1741082 1738394 1736581
49472 1736581 1735643 1736065 1738543 1743253 1749604 1756546 1763090 1768935 1774749 1781506 1789457 1798088 1806965 1815933
49458 1815933 1824427 1831430 1836537 1840350 1843272 1844560 1843169 1839056 1833123 1826347 1819559 1813443 1807810 1801196
49444 1801196 1792175 1781167 1770247 1761085 1753696 1747212 1741241 1736294 1733364 1733356 1736534 1742302 1749669 1758045
49430 1758045 1767552 1778775 1792368 1808662 1827315 1847619 1869499 1893936 1921925 1953199 1986507
49419 1986507 2020986 2056637 2093438 2130369 2165336 2195719 2219295 2235210 2243996 2246379 2242667 2234081
49407 2234081 2224130 2217111 2214920 2216298 2219451 2224344 2232043 2243127 2257567 2275146 2294845 2314575 2332764
49394 2332764 2349892 2367314 2384863 2400802 2414067 2425239 2435010 2442904 2448005 2449952 2448495 2442977
49382 2442977 2433303 2420887 2407600 2394006 2379577 2364475 2349987 2336965 2324893 2313088 2302048
49371 2302048 2292764 2285206 2278393 2271880 2266344 2262552 2260317 2258620 2256256 2252223 2246040 2238136 2229596 2221117
49357 2221117 2212262 2201975 2189706 2175943 2161827 2148440 2136324 2125522 2116077 2108304 2102220 2096825
49345 2096825 2090687 2083554 2076825 2071989 2069111 2067305 2066022 2064937 2063057 2059253 2053869 2048740 2045160 2042570
49331 2042570 2039613 2035749 2031240 2026347 2021453 2017594 2015917 2016507 2018355 2020509 2022696 2024831 2026639 2028171
49317 2028171 2030250 2033994 2039940 2047736 2056444 2065018 2072802 2079870 2086719 2093510 2099798 2105162 2109773 2114072
49303 2114072 2118303 2122762 2128095 2134632 2141679 2148316 2154922 2162907 2172697 2183054 2193064 2203837 2217166
49290 2217166 2233056 2249704 2265713 2281212 2296852 2312804 2328878 2344666 2359452 2373013 2386739
49279 2386739 2402721 2421086 2439242 2454498 2466630 2477240 2487649 2498511 2510564 2524245 2538769
49268 2538769 2552881 2566530 2580735 2595667 2609797 2621116 2628590 2632392 2633472 2632968 2631409 2628426 2623900
49255 2623900 2619455 2618201 2622914 2634829 2653798 2678723 2707898 2739829 2773865 2809246 2843653 2873702
49243 2873702 2896973 2912610 2919926 2917828 2906127 2886256 2860032 2828739 2794133 2759127 2726199 2695735
49231 2695735 2667111 2640995 2619438 2603905 2594210 2589295 2588156 2589979 2594328 2601481 2611999 2625496
49219 2625496 2640176 2653877 2665595 2675903 2685903 2695768 2704531 2711478 2717427 2724006 2731899 2740742 2750759
49206 2750759 2763199 2778503 2795168 2811486 2827725 2845515 2865611 2887320 2909797 2932730 2955803
49195 2955803 2978583 3001081 3023693 3046459 3069006 3091143 3112892 3134049 3154405 3174378 3194750
49184 3194750 3215880 3237684 3260140 3283205 3306768 3331643 3360096 3394075 3433107 3475298 3520381
49173 3520381 3570206 3626003 3686770 3750950 3818195 3888610 3961450 4035474 4109264 4179988 4242821
49162 4242821 4293035 4328478 4349465 4357419 4354914 4346053 4334953 4323831 4313665 4306064 4302721 4303179 4305155
49149 4305155 4307727 4312499 4320748 4330834 4339971 4347878 4357234 4370548 4387627 4406366 4425241 4444527
49137 4444527 4465386 4488348 4513039 4539172 4567240 4597811 4630497 4664262 4698629 4733764 4769226
49126 4769226 4803598 4835989 4867352 4899574 4933574 4969030 5005756 5044459 5085900 5129997 5176236
49115 5176236 5224712 5276514 5333204 5396127 5465940 5542646 5626210 5717398 5817820 5928885 6050744
49104 6050744 6182442 6322823 6470774 6624324 6779812 6932363 7077420 7211871 7333581
49095 7333581 7439605 7524685 7581969 7606145 7596538 7557082 7493037 7407907 7303606 7182819 7050212
49084 7050212 6911253 6770616 6631950 6498421 6372737 6256739 6151387 6057126 5974071 5901941
49074 5901941 5839904 5786398 5739150 5695921 5655631 5618500 5584818 5553931 5524797 5497116 5471166
49063 5471166 5446701 5422839 5399217 5376645 5356167 5337873 5321011 5305044 5290215 5277053 5265610
49052 5265610 5255307 5245546 5236373 5228345 5221710 5216004 5210736 5206268 5203563 5203086 5204241 5205895 5207248 5208493
49038 5208493 5211222 5217948 5230317 5247542 5267290 5288434 5312148 5339798 5370484 5401477 5430481 5456461
49026 5456461 5478506 5495156 5505340 5509390 5508729 5504828 5498552 5490190 5480095 5469474 5460184 5453121 5447205
49013 5447205 5440987 5435178 5432241 5433107 5435634 5437241 5437958 5439612 5442927 5447176 5452403 5459997 5470372 5481413
48999 5481413 5490220 5495762 5499185 5502121 5505341 5508579 5510861 5511197 5509467 5506512 5503123 5499282 5494732 5489748
48985 5489748 5484795 5479743 5474011 5467255 5459415 5450476 5440797 5431382 5423145 5416040 5409508 5403502 5398370 5394041
48971 5394041 5390267 5387527 5386596 5387107 5387654 5387726 5388540 5391406 5396069 5401344 5406792 5413112 5421368 5432445 5446826
48956 5446826 5464280 5484011 5505552 5529201 5555278 5583462 5613392 5645426 5680313 5718477 5760038
48945 5760038 5804983 5852811 5902643 5954370 6009055 6067364 6128161 6189660 6251466 6314501 6379437
48934 6379437 6446481 6516248 6589231 6664532 6740832 6818885 6901326 6989374 7081246 7174589 7268961
48923 7268961 7364870 7461956 7559865 7659910 7763821 7871034 7978835 8085156 8189697 8292216
48913 8292216 8391524 8487021 8579863 8671294 8760491 8845324 8925106 9001438 9076050 9148654 9217532
48902 9217532 9281703 9341704 9398318 9451364 9500163 9544654 9585377 9622501 9655477 9683664 9706867
48891 9706867 9725184 9738810 9747984 9752674 9752325 9746614 9736649 9724611 9711624 9696288 9675769 9648160
48879 9648160 9613659 9573918 9530630 9484431 9434809 9381089 9323344 9261817 9195694 9123511 9045049
48868 9045049 8961824 8875383 8786342 8695730 8605736 8517678 8430283 8341748 8252940 8166892 8085457
48857 8085457 8008228 7934661 7865294 7800535 7740035 7683904 7632971 7587038 7544412 7504241 7468052
48846 7468052 7437790 7413389 7393473 7377515 7365774 7357812 7352730 7350772 7353145 7360069 7370157 7382034
48834 7382034 7395636 7411636 7430492 7452472 7477805 7506209 7536666 7568079 7599851 7631692 7663426
48823 7663426 7695392 7728616 7763930 7801045 7838989 7877484 7917509 7960283 8005864 8052923 8099707
48812 8099707 8145007 8188316 8229626 8269475 8309013 8349490 8391510 8434943 8479528 8525201 8571756
48801 8571756 8618570 8665019 8711073 8757369 8804664 8853128 8901956 8949726 8995480 9039397 9082047
48790 9082047 9123095 9161273 9195650 9226186 9252781 9274583 9290704 9300999 9305472 9303513 9294514 9278863
48778 9278863 9257414 9229994 9195300 9152424 9101873 9044940 8982568 8915042 8842369 8764720 8682670
48767 8682670 8597162 8509159 8419536 8329438 8240234 8152446 8064894 7975792 7885020 7794840 7708160
48756 7708160 7626465 7549600 7476929 7408073 7342679 7280090 7219700 7161712 7107402 7058246 7014420
48745 7014420 6974355 6936234 6900012 6867597 6840850 6819687 6802342 6787271 6774455 6764734 6758146 6753252
48733 6753252 6748379 6743325 6739347 6737302 6736278 6734450 6730864 6725810 6719856 6713359 6707025 6702002 6698921 6697189
48719 6697189 6695590 6693266 6689884 6685288 6679574 6673383 6667616 6662709 6658439 6654562 6651403 6649545 6648975 6648929 6648857
48704 6648857 6649230 6650850 6653360 6655229 6655639 6655813 6657780 6662211 6668216 6674992 6682735 6691856 6702336 6714176
48690 6714176 6727597 6742135 6756131 6767963 6777532 6785894 6793580 6799958 6804292 6806729 6807929 6808163 6807120
48677 6807120 6804340 6799448 6792158 6782515 6771106 6758410 6743675 6724925 6700701 6671611 6639615 6605849
48665 6605849 6569860 6531064 6490141 6448478 6406786 6364800 6322024 6278299 6233856 6189123 6144134
48654 6144134 6097781 6048229 5994601 5937791 5879072 5818575 5756088 5692879 5631530 5573955 5520479
48643 5520479 5470604 5423481 5377623 5331508 5285048 5239510 5195582 5152376 5108782 5064964 5021867
48632 5021867 4980012 4939361 4899750 4860844 4822179 4783798 4746317 4709825 4673270 4635667 4597524
48621 4597524 4560421 4525407 4492382 4460892 4430995 4403389 4378954 4358077 4340276 4324780 4311531
48610 4311531 4301276 4294539 4290952 4289526 4288987 4287917 4285583 4282796 4280883 4279440 4276290 4270330 4263194 4257146
48596 4257146 4252385 4247555 4241889 4235340 4227304 4216833 4203790 4188348 4169616 4146456 4119766 4092407
48584 4092407 4066477 4041794 4017352 3992925 3968745 3944767 3921073 3898300 3876988 3857001 3838010
48573 3838010 3820132 3803954 3790451 3780771 3775207 3772366 3770532 3770222 3774097 3783605 3796729 3809936 3821388
48560 3821388 3831230 3839675 3846371 3851268 3854440 3854866 3850695 3841368 3828605 3814728 3800596 3785695 3769589
48547 3769589 3752508 3734832 3716730 3698258 3679137 3658350 3634704 3608206 3580436 3553107 3526588
48536 3526588 3500326 3474325 3449454 3426403 3405178 3385715 3368220 3352621 3338499 3326090 3316658
48525 3316658 3311319 3309954 3311710 3315890 3321760 3328354 3335338 3343281 3351857 3358466 3360112 3356385 3349108 3339285
48511 3339285 3326285 3310418 3294429 3281399 3272351 3266853 3264835 3266693 3272530 3282404 3296649 3314682
48499 3314682 3333994 3351642 3366740 3380532 3393990 3406173 3414962 3418658 3416699 3409366 3397043 3379593
48487 3379593 3356719 3329171 3299151 3268855 3238813 3208225 3176663 3144809 3113840 3084841 3058689
48476 3058689 3035565 3014552 2994529 2975616 2958916 2944666 2931657 2919042 2907913 2900217 2896457 2895241
48464 2895241 2894931 2895085 2896294 2899327 2904674 2912454 2922358 2933838 2946632 2961022 2977220 2994300 3009922
48451 3009922 3021459 3027697 3029554 3029165 3028190 3026810 3024047 3018914 3011393 3002493 2993301 2983827 2972849 2959145
48437 2959145 2942902 2925652 2908775 2892327 2875440 2857547 2838795 2819498 2799750 2779747 2760086
48426 2760086 2741449 2724137 2708039 2692709 2677307 2660968 2643722 2626696 2610793 2595433 2579388
48415 2579388 2562617 2546211 2530448 2514194 2496867 2479852 2464903 2451859 2439086 2425750 2412549
48404 2412549 2400447 2389833 2380925 2373880 2368176 2362615 2356203 2348551 2339531 2329276 2318460 2307732 2296921
48391 2296921 2285668 2274745 2265477 2257726 2249772 2240672 2231524 2223606 2216471 2208894 2200802 2193025 2185717
48378 2185717 2178272 2170520 2162890 2155414 2147591 2139401 2131751 2125676 2121449 2118477 2115677 2112091 2107568 2102877
48364 2102877 2098943 2096113 2094313 2093437 2093183 2092910 2092289 2091813 2092081 2092749 2092757 2091577 2089819 2088697 2089175 2091410 2094645
48347 2094645 2097795 2100456 2103120 2106165 2109096 2111238 2112778 2114655 2117752 2122634 2129563 2138098 2147074 2155716
48333 2155716 2164486 2174277 2185220 2197035 2210120 2225118 2241489 2257547 2272139 2285612 2299084 2313557
48321 2313557 2329826 2348452 2369450 2392496 2417505 2444479 2472745 2500962 2527972 2553248 2576715
48310 2576715 2599089 2622369 2648902 2679391 2712448 2746573 2781956 2819965 2861438 2906026 2952773
48299 2952773 3000704 3049058 3097498 3146246 3195938 3247476 3302147 3361536 3427032 3499458 3579287
48288 3579287 3667066 3763409 3868673 3982826 4105856 4238369 4381810 4538049 4708974 4896718
48278 4896718 5103984 5333628 5588108 5870331 6185294 6539940 6940655 7391239 7893550
48269 7893550 8449267 9060614 9730465 10462992 11264161 12141676 13105919 14172229 15361635
48260 15361635 16697823 18201864 19885993 21745111 23747785 25833030 27914019 29879954
48252 29879954 31592907 32894802 33640493 33744807 33209014 32108865 30561883 28701263
48244 28701263 26662340 24571076 22530905 20614474 18863509 17292960 15897170 14658917
48236 14658917 13558660 12579083 11705100 10923813 10225288 9601471 9043852 8543481 8092929
48227 8092929 7686437 7318283 6983006 6677187 6398784 6144222 5908215 5687198 5481075
48218 5481075 5290630 5114768 4951217 4798272 4654549 4518255 4388119 4264267 4147105
48209 4147105 4036126 3930795 3831691 3739566 3653879 3573440 3497943 3427620 3361756 3298813 3237970
48198 3237970 3179402 3122900 3067288 3011580 2955904 2900749 2845763 2789895 2732620 2674711 2617820
48187 2617820 2563569 2513087 2467105 2425944 2389199 2355738 2324381 2294531 2265967 2238370 2211550
48176 2211550 2185868 2161837 2139461 2118585 2099725 2083587 2069667 2056269 2042313 2028386 2015595
48165 2015595 2004173 1993686 1983898 1974677 1965577 1956291 1947271 1939226 1932113 1925182 1917968 1910824 1904552
48152 1904552 1899730 1896204 1893017 1889131 1884430 1879677 1875381 1871293 1867355 1864325 1862698 1861511 1859181 1855386
48138 1855386 1851389 1848550 1847227 1847084 1847739 1848872 1850244 1851822 1853620 1855518 1857617 1860587 1865054 1870604
48124 1870604 1875984 1880385 1884063 1887621 1891322 1895338 1900060 1905662 1911728 1917866 1924599 1933150 1944183 1956890
48110 1956890 1969508 1980787 1991019 2001662 2013971 2028087 2043390 2059411 2076230 2094327 2114368
48099 2114368 2136866 2161545 2187152 2212382 2237013 2261767 2287144 2312935 2338935 2365488 2392954
48088 2392954 2421007 2448918 2476364 2503649 2531130 2558630 2585523 2611385 2636507 2661531 2686493
48077 2686493 2710573 2733100 2754526 2775858 2797311 2818117 2837616 2855860 2873070 2889231 2904390
48066 2904390 2918761 2932280 2944726 2956579 2968970 2982228 2995083 3005933 3014429 3021190 3026428 3029648
48054 3029648 3030431 3028803 3025036 3019608 3012967 3004675 2993199 2977522 2958652 2938521 2917572 2894595 2868885
48041 2868885 2841202 2812234 2781519 2748695 2714748 2680944 2647175 2612291 2575723 2538071 2500606
48030 2500606 2464877 2432194 2402434 2373659 2343833 2312671 2280998 2248826 2215409 2181072 2147414
48019 2147414 2115245 2083680 2051942 2020885 1991753 1964427 1938153 1913304 1890879 1870399 1849871
48008 1849871 1828402 1807731 1790373 1776878 1765715 1755333 1745448 1736378 1728136 1720495 1713446 1707179
47996 1707179 1701881 1697708 1694624 1692046 1689128 1685792 1683100 1681953 1681630 1680304 1677081 1672942 1669513 1667455
47982 1667455 1666277 1665146 1663516 1661351 1659081 1657064 1654941 1651980 1648147 1644193 1640375 1635983 1630694 1625582
47968 1625582 1621767 1618687 1614925 1610377 1606368 1603664 1601673 1599754 1598112 1596979 1596041 1595227 1595107 1595858 1596645
47953 1596645 1596781 1596892 1598274 1601529 1606372 1612168 1618072 1623278 1627980 1633737 1642131 1653285 1666164 1679803
47939 1679803 1693583 1706865 1719416 1732005 1745606 1760014 1774066 1787210 1799969 1812700 1824722
47928 1824722 1835101 1843749 1851315 1858264 1864340 1868819 1871237 1872032 1872329 1872736 1872375 1869456 1862938 1853544 1843286
47913 1843286 1834144 1826822 1820385 1813230 1804695 1795454 1786250 1776849 1766749 1756246 1746026 1736273 1727162
47900 1727162 1719748 1714983 1711952 1708502 1703895 1699634 1697331 1696994 1698037 1700764 1705774 1712596 1719926 1726920
47886 1726920 1733633 1740549 1748281 1757337 1767625 1778451 1789493 1801240 1813967 1826823 1838652 1849269
47874 1849269 1859179 1868464 1876905 1884947 1893493 1902634 1911338 1918486 1923498 1925884 1925098 1921229 1915253 1908196
47860 1908196 1900399 1891827 1882544 1872531 1861470 1849226 1836303 1823406 1810753 1798196 1785844 1774052
47848 1774052 1762813 1751743 1741001 1731831 1725589 1722185 1719944 1717366 1714720 1713502 1714446 1716648 1718762
47835 1718762 1720492 1722531 1725496 1729512 1734674 1741268 1749333 1758415 1767926 1777529 1787040 1796257 1805130 1814000
47821 1814000 1823463 1834017 1845929 1859407 1874703 1891936 1910861 1930945 1951833 1973745 1997327
47810 1997327 2023098 2051158 2081459 2114175 2149596 2187684 2227849 2269180 2310786 2351934 2391959
47799 2391959 2430168 2465849 2498294 2526702 2550122 2567676 2578915 2583731 2581845 2572800 2556879 2535805
47787 2535805 2511955 2486870 2460899 2434142 2407035 2379928 2352913 2326520 2301895 2279619 2258856
47776 2258856 2238443 2218642 2201051 2186804 2175486 2165849 2156820 2147544 2137110 2124958 2111455 2097636
47764 2097636 2084387 2072036 2060627 2050180 2040509 2031043 2021159 2010862 2000968 1992487 1985743 1980093 1974447
47751 1974447 1967988 1960659 1953273 1947193 1943623 1943050 1945306 1949879 1955921 1962253 1968099 1973920 1981041 1990168
47737 1990168 2000700 2011686 2023015 2035420 2049772 2066651 2086055 2107024 2127975 2147926 2167104
47726 2167104 2185980 2204285 2221609 2238462 2255682 2272834 2288017 2299420 2306552 2310039 2310974 2310474
47714 2310474 2309109 2306404 2301395 2293807 2284186 2272838 2259337 2243362 2225506 2206929 2188604 2171003
47702 2171003 2154026 2137060 2119674 2102523 2087121 2074457 2064290 2055973 2049359 2044631 2041889 2041429
47690 2041429 2043867 2049443 2057536 2067347 2078714 2091755 2106202 2121632 2138064 2155764 2174728 2194948
47678 2194948 2216928 2241223 2267453 2294303 2320521 2345628 2369853 2393654 2417022 2438818 2457234
47667 2457234 2471539 2483012 2493395 2502702 2509296 2511872 2510329 2504907 2495783 2483831 2470587 2456760
47655 2456760 2441597 2424293 2405241 2385278 2364586 2343373 2323037 2305481 2291265 2279225 2267891
47644 2267891 2256640 2245635 2235484 2227244 2222116 2220790 2223166 2228655 2236453 2245888 2257078 2271067 2288625
47631 2288625 2308939 2330402 2352873 2378267 2408387 2442796 2479568 2517764 2558500 2603530 2653122
47620 2653122 2705294 2756965 2806172 2853480 2900967 2949283 2995737 3035597 3065220 3083657 3091548
47609 3091548 3089275 3076626 3053859 3022305 2983519 2937944 2884889 2824080 2757027 2686426 2614324
47598 2614324 2541411 2468176 2396051 2326864 2261573 2200081 2142107 2087764 2037382 1991162 1948878
47587 1948878 1909592 1872021 1835800 1802235 1773115 1748673 1727204 1706744 1686647 1667531 1650324
47576 1650324 1635571 1623111 1612079 1601492 1591057 1581207 1572324 1564410 1557476 1551589 1546152 1539663 1530841
47563 1530841 1520006 1509113 1500416 1494935 1491818 1489073 1485297 1480790 1476672 1473145 1469448 1465512 1462576
47550 1462576 1461514 1461505 1461119 1460041 1458769 1457221 1454943 1452533 1451520 1452514 1454403 1455761 1456278 1456450 1456652 1457133
47534 1457133 1458263 1460016 1461482 1461695 1460922 1460425 1460741 1460809 1459207 1455833 1451735 1447468 1442500 1436498 1430483
47519 1430483 1425868 1422708 1419777 1416321 1412864 1410064 1407607 1404728 1401156 1397060 1392567 1387972 1384036 1381485
47505 1381485 1380356 1380063 1379792 1378656 1376149 1372896 1370294 1368874 1367690 1365952 1364374 1363919 1364045 1363536 1362543
47490 1362543 1362226 1362493 1361642 1358538 1353947 1349453 1346133 1344522 1344712 1346077 1347800 1349960 1353142 1356990 1360406
47475 1360406 1363434 1367397 1372682 1377888 1381993 1385879 1390676 1396022 1401268 1407051 1414014 1420915 1425923 1429258
47461 1429258 1432768 1437137 1441309 1444677 1448046 1452050 1456176 1459967 1463943 1468585 1473407 1477852 1482463 1488508
47447 1488508 1496849 1507604 1520480 1535051 1551124 1569153 1589916 1613534 1639226 1666240 1694605
47436 1694605 1724724 1756760 1790706 1826573 1863998 1901837 1938652 1973807 2008032 2042614 2077602
47425 2077602 2110657 2138289 2158739 2173103 2183013 2187955 2186228 2178162 2166610 2153759 2138985 2120702
47413 2120702 2099035 2075350 2050037 2022404 1992682 1962856 1935102 1910136 1887286 1865599 1844509
47402 1844509 1823816 1803399 1783044 1762737 1743169 1725526 1710357 1696862 1683744 1670740 1658930
47391 1658930 1649615 1643267 1639497 1637696 1637515 1638926 1641851 1645804 1650097 1654502 1659359 1664826 1670515 1676313
47377 1676313 1683081 1691752 1701835 1711523 1719382 1725399 1730304 1734516 1737947 1740219 1740630 1738295 1732798 1724578
47363 1724578 1714434 1702851 1690015 1676207 1661849 1647282 1632681 1617981 1602673 1585957 1567603
47352 1567603 1548602 1530451 1513667 1497401 1480725 1463939 1448236 1434269 1421622 1409751 1398904
47341 1398904 1389643 1381662 1373788 1365327 1356996 1350086 1344975 1340889 1337040 1333477 1330687 1328850 1327810 1327478
47327 1327478 1327717 1327910 1327162 1325265 1323309 1323047 1325565 1330515 1336512 1342175 1346878 1350778 1354319 1357676 1360545
47312 1360545 1362467 1363381 1363948 1365220 1367852 1371481 1374920 1377077 1377737 1377442 1376758 1375915 1375207 1375372 1377186 1380733
47296 1380733 1385363 1390323 1395133 1399530 1403677 1408623 1415917 1426200 1438559 1451648 1465048 1478886 1492662
47283 1492662 1505565 1517880 1530916 1545125 1559376 1572768 1586235 1601311 1617830 1633974 1648436
47272 1648436 1661459 1673658 1684805 1694245 1701861 1708165 1713860 1719661 1726134 1733229 1740064 1745373 1748123
47259 1748123 1747811 1744654 1739692 1734205 1728681 1722568 1715365 1707633 1700532 1694527 1688940 1682714 1675351 1667213
47245 1667213 1659240 1652452 1647514 1644640 1643716 1644306 1645649 1647167 1649156 1652505 1657409 1662778 1667444 1671576
47231 1671576 1676453 1683123 1692021 1703654 1718672 1736938 1757127 1777659 1797708 1817112 1835736 1853344
47219 1853344 1869909 1885665 1900723 1914517 1925546 1932029 1933436 1931280 1927765 1923572 1917730 1909797 1901117
47206 1901117 1893207 1885681 1876848 1865998 1854133 1842560 1831756 1821762 1812699 1804531 1797035 1790424 1785404
47193 1785404 1782206 1780185 1778934 1779212 1781950 1786660 1791842 1796937 1802936 1810814 1820280 1830784 1843058 1858648
47179 1858648 1878010 1899989 1923326 1947905 1974041 2001219 2028283 2054638 2080644 2106949 2133922
47168 2133922 2161570 2189355 2216146 2241111 2264761 2288220 2311096 2330942 2345582 2355289 2361765 2365513
47156 2365513 2365489 2361309 2354514 2347099 2339695 2331854 2323437 2314842 2306188 2297150 2287664 2278131 2268701 2258919
47142 2258919 2248480 2238098 2229240 2222977 2219299 2217462 2216711 2216640 2217316 2219330 2223352 2229069 2234791 2238919
47128 2238919 2241945 2246143 2252796 2260404 2266287 2269364 2270394 2270009 2267758 2263106 2256157 2247059 2235700 2222425
47114 2222425 2208126 2193121 2176741 2158566 2139244 2119441 2099058 2078426 2059234 2042682 2027299
47103 2027299 2010410 1991836 1974367 1959966 1947092 1932798 1916446 1900078 1885816 1874150 1864479
47092 1864479 1856060 1848271 1840936 1834723 1830589 1828523 1827361 1826134 1825165 1825475 1827483 1830692 1834459 1838676
47078 1838676 1843720 1849906 1856955 1863941 1869981 1875070 1880029 1885521 1891437 1897397 1903335 1909053 1913549 1915608
47064 1915608 1915168 1913503 1911901 1910638 1909406 1908166 1907245 1907085 1908327 1911665 1916973 1922764 1927206 1929958 1932737
47049 1932737 1937915 1946587 1957862 1969914 1981746 1993864 2007111 2021148 2034775 2047734 2061165 2075843
47037 2075843 2090896 2105167 2119077 2133968 2150030 2166097 2181331 2195926 2210153 2223999 2237972
47026 2237972 2253033 2269265 2285555 2300997 2315651 2329436 2341365 2350594 2357534 2363233 2368348 2373167
47014 2373167 2377846 2382047 2385059 2386767 2387562 2386823 2382795 2375014 2365708 2357444 2350192 2342198 2333060 2324345
$$ [...]
##END NTUPLES=NMR SPECTRUM
##END=
