##TITLE=AC1579_ROEFFECT0024_8271261_KkX4UNjri4
##JCAMPDX= 6.0         $$ Bruker NMR JCAMP-DX V2.0
##DATA TYPE= NMR SPECTRUM
##DATA CLASS= NTUPLES
##ORIGIN= BRUKER
##OWNER= Administrator
$$ 1.72 TOPSPIN		Version 2.1
$$ 2013-10-18 22:45:01.680 -0700  Administrator@X
$$ Compression mode = diff/dup
##.OBSERVE FREQUENCY= 400.02188249412
##.OBSERVE NUCLEUS= ^1H
##.ACQUISITION MODE= SIMULTANEOUS (DQD)
##.ACQUISITION SCHEME= undefined
##.AVERAGES= 8
##.DIGITISER RES= 22
##SPECTROMETER/DATA SYSTEM= spect
##.PULSE SEQUENCE= zg30
##.SOLVENT NAME= COFFEE_meoh
##.SHIFT REFERENCE= INTERNAL, COFFEE_meoh, 1, 14.98509
##AUDIT TRAIL= $$ (NUMBER, WHEN, WHO, WHERE, PROCESS, VERSION, WHAT)
$$ ##TITLE= Audit trail, TOPSPIN		Version 2.1
$$ ##JCAMPDX= 5.01
$$ ##ORIGIN= Bruker BioSpin GmbH
$$ ##OWNER= Administrator
$$ $$ E:\/data/COFFEE/nmr/AC1579_ROEFFECT0024_8271261_KkX4UNjri4/10/pdata/1/auditp.txt
$$ ##AUDIT TRAIL=  $$ (NUMBER, WHEN, WHO, WHERE, PROCESS, VERSION, WHAT)
(   1,<2013-10-18 22:44:54.820 -0700>,<Administrator>,<X>,<go>,<TOPSPIN 2.1>,
      <created by zg
	started at 2013-10-18 22:43:48.898 -0700,
	POWCHK enabled, PULCHK disabled,
       configuration hash MD5:
       C8 4E 4E 5D D3 5C D8 9E 9F 52 82 E0 59 8A DE 15
       data hash MD5: 64K
       BA DA 89 0B 88 7C 8D 1F BC 85 D2 9B EC CA 7B 13>)
(   2,<2013-10-18 22:44:57.805 -0700>,<Administrator>,<X>,<proc1d>,<TOPSPIN 2.1>,
      <Start of raw data processing
       efp LB = 0 FT_mod = 6 PKNL = 1 PHC0 = 0 PHC1 = 0 SI = 32K 
       data hash MD5: 32K
       5C 9E 50 70 F3 A0 ED F2 44 E4 DD 96 7A 2A D0 28>)
(   3,<2013-10-18 22:44:58.148 -0700>,<Administrator>,<X>,<proc1d>,<TOPSPIN 2.1>,
      <pk PHC0 = 92.28516 PHC1 = 0 
       data hash MD5: 32K
       43 27 C4 4A CC 32 95 43 8F 8B E2 54 6F 84 1C AA>)
(   4,<2013-10-18 22:44:58.305 -0700>,<Administrator>,<X>,<proc1d>,<TOPSPIN 2.1>,
      <abs ABSG = 1 
       data hash MD5: 32K
       08 A9 33 35 71 B6 81 F5 92 50 B5 FE AB DB 2C 29>)
(   5,<2013-10-18 22:44:58.414 -0700>,<Administrator>,<X>,<proc1d>,<TOPSPIN 2.1>,
      <abs ABSG = 2 
       data hash MD5: 32K
       7E 29 56 22 11 34 2D 5B CC E3 1C AB 9B C5 61 D2>)
(   6,<2013-10-18 22:44:58.476 -0700>,<Administrator>,<X>,<proc1d>,<TOPSPIN 2.1>,
      <abs ABSG = 3 
       data hash MD5: 32K
       68 5B AE 70 52 6B B2 89 B9 16 C6 F4 9A B6 18 5C>)
(   7,<2013-10-18 22:44:58.539 -0700>,<Administrator>,<X>,<proc1d>,<TOPSPIN 2.1>,
      <abs ABSG = 4 
       data hash MD5: 32K
       09 AC C6 81 E0 DC 0C 60 0A BD A7 C1 3F D6 24 72>)
(   8,<2013-10-18 22:44:58.617 -0700>,<Administrator>,<X>,<proc1d>,<TOPSPIN 2.1>,
      <abs ABSG = 5 
       data hash MD5: 32K
       A3 2C 02 D3 C9 CC AE A1 4D 26 7A 39 95 29 B7 21>)
$$ ##END=
$$ 
$$ $$ hash MD5
$$ $$ 27 FC DC 3C 4C DF 2B 5F 81 5A D3 2A D1 1C 29 A6
##$RELAX= 
##$RELAX= 
##$RELAX= 
##$RELAX= 
##$RELAX= 
##$RELAX= 
##$RELAX= 
$$ Bruker specific parameters
$$ --------------------------
##$DU= <E:\>
##$EXPNO= 10
$$ [...]
150 150 150 150 150 150 150 150
##$TP07= 0
##$TPNAME0= <>
##$TPNAME1= <>
##$TPNAME2= <>
##$TPNAME3= <>
##$TPNAME4= <>
##$TPNAME5= <>
##$TPNAME6= <>
##$TPNAME7= <>
##$TPOAL= (0..7)
0.5 0.5 0.5 0.5 0.5 0.5 0.5 0.5
##$TPOFFS= (0..7)
0 0 0 0 0 0 0 0
##$TUNHIN= 0
##$TUNHOUT= 0
##$TUNXOUT= 0
##$USERA1= <user>
##$USERA2= <user>
##$USERA3= <user>
##$USERA4= <user>
##$USERA5= <user>
##$V9= 5
##$VALIST= <valist>
##$VCLIST= <CCCCCCCCCCCCCCC>
##$VD= 0
##$VDLIST= <DDDDDDDDDDDDDDD>
##$VPLIST= <PPPPPPPPPPPPPPP>
##$VTLIST= <TTTTTTTTTTTTTTT>
##$WBST= 1024
##$WBSW= 4
##$XGAIN= (0..3)
0 0 0 0
##$XL= 0
##$YL= 0
##$YMAX_a= 631904
##$YMIN_a= -538622
##$ZGOPTNS= <>
##$ZL1= 120
##$ZL2= 120
##$ZL3= 120
##$ZL4= 120
##$ABSF1= 14.98509
##$ABSF2= -5.573092
##$ABSG= 5
##$ABSL= 3
##$ALPHA= 0
##$AQORDER= 0
##$ASSFAC= 0
##$ASSFACI= 0
##$ASSFACX= 0
##$ASSWID= 0
##$AUNMP= <proc_prof1d_extract_pilot.lims>
##$AXLEFT= 0
##$AXNAME= <>
##$AXNUC= <1H>
##$AXRIGHT= 0
##$AXTYPE= 0
##$AXUNIT= <>
##$AZFE= 0.1
##$AZFW= 0.1
##$BCFW= 0
##$BC_mod= 0
##$BYTORDP= 0
##$COROFFS= 0
##$CY= 15
##$DATMOD= 1
##$DC= 0
##$DFILT= <>
##$DTYPP= 0
##$F1P= 0
##$F2P= 0
##$FCOR= 0.5
##$FTSIZE= 32768
##$FT_mod= 6
##$GAMMA= 0
##$GB= 0
##$INTBC= 1
##$INTSCL= 1
##$ISEN= 128
##$LB= 0
##$LEV0= 0
##$LPBIN= 0
##$MAXI= 10000
##$MC2= 0
##$MEAN= 0
##$ME_mod= 0
##$MI= 0
##$NCOEF= 0
##$NC_proc= -8
##$NLEV= 6
##$NOISF1= 0
##$NOISF2= 0
##$NSP= 0
##$NTH_PI= 0
##$NZP= 0
##$OFFSET= 14.98509
##$PC= 1
##$PHC0= 92.28516
##$PHC1= 0
##$PH_mod= 1
##$PKNL= yes
##$PPARMOD= 0
##$PPDIAG= 0
##$PPIPTYP= 0
##$PPMPNUM= 2147483647
##$PPRESOL= 1
##$PSCAL= 4
##$PSIGN= 0
##$PYNMP= <proc.py>
##$REVERSE= no
##$SF= 400.02
##$SI= 32768
##$SIGF1= 0
##$SIGF2= 0
##$SINO= 400
##$SIOLD= 32768
##$SPECTYP= <>
##$SREGLST= <1H.CDCl3>
##$SSB= 0
##$STSI= 32768
##$STSR= 0
##$SW_p= 8223.68421052631
##$SYMM= 0
##$S_DEV= 0
##$TDeff= 65536
##$TDoff= 0
##$TI= <>
##$TILT= no
##$TM1= 0
##$TM2= 0
##$TOPLEV= 0
##$USERP1= <user>
##$USERP2= <user>
##$USERP3= <user>
##$USERP4= <user>
##$USERP5= <user>
##$WDW= 1
##$XDIM= 32768
##$YMAX_p= 463888606
##$YMIN_p= -684909
##$CURPLOT= <Network HP LaserJet P1505>
##$CURPRIN= <$Network HP LaserJet P1505>
##$DFORMAT= <normdp>
##$LAYOUT= <+/1D_H.xwp>
##$LFORMAT= <normlp>
##$PFORMAT= <normpl>
##$SURQMSG= 1
$$ End of Bruker specific parameters
$$ ---------------------------------
##NTUPLES= NMR SPECTRUM
##VAR_NAME=  FREQUENCY,     SPECTRUM/REAL,   SPECTRUM/IMAG
##SYMBOL=    X,             R,               I
##VAR_TYPE=  INDEPENDENT,   DEPENDENT,       DEPENDENT
##VAR_FORM=  AFFN,          ASDF,            ASDF
##VAR_DIM=   32768,         32768,           32768
##UNITS=     HZ,            ARBITRARY UNITS, ARBITRARY UNITS
##FACTOR=    0.250966925370066, 1,           1
##FIRST=     8223.43324360094, 52421,        -189428
##LAST=      0,             -104280,         -87369
##MIN=       0,             -684909,         0
##MAX=       8223.43324360094, 463888606,    0
$$ Real data points
##PAGE= N=1
##DATA TABLE= (X++(R..R)), XYDATA
$$ [...]
23859 -113810 -510446 -213826 14068 -189960 -182775 -189738 -118077 296357 -213174 53992 -251317
23847 42475 195370 71687 -246884 159780 136451 -24310 -93601 -61361 188290 -86682 121314
23835 70131 -3096 144680 -135438 13038 -9246 24810 83008 -20543 170740 -361918 -157281
23823 -53936 -167515 420171 -139014 217660 -401152 139980 -469200 90595 9844 -55822
23812 226077 -55733 67151 65379 126924 -127158 -428835 187485 -275505 -172768 -122604 80245
23800 -48639 -96841 -146322 7491 56703 10079 183388 72038 -150291 101981 91174 -250629
23788 -75799 -25306 180715 223341 182193 211703 -139026 -87905 -210815 26618 55655 -425
23776 246591 -199068 -30447 -266370 -64283 231549 60935 199939 114633 -269643 66422
23765 3998 93702 -14917 -146708 92345 -70267 -38588 -180098 -57494 -219230 95294 256839
23754 256839 -87123 333673 82064 74242 94986 276928 67029 -24357 10223 -3262 -38096
23743 -38096 -226926 264135 -72053 -103023 14644 98476 -67695 48517 -37276 -111468 8691
23731 -108466 -12477 40935 211236 -118569 115663 304403 70633 -56546 148363 -221026
23720 115197 -209608 -4934 177949 -311997 170930 337082 89304 212429 446166 -31259
23709 -108516 -364281 -12255 93838 501777 -271813 211522 -97487 -10982 224816 58335
23698 -383574 -157083 116616 -9269 -226363 -124004 -243989 164074 -44421 -116416 -262035
23688 -262035 -113534 182965 -141789 4051 -105954 28900 198781 106572 -121468 -47281
23677 -387344 128111 -423829 77332 333722 143885 28540 -191214 -282062 7615 59575 -42956
23665 -328576 45201 62313 -71858 -178694 -101736 14485 -187672 -16057 -7803 -192896 -147233
23654 -147233 21284 -161563 103029 -7299 -58427 5392 -89107 239379 78946 131217 559173
23643 559173 41026 -110550 -68823 123346 -256162 -382609 -10980 49646 106357 156845 93064
23632 93064 -170150 -166050 -55610 -206967 198234 47622 140031 -83629 -130008 179124 -79008
23620 -39042 -232726 -199480 -208212 115217 -125910 -109404 -115670 216828 205062 -140539 172674
23608 -185637 -76439 266330 58837 -102117 181145 -273884 305797 -144656 -76631 104008
23597 -88801 46046 -243060 14663 202627 178840 -67426 262440 313733 315600 -26982 221141
23585 -211187 69138 164480 147471 -108479 -72011 37594 136072 15916 -66073 264518 -190692
23573 188027 -32791 15296 5426 281372 98065 80356 -158837 -291118 -16929 154947 141510
23562 141510 -101358 205106 -306025 271997 59239 -93029 9907 -154930 -421942 220071
23551 -38994 -110686 -247813 -118421 212844 -59965 148537 -83300 -113399 74953 134301 -174652
23539 -85380 -403751 86057 -13950 -130149 -289353 -94615 39727 170119 -262625 216014
23528 -250447 -10897 46740 112203 -487733 34548 -111283 251104 109584 -197533 106275
23517 -132434 44536 14854 -225886 344738 -145722 -141075 77327 -117357 -68593 -458105 -41261
23505 -40935 365926 48447 -132292 -38477 425956 -434131 -43038 -151831 246742 -41411
23494 -123992 241761 116260 71747 54989 -264075 -20866 -143268 75051 -81180 101850
23483 -5342 305743 245620 220977 -69820 -42191 -232031 -258882 230805 34064 247053 -64200
23471 62754 1011 -287910 -403882 8626 -232458 234832 390876 234582 193162 275621 3910
23459 256625 -394145 76030 -109036 238032 -148564 -70863 150425 -93480 107782 89597
23449 89597 -261849 -29834 -209623 -42276 -218403 -218508 126425 -240103 17332 -462870 -149297
23437 10556 -120426 -66754 122361 304581 77439 -279915 -191064 301357 161865 45940
23426 224352 136770 213484 55179 246274 -548424 -190842 275265 270173 -255522 -107964
23415 131002 214703 -1871 53391 -170623 83195 -221523 -126446 -99822 134804 -137904 173931
23403 -43164 -23583 -195795 -110429 183190 -19102 -326617 -42900 -520738 84586 154915 152121
23392 152121 85567 215517 -191047 -318349 80187 -146348 78581 5492 30848 27500 -17186
23380 -118621 -307289 -76751 85052 -77772 -91602 -80273 167080 -187154 52338 -206984 -252623
23369 -252623 4367 153275 86692 -9456 91081 -41802 -333425 33686 -8792 -67118 143975
23357 162434 -21151 -55766 43148 -173515 27249 32927 -108369 42089 11840 314108 159307
23346 159307 -240266 -277021 -276133 -16582 321618 190918 12218 -103540 -173331 119168 118087
23335 118087 -85296 -210996 -30336 -70380 -78774 -76481 191569 -684909 -72255 -202457 -132229
23324 -132229 -63009 -253113 18701 -6056 -248354 142368 115392 -196094 -263744 -144166 -7567
23312 -228932 -310484 -198564 -11479 -86095 -224743 51978 -462627 -58024 -143256 60625 -40240
23300 50136 -26241 13005 -45954 147476 -393451 98828 63198 -157116 22685 55147 69610
23289 69610 53856 -87838 -262424 -185129 122878 87272 -218490 36595 -171889 228468 -66361
23277 -36406 138298 136669 302068 -74310 162139 -207983 -9122 -90275 -139662 -153147 -18256
23265 6073 -385594 259860 142351 -105508 65365 336495 7695 99782 90288 -34768 55552
23253 149672 49896 122542 -151760 -185232 -530984 -81754 12140 286108 -242120 144309
23242 -89650 -227437 243445 53236 -422305 263901 -22044 58809 -134399 162503 -273459
23231 330294 -210998 -109784 162992 158722 30603 133162 -134040 56089 -54248 38970 -120423
23219 120847 87244 -144815 149628 192506 -170370 -138761 167081 41794 175666 140893
23209 140893 -37295 -262467 29172 132255 326521 -218286 -290656 69599 122076 -137945
23198 29460 273779 13776 -144823 -216630 -213620 177785 -176900 -79192 -68669 60200 -219493
23186 -177336 -107430 -330238 150434 104427 272912 -325152 -95954 -109069 193688 -7167 148668
23174 -167392 85550 223475 52801 255299 -200425 -289238 -6238 56825 279364 -123314 -135601
23163 -135601 -221858 14545 -10247 305781 -312972 -205755 -34200 -158369 -369849 212650
23152 -159626 -73848 -155788 111593 95562 2093 -23697 -556526 -18399 -174300 -196377 129608
23140 108852 15919 59464 -128981 -30642 139588 -55784 -231320 -61751 50644 -386808 423985
23128 -344919 254608 116727 -1769 -267360 -42124 121869 168929 209951 -201563 -7168 224281
23116 37584 56839 -225733 245542 128478 -141398 19881 86842 158757 202861 -180016 -70940
23104 161343 -125750 168748 37431 -266512 -305058 -47937 159122 136638 143845 241962 56441
23092 -76477 -34679 138265 -112422 217878 177434 -246121 -130618 -44114 -9233 -139379 150639
23080 -233576 246319 166266 78926 -138594 -90825 212643 -65861 -29635 180732 -252965
23069 -168428 231937 52365 -75251 -195362 141528 25505 -29984 -48287 17014 65828 47748
23058 47748 114165 378678 6242 -33619 253852 82033 -113225 189229 224957 60090 -100834
23046 -92816 -30735 64578 -26621 239717 -217917 202678 130594 -8710 -112243 -193870 -83824
23034 -144486 -148885 -111941 211072 201360 -343053 99151 246784 47231 442733 -66746 -94625
23023 -94625 -106116 -105964 73572 59887 224576 -397396 164198 -315840 179295 -81833 37544
23011 93612 -287175 -79198 54593 -225949 -233089 -11467 95232 -44851 -46097 17914 -137407
22999 -3975 -14085 84511 70293 179121 -178234 60642 -49483 39557 228274 227239 73479
22987 20386 236392 -14678 210553 -115012 -176821 -374651 -51513 168022 33766 295535
22977 295535 -84752 -101071 104425 314487 28637 -45613 28934 -132775 -353493 -342132 153776
22965 -203233 178896 -28366 142654 10605 -109322 -220120 -30221 166177 -168059 -88232
22955 -88232 225200 -44379 -7462 -47191 28451 -43928 -174944 28314 -108301 -255214 2537
22943 -208022 -73817 152929 -14745 199658 -98333 -29436 -108563 209746 74664 134749 -82060
22931 -118263 -139061 -127518 -200789 52716 -209277 73926 284933 20741 217435 -164651 171133
22919 285917 57934 -294440 -186615 237806 -41147 -169737 -17513 -263310 -194000 113713
22908 -17576 -51320 -33911 104664 -299279 -159173 15803 57904 -70519 65150 57134 -162592
22896 -74527 66809 -16798 -152388 20864 -404321 -99674 -213191 14127 -5638 332500 -190797
22884 -28972 -32830 -193474 249903 -197679 24161 -234465 87993 37201 218137 29576 168556
22873 168556 -458731 -161931 -9318 19973 249235 -135445 -235328 -127585 -166 296810 -52295
22861 142794 41610 -81179 134233 109154 17923 -269435 5729 -13300 44798 -217006 39454
22849 229800 -104107 42693 -12290 -256417 -50953 412327 -195052 158025 -51167 213754
22838 58358 19850 99750 339021 78949 -24175 -54109 -90123 -93611 73048 147268 -135312
22826 238517 9645 -125932 -5460 -318278 -146358 -179819 -178415 237833 167541 -43886 -102728
22815 -102728 175508 -181451 -194961 238414 -113131 -368258 32538 73312 -39206 -284898
22805 -284898 234883 -26122 -62791 -71752 781 126416 -64096 -317465 129836 -283960 93586
22793 -52585 169278 -104785 32303 204416 -2855 -358235 -32454 398532 274250 -197260
22782 -119596 -159127 39798 -350148 -90097 -108659 115142 24677 -208648 79834 47226 -21200
22770 -67525 -441438 174417 459264 -210240 128901 -170352 -164946 -45158 69176 25134 -184216
22758 -165243 254757 171562 107313 231009 175975 25105 -216788 -170737 19133 218882 88283
22746 -260570 480867 -75811 217184 216271 -296124 -103467 -356223 -69509 6107 -20245 -24760
22735 -24760 225910 65638 -30903 -136549 -104359 3458 -127586 109507 392680 -59515 -2326
22723 -211690 105160 99215 -236743 17039 310230 -223906 129374 -99123 -98126 245902 -161988
22711 -113743 251282 -189981 -65386 138380 -170418 -126572 93755 99868 184976 232700 114151
22699 -121050 -137786 -266973 -29878 69683 84848 162326 -109189 116580 201058 -137774 -270174
22688 -270174 -12200 -133692 -68047 -74261 -133513 -17299 47541 -69250 258048 -54724 73352
22676 48479 207683 -43203 -86677 -259802 -179111 -127303 -122022 -46759 -30402 -177585 3183
22664 -448592 104333 182700 -82824 -79663 166510 -9254 -181216 249889 162367 -93613 223477
22652 -29538 -311540 -28421 -311368 114461 63413 -165503 64363 -198770 -33482 -70339 -166592
22641 -166592 52774 -8226 -121080 91886 -20575 -145584 55006 -125948 -131550 -262000 90798
22629 -144858 -51598 117515 221175 -88175 -7949 -87512 200701 -227580 -206385 126303 88525
22618 88525 -101064 363606 -173260 -142640 -5887 -91723 5000 -131063 -72851 -228343 -8950
22606 -155897 55861 -20366 189424 63498 128227 139758 -390859 84584 -104903 -173208 -343864
22595 -343864 -41277 160905 -140484 172882 27298 -177711 31050 -26810 228878 -89044
22584 108537 -190176 145556 -225515 -267787 -2322 -17853 -84532 -124858 2230 -172226 81385
22572 -305696 -67590 -195092 -13601 11156 148856 -204303 189969 -625554 -297440 26624
22561 206677 99475 158972 -115978 228091 -20871 317578 114126 259159 -118114 237594
22550 -273873 -126013 -45417 -53069 82546 65826 58689 42517 101335 5422 -309551 -94463 230107
22537 -157774 -102946 50889 318136 67516 -395841 -111962 -149135 31551 56216 -360225 -26581
22525 -121155 -82433 51731 -341489 290519 -177780 179558 2125 -332224 234438 -180375
22514 -148588 31676 33718 -85722 58371 -90226 -85597 -185637 -280466 -163866 -18740 75735
22502 405031 100137 9473 209261 -218368 110896 -399736 -9324 194170 242430 -307976
22491 141561 180174 -149118 -152242 211106 110051 -11820 -15747 195930 505626 -179339 196081
22479 -160542 16690 -105313 -50762 191715 -228190 101220 -237927 75636 -171721 50924
22468 -97869 128802 -208122 -125992 8412 -65345 -190941 -43111 46487 18951 180126 24556
22456 -229872 -171898 -72712 242730 -91257 109139 -257124 -25432 -157414 110602 33728
22445 -187365 29244 -143714 -187128 21333 138729 -229093 177800 -41315 23195 -161039
22434 -257689 57234 386506 -307 31925 -323692 -271650 21735 154801 115384 -43178 -353725
22423 -353725 -106618 71501 131374 92738 -111648 184613 230884 212385 -33323 195427 362874
22412 362874 66655 41049 129980 123809 -20672 -248232 -48558 -175729 -4113 80144 -145454
22400 148033 -36423 23406 -23073 54907 110347 25763 -14823 3991 100463 -219062 -46486
22388 27138 -72600 -267097 291112 -13582 -50988 -99701 45963 -130952 134447 74505 -105146
22376 245814 37114 -50432 -74453 -251832 -193689 -222066 -106628 -214435 85298 -92097 -92287
22365 -92287 -26660 -170289 511546 44752 -206826 -135858 69421 -196535 90937 -215826 -282059
22354 -282059 210959 -36488 217262 189985 -261452 27754 48390 2417 -97851 85675 -71916
22342 -227424 -470671 -151195 125724 48237 -294476 23437 -199983 -309445 -86231 94334
22331 -188327 -357887 -44433 -462 -135689 -192063 95371 134574 -323671 162676 9929 20365
22320 20365 -248909 -64235 -190705 30322 65402 -98472 -219839 -292225 -18313 -186348 -135521
22309 -135521 12901 54615 262923 18873 -82400 -94691 358860 46834 177119 37314 -30481
22297 -157430 3950 156833 -344566 325645 295749 -298159 -87613 -270058 315940 113464
22286 228562 -175379 109466 65386 -34779 -91450 -68396 -72646 -58624 -298657 -262962 196821
22274 -215888 100883 -357269 -46442 -224258 164163 -156433 -24018 -122318 192938 84770
22263 -159612 -367516 175521 -74731 60661 -75542 -267858 -68749 36417 -68391 -57423 -101733
22252 -101733 203960 58129 91614 -30367 2728 166463 -50434 -87675 -188032 333932 -151116
22240 156641 129147 -71343 -201791 111524 98956 -126168 -84632 -314144 135157 164127
22230 164127 186475 -182453 -291299 -333770 -379969 45781 -12898 -10206 185928 538898 87203
22218 4716 -213596 -309425 -37353 -177063 -453415 179831 9557 196020 245540 -68879 -299699
22207 -299699 -245442 69518 -262976 -115423 253608 267136 175095 -115012 -66193 -481988
22197 -481988 93269 -205304 26002 -8092 -110189 -187858 -152492 115181 -215447 -263990 296752
22185 -153080 54235 139822 262615 65002 -191822 168323 43912 461888 -370162 103022
22174 -191924 -150700 180370 323368 -256828 -148003 -103707 -267038 -174291 64841 77540
22164 77540 -174766 -275463 -59841 97170 -318465 956 -53668 52477 236154 -469453 -154279
22152 17584 -141910 -257666 -113089 123067 -130619 159629 -175976 -138490 -80250 190835
22141 82129 60733 61886 180181 -97284 -81536 -249691 121169 -64997 -92978 -196937 50305
22129 -23800 111361 -100535 -45646 73514 -94895 187425 -198530 -170459 55834 -60936 3006
22117 -285480 -305294 23695 -465711 -131610 25564 168176 -102304 87585 -169840 273795
22106 152451 -31858 -77029 -324274 15818 -274458 -129083 200916 73586 54144 -16316 -88364
22095 -88364 -95793 -27151 -164569 -83218 -3696 95256 -86889 -227868 199588 -81016 -9181 -201841
22083 -201841 -259160 202500 111281 -220507 100371 -26597 -237306 -216805 26986 -221397
22072 174420 -252052 139581 -177199 70066 48794 -52147 85564 123217 -107730 -301886
22062 -301886 2578 -82742 -264975 37341 -120179 6406 -197515 -78685 -218050 207565 62931
22050 -389781 -17917 45113 -604680 104729 -173059 43411 -46481 87400 -103127 51389 146489
22039 146489 -174645 -148904 349705 -191593 -12861 6156 114701 -115831 -10486 89072 276696
22028 276696 -141432 -74230 -83235 95614 123662 -58599 -157942 186909 -21934 -780 -93913 -335567
22016 -335567 -398538 -250058 -92461 25967 -89497 -136395 39626 4993 269149 40974 -80238
22004 -230298 -95111 192778 188358 -369037 -153665 -174303 -42986 -25327 124181 -195691 -104874
21993 -104874 -13460 7928 -23882 -245945 -249967 -4652 344372 -192842 -14295 312469 -114024
21981 252924 -50127 -267074 90635 28970 -23219 161386 -395611 -46394 -262641 2002 -117140
21969 20588 -341754 225292 257779 -45301 17441 79410 -276130 148185 6845 98159 -259396
21957 -86275 326687 -225252 29361 -198556 29517 34651 63893 -1988 -230145 55763 -333929
21945 -257733 -155875 -108018 -106081 -451769 -413409 -110291 -446331 345808 38162 105229 -122151
21933 -5765 -604900 -109038 208679 265844 -45211 12960 -153065 107610 -347471 -225928
21923 -225928 88377 165043 121844 -82977 -112517 220129 58986 -260589 -163550 -237588 446862
21911 -100033 17410 246046 -174226 -105595 75301 301491 -228684 96920 -172596 -58868
21900 140528 -204375 -214962 246956 -236080 37138 307348 -69705 -111087 26868 -83130 161297
21888 -132355 196052 -101482 -44671 -262991 102418 20641 -59785 89031 -3270 -198958 64397
21876 -149760 491362 90445 -180123 -370641 251457 149158 57546 175419 373636 57658
21865 -198102 -169022 -43301 -150808 262683 -152264 22664 19880 169897 -137761 -220035 -129782
21854 -129782 -151657 -126991 161140 -141318 -160490 -188886 -136532 -399321 74246 -25264 85559
21842 100432 155437 -52487 182682 -107631 -201868 327683 348953 -199173 -10602 409147
21831 -140714 -136028 154749 -276705 -102149 56900 94868 129365 -416093 -138555 -46146 364496
21819 -315218 -329616 -196978 509438 50699 -243906 -37132 -1861 -104168 -27160 -127128 101681
21807 -7730 -157351 -194704 -170455 56483 188420 98271 30225 -334849 78318 42466 -235435
21795 -158586 226594 48038 -105843 -160982 108153 164323 -149836 -46859 201519 -216854
21784 -2246 314857 190305 95782 166362 -190000 26179 205565 -314594 326335 -235247
21773 -144741 70567 -55674 118178 -226659 7152 -98899 -446239 -30777 29032 228818 20727
21761 91058 -141708 -15397 -286139 -260100 -246598 -94486 82434 39349 153755 381413 -75782
21749 50500 94387 19131 137701 -105033 -108655 -176713 -215721 -216878 -252945 147191 200316
21738 200316 -137128 -132814 -321374 -19900 -135448 -85324 -233007 -419475 -7762 -39171 26171
21726 4300 -61661 -161589 -173671 -18235 -203523 -103920 -316679 -18456 164130 89674 -172150
21714 -142699 123853 -392308 -329619 -219064 -184158 299945 -34445 75697 -48706 153635
21703 10255 126590 -62333 124955 -50808 -30659 -113690 -307889 74185 -223242 -485671 -201494
21691 -128366 -266022 -196735 -176837 -27653 37175 -33243 -79801 174639 18521 50161 57051
21680 57051 -36446 84407 134505 -254527 -193465 -260611 -68142 54749 -110879 -109066 -16887
21668 126031 -152295 -121084 -230210 -348757 -102252 187715 -257368 253847 -244456 -12895
21657 -156367 -423939 -200577 463162 -146706 -1910 40376 54691 -297956 -25717 -25986 -80958
21646 -80958 -12842 46893 -326505 -82437 -139299 26302 -172293 186484 -179442 -171284 -141192
21635 -141192 -162347 356461 10380 -96659 63741 -263025 248056 -79849 34256 -160002 207004
21623 -56896 -148144 31107 3855 -94540 43560 -9134 443674 -133539 62207 -301758 -158115
21612 -158115 257990 -182964 64149 4812 40855 -208249 -447835 -154940 -178144 -278003 -309627
21601 -309627 61014 225418 -143291 -305839 -118535 -47250 -128139 239701 -93642 -77390
21591 -77390 37676 93723 121155 -259327 399403 -179914 -95401 248000 63671 -53140 -251547
21580 -251547 -62392 -13568 -32559 68645 74708 -112082 11212 271678 -100137 -140876 -28823
21568 -100614 -161098 241193 16321 -152623 -160074 -235014 79463 -80533 167880 -31802 -21065
21557 -21065 658 -45516 -44552 83882 -259893 -242892 -64747 90102 57323 -99006 -39221 -265599
21545 -265599 -278489 251890 -209019 -143386 -148458 205143 264803 -266804 -305990 -459313 -27863
21533 -101098 70802 -295711 -63539 116297 -96039 26748 196728 -135316 193943 -118646
21522 -10261 309175 -160170 46665 -66518 -3984 80298 8718 -213317 53622 -10334 -26750
21511 -26750 -3545 -60627 24199 6411 -127256 81832 -41605 -158669 -40584 216109 122905
21500 122905 -143310 -317970 -109220 20208 -63396 -63995 110765 167844 -66135 -282960 -112658
21488 -241013 53344 -142457 -380995 -77678 -228664 -263318 -344564 -128355 -264890 56776
21477 -84252 11086 231070 -329967 -153727 -404949 232993 -14992 -80962 -194159 317554
21466 145780 -135775 -33731 -203134 -146301 197733 -229396 83014 -46869 -381125 199778
21455 -291657 44449 77049 -268632 -57756 -151507 -140154 -184218 166063 -14530 -219189 -84861
21443 -446736 -166118 31251 167357 142659 65434 382041 52553 596871 469199 223403
21432 104659 281232 57140 33105 72928 866 95203 -131767 56245 -318672 -181877 69478
21420 -262084 -192470 234043 54690 -244048 130859 -32224 61396 21683 -210176 -109057
21410 -109057 -158454 -388188 82517 7133 67686 -509349 -204404 -103781 -104833 -88640 -186147
21399 -186147 -201070 210957 217197 -417512 4562 -76486 -179381 -242505 172323 -58588 -277932
21388 -277932 -230085 48956 -103229 -47433 -83784 154281 -105689 -145032 -103006 57847 16104
21376 98157 -319611 -11746 126043 -32566 -130775 349797 -5051 -358989 150636 93863 -234746
21364 54570 108207 223099 -149345 290259 -140479 -349788 70831 -55078 -29782 47762 -139736
21352 -96330 15931 -35508 -372461 215400 -129028 97503 -161408 1542 -18562 181623 -95741
21340 -79629 -226385 -198321 -78880 36654 -215698 -187846 -64416 -425350 -45544 -49376 -57335
21329 -57335 82654 121474 261370 -152320 -159486 -134880 144596 107859 -259335 -351207 130385
21317 -109129 -271451 -120274 -201502 49404 -314415 255170 112797 119004 -133071 -4939 -50443
21306 -50443 -72861 95831 225535 94219 176329 -237586 -276589 -2920 35210 -192230 316343
21294 -26371 -202969 -35132 132283 59031 -229275 -216494 -197553 -120208 92624 -48378 59927
21282 -209304 279636 6732 -157778 -197311 250354 -225461 -209125 -4284 205801 30112 -252053
21270 -118801 185484 282343 -238392 -140505 -199909 -71693 42648 -50203 86624 -79604 347397
21258 129001 -302281 36375 5185 -70523 -464767 -237268 107764 -134443 -49309 -241057
21248 -241057 302548 182320 -336927 -110742 -76051 -50635 -313245 201010 89258 -148146
21237 -180306 -39706 -73373 -148452 -360329 -72843 320945 -173241 -3679 249298 -118050 78811
21225 6431 96922 -88413 28303 40452 -243755 36163 2505 -232316 -428295 189264 -70542
21213 77923 315981 -148062 -19479 59234 -114335 56218 -215850 56397 -225452 3127 59480
21202 59480 -69376 -130628 -127980 -39005 -211466 -5414 55973 130537 -191231 40764 170383
21191 170383 -124136 -116063 -156825 13186 -477292 -151629 87840 17770 -187840 141278 50453
21179 -42298 -172917 -92498 335291 -127158 -247517 124212 253144 -237067 -312736 -79785
21168 -297267 128604 37516 59347 397125 8908 -85618 166376 -19713 -202730 4559 38707
21157 38707 143387 140128 148987 223774 103258 40495 -82101 211972 -66578 -167560 -85657
21146 -85657 68323 -165821 -347250 -358656 -244808 -535823 139890 -74936 -93653 -97459 59362
21134 -149001 90218 108203 -43689 -39508 -306727 -132173 80954 117622 290370 -196595 -133968
21123 -133968 -248624 29050 346277 11259 159267 -287386 -261764 54345 -3619 -212483 -6239
21111 -314359 171007 -294137 -126977 -105714 -128195 -245796 -58565 68721 129777 -161130
21100 10790 42663 -221790 -115007 -172453 -377030 -182155 -19583 -189186 181107 -284897
21089 185798 99808 -338160 334502 109299 9709 -85259 184478 187754 -112109 -2906 -28669
21078 -28669 -243495 112801 190941 139986 -202055 175601 -234205 -127865 36979 -115570
21067 292108 130424 83765 -212038 -99402 -257902 -75599 35850 -215978 -221571 -369976 34473
21055 -31871 -117640 248416 -308705 -122697 49667 23141 33315 18611 192382 -29139 -49548
21044 -49548 80629 -169901 28057 -228924 -266160 -276604 -479325 244077 12747 89864 -58693
21032 -323393 -43406 120253 102525 -234000 6356 -115684 203030 223616 -89381 -92257 -151908
21021 -151908 -25378 -241015 196530 -219679 -206188 80166 -15693 -176427 -326957 -172077
21011 -172077 -37641 170687 -336507 -54749 70381 -90929 -50879 47703 84715 189811 -141562
20999 -148059 -77505 -3110 -59728 72344 -76941 -200659 -136647 -51187 104656 -34568 144792
20987 -146083 81239 192997 179450 182150 158207 10587 72792 -31554 -89125 -31535 -151280
20976 -151280 254659 86008 101079 37218 188133 -32955 -67556 -253173 -3698 115446 -155288
20964 268111 133649 -68701 35052 -265043 384992 -230827 -205118 73411 -300060 135212
20953 -199542 -239231 -338840 -98621 -112286 -169243 -113030 -297631 39405 193795 -291382 -287690
20942 -287690 -50220 53811 -242327 -86790 -175351 -94224 -462075 243970 49468 -30318 -227280
20931 -227280 372321 23939 -49337 281427 41860 88638 27922 -383386 -207108 -60900 -339452
20920 -339452 -63001 83152 -322911 201402 -155759 -81459 -139316 -157011 68018 -173341 153018
20908 -322818 -194416 -120112 -27451 300219 -145472 54289 -90020 -471475 -64826 65481 -180401
20896 55301 85161 -59955 -66193 -287921 -282958 -45819 254580 -280645 -6085 -108174 53494
20884 -95222 119753 -200221 121505 -305343 -122664 21894 -105943 -242785 139831 34959
20873 -121377 -97086 116971 -169840 300281 -268187 -160953 -270487 -29513 43995 -447565
20862 -349326 -182551 -254889 -123935 -94824 -282144 -203306 -32092 113561 30191 -162348
20851 -143660 -231107 -190748 -144698 -107867 96545 121156 123282 -135712 -101828 -98024 56225 -122073
20838 109936 -78938 96972 284048 355907 45234 -183527 167492 -71431 89428 21620 -45903
20826 -53605 -189510 -117396 -76297 -99672 113287 -153033 222185 -62382 -28271 90992 -84048
20814 5915 -192869 -361580 -98646 34175 -51650 -309259 97345 -118177 -238502 238177 -328313
20802 199958 77471 243000 -7306 33985 -98508 -217376 -3031 -112362 184885 -11719 159948
20790 -245575 -172295 -307668 -165027 159177 61935 42247 -303906 -320395 87763 -68650 -44505
20779 -44505 -184942 -47565 85008 -241416 -301526 26593 306835 123302 314009 -96860 -141383
20768 -141383 -213690 -103833 39508 162258 -132468 -158241 206752 36563 -74678 -43554 -15263
20756 -249077 -32393 164633 -19074 -137882 -132075 -1212 271415 -10001 141399 21181 -101155
20744 -311980 -491362 35926 158178 34548 333362 -176578 72041 -150636 2875 -143161
20733 -34365 -120593 -63041 260812 -80994 78293 -12184 -168930 209985 8569 -45429 2075
20721 99742 -562421 -124178 48166 -188599 -198891 39229 -85043 94264 -237541 -371759 -164362
20709 -245760 -24154 -220960 -16843 -25328 -10858 -223619 184950 126647 -119366 96913 54316
20698 54316 418521 68291 -37816 41531 -8356 -222813 -95424 -228734 85530 -110889 195951
20686 -167588 -207723 103291 -376676 79405 97070 -258934 7829 76437 -88800 -24505 208626
20674 -37926 -4667 -68613 3116 250858 -468972 -138947 90567 -92426 -316190 42879 -24915
20662 -196752 -300346 28294 204423 -282950 4514 12452 -135530 4644 -42250 93935 145607
20651 145607 -400504 254169 -403002 -74183 30279 105890 9427 275255 -30180 -133640 125774
20639 -440926 -192708 -175103 -17218 -122198 -12802 65299 99763 19857 -220099 497862 127202
20627 -58778 -393899 446532 -130592 67514 -3176 -390553 -328013 -80467 16728 148402 -169585
20615 292359 -304241 -141586 -25021 -85015 83177 -4137 -172262 -98078 -327 -100116 141878
20603 -149538 59754 -126861 -113093 36961 121612 -419007 -171789 -48040 162603 -314186
20592 -253914 -157371 188391 -2193 126628 169557 26273 76419 -133278 -4597 -335622 240408
20580 -179582 174584 23768 74048 311564 -6355 85875 93391 10725 -138246 -77129 -36772
20568 115061 -122884 -35867 -376241 -31342 20 -226742 -47172 7370 -241249 36023 -113537
20556 -24872 202496 -258104 -82945 -487838 184628 -327512 -150184 -9912 -40253 86658 -45757
20544 111090 -110584 126471 143531 -253890 165549 -27953 -160310 205998 246537 -96471
20533 244056 -126942 153283 86056 -91211 -351690 -1047 79977 -175539 25869 -105839 -3619
20521 -211106 -327614 -207673 7145 25524 87972 27572 274600 11625 -273107 272665 -133675
20509 -88392 -167922 -127141 -37030 -234509 196974 40648 111084 -177620 94798 -179813 -170169
20498 -170169 226050 -24720 397074 109219 155617 -97124 114248 -40807 489492 -154562
20487 25108 -11754 -234235 -188407 76999 138254 117921 51402 -39985 -183556 -18936 -31619
20476 -31619 -71633 -145950 -239979 -59544 92003 -293647 -237018 -63404 -15819 -438649 9222
20464 206405 24564 -71869 58235 -160829 30398 135247 -165277 -146115 -39788 7763 159393
20453 159393 -109776 -129455 -443884 -165492 -14696 128843 -18609 -97880 -41434 -200899
20443 -200899 -316590 -74280 -201578 -281368 -59293 211480 -94051 -390947 -111203 -315627
20433 -315627 -100350 192778 525875 43170 263721 -204072 -209274 -37774 -2109 -142560 -454832
20422 -454832 -4026 -198942 -139568 -123301 -122969 -79082 104202 -42690 -46322 18139 -423251 -250067
20410 -250067 -35033 146952 -95982 -103563 -91456 82703 -167166 85740 144648 83720 -247909
20398 13962 42906 79887 -281771 -106492 195043 -194358 19514 -138461 -30520 108028
20387 136372 95929 -16645 167080 5497 -220499 -275154 -262329 7468 317898 74068 -105709
20375 24098 -7029 -56899 84325 -57571 -151041 -336237 38768 116338 -96707 -84155 -73586 220003
20362 -23014 11476 -93300 293929 75370 44882 297438 -144531 379590 -42960 -147396 -222413
20351 -222413 54488 9792 62065 52000 -7831 -142250 -44951 -98552 -105783 -256819 191207
20339 -49483 25398 53833 43876 -76862 -201982 108069 -25232 25066 169289 4539 -302800
20327 -287975 -137976 -323826 -130588 -85634 -12541 96940 131640 202176 -165920 -47533 -173478
20316 -173478 -175443 -212634 -336861 59057 -54012 69846 256781 -295597 -125679 -48331 -107895
20305 -107895 86812 50791 55360 -262910 170751 -64616 -277067 -227589 218429 -305535 -116089
20293 -360854 86512 -26420 -111076 346215 98643 -326954 -105358 -200586 -174043 221328 -366436
20281 141387 -84922 -100579 -105370 33699 17447 -72035 -74458 -218165 -141973 15236 29211 -228727
20268 -204917 258692 178871 -113490 -66526 -98092 -71613 189528 -125922 -209342 -252599 -61618
20256 -398057 -51959 -240519 2317 129343 322743 -197869 -365769 184942 99093 68707
20246 68707 182985 188104 -17610 248206 -385890 -112690 -208431 173607 12492 93169 -75496
20234 133706 -308173 22605 -120662 147789 64849 296932 -240003 -437689 -192257 -18107
20223 -208285 -239013 -215081 -93053 34184 36459 -345735 -34107 -62462 -237226 203073 -447328
20211 -72859 31780 -341768 -146693 -234832 -86102 -222338 -165432 25041 85553 -4885 45696
20199 54462 1427 -15531 -204508 -3633 -16759 -85558 120746 -46486 15179 129812 -69587
20187 -266990 49134 19595 -267997 -401793 -140468 -370746 52292 -224538 326869 -196848
20176 -92284 33094 -92203 -225734 -265253 28403 119795 -50952 161858 38756 102315 -258404
20164 -42213 55254 -212061 -49445 -44408 185481 -35967 46672 -22192 147304 -117389 6463
20152 -278132 -66154 128170 -227583 -117067 -201048 49262 294233 -256995 -147534 95012
20141 -15399 -38312 22718 34886 -75536 9460 -94915 -114239 -143559 291538 246512 36133 -15812
20128 -200471 23599 -140554 -113744 -401944 96250 145692 -291713 -42935 -121460 159752 -152940
20116 110428 87978 -200257 -328592 -38313 326747 74489 306574 -104668 95523 -240036
20105 422317 -243027 -22149 -122228 80012 -82660 396752 -57068 -142764 58877 -239438 -156376
20094 -156376 -488972 -4321 86922 132397 -162742 -65070 179338 -164612 212208 336404
20084 336404 -194026 -223502 -270678 -43467 -130067 26313 -158141 130044 -195712 -318946
20074 -318946 -56292 -91083 377227 -293383 183832 -157820 -62763 -264555 -35808 46773
20063 443389 28923 -119545 24629 312248 200144 172434 -193603 195284 119669 -226946
20052 -40764 -189731 -251083 108829 -88433 -10492 -407682 -48409 -196074 -101573 -149151 -240217
20041 -240217 12117 73963 -139860 142009 -281243 -126462 -190636 -143656 -89736 -93606 -144615
20030 -144615 -169299 -115717 79257 27176 -233654 -69794 -186325 -116327 -253029 -54560 -349552
20019 -349552 167688 -53900 -13493 61445 125391 -140623 117651 71417 -96954 -346715 -224626
20008 -224626 200528 73756 -129214 -53694 -143069 -71415 -373997 -74946 -225337 138322
19997 3669 -128957 -7803 -392899 -23056 257327 -207109 -80651 185214 -230680 281462 99060
19985 -180726 120930 -215171 308875 -289519 -17871 -123663 -35408 -177286 142395 -222404
19974 -36514 -31628 -203486 83419 -151717 89669 18232 -26546 278834 -301974 163846 -108908
19962 -50286 10671 -212236 -293311 -321496 -234624 -78701 -54712 188986 -215165 -12253 77236
19950 285908 -287795 110165 -103579 40627 -56425 64799 -183944 215941 -157086 144069
19939 172533 -394394 156523 -105159 -316705 95413 -69834 147987 -249936 7172 -309133
19928 -69460 -137151 -16087 -105691 93938 -122408 -233731 -92284 98200 -244781 -336570 -111728
19916 -313793 94283 217935 -1595 82753 235712 8801 -558889 -185767 116796 -126588 127484
19904 -268739 88668 50104 131753 -294827 37950 -83568 -12635 -87482 -214979 -298622 197606
19892 9739 -116380 51264 -116354 -61180 -304592 -154342 207156 305009 -98240 43542 -280637
19880 -358009 2333 11368 -137538 -318716 132748 -127478 98878 97272 298746 56888 -237057
19868 -270222 -249266 -95690 -116953 98953 170629 -265828 -208565 25256 -269181 -259952 -109623
19856 22016 -42657 113884 285402 -158880 -13329 -269099 392575 -5287 6708 -100094 -120761
19845 -120761 -362445 -14012 -215967 -113076 -75932 40472 78693 -573860 52250 83795 155017
19834 155017 -191254 -121991 -141080 -16487 -102145 17018 -129548 -85953 46197 51941 -288244
19822 -84801 -246165 -187287 257877 14001 -31401 -90661 -186599 -155169 -153647 69722 -62025
19810 -110386 -476609 175961 102357 -122526 56995 192210 -250943 170258 115766 -136398
19799 -103100 66515 339710 -30990 249733 -235926 95670 -105745 -236047 53129 -233906
19788 47360 -203995 -237791 -279769 -216383 -173219 -54216 94215 -33295 -34118 -301641 -98645 -24082
19775 -248585 8646 85010 57107 176362 -87481 157942 240157 37617 45555 189496 -277582
19763 49230 223920 142706 -99561 -149340 -33414 -168662 107941 109967 -394921 -216805 124708
19751 -94431 -212724 69385 -87190 -18108 -413164 -93666 -47165 -239978 114669 -209712 -118970
19740 -118970 -162608 -262928 -68607 92605 93440 -150295 -256219 351197 -205386 172522 -309594
19728 80394 -42599 -276029 -129466 145063 -130902 -53553 -176424 9459 93428 176292 70207
19716 -210410 -9196 124052 -96990 -105722 -366669 -95041 104120 -153202 260416 -28780 -219109
19705 -219109 -269851 41566 81655 40463 288593 -192169 184348 59204 50094 -79083 -14420
19693 -127982 30609 -8427 -79182 39730 -143312 -125738 -109838 -386809 169708 164277 -221705
19681 314447 -371843 -207491 136914 -100686 -43214 -275908 11692 -184310 -19870 111325
19670 -106275 -437988 57939 -11890 -226693 -22963 -272332 -315368 -274680 -112961 -187085 -114309
19659 -114309 -144365 -183173 -38505 -124847 -53027 -8084 140722 305928 -128654 62592 -350355
19647 -111834 -66592 258165 -102416 -46694 -53508 -142139 -156216 -62502 -252476 -384315 -233562
19636 -233562 71607 -8775 -73384 -257669 -64088 71825 163894 -139791 -75612 58204 -210598
19624 202759 -128716 82107 94516 -320535 -11568 -337367 -147040 25411 119033 25571 28567
19613 28567 -11974 -89463 -120742 29073 95133 -112590 -2339 13304 -3581 -247903 65259 126304
19601 126304 108973 -177077 239434 -38813 169274 -52211 -306174 58983 -113437 -120722 123789
19589 152031 -224089 -116997 14039 169059 -115167 186167 101533 -343389 52648 -126571
19578 -110633 68411 -69094 178196 -142203 -112493 -154856 -95734 238499 447236 69631 -145258
19566 -16904 -221779 200818 182046 4154 94623 81990 -158930 -26418 -177025 33842 30860
19555 30860 -75088 90795 -126986 -40065 62487 -211476 -190172 -83262 -344040 -247396 -161184
19544 -161184 -142552 -295546 279918 -100988 117500 -93168 -353841 4989 -175249 -149165
19534 -149165 280011 -277020 -107647 -21379 -134516 -149969 92699 16108 -287777 74372
19523 -140759 196760 -316105 142568 -33162 5357 -57699 305561 218842 -58594 -274771 -46052
19511 200216 -36691 77462 -210813 245165 -153300 -41157 58009 -27650 146678 76333 -136975
19499 -117061 -228259 -19693 -459685 118691 -117672 19451 -156537 94195 -96308 -68811
19489 -68811 -328213 -234728 12030 -128235 -336984 -185202 60905 130193 145730 -22661 12693
19477 -122223 -291995 -57485 -199136 191795 -30892 -51212 -239491 -147178 -120582 -68513 -36233
19466 -36233 -146049 72274 -82409 174648 -472525 -126797 79651 112735 227437 -26242 -120073
19455 -120073 36898 -61547 -126501 -272308 -8467 -117094 -237295 57314 -126661 28588 1187
19443 -163258 -83484 122869 -129899 -251841 -72882 -74745 -232339 5517 -347089 -468687 -25162
19431 -79809 -277816 -415611 -96456 54718 -41339 9173 -100935 222901 23323 -107838 223907
19419 -326103 14756 19200 -4505 -62313 13105 -55968 -246372 22219 -351570 -415918 58797
19407 -214283 153696 80260 -159242 157908 -216578 -295472 82767 112874 -85033 -200128
19397 -200128 76911 -215185 -76114 -79524 -165018 207233 -136244 127807 -543363 169381
19386 126836 79076 -87401 -225507 -36105 135042 39732 99563 226152 407881 -66093 -4794
19374 -9693 -190230 -186369 -75346 -119904 168823 -100135 -119068 -191602 31910 -177776 -155697
19363 -155697 60385 140921 -128299 -306053 36949 -142498 -176064 -169673 -167270 184632 -135434
19351 -343358 133239 -35007 14009 -192592 256246 91398 351793 267152 -224450 -51353
19340 -59240 59687 315434 -103606 36589 -371337 164095 -346702 -348190 198733 -6794 -90132
19329 -90132 -86258 168044 -194817 65326 89337 -44096 85327 37572 -121578 -142392 32479
19317 139710 -164342 109673 -296981 68055 -93394 -313413 -70792 253912 -21466 -30801 -261773
19306 -261773 51682 69503 -98008 -93814 -155459 69735 34666 16646 -86737 -41931 94422 243669
19294 243669 -43646 102727 49644 199092 72541 54307 112750 150257 -172865 -71405 -484125
19283 -484125 -27898 3702 92480 -236113 -33435 -118352 -117114 -28869 -125168 94394 24997 99837
19271 99837 -62182 -217734 -198366 142473 54432 -177737 -140113 -10155 187410 -101398 152000
19259 -173990 158363 -68332 116595 -335381 -147049 -67348 -225940 60382 224572 28307
19248 -180919 -132001 313129 -404003 -8742 -260908 -162171 -182765 147857 -131158 29727 -341328
19236 165434 242178 33551 110808 189630 -189434 -229213 -170617 -165463 -53059 63754 -107623
19224 -194086 -123216 128349 225575 -86318 102177 -117182 -11434 -13748 129864 -26754 -15040
19213 -15040 -233824 -68007 72229 -83134 79875 49766 -88740 -20438 -443293 178733 -217095
19201 116802 -190474 235033 -150719 -221505 119901 -244196 -415713 -94917 -17003 239973
19190 -127247 66604 -26847 -8255 -192770 -76399 -193958 121246 136945 -74239 -57566 -301261
19179 -301261 90322 -155459 -94140 -254648 -2961 -243696 -23958 -258315 -224167 -476118 -61509
19167 -74366 -97846 -340678 -202054 -152947 -286016 -451335 55863 75868 -252327 192919
19156 287270 -38750 -178983 -213314 -52023 -59470 154132 -157363 -71752 -97969 123685 333775
19145 333775 38501 241297 252838 -310717 131483 140603 222046 -350482 -160293 -119641 -263190
19134 -263190 206184 -87703 -110822 93087 94930 -154430 -150561 -79432 -98014 39555 -421091
19122 66818 -280186 77546 188808 -80531 151796 -48821 -88292 17843 -372069 97151 -176978
19110 159925 68407 257408 -30149 22409 106536 -153375 206941 281691 11838 118502 -189394
19098 -266660 -132067 133633 -73600 -334228 135239 -283779 -332524 -116888 -132219 -359423
19088 -359423 -59468 -322541 -206129 -108649 35968 -8201 -218250 -392146 45499 141870 -232811
19076 -191779 317957 -163710 -114135 -272725 204880 -224772 -229390 -55590 -157825 -139649
19066 -139649 -533833 -168835 151879 -225806 143846 -76477 -167831 -113675 114374 -10337
19055 -282663 -442830 -292688 -193813 -228096 193407 -247316 -192152 -278726 -125423 -53848
19044 -238592 119888 -311817 -339831 21427 53850 122583 -58160 351762 -76830 -222242 353365
19032 -147185 48733 159029 244883 168509 -182412 902 194782 96132 406835 150059 250002
19021 250002 369225 -268574 499887 216365 13173 -535178 -46646 111979 -48672 86735
19010 -314032 162046 3537 -65262 -59782 162446 -103716 22184 -43482 -139949 -61264 71295
18998 8968 -130689 -124744 143 -265039 83556 45505 -9240 228755 54975 128842 -103629 336268
18985 -201422 -1315 153185 -140738 -227780 -206651 32476 230066 90787 -237819 -158067 -170181
18974 -170181 -122745 269844 -245659 -100104 36333 -191658 -45954 144904 -111801 -65408
18964 -65408 -276482 -282992 68134 -255952 -114374 -154119 -177841 21960 12815 -226105 63465
18952 -32257 202906 -120231 9766 -232829 -108117 -148710 316472 89011 243894 161899 225987
18941 225987 -203618 307353 -18184 -162806 -96818 -40888 118325 -37309 160184 47633
18930 162271 28982 80423 257870 -20012 -48806 -42734 -7345 -146928 81369 -377071 -138951
18918 -150643 20754 -118302 241151 -211087 128610 -243890 190086 -27878 -37089 3606 -246808
18906 92951 -263630 92573 151845 -373263 -37126 -318086 21303 -153973 -138167 -144699 -33259
18894 -199332 -85942 -111629 -141320 -165762 338051 8061 235713 -50030 -26339 -82226 -230623
18883 -230623 -91730 22748 -582485 -25342 -312487 86208 -317230 175346 250350 -43169 -42199
18872 -42199 -92773 -173609 -320452 246279 -207382 -72156 317837 -41690 -254318 -171103 -184144
18861 -184144 -226143 -106859 -121760 -373343 -58813 -108266 9328 -183785 -139041 -40637 62187
18849 86936 -271718 11856 -53244 -226963 198028 -207599 89801 175718 -109602 -180629 -181258
18838 -181258 269062 -215318 106129 -74832 -299566 -418065 -153712 -115134 -80962 64739
18827 51288 -190763 254298 387297 69463 28245 43357 -138991 -104867 106855 33477 -197518
18815 83438 -74120 -7286 -101358 421777 95081 270393 472257 56436 -138552 71526 248364
18804 248364 266608 -133224 103402 -71342 49879 -392490 -36816 -178521 56874 18966 -285137
18792 264293 298130 -100461 157782 -84619 80482 4510 -104376 -235843 210616 -387503
18781 -182853 -49393 172221 -71752 28835 145449 -371870 110357 35763 -21190 -149478
18771 -149478 219541 -130924 -209158 -68899 184794 366251 20255 -34299 -184112 -178193 64211
18759 -73734 4521 -159929 -313814 -178125 444009 -157717 -195921 38152 -49169 58449 -29333
18747 -214406 -167029 203505 -91236 -337635 -187396 243547 192646 -91064 101572 198643
18737 198643 200319 -419684 122218 -230831 -8390 -343156 91721 -127288 342035 38016 -256680
18725 -142523 -320160 -30920 73807 417595 -70170 297624 -241983 -276059 -121918 -90475
18715 -90475 -99072 -148672 170689 85248 8460 180435 169518 -183461 -62787 -115197 -220177
18704 -220177 -90437 -207399 27818 -77674 121188 -414090 44919 -312911 -201649 -48558
18693 22285 228093 -176630 289174 -156279 154378 -310522 -166350 2205 -145639 -86434
18683 -86434 -177051 -382082 82024 192500 377926 -16583 -123586 -111455 163517 -149551
18672 -96390 -306937 55022 -131137 -324066 -169665 -209301 181413 20676 85799 -238934
18661 76158 -238342 -143371 -92388 -126826 139087 -84324 -332698 173392 10728 -277421 -30004
18649 -3404 -405592 55742 38580 128821 -38028 -52228 -164830 183783 227005 -165439 188253
18637 -66467 -421430 -297517 -211828 154531 -14861 226912 -261651 -83054 -108950 160996
18626 -231282 -52152 -250772 -543887 -3304 70819 198315 -237000 -207266 15222 -190753 13745
18614 55925 -92633 -129478 -4083 -256224 16946 305474 177423 -243709 256181 41579 190985
18603 190985 201587 8296 35831 -25990 167210 143507 -181989 103927 217714 -74706 61561
18591 -312545 249440 -70616 -289323 -59113 -281399 143291 101285 318883 -147812 -218729
18581 -218729 19514 246851 94162 -79106 52920 -72 -146700 43228 -114185 -44881 206103
18569 -142852 -10439 63006 65839 -3057 82328 -168645 206610 189633 379315 61058 -203436
18557 95823 -22409 95203 282341 81128 -417572 -435892 -250658 -296184 -32899 -144472 -128246
18546 -128246 -66273 -207403 28525 -60406 -175076 -126989 26040 91145 -304721 -151968 51581
18534 -279451 -215676 -94773 -9012 -120041 80226 -166474 7202 81901 -266275 147897 -141916
18522 -107080 131204 46523 -33334 -135839 -158320 -103600 282333 31591 334842 8434 145621
18511 145621 -15477 -152111 -217346 -27418 -44445 -3688 -67727 -69332 -92593 -220912 -239284
18500 -239284 148651 -105430 -77626 -124060 -166323 4551 -440793 -274627 -82093 -354843 278212
18488 -85890 -121629 206563 -196446 -8314 68670 -59419 -425121 -81604 -160618 4357 198084
18477 198084 -109342 351346 -95633 -87047 -264140 105518 47851 -86627 214024 138321 -26534
18465 -196165 119644 -83822 6737 -51423 -291997 -24332 -9020 59630 165138 -108755 -473257
18454 -473257 140083 -228921 174946 32412 253643 -117159 -236009 -1800 -96123 -153999
18444 -153999 -138544 -316984 -159876 53098 -107421 2848 -223352 -201020 202747 -173319
18433 -72605 -238241 -237223 244221 248046 60210 -413080 -64953 -175036 -274705 79045 -23500
18421 -130888 -126916 -406217 -74981 -54152 -143946 -131933 18083 384862 275340 -54802 333355
18409 272294 -42014 226518 352048 -167813 -323855 -316007 211131 -261341 383550 104197
18398 53251 409828 7550 -429275 -39934 -266842 22422 53172 -123057 84952 15934 80832
18387 80832 -392008 75862 -98193 48064 135572 -227785 65146 -95959 -201428 -396470 -33426
18375 110496 -82261 269956 -17797 231693 157623 21275 80376 -206819 -92048 215997 -399300
18363 -64891 342092 -179106 -72002 95164 -212562 -53055 -345206 -315992 -202470 27436 -204490
18351 -118862 -281692 75483 -45362 -74607 -154594 69873 86411 -97731 -42704 12831 -57575
18339 -32927 191644 -289477 104031 -11725 129434 -241482 -286264 -123853 164047 236681
18329 236681 -303014 98703 -364009 114541 -107563 -130538 90764 -56117 -96581 -42273 40496
18317 74929 -35158 -387568 -5958 -362182 -232980 51681 96191 -46776 -55895 82976 72456
18306 72456 -185403 350869 -57789 -364995 -52319 -30744 -78394 -408269 -160571 -315499
18296 -315499 163102 215297 -35313 44881 127385 -114213 -212689 59941 31689 -193917 -390342
18285 -390342 -121300 -122400 71023 -24810 -29446 -110654 142962 37540 -62981 -288242 151717
18273 449230 -127462 83224 -94180 19124 18662 287631 -40080 107571 -81848 -21594 -152621
18262 -152621 -4641 402808 -205276 -86255 -63431 -301823 -492451 67612 70705 -12469 29086
18250 65678 175199 -277475 -148000 179868 -377939 -230836 -150108 -337153 143048 165597
18240 165597 84355 63386 -316431 -394590 -145753 -493146 -25005 554363 122095 419567
18230 419567 -214811 -10166 -484502 -58829 -45425 -71934 -214002 203855 14554 93413 14435
18218 -104341 -155475 -130642 -69280 -319167 -243761 -138775 -78626 -233120 -351114 -327406 -94758
18206 103004 -42832 -23526 -78325 83941 -72012 361455 228608 23389 -248716 63567 -199072
18194 -147769 14280 -580022 -121237 -10131 57027 -212438 95571 -146321 -291940 -238799
18184 -238799 -33763 -91342 1390 -304118 -466047 14024 -13349 -119525 301880 -379102 17177
18172 260447 129446 436471 182789 101229 -167333 247207 -109515 -201968 30806 -247460
18161 265424 -259558 16191 73440 -27928 190006 177638 -194544 -55230 -9520 187231 210712
18150 210712 -284397 -61804 103586 -34943 -236423 -443727 -454897 162088 87471 141816
18140 141816 -304848 139528 -144720 -203320 66540 -56345 79832 -44620 5676 674 -85282
18128 242097 -205484 1599 -13498 -39978 -104692 227354 186593 -168916 -37823 -108109 163458
18116 -211192 103064 297355 -7061 -59387 -14734 273345 -21408 -336020 -33919 255597 -168781
18104 9660 -27550 46946 37537 -302097 10959 117071 149422 -58762 232754 -63418 127269
18092 231964 52837 -274834 -132644 -337099 -161112 222245 -75935 92329 23504 108810
18082 108810 -69183 287779 -59264 -17912 -81386 -89917 -59875 -652015 -56313 234074 -93042
18070 -194105 55508 202883 124547 27066 -207004 -143818 -47756 -156373 -80723 -205976 187026
18058 -242295 46148 51426 130918 285477 -186429 -176438 -257667 53525 -127910 139238 108500
18047 108500 45746 126624 -128346 -73267 -260272 -75831 43155 185417 -75388 58417 148878
18036 148878 -31280 -47367 -6427 -115236 -127971 82491 -286978 146080 -102451 -32909 -191029
18025 -191029 -83119 -80713 -155765 34256 87821 -103560 236435 15433 -37300 -51328 -42145
18014 -42145 -154221 -87408 175878 12829 -77376 -62098 119631 95603 -61741 210820 60952
18002 111104 -245748 -218495 -111756 130887 57563 16334 260473 7202 67725 41707 -35058
17990 -100299 217160 22775 99711 43712 33450 -34137 20962 48249 84424 102157 265711
17979 265711 194219 -146893 415763 -68133 -87702 -202577 174916 -224712 -191699 -19665
17968 -123930 115642 -129449 450598 -129261 14694 20745 -81272 104414 127027 -205028
17957 -287771 -221501 47143 -26180 340384 -19421 295284 182887 -373593 4847 -60353 1151
17945 -180202 121138 -101689 179621 12363 -193671 -141143 -140046 217127 33463 224859
17935 224859 -10543 -385370 -425357 86236 256173 -25809 149446 70690 -138819 -268670
17925 -268670 39145 104864 -110939 -99394 99581 -196286 378752 -265712 -142044 -229863
17915 -229863 339790 18339 120906 -185072 -2146 18584 11519 -102299 149836 -9725 -115616
17904 -115616 20126 -34424 -9863 -54025 25849 77657 338655 221076 -4510 263091 -52697
17892 -185139 172560 -113679 7007 -105197 -445168 85601 -61380 14699 133018 163760 -323238
17880 -65608 8278 -105772 -97703 -261081 -314012 43477 294613 120305 -267657 -99204 -138810
17869 -138810 -212079 54323 -5958 -5805 41854 82175 -109385 -316084 46079 -3104 -102263 -227836
17857 -227836 66205 -106146 203174 -333091 -183427 245560 -87972 278414 81606 -53822
17846 253934 61450 513079 144837 107333 -201990 286326 130508 284813 -53953 -189744
17836 -189744 -62390 314513 -245682 -167082 13664 71775 -66307 25362 -34189 217858 109510
17825 109510 193573 34893 73479 -301300 -28222 15765 395360 -257931 -207022 -225729 -204748
17814 -204748 -84141 162269 -50683 -34557 266170 -25160 389738 -40118 -102709 25971 -195000
17802 321310 64052 223445 -207286 -81181 165125 -192439 -342371 63324 26123 -150133
17791 40519 285862 -4288 -27505 -132571 -86089 146548 -224182 161384 -122184 22856 -44640
17779 90626 15662 -6731 -553 109598 680 447 -346018 -127353 41428 -277735 -236272 -56933
17766 -22396 -204649 79178 86824 -197280 93764 -210079 -209077 -458075 -108748 -245331 -17967
17754 -364521 406044 -60433 -139824 -148601 98187 -361935 10600 -256408 6874 137865 230653
17743 230653 243191 -414367 10585 260063 -136634 -42159 223533 -130014 340922 -17429
17732 422257 117973 -23863 54131 81724 -5980 189823 60619 -115475 -175107 83661 82442
17721 82442 70085 -44842 92695 -192988 -136864 -251847 144858 269512 53958 -468971 202740
17709 -67022 112998 -215922 101793 -106907 126225 25410 -67990 129975 65771 -292864
17698 -41830 212506 -119161 115965 -94288 248581 19198 -210351 129887 -16318 -8239 348899
17686 201391 285512 30683 2007 -131031 -65343 -100060 123546 -56828 -153094 239277 -9050
17674 -243140 138952 133183 12775 192730 -79888 388016 63412 -2259 -174741 195683 411673
17663 411673 -7200 251948 90986 18052 -401070 106486 -266739 -4562 138409 87987 85381
17652 85381 -91119 -513992 163105 -108915 -152200 -15345 94800 48641 -16707 140931 50686
17640 79944 232488 29163 70985 5070 43900 -297982 202308 -37546 17312 3543 -230448
17628 -145986 238632 47826 230675 -134850 163858 -61586 -103786 73966 71680 60703 51353
17617 51353 42654 27507 61044 58200 263823 -237383 67824 -50418 -345268 -25835 60093
17605 -19859 86778 28954 -209888 -47968 128793 -202174 -56150 -28142 -121848 -21285 178165
17593 11659 -63137 165529 206984 81944 -34517 255321 26301 -75447 -94851 4721 -75191
17581 -173400 118832 154912 275278 147989 221623 -97486 -125983 127572 -206766 -70478
17570 20474 55102 -112849 -204317 21526 -99128 42594 63809 -19068 132929 -299239 -351375
17559 -351375 165127 8502 440355 48998 266203 170583 152875 -32451 -82461 156471 152689
17548 152689 89024 -23501 238149 53951 148008 510970 104359 -200965 226408 -75734
17537 -9614 -7904 -72671 -19729 147509 -14864 -57812 -181339 -130769 397580 -173488 196541
17525 321681 -19793 72134 117886 167847 18261 31557 235418 36501 14191 100364 18633
17513 356127 247071 10393 347057 80458 53712 107420 215613 202325 -29710 189303 -35682
17501 104836 25896 316668 33985 -11743 -58952 5888 -108853 167482 -119772 307660 196528
17490 196528 54301 72295 -241833 210555 -134470 313509 -291162 205676 165379 -67357
17479 150100 68076 -102082 -98178 224654 226211 141796 52621 174180 -24993 139777 230163
17468 230163 190381 53658 281570 224016 -146918 -310455 -164899 222447 37998 125307
17458 125307 26230 45422 105387 228884 271709 138920 70152 -117518 307401 261493 227130
17447 227130 368544 -87736 -115110 288965 228075 49783 346017 187263 363524 382429
17437 382429 350366 239716 408881 266060 281855 279335 245858 276983 181287 378139 252438
17426 252438 237899 281858 -47701 465651 107813 335360 129574 261134 -75434 214448
17415 51486 247833 229248 211485 170759 151826 116772 403106 198929 -2653 177388 -53827
17403 64605 -1076 43122 152834 304442 376476 47042 159260 12594 26808 343145 151750
17391 169228 122943 294818 325390 -7549 326327 439544 94127 43784 79557 134737 205751
17380 205751 15771 62832 63924 -9163 -40430 294379 -51400 374895 -317749 206775 109990
17369 109990 169257 221680 303220 331051 127370 -325885 -94706 -60213 4311 -82363 271705
17357 -226755 145820 214995 471889 125450 169370 444064 312545 308436 330692 283624 332970
17346 332970 194827 14534 68213 4546 143185 -39617 -64447 391011 -15346 -91038 -90082
17335 -90082 216413 135198 210763 -29338 150951 -193106 139110 -208269 194051 -3537 142773
17323 -112162 93791 47073 146485 -78304 110975 -41009 142505 108916 175955 524981 153878
17311 154898 27915 -54732 -267669 -33565 -5689 36139 -131166 -78048 212894 377040 248397
17300 248397 125179 274708 384200 94047 170685 95164 121004 360520 319562 175629
17290 175629 127322 -3555 217518 -6146 209051 318695 105796 210043 293339 368526 222063
17279 222063 534164 283961 41481 67416 36834 329789 -67854 467399 306703 101520
17268 19220 -53144 199666 149029 282214 104602 -168414 -73350 192389 166483 553884
17258 553884 228441 282130 99597 328 -24774 245503 101761 48255 385856 646946 28806
17246 103959 203649 200918 372370 260652 339074 339759 242764 -370 -69373 -54530 301997 165517
17234 165517 342288 87227 189251 295339 105682 16973 152833 513591 90073 346636
17224 346636 448180 318215 189883 74523 239753 626958 134296 281176 241456 503459
17214 503459 -78706 200506 219023 115283 321891 121700 501213 468267 181743 -87955
17203 9291 382529 94881 288403 165308 525118 183274 388769 -155551 180572 251361
17193 251361 242812 361423 252066 314174 -80794 386341 286403 -262090 473971 541065 62334
17181 337003 60477 150427 127090 307429 598416 -517 331183 94418 256092 405395 374324
17170 374324 -63093 375290 183087 598825 210356 115491 205527 126322 285786 255275
17160 255275 483757 137018 -17259 64173 164713 270538 572916 217298 188223 56415
17149 330920 312211 286443 149811 370042 387841 228899 117141 358429 188748 117155
17139 117155 541245 149067 411287 112353 239335 185086 31144 370302 259929 310376
17129 310376 260237 92462 102126 17383 314691 272104 288764 542434 266025 750606 259381
17117 102025 290872 338068 414602 468172 204735 538834 587652 305184 28592 196719
17107 196719 574413 374400 167323 503470 279462 257171 345855 390832 324310 196129
17097 196129 677339 384862 478068 483911 421858 271032 652453 178869 552771 364618
17087 364618 291639 391943 58649 485631 325140 192359 458111 466832 304308 94915
17076 442904 39773 238500 608164 464979 601228 129673 594309 450093 455419 484220
17066 484220 444376 393750 511399 825554 311451 318959 338199 527618 267993 455977
17056 455977 613975 561407 318748 614410 416883 619022 659230 736355 386331 585700
17046 585700 562549 419563 642816 600018 600213 419090 440374 740648 745551 530917 583465
17035 583465 241931 390256 524975 454706 401434 483886 623027 715290 642383 330597
17025 330597 632252 788139 915622 370048 521789 858286 855497 733024 563899 65707
17014 304806 491960 518932 544894 836608 805378 583841 677425 729659 407974 544942
17004 544942 635412 509342 995197 890140 747460 629692 708232 765722 568441 465585
16994 465585 472220 1035397 881889 755754 1069254 729545 830775 866022 744918 675330
16984 675330 605420 703396 932176 533002 474253 729412 898683 866559 890386 995978
16974 995978 820749 500979 946355 829324 1123385 732725 889643 1276368 679505 749360
16964 749360 836579 728050 1018768 801440 1136064 909390 705983 876733 1000230 957716
16954 957716 1097254 1179735 998171 990874 818502 928818 997618 695839 1076663 1305915
16944 1305915 768424 789582 1033913 956621 1345904 954046 983511 1355076 1106716 993857
16934 993857 1015958 1277533 1262015 1078719 1282160 982095 1121459 1085036 1107961 1301510
16924 1301510 1313833 1129338 1268354 1036315 1366543 1083929 1216414 1393554 1193349 1169732
16914 1169732 1669183 1255426 1488002 1369819 1692743 1456160 1549061 1470001 1294547 1542465
16904 1542465 1760340 1433760 1365438 1585832 1471166 1730246 1658101 1614783 1479746 1545171
16894 1545171 1568485 1857911 1564939 1776370 1904220 1699319 1833381 1963105 1983103 1760254
16884 1760254 1534674 1969457 1892035 1882264 2419713 2032545 2305344 2321755 1949461 2266006
16874 2266006 2385036 2207532 2154665 2318961 2356352 2053405 2063967 2248737 2192785 2229890
16864 2229890 2596794 2343902 2252426 2604699 2765991 2457849 2604658 2562698 2790905 2762224
16854 2762224 2836822 2713717 2734057 2639311 3073132 3240784 3036095 2789240 3091683 3198625
16844 3198625 3238356 3247339 3325377 3359927 3697609 3793264 3424763 3914179 3279582 3624058
16834 3624058 3736287 3579216 3840109 3725416 4202287 4390433 4013160 4153261 4149053 4668412
16824 4668412 4499078 4756420 4647420 4697431 4987556 5168512 5011778 5372806 5423452 5485326
16814 5485326 5605413 5137252 5887591 5970613 5787549 5919211 6145227 6128708 6322729 6325134
16804 6325134 6800766 6932902 7093767 7320226 7482656 7641768 7433126 8201284 8093708
16795 8093708 8100827 8426477 8848357 8934267 9223243 9165820 9768609 10089960 10488455 10168901
16785 10168901 10728428 11132491 11233730 11559711 11856259 12461164 12310406 12717342 12989614
16776 12989614 13690850 14126501 14831527 15275642 15996473 16334764 17091475 17077616 18034995
16767 18034995 18667657 19169789 20057884 20605765 21629663 22502853 23596241 24339555 25293766
16758 25293766 26543419 27755684 29083207 30417680 31623222 33101966 34721456 36479307
16750 36479307 38026853 40119668 42344071 44701432 46649345 49426291 52200457 55016681
16742 55016681 58280104 62034139 65796580 69817494 74021027 78246171 83796663 89179529
16734 89179529 95242964 101548680 107748088 115199387 122742235 130714264 138613258 147266565
16726 147266565 155827309 164232103 172444406 180754616 187723164 194324558 199342675 203119936
16718 203119936 205509485 206978513 206091486 203901023 200466153 195704291 189617410 182785462
16710 182785462 174624461 166520070 157933199 149611299 140412650 132218086 123704139 116080384
16702 116080384 108880428 101762186 95476804 89274769 83287886 78145532 73300975 68678698
16694 68678698 64783220 60862210 57522479 53922693 50849619 48113177 45527992 42977064
16686 42977064 40537713 38481969 36494820 35015118 33358374 31589058 30201152 28626399
16678 28626399 27637456 26060281 25164383 24085865 23138825 22029289 21195734 20345112 19504492
16669 19504492 18673322 18071329 17368714 16804837 16036719 15467853 15026903 14570833 14031044
16660 14031044 13883045 13243289 12780654 12501875 11702846 11464713 11086824 10744281 10496923
16651 10496923 9905082 9813799 9748155 9050498 8919322 8746179 8467195 8115897 7863645 8094096
16641 8094096 7542864 7427165 7311099 6978547 6795032 6503881 6269806 6487823 5895701
16632 5895701 5833769 6101848 5743955 5776720 5381322 5486696 5106023 5080937 4864311 4807952
16622 4807952 4915645 4696954 4879977 4449203 4193458 4427351 4431582 4073675 4374923 3912189
16612 3912189 3892090 3858608 3783002 3583993 3756027 3528901 3154342 3362695 3019702 3081845
16602 3081845 3289491 3201356 3398290 3169029 2826280 2752791 2867944 2852603 3091569 2964073
16592 2964073 2608355 2899097 2399494 2720795 2468504 2183470 2208428 2450950 2209016 2313129
16582 2313129 2122967 2065771 2225069 2424141 2217120 2302066 2138426 2048884 1857809 2086324
16572 2086324 1447836 2190031 1706698 1733902 1853240 1575867 2103178 1520443 1742690 1627902
16562 1627902 2019094 1979751 1622892 1569292 1726887 1439264 1683132 1604790 1418179 1521023
16552 1521023 1566937 1172693 1512592 1323468 1284549 1591943 1199961 1297976 1499023 1143310
16542 1143310 1629162 1141378 1511591 1328823 1137276 867973 1233952 1332171 1198454 1146165
16532 1146165 1175044 1256793 743296 1138717 1244805 771429 1333088 1042532 1111906 773955
16522 773955 1196963 881819 1157725 1131413 756656 1105878 669375 881018 992991 819052
16512 819052 985821 892134 830958 827844 613376 648575 1317868 651180 1099812 970034
16502 970034 674544 693566 860594 685994 829564 966099 825745 480618 736368 784742
16492 784742 197352 654403 648363 972719 729401 449151 839241 692667 805957 543081
16482 543081 914031 420277 548104 776702 698050 693923 421482 829089 405543 491548
16472 491548 331081 474944 135867 330308 407395 525133 743644 357583 689047 473803
16462 473803 616102 968302 543227 637038 445378 463937 598474 571562 256684 290374
16452 290374 578340 282684 547232 477499 563472 534001 496837 634454 165057 666753
16442 666753 385053 610467 421035 551463 714322 308810 185226 352476 323005 603027
16432 603027 657893 480143 230152 381581 507162 475739 236938 36602 477849 306255
16422 306255 234147 551702 58214 334497 327628 371051 279302 320389 203101 538556 190053
16410 400116 306505 263517 -48396 294637 574827 25271 195798 222210 83187 276743 80665
16398 233476 284190 161157 31565 283649 191873 291765 339193 284712 372965 207124 303826
16387 303826 365796 396330 -66277 444720 369816 159296 215675 209173 267671 381341 328455
16376 328455 78559 185502 429300 156452 483134 83919 281503 258715 113942 127508
16366 127508 125968 268142 208055 47993 33853 215939 279891 246272 252769 328594 313020
16355 313020 125509 411743 298913 513048 143364 216063 225437 275741 202902 151336 279399
16344 279399 321134 288214 257192 168572 22742 -236504 359706 58038 2695 257954 36217
16332 82469 -129052 464539 151360 179295 79488 51587 82973 147916 385354 30124 281547
16321 281547 -197049 255184 318875 -5812 194197 152419 167598 464960 32761 132190 126133
16310 126133 119496 157541 20450 118615 -102110 -12620 -111796 405328 25179 199116 -34054
16298 237463 -2207 366643 149382 392089 -63697 268341 174571 373684 3669 309755 328859
16287 328859 -56787 -76218 216654 92056 106992 -17378 89353 102730 207145 11433 140353
16276 140353 -66700 80530 33142 164784 134268 163496 274339 -156636 15418 266495 -25510
16264 -51094 158206 119103 243734 -77336 103243 59898 9932 519680 120050 -26953 -198106
16253 -198106 150211 183233 136420 35382 443086 175084 161810 37212 -68754 251343 112781
16241 -264518 117960 298258 -118783 261570 121968 -66444 338347 250524 -115820 -79213
16231 -79213 -141225 533980 162534 18331 207240 -26796 529637 17901 -93211 83897 404921
16220 404921 -117257 253047 -151521 -169878 -6501 41737 168274 -77305 149998 -874 40773
16208 -122139 -39018 26042 -241774 117980 -52001 28009 -123212 100617 166024 4369 95855
16197 95855 2781 152520 22093 92254 232147 260577 2754 -202426 -11858 21753 133711
16186 133711 163237 -14052 93325 -129629 -30224 -137222 56612 1333 44297 28153 -19251
16174 -292481 136023 164736 -292476 67076 -92349 -30483 -231223 324034 310561 -33288 -2092
16162 115238 112268 -56390 -289336 -43099 109901 -183189 -202122 -82605 181766 90614 193361
16151 193361 188709 -146911 -148617 5454 40661 31641 -185559 -13043 -110630 -141284 293140 -15782
16138 18121 73138 50423 106849 -73460 170845 -10550 145022 -205689 215704 -282600 189165
16126 251255 -99418 18692 -178315 -139444 -172371 -205701 260161 104737 66674 -33646 -226595
16115 -226595 189870 179959 -128305 86192 -147117 -161970 242693 27140 356972 86219 -50784
16103 243736 -322412 129657 163149 301376 -33300 122934 117740 229682 165099 33301 -59570
16091 -44628 -391102 398254 -93881 -297895 358419 39103 18171 -81655 -298496 -136744
16080 -42040 -33840 239908 7408 -256062 165841 172305 77559 211782 96443 -111139 292992
16068 -274807 -70014 -44260 -268877 6097 16517 -41403 -159727 -126127 -154911 37246 80305
16057 80305 -86328 -392247 -230861 417584 -38221 -125986 49617 -252620 -400400 -308543 193311
16045 130557 -23025 207253 -95431 -347360 255342 175726 53966 -306383 265182 162279
16035 162279 -66309 -335765 259877 27386 23975 27600 34421 -156388 180500 -10397 318461
16023 -352383 -145503 -28172 57543 -25131 -80289 -32006 20945 -353415 8332 -188867 56311
16011 135760 -393032 -106699 -141545 -119217 4368 -18671 21353 30854 -66765 -98447 76533
15999 134974 -53384 113343 -80987 -187658 -70885 -45657 29502 -239740 119793 -121838
15988 189397 -116577 -290110 32876 -80612 -68146 210555 246234 355522 113912 313170
15978 313170 224405 -101277 464978 -126193 98605 172246 -85382 71263 199438 -200968
15967 -61425 150194 -97713 223771 161806 -118555 62890 -177792 60331 -63073 61218 288330
15956 288330 -142108 127433 -102324 -50367 244372 -221065 198873 -74280 -386052 226026
15945 -128861 -54972 -319105 57200 -116737 -67738 -341417 -258149 -51715 -155539 -15298 -174320
15934 -174320 242326 -188001 40031 7393 -114169 -86610 29200 -208924 -390049 16844 6686
15922 -235669 27793 99045 54052 -170496 -108435 -333970 111747 55326 43882 85544 193812
15911 193812 270909 126511 -48380 63070 -118131 -111165 -82625 300 -252142 87987 -202451
15899 49579 49002 -160984 -211476 -98718 -225090 254870 -4238 -166747 -12403 -63924 3639 88845
15887 88845 -179171 48037 91772 -252885 -173571 176342 266225 64869 -259527 -51342 188048
15875 -198900 -152685 51143 108660 -157382 42342 -19889 2281 323397 -212284 -127416 383123
15863 -111044 -63021 -200554 191696 -194228 -98023 -107556 -85671 38419 25592 11874 92192
15852 92192 -44718 111632 73193 -334025 175722 34658 147894 183257 -383662 -173139
15841 -174526 -232612 -169996 7972 20547 230858 -177496 284870 -19807 -66972 -88904 -528598
15830 -528598 -83599 -46173 -66157 108768 11861 -31254 10293 70459 -287529 -243470 -402743
15819 -402743 105327 158654 -136078 39599 -173010 -223405 -440743 209612 -317396 -638717
15809 -638717 105583 174104 165045 -170214 -23439 -38236 -109343 200215 203867 152794 -273722
15797 -177636 -56961 -141446 -318831 172483 200720 -242187 -293628 -82325 86816 -263857 -48406
15785 -225573 167845 98062 6991 128427 -310198 -154221 -341312 -98616 35306 -34366 59357
15773 87652 232759 20432 78916 -15529 196314 -26704 -26339 -265622 2756 -315399 241820
15761 2517 -239227 -54649 -147558 -36481 191925 362025 92626 289319 -122978 -734 50725
15749 33887 -73428 123119 -115178 -64312 91568 -19476 -19976 161249 80979 38475 -157573
15737 -25536 73817 -46669 -130488 81762 -168702 298489 29323 -6329 -257228 -223807 -90456
15725 -199138 13230 -113963 118835 -60274 -323580 -210165 -93428 -281904 99102 123491
15715 123491 -8175 87935 77448 7021 160030 -333902 -444482 28947 165807 103042 -143097
15703 150583 73876 -88557 -145168 -9788 -26559 -297665 182785 -131757 73420 51397 -30818
15691 -89538 180748 92404 -26407 7635 -92414 -94803 295400 -68224 20851 226193 135386
15680 135386 -291270 -37641 -22877 26041 101460 90430 -220401 -132792 335049 54486 -40829
15668 188934 145630 -84732 110838 31346 191650 -196 -8694 -187437 -99783 -249460 -104180
15656 -407383 -196373 -62773 112086 -331972 -291528 -169236 -137697 -225731 90901 52833 -223939
15644 -199242 -189082 -1562 -444245 -32593 -65256 -356327 44561 -119905 -34693 -31759 72058
15632 -46361 91123 -171690 -62384 -22008 58695 154403 -32336 362668 -4032 113581 -43436
15620 41764 135547 -45783 162612 -50432 52231 -72765 -120049 -49385 67269 339796 -125165
15608 -98141 -307680 64838 -130913 88750 138640 -157075 53636 -87845 -177818 -20263 -153335
15597 -153335 6426 -179458 -171430 87790 38116 103756 3787 -127230 62688 336785 -90734
15585 -120054 124212 239871 259654 204766 375468 9867 -293337 333108 100583 -60399
15574 158104 -26977 222354 -102447 -61750 39605 -104075 172689 29490 -223587 186100
15563 172808 -59787 188352 90324 83590 -162459 -137890 58631 111436 230415 -12257 120412
15551 -97120 384061 -139664 -255683 -392625 -64660 186461 31866 -170337 -367918 -49357
15540 31448 166415 -68875 -19475 20572 13101 -15603 -241862 -45332 -156743 192429 -210922
15528 158238 49547 -148549 -124626 -205734 -55919 21031 -22833 -232322 54559 54063 -313941
15516 42851 236560 -37585 22077 -93027 143270 -194374 -42307 -157628 -7041 15318 66891
15505 66891 150320 -167105 -39390 201656 -30435 -90866 -50318 -9355 120149 161852 -6836
15493 38770 -73441 -26846 -183027 -33035 -144100 -126639 76858 252240 -208072 -17266 -167172
15482 -167172 -1860 356741 -41811 -56897 -14953 205288 144704 319876 81330 201036 248218
15471 248218 8013 163741 -414388 -289940 99979 -134392 34377 85838 6128 252483 -211420
15459 110460 -355261 -46869 153129 -227351 28361 4087 126933 71649 -34778 31941 159631
15448 159631 -190209 152121 43099 -367335 -6493 -121140 25615 -21480 -7535 -181171 33208
15436 220195 107908 156624 241069 151586 -102231 -185693 57047 364041 -278403 -177626
15426 -177626 -227551 59316 8425 -97453 22368 -195874 90290 -203511 -62893 6576 -321556
15414 -713 97765 -178423 56415 293426 -159021 -411176 154896 76273 -237652 -137631 142567
15402 321996 -24782 -98490 292497 219023 16035 67741 -193154 201626 109156 152772 112393
15391 112393 -232427 -80569 88780 -96272 -214116 50223 20809 -229603 188322 134708 -48324
15379 159414 -249093 -91741 331716 420996 -317816 -64955 -120108 -10239 -49613 -159483 97988
15367 -170927 126764 -328406 136625 -88200 256149 9556 159692 114622 -346680 -175024
15357 -175024 -191925 147703 219222 -63522 -40088 47036 -24455 156467 -6379 202069 72562
15345 98508 275524 34754 -47090 -283643 35175 -283264 -151882 112977 101312 60025 201066
15334 201066 42 88491 -138060 -161399 100819 249106 -80607 513509 110415 63754 -52289
15322 148699 -56113 44021 200083 -8778 -100685 7130 218933 170368 -88888 241326 -98310
15310 -54105 137430 270230 -355866 5437 77284 289731 34086 244556 -232186 149614
15299 -115655 -49394 -275248 26654 -165384 -5452 76661 85928 288207 315910 -32285 -82708
15288 -82708 133953 155820 82198 77883 15340 -80483 89360 -135204 -62246 7148 350371
15277 350371 83232 -54378 191875 277316 -97599 260415 -97511 206372 -46598 -114327 -317361
15266 -317361 105660 -34746 -305710 -21238 -20325 176450 -25640 446259 -125163 52372 340330
15255 340330 187834 86061 177562 -169620 21547 463278 237838 900725 1334339 1606864
15245 1606864 1447495 1268213 711162 401496 11881 228507 105131 -18300 -32620 35329
15234 279496 185990 9749 76057 -30111 85772 33993 218243 78392 75093 -14523 488434
15222 351986 -102899 -109389 -138406 27855 118286 29258 265560 293023 358771 199013 -124702
15210 225144 -78035 -170887 277711 8973 -44087 219527 229138 160910 -194320 -115865 8583
15198 461329 -148193 113656 32199 14356 166490 11154 -257781 -11213 226470 91843
15187 -86020 364633 265506 645711 59842 -101482 43962 -78253 -302409 -28036 -206392 52108
15175 -370046 46457 12235 -94119 54793 384857 198091 258339 164778 227865 33539 -82320
15163 -116807 8780 342613 -7345 -102630 117440 -41465 90625 77128 -86249 166246 -176169
15151 63284 228605 -120937 342847 77635 107443 192213 40235 211852 513587 225303
15140 -95901 -188917 257229 259917 228672 -58297 -291659 -112225 -192561 233478 617826 329656
15129 329656 250583 273611 123952 157906 122443 133363 216416 145845 297257 133751 44223
15117 574074 237938 607380 130847 74457 214335 154050 339465 -339012 381014 155703
15106 -76041 29784 349615 219497 -83879 29239 225954 28655 -89039 71295 -153973 -257246
15095 -257246 -34791 166426 -198380 204440 225222 601439 145091 -78540 49645 329107
15085 329107 219018 209050 60924 141185 550193 261441 -71990 255216 475252 168221
15074 95433 350997 304172 31862 -184712 581918 163050 56967 254434 45894 285348
15064 285348 -146033 27091 507452 72012 278330 215378 23500 245286 -205183 89332
15053 103397 260740 196807 240798 -101172 258610 122042 356072 232874 39986 15653
15042 -120569 109591 -197053 -158410 28865 242779 70306 300689 244804 258555 108987
15031 113229 474667 306020 532657 -125194 210063 327166 579203 210603 60653 197461
15021 197461 362656 -43311 -89839 251313 214719 205174 41954 12756 -105886 205862 424974
15010 424974 368612 139296 270341 365132 295387 33402 577839 335115 119412 338943
15000 338943 120958 486850 211580 347425 388712 181913 275778 331046 322706 317774 111100
14988 -276368 67912 149787 295915 246802 8279 466072 521054 159391 187112 501253 213832
14976 626804 60289 206183 188092 205580 210653 297486 252181 224837 340267 185981 -150748
14964 213002 65860 594677 63588 131926 393098 26534 503652 221979 365415 208973
14954 208973 394497 205691 128466 448032 113293 -13640 506327 247448 451141 196267
14943 442735 337218 324403 414874 283120 231837 83479 359720 322861 319435 211648 381797
14932 381797 81921 218775 6752 374945 102376 134246 73221 481966 102970 150943 184248
14921 184248 285784 154770 104179 173290 321920 432797 437406 268231 578133 236124
14910 165774 240654 18712 309730 302936 329199 385533 357712 458550 212381 109797 382253
14899 382253 185033 344636 563346 524638 322824 557338 292851 208510 271308 523896
14889 523896 506141 504827 468561 603793 112072 178571 209444 242283 567431 414321 328034
14878 328034 513605 385486 222309 466333 -33388 279237 276779 192213 527484 536185 383259
14867 383259 -124354 416744 395809 43094 145765 610613 379315 546885 593054 105672
14856 661418 494337 443043 44033 420641 347098 271849 592509 246169 513005 628831
14846 628831 383936 389612 281638 621537 231514 325362 232753 567829 345906 76891
14835 478820 284055 378625 683985 206509 720231 484146 624832 166479 370660 517648
14825 517648 385169 383643 449521 583699 431256 680173 573643 451507 481301 198418
14814 498425 476720 413035 610110 525944 671132 301340 615183 537336 422785 614950
14804 614950 440752 414772 406839 822498 591551 811423 809835 503503 582315 382446 827936
14793 827936 404657 494668 583503 937822 413696 617418 409099 765585 543907 539550
14783 539550 742758 723857 667930 872874 367552 731456 865926 794911 674512 857625
14773 857625 686736 971579 645854 621127 657733 690555 559879 595160 832528 564507
14763 564507 625221 852430 450605 471479 837218 504298 572594 436573 579520 615458
14753 615458 1017758 892602 639926 1082214 750892 356744 554909 903038 803778 506522
14743 506522 264902 646050 892096 875434 637526 593305 863327 775299 548201 451211
14733 451211 415618 841628 497516 873495 775467 717732 878465 743963 686182 781661
14723 781661 710927 831737 827917 1018421 813762 823707 732300 1008227 806845 1016538 918738
14712 918738 970073 813741 799744 951511 783673 1137915 750412 1233594 801405 838555
14702 838555 1064204 725951 874101 1005296 1128310 730951 1164797 798869 1015665 1032722
14692 1032722 701208 937177 840932 1006473 575580 761065 840694 1089467 896160 758054
14682 758054 1212794 734210 785697 1185360 991937 692792 1120078 796930 1087219 977443
14672 977443 863158 1151589 1174626 922431 1168546 1169535 725164 759089 1092149 964775
14662 964775 1066936 978965 1351220 1431748 1023753 1029714 1177837 1391715 1217895 986833
14652 986833 832612 1152326 1164813 1268618 1157812 1414789 798152 943321 1458778 987792
14642 987792 1251407 1215515 1240988 1033927 1143640 1495108 1240103 1296392 1281998 1377395
14632 1377395 1564489 1342381 1335791 1929598 1117326 1290296 1539058 1448443 1217354 1571186
14622 1571186 1161838 1334168 1193394 1336714 1376461 1388125 1612175 1285812 1319771 1523879
14612 1523879 1261478 1508760 1337885 1412936 1653040 1557156 1668272 1577427 1860489 1354964
14602 1354964 1974241 1677851 1786338 1426322 1533460 1898031 1407785 1809157 1374903
14593 1374903 1797643 1780489 1469087 1717035 1593603 1972068 1889962 2063802 1756163 1818314
14583 1818314 1852316 2004704 2251717 1760610 2142577 1966223 1879588 2187154 2096979 2062828
14573 2062828 1882030 2192168 2008276 2286384 2209018 1937747 2194548 2437753 2391723 2592244
14563 2592244 2520674 2847985 2556361 2727239 2998535 3307782 3033162 2991596 3178940 3473636
14553 3473636 3651442 4308500 5041702 5754318 8682262 13255104 24842117 37138704
14545 37138704 35719127 23450733 12475832 6548077 3602419 2657192 2375024 2201202
14537 2201202 1975877 1958012 1930661 1972843 2155608 1866411 2084336 2241755 2287472 1833852
14527 1833852 2265922 2317572 2288799 2398208 2285872 2137514 2528582 2219396 2968476 2595257
14517 2595257 2577769 2662546 2723339 2473632 2762276 2787061 3053353 2732488 2566711 2987614
14507 2987614 2856876 3032188 3064963 3159665 3056629 3049275 3253346 2995091 3197960 3392450
14497 3392450 3070400 3202234 3293343 3109940 3527477 3213500 3090011 3543505 3295164 3623537
14487 3623537 3478888 3179423 3254464 3981295 3762091 3773271 3498456 3732998 3899474 4416411
14477 4416411 3876632 3648287 3904355 3809689 4088136 4120919 4301960 4134213 4625655 3939064
14467 3939064 4277346 4448568 4444299 4587690 4635180 4699472 4768740 4592992 4593110 5133894 4861986
14456 4861986 5017729 5128247 5191740 5618073 5318383 4881344 5443547 5479328 5355469 5653989
14446 5653989 5563073 5726279 5904474 5680569 6237906 5722892 6181333 6098940 6175237 6620634
14436 6620634 6355302 6557763 6674509 6613667 6418785 6945838 6911167 6805674 7042454 7231043
14426 7231043 7147018 7522469 7652272 7558965 7621712 7387234 7637647 7656203 7900815 8302730
14416 8302730 8280114 8137743 8361929 8725056 9006142 8719429 8919688 8951170 9746741 9379071
14406 9379071 9872429 9672639 9807577 10534450 9985305 10394061 10763281 10657925 10787018
14397 10787018 11080867 11407954 11434029 11808166 11952574 12145842 12082101 12680063 12638780 12879323
14387 12879323 12903868 13409209 13323235 13837162 14162131 14040951 14573406 14557556 14846958 15319520
14377 15319520 15517583 15715062 16004980 16414002 16942387 17349851 17562760 17873633 18222000
14368 18222000 18325155 18990570 19371032 19441374 19873052 20416011 21109476 21301020 21843724
14359 21843724 22819640 23010576 23307902 23912115 24402405 25145409 25597538 26199374 26546474
14350 26546474 27544668 28031940 28883136 29481496 30366685 30885153 31793800 32719861 33544844
14341 33544844 34945904 35405370 36467434 37653181 38528642 39625305 40697174 42078241
14333 42078241 43375957 44581435 46099095 47415778 48627542 50245912 51929635 53325370
14325 53325370 55583858 57355748 59479695 61590587 63809472 65849017 68234233 70705512
14317 70705512 73347399 76090905 79427075 82536590 85402821 89549501 92940493 96557884
14309 96557884 100667771 105204554 109965193 114165278 119784256 125295178 131239022 137447681
14301 137447681 144049572 151141620 158324640 166017666 174682528 183670166 192857425 202828417
14293 202828417 213224125 224413578 235995013 248226004 261392604 274641362 288640968
14286 288640968 303503278 318232362 333727169 348978412 364385109 379723321 394481574
14279 394481574 408691154 422313890 434246318 445049009 454411309 461238544 463888606
14272 463888606 462238814 459553229 453349387 451236509 449441470 445892014 441811104 432472829
14264 432472829 420265939 406624401 391860763 376382658 360554156 344465689 328263754
14257 328263754 312658764 297762508 282783978 269435122 256218370 243532993 231004349
14250 231004349 219194000 208576320 197973553 188260571 179003066 170615501 162380437
14243 162380437 154785993 147521134 140515995 133994143 128170885 122794863 117504794 112417715
14235 112417715 107746230 102662335 98863403 95202449 91491792 88120707 84432971 81052262
14227 81052262 77771806 74942740 72018222 69175974 66752814 64707703 62381774 60514252
14219 60514252 58531262 56493327 54727401 52883210 51446000 49559543 48512326 46965162
14211 46965162 45237821 43856815 42894624 41969933 40907250 39855149 38245657 37407918
14203 37407918 35932766 34990709 34215083 33847697 32748173 31677422 31252646 29950788 29159962
14194 29159962 28686563 28004686 27374941 26207702 25568048 25356154 24722830 24082668 23312221
14185 23312221 23154558 22310838 22278880 21784054 21271126 20816158 20262985 19802878 19415969
14176 19415969 19104984 18877936 18173460 17934122 17243645 17295410 16768506 16628748 16258456
14167 16258456 16123976 15381176 15363429 15138063 14820116 14520212 14321555 13936957 14144389
14158 14144389 13424200 13322683 12809303 12769112 12605379 12807523 12189123 11791877 11884155 11642069
14148 11642069 11393581 11157421 11340001 10848513 10860103 10413783 10673496 9844401 10170881
14139 10170881 10090921 9883493 9727924 9576448 9246291 9620856 9105840 8712742 8613119 8688783
14129 8688783 8740926 8291771 8497773 8556047 8011099 8013179 8230032 7660183 7622290 7482108
14119 7482108 7529286 7552174 7124863 7217224 7249023 6980725 7075526 6752123 6811437 6503211
14109 6503211 6794976 6216583 6347981 6498026 6206779 6207818 6084558 5813318 6004971 5843404
14099 5843404 5860331 5731036 5660762 5674149 5634931 5609624 5522267 5188001 5620209 5193440
14089 5193440 5019193 5295651 4718833 4813785 4726189 5138987 4849113 4695554 4955380 4727537
14079 4727537 4646522 4826910 4599125 4590583 4434969 4700103 4205563 4395237 4185459 3879276
14069 3879276 4476173 4508908 4173785 4046997 4189792 4093135 3962847 4333864 4020069 4052765
14059 4052765 4138756 4137763 4378770 3641853 3736413 3769824 3650224 3643339 3558901 3483359 3204736
14048 3204736 3518976 3519854 3747000 3282543 3314813 3266903 3395099 3153787 3182197 3103721 2948431
14037 2948431 3209113 3106780 3146048 3159179 3062556 3301216 2953417 3027624 3018789 3016134 2940412
14026 2940412 2739178 2748404 2785103 2671927 2808474 2490181 2757436 2854442 2865906 2528976
14016 2528976 2333196 2422029 2538354 2238811 2723045 2233715 2432964 2581705 2133161 2123843
14006 2123843 2327171 2439744 1824338 1881759 2158380 2270644 2469362 2153220 2188290 2290332
13996 2290332 2028848 2104939 2174552 2304058 2153041 2218853 2780033 4084230 8168623 18122825
13986 18122825 33404032 35977481 26267537 15000530 8909785 6086900 4575482 3960813
13978 3960813 3491084 3112388 3108404 2849483 2647280 2790186 2560649 2482438 2148011 2269850
13968 2269850 2054015 2347944 2211887 2439628 2048952 2203531 2121639 1946023 2063713 1863561
13958 1863561 2196111 2112423 1688600 2155428 1969121 2100947 1963809 1830685 1669297 1736350
13948 1736350 1917818 1851620 1689357 2129356 1827763 2194401 1633023 1971069 1518818 1272154
13938 1272154 1371250 1599750 1560481 1914930 1874983 1724166 1456168 1634284 1294990 1330138
13928 1330138 1734862 1342402 1514390 1530567 1273028 1730120 1308331 1741434 1213731 1439706
13918 1439706 1484093 1548386 1561559 1392303 1361887 1324974 1386967 1094250 1638731 1513132
13908 1513132 1526795 1334983 1196423 1024548 1474100 1426948 1612646 1235741 1299722 1288928
13898 1288928 1165409 1236498 1519884 1191428 794862 1365403 1198875 1308040 1390763 1251480
13888 1251480 1446836 1211485 1179127 1096585 962031 891863 960715 1502069 1402340 996272
13878 996272 1311783 915838 1045857 1332037 1260807 1308612 1415743 1087921 1103867 907150
13868 907150 944312 570352 1257943 1222722 634908 864998 1212939 1225679 1182679 845309
13858 845309 1022519 1099770 970464 744685 1023855 831345 1039271 1194828 874545 944603
13848 944603 766821 1138159 947705 759309 1034136 1151970 923649 901759 747661 500485
13838 500485 918123 888243 1239866 944175 963648 750202 1111521 774627 838579 880497
13828 880497 1295685 572942 872584 779942 1098807 1216586 764448 952779 642131 783821
13818 783821 357568 671951 1100916 789103 658068 860697 734065 606662 809444 626896
13808 626896 649600 615008 1031724 875342 835233 1136702 711909 515790 648181 556294
13798 556294 859303 951700 996806 596161 940004 716160 1055080 970982 679530 688608
13788 688608 721412 676576 589593 489169 735593 772355 741657 860876 426453 824373
13778 824373 594429 835600 806894 499592 891250 695196 562242 848178 610641 716035
13768 716035 653524 449989 708300 571644 887009 542416 730524 665459 1106865 659726
13758 659726 633143 743412 743620 760370 807786 811434 470305 628646 676025 670093 533379
13747 533379 703942 784746 495555 578561 202457 885799 534311 578842 863761 493544
13737 493544 579219 499956 673126 489176 513316 471455 650435 430138 208412 561334
13727 561334 719659 594423 261485 331742 527802 529285 441555 425577 540277 630513 529327
13716 529327 745267 244093 458202 799079 494832 523370 457559 358914 85932 410833
13706 410833 504625 63566 413524 516926 521140 523663 658455 609516 644450 462926 129492
13694 600943 697696 533737 557740 325326 321003 882951 544101 159644 354204 514736
13684 514736 526386 420619 417988 598559 279164 428289 389749 343076 495296 290745
13674 290745 641438 443843 440893 376907 797075 319019 296773 359096 460592 295187
13664 295187 413268 754937 209112 527325 269623 560483 655413 445507 323853 305488
13654 305488 379182 473262 609244 381062 406181 373657 137516 506592 403490 366687
13644 366687 327224 405930 244726 412101 230825 429914 352393 482474 478705 394090 628202
13633 628202 527350 363395 313835 925634 518247 502835 507651 466831 452134 36786 196711
13622 196711 383623 294640 547163 51279 231470 747915 273936 206503 591325 375568
13612 375568 146578 409259 369741 273926 355133 127262 440230 322093 461637 304680
13602 304680 249659 325454 504249 757622 168215 242831 83532 321325 278724 139307
13591 478522 213488 -64667 48926 477814 676885 306067 186163 157429 128626 293784
13581 293784 522604 313759 204637 388424 193258 397467 458739 132959 306646 322830
13571 322830 138105 237839 35745 431247 218765 341829 376066 530176 205740 -46555
13560 633410 264010 532162 -181519 225383 273307 186683 273858 439279 194651 346297
13550 346297 331244 401036 82228 385389 391688 129775 418049 370881 350769 193840 181019
13539 181019 344128 129326 280234 301720 888332 380786 279841 777880 298617 405699
13529 405699 342205 177932 223858 383910 387914 98302 336656 278581 328035 359411 152371
13517 246392 382700 300146 322980 9494 670353 136549 280344 77396 332833 219818
13507 219818 80436 539055 299592 422993 497213 154884 260929 350911 259915 154983
13497 154983 392175 343512 255211 330494 309460 412817 130398 194642 359930 249913
13487 249913 325284 128486 103291 -133751 379809 246500 9218 346118 280350 387694
13477 387694 -36568 206722 12700 494918 88829 149824 98414 183153 77357 193778 288221
13466 288221 297475 140342 115448 45173 393722 -239221 35794 356720 250998 310297 -182918
13454 103013 115005 88549 275623 279837 126383 360855 388411 554712 168787 440801
13444 440801 -15664 -207427 60387 -7257 192772 -97736 201862 65792 562156 205081 157608
13433 157608 566973 -283886 363224 401071 115631 191944 307805 137495 298524 112463
13422 -115297 274758 277616 360072 31281 170900 133428 328906 797190 279504 144767
13412 144767 134104 144168 283320 473903 178087 192686 43965 370498 469113 74576 296557
13401 296557 393858 240442 -5249 79329 -143788 68956 27428 52920 -104443 275279 265199
13390 265199 171818 315374 251220 191432 304847 239004 -15498 336296 -157495 50633 513119
13379 513119 83575 129480 140684 -98360 205214 361966 105160 361890 102612 64660
13369 64660 133752 234325 275841 127115 396114 243214 266115 14661 -107372 371873
13358 34383 177622 353530 -148288 -281389 185335 310736 94347 111538 237916 190523
13348 190523 307384 290389 295123 64258 80218 260340 170380 396411 162374 123778 333753
13337 333753 325858 309949 233879 150593 -27947 68102 -33302 403773 217997 -73229 93206
13325 521229 401430 147364 269224 320563 161487 378153 166096 85668 471418 144673
13314 90246 199232 326796 342488 351233 -30806 141482 91223 -95734 -242349 64943 278684
13303 278684 143988 97275 -100424 92494 113944 23497 -67873 284808 -127191 -22936 49513
13291 196389 -166913 50394 248398 208565 -508 165243 403730 61403 -60773 -155593 -21885
13279 -67552 83593 19366 26133 173286 221149 181855 292140 313348 -55473 576916 277203
13267 194436 40917 -34359 -173501 221287 -17720 429979 335576 124888 340469 -260398
13256 256544 180605 13799 366011 123072 110661 271095 -26090 120941 53423 51883 -121969
13244 -71899 -53942 -2847 154792 268392 137122 26181 169921 386068 -36875 261395 -11183
13232 146778 -49362 -181200 118213 47519 -233429 368793 175331 308262 361875 277624
13222 277624 117118 96821 -46515 630233 222040 -158718 -64721 -3924 115860 124255 264936
13211 264936 182211 307890 140368 -8596 67936 133692 276981 53176 -234864 165403 353705
13200 353705 1255 143118 130507 -4691 228207 -243280 192843 44269 181253 259255 175319
13189 175319 208490 155637 197151 57483 216331 -43871 242952 -216956 -257343 283583 186902
13178 186902 35008 -77787 -71087 -13783 -167474 22686 59939 225992 -291917 74526 42681
13167 42681 312023 195169 246699 135656 29169 206428 271661 160835 -252154 125989
13156 -206534 -268511 20315 133951 253461 381224 120255 234517 -138639 -9206 282388
13145 169499 360284 289632 215541 -144442 270390 315393 315748 -58932 96112 24782 374547
13134 374547 64140 -400948 -101644 56840 239606 -260981 66993 320232 6947 -93788 328371
13122 -306919 189843 -168093 192530 -120551 -140634 -139564 -148832 -149188 114508 136985 276439
13111 276439 -463209 78917 113677 -286872 339744 -3580 128349 -124685 146503 113889
13101 113889 -19333 231280 -146285 86624 52686 71647 382439 33343 -179497 91026 107538
13090 107538 -52898 -30464 -140881 -11650 -92526 165856 -224278 46048 -97073 384095 152597
13078 99832 274494 -7623 157515 73788 91283 22576 62154 21876 33883 54053 -193065
13066 83710 241076 24147 269537 69933 194249 5 13915 -114117 22081 349037 281344
13055 281344 310134 16777 232771 1374 -67111 275711 -94707 138337 -270300 124617 -239173
13043 -132729 -37652 76867 49827 -8120 -220498 94377 114285 116087 467368 251465 -8420
13031 283353 86899 349230 236586 52174 -78034 -16445 123217 227597 275688 92172 -202568
13019 183420 159960 108012 246057 193088 -76354 -129194 186918 378137 129387 -77684 -168856
13008 -168856 30390 -23582 -92242 16438 307097 49099 384230 252392 173164 -79374 171215
12996 -308794 -66966 8656 -131661 215349 286424 -43827 102579 14226 -77055 -136346 133256
12984 19414 -92494 53951 -112361 189587 -87786 -122971 -7409 -47248 -26208 30440 102792
12973 102792 57830 136916 16558 178840 86683 110084 -49500 101999 -160786 241440 -213922
12961 143698 156776 -103255 281853 185545 35345 -73399 -397177 -64589 225697 19807 98485
12950 98485 -265179 85100 -66305 386041 147504 62233 31228 -132848 701080 -10481 108248
12938 48181 -125783 284808 322529 1138 90235 -77941 53578 159425 -249740 141563 178779
12927 178779 -97755 -87991 316791 21334 -206108 -175191 284471 28182 305544 71380 -231933
12915 185244 -473551 402942 -121138 163271 184512 -89785 140628 156701 118049 95364
12905 95364 178255 216177 -184175 121677 231680 57796 -125898 46367 -59092 242254 -26763
12893 -68603 -199016 -58245 194773 161281 292295 98809 399520 90096 34080 -15162 -9126
12882 -9126 -62693 268929 -99944 119860 137483 -331751 -73944 -190145 122501 -86568 -67661
12871 -67661 157341 60734 133979 244719 -155348 162997 250932 111896 -193270 -193793 10527
12859 -49619 168630 98269 202405 64302 -8951 -109932 -166470 112317 234617 -93771 -3363
12847 129713 32323 -158175 -182957 96623 39487 277909 105891 389367 -37822 -196664
12837 -196664 -40115 292845 -46795 191742 -212545 -127300 5879 -225073 -249667 152440 171394
12826 171394 -105041 69079 256202 108041 -38835 112614 46238 18587 -190034 174083
12815 351006 52535 140638 179084 -57762 150655 126628 192792 221557 -3885 46010 -171024
12803 -28135 -99918 -144876 115962 -70330 17188 -184796 111537 148727 33048 -23693 200101
12791 -127752 188156 -26621 -222270 48485 238911 481784 -30292 12653 12237 -74792 -101410
12780 -101410 231229 -238982 173286 75164 -75049 337284 -27320 -126981 31241 283930
12770 283930 -74445 -411957 -238494 157421 -39240 -7173 -45220 3118 13544 -449309 -245247
12759 -245247 -206771 -154943 205192 231844 20524 62983 -373678 -119910 -125990 -142617 261417
12747 -68221 24987 -98256 140107 -291809 -105591 -5737 -421079 259488 268735 -112849 109045
12735 249691 -121000 148675 187536 -3938 150631 285401 -106657 307072 73561 277992
12725 277992 95418 254780 330935 -193004 -118096 -101944 -108176 -78251 -78818 234603 -563643
12713 -88773 -98422 142620 -68629 153628 153703 192774 249653 -381031 74464 -61457 272853 193508
12701 193508 113894 37274 -103261 -71788 124485 245072 -137249 36738 -27582 178308
12690 80644 194972 -151034 -59893 92052 -170836 4706 -109304 216542 105530 -125430
12679 237550 202527 -44263 89813 149152 -121043 198331 56889 68777 -141326 10237 -97411
12667 325764 82937 -112644 -75247 -193518 191420 -71180 -60693 107143 155851 -39796 117853
12655 -119635 -37906 221941 -55074 -35447 275480 521533 232198 202225 211046 79511 136269
12644 136269 231018 298239 -8071 243156 221637 269709 78701 -163133 111140 -24220 -97460
12633 -97460 -59136 205496 211579 219779 -133301 470703 379423 121023 380244 -211280 99065
12621 83572 87735 252220 166891 108686 -53774 -1957 136038 75954 32847 79285 -163376
12609 166983 -181382 116330 15306 -155957 390134 23603 -31683 -203718 23177 131885
12599 131885 339919 332792 119753 64694 79099 -113952 -81671 469822 -252034 -39725 -33721
12588 -33721 329680 112017 -219393 -406707 125963 -46364 36524 139981 1067 -213563
12577 70552 -138670 238464 -36487 -40904 643 20199 42833 -34273 264761 69492 -951 -31041
12565 -31041 12911 104639 -103831 274042 -31145 26468 52848 -286889 -100184 -152368 41629
12553 -150151 -159636 239374 15552 -125540 73123 -50578 -278280 69279 111792 1938 -403658
12541 43782 105477 -7729 8762 -471692 95766 -385110 -96630 175176 61290 383582 428537
12530 428537 -111861 -17202 27617 118541 88180 212521 232184 9417 55914 -5645 183269
12518 -103644 55042 247422 208088 -68714 219260 -372361 3495 324557 -126545 53982 -74850
12506 -94866 -126408 73728 -70484 62992 222477 -218710 -20356 104032 157005 -79182 130194
12494 37780 79318 40397 196554 -185540 8377 -85520 -140930 315630 -38236 -40090 -183079
12483 -183079 -297401 136941 -28941 -109181 -15333 171089 253253 -163709 -250493 -171491 135799
12471 -26700 355296 -46685 -79257 68710 -173375 162291 -321479 -192814 -190698 -101505 -48247
12459 -79303 149835 154733 25365 76787 -37188 -29372 -253411 -147388 -274321 -147463 -330069
12448 -330069 57539 -196150 73088 128920 325058 -171387 325197 -134120 105493 -90109
12437 54793 12810 59338 -99900 -118083 120722 -149933 225894 -98510 201890 304483 -62129
12425 151980 274201 -97481 240588 -163332 88984 -62704 -107983 -125083 29654 118210 -40624
12413 89356 17481 -100376 -129442 74852 406329 130021 -113359 -226006 119128 -241279
12402 10571 94166 -157771 20824 -23887 -34523 -475469 2798 95292 -254507 185890 -362024
12390 89679 -298438 348030 -29035 71181 -70433 -106877 -147749 8470 152397 -99587 -87218
12379 -87218 -19687 -8250 183581 236634 51149 -107514 -107040 104668 158161 64397 28310 -45236
12366 102540 200296 -26952 -125315 134312 -102062 -92957 -41316 -208502 21507 -171636 153829
12354 -288177 -317966 153734 133322 82750 -53222 -142859 -62327 258042 146862 -232198 246278
12342 93157 381173 278273 18623 -42720 -73341 -67179 -4255 178822 103261 -304811 -180953
12331 -180953 -147133 118962 -169743 -58196 -137299 -354446 -35438 114909 -84370 -54602 -125225
12320 -125225 103879 -169417 -267588 -205441 102405 256291 388732 -110156 -9620 288125
12309 -85291 -13154 85165 -147742 -96009 -269067 532481 104836 106729 263050 15124 51692
12298 51692 87586 -75781 68521 -86054 145449 -85212 -37772 23449 51452 348365 -108299
12286 260979 222956 -77274 142812 288964 -176343 -399259 467807 215341 337670 375990
12276 375990 106672 170306 213547 104095 84539 208275 -60368 309812 197766 -103105
12265 -112605 301759 -32194 88633 179878 21700 38742 -325898 -87421 -164502 -37998 -124100
12254 -124100 16381 36149 -59627 477119 -166421 -53629 -43717 -214519 145658 232031 354114
12243 354114 65492 -27511 -105609 223330 118167 123948 116521 -71010 182543 -224193 -133676
12232 -133676 55458 424068 335570 29988 205054 145681 -106691 281749 21015 105991 103244
12221 103244 583173 372836 477789 440918 324858 221159 222466 158580 155628 -53940 51667
12209 18302 -4913 182955 96170 349472 410179 -44219 296312 -48847 -3468 -78116 119192
12197 110255 -133142 313795 263418 507702 350486 190944 -18006 40921 283053 -176991
12186 118654 170318 -15308 17711 -108437 39500 226400 156130 147256 -5431 -88038 211394
12174 338564 66218 108846 -148740 217039 323283 140543 -22548 216297 281482 65341
12163 249750 -7137 480406 126791 17571 21992 -223713 59992 89418 294150 -305156 -166227
12152 -166227 -276976 -235299 212648 288967 -29523 -82346 399942 146646 -126048 -55025
12141 -143774 330697 123214 -79266 107013 266304 230501 -69416 -177965 354575 229342
12131 229342 -19038 -101156 -65941 106555 179527 166931 131855 -26787 191405 -7968 271866
12119 44915 -130770 -273511 -474179 92152 149924 -17393 1711 -73069 -16547 31374 -134990
12107 -45235 -74354 -34921 -112010 -50697 99819 -35633 150463 183172 96838 -32440 -129717
12096 -129717 -135747 68129 -69599 -360641 122470 -19858 -56368 105733 281593 76412 -159036
12084 113457 -142143 -151662 60157 -91925 -186406 123673 389619 -76231 -25132 42622 -56669
12072 -379672 -170594 -108259 141041 -48499 13340 -113799 98658 81436 768214 1669707
12062 1669707 1350918 770168 198853 55858 -10993 159886 27876 -166856 -192884 -141831
12052 -141831 -37069 -160868 65530 291279 -49542 -192427 362711 31808 202801 95707
12041 -38138 -265381 -56932 -303657 -348713 146927 109179 176294 -98970 -11338 34957 190139
12030 190139 10003 -297497 -45813 -157427 -72719 64440 -115828 147583 -42313 -168565
12020 -168565 183184 -270369 94352 -114750 -107229 -214679 -44904 35124 76409 -9918 -17320
12009 -17320 86807 -26992 149101 -161063 200152 67603 -41376 -323776 101494 222812
11999 222812 -114506 43220 -216296 25135 129162 161307 36961 222928 268842 18 -245929
11987 -91982 90237 355907 109777 -226177 137461 -68728 -117843 287335 258065 -57534 -199241
11976 -199241 143764 -24709 18455 -238278 124148 -88905 -68844 -97385 333511 -20279 193220
11964 -132466 -352525 -29563 125246 40266 -54248 43156 269534 -245281 -32287 110740
11953 235022 -256118 198375 -119488 -138048 -186741 -62490 152622 -43524 -105277 152730
11942 -329336 -243892 72494 166899 -221890 19240 3470 210884 73858 -346469 342544 301954
11931 301954 163057 220080 13229 328928 136943 38684 116570 58253 72979 -147502 -93000
11920 -93000 114516 -54473 63908 93845 -104137 -46716 141580 -2681 -233936 -26081 -278469
11909 -278469 -272182 99999 191422 -92163 43574 216297 57307 -83871 43029 -377364 26036
11897 -292385 -89843 111148 24653 59668 -53281 -120775 -40750 -128831 -227257 -146911 -320414
11886 -320414 86552 78752 -328156 145994 188565 -87083 268555 -119578 -383725 87837 28760
11874 -34899 -16427 -9127 -93431 -160714 -16618 -228167 -153830 191047 -227223 -204038 -109554
11863 -109554 -84003 -194590 27585 224565 -113855 128933 157993 1758 -42179 -339707 -65638
11851 61284 -106719 -159009 -192936 147868 354913 -249214 -215592 -107059 333203 -163628
11840 -75935 164193 6308 -218734 -162379 325138 -127347 -179298 21080 -271370 -128121 -117657
11829 -117657 316166 -273191 21957 -26373 -433249 57366 -176479 147082 32762 -158620
11818 -289194 -60847 443617 -125479 -235848 300921 186317 -449367 -74453 1221 -131059
11807 -340921 106561 -535594 -255386 -26179 115439 56506 -251445 106647 97761 7359 27440
11796 27440 31791 -3837 -153955 154192 25549 85481 326237 21852 -179742 -72227 197935
11784 26868 400155 -69919 28470 -33447 45878 172005 -89 119122 194018 -15814 473274
11772 -47262 299679 -3230 56540 -62919 11493 -245685 -198555 195557 -118801 33381 234816
11761 234816 -72123 -192491 -121097 178713 -1320 60886 85375 8579 24197 -50412 20060
11749 147669 112640 -302298 688186 219990 53276 14545 19401 22511 -18886 -252295 -265119
11738 -265119 165940 80635 233188 43270 -279478 75509 121733 -19437 62905 -222456 139616
11726 140393 -14895 28886 -172723 -158420 7196 10486 52615 -116811 -99716 96427 67149
11715 67149 -105021 160111 -18245 -101414 -93095 375114 -240883 -143069 13400 -217494 -136732
11704 -136732 328649 -151912 -155128 298396 -255674 31380 22294 140287 -121851 173458
11693 -426611 482567 -163841 102455 -38370 22379 -82788 4262 -109503 211023 -17422 -3988
11681 -60131 66199 190977 -17725 51682 -76712 30773 -101831 50972 45475 290628 2461
11669 21950 -18811 70325 -171848 -403800 -58424 -89122 30368 100661 91195 -274935 16505
11657 -248389 -170796 136394 4611 82507 -89514 110531 132902 -17540 -60869 -100436 -10793
11645 -105994 67017 -255735 -81832 74968 7859 316218 280906 -107792 97087 -125440 -178965
11634 -178965 -23706 205606 -411173 149720 92053 50116 163200 -112345 235436 252554
11624 252554 268770 178186 -2323 -20623 -106617 -350721 133670 -29350 -260909 245925 -564022
11612 -87225 -172945 -38876 -323927 -109584 94269 169732 -153921 256031 148035 206513 197509
11601 197509 14617 285737 -49246 -164537 108660 237271 64860 95024 36894 -154844
11590 228278 198621 -126235 185899 210087 195793 246872 376025 311238 258616 136168 437261
11579 437261 -77185 399 221767 385897 71916 343523 -93685 -12999 -76252 -331046 280
11567 194576 31684 46950 66076 51479 353398 28417 273438 66578 36142 145494 141760
11556 141760 26613 551892 165386 -237394 113423 -193262 230071 48192 348239 -51976
11545 152614 -20639 -16429 -135925 274724 193480 364938 -201788 309901 -207774 158915
11534 -19472 464185 -62614 -17589 -57948 506719 88090 -247693 22525 -505881 -215935 -49520
11522 -70433 165989 189282 82580 -123835 129218 215523 -91660 25708 70670 402480 -261865
11510 -78566 75237 131934 93980 -32497 141022 -14528 -91728 -219058 -25719 348765 -16356
11498 192185 -267056 299775 26437 160739 250475 -73879 184895 447887 -108291 -840 95310
11486 127427 185929 70453 183549 154331 237257 -22068 142052 552780 316356 510667
11476 510667 25728 166512 8193 128776 138458 590020 221793 161790 -48901 205288 43744
11464 343572 98237 256658 72747 85860 122649 166815 -28117 -35116 73816 52877 -155370
11452 50975 203603 126289 135039 201468 171818 50527 129230 276470 29476 116887 23899
11440 127590 -106923 -83489 -25582 -265163 99371 -36586 38451 153487 -6442 72899 125406
11429 125406 209053 251385 -21519 -239947 230301 113498 -175563 36905 -30978 -219030
11419 -219030 -95149 82943 83246 -181597 132041 25758 -151280 -30115 417403 -16098 117340
11407 -145572 130842 -103578 16562 17715 13217 176326 48872 220684 62023 -108446 60841
11395 16491 212005 -158486 -141865 -258161 -337790 85957 -51833 96307 136913 -53929 -83420
11384 -83420 -82787 -149246 -319764 163066 -201859 72469 -151301 6059 -86136 -2390 66738 196651
11372 196651 -249736 -283406 -2325 -149641 198764 -54039 175630 210513 -57112 275610 -313568
11360 490759 60695 74265 456879 47524 8913 -188063 86396 -147560 90423 -105788 -122418
11349 -122418 -53816 -94869 7 -79513 133051 -162323 -152944 169562 -149866 -288199 -48824
11337 6987 -59027 137055 158094 -44813 94337 132259 198704 276257 -38792 105353 82052
11326 82052 -251907 331599 24341 -158308 22202 -148194 -137741 -313566 94500 255944
11316 255944 60606 -390229 37191 182448 -3569 72206 65843 -55886 148633 -66284 184706
11304 -520913 288050 259807 -127918 -142121 132551 15294 -188136 112107 10670 45977
11294 45977 -103810 245535 -27165 31518 46800 -38056 -81127 -227211 -215787 283973 16835
11282 203638 -251330 277389 124745 -91339 447208 -167091 -207959 -338729 -242531 58050
11271 -250662 -66607 -243135 -286708 40256 -225395 -225947 -82359 -277428 38951 -3446 152093
11259 -431180 74454 234572 2349 -119897 -122664 -203612 -138890 -333252 -410019 -207523 125375
11247 -36991 -183689 169805 -414246 53497 -332772 45330 -276661 -11028 -132582 -88294
11237 -88294 -54375 -22597 7577 -154927 35784 -160362 152367 -118360 105128 -141783 127955
11225 -82683 55194 -68875 -195839 -272379 -312235 -177826 -99150 -92399 243126 -106254 -21223
11213 -110432 -76850 -94260 -92380 35306 58778 99572 72807 -104490 1932 4096 112223 64429
11201 64429 -232887 -153977 -59265 -33008 -141503 -29008 -63199 281962 66125 -222949 -388735
11190 -388735 -14780 -125576 -134346 258669 -14761 -51201 -303806 -95336 5603 8066 -9215 -105
11177 -5475 -36845 -233807 -60750 30476 199474 -54325 77424 237102 59643 35267 -417356
11165 -14441 59061 -312409 -185960 43637 -197574 -92624 87834 -100679 -195053 -121732 113629
11153 -214337 80903 -193967 -109326 -161902 -251130 309139 372 165104 260918 -2502 -280 27787
11140 147494 -415209 344766 88341 -127927 265711 44192 -70398 94632 443051 101422
11129 234990 176076 -311885 25047 -105920 -34090 -277272 151552 68726 8112 341889 286791
11118 286791 181889 -350543 -70417 288981 -73964 19532 30359 46362 48634 -208706 -111493
11107 -111493 189058 307831 118552 514403 -54719 -66363 358025 171835 -47121 348887
11096 2993 122674 103751 238220 199448 274670 340162 -20547 -55911 43759 516851 243120
11084 278998 283587 -13749 216687 21168 119467 319534 165217 103644 106704 126820 280151
11073 280151 140998 84241 337939 541482 434571 498533 465061 346583 451705 363836
11063 363836 626338 598506 470502 905954 766236 388350 559374 585248 509611 643000
11053 643000 303160 646159 317563 633526 443757 837318 664789 851949 1112065 822047
11043 822047 555569 714701 332262 614020 678701 666070 813968 376647 846961 867186
11033 867186 747828 685499 648067 946438 729904 759259 817539 819063 732751 720770 613907
11022 613907 662486 652279 576108 842704 633897 565778 595863 876542 796714 546882 732065
11011 732065 813674 298825 691427 406985 634931 486612 443227 909274 484582 652493
11001 652493 547282 324791 447669 724364 593760 743833 543366 633497 739374 536726
10991 536726 560492 655225 1184080 1116672 612792 924321 902811 1313348 737870 1187697
10981 1187697 1388007 1470779 1518809 1497695 1580774 1717777 2134149 2593515 2856443 3036061
10971 3036061 2737897 2478183 2636155 2519114 2110863 2298591 1926781 1758492 1551661
10962 1551661 1728531 1751201 1997707 1777200 1872531 1740949 1597333 1210686 1558794 1382080
10952 1382080 1599458 1125063 948329 479313 506318 589780 475544 262158 361059 287399
10942 287399 100656 411259 25752 351774 310493 450285 320320 -29072 35360 45671
10932 45671 194614 -10575 4297 6770 259120 212697 401262 15940 238376 -170418 -199167
10921 -199167 588633 60876 130159 37427 -72323 -211033 -115649 9487 -256273 29800 -168517
10909 68739 -139381 -150256 73381 -52507 132915 -155528 -28764 154823 362221 74559 -91949
10897 200717 -227992 303192 -45191 91866 -64672 -86220 -123401 176168 -305380 257726
10886 -108017 -54767 185272 -3540 -166327 123635 229071 -114686 -132453 -121433 -226080
10876 -226080 194292 -41146 -111042 -40144 62863 238536 245979 26135 -189576 -344548 7300
10864 62758 147468 21678 -383833 -73347 216814 -30147 142366 136324 -336619 -189471 216451
10852 11046 -114981 -107351 -46611 -382470 -273378 -78635 61972 190915 -239014 34235 -290335
10840 -105042 -253347 204918 13405 4536 -217830 216657 -8897 -5583 13447 41097 419352
10829 419352 -198850 -34188 408416 -202308 51701 -333299 108630 122723 -90491 204418
10818 -132019 59081 -9443 -238224 -121407 101689 -54402 -95202 -262531 165423 -16867 24994
10806 218943 -189098 53964 -86443 -106374 96599 -273847 -140344 379795 821 -70614 -3978
10794 180644 58206 -102615 219474 -6941 -251106 -9624 -105762 -81224 -208556 -258248 -310143
10783 -310143 11975 -53803 -4669 -39732 -56823 32190 -168684 50559 -89612 62576 -141690
10771 -13535 214126 -264956 106800 10540 -510933 -89662 -25372 123998 120191 -164095 157611
10759 241621 -89630 378196 -23447 163951 -460764 -35264 178812 -20247 -140870 177875
10748 -213732 -169358 44469 -72487 226404 244399 227620 -480290 219333 -571112 100624
10737 192983 -305335 -189907 -251212 3126 79548 -157038 -224946 -34219 -214179 -10399 -222952
10726 -222952 -112411 -136361 226592 49778 197029 178074 116419 -65995 -26453 57346 18317
10714 -73692 -40704 -328147 -258125 -161266 -42615 -37525 -399625 -106192 54469 -337879 -232936
10703 -232936 -175682 -89768 -117367 -142862 -19602 -57879 -90992 22099 26899 -325201 -60249
10691 -122355 -49226 -284820 -256623 182468 -158267 -416666 -154110 -214288 -26059 -242568
10681 -242568 81500 -103366 -525886 124568 121698 -1705 -204 14710 -68651 -64126 172132 -47470
10668 -148089 -175133 -245217 212423 -213901 -77054 -23418 -63944 -17093 -198800 -216160 -37927
10656 -128531 230199 -123341 57958 -327740 -16509 24562 -380841 -102607 -77399 -26958
10645 -190609 -239198 -65486 76654 83595 -321336 10906 42230 -316470 -164853 -74195 -155075
10634 -155075 201942 -142520 112231 60256 -18639 -331814 -273399 67996 -218514 -150064
10624 -150064 -26586 -240417 -153027 -86909 -122047 -191342 20328 -253640 -119507 -85599 -45150
10613 -45150 -235245 -93554 -60744 184779 -182534 -109160 240039 -134653 158569 233819
10603 233819 222874 83112 111118 -398 -71851 -25007 128555 49140 306269 201946 -65454
10591 137775 -121600 84851 -130281 -130179 -424356 -162 -265887 -85776 216996 -115622 -104821
10580 -104821 138339 222660 -44514 -113172 -353321 -26303 -336828 41520 -289882 -35474 -186216
10569 -186216 -3910 -189941 -244754 -110705 -179854 -276459 -12983 -131756 26086 -111281 67300
10557 -128213 -19565 13492 253985 -136760 162925 56897 40643 -10499 119562 -80492 -154327
10546 -154327 -80948 -188901 -209705 91115 -113146 -278098 85774 -180263 -31700 158816
10535 120125 -138586 -25799 -43853 -188821 187404 -494684 -262564 67118 273373 -153070
10524 -87548 337615 -141440 -202303 71353 -16673 43331 36468 364386 -315858 -191874 345008
10512 50214 90909 -34168 65613 194076 29042 -26395 256346 -149264 -114183 17231 -352329
10500 27613 52695 -9579 -106808 57535 36254 -3390 -117484 -311767 -45156 146359 -1506 1367
10487 35935 -153825 -86335 -189940 -22120 -8625 376675 548595 613855 249033 -122411 161159
10475 -36067 -65954 226376 -66410 91702 23655 -78895 186850 -109601 -105670 51004 -241249
10463 -108504 -41628 153239 60572 -30283 95513 -85547 -380978 50728 300373 -243531 -224268
10452 -224268 -246431 -191422 -63056 -241807 -177805 -39009 -400250 200135 45613 71812 179872
10441 179872 -237735 36706 124123 238357 51055 -174425 -218526 -222323 189241 -124828 -157115
10430 -157115 139339 57889 91782 -94819 2934 -120019 -168743 102610 -23985 343516 -85407
10418 -380062 28412 -208603 108309 -155638 206617 -108546 -89773 -265169 -40456 -324582
10408 -324582 179427 -214441 173075 -294763 -11891 190043 364170 -32334 17516 7761
10397 -171446 179896 228635 126012 75671 23871 314535 229132 -49016 -95082 61671 310516
10386 310516 -259497 -106998 -858 149023 -15474 137667 296963 422335 332465 67941 192351
10375 192351 102580 348894 91532 322151 505084 425041 265411 100983 248651 433266
10365 433266 461832 3546 140812 344911 289107 44249 182890 107767 189407 297912 -20140
10353 357265 380324 297964 430317 674398 463237 284137 169309 333715 122753 141920
10343 141920 392882 -87573 218831 481880 34499 101243 -3533 -41903 329163 -117406 230317
10331 277447 17586 133133 192912 -94680 -149183 -50451 -5178 235622 379837 94629 133177
10320 133177 128125 358156 362592 31613 15107 343692 96360 128212 545653 -90109 -22884
10308 -182270 -202726 36821 -225694 -887 212097 200618 -15743 -338573 254165 347347 67062
10296 100998 -92250 64936 203247 343975 91329 -153046 195866 286489 74850 -48287 -16245
10284 -15192 -294519 -40172 -162632 -251816 -89263 274145 -357242 -18499 -114139 -120404 -265439
10273 -265439 -233447 -186511 -39079 -39109 -314155 -43731 305634 107418 504780 -75738 16856
10261 149526 526493 262177 184213 302633 396844 313568 177806 120736 154597 -386678
10250 -157332 185344 -24313 -141321 170595 -70304 45139 -106743 -266834 -166409 -65084
10239 104676 -58531 177899 -315712 -313100 97492 -305456 -33731 84261 32337 180586 -81737
10227 -196115 192772 -295303 -22236 37635 -297642 14027 -149105 60764 -195562 -283213
10217 -283213 -254086 71003 -79389 -144302 157295 -40944 -179443 -171074 32828 79161 -354237
10205 -14178 206593 304529 -329143 -205762 201590 -50185 -234359 -227472 -111987 106082
10194 212889 52720 -126383 8693 57721 -249145 -112430 267403 175897 -271973 -157272
10184 -157272 -204139 -330810 -24975 93506 163134 -228991 -169918 -389252 -79261 -243756 -78123
10172 37710 -467515 -123813 -120079 263989 -48817 30188 112617 -309417 -31628 -249882 41181
10160 -22809 192258 100522 -10652 177742 -277290 136629 -319650 -271644 -250093 34565 69463
10149 69463 123146 -91176 47884 202671 -42890 17460 -123710 -326871 -219508 43255 20668
10137 -298369 -123416 -82001 -10148 29359 -21208 -16701 44538 -79415 43891 -112443 -39975
10125 -179137 -171193 -330687 -279510 -59900 -177802 -108157 -274724 15063 187003 330185 84542
10113 58857 149483 -200336 -229429 136065 -373604 -211566 -291034 19150 115051 -91270 204879
10101 62949 -23626 -231456 -135572 -48711 -310474 42233 43679 -165082 -319670 -103470 -95678
10090 -95678 -191963 274691 -1497 18766 -69473 119124 78411 68149 -467163 -103279 -210848
10079 -210848 15137 -206424 -124537 -175950 -78718 94372 29417 211789 -68352 -153026 -171015
10068 -171015 -189742 118521 -168708 -93283 42293 -289826 298438 -270274 -207147 114960
10057 -125584 -278698 -8869 -59622 -342776 49417 -127573 -67731 28802 -23752 -69338 -484402
10046 -484402 -460552 -40799 423 -10285 137934 231132 111578 -37889 39500 63262 -188086
10034 -76792 140963 20667 69540 -93822 18019 -137245 -364713 41012 -295218 -125034 137098
10022 -274192 67806 -432981 -274522 -67189 -222884 -527143 -197930 69325 -183018 -238170
10012 -238170 -559464 -212753 -46189 -237983 -131975 22058 1786 6463 -432662 -300370 11028
10000 185312 99097 259105 -217181 -291866 -240432 21026 57701 -127441 1014 -114600 58430
9988 84591 -170213 -200807 89162 -206061 375872 -66392 -205970 -188831 53718 -46921 -325926
9977 -325926 114519 -178483 8291 -1174 -95229 104532 -419173 -119265 236317 -65789 104815
9965 -27444 -37801 -36596 -238155 186330 -66776 -27835 -411404 -43251 37351 -229101 -298881
9954 -298881 140488 138125 -27324 78012 4521 51700 -158968 -9692 -356731 40319 59286 -75521
9941 -10705 364122 -213535 -149908 43037 -78016 -140210 -191235 -245218 261717 -252574 157938
9929 285596 -64594 -146582 -262405 358021 -122090 -23374 261158 -125457 159670 -86241
9918 -36526 -633547 -103706 -530156 128191 -310688 257367 -91527 -127877 198558 116756
9908 116756 -101778 90871 -178235 -87794 66755 -18176 -369747 138809 -9585 -37437 -55817
9897 -55817 -98093 -42568 -462960 -322542 -75317 -130932 -132760 -296548 -268902 -123468 -137474
9886 -137474 209102 174038 -121970 -409489 141245 -121374 29821 -59367 8349 -4386 307255
9874 -120224 -49823 -53077 -66558 -169695 -118724 -46919 -54002 -167566 -62297 -119525 -415454
9863 -415454 -59890 5430 38806 10060 48016 140090 327671 5827 156139 163144 -12576 -136262
9851 -136262 133121 -199028 -198705 11260 210609 -296679 107331 -7517 -52545 -42008 -267537
9840 -267537 -130608 -394 138723 57482 -228301 258320 -108865 200533 -153850 -160017 -263335
9829 -263335 -15486 149360 -313675 172952 53624 -292954 -129165 59131 -124689 -253157
9819 -253157 -267199 -55112 126205 -42485 -349687 113550 -416656 -120571 43421 374028
9809 374028 77107 -33410 -183502 52367 -237686 -295327 -191541 -29707 -281511 175827 137057
9798 137057 285962 82263 327735 -138503 -111493 288819 10333 208760 -114888 15303
9787 -199563 -298980 -180346 304369 -98588 15663 -130786 -35357 -227104 22272 130144 -379242
9775 57170 -98976 -99139 -56088 -88122 198800 -302588 -222717 -67769 -146044 20029 -141683 -323837
9763 -323837 98146 103257 -457660 -116156 -182480 69737 -20178 37012 -178127 40355 78956
9752 78956 -342687 -42902 -152598 -275483 -381831 -194761 -142871 79547 -118003 -171085 -65166
9740 6434 -146735 -130922 70698 -247986 -58827 24151 -75178 -35346 -335342 -31361 96717
9728 -27441 1926 96102 -81456 81790 -80754 28403 165449 -43136 -25874 -56884 -439959 -538464
9716 -538464 -159682 -59295 232269 -267670 -94915 -108878 77172 -46798 -265758 18105 -268705
9704 100451 30797 -158084 111124 -144570 -196306 52297 -28810 -93122 60775 -108998 -276017
9693 -276017 -436704 -22277 244809 -155650 -66824 -168145 -276557 13665 13344 196722 -335766
9681 -296276 -232219 -112719 -58413 -114738 -294088 50822 23344 138291 -52931 -3248 -285014
9670 -285014 -109813 -176084 -26562 -38776 -123555 22097 117223 120773 -130351 52811 -234522
9658 -151114 -74767 -21829 -196232 -99525 -136975 -23438 150675 -114394 -65922 -274999 98781
9646 37400 175673 -175450 30542 42766 -100333 -112457 282391 -206315 46070 -176090 -113614
9635 -113614 -107867 17936 217374 -138291 -303690 116445 -55148 -227302 -203569 -154401 477661
9623 -92153 -111265 -41172 1539 -121817 -35965 -42422 -304086 -118796 267926 12483 -5994 -3716
9611 -3716 -102969 176054 -236018 5866 -155807 -238817 104720 242583 -62376 -209168 230078
9599 302531 64181 -115438 -572977 96306 170518 -2067 15765 -503053 -152768 21144 -183608
9587 -33499 -239350 148047 -370161 -107401 -40206 -301377 128014 -238353 51990 39065
9577 39065 5112 -115916 -313402 317335 5169 83355 38035 337733 69093 97474 23433
9565 -96491 39485 -53580 5184 -387149 -18643 85336 -32002 -390983 -309596 38223 122855 -160967
9552 -207366 -161395 -74026 22845 -198268 229008 -322248 -249840 -272393 -31637 -168982 -240695
9541 -240695 -7928 -174452 -298597 -227678 -12504 -478930 -71100 -50251 -205119 192356 -320105
9529 -54339 74056 79691 166565 70720 -93359 17638 -78446 -187181 -216949 -73046 -407753 -19645
9516 -25980 -102791 -178341 67386 -139089 -126314 101228 -111436 -57124 123320 120935 72779
9505 72779 -37817 291372 -310689 -101517 -365921 -357715 -180319 144815 -149159 -149551 -171285
9494 -171285 281561 -145688 -133241 -175582 38708 -56569 -425896 -139730 -22439 112189 -52062
9482 -101698 140732 230132 188363 -523969 -467294 106967 -168114 -161501 -228413 -91713 -218909
9471 -218909 374370 -24062 -242979 -69770 -411302 52899 116350 155865 85898 90790 174565
9460 174565 37160 -85851 -26758 131654 -220350 94818 133691 -219895 302610 -46647 -328691
9449 -328691 1326 58063 150821 -235568 -36651 -381606 -225645 -140932 136328 108463 -251837
9437 23885 -135328 -56842 19629 -89549 78270 -370179 -321659 126458 -118765 -151349 207136
9425 14640 -247627 103449 -206869 218326 53165 -121031 -73347 -419159 -46302 -149015
9415 -149015 249623 653057 -278357 -282932 -11013 -161213 -328337 -119599 -67941 15536 -83924
9403 38678 -283596 -196326 -209108 -120376 -28476 -296647 -124170 99148 -306420 -402783 -102369
9391 -200431 126382 -116103 236942 -20459 51084 -51809 -334046 -202900 -188945 298647
9380 -182284 -124946 6228 -216686 62464 -48667 275581 -4347 -207943 1228 6238 124266 -81770
9367 -226631 -224469 83849 163844 -50288 -183181 -218549 6756 -26902 -434910 -42948 -273851
9356 -273851 -143067 -145057 145501 266660 -262870 -483664 -80712 -342053 -189931 -69614
9345 48316 -578964 -271830 -602000 -174149 108 -36923 -457517 186138 -136301 -103671 139672
9333 154133 -128440 146202 -68144 80510 56404 43273 -287366 -41952 -215490 -434166 59543
9321 -106846 -34099 175699 -57006 -223941 764 -11045 -166994 -191002 -30298 136878 -150608
9309 -128973 95047 -233310 26423 4083 -11376 -287416 -30504 -138919 -49743 -386900 -406964
9298 -406964 75004 101704 -9585 86438 -134631 23602 70720 10572 45688 -165289 -76654
9286 29761 -247302 -74539 175131 21427 231901 -298222 -68399 -62430 -18906 -204965 18642
9274 20457 -389114 133902 -112303 -65279 37979 -215417 133156 80976 -229440 -187529 80046
9262 90657 -40924 -186860 -401379 -276310 109798 -48981 -209709 -58700 100081 -100378
9251 -266188 -16096 -133564 -328699 8836 -140522 -60993 -72837 -64282 -234784 -27319 80470
9239 92328 136815 341896 -635603 -287696 18117 110852 -227258 300823 -295235 -64742 -104063
9228 -104063 39879 -103700 171802 -50912 461585 -129140 -67136 -68086 36267 -466269 -87738
9216 -182748 -176256 -192693 -183677 -197077 182308 -309828 -119455 92449 21456 112336 -115570
9204 -283836 -140890 170855 -198592 -108147 -311447 -182240 74753 101022 -138260 369517
9193 -216037 210841 -333416 -129387 23990 -42384 -369001 141342 -196280 -229923 -13393
9182 -202445 269548 -151301 -10201 -1993 -344304 -132038 24921 -75186 -214700 94937 -231642
9170 -200879 -195637 -285573 -151616 25960 48275 -127231 -93093 -56922 278716 85558 -235793
9158 142388 -191651 214147 177114 -175995 -315806 -121707 251200 156305 -94126 449648
9147 -141782 -138416 485685 -241376 37981 98196 86622 -43582 -35590 331641 338578 94198 25184
9134 -455409 63641 92509 -416132 73702 -157807 -192787 -567737 309952 -90243 -169419 -17733
9122 -177053 75108 -74912 -137339 -321329 46826 110823 125566 131282 -84895 -197818 229911
9110 -84250 154065 -440023 -316985 -156744 225131 -115218 163131 -89024 -19694 308527
9099 -14210 -61912 -144618 46111 -12607 129035 -347436 228106 -243837 -243035 -134798 -24911
9087 67978 -266494 -81841 -521810 -94181 -3119 -45201 118012 -60646 -217778 -213307 266977
9075 -85374 4522 72647 -187685 -19959 -216383 290462 90304 82483 -138557 15332 -139200
9063 118160 -236079 -75485 143312 107462 -49939 162355 59108 -236268 -389417 176252
9052 96838 -273394 30818 -271471 275179 -82285 60418 -158450 138273 107137 185029 17409
9040 -270366 135691 109466 -88570 -296618 -307873 -123903 48149 -5053 -135601 -57269 -218684
9029 -218684 -399707 -282337 -15902 103484 -216034 -426605 -394122 -12813 -289270 -123277
9018 -210121 -101813 -269609 63964 -66325 29514 -389653 -79873 -358385 112017 243036
9008 243036 -6072 56487 60338 -89131 -271926 -344421 -239588 -243298 -263491 -93998 59648 249322
8996 249322 -154331 -140242 31828 -214581 92208 -38791 247386 -62162 -266756 -335214 38773
8984 -126647 133166 114135 -161234 -511622 -73833 -63232 -184735 -23536 -178888 -302932
8974 -302932 167219 24453 -175615 -185627 -89022 -225992 -305998 -115786 -195586 133556 -80271
8962 -52482 163502 -38241 -118936 -68881 168003 -80107 -196817 37738 224044 -27090 -157479
8951 -157479 -116205 2725 -110578 -168625 -72170 86713 9008 -161792 -26552 75975 -126935
8939 -36376 171662 195405 46061 203878 154976 40639 -112928 -40195 -73784 74794 -142374
8927 -213055 265066 119200 751914 2601359 8401557 11011967 9026574 3722490 1298188
8917 570313 82404 339587 -37689 209026 67515 46432 122977 280400 629154 76904 288059
8906 288059 202941 140515 -39116 -41843 -79579 -157347 10305 -444519 -174392 31410 -155155
8894 85852 59891 131569 263410 -66338 -192717 -100262 214366 -123772 49941 20167 96243
8883 96243 -58499 -58291 -403808 120713 120442 140507 -321339 98670 79702 -30239 107330 -138589
8870 46760 -207501 -65123 -519710 109402 -81591 -102468 -71386 -69241 -199126 38782 120392
8859 120392 -108545 -292800 238610 -209658 -111573 -42338 94212 14050 -146386 -74728 -419118
8848 -419118 298376 -29696 -52711 96253 -78755 125148 -10111 23870 -6751 -330786 4215
8836 -36269 179553 230277 -392109 -340136 -98351 -104887 76869 -260860 118877 207710 -188876
8824 -168761 48601 -42041 -183653 -28674 186019 -330752 -110279 12866 -17593 -216712 177064
8812 -281327 -108058 157052 300835 -64649 -147238 180765 47149 -196069 -30157 83742 -314863
8800 194379 168572 -214629 -29653 -375153 64214 -25884 -116499 -36777 -50433 -120361 -34911
8788 73839 359081 10221 71473 -28256 -58410 -168833 127226 -25389 -452102 -167024 -105087
8777 -105087 35896 -26444 -51553 -76125 -323757 -279888 -463378 -10026 -351501 24813 -4700
8765 -97243 3059 -66920 233124 -134810 29975 -70012 -129608 -214442 -75201 -129742 10184 -282086
8752 -38489 -310020 135174 -199767 96263 -350484 -111466 -124566 -280735 -212420 24594 -91742
8740 -84813 -57916 -170496 84086 -109019 121118 103283 -181919 321527 68475 -90198 8258
8728 212571 -85080 -42790 -240368 -229847 -349650 -47711 -234139 365123 32685 -166821 -53214
8716 -64633 -533 -252859 -29082 185290 14226 -385716 20843 -227793 -211245 -80739 -433325
8705 -433325 161350 68573 -204713 -71039 -274739 74420 -235420 55415 20951 -128537 -216564
8694 -216564 -137137 48627 179347 60980 22582 -4760 113800 -19379 -54905 -244833 220406
8682 -212999 27916 -166935 -287008 -253219 -85479 349594 -68183 -140806 -213099 52254 -95082
8670 -44756 182737 -237459 -269002 -248366 68183 36742 89743 -203314 -116443 -241463 -15842
8658 41108 325823 -52397 24000 245959 163941 -510363 -64480 -290874 393414 40042 23268
8647 23268 133540 181173 -187996 -196928 -266750 49529 -32391 -122207 4864 -144611 -17494 -198657
8635 -198657 37 104487 -178123 101605 55032 141881 171004 -66524 -169138 -75600 254515
8623 64803 -123102 -267097 187137 -337732 73804 -430980 -232943 -6693 -25042 -82974 -35604
8611 97779 8741 -440888 -115750 17430 79339 67506 -290724 -197474 218521 -345679 59771
8599 54466 4487 -43766 233844 -9051 -193856 22719 211444 223185 -83341 68701 11684 51259
8587 51259 -174854 -54293 -27628 -239066 199935 189776 52124 -214600 86906 -208969 -320842
8576 -320842 140677 -50224 36306 -393244 -100118 -302613 -149198 81505 33120 -53881 -74810
8565 -74810 -214110 205364 -149399 -72249 -176943 -166240 -232286 -276229 -314468 47208 -272659
8553 172309 -369472 218859 -242289 -20029 -293701 -100568 28460 23777 -274363 46953 -131577
8541 -103380 29370 -291221 -177604 -84572 -210147 27272 -76926 -203514 -58148 98493 104175
8530 104175 54556 1836 -109241 299185 72044 71198 40655 143372 -49976 -379355 -191613
8519 -191613 -60279 141716 -50136 134799 78450 -67533 -402455 -66792 141285 -239333 116697
8507 49842 -162982 14482 155871 981 -155616 -230307 -48662 -220171 -3831 -65473 -34217 69374
8494 -60025 99403 -249164 155682 133367 82875 -60345 57214 206544 -171263 31196 49098
8483 49098 -55152 29584 -68083 -310728 -200721 -78634 250550 -273057 -162773 429272 23768
8471 -95828 43283 -84458 35082 -177142 42169 -185591 -191697 -286679 161464 7127 -114878
8459 -329092 -306956 47428 274657 -228888 -22068 -62735 100094 -130752 -153024 118034 -240766
8447 104943 86287 -27824 -294071 -261713 -115484 -76126 -57682 175709 -10168 -212314 -235145
8436 -235145 -89481 -39695 -213337 162150 -64745 -80687 -191314 -5616 -28165 6607 75863
8425 75863 269170 -209460 105827 9115 108230 -134081 25465 -105291 -2932 110528 -79068
8413 -539307 34123 -318574 130161 34125 -66185 145596 74890 -215458 -178149 13924 22420
8402 22420 128729 -277981 -77236 81264 1212 119866 -55269 -176893 146908 48499 74219
8391 74219 8206 -147197 -298679 -350942 215125 -100579 -290176 -199841 -50306 -105737 85084
8379 -80584 4463 276324 379099 103462 -59770 -183113 -3824 -148646 -440040 -103225 333356
8367 -88476 136207 -143843 -173682 9823 165545 -174586 -105753 75081 99723 180817 -24821
8355 -466002 -124757 -66971 171504 2091 154418 -354556 -110310 -171372 -179969 -49907 -499198
8344 -499198 -145941 -84620 138632 -63847 -23752 -158976 46113 -373783 170742 57710 354196
8333 354196 -285363 -72255 -150258 -82620 -202196 -101025 84221 61638 345641 199072 -104366
8321 -124009 -369492 479423 182901 -189345 -314752 -76868 -231324 11063 -45450 24414
8310 -94225 -340663 172982 81472 -489764 326578 -179171 -195908 -48532 -63717 368449 435942
8299 435942 -172658 35467 17047 29703 -38759 -98078 -226801 -306672 -15182 108129 17936
8287 -199631 49554 -145712 -22366 -40295 -34077 -31922 104495 -163584 -420139 -10766 -27719
8276 -27719 -293649 -127064 -27224 -185983 52546 -303396 168823 -138413 -249801 -81110
8265 -219668 109094 48898 -202180 -176220 -116606 -192705 -149628 39508 -72420 22129 104180
8254 104180 -218557 -104190 -277174 -29941 -121140 -449820 122759 -102383 -16630 413394
8243 148718 -273439 267407 -323047 -125145 333274 29814 77671 289485 -58671 127159
8232 201338 263703 -179494 -244043 -188213 34065 -124126 -181383 -110230 -91085 -35889 -32331
8221 -32331 -344219 -19358 28519 -16603 40958 -116687 -271611 57676 112259 8881 -64754
8209 88940 93299 -31379 47622 11477 -113984 91452 -165361 154143 -271872 -19704 -291236
8198 -291236 22781 -65668 -25700 -201061 33537 -88710 -336999 147653 158359 -34990 157579
8186 240172 -68053 -136986 348081 -81097 -31198 -120081 -5106 64485 -33775 -214728 18772
8174 172897 34421 -343332 -83764 -63470 153448 -35191 204870 -181848 -141285 -336089 -315521
8163 -315521 -73914 55868 237772 -73243 101589 -203985 105765 -2942 -201006 -112236 1524
8151 59915 -258509 -297155 -192741 228711 -125889 -44533 47298 183192 44744 -291273 -316130
8140 -316130 50423 -20555 -105964 111591 4080 397737 -137874 -47313 144594 165168 -408912
8128 -104831 165907 -228239 -276693 37085 34467 335447 62436 232084 161317 -82828 -151087
8117 -151087 -29402 -124750 -4915 -197018 -55363 -181497 -360061 -222456 72151 -17291 8869
8105 -410775 291547 -48928 -73245 192281 -296756 -109795 260045 -152813 72754 -185231
8094 25527 319131 -111580 223010 -275912 -11207 -91686 242254 -180098 236842 -6721 63855
8082 -258306 -47407 -185873 -134842 -123627 -658575 -286306 -4738 135869 -42409 -105592 290137
8070 -38446 29714 79985 -121464 231240 -82076 28929 67590 -257543 -14686 74579 226081
8059 226081 24961 261077 -210720 233517 -339518 105857 -102585 -401981 -312177 131962
8048 7643 175765 -61629 560034 -149415 -219261 96297 -130218 335148 -175630 -125454 -221397
8037 -221397 226705 176345 7242 -65811 -390870 -574400 5690 11793 -283016 15006 -254694
8025 191299 -46236 -94526 272528 116114 -227122 -192495 65740 -309420 -280868 78198 -201723
8013 283244 -159751 209459 -141712 -122778 54380 -14468 -125220 -42490 -13928 -163150 41496
8001 369245 -264180 -397516 41246 80285 160442 -118375 -202141 119631 164056 -121759 -71893
7990 -71893 148272 -120989 286903 -19920 12701 131967 125990 93445 28069 -266330 247932
7978 -241453 -141665 33450 157612 14267 -185747 38378 143943 -117508 188251 -321588
7967 149895 34169 160265 131684 -198928 179951 -60227 -358425 76522 -288177 206316
7956 174762 -76509 132087 264585 -88832 85993 -123027 136742 -43417 -147505 240993
7945 -234257 315022 62499 -27661 -82953 -21307 192317 -114496 -68990 19467 222578 -60337
7933 -198273 -267913 -287130 -3016 -46766 -55223 -26092 23598 -364421 -121415 143697 -237202
7921 -377363 -173084 -356789 100657 -277454 -389062 107529 139240 -59847 -17944 -41673
7911 -41673 -149690 -247308 -128597 45784 199132 -137619 283375 102593 68217 -233366
7900 52631 -200788 63296 -462229 21931 102429 102469 -5182 -126349 144216 -86898 -139326 7625
7887 13342 -3780 -159010 -58165 -340868 188359 310662 -194367 -214112 40923 195409 -194650
7875 -255089 358822 -15036 -170269 -74419 191755 -142727 141222 -196952 -104126 89434
7864 -145860 -109051 156289 -133235 2830 -315418 -144594 33824 -424345 57456 -171067 -220806
7853 -220806 80138 266879 529547 -169959 115090 146627 -43441 -229851 -206790 -221377 256756
7841 302370 167525 152207 -332693 -74902 -152878 -264899 -233493 233289 -190690 66041 -302543
7829 -208605 -171917 39072 -215326 84275 56444 93080 -215290 -233117 -220957 -74192 172387
7817 134321 252882 -337053 33946 -226988 69978 351504 270302 282466 -104798 -94978 -116719
7806 -116719 -306751 116145 168245 218860 -72597 176172 -104315 -128304 19027 -128594 76431
7794 277098 98390 -279731 31710 -130419 -194736 273263 208669 210829 -88913 -20971 -151881
7783 -151881 97741 153081 -228750 -309202 -177533 172379 78058 91591 155017 96878 320917
7772 320917 56376 -181484 358998 -118972 -119090 -87304 -91188 302226 310160 444062 207180
7760 197690 -137948 161809 -68562 -222257 -40022 48926 211748 -64366 -170415 128838
7749 -283023 352994 -3009 -220565 31948 91848 45351 11412 -223081 -74315 -69002 115273
7737 -302180 -116385 -261472 -264612 -129048 93870 360545 -112774 334310 81287 281295
7727 281295 2226 -23115 142719 -37929 -35537 -94344 118844 -225807 -43072 -334142 274152
7715 110639 160013 -67189 -12647 -282764 -41227 81737 -279465 145524 -60458 -340511 122964
7703 -381756 -36625 -107577 85501 -276214 215959 -77631 -76076 -97866 58403 -167796 85273
7691 268332 -358171 141528 -75212 73583 199502 81120 -7555 -38298 271072 -19868 -227433
7680 -227433 23581 32801 104519 -237510 -327707 -238989 -142207 -240087 241646 118741 117945 57042
7667 -43116 -175418 52111 91612 28363 254419 -111175 194550 15556 -287080 43923 48652
7656 48652 220277 179802 174219 -10365 184848 189597 137393 213149 -401268 -161134 -96717
7645 -96717 -138852 298436 -94165 47383 184588 -371549 -36623 -19454 62915 -38927 -369909
7634 -369909 -267755 157059 -136538 -124447 25025 -85531 -48830 362378 -122540 274238
7623 7289 -106737 67003 -124480 -211200 111673 177957 26921 -3312 64266 -1756 -41605 10011
7610 -397829 -94521 -114921 -17605 -351174 120450 111887 -302821 -165277 -525821 100348 -48442
7598 -433608 -27868 12428 144008 -375201 134349 -329325 -124555 -31421 84404 -133668
7587 -180665 -360711 -17993 -56228 434040 97732 116955 -23265 -29988 80524 37469 -453841
7575 -248610 85768 74053 -5830 241580 17222 -12848 -248570 17779 79987 -194571 178578
7563 23742 135924 -68622 -389508 100910 71801 99187 -90636 -6356 -70570 -152245 121261
7551 381998 209079 -418820 93255 72222 -100683 43623 73561 -241535 -5425 188071 -199049
7539 261127 16990 -30113 -499 5491 -82795 -315211 4022 148452 -251575 -176079 -181179 199130
7526 -59807 43749 228060 -145379 -122819 -106809 -126033 -28207 257423 -237275 -197343 -73373
7514 -113078 -191817 204835 155005 22842 -88563 -35049 42645 -105903 -193888 51777 -159312
7502 -259099 50080 26996 -219033 238163 -74383 -145767 215988 121594 180539 -13151 43945
7490 159779 -42344 236578 -145174 261782 -249529 135260 -196288 -185505 40481 -203968
7479 -52982 -173169 -121343 -124434 -144519 -215449 -316976 -72218 10670 -65129 -159627 -128622 129768
7466 -78297 39344 -218282 -22797 173110 110406 92195 -167796 10277 -71362 192682 152532
7455 152532 -171878 -87761 254419 -142032 107594 20490 -152862 53267 -113932 -214359
7445 -214359 134703 -144562 38611 -23154 -66348 -170380 -286783 -222349 7454 141580 21930
7433 64916 119589 237105 126904 -31728 36185 56854 -100256 118476 111542 67078 84642
7422 84642 -159848 161335 236761 -263702 -86464 169161 -201310 -82520 -267002 -70532 -39530
7411 -39530 76134 173818 60263 344329 -158139 -111409 3834 -270483 -139437 84630 -202698
7399 -46790 -52199 102217 -37223 167807 -223259 150529 -111241 -34051 53536 -51262 -91620
7388 -91620 -19211 180924 22106 1824 143874 -92538 291989 -196 158269 71431 -150656
7376 174498 -237120 47986 -378382 229132 51716 -150464 241592 15946 47132 162134
7366 162134 56981 -413173 -262715 18142 -29746 -102899 50235 126572 -96754 126658 13243
7354 -399675 -21988 -440537 -304303 -35355 15557 275682 19723 -100789 -29134 -5462 -20384
7343 -20384 219751 35125 -45215 72590 -108344 -319194 75074 197712 -140478 291666 -42190
7331 61768 278485 -117441 156982 256733 152232 -109559 -195259 -353435 -260966 -195940 685
7319 164153 -64389 6369 82074 -273097 -116932 -5109 -277140 147722 -177813 -30495 114863
7307 9298 179851 149321 197438 -29288 294858 -360955 -161464 -242467 -151662 -17330 -227559
7296 -227559 64952 216430 -58941 -11493 -37987 166328 -129030 -224855 163954 162295 -40870
7284 -12725 -261317 -314064 16570 44225 -186672 318200 84292 50898 -206765 -208161 -116692
7273 -116692 -57879 3849 124889 60289 105887 -124897 -243604 129178 45008 308157 -52738
7261 -145387 283767 -2651 -110641 9888 -111671 94315 31061 172333 -215433 -37043 170963
7249 -134160 89769 -76172 -167865 216221 -348900 -33438 169808 244326 86844 -54588 -89218
7238 -89218 150532 -265596 -335624 -223604 103056 141268 70389 46255 -193121 -162307 -42765
7226 -394769 255112 -116573 -255853 -191272 57957 -436452 -90864 -283293 -211008 121293
7215 -229163 -32453 -22013 -8331 -92124 19345 242941 -125561 -101743 -242483 -76517 -155885
7204 -155885 -218639 151535 80808 185055 -212349 80866 122188 -300724 168005 -41963 125056
7192 -155903 -64045 -244393 -12313 58391 34514 -112442 -23706 -56619 91820 -204725 71091
7180 -246559 -103660 -95577 -17417 -461475 180011 -406346 -329030 -177090 30204 224886 -220750
7168 -652867 -270592 -83072 -40809 205323 1607 -142587 -3311 13880 -135647 -92062 40199
7156 -160658 278062 206776 -239022 -115299 131960 -52597 -56647 -148016 -45249 15277 -97726
7144 -167642 -72929 175369 -191199 -54966 324853 -218519 -404844 79077 -118301 -17536
7133 -127807 -240651 -81496 222117 -71299 -251039 -110635 -96023 125630 162215 8703 -35062
7121 -187810 -15982 -265253 -83806 327823 -209302 747 145215 -108620 50270 120466 64183
7110 64183 102428 -93737 272745 -45184 -117281 -254385 -121815 -75196 239689 -69983 247449
7098 -175862 99278 -43583 -169481 201674 82200 -101135 -54136 -29877 26758 79457 -188023
7086 -97894 2481 38299 166385 -318561 94938 18862 253423 -47332 -127650 -1781 -75907 146012
7073 -114777 -90187 -129432 222409 94663 255390 82504 233944 -5859 -68391 17007 -101748
7061 35911 2756 306537 -248023 -49057 -209507 -155434 -168535 132856 186589 225669 -306788
7049 -41790 6843 142168 -151481 79667 526183 -86560 -11807 -61714 -179256 -62152 19964
7037 -70630 -171202 145491 -296799 461171 36930 57735 -91349 190861 -235913 -335566 59452
7025 204814 -158679 42709 -219071 139879 -109407 466783 84168 300187 -228604 -8287
7014 -73838 -24358 213670 -209532 -230423 65241 -165432 125828 109819 152528 -1548 15999
7002 -118820 23936 320616 -123574 172042 -28996 -206827 146909 -222849 11471 198375
6992 198375 -175794 -26127 197143 80355 43512 132942 60920 134002 -129355 -254941 -35619
6980 -108629 -30078 -127628 99074 -172744 -404999 174235 428999 -422681 233718 20814
6969 8645 328600 7844 -402600 -28871 -113368 -169596 225433 -37331 139420 36204 50767
6958 50767 57390 -271048 190026 -69559 -352399 -253809 21233 252247 -477169 -342371 105516
6946 63577 164625 235657 38560 -22130 80341 -180995 -128444 -116445 156134 -188569 291969
6934 47670 141166 277901 -204599 126534 355829 15763 49538 283174 41903 -473947 -29649
6922 -62096 -30449 -136450 -352627 55565 92211 222745 -317018 -244554 237962 121314 -97395
6910 330736 114133 167831 -158328 -165482 -134036 -12790 166068 -79465 -132209 137436 -129711
6898 -115084 354948 126677 -94050 -50654 151524 -24537 -368994 2115 -121613 -160201 218851
6886 -134362 149558 -6970 17118 -362127 99109 -161684 140059 -147272 -92118 -140223 112307
6874 -7800 -82070 131974 -217760 16798 -364308 -217572 285926 613797 -55314 -336229 235871
6862 -168081 -189814 21203 -298861 4343 62409 -183660 147249 -67486 -279303 -84502 -140027
6851 -140027 -314539 76463 -337097 9958 -138220 -101834 45479 184502 95578 352625 51670
6839 -196923 -57655 118127 -267522 181512 -99000 -52171 23516 -155714 41247 401097 155257
6827 -8387 199489 71745 -269654 166542 65553 -18007 -93490 74799 -124810 327227 -112618
6815 298951 43610 82026 -56324 95615 -4101 -393810 36380 -130522 -25023 44121 -131056
6803 8285 -293157 -87748 -160347 -896 -58187 -88851 -301791 -247264 -200146 87950 -188534 -181049
6791 -181049 -354603 -54038 -225668 -248759 115122 -38779 354504 91096 168736 59813 -109986
6779 282055 -23540 -180581 -10972 -248208 -156786 -35036 22382 -8822 43051 154064 27392
6767 170944 58438 233921 -131718 167007 -9230 24848 81394 -168640 81164 -57198 -229123
6756 -229123 -212905 284624 -131575 237477 19329 -78766 -11307 -69630 133898 -56180 173865
6744 -24719 24480 -87172 5957 -3238 148238 -41051 185260 -8133 -115297 92375 193450 174847
6732 174847 94382 50894 217840 -28193 330640 14499 -277967 -69032 -379248 -99492 46440
6720 262809 132278 -42456 280466 -42679 -164912 -31505 24094 -27161 -225018 97592 -12067
6708 144484 149150 14642 -291641 -180557 -199886 -92010 217744 14986 -211150 -7924 79219
6696 -307695 -135566 -84292 94670 -61433 450251 -304609 34484 -169075 -125921 -259126 59474
6684 41057 -130720 -101434 -310867 136464 -133962 -40073 -78612 -14897 -34589 123568 -108848
6672 119894 -165259 -76363 -36744 -82364 27306 -151432 -195073 212088 229929 -147202 192718
6660 -15906 30553 45976 209244 90984 182586 -50697 -116959 119896 194818 175871 -191161
6648 -194469 -198711 -102647 314378 -163782 126894 175819 57728 -108482 -463415 -12749 -213775
6637 -213775 -223032 12225 -93879 35002 -4855 -118994 208809 202021 313857 86324 -244420
6625 113599 25121 -18887 -167398 -47707 -85279 123484 -201291 209992 -42612 313619 -143435
6613 175582 299051 -199211 -14870 -148216 113510 -236886 -187703 -334708 -328591 18794 -235849
6601 -205738 255291 -403784 107305 -115536 104760 44524 154993 78666 38245 -84813
6590 123206 70211 96786 104634 144075 -473258 174289 -95353 -97383 -64375 -275456 -173408
6579 -173408 -67040 -122566 19580 -123547 -197379 -147258 -3909 147646 -54661 2777 -62099 -79028
6567 -79028 383 61953 -163704 114543 -288787 -290882 -2089 77337 274166 -43431 57469 61149
6555 61149 -107386 26385 152276 -89101 -129848 280031 20455 -100825 -128731 -233242 -112813
6543 174488 -156637 -124727 -11904 -95082 -187381 37274 -145645 35386 59207 -134295 290727
6531 -48800 -84811 -65877 305618 -139647 -46859 -14314 -232741 -63230 115417 71022 27505
6519 -439067 112347 -26974 -195751 35249 -35299 -72379 239183 114015 196158 -49505 213899
6507 133449 -95568 218916 110178 -168461 -200120 321093 -61426 134354 -394721 179789
6496 282535 51709 -70786 -371426 -192586 -169846 -54654 201193 -106165 -59154 -175884 197877
6484 -112262 272453 -36207 -32699 8456 39156 -243762 -39890 96919 -32458 -5468 -107905 -169323
6472 -169323 -65760 -264785 -231352 78965 120751 -138026 -41101 -97935 -204441 -196704 -46281
6460 59114 -258780 -271460 185575 -10534 107261 -31140 99774 -107035 241898 -78221 67760
6448 80609 -39904 -107202 59011 1715 24742 -149091 -36102 156007 -146443 298851 104775
6436 -149351 192633 -116566 -119097 24293 -322826 -106757 7918 -193007 -103388 75126 -142320
6424 4975 -276867 -4246 240521 -39547 141568 -43152 127340 122568 187816 197196 -66784 -34327
6412 -34327 57545 -386749 114586 -78926 -265317 -35570 -44064 118755 -308076 74152 -82706
6400 113017 -67073 -91381 -31106 -65456 152725 -142829 365153 -20457 114921 -564791 -166281
6388 18592 -84571 156646 -99849 -194489 -209142 -27371 -179414 -97855 -94768 27443 -188180
6376 -180249 87709 -26245 1516 -268456 151438 61670 8416 114977 -296797 120894 174606
6365 174606 133693 -60339 -116099 -33632 -3681 -99232 -132792 23231 77268 199275 -212020
6353 -100162 -276989 -147362 158666 39121 4076 -442 89052 -186437 90920 204868 -115554
6341 -149574 -196166 161217 -180195 77916 212345 287395 142976 -4781 -16113 345930 58824
6329 150859 266098 -327247 -158865 211925 -203196 -151971 -106315 -261178 -62550 -98608
6319 -98608 155957 -57173 -281774 -24907 174203 -22987 54689 -302488 -119005 -148816 -257438
6308 -257438 368388 -114872 10007 -80376 303928 -583640 24382 3298 121309 -33813 -284104
6297 -284104 240281 121020 46378 97395 76053 -139129 174529 104048 -102008 -43670 10018
6285 -180891 151403 -128329 -211278 65539 -219536 -152689 -56286 -83218 233356 -204733 185772
6273 53624 -35459 -130932 215223 66645 -188184 -90088 195643 -173938 -228798 431368 -99808
6261 -196199 -172470 75747 -83719 -25121 269394 92579 243689 104595 -290158 132446 6746
6249 -144619 152605 -1924 132252 -119983 -103354 -121889 -184194 -76411 -80421 -217104 -61332
6237 -146504 74845 61453 -421196 50062 -121076 -135762 -36453 150903 200214 -60221 -330144
6226 -330144 173641 -12199 10354 -299795 153347 -164358 -193292 -217854 11749 80933 -114775
6214 203170 200915 -154902 -168051 -19701 216610 148463 -5975 254893 160915 -184479 1409
6202 -99430 278945 103299 30252 -139730 59415 -220910 -310096 88344 -214499 -394177 145361
6190 -56872 -64128 13837 -7890 11018 370051 -100687 194319 77809 -42928 441137 -49112
6178 -36727 -210443 -134795 -4222 -139711 -222664 129356 133239 -115317 149640 -50172 -46011
6167 -46011 378172 697 -359521 121395 -23867 202629 -288185 -45233 -8860 30486 400093
6156 400093 104600 -102322 -31298 201852 39416 -79568 -55026 208086 -103876 49721 71529
6145 71529 81393 -119629 259784 -57446 58110 -141958 -152824 -297363 -250680 161928 -30323
6133 85787 89194 294720 -3430 -32301 64402 -45988 -13429 -12504 -327235 -65591 53320 -29836
6120 -142654 35684 -66051 54344 44391 -286062 -212230 -222731 187773 191331 -248600 -52862
6108 -24883 48261 71359 -311546 -103737 6402 55599 103978 57805 99576 3761 -37517 -205590
6096 -205590 116179 -56409 -29419 247044 -4719 -401635 -79762 151435 -148664 -128357 53744
6084 -315280 270877 -236539 -141603 -147578 -102462 39888 -22989 -215420 -113524 -77083 145393
6072 59440 44706 -146430 -108291 -246554 96377 -1115 42944 39473 355256 25902 -54748 -29229
6060 -29229 -286842 105733 -295407 -86330 -257868 -160928 71147 197217 -115409 208653
6049 155754 -71774 -206197 -145434 -120186 -65858 221207 -50564 -71929 -119407 58686 79665
6038 79665 259116 -151109 -81196 -448595 135609 -22355 -91491 25584 32097 53219 -283583
6026 -179994 -38603 47973 161141 203939 110563 -194115 -146436 -315051 -253834 -234345 234093
6014 21648 -1424 -309097 20439 76356 -6852 -79644 199324 -54256 274548 -29593 -150736
6003 -150736 -220604 222181 -114020 223410 114084 90363 -211116 -252633 157267 -64128
5992 75232 88212 -171625 52447 222450 163346 170038 -321474 -341404 243872 253717 -233461
5980 18273 -14373 66226 26687 -19049 -296220 233693 63341 -5797 -254217 -239477 107637
5968 -155647 -174094 101769 -226332 -111513 -360379 -143659 134167 -88018 228238 -16148
5957 1044 -63531 110634 19284 -66001 -59548 211270 -79329 86355 274799 87816 -249664
5945 -113455 175072 398583 211099 49369 -55834 -44206 -247185 -17112 197646 135960 274911
5934 274911 -335381 89095 -131426 -125202 44636 -210963 -118146 13951 72363 -10050 100260
5922 67889 237314 25887 -362205 263185 79097 92316 94277 10065 45200 -239272 -342616
5911 -342616 -93610 -27837 -85107 279914 170895 -206301 -277809 33913 196468 38375 -106031
5899 -224467 292097 -55044 -150626 13613 306178 115203 -152492 -69420 34103 104052 -203922
5887 -95305 -24975 -300468 -3946 -102424 -31449 191010 -81829 105598 -323675 49868 24049
5875 -270428 97605 -8771 -140558 -122331 -77608 -122044 -302686 -156225 59387 -242197 -142255
5864 -142255 141807 -56846 -194464 -244188 27329 77928 -126918 -185282 -176055 -36525 -5728
5852 39504 17873 259117 53103 -171668 206031 106053 -285858 -148941 139920 -22548 14972
5840 113913 -9916 -387111 -42343 -172083 -90353 38588 97546 -242623 34409 -262777 -16409
5828 182293 84800 -256700 -4426 -77325 7017 60122 270775 246170 -229233 -60680 36193
5816 -85164 68983 4121 124114 -267128 234096 -246343 -134039 557336 18387 212885 26925
5804 122059 -46911 -168722 -250598 48956 -29382 175526 66768 -155930 88664 -1385 24916
5792 -97176 -177033 -255539 -208378 -107236 198168 -9082 102107 -89773 206039 170596 109742
5781 109742 235783 -46073 -153087 110350 -83545 34729 30228 -75982 -16507 -361625 -244041
5770 -244041 177921 193399 303469 49846 370039 199946 -84630 -124425 16179 125973 66594
5759 66594 -212186 -448544 53208 93140 210910 22882 -127039 -60520 -12356 -11508 -187625
5748 -187625 81183 70 36991 197983 344430 -127312 100931 86533 103958 147630 135892
5737 135892 -155575 -35679 32836 195247 243577 -47235 190253 30139 73746 32675 364027
5726 364027 367884 -9448 -378681 62452 32697 -79408 167335 119187 92610 -111675 -24125
5714 97063 100648 210801 -315542 214010 -110921 -173969 -27053 -29733 -311759 207891 -271604
5702 158556 93464 76298 -343238 77382 194467 232567 -80825 179237 99915 -87247 212049
5690 83020 589391 -173421 222130 -128706 107110 67226 90532 71176 -295507 162994
5679 -163447 -24452 134636 -340280 139056 -31252 -61207 45344 -64022 53024 139052 -282509
5667 -2393 -68929 202542 239655 -156095 -99895 -27441 206978 31896 174890 -14477 84292
5655 -86839 15285 -89888 -57713 3341 -135503 -139773 109075 53528 70282 124261 -338990 376220
5642 -241773 172226 16642 14378 63619 229001 -239896 -174009 -102990 -34058 -101095 -159039
5631 -159039 -77648 -46544 -295938 -92826 332802 -335780 -56498 172378 27803 224006 154107
5620 154107 12642 -42665 15885 -210694 -20780 -176520 -201814 -195212 -87877 4712 70759 -372680
5607 -105890 -131267 97317 -223504 -6720 -155550 23875 178888 124840 -184373 322101 -31744
5595 196836 247262 -37072 -258955 -166568 178924 116205 2105 46200 132151 -372933 32438
5583 -104645 11979 238396 -115845 -79975 33121 286021 81288 -323145 185370 -69747 -367950
5572 -367950 20116 -141798 -223587 -143343 -400248 281848 245384 224874 178346 145078 169684
5561 169684 -5138 -4543 -325767 269316 -151712 17692 74196 5877 -89057 -57146 244177 157591
5549 157591 -2136 -272023 -69791 37520 -65303 -104956 227601 -196915 108515 71711 49682
5538 49682 -133047 144312 12662 -191720 -30515 -231038 -175509 8781 129962 301247 -91565
5526 -45780 110518 75842 -60493 -202492 -38099 119324 -51922 162914 -171224 -484835 19851
5514 -256869 -237206 92029 -100006 51660 -48183 -229439 193217 -75895 -127230 -1644 174260
5502 -229140 172047 -254294 -54486 -57218 -32794 -22689 -18133 81773 216205 94956 110285
5491 110285 62924 181276 61269 272872 -126537 15610 69392 143455 233206 91178 -104051
5479 -167236 -11771 -253750 -236630 17628 -96936 38169 -6417 141920 166993 -13845 -133851
5468 -133851 73881 38302 206956 -66731 291810 -45459 -291123 49647 -9869 176547 244411
5457 244411 -106650 -201620 33335 -87374 81071 -166581 166597 284179 44679 -6352 32320
5445 356156 -281625 344188 109786 -255901 -96518 11795 4281 -30096 -195699 74348 -159397
5433 -8532 60892 165722 -86504 176475 -11529 371363 -108438 134218 -54325 167363 -313858
5421 147932 69137 -37849 264804 405228 288557 -53463 87403 71293 124653 134419 -57276
5409 129017 183749 106246 -310426 10797 175264 -192428 149243 75395 -43985 -199036 5382
5397 22557 -50418 -102475 -173515 -158208 60821 -307071 -164698 14791 -13344 59694 24426
5385 -181028 173258 12187 -122383 -91953 -179656 185626 23135 -98485 1360 150819 -27527
5373 -85071 46301 -434186 164502 220272 28806 36025 199673 -311120 -121213 171418 -150184
5361 150872 -108519 -87503 74337 -96966 309116 34714 -278238 55538 224098 -457458 144063
5349 63010 52129 -78136 128583 -200227 -78448 68359 161763 179694 -288123 185004 -72386
5337 -55402 -136050 -89495 94579 6910 -240702 7114 348235 153643 -152031 388116 35608
5325 191008 34300 -87205 108377 -14117 -126716 -186310 369876 227858 -395233 57781 -369600
5313 58428 -235248 398677 468811 -33313 -53399 476478 97548 301564 188035 151344 21203
5301 -138243 27935 -5777 81194 61278 -101605 -235874 138026 -76035 -95463 374110 -159241
5289 -118814 -20497 357562 333762 419001 178933 146385 -13538 45222 -218400 161384 559070
5278 559070 209858 -210236 166066 882 -89570 -19619 172943 184027 -365497 -128147 -591321
5267 -591321 85014 -200637 -185200 -223574 -9072 -131078 52976 -228923 -293883 37601 -388746
5255 214123 151179 -61012 -141416 -32602 225449 -349 142683 9810 11530 109184 -49477 -67168
5243 -67168 149087 110739 -149086 -114537 127380 -48632 -39288 -2502 -97934 165531 267822
5232 267822 159256 318679 -116240 -243615 146622 166368 155692 -226849 -127846 33229
5221 -78536 -118480 197658 -249061 -119744 -222870 -277734 -247847 -196870 266236 -13661 235600
5209 181147 -88816 143662 234672 61660 60104 269698 -123811 311744 -83668 -93895 329945
5197 -106654 -207336 68461 18556 295712 -34292 -145988 69993 -153897 10438 -41111 127163
5185 31576 -31667 -210822 -52794 7426 261663 -241546 -229508 6807 -17997 -146993 -105262
5174 -105262 65118 59428 102837 92503 183002 212167 -155953 -240819 -217935 28313 55413 311860
5162 311860 100581 -9158 -211018 -43113 -89454 217515 79089 -62305 355989 -206264 171808
5150 -34689 192647 -55296 -4550 -119244 53893 65594 -222832 -254949 -123742 136902 274954
5139 274954 205354 220693 -41158 80910 1246 299345 -54458 -294626 -61365 5660 200013
5128 200013 357490 -41264 -41487 -71947 -96050 -159789 134536 -85070 -68623 -82327 77853 181093
5116 181093 11407 131737 9028 -111340 29787 103415 113768 22074 238555 -162067 -49670
5104 178638 -212624 11369 -76883 -185398 -29356 -314766 101704 125255 -52205 82672 192489
5093 192489 70987 -63780 -74965 25667 368227 -156017 96233 -281148 94692 361594 16662
5081 66195 21114 25828 -36942 -410183 -333366 -53283 110354 241856 -63455 -117052 270651
5069 -14365 -86326 197300 -121528 -135030 58586 -127156 284575 -373464 -71270 191588 92109
5057 141755 -126538 -352834 -76273 239623 -42288 16317 -164711 -150846 20506 27416 -33351
5045 -248480 -71245 102806 -85860 -82843 -123250 221943 39504 183703 -7631 33286 -34910
5033 -142193 118703 342424 200180 -40984 260451 96196 -14862 -31606 120534 -91095 78707
5021 -29174 -22827 -6519 -78356 -239736 75940 -352428 -214807 27696 -69508 208688 242159
5010 242159 175144 -96351 -57676 118179 238443 -264269 -88449 179691 143345 334 218072
4999 218072 230254 106936 158026 277380 -40615 -270870 -75209 -85318 -230056 -156605 -259174
4988 -259174 -462336 151899 -87275 124366 -215701 -136067 -18143 -400969 -34126 268169
4977 -242551 30852 139261 16049 218449 202441 74026 -137079 -16361 -272358 -210780 -103058
4965 194463 63281 262276 -75774 -68532 -104128 -172344 -213282 -153680 -10496 205097 -53223
4953 45621 -175439 117367 164009 -251091 -40835 155282 133197 20687 111911 -45725 51656
4941 -313077 30638 145179 -247595 9614 15928 33262 -187298 -384552 -76517 -19331 15840
4929 -217797 182201 350995 -3957 -169674 -12693 -100132 358477 -84796 -43363 -252243 -4982
4917 -11815 -41014 83637 -301639 -46953 -127768 -57417 -104751 94391 -77025 216517 -371570
4905 -15968 5956 -30697 195732 24072 -261097 -113516 -129872 -97453 242207 185097 111685
4894 111685 -48906 -142868 314280 -306509 109602 5904 140383 -70790 -346442 101187 194758
4883 194758 -152237 96273 15917 -49250 129677 192711 -39969 149065 30975 -209289 -40163
4871 -109027 -293676 212212 -36253 -171298 3683 50218 -136281 23653 -245619 176212 -149063
4859 84433 15833 141979 -180259 -138322 -221985 121499 208896 -26206 -124416 262998 34487
4847 115341 181057 -37256 110890 87588 -4260 103814 -140875 145613 73254 -248502 329719
4835 31472 -434509 -55194 287629 -81861 -135818 -6306 53957 245153 -241646 -94218 168172
4823 100854 149119 -126299 109589 -16225 -124671 159274 140721 -71984 88684 -92031 -89471
4812 -89471 32920 -377799 143215 88969 238970 -43352 194131 -115190 153076 -19966 195162
4800 79750 96001 -59959 15302 -242171 -158782 344136 -57081 24554 227932 -111321 84488
4788 133671 -213927 -206931 51934 -23413 -71422 85966 42454 -73510 -93799 25094 -167389
4776 599403 -70597 209928 -261809 325126 -411579 -168185 -303117 -175690 142800 23644
4765 -102603 164642 264018 20638 -128415 -271439 -344470 115352 101850 -29954 132123 128601
4754 128601 -188730 104131 39494 -81810 87153 144922 684 -178323 -32693 149658 -315572
4742 -118134 95264 -238733 -82268 188354 129115 -212212 -91891 70481 -294871 12801 -121057
4730 88126 140031 77252 245884 131962 262771 -78517 -14957 -43223 150734 -342887 9373
4718 18466 -225150 240677 395699 -714 -48069 216128 -254263 199534 120379 -145677 -19322
4706 117126 184019 118005 67934 -53822 -254626 -3759 85050 6312 25564 -67613 107357 115208
4694 115208 88448 -203126 -22822 -156747 23832 -48652 -185140 71644 -69537 -130766 153446
4682 415773 15541 -23840 -1440 296109 -182842 -62917 -38404 50539 17590 -206809 -146067
4671 -146067 114754 2279 -59737 176442 -20079 171563 -65374 303692 -153414 81942 284925
4660 284925 -41801 -44943 -180325 -101967 -116906 -124808 42682 163441 161184 357511 152532
4648 238353 246294 -159910 224119 -144628 7112 150929 10463 -59296 -133356 271558 -273724
4636 -25164 -140439 129777 21437 63340 214105 -88741 -253290 -16796 -242107 34172 4657
4624 -252748 228212 22313 -88427 -82112 362030 -187393 228258 -54853 199904 9369 103455
4613 103455 19876 -226324 1267 -49238 224178 81890 -306618 105891 -101606 164403 164339
4602 164339 26782 47697 59773 98673 43829 135261 -126795 -175 98710 -233222 84738 -207174
4589 -75338 -105234 -163926 -221876 238202 -280762 146001 54934 140213 -314529 -130396 -142181
4578 -142181 179114 -83725 -281746 -33806 -110745 136234 -202422 -314665 263168 -219760
4567 -236578 -266746 -351364 -48981 -331496 -655426 -168 75093 45536 -110797 -99357 -93859 8437
4554 -70840 86133 308758 89426 64661 149325 -147607 -78551 159629 23108 65599 -30531
4542 -36812 189858 -111024 -28445 50861 261412 -13064 -106724 9173 -109586 -96143 308219
4530 55798 35500 137476 -39491 -138664 274998 -56257 180343 89266 -158326 58468 111627
4519 111627 -71225 433891 -79003 131087 299165 -9115 -86744 113293 7604 54652 224487
4508 224487 -33596 -12575 53117 -118431 -142175 -140216 102542 74850 -179932 -310298 -202917
4497 -202917 117192 -210574 -52497 -439652 -321728 233627 -269481 50559 197611 167584
$$ [...]
##END NTUPLES=NMR SPECTRUM
##END=
