##TITLE=AC1579_ROEFFECT0024_8271261_KkX4UNjri4
##JCAMPDX= 6.0         $$ Bruker NMR JCAMP-DX V2.0
##DATA TYPE= NMR SPECTRUM
##DATA CLASS= NTUPLES
##ORIGIN= BRUKER
##OWNER= Administrator
$$ 1.72 TOPSPIN		Version 2.1
$$ 2013-10-18 22:58:02.197 -0700  Administrator@X
$$ Compression mode = diff/dup
##.OBSERVE FREQUENCY= 400.02188249412
##.OBSERVE NUCLEUS= ^1H
##.ACQUISITION MODE= SIMULTANEOUS (DQD)
##.ACQUISITION SCHEME= undefined
##.AVERAGES= 64
##.DIGITISER RES= 22
##SPECTROMETER/DATA SYSTEM= spect
##.PULSE SEQUENCE= noesygpps1d.comp
##.SOLVENT NAME= COFFEE_meoh
##.SHIFT REFERENCE= INTERNAL, COFFEE_meoh, 1, 14.96066
##AUDIT TRAIL= $$ (NUMBER, WHEN, WHO, WHERE, PROCESS, VERSION, WHAT)
$$ ##TITLE= Audit trail, TOPSPIN		Version 2.1
$$ ##JCAMPDX= 5.01
$$ ##ORIGIN= Bruker BioSpin GmbH
$$ ##OWNER= Administrator
$$ $$ E:\/data/COFFEE/nmr/AC1579_ROEFFECT0024_8271261_KkX4UNjri4/12/pdata/1/auditp.txt
$$ ##AUDIT TRAIL=  $$ (NUMBER, WHEN, WHO, WHERE, PROCESS, VERSION, WHAT)
(   1,<2013-10-18 22:57:56.963 -0700>,<Administrator>,<X>,<go>,<TOPSPIN 2.1>,
      <created by zg
	started at 2013-10-18 22:46:27.298 -0700,
	POWCHK enabled, PULCHK disabled,
       configuration hash MD5:
       C8 4E 4E 5D D3 5C D8 9E 9F 52 82 E0 59 8A DE 15
       data hash MD5: 64K
       77 93 B4 C9 27 6D 43 A8 D6 2B 43 A9 21 48 62 43>)
(   2,<2013-10-18 22:58:00.056 -0700>,<Administrator>,<X>,<proc1d>,<TOPSPIN 2.1>,
      <Start of raw data processing
       efp LB = 0.3 FT_mod = 6 PKNL = 1 PHC0 = 0 PHC1 = 0 SI = 128K 
       data hash MD5: 128K
       A9 2E 35 8C 65 2D 07 D1 03 EC DC 04 57 87 97 9A>)
(   3,<2013-10-18 22:58:01.072 -0700>,<Administrator>,<X>,<proc1d>,<TOPSPIN 2.1>,
      <pk PHC0 = -84.86938 PHC1 = 0 
       data hash MD5: 128K
       67 89 58 80 C2 70 45 75 A4 CE A5 CA 2A C3 03 8F>)
(   4,<2013-10-18 22:58:01.556 -0700>,<Administrator>,<X>,<proc1d>,<TOPSPIN 2.1>,
      <abs ABSG = 1 
       data hash MD5: 128K
       ED 54 64 26 4A 9F 80 DF AC 99 08 E2 F0 E6 3D 2C>)
(   5,<2013-10-18 22:58:01.666 -0700>,<Administrator>,<X>,<proc1d>,<TOPSPIN 2.1>,
      <abs ABSG = 2 
       data hash MD5: 128K
       BF C5 62 DE 48 29 64 91 60 05 29 37 13 38 39 1B>)
(   6,<2013-10-18 22:58:01.759 -0700>,<Administrator>,<X>,<proc1d>,<TOPSPIN 2.1>,
      <abs ABSG = 3 
       data hash MD5: 128K
       D0 2E F1 8E 5B BC 69 C2 98 E4 4D 5B 5F 60 47 BC>)
(   7,<2013-10-18 22:58:01.838 -0700>,<Administrator>,<X>,<proc1d>,<TOPSPIN 2.1>,
      <abs ABSG = 4 
       data hash MD5: 128K
       FE 55 C1 70 9A E7 E9 77 30 47 68 A8 52 3D F1 D4>)
(   8,<2013-10-18 22:58:01.916 -0700>,<Administrator>,<X>,<proc1d>,<TOPSPIN 2.1>,
      <abs ABSG = 5 
       data hash MD5: 128K
       BF 51 4F 8F EE EB B1 90 67 39 F5 6E 6A 92 71 21>)
$$ ##END=
$$ 
$$ $$ hash MD5
$$ $$ E5 2D E1 62 3E 76 6D BF 0F F5 23 21 6C A0 41 DA
##$RELAX= 
##$RELAX= 
##$RELAX= 
##$RELAX= 
##$RELAX= 
##$RELAX= 
##$RELAX= 
##$RELAX= 
$$ Bruker specific parameters
$$ --------------------------
##$DU= <E:\>
##$EXPNO= 12
$$ [...]
##$TP07= 0
##$TPNAME0= <>
##$TPNAME1= <>
##$TPNAME2= <>
##$TPNAME3= <>
##$TPNAME4= <>
##$TPNAME5= <>
##$TPNAME6= <>
##$TPNAME7= <>
##$TPOAL= (0..7)
0.5 0.5 0.5 0.5 0.5 0.5 0.5 0.5
##$TPOFFS= (0..7)
0 0 0 0 0 0 0 0
##$TUNHIN= 0
##$TUNHOUT= 0
##$TUNXOUT= 0
##$USERA1= <user>
##$USERA2= <user>
##$USERA3= <user>
##$USERA4= <user>
##$USERA5= <user>
##$V9= 5
##$VALIST= <valist>
##$VCLIST= <CCCCCCCCCCCCCCC>
##$VD= 0
##$VDLIST= <DDDDDDDDDDDDDDD>
##$VPLIST= <PPPPPPPPPPPPPPP>
##$VTLIST= <TTTTTTTTTTTTTTT>
##$WBST= 1024
##$WBSW= 4
##$XGAIN= (0..3)
0 0 0 0
##$XL= 0
##$YL= 0
##$YMAX_a= 6501272
##$YMIN_a= -12841014
##$ZGOPTNS= <>
##$ZL1= 120
##$ZL2= 120
##$ZL3= 120
##$ZL4= 120
##$ABSF1= 14.96066
##$ABSF2= -5.597522
##$ABSG= 5
##$ABSL= 3
##$ALPHA= 0
##$AQORDER= 0
##$ASSFAC= 0
##$ASSFACI= 0
##$ASSFACX= 0
##$ASSWID= 0
##$AUNMP= <proc_prof1d_extract.lims>
##$AXLEFT= 0
##$AXNAME= <>
##$AXNUC= <1H>
##$AXRIGHT= 0
##$AXTYPE= 0
##$AXUNIT= <>
##$AZFE= 0.1
##$AZFW= 0.1
##$BCFW= 0
##$BC_mod= 0
##$BYTORDP= 0
##$COROFFS= 0
##$CY= 15
##$DATMOD= 1
##$DC= 0
##$DFILT= <>
##$DTYPP= 0
##$F1P= 0
##$F2P= 0
##$FCOR= 0.5
##$FTSIZE= 131072
##$FT_mod= 6
##$GAMMA= 0
##$GB= 0
##$INTBC= 1
##$INTSCL= 1
##$ISEN= 128
##$LB= 0.3
##$LEV0= 0
##$LPBIN= 0
##$MAXI= 10000
##$MC2= 0
##$MEAN= 0
##$ME_mod= 0
##$MI= 0
##$NCOEF= 0
##$NC_proc= -2
##$NLEV= 6
##$NOISF1= 0
##$NOISF2= 0
##$NSP= 0
##$NTH_PI= 0
##$NZP= 0
##$OFFSET= 14.96066
##$PC= 1
##$PHC0= -84.86938
##$PHC1= 0
##$PH_mod= 1
##$PKNL= yes
##$PPARMOD= 0
##$PPDIAG= 0
##$PPIPTYP= 0
##$PPMPNUM= 2147483647
##$PPRESOL= 1
##$PSCAL= 4
##$PSIGN= 0
##$PYNMP= <proc.py>
##$REVERSE= no
##$SF= 400.020009773981
##$SI= 131072
##$SIGF1= 0
##$SIGF2= 0
##$SINO= 400
##$SIOLD= 131072
##$SPECTYP= <>
##$SREGLST= <1H.CDCl3>
##$SSB= 0
##$STSI= 131072
##$STSR= 0
##$SW_p= 8223.68421052631
##$SYMM= 0
##$S_DEV= 0
##$TDeff= 65536
##$TDoff= 0
##$TI= <>
##$TILT= no
##$TM1= 0
##$TM2= 0
##$TOPLEV= 0
##$USERP1= <user>
##$USERP2= <user>
##$USERP3= <user>
##$USERP4= <user>
##$USERP5= <user>
##$WDW= 1
##$XDIM= 131072
##$YMAX_p= 425567754
##$YMIN_p= -12920
##$CURPLOT= <Network HP LaserJet P1505>
##$CURPRIN= <$Network HP LaserJet P1505>
##$DFORMAT= <normdp>
##$LAYOUT= <+/1D_H.xwp>
##$LFORMAT= <normlp>
##$PFORMAT= <normpl>
##$SURQMSG= 1
$$ End of Bruker specific parameters
$$ ---------------------------------
##NTUPLES= NMR SPECTRUM
##VAR_NAME=  FREQUENCY,     SPECTRUM/REAL,   SPECTRUM/IMAG
##SYMBOL=    X,             R,               I
##VAR_TYPE=  INDEPENDENT,   DEPENDENT,       DEPENDENT
##VAR_FORM=  AFFN,          ASDF,            ASDF
##VAR_DIM=   131072,        131072,          131072
##UNITS=     HZ,            ARBITRARY UNITS, ARBITRARY UNITS
##FACTOR=    0.0627417313425164, 1,          1
##FIRST=     8223.62146879497, 2442,         -63048
##LAST=      0,             3049,            -63006
##MIN=       0,             -12920,          0
##MAX=       8223.62146879497, 425567754,    0
$$ Real data points
##PAGE= N=1
##DATA TABLE= (X++(R..R)), XYDATA
$$ [...]
$$ plain form
63843 1684382 1654469 1615374 1568773 1517387 1463159 1406470 1346956 1284817 1221412 1158778 1098540
63832 1098540 1041078 985696 931649 879053 828922 782459 740308 702227 667322 634739 604274
63821 604274 576273 550890 527653 505965 485853 467808 451864 437235 423193 410005 398558
63810 398558 389088 380744 372631 364893 358350 353239 348804 344244 339585 335297 331322 327027 322138 317365
63796 317365 313781 311719 310483 309055 306867 303843 300040 295648 291284 287808 285523 283707 281288 278023
63782 278023 274792 272750 272383 273285 274467 274857 273937 272172 270510 269237 267639 265126 262281 260207 259015
63767 259015 257654 255334 252470 249995 248274 247097 246326 245972 245807 245483 245023 244841 245192 245924 246796 247677 248319
63750 248319 248329 247636 246769 246364 246505 246864 247358 248272 249629 250813 251181 250896 250862 251806 253662 255936 258412 261263
$$ packed form
63843A684382k9913l9095m6601n1386n4228n6689n9514o2139o3405o2634o0238
63832A098540n7462n5382n4047n2596n0131m6463m2151l8081l4905l2583l0465
63821F04274k8001k5383k3237k1688k0112j8045j5944j4629j4042j3188j1447
63810C98558r470q344q113p738o543n111m435m560m659m288l975m295m889m773
63796C17365l584k062j236j428k188l024l803m392m364l476k285j816k419l265
63782B78023l231k042l67R02J182L90r20j765j662j273j598k513k845k074j192
63767B59015j361k320k864k475j721j177p71l54j65l24m60j82L51P32Q72Q81O42
63750B48319J0o93q67m05J41L59M94R14J357J184L68k85l4R44J856K274K476K851
$$ plain form
63732 261263 264567 267994 271053 273525 275556 277465 279573 282142 285293 288957 293019 297493 302464 307821
63718 307821 313168 318108 322565 326748 330773 334345 336806 337533 336489 334451 332576 331533 331013 330195 328684
63703 328684 326890 325503 324773 324345 323686 322592 321376 320638 320836 322017 323985 326641 330023 334057 338436
63688 338436 342810 346920 350499 353297 355366 357126 358917 360542 361452 361397 360718 360052 359883 360343 361279 362437
63672 362437 363659 364913 366193 367560 369332 371978 375491 378978 381151 381373 380129 378477 377063 375541
63658 375541 372844 368211 362131 356122 351275 347153 342445 336576 330261 324609 320185 317027 315006 313891
63644 313891 313422 313595 314593 316242 317971 319611 321895 325677 330833 336321 341264 345631 349914 354524 359593
63629 359593 365122 371168 377849 385100 392424 399106 404874 410251 416097 422936 430823 439643 449336 459960
$$ packed form
63732B61263L304L427L059K472K031J909K108K569L151L664M062M474M971N357
63718C07821N347M940M457M183M025L572K461P27j044k038j875j043n20q18j511
63703C28684j794j387p30m28o59j094j216p38J98J181J968K656L382M034M379
63688C38436M374M110L579K798K069J760J791J625R10n5o79o66j69M60R36J158
63672C62437J222J254J280J367J772K646L513L487K173K22j244j652j414j522
63658C75541k697m633o080o009m847m122m708n869o315n652m424l158k021j115
63644C13891m69J73R98J649J729J640K284L782N156N488M943M367M283M610N069
63629C59593N529O046O681P251P324O682N768N377N846O839P887Q820R693J0624
$$ plain form
63615 459960 471738 484914 499411 514885 531354 549512 570052 592913 617607 644189 673377
63604 673377 705620 740407 776443 812046 845285 874282 897856 915772 928231 935366 937468 935477
63592 935477 930827 924690 917533 909425 900547 891153 881057 869395 855072 837403 816271 791973 765349
63579 765349 737966 711502 686614 662770 639516 617582 598299 582236 568906 557652 548281 540880
63567 540880 535510 532163 530645 530542 531617 534135 538346 543789 549665 555843 562862 570908 579518 588502
63553 588502 598468 610058 623300 638184 655367 675778 699929 728135 761123 799876 845018 896568
63541 896568 953603 1013220 1069985 1117487 1151214 1170090 1175740 1170980 1159018 1143093 1125893 1109091
63529 1109091 1093487 1079410 1066814 1055091 1042984 1028831 1011117 989068 962802 932832 899497
$$ packed form
63615D59960J1778J3176J4497J5474J6469J8158K0540K2861K4694K6582K9188
63604F73377L2243L4787L6036L5603L3239K8997K3574J7916J2459P135K102j991
63592I35477m650o137p157q108q878r394j0096j1662j4323j7669k1132k4298k6624
63579G65349k7383k6464k4888k3844k3254k1934j9283j6063j3330j1254r371p401
63567E40880n370l347j518j03J075K518M211N443N876O178P019Q046Q610Q984
63553E88502R966J1590J3242J4884J7183K0411K4151K8206L2988L8753M5142N1550
63541H96568N7035N9617N6765M7502L3727J8876N650m760j1962j5925j7200j6802
63529A109091j5604j4077j2596j1723j2107j4153j7714k2049k6266k9970l3335
$$ plain form
63518 899497 863148 824793 786157 748838 713462 679779 647504 616956 588975 564287 542926
63507 542926 524213 507303 491766 477649 465129 454231 444789 436442 428647 420911 413212 406089 400131
63494 400131 395370 391300 387512 384115 381384 379137 376827 374340 372383 371821 372785 374705 377012 379433 381731
63479 381731 383697 385507 387656 390406 393703 397702 402769 408572 413743 417050 418616 419425 419847 419334 417502
63464 417502 414784 411889 409165 406801 405219 404791 405311 406017 406206 405824 405502 405958 407232 408601 409404 409799
63448 409799 410410 411487 412875 414798 418021 422979 429197 435915 443016 451004 460332 471144 483708 498816
63434 498816 517711 541705 571791 608409 651222 698734 747897 794336 833642 862947 881479
63423 881479 890020 890343 885164 877846 871484 868225 869475 876320 889400 908686 933826 964470 999817
$$ packed form
63518H99497l6349l8355l8636l7319l5376l3683l2275l0548k7981k4688k1361
63507E42926j8713j6910j5537j4117j2520j0898r442q347p795p736p699p123n958
63494D00131m761m070l788l397k731k247k310k487j957n62R64J920K307K421K298
63479C81731J966J810K149K750L297L999N067N803N171L307J566Q09M22n13j832
63464D17502k718k895k724k364j582m28N20P06J89l82l22M56J274J369Q03L95
63448D09799O11J077J388J923L223M958O218O718P101P988R328J0812J2564J5108
63434D98816J8895K3994L0086L6618M2813M7512M9163M6439L9306K9305J8532
63423H81479Q541L23n179p318o362l259J250O845J3080J9286K5140L0644L5347
$$ plain form
63410 999817 1037968 1076249 1112125 1143438 1168011 1183935 1190784 1190184 1184724 1176417 1166322 1155204
63398 1155204 1143845 1132574 1120855 1107493 1091081 1070312 1044313 1013098 977658 939396 899509
63387 899509 859013 819195 781494 746694 714488 684151 655637 629772 607371 588382 572002
63376 572002 557467 544635 533936 525942 520965 518893 519315 521846 526356 532905 541481 551866 563845
63363 563845 577524 593342 611710 632708 656278 682633 712220 745162 780989 819153 859649
63352 859649 902775 948221 994549 1039630 1081477 1118637 1149997 1174528 1191362 1200230 1201803 1197511
63340 1197511 1189044 1178039 1165996 1153974 1142102 1129683 1115985 1100576 1082642 1060566 1033068
63329 1033068 1000737 965733 929867 893579 856945 820923 787125 756881 731023 710214 694932
$$ packed form
63410I99817L8151L8281L5876L1313K4573J5924O849o00n460q307j0095j1118
63398A155204j1359j1271j1719j3362j6412k0769k5999l1215l5440l8262l9887
63387H99509m0496l9818l7701l4800l2206l0337k8514k5865k2401j8989j6380
63376E72002j4535j2832j0699p994m977k072M22K531M510O549Q576J0385J1979
63363E63845J3679J5818J8368K0998K3570K6355K9587L2942L5827L8164M0496
63352H59649M3126M5446M6328M5081M1847L7160L1360K4531J6834Q868J573m292
63340A197511q467j1005j2043j2022j1872j2419j3698j5409j7934k2076k7498
63329A033068l2331l5004l5866l6288l6634l6022l3798l0244k5858k0809j5282
$$ plain form
63318 694932 685366 681654 683755 690209 697112 699205 692614 676618 653035 624552 593811 563296 535068
63305 535068 510194 488642 469882 453549 439509 427534 417260 408541 401539 396125 391359 386041
63293 386041 379895 373863 369016 365449 362448 359401 356196 352975 349928 347285 345123 343162 341006 338614
63279 338614 336325 334457 333100 332271 332043 332479 333524 334896 336062 336630 336950 337951 339941 341984 343052
63264 343052 343600 345139 348178 351441 353493 354511 355920 358758 362973 368032 373595 379638 386379 394110
63250 394110 402736 411488 419404 426195 432433 438942 446197 454261 463004 472311 482262 493218 505607 519644
63236 519644 535313 552513 571034 590482 610526 631274 653186 676531 701073 726309 751797
63225 751797 777206 802297 827024 851531 875910 900059 923935 947810 972108 997046 1022573
$$ packed form
63318F94932r566l712K101O454O903K093o591j5996k3583k8483l0741l0515k8228
63305E35068k4874k1552j8760j6333j4040j1975j0274q719p002n414m766n318
63293C86041o146o032m847l567l001l047l205l221l047k643k162j961k156k392
63279C38614k289j868j357q29k28M36J045J372J166N68L20J001J990K043J068
63264C43052N48J539L039L263K052J018J409K838M215N059N563O043O741P731
63250C94110Q626Q752P916O791O238O509P255Q064Q743R307R951J0956J2389J4037
63236E19644J5669J7200J8521J9448K0044K0748K1912K3345K4542K5236K5488
63225G51797K5409K5091K4727K4507K4379K4149K3876K3875K4298K4938K5527
$$ plain form
63214 1022573 1048516 1074475 1099546 1122405 1141799 1156823 1166630 1170221 1166850 1156581 1140115 1118083
63202 1118083 1090870 1059217 1024641 988886 953082 917645 882896 849550 818678 791474 768938
63191 768938 751459 738559 729288 722984 719568 719151 721655 726907 734865 745576 759030 775115 793490
63178 793490 813394 833780 853935 873865 893909 914070 933923 953100 971650 989860 1007783
63167 1007783 1024857 1039923 1051716 1059508 1063277 1063213 1059217 1050992 1038410 1021558 1000557 975626 947276
63154 947276 916197 882917 847916 812125 777037 744078 713876 686174 660410 636374 614456
63143 614456 595267 578988 565129 553052 542572 533733 526110 518864 511660 505155 500255 497125 495247
63130 495247 494129 493508 493016 492275 491492 491540 493100 495951 499292 502583 505844 509304 513071 517194 521775 526910
$$ packed form
63214A022573K5943K5959K5071K2859J9394J5024R807L591l371j0269j6466k2032
63202A118083k7213l1653l4576l5755l5804l5437l4749l3346l0872k7204k2536
63191G68938j7479j2900r271o304l416m17K504N252P958J0711J3454J6085J8375
63178G93490J9904K0386K0155J9930K0044K0161J9853J9177J8550J8210J7923
63167A007783J7074J5066J1793P792L769o4l996q225j2582j6852k1001k4931k8350
63154I47276l1079l3280l5001l5791l5088l2959l0202k7702k5764k4036k1918
63143F14456j9189j6279j3859j2077j0480q839p623p246p204o505m900l130j878
63130D95247j118o21m92p41p83M8J560K851L341L291L261L460L767M123M581N135
$$ plain form
63114 526910 532536 538335 543756 548255 551701 554569 557581 561052 564642 567753 570071 571750 573191 574751
63100 574751 576535 578360 579925 581126 582274 583961 586678 590493 595031 599703 604078 608073 611797 615213
63086 615213 618004 619812 620553 620367 619356 617509 614948 612146 609759 608276 607917 608852 611351 615571 621238
63071 621238 627690 634357 641179 648542 656868 666363 677123 689361 703421 719556 737739 757752 779434
63058 779434 802838 828149 855625 885812 919652 958016 1000924 1047510 1096974 1149334 1204902
63047 1204902 1263286 1323477 1384906 1447794 1512225 1577381 1642117 1705966 1769141 1831796 1893859
63036 1893859 1955569 2017610 2080382 2143342 2205265 2265087 2322276 2376250 2425409 2466960 2497996
63025 2497996 2516741 2522517 2514672 2492303 2455392 2405565 2345008 2275092 2196918 2112938 2026846 1941544
$$ packed form
63114E26910N626N799N421M499L446K868L012L471L590L111K318J679J441J560
63100E74751J784J825J565J201J148J687K717L815M538M672M375L995L724L416
63086F15213K791J808P41j86j011j847k561k802k387j483l59R35K499M220N667
63071F21238O452O667O822P363Q326R495J0760J2238J4060J6135J8183K0013K1682
63058G79434K3404K5311K7476L0187L3840L8364M2908M6586M9464N2360N5568
63047A204902N8384O0191O1429O2888O4431O5156O4736O3849O3175O2655O2063
63036A893859O1710O2041O2772O2960O1923N9822N7189N3974M9159M1551L1036
63025B497996J8745N776p845k2369l6911m9827o0557o9916p8174q3980q6092q5302
$$ plain form
63013 1941544 1858151 1777508 1701752 1633496 1573912 1522571 1479081 1444036 1418193 1401441 1392923
63002 1392923 1391777 1397289 1408577 1424586 1444496 1467917 1494518 1523569 1553994 1584876 1615817 1646766
62990 1646766 1677666 1708413 1739015 1769490 1799557 1828637 1856118 1881318 1903129 1919959 1930230
62979 1930230 1932807 1926923 1912056 1888115 1855518 1814902 1766923 1712509 1653062 1590176 1525373 1460313
62967 1460313 1396895 1336644 1280044 1226835 1176976 1131008 1089453 1052133 1018182 986689 957341
62956 957341 930512 906583 885116 864931 845110 825559 806377 787165 767469 747665 728720
62945 728720 711174 694908 679872 666323 654173 642679 631185 619849 609381 600264 592424 585400
62933 585400 578698 572177 566197 561165 556951 553055 549387 546409 544374 542861 541322 539708 538329 537341
$$ packed form
63013A941544q3393q0643p5756o8256n9584n1341m3490l5045k5843j6752q518
63002A392923j146N512J1288J6009J9910K3421K6601K9051L0425L0882L0941L0949
62990A646766L0900L0747L0602L0475L0067K9080K7481K5200K1811J6830J0271
62979A930230K577n884j4867k3941l2597m0616m7979n4414n9447o2886o4803o5060
62967A460313o3418o0251n6600n3209m9859m5968m1555l7320l3951l1493k9348
62956I57341k6829k3929k1467k0185j9821j9551j9182j9212j9696j9804j8945
62945G28720j7546j6266j5036j3549j2150j1494j1494j1336j0468r117p840p024
62933E85400o702o521n980n032m214l896l668k978k035j513j539j614j379r88
$$ plain form
62919 537341 536633 535932 534866 533305 531784 531114 531299 531371 530715 530008 530257 531357 532343 532734 532692 531977 529785 525946
62901 525946 521486 517551 514339 511512 509136 507581 506832 506538 506690 507692 509599 511725 513226 513940 514323
62886 514323 514583 514127 512250 509380 507191 507048 508542 510093 510937 511782 513328 514990 515796 515918 516323 517063
62870 517063 516994 515427 513130 511229 509804 508236 506347 504405 502341 499880 497399 495789 495245 494948 494254
62855 494254 493560 493522 493971 494177 493817 493108 492263 491423 490928 491041 491437 491577 491543 491898 492674 493154 492851 492092 491355
62836 491355 490629 489763 488918 488162 487121 485634 484404 484330 485324 486414 486972 487268 487830 488840 490322 492437 495283
62819 495283 498698 502444 506374 510316 514055 517521 520754 523671 526187 528630 531681 535692 540374 545316
62805 545316 550495 556080 562103 568653 576129 584875 594670 604925 615321 626025 637435 650016 664208
$$ packed form
62919E37341p08p01j066j561j521o70J85P2o56p07K49J100R86L91m2p15k192l839
62901E25946m460l935l212k827k376j555p49k94J52J002J907K126J501P14L83
62886E14323K60m56j877k870k189j43J494J551Q44Q45J546J662Q06J22M05P40
62870E17063o9j567k297j901j425j568j889j942k064k461k481j610n44k97o94
62855D94254o94l8M49K06l60p09q45q40m95J13L96J40l4L55P76M80l03p59p37
62836D91355p26q66q45p56j041j487j230p4R94J090N58K96N62J010J482K115K846
62819D95283L415L746L930L942L739L466L233K917K516K443L051M011M682M942
62805E45316N179N585O023O550P476Q746R795J0255J0396J0704J1410J2581J4192
$$ plain form
62792 664208 679976 696516 712957 729635 748258 770561 797041 827263 861056 899019 942018
62781 942018 990693 1045464 1106670 1174578 1249485 1331843 1421928 1519173 1622019 1728537 1836916
62770 1836916 1945233 2051108 2151969 2245404 2328851 2399209 2453461 2489863 2508129 2508411 2490715
62759 2490715 2455583 2404735 2340424 2264479 2178614 2085410 1988191 1889622 1790905 1692513 1595350
62748 1595350 1500983 1411070 1326825 1248758 1176627 1109787 1047928 991372 940508 895070 854210
62737 854210 817216 783894 754278 728220 705333 685179 667449 652064 639112 628569 620040 612873
62725 612873 606581 601139 596853 593946 592220 591036 589707 588086 586837 587006 589229 593326 598646 604716
62711 604716 611591 619781 629986 642783 658330 676387 696807 720032 746852 777618 811970 849545
$$ packed form
62792F64208J5768J6540J6441J6678J8623K2303K6480L0222L3793L7963M2999
62781I42018M8675N4771O1206O7908P4907Q2358R0085R7245J02846J06518J08379
62770A836916J08317J05875J00861R3435Q3447P0358N4252L6402J8266K82j7696
62759B490715l5132n0848o4311p5945q5865r3204r7219r8569r8717r8392r7163
62748A595350r4367q9913q4245p8067p2131o6840o1859n6556n0864m5438m0860
62737H54210l6994l3322k9616k6058k2887k0154j7730j5385j2952j0543q529p167
62725F12873o292n442m286k907j726j184j329j621j249J69K223M097N320O070
62711F04716O875Q190J0205J2797J5547J8057K0420K3225K6820L0766L4352L7575
$$ plain form
62699 849545 890742 936394 986828 1041701 1100756 1164199 1232076 1303680 1377922 1453845 1530274
62688 1530274 1605221 1676250 1741412 1799264 1847970 1885068 1908529 1917740 1913170 1895405 1864823 1822010
62676 1822010 1768202 1705427 1636296 1563329 1488192 1411819 1335459 1261196 1190966 1125363 1063928
62665 1063928 1006441 953323 904786 860325 819333 781752 747800 717420 690299 666186 644844
62654 644844 625872 608826 593432 579468 566666 554962 544629 535768 527746 519562 510816 501981
62642 501981 493643 485854 478435 471608 465949 461790 458968 457177 456316 456395 457249 458490 459683 460529 460894 460719
62626 460719 459896 458248 455735 452759 450161 448725 448617 449350 450318 451296 452440 453976 456004 458532 461542
62611 461542 464989 468830 473166 478314 484644 492194 500506 509068 518040 528353 540811 555162 570500
$$ packed form
62699H49545M1197M5652N0434N4873N9055O3443O7877P1604P4242P5923P6429
62688A530274P4947P1029O5162N7852M8706L7098K3461R211m570j7765l0582m2813
62676A822010n3808o2775o9131p2967p5137p6373p6360p4263p0230o5603o1435
62665A063928n7487n3118m8537m4461m0992l7581l3952l0380k7121k4113k1342
62654F44844j8972j7046j5394j3964j2802j1704j0333q861q022q184q746q835
62642E01981q338p789p419o827n659m159k822j791q61P9Q54J241J193Q46L65j75
62626D60719q23j648k513k976k598j436j08P33R68R78J144J536K028K528L010
62611D61542L447L841M336N148O330P550Q312Q562Q972J0313J2458J4351J5338
$$ plain form
62598 570500 586673 604900 626680 652421 681536 713669 749275 788988 832901 880564 931218
62587 931218 983681 1036348 1087686 1136619 1182207 1222963 1256732 1281257 1294977 1297625 1290282 1274651
62575 1274651 1252034 1223020 1188165 1148619 1105834 1060978 1015008 969010 923910 879951 837053
62564 837053 795757 757308 722668 691881 664511 640231 618671 599160 581132 564687 550422
62553 550422 538752 529507 521973 515195 508512 502036 496342 491549 487059 482511 478509 475876 474538 473805
62539 473805 473519 474121 475627 477406 479174 481417 484382 487335 489367 490477 491250 491876 492252 492799 494410 497544
62523 497544 502050 508009 516059 526580 539102 553024 568609 586810 608266 632925 660555 691165
62511 691165 724831 761485 801063 843520 888377 934351 979772 1023398 1064592 1102723 1136667
$$ packed form
62598E70500J6173J8227K1780K5741K9115L2133L5606L9713M3913M7663N0654
62587I31218N2463N2667N1338M8933M5588M0756L3769K4525J3720K648p343j5631
62575A274651k2617k9014l4855l9546m2785m4856m5970m5998m5100m3959m2898
62564H37053m1296l8449l4640l0787k7370k4280k1560j9511j8028j6445j4265
62553E50422j1670r245p534o778o683o476n694m793m490m548m002k633j338p33
62539D73805k86O02J506J779J768K243K965K953K032J110P73O26L76N47J611L134
62523D97544M506N959Q050J0521J2522J3922J5585J8201K1456K4659K7630L0610
62511F91165L3666L6654L9578M2457M4857M5974M5421M3626M1194L8131L3944
$$ plain form
62500 1136667 1165141 1187305 1202773 1211183 1212206 1206205 1194588 1179145 1161085 1140977 1119688 1099026
62488 1099026 1081174 1067526 1058362 1053642 1053847 1059787 1071794 1089502 1112415 1140288 1172733 1208828
62476 1208828 1247468 1287803 1328763 1368202 1403124 1431085 1451143 1463337 1467665 1463696 1450747 1428014
62464 1428014 1394937 1352005 1301183 1245133 1185982 1125070 1063581 1002819 943804 887147 833611
62453 833611 784445 740869 703364 671592 644791 622090 602773 586571 573606 563831 556651 551347
62441 551347 547783 546389 547384 550266 554155 558429 562826 567076 570722 573415 575161 576054 575845 574011 570321
62426 570321 565094 558816 551693 543753 535187 526296 517188 507815 498326 489182 480868 473670 467633 462540
62412 462540 457984 453722 449929 446759 443748 440110 435749 431522 428226 425698 423285 420863 418934 417858
$$ packed form
62500A136667K8474K2164J5468Q410J023o001j1617j5443j8060k0108k1289k0662
62488A099026j7852j3648r164m720K05N940J2007J7708K2913K7873L2445L6095
62476A208828L8640M0335M0960L9439L4922K7961K0058J2194M328l969j2949k2733
62464A428014l3077m2932n0822n6050n9151o0912o1489o0762n9015n6657n3536
62453H33611m9166m3576l7505l1772k6801k2701j9317j6202j2965r775p180n304
62441E51347l564j394R95K882L889M274M397M250L646K693J746Q93k09j834l690
62426E70321n227o278p123p940q566q891r108r373r489r144q314p198o037n093
62412D62540m556m262l793l170l011l638m361m227l296k528k413k422j929j076
$$ plain form
62398 417858 417426 417260 417289 417727 418800 420535 422719 425131 427889 431424 435827 440355 443957 446354 448292
62383 448292 450679 453760 457287 461210 465896 471708 478559 485946 493423 501039 509250 518273 527637 536672
62369 536672 545406 554686 565245 576962 589318 602348 616781 633388 652617 674919 700920 730973
62357 730973 764863 802345 843926 890675 943165 1000753 1061921 1125032 1188549 1250730 1309381
62346 1309381 1362077 1406643 1441704 1467030 1483322 1491461 1491816 1484322 1469120 1446865 1418375 1384270
62334 1384270 1345197 1302357 1257533 1212485 1168321 1125508 1084456 1045952 1010938 979875 952427
62323 952427 927810 905268 884119 863546 842703 821073 798569 775299 751449 727453 703970
62312 703970 681518 660242 640123 621236 603645 587246 571947 557937 545549 534899 525829 518196
$$ packed form
62398D17858m32j66K9M38J073J735K184K412K758L535M403M528L602K397J938
62383D48292K387L081L527L923M686N812O851P387P477P616Q211R023R364R035
62369E36672Q734R280J0559J1717J2356J3030J4433J6607J9229K2302K6001L0053
62357G30973L3890L7482M1581M6749N2490N7588O1168O3111O3517O2181N8651
62346A309381N2696M4566L5061K5326J6292Q139L55p494j5202k2255k8490l4105
62334A384270l9073m2840m4824m5048m4164m2813m1052l8504l5014l1063k7448
62323I52427k4617k2542k1149k0573k0843k1630k2504k3270k3850k3996k3483
62312G03970k2452k1276k0119j8887j7591j6399j5299j4010j2388j0650r070p633
$$ plain form
62300 518196 512057 507522 504520 502701 501521 500454 499280 498182 497476 497277 497549 498414 500173 502916 506249
62285 506249 509617 512858 516294 520231 524504 528645 532380 535787 539020 542132 545272 548775 552747 556684
62271 556684 559863 562168 564399 567735 573009 580401 589501 599709 610920 623943 640014 659835 683369
62258 683369 710641 742279 778975 820800 867511 919318 976769 1039774 1107047 1176503 1245834
62247 1245834 1312564 1374016 1427732 1472113 1506566 1531064 1545699 1550664 1546370 1533180 1510957 1479247
62235 1479247 1438242 1389363 1334605 1275521 1213278 1149548 1086535 1025934 968432 914531 865244
62224 865244 821431 782907 748840 718734 692430 669332 648460 629344 612319 597710 585179
62213 585179 574038 563859 554555 546065 538162 530571 523288 516804 511757 508133 505113 502001 499025 496837
$$ packed form
62300E18196o139m535l002j819j180j067j174j098p06j99K72Q65J759K743L333
62285E06249L368L241L436L937M273M141L735L407L233L112L140L503L972L937
62271E56684L179K305K231L336N274P392R100J0208J1211J3023J6071J9821K3534
62258F83369K7272L1638L6696M1825M6711N1807N7451O3005O7273O9456O9331
62247A245834O6730O1452N3716M4381L4453K4498J4635M965m294j3190k2223l1710
62235A479247m1005m8879n4758n9084o2243o3730o3013o0601n7502n3901m9287
62224H65244m3813l8524l4067l0106k6304k3098k0872j9116j7025j4609j2531
62213E85179j1141j0179r304q490p903p591p283o484n047l624l020l112k976k188
$$ plain form
62199 496837 495538 494879 495128 496918 500194 504119 508250 513053 518980 525755 533024 541051 550202 560200 570556
62184 570556 581386 593156 605789 618582 630909 642530 653288 663038 671886 680119 687811 694842
62172 694842 701373 708104 716096 726514 740352 758072 779601 805061 835460 872202 915847 965685
62160 965685 1020539 1079403 1140974 1202927 1262240 1316222 1363087 1401732 1431500 1452319 1464737
62149 1464737 1469464 1466865 1456946 1439673 1415156 1383660 1345848 1303069 1257155 1209714 1161838 1114647
62137 1114647 1069801 1029059 993324 962411 935706 912763 893316 877212 864599 855913 851356 850311
62125 850311 851397 853130 854753 856678 860130 866062 874301 883904 894256 905529 918085 931861 946392
62112 946392 960886 973942 983651 988526 988389 984190 977197 968600 959551 951010 943402 936607 930265 923987
$$ packed form
62199D96837j299o59K49J790L276L925M131M803N927O775P269Q027R151R998J0356
62184E70556J0830J1770J2633J2793J2327J1621J0758R750Q848Q233P692P031
62172F94842O531O731P992J0418J3838J7720K1529K5460L0399L6742M3645M9838
62160I65685N4854N8864O1571O1953N9313N3982M6865L8645K9768K0819J2418
62149A464737M727k599r919j7273k4517l1496l7812m2779m5914m7441m7876m7191
62137A114647m4846m0742l5735l0913k6705k2943j9447j6104j2613q686m557j045
62125H50311J086J733J623J925L452N932Q239R603J0352J1273J2556J3776J4531
62112I46392J4494J3056R709M875j37m199o993q597r049q541p608o795o342o278
$$ plain form
62098 923987 917483 910817 904548 899382 895730 893758 893758 896113 900773 906898 913224 918852 923781 928680 934071
62083 934071 939827 945608 951614 958497 966534 975412 985062 996250 1009961 1026519 1045629 1066890 1089734
62070 1089734 1113076 1135686 1156971 1177067 1196278 1214880 1233461 1252918 1273886 1296482 1320642
62059 1320642 1346398 1373574 1401438 1428893 1454946 1478802 1499515 1515814 1526605 1531833 1532576 1529792
62047 1529792 1523016 1510710 1491924 1466981 1436397 1400041 1358008 1311650 1262783 1212196 1159896
62036 1159896 1106609 1054052 1003614 955722 910682 869191 831554 797177 765428 736527 711059
62025 711059 689013 669763 652611 636903 621959 607467 593747 581213 569719 558823 548514
62014 548514 539189 531021 523753 517123 511072 505492 500144 495051 490779 488077 487202 487725 489110 491470 495482
$$ packed form
62098I23987o504o666o269n166l652j972%K355M660O125O326N628M929M899N391
62083I34071N756N781O006O883Q037Q878R650J1188J3711J6558J9110K1261K2844
62070A089734K3342K2610K1285K0096J9211J8602J8581J9457K0968K2596K4160
62059A320642K5756K7176K7864K7455K6053K3856K0713J6299J0791N228P43k784
62047A529792o776j2306j8786k4943l0584l6356m2033m6358m8867n0587n2300
62036A159896n3287n2557n0438m7892m5040m1491l7637l4377l1749k8901k5468
62025G11059k2046j9250j7152j5708j4944j4492j3720j2534j1494j0896j0309
62014E48514r325q168p268o630o051n580n348n093m272k702q75N23J385K360M012
$$ plain form
61999 495482 501458 508728 516289 523786 531373 538767 545226 550642 555802 561047 565304 567177 566605 564617
61985 564617 561713 557391 551408 544594 537955 531511 524564 516854 508903 501321 494176 487183 480255 473674
61971 473674 467762 462493 457530 452657 448090 444280 441400 439174 437222 435444 433964 432825 431944 431306 430945
61956 430945 430640 429906 428601 427427 427380 428582 430045 430909 431594 433395 437148 442703 449535 457290 465726 474699
61940 474699 484442 495429 507730 520814 534272 548387 563708 580274 597523 614712 631145 646232
61928 646232 659746 671989 683456 694392 704753 714282 722274 727541 729158 727297 723085 717651 711562
61915 711562 705080 698535 692412 687419 684574 684865 688587 695201 704042 715025 728438 744168 761389
61902 761389 779040 796396 812992 828116 840646 849541 854346 855116 852025 845382 835960 824879 812909
$$ packed form
61999D95482N976P270P561P497P587P394O459N416N160N245M257J873n72j988
61985E64617k904m322n983o814o639o444o947p710p951p582p145o993o928o581
61971D73674n912n269m963m873m567l810k880k226j952j778j480j139q81o38l61
61956D30945l05p34j305j174m7J202J463Q64O85J801L753N555O832P755Q436Q973
61940D74699R743J0987J2301J3084J3458J4115J5321J6566J7249J7189J6433J5087
61928F46232J3514J2243J1467J0936J0361R529P992N267J617j861m212n434o089
61915G11562o482o545o123m993k845K91L722O614Q841J0983J3413J5730J7221
61902G61389J7651J7356J6596J5124J2530Q895M805P70l091o643r422j1081j1970
$$ plain form
61889 812909 800090 786197 771439 756494 741961 727962 714276 700766 687707 675628 664654
61878 664654 654125 643183 631776 620705 610619 601403 592776 584976 578413 572961 568154 563890 560519
61865 560519 558331 557356 557588 559037 561653 565576 571325 579344 589415 600972 613919 628728 645795
61852 645795 665159 686814 710767 736704 764064 792558 822189 852644 883160 913112 942232
61841 942232 969985 995125 1016231 1032374 1043096 1048155 1047687 1042393 1033252 1021136 1006869 991419
61829 991419 975844 961306 949236 941119 937721 938768 943579 951700 962613 975198 987984 999756
61817 999756 1009525 1016112 1018351 1015614 1007743 994537 975902 952546 925988 897601 868011 837612
61805 837612 807291 778212 751071 725868 702432 680891 661600 644683 629835 616676 605228
$$ packed form
61889H12909j2819j3893j4758j4945j4533j3999j3686j3510j3059j2079j0974
61878F64654j0529j0942j1407j1071j0086r216q627p800o563n452m807m264l371
61865E60519k188r75K32J449K616L923N749Q019J0071J1557J2947J4809J7067
61852F45795J9364K1655K3953K5937K7360K8494K9631L0455L0516K9952K9120
61841I42232K7753K5140K1106J6143J0722N059m68n294r141j2116j4267j5450
61829I91419j5575j4538j2070q117l398J047M811Q121J0913J2585J2786J1772
61817I99756R769O587K239k737p871j3206j8635k3356k6558k8387k9590l0399
61805H37612l0321k9079k7141k5203k3436k1541j9291j6917j4848j3159j1448
$$ plain form
61794 605228 595822 588367 581973 575645 569205 563228 558135 553833 550253 547689 546321 545841 545897 546558 547917
61779 547917 549499 550567 550898 550821 550602 550322 550316 551112 552679 554233 555165 555831 557108 559380 562298 565357 568368
61762 568368 571430 574750 578423 582166 585379 587756 589729 592009 594788 597692 600361 602639 604265 604951
61748 604951 604937 604949 605316 605493 604721 602799 599890 595987 591103 585810 581092 577571 575177 573533 572336 571386
61732 571386 570593 570068 570007 570372 570805 570936 570722 570507 570729 571485 572314 572631 572475 572603 573723 575874 578687 581852
61714 581852 584963 587360 588717 589580 590685 591810 591872 590130 586678 581818 575760 569163 563176 558427 554417
61699 554417 550358 546127 541986 537783 533124 528130 523491 519792 517073 514919 512680 509827 506485 503477
61685 503477 501486 500300 499171 497639 495608 492941 489654 486439 484277 483357 482858 481930 480392 478303 475474
$$ packed form
61794F05228r406p455o394o328o440n977n093m302l580k564j368m80N6O61J359
61779E47917J582J068L31p7k19k80oP96J567J554R32O66J277K272K918L059L011
61762E68368L062L320L673L743L213K377J973K280K779K904K669K278J626O86
61748F04951j4J2L67J77p72j922k909l903m884n293m718l521k394j644j197r50
61732E71386p93n25o1L65M33J31k14k15K22P56Q29L17j56J28J120K151K813L165
61714E81852L111K397J357Q63J105J125O2j742l452m860o058o597n987m749m010
61699E54417m059m231m141m203m659m994m639l699k719k154k239k853l342l008
61685E03477j991j186j129j532k031k667l287l215k162r20m99r28j538k089k829
$$ plain form
61670 475474 471819 467852 464372 461784 460027 458955 458394 457931 457032 455520 453711 452052 450730 449698 448929
61655 448929 448549 448692 449269 449946 450396 450583 450746 451138 451900 453084 454653 456437 458302 460397 463006 466032
61639 466032 468900 471144 472887 474536 476115 477222 477565 477227 476363 474944 472937 470556 468148 465881 463653
61624 463653 461215 458340 455021 451600 448607 446282 444349 442377 440309 438477 437142 436246 435574 434934 434089
61609 434089 432712 430526 427417 423389 418589 413402 408240 403120 397734 392160 387183 383463 380550 377241
61595 377241 372967 368409 364587 361734 359266 356580 353574 350576 348007 346053 344460 342720 340542 338097
61581 338097 335806 334036 332970 332413 331616 329714 326597 323096 320041 317463 315062 313015 311688 310769 309505
61566 309505 307892 306902 307204 308199 308721 308298 307320 306321 305629 305562 306349 307733 309019 309740 310091 310620 311577 312671
$$ packed form
61670D75474l655l967l480k588j757j072n61m63q99j512j809j659j322j032p69
61655D48929l80J43N77O77M50J87J63L92P62J184J569J784J865K095K609L026
61639D66032K868K244J743J649J579J107L43l38q64j419k007k381k408k267k228
61624D63653k438k875l319l421k993k325j933j972k068j832j335q96o72o40q45
61609D34089j377k186l109m028m800n187n162n120n386n574m977l720k913l309
61595C77241m274m558l822k853k468k686l006k998k569j954j593j740k178k445
61581C38097k291j770j066n57p97j902l117l501l055k578k401k047j327r19j264
61566C09505j613r90L02R95N22m23r78r99o92o7P87J384J286P21L51N29R57J094
$$ plain form
61548 312671 313389 313525 313484 313982 315319 316898 317666 317131 315897 315118 315485 316835 318670 320849 323649 327226
61532 327226 331204 334880 337774 339859 341262 341923 341647 340463 338761 337016 335409 333777 331900 329750 327452
61517 327452 325041 322387 319380 316150 313108 310797 309623 309603 310264 310936 311271 311428 311676 311923 311830 311271 310437
61500 310437 309417 308017 306187 304458 303644 304073 305243 306262 306507 305898 304803 303792 303322 303382 303445 302993 302126
61483 302126 301520 301654 302250 302634 302536 302293 302368 302937 303990 305483 307247 308979 310583 312294 314204 315826 316517
61466 316517 316333 316106 316555 317568 318517 319052 319351 319675 319954 319929 319621 319507 320059 321116 321871 321667 320732 319938
61448 319938 319895 320482 321199 321700 321915 321949 322023 322396 323155 324196 325442 326938 328650 330393 332148 334287 337209
61431 337209 340781 344348 347305 349541 351306 352787 353915 354578 354987 355704 357184 359269 361314 362894 364249
$$ packed form
61548C12671P18J36m1M98J337J579P68n35j234p79L67J350J835K179K800L577
61532C27226L978L676K894K085J403O61k76j184j702j745j607j632j877k150k298
61517C27452k411k654l007l230l042k311j174k0O61O72L35J57K48K47r3n59q34
61500C10437j020j400j830j729q14M29J170J019K45o09j095j011m70O0O3m52q67
61483C02126o06J34N96L84r8k43P5N69J053J493J764J732J604J711J910J622O91
61466C16517j84k27M49J013R49N35K99L24K79k5l08j14N52J057P55k04r35p94
61448C19938m3N87P17N01K15L4P4L73P59J041J246J496J712J743J755K139K922
61431C37209L572L567K957K236J765J481J128O63M09P17J480K085K045J580J355
$$ plain form
61416 364249 365911 368078 370545 373138 375915 378872 381662 383795 385086 385762 386088 385938 384929 382989 380596
61401 380596 378256 375903 373130 369963 366993 364639 362706 360859 359170 357855 356795 355749 354860 354526 354849
61386 354849 355589 356564 357708 358830 359757 360631 361597 362198 361726 360371 359416 359889 361399 362750 363381 363766 364571
61369 364571 365941 367613 369319 370975 372693 374688 377059 379640 382167 384541 386868 389319 392094 395368
61355 395368 399067 402830 406477 410441 415504 422020 429534 437167 444315 451076 458163 466349 475700 485332
61341 485332 494043 501230 507137 512353 517298 522130 526844 531304 535250 538324 540150 540638 540354 540329 541043
61326 541043 541670 540716 537493 532723 527746 523488 520257 518013 516502 515411 514748 514986 516596 519493 523085
61311 523085 526847 530867 535927 542973 552241 562899 573856 584939 596848 609921 623554 637122
$$ packed form
61416C64249J662K167K467K593K777K957K790K133J291O76L26j50j009j940k393
61401C80596k340k353k773l167k970k354j933j847j689j315j060j046q89l34L23
61386C54849P40R75J144J122R27Q74R66O01m72j355r55M73J510J351O31L85Q05
61369C64571J370J672J706J656J718J995K371K581K527K374K327K451K775L274
61355C95368L699L763L647L964N063O516P514P633P148O761P087Q186R351R632
61341D85332Q711P187N907N216M945M832M714M460L946L074J826M88k84k5P14
61326E41043O27r54l223m770m977m258l231k244j511j091o63K38J610K897L592
61311E23085L762M020N060P046R268J0658J0957J1083J1909J3073J3633J3568
$$ plain form
61299 637122 650786 664706 677861 688482 695586 699420 700464 698811 694722 689006 682296 674421 665067
61286 665067 654739 644499 634840 625416 615974 607036 599389 593184 587934 583268 579362 576540 574748 573674
61272 573674 573242 573708 575238 577663 580777 584575 588952 593388 597304 600717 604238 608391 613206 618614 624852
61257 624852 632255 640831 650351 660736 672013 683843 695367 705663 714225 720880 725469 727910 728517
61244 728517 727943 726654 724612 721593 717621 712858 707298 701011 694622 689066 684675 680937 677342 674070
61230 674070 671427 669062 666414 663847 662688 663944 667433 672299 677925 684067 690556 697341 704696 712957
61216 712957 722015 731263 740069 748141 755521 762421 769131 775878 782634 789073 794792 799586 803481 806520
61202 806520 808652 809972 811005 812568 815377 819999 827117 837353 850541 865579 881507 898521 917426
$$ packed form
61299F37122J3664J3920J3155J0621P104L834J044j653m089n716o710p875r354
61286F65067j0328j0240r659r424r442q938p647o205n250m666l906k822j792j074
61272E73674m32M66J530K425L114L798M377M436L916L413L521M153M815N408O238
61257F24852P403Q576R520J0385J1277J1830J1524J0296Q562O655M589K441O07
61244G28517n74j289k042l019l972m763n560o287o389n556m391l738l595l272
61230F74070k643k365k648k567j159J256L489M866N626O142O489O785P355Q261
61216G12957R058R248Q806Q072P380O900O710O747O756O439N719M794L895L039
61202H06520K132J320J033J563K809M622P118J0236J3188J5038J5928J7014J8905
$$ plain form
61189 917426 938224 959757 980724 1000421 1018429 1034208 1047358 1057885 1065950 1071776 1076081 1080124
61177 1080124 1084744 1089528 1093304 1095303 1095537 1094311 1091828 1088173 1083249 1076673 1068075 1057568 1045729 1033086
61163 1033086 1019719 1005351 989682 972731 954938 936797 918311 899041 878874 858496 838883
61152 838883 820605 803909 789176 776792 766679 758435 751901 747109 743631 740463 736730 732189 726898
61139 726898 720796 713881 706500 699098 691787 684407 677017 670163 664634 661056 659653 660234 662374 665731
61125 665731 670356 676748 685547 697169 711671 728885 748506 770115 793496 819074 847681 879483
61113 879483 913472 948520 984722 1022917 1062858 1102726 1140772 1176791 1211609 1245853 1279609
61102 1279609 1312457 1343046 1369340 1390306 1406978 1420831 1431331 1436192 1434018 1425585 1412357 1394852
$$ packed form
61189I17426K0798K1533K0967J9697J8008J5779J3150J0527Q065N826M305M043
61177A080124M620M784L776J999K34j226k483l655m924o576q598j0507j1839j2643
61163A033086j3367j4368j5669j6951j7793j8141j8486j9270k0167k0378j9613
61152H38883j8278j6696j4733j2384j0113q244o534m792l478l168l733m541n291
61139G26898o102o915p381p402p311p380p390o854n529l578j403N81K140L357
61125F65731M625O392Q799J1622J4502J7214J9621K1609K3381K5578K8607L1802
61113H79483L3989L5048L6202L8195L9941L9868L8046L6019L4818L4244L3756
61102A279609L2848L0589K6294K0966J6672J3853J0500M861k174q433j3228j7505
$$ plain form
61090 1394852 1372941 1346892 1317439 1285338 1251306 1216015 1179797 1142763 1105427 1068688 1032945
61079 1032945 997927 963847 932043 903742 878577 855108 832559 811335 791964 774348 758296
61068 758296 744207 732800 724312 718131 713213 708818 704941 702033 700330 699569 699390 699803 701153 703786
61054 703786 707871 713354 719960 727396 735724 745400 756819 769944 784453 800149 817167 835937 856982
61041 856982 880526 906268 933723 962730 993376 1025516 1058790 1093081 1128486 1164791 1201614
61030 1201614 1239226 1278600 1320348 1364184 1409777 1457409 1507209 1558263 1609251 1659646 1709653
61019 1709653 1759367 1808962 1859756 1914323 1975242 2044092 2121677 2208714 2306028 2414376 2534577
61008 2534577 2668359 2819688 2995588 3205531 3460260 3771851 4154995 4627458 5209493
$$ packed form
61090A394852k1911k6049k9453l2101l4032l5291l6218l7034l7336l6739l5743
61079A032945l5018l4080l1804k8301k5165k3469k2549k1224j9371j7616j6052
61068G58296j4089j1407q488o181m918m395l877k908j703p61j79M13J350K633
61054G03786M085N483O606P436Q328R676J1419J3125J4509J5696J7018J8770K1045
61041H56982K3544K5742K7455K9007L0646L2140L3274L4291L5405L6305L6823
61030A201614L7612L9374M1748M3836M5593M7632M9800N1054N0988N0395N0007
61019A709653M9714M9595N0794N4567O0919O8850P7585Q7037R7314J08348J20201
61008B534577J33782J51329J75900K09943K54729L11591L83144M72463N82035
$$ plain form
60999 5209493 5924605 6802077 7877830 9192116 10786569 12697177 14929235 17410241
60991 17410241 19951867 22272445 24094871 25265127 25809345 25899128 25769204 25646887 25705054
60982 25705054 26014524 26497343 26927007 27010302 26516766 25372854 23666375 21579933 19313285
60973 19313285 17035662 14869263 12888736 11128237 9593788 8276131 7158747 6221118
60965 6221118 5440713 4794970 4262343 3822597 3457524 3151783 2892801 2670257 2476302
60956 2476302 2305915 2156021 2023844 1906409 1801425 1707946 1625851 1554898 1494144 1441714
60946 1441714 1394911 1350985 1308205 1266179 1225191 1185477 1147128 1110205 1074593 1039974 1006219
60935 1006219 973716 943051 914444 887687 862531 838910 816795 796100 776781 758810 742024
$$ packed form
60999E209493P15112Q77472J075753J314286J594453J910608K232058K481006
60991A7410241K541626K320578J822426J170256N44218Q9783j29924j22317N8167
60982B5705054L09470M82819M29664Q3295m93536j143912j706479k086442k266648
60973A9313285k277623k166399j980527j760499j534449j317657j117384r37629
60965F221118p80405o45743n32627m39746l65073l05741k58982k22544j93955
60956B476302j70387j49894j32177j17435j04984r3479q2095p0953o0754n2430
60946A441714m6803m3926m2780m2026m0988l9714l8349l6923l5612l4619l3755
60935A006219l2503l0665k8607k6757k5156k3621k2115k0695j9319j7971j6786
$$ plain form
60924 742024 726252 711690 698832 687734 677686 668033 659144 651942 646444 641459 636033 630573 626056
60911 626056 622673 619928 617741 616567 616488 616946 617500 618093 618426 617845 616300 614764 614145 614191 614034 613378 612512
60894 612512 611399 609475 606417 602556 598453 594501 590984 588036 585321 582145 578096 573374 568356 563140
60880 563140 557729 552407 547599 543482 539993 537209 535426 534767 534887 535245 535634 536336 537722 539817 542399
60865 542399 545472 549406 554437 560220 566188 572368 579456 587869 597024 606023 614846 624303 634601 644544
60851 644544 652635 658669 663666 668513 673426 678763 685335 693271 701125 706980 710283 712011 713150 713651
60837 713651 712923 710678 707098 702749 698586 695560 693846 692783 691885 691524 692252 693824 695499 697240 700053
60822 700053 704971 711960 719944 727665 734465 740481 746406 753065 761041 770471 781087 792449 804243
$$ packed form
60924G42024j5772j4562j2858j1098j0048r653q889p202n498m985n426n460m517
60911F26056l383k745k187j174p9M58N54N93L33n81j545j536o19M6j57o56q66
60894F12512j113j924l058l861m103l952l517k948k715l176m049m722n018n216
60880E63140n411n322m808m117l489k784j783o59J20L58L89P02J386K095K582
60865E42399L073L934N031N783N968O180P088Q413R155Q999Q823R457J0298R943
60851F44544Q091O034M997M847M913N337O572P936P854N855L303J728J139N01
60837G13651p28k245l580m349m163l026j714j063q98l61P28J572J675J741K813
60822G00053M918O989P984P721O800O016N925O659P976R430J0616J1362J1794
$$ plain form
60809 804243 816344 828612 840739 852479 863978 875702 888043 901084 914536 927660 939402
60798 939402 949122 957256 964845 972242 978676 983223 985783 986829 986598 984920 981561 976393 969478 961320
60784 961320 952768 944283 935474 925761 915225 904380 893290 881521 868947 856075 843468 831258
60772 831258 819365 807812 796712 786142 776086 766297 756344 746118 736217 727354 719365 711263 702368
60759 702368 692898 683338 673792 664202 654674 645144 635185 624685 614429 605402 597624 590205 582582 575187
60745 575187 568805 563671 559368 555280 550922 546080 540824 535325 529495 523004 515770 508315 501451 495664
60731 495664 490916 486950 483586 480739 478322 476255 474519 473176 472318 471931 471728 471254 470322 469346 468974 469308
60715 469308 469692 469420 468515 467507 466542 464985 462069 457778 452978 448720 445417 442592 439392 435453 431319
$$ packed form
60809H04243J2101J2268J2127J1740J1499J1724J2341J3041J3452J3124J1742
60798I39402R720Q134P589P397O434M547K560J046k31j678l359n168o915q158
60784I61320q552q485q809r713j0536j0845j1090j1769j2574j2872j2607j2210
60772H31258j1893j1553j1100j0570j0056r789r953j0226r901q863p989q102q895
60759G02368r470r560r546r590r528r530r959j0500j0256r027p778p419p623p395
60745E75187o382n134m303m088m358m842n256n499n830o491p234p455o864n787
60731D95664m748l966l364k847k417k067j736j343q58l87k03m74r32r76l72L34
60715D69308L84k72r05j008r65j557k916m291m800m258l303k825l200l939m134
$$ plain form
60700 431319 427893 425461 423375 420746 417293 413439 409764 406538 403713 401133 398755 396770 395479 394943
60686 394943 394756 394344 393531 392771 392725 393599 394921 396047 396925 398232 400632 403976 407451 410476 413088 415430
60670 415430 417295 418548 419718 421648 424510 427501 429622 430584 430826 430859 430796 430489 430013 429852 430543 432159 434318
60653 434318 436766 439719 443504 448014 452745 457341 461874 466570 471422 476130 480340 483904 486857 489112
60639 489112 490275 489995 488498 486505 484461 482137 479172 475685 472034 468292 464398 460594 457188 453981
60625 453981 450495 446766 443417 440883 439071 437876 437405 437465 437405 436853 436123 435436 434204 431737 428341 425072
60609 425072 422502 420410 418666 417652 417513 417659 417493 417233 417528 418522 419830 421237 422746 423918 423925 422678
60593 422678 421427 421635 423390 425415 426544 426688 426365 425891 425302 424574 423563 422028 420091 418460 417824 418225
$$ packed form
60700D31319l426k432k086k629l453l854l675l226k825k580k378j985j291n36
60686C94943j87m12q13p60m6Q74J322J126Q78J307K400L344L475L025K612K342
60670D15430J865J253J170J930K862K991K121R62K42L3o3l07m76j61O91J616K159
60653D34318K448K953L785M510M731M596M533M696M852M708M210L564K953K255
60639D89112J163k80j497j993k044k324k965l487l651l742l894l804l406l207
60625D53981l486l729l349k534j812j195m71O0o0n52p30o87j232k467l396l269
60609D25072k570k092j744j014j39J46j66k60K95R94J308J407J509J172Pj247
60593D22678j251K08J755K025J129J44l23m74n89p28j011j535j937j631o36M01
$$ plain form
60577 418225 419312 420974 423318 426240 429478 432969 436719 440524 444382 449043 455421 463472 472381 482016
60563 482016 493292 506720 521296 535429 548302 559687 568924 574959 577179 575568 570365 562405 553578
60550 553578 545925 540031 535050 530458 527002 525604 526175 528128 531417 536270 542276 548642 555433 563849
60536 563849 574946 588421 602895 617152 630801 643784 655485 664600 670007 671662 670478 667349
60524 667349 662666 656805 650592 644804 639460 634082 628554 623277 618548 614341 610853 608661 607991 608143 608103
60509 608103 607603 607244 607694 609104 611270 613984 617162 620982 626101 633581 644393 659032 677685 700586
60495 700586 727993 759921 796182 836697 881450 929786 979842 1028930 1074481 1114454 1146922
60484 1146922 1169810 1181434 1181146 1169219 1146409 1114036 1074238 1029437 981439 931563 881641 834085
$$ packed form
60577D18225J087J662K344K922L238L491L750L805L858M661O378Q051Q909R635
60563D82016J1276J3428J4576J4133J2873J1385R237O035K220j611n203p960q827
60550E53578p653n894m981m592l456j398N71J953L289M853O006O366O791Q416
60536E63849J1097J3475J4474J4257J3649J2983J1701R115N407J655j184l129
60524F67349m683n861o213n788n344n378n528n277m729m207l488k192o70J52m0
60509F08103n00l59M50J410K166K714L178L820N119P480J0812J4639J8653K2901
60495G00586K7407L1928L6261M0515M4753M8336N0056M9088M5551L9973L2468
60484A146922K2888J1624k88j1927k2810l2373l9798m4801m7998m9876m9922m7556
$$ plain form
60472 834085 790517 750905 714583 681611 652517 627208 604949 585225 567870 552503 538747
60461 538747 526958 517780 510745 504217 497102 489870 483479 478051 473168 468774 465026 461701 458482 455472
60447 455472 452747 449738 445808 441247 437059 433939 432056 431472 431886 432110 430888 428416 426233 425348 425233
60432 425233 424908 424139 423077 421492 419180 416674 414806 413734 413029 412573 412750 413754 415227 416795 418565
60417 418565 420823 423448 425839 427449 428241 428610 428963 429476 430192 431103 431990 432458 432437 432562 433670 435903 438580
60400 438580 440912 442524 443347 443534 443648 444454 446156 448134 449741 451143 453066 455866 459141 462208 464737
60385 464737 466931 469288 472150 475402 478521 480893 482106 482198 481846 482101 483549 485792 488086 490330 492929
60370 492929 495837 498439 500513 502584 504978 507169 508494 509008 509157 509069 508683 508230 507989 507884 507860 508434 510351
$$ packed form
60472H34085m3568l9612l6322l2972k9094k5309k2259j9724j7355j5367j3756
60461E38747j1789r178p035o528p115p232o391n428m883m394l748l325l219l010
60447D55472k725l009l930m561m188l120j883n84M14K24j222k472k183q85j15
60432D25233l25p69j062j585k312k506j868j072p05m56J77J004J473J568J770
60417D18565K258K625K391J610P92L69L53N13P16R11Q87M68k1J25J108K233K677
60400D38580K332J612Q23J87J14Q06J702J978J607J402J923K800L275L067K529
60385D64737K194K357K862L252L119K372J213R2l52K55J448K243K294K244K599
60370D92929K908K602K074K071K394K191J325N14J49q8l86m53k41j05k4N74J917
$$ plain form
60353 510351 513804 518362 523458 528547 533210 537730 543334 551128 560904 571630 582992 595581 609387
60340 609387 622841 633838 641332 645608 647331 646665 643203 636595 627226 616264 604894 593605 582406
60327 582406 571561 561747 553543 547092 542149 538128 534217 529894 525377 521268 517850 515140 513403 513012
60313 513012 513775 515018 516457 518469 521409 525257 530149 536690 545442 556565 570193 586700 606202
60300 606202 628223 652080 677132 702237 725421 744659 758832 767669 771157 769550 763709 754864
60288 754864 743934 731332 717240 701771 685052 667553 650244 634058 619260 605639 593156
60277 593156 582018 572204 563366 555245 547835 541102 534920 529369 524749 521101 517958 514734 511149 507130
60263 507130 502556 497413 492169 487695 484689 483190 482663 482487 482327 482136 481989 481913 481788 481352 480433 479251 478386
$$ packed form
60353E10351L453M558N096N089M663M520N604P794R776J0726J1362J2589J3806
60340F09387J3454J0997P494M276J723o66l462o608r369j0962j1370j1289j1199
60327E82406j0845r814q204o451m943m021l911m323m517m109l418k710j737l91
60313E13012P63J243J439K012K940L848M892O541Q752J1123J3628J6507J9502
60300F06202K2021K3857K5052K5105K3184J9238J4173Q837L488j607n841q845
60288G54864j0930j2602j4092j5469j6719j7499j7309j6186j4798j3621j2483
60277E93156j1138r814q838q121p410o733o182n551m620l648l143l224l585m019
60263E07130m574n143n244m474l006j499n27j76j60j91j47p6j25m36r19j182q65
$$ plain form
60246 478386 478312 479114 480682 482870 485198 486734 486833 485932 485119 484854 484667 484135 483538 483265 483233 483357 484142 486195
60228 486195 489377 492931 496273 499283 502040 504755 507802 511331 514917 518074 520979 524198 527778 531222
60214 531222 534400 537852 541935 546261 550423 554874 560589 567965 576414 585009 593200 600917 608255 615252
60200 615252 621888 628162 634069 639539 644506 649038 653277 657200 660599 663416 665935 668424 670764 672584
60186 672584 673647 673895 673309 672003 670190 667682 663655 657515 649943 642481 636004 630091 624076 618052 612544
60171 612544 607708 603323 599285 595704 592755 590750 590050 590498 591199 591313 590897 590655 590993 591709 592387 592668 592306
60154 592306 591478 590911 591173 591894 592255 592257 592809 594434 596528 598306 599937 602258 605739 610220 615408 621128
60138 621128 627274 633982 641754 650943 661114 671337 681145 690796 700545 710054 718594 725465 730081 732122
$$ packed form
60246D78386p4Q02J568K188K328J536R9r01q13k65j87n32n97k73l2J24P85K053
60228D86195L182L554L342L010K757K715L047L529L586L157K905L219L580L444
60214E31222L178L452M083M326M162M451N715P376Q449Q595Q191P717P338O997
60200F15252O636O274N907N470M967M532M239L923L399K817K519K489K340J820
60186F72584J063K48n86j306j813k508m027o140p572p462o477n913o015o024n508
60171F12544m836m385m038l581k949k005p00M48P01J14m16k42L38P16O78K81l62
60154E92306q28n67K62P21L61KN52J625K094J778J631K321L481M481N188N720
60138F21128O146O708P772R189J0171J0223R808R651R749R509Q540O871M616K041
$$ plain form
60124 732122 731928 730527 728897 727290 725425 723105 720406 717446 714373 711596 709727 709184 709981 711871 714464
60109 714464 717212 719523 721064 721892 722216 722150 721707 720906 719682 717733 714581 709880 703722 696672 689552 683131
60093 683131 677898 673994 671329 669916 670112 672317 676236 680671 684500 687850 691842 697093 703009 708822
60079 708822 714657 720979 727465 733206 737794 741265 743015 741783 737125 730116 722065 713156 702943 691584
60065 691584 679841 668194 656760 645922 636231 627646 619560 611726 604543 598196 592100 585568 578676
60052 578676 572153 566605 562146 558553 555573 553136 551457 550853 551425 553064 555759 559627 564584 570353 576894
60037 576894 584447 592867 601218 608442 614270 619181 623621 627599 630938 633477 635006 635309 634291 631793
60023 631793 627308 620293 610931 600311 589619 579365 569509 560047 551081 542470 533843 525118 516767
$$ packed form
60124G32122j94j401j630j607j865k320k699k960l073k777j869n43P97J890K593
60109G14464K748K311J541Q28L24o6m43q01j224j949l152m701o158p050p120o421
60093F83131n233l904k665j413J96K205L919M435L829L350L992N251N916N813
60079G08822N835O322O486N741M588L471J750j232m658p009q051q909j0213j1359
60065F91584j1743j1647j1434j0838r691q585q086p834p183o347o096o532o892
60052E78676o523n548m459l593k980k437j679o04N72J639K695L868M957N769O541
60037E76894P553Q420Q351P224N828M911M440L978L339K539J529L03j018k498
60023F31793m485p015r362j0620j0692j0254r856r462q966q611q627q725q351
$$ plain form
60010 516767 509388 503132 497742 493088 489530 487638 487592 488948 490954 493082 495192 497301 499315 501089 502613
59995 502613 504024 505451 507001 508960 511778 515630 520021 524143 527794 531705 536652 542365 547726 552104
59981 552104 556019 560196 564346 567490 569357 570786 572520 574109 574425 572942 570072 566528 562873 559589
59967 559589 556982 554899 552960 551257 550447 550968 552521 554564 556980 560007 563792 568223 572839 576622 578330
59952 578330 577635 575701 574107 573338 572822 572122 571336 570366 568716 566269 563556 560914 558039 554790 551806 549703
59936 549703 548113 546122 543402 540375 537540 535158 533354 531951 530380 528341 526381 525298 525149 525472 526237
59921 526237 527780 529812 531400 532125 532541 533236 534168 535298 537122 540074 543943 548433 553761 560048 566589
59906 566589 572490 577803 583347 589556 596155 602855 609564 615866 621023 624751 627384 629036 629260 627983
$$ packed form
60010E16767p379o256n390m654l558j892m6J356K006K128K110K109K014J774J524
59995E02613J411J427J550J959K818L852M391M122L651L911M947N713N361M378
59981E52104L915M177M150L144J867J429J734J589L16j483k870l544l655l284
59967E59589k607k083j939j703q10N21J553K043K416L027L785M431M616L783J708
59952E78330o95j934j594p69n16p00p86r70j650k447k713k642k875l249k984k103
59936E49703j590j991k720l027k835k382j804j403j571k039j960j083j49L23P65
59921E26237J543K032J588P25M16O95R32J130J824K952L869M490N328O287O541
59906E66589N901N313N544O209O599O700O709O302N157L728K633J652K24j277
$$ plain form
59892 627983 626218 625170 624935 624720 624251 624286 625595 628031 630970 634297 638482 643830 650054 656631 663252
59877 663252 669893 676683 683800 691258 698639 705207 710371 713838 715234 714073 710442 705366 699924 694160
59863 694160 687412 679691 671946 664836 657942 650698 643484 637150 631782 626668 621449 616652 612998 610743
59849 610743 609940 610952 614299 620119 628006 637344 647658 658613 669645 679626 687079 690997 691580 690181
59835 690181 688585 688308 690125 693762 698006 701497 703611 704475 704214 702446 698607 692480 684344 674841 664736
59820 664736 654614 644624 634612 624548 614659 605175 596195 587822 580137 572941 565905 559183 553557
59807 553557 549654 547201 545389 543790 542538 541690 540878 539752 538421 537188 536005 534490 532488 530340 528399
59792 528399 526376 523422 519029 513696 508526 504238 500833 498105 496078 494723 493643 492464 491378 490913
$$ packed form
59892F27983j765j048k35k15m69L5J309K436K939L327M185N348O224O577O621
59877F63252O641O790P117P458P381O568N164L467J396j161l631n076n442n764
59863F94160o748p721p745p110o894p244p214o334n368n114n219m797l654k255
59849F10743q03J012L347N820P887R338J0314J0955J1032R981P453L918N83j399
59835F90181j596k77J817L637M244L491K114Q64k61j768l839o127q136r503j0105
59820F64736j0122r990j0012j0064r889r484q980q373p685p196p036o722n626
59807E53557l903k453j812j599j252q48q12j126j331j233j183j515k002k148j941
59792E28399k023k954m393n333n170m288l405k728k027j355j080j179j086m65
$$ plain form
59778 490913 491105 491297 490883 490039 489514 489850 490962 492415 493894 495371 497002 498932 501132 503365 505381 507247
59762 507247 509366 511991 514789 517184 519256 522075 526805 533582 541499 549569 557351 564737 571689 578491
59748 578491 585882 594459 603994 613597 622501 630515 637842 644745 651349 657485 662659 666398 668715 670107
59734 670107 671058 671689 671900 671651 670953 669679 667599 664687 661366 658325 655981 654149 652384 650636 649327
59719 649327 648678 648255 647485 646410 645521 644916 644069 642638 641111 640373 640753 641772 642722 643295 643629 643964 644347
59702 644347 644617 644599 644235 643558 642630 641567 640599 640009 640059 641021 643132 646284 649782 652672 654377 654874 654323
59685 654323 652878 650939 649240 648333 648091 648032 648022 648402 649373 650515 651037 650386 648542 645770 642222 637813 632492
59668 632492 626512 620310 614103 607756 601090 594200 587409 581107 575752 571828 569503 568347 567674 567225 567372
$$ packed form
59778D90913J92J92m14q44n25L36J112J453J479J477J631J930K200K233K016J866
59762E07247K119K625K798K395K072K819M730O777P917Q070P782P386O952O802
59748E78491P391Q577R535R603Q904Q014P327O903O604O136N174L739K317J392
59734F70107R51O31K11k49o98j274k080k912l321l041k344j832j765j748j309
59719F49327o49m23p70j075q89o05q47j431j527p38L80J019R50N73L34L35L83
59702F44347K70j8l64o77r28j063r68n90N0R62K111L152L498K890J705M97n51
59685F54323j445j939j699r07k42n9j0L80R71J142N22o51j844k772l548m409n321
59668F32492n980o202o207o347o666o890o791o302n355l924k325j156o73m49J47
$$ plain form
59653 567372 568605 570962 574043 577428 581002 584914 589287 593881 597997 600796 601837 601272 599538 596970
59639 596970 593779 590264 586784 583447 580017 576268 572388 568894 566191 564392 563581 563950 565420 567254 568392
59624 568392 568308 567373 566347 565645 565206 564821 564320 563499 562076 559898 557102 554032 550989 548100 545440 543278
59608 543278 542140 542523 544525 547773 551686 555708 559376 562387 564672 566256 567026 566799 565708 564328 563279
59593 563279 562819 562793 562748 562065 560357 558018 556002 554724 553436 551120 547847 544762 542790 541844 541274 540510
59577 540510 539144 536903 533917 530778 528108 526193 525045 524440 523802 522533 520743 519290 518837 519208 519966
59562 519966 521133 522835 524625 525818 526361 526723 527066 527205 527396 528397 530457 532868 534875 536490 537996
59547 537996 539227 539967 540751 542519 545556 549352 553559 558520 564771 572573 582260 594649 610617 630153
$$ packed form
59653E67372J233K357L081L385L574L912M373M594M116K799J041n65j734k568
59639E96970l191l515l480l337l430l749l880l494k703j799q11L69J470J834J138
59624E68392q4r35j026p02m39l85n01q21j423k178k796l070l043k889k660k162
59608E43278j138L83K002L248L913M022L668L011K285J584P70k27j091j380j049
59593E63279m60k6m5o83j708k339k016j278j288k316l273l085j972r46n70p64
59577E40510j366k241k986l139k670j915j148o05o38j269j790j453m53L71P58
59562E19966J167J702J790J193N43L62L43J39J91J001K060K411K007J615J506
59547E37996J231P40P84J768L037L796M207M961O251P802R687J2389J5968J9536
$$ plain form
59533 630153 651759 672532 689042 698906 702133 700864 697513 693330 688849 685066 683359 684339 687506 692180
59519 692180 698168 705274 712710 719431 724734 728170 729216 727519 723375 717465 710141 701282 690868 679309
59505 679309 667134 654637 641930 629193 616805 605339 595411 587349 580946 575723 571387 567924 565311
59492 565311 563411 562155 561533 561350 561255 561170 561525 562910 565573 569239 573347 577541 582136 588016 595715 604623
59476 604623 613553 622227 631704 642982 655550 667793 678546 687713 695436 701342 704911 706180 705713
59463 705713 704043 701533 698774 696757 696389 697919 701101 705952 713092 723184 736209 751531 768559
59450 768559 787068 806979 828232 850963 875298 900568 924870 945709 961055 969739 971157 965066
59438 965066 951788 932498 909169 884114 859306 835898 814359 794885 777417 761336 745773
$$ packed form
59533F30153K1606K0773J6510R864L227j269l351m183m481l783j707R80L167M674
59519F92180N988P106P436O721N303L436J046j697m144n910p324q859j0414j1559
59505F79309j2175j2497j2707j2737j2388j1466r928q062o403n223m336l463k613
59492E65311j900j256o22j83r5q5L55J385K663L666M108M194M595N880P699Q908
59476F04623Q930Q674R477J1278J2568J2243J0753R167P723N906L569J269m67
59463G05713j670k510k759k017l68J530L182M851P140J0092J3025J5322J7028
59450G68559J8509J9911K1253K2731K4335K5270K4302K0839J5346Q684J418o091
59438I65066j3278j9290k3329k5055k4808k3408k1539j9474j7468j6081j5563
$$ plain form
59427 745773 730577 716647 705015 695961 689435 685884 686003 689839 696832 706730 719837 736302 755818
59414 755818 778160 803388 831309 861420 893647 928108 963135 993894 1014184 1020173 1012355 994240
59402 994240 969990 943257 917162 894367 877081 867183 865705 871340 879443 883373 877786 861199 835947
59389 835947 806139 775523 746364 719439 694797 672649 653578 637988 625717 616373 609710 605294
59377 605294 602097 598980 595562 592238 589495 587678 587241 588495 590995 593920 597222 601630 607114 612326
59363 612326 616258 619771 624463 630444 636368 641519 646801 653466 661833 671631 682769 695233 708783
59350 708783 723384 739662 758382 779596 802540 826276 850288 874686 899949 926237 952750
59339 952750 977950 1000531 1019927 1035932 1048231 1056536 1060717 1060496 1055318 1044872 1029603 1010538
$$ packed form
59427G45773j5196j3930j1632r054o526l551J19L836O993R898J3107J6465J9516
59414G55818K2342K5228K7921L0111L2227L4461L5027L0759K0290N989p818j8115
59402I94240k4250k6733k6095k2795j7286r898j478N635Q103L930n587j6587k5252
59389H35947k9808l0616k9159k6925k4642k2148j9071j5590j2271r344o663m416
59377F05294l197l117l418l324k743j817m37J254K500K925L302M408N484N212
59363F12326L932L513M692N981N924N151N282O665Q367R798J1138J2464J3550
59350G08783J4601J6278J8720K1214K2944K3736K4012K4398K5263K6288K6513
59339I52750K5200K2581J9396J6005J2299Q305M181k21n178j0446j5269j9065
$$ plain form
59327 1010538 988838 965617 941705 917254 891955 866030 840723 817378 796327 777213 760147
59316 760147 745851 734573 725515 717561 710232 703635 697845 692675 688070 684416 682297 681933 682971 684978
59302 684978 688077 692897 699854 708719 719051 730801 744302 759861 777516 796801 816241 833099
59290 833099 844218 847561 843075 832251 817088 799475 781154 763772 748568 735938 725493 716838
59278 716838 710308 706683 706188 708170 711938 717615 725871 737070 750932 766813 784021 801957 820218
59265 820218 838453 855932 871542 884433 894426 901445 904927 904271 899654 891724 880582 865799 847672
59252 847672 827856 808366 790295 773788 758907 745982 735167 726075 718109 711040 705108 700582
59240 700582 697468 695823 696127 698887 703824 709850 716068 722424 729179 736228 743353 750619 757885 764262
$$ packed form
59327A010538k1700k3221k3912k4451k5299k5925k5307k3345k1051j9114j7066
59316G60147j4296j1278r058p954p329o597n790n170m605l654k119l64J038K007
59302F84978L099M820O957Q865J0332J1750J3501J5559J7655J9285J9440J6858
59290H33099J1119L343m486j0824j5163j7613j8321j7382j5204j2630j0445q655
59278G16838o530l625m95J982L768N677Q256J1199J3862J5881J7208J7936J8261
59265H20218J8235J7479J5610J2891R993P019L482o56m617p930j1142j4783j8127
59252H47672j9816j9490j8071j6507j4881j2925j0815r092p966p069n932m526
59240G00582l114j645L04K760M937O026O218O356O755P049P125P266P266O377
$$ plain form
59226 764262 768721 771061 771535 769737 764777 756661 746546 735383 723122 709671 695818 682586 670236
59213 670236 658576 647831 638472 630427 623164 616496 610750 606153 602546 599816 598227 598175 599752 602576
59199 602576 605938 609139 611903 614524 617567 621464 626309 631826 637521 643081 648587 653942 658215 660266
59185 660266 660320 660207 661493 663860 665969 667444 669126 671581 674356 676809 678917 680953 683021 685330 688516
59170 688516 693250 699680 707448 716066 725183 734773 745185 756728 769093 781472 793375 804932 816146
59157 816146 826232 834032 838871 840658 839396 835029 827753 818107 806609 793526 779134 764056 749223
59144 749223 735488 723239 712359 702513 693449 685034 677168 669845 663259 657603 652717 648094 643372
59131 643372 638702 634570 631339 629032 627446 626463 626323 627505 630148 633697 637480 641583 646713 653088 660003
$$ packed form
59226G64262M459K340M74j798m960q116j0115j1163j2261j3451j3853j3232j2350
59213F70236j1660j0745r359q045p263o668n746m597l607k730j589n2J577K824
59199F02576L362L201K764K621L043L897M845N517N695N560N506N355M273K051
59185F60266N4j13J286K367K109J475J682K455K775K453K108K036K068K309L186
59170F88516M734O430P768Q618R117R590J0412J1543J2365J2379J1903J1557J1214
59157H16146J0086P800M839J787j262m367p276r646j1498j3083j4392j5078j4833
59144G49223j3735j2249j0880r846r064q415p866p323o586n656m886m623m722
59131F43372m670m132l231k307j586r83j40J182K643L549L783M103N130O375O915
$$ plain form
59116 660003 666845 674067 682663 692889 703975 714902 724960 733712 741082 747567 753809 759729 764481
59103 764481 767496 769198 770474 771811 773202 774519 775492 775569 774297 771869 768982 766157 763466 760886 758569
59088 758569 756708 755391 754699 754692 755122 755304 754419 751890 747421 740884 732366 722298 711375 700337 689789
59073 689789 680112 671352 663197 655218 647225 639395 632079 625550 619927 615233 611372 608087 605091 602299
59059 602299 599873 597967 596506 595277 594137 592925 591251 588672 585232 581654 578770 576855 575675 575065
59045 575065 575176 576115 577603 579133 580343 581158 581660 581904 581811 581194 579961 578360 576957 576318 576754 578328 580948
59028 580948 584408 588526 593446 599754 608120 618760 631255 644935 659368 674516 690433 706788
59016 706788 722683 736972 748753 757554 763182 765624 765131 762167 757130 750352 742582 735282 729992 727243
$$ packed form
59116F60003O842P222Q596J0226J1086J0927J0058Q752P370O485O242N920M752
59103G64481L015J702J276J337J391J317R73P7j272k428k887k825k691k580k317
59088G58569j861j317o92pM30J82q85k529m469o537q518j0068j0923j1038j0548
59073F89789r677q760q155p979p993p830p316o529n623m694l861l285k996k792
59059F02299k426j906j461j229j140j212j674k579l440l578k884j915j180o10
59045E75065J11R39J488J530J210Q15N02K44r3o17j233j601j403o39M36J574K620
59028E80948L460M118M920O308Q366J0640J2495J3680J4433J5148J5917J6355
59016G06788J5895J4289J1781Q801N628K442m93k964n037o778p770p300n290k749
$$ plain form
59002 727243 726308 726251 727150 730073 735826 743899 752813 761440 769774 778311 786976 795072 802257 809102 816341
58987 816341 823802 830435 835298 838093 838733 836924 832595 826542 820169 814474 809578 805348 802211 801032
58973 801032 802325 805956 811707 819734 830197 842696 856494 871298 887460 905287 924388 943890
58961 943890 963121 981897 1000161 1017408 1032432 1043748 1050440 1052578 1050512 1043845 1031669 1014031
58949 1014031 992693 969938 946897 923553 900075 877392 856347 837026 819269 803290 789333
58938 789333 777087 766093 756646 749681 745586 743527 742186 740826 739326 737501 735086 732461 730724 730531
58924 730531 731123 731081 729914 728374 727183 726073 724383 722024 719394 716716 714016 711585 709903 709149 709235 710270
58908 710270 712541 716057 720548 725959 732486 740134 748797 758880 771218 786030 802488 819708 837679
$$ packed form
59002G27243r35n7Q99K923N753Q073Q914Q627Q334Q537Q665Q096P185O845P239
58987H16341P461O633M863K795O40j809m329o053o373n695m896m230l137j179
58973H01032J293L631N751Q027J0463J2499J3798J4804J6162J7827J9101J9502
58961I43890J9231J8776J8264J7247J5024J1316O692K138k066o667j2176j7638
58949A014031k1338k2755k3041k3344k3478k2683k1045j9321j7757j5979j3957
58938G89333j2246j0994r447o965m095k059j341j360j500j825k415k625j737j93
58924G30531N92m2j167j540j191j110j690k359k630k678k700k431j682p54Q6J035
58908G10270K271L516M491N411O527P648Q663J0083J2338J4812J6458J7220J7971
$$ plain form
58895 837679 856642 876025 894799 912830 931080 950350 970593 991859 1015227 1042033 1072350
58884 1072350 1104835 1138023 1171115 1203346 1233279 1259336 1280677 1297014 1307778 1312166 1310079 1302318
58872 1302318 1289570 1271720 1248578 1220887 1190152 1157812 1125105 1093531 1064745 1039809 1018820
58861 1018820 1001161 985767 971388 957214 943369 930376 918165 906071 893785 881627 869754
58850 869754 857793 845673 834257 824617 816950 810557 804561 798232 790900 782168 772195 761550 750840
58837 750840 740609 731287 722830 714639 706186 697627 689485 681938 674807 668059 661939 656658 652393 649558
58823 649558 648616 649567 651898 655070 658761 662732 666906 671659 677551 684503 691557 697767 703125 708276 713381
58808 713381 717655 720201 721139 721572 722402 723445 723867 723138 721105 717423 711749 704757 698094 692693 687642
$$ packed form
58895H37679J8963J9383J8774J8031J8250J9270K0243K1266K3368K6806L0317
58884A072350L2485L3188L3092L2231K9933K6057K1341J6337J0764M388k087p761
58872A302318j2748j7850k3142k7691l0735l2340l2707l1574k8786k4936k0989
58861A018820j7659j5394j4379j4174j3845j2993j2211j2094j2286j2158j1873
58850H69754j1961j2120j1416r640p667o393n996o329p332q732r973j0645j0710
58837G50840j0231r322q457q191q453q559q142p547p131o748o120n281m265k835
58823F49558r42R51K331L172L691L971M174M753N892O952P054O210N358N151N105
58808G13381M274K546R38M33Q30J043M22p29k033l682n674o992o663n401n051
$$ plain form
58793 687642 681447 674041 666724 660292 654210 647786 641316 635713 631686 629693 630081 632682 636625 641045
58779 641045 645708 650595 655228 658990 661929 664644 667368 669623 670723 670217 667843 663582 657954 651911
58765 651911 646162 640794 635652 630838 626637 623156 620278 617897 616053 614912 614741 615763 617931 620905
58751 620905 624417 628559 633497 638973 644339 649156 653564 657920 662224 666218 670015 674437 680465 688364
58737 688364 697429 706574 715075 722769 729729 735969 741464 746322 750828 755390 760420 766162 772503 779000
58723 779000 785223 791092 796834 802604 808219 813280 817579 821429 825653 831195 838534 847383 856929 866385
58709 866385 875309 883517 890771 896537 900009 900483 897809 892361 884423 873745 859972 843306 824397
58696 824397 803638 781117 757332 733436 710532 689170 669802 653145 639491 627996 617346
$$ packed form
58793F87642o195p406p317o432o082o424o470n603m027j993L88K601L943M420
58779F41045M663M887M633L762K939K715K724K255J100n06k374m261n628o043
58765F51911n749n368n142m814m201l481k878k381j844j141j71J022K168K974
58751F20905L512M142M938N476N366M817M408M356M304L994L797M422O028P899
58737F88364R065R145Q501P694O960O240N495M858M506M562N030N742O341O497
58723G79000O223N869N742N770N615N061M299L850M224N542P339Q849R546R456
58709H66385Q924Q208P254N766L472M74k674n448p938j0678j3773j6666j8909
58696H24397k0759k2521k3785k3896k2904k1362j9368j6657j3654j1495j0650
$$ plain form
58685 617346 607039 597511 589170 581925 575613 570158 565121 559689 553525 547295 542097 538574 536641 535722
58671 535722 535142 534689 534994 537080 541332 547197 554060 562034 571641 583020 595711 608927 621687 632874
58657 632874 641500 646983 649159 648284 645131 640775 636004 631080 626122 621411 617068 612781 608201 603515
58643 603515 599344 596123 593650 591133 587688 583097 578236 574554 573011 573730 576478 580927 586377 591938
58629 591938 597348 603024 608867 613619 616019 616234 615554 614949 614570 614374 614533 615296 617031 620370 625847 633398
58613 633398 642639 653458 665864 679329 692791 705238 715895 724002 729064 731300 731392 729797 726731
58600 726731 722661 718178 713351 707830 701638 695284 689033 682683 676256 670354 665630 662376 660775 661039
58586 661039 663108 666780 672341 680500 691300 703614 716191 728831 742091 756081 770031 782855
$$ packed form
58685F17346j0307r528q341p245o312n455n037n432o164o230n198l523j933r19
58671E35722n80m53L05K086M252N865O863P974R607J1379J2691J3216J2760J1187
58657F32874Q626N483K176q75l153m356m771m924m958m711m343m287m580m686
58643F03515m171l221k473k517l445m591m861l682j543P19K748M449N450N561
58629E91938N410N676N843M752K400K15o80o05l79j96J59P63J735L339N477P551
58613F33398R241J0819J2406J3465J3462J2447J0657Q107N062K236R2j595l066
58600G26731m070m483m827n521o192o354o251o350o427n902m724l254j601K64
58586F61039K069L672N561Q159J0800J2314J2577J2640J3260J3990J3950J2824
$$ plain form
58574 782855 793766 802480 809306 815131 821027 827708 835384 844069 853962 865587 879619 896540 916472
58561 916472 939356 965025 992821 1021348 1049072 1075155 1099247 1120459 1137161 1148201 1153906 1155477
58549 1155477 1153583 1147993 1138543 1126151 1112777 1100413 1090018 1081258 1073149 1064764 1055276 1043659 1028969
58536 1028969 1011057 990694 968870 946253 923427 901213 880447 861557 844604 829653 816981
58525 816981 807030 800219 796591 795583 796289 798033 800520 803435 806239 808521 810341 812023 813689 815115
58511 815115 815931 815924 815274 814422 813551 812203 809681 805881 801458 797148 793151 789250 785301 781479 778150 775503
58495 775503 773179 770391 766687 762490 758613 755373 752610 750432 749315 749404 750258 751549 753557 756783 761516
58480 761516 768044 776809 787946 800946 815120 830150 845882 861834 877215 891170 902684 910510
$$ packed form
58574G82855J0911Q714O826N825N896O681P676Q685R893J1625J4032J6921J9932
58561I16472K2884K5669K7796K8527K7724K6083K4092K1212J6702J1040N705J571
58549A155477j894n590r450j2392j3374j2364j0395q760q109q385r488j1617j4690
58536A028969j7912k0363k1824k2617k2826k2214k0766j8890j6953j4951j2672
58525H16981r951o811l628j008P06J744K487K915K804K282J820J682J666J426
58511H15115Q16po50q52q71j348k522l800m423m310l997l901l949l822l329k647
58495G75503k324k788l704m197l877l240k763k178j117Q9Q54J291K008L226M733
58480G61516O528Q765J1137J3000J4174J5030J5732J5952J5381J3955J1514P826
$$ plain form
58468 910510 913714 912333 907271 899553 889917 879058 867913 857549 848804 842073 837398 834738 834136 835635
58454 835635 839138 844518 851740 860725 871080 882071 892752 901939 908285 910779 909231 904048 895695
58441 895695 884732 872283 859918 848878 839578 831860 825397 819927 815523 812712 811974 813129 815612
58428 815612 819377 824958 832567 841695 851940 863650 877258 892243 907237 921062 933307 943906
58416 943906 952491 958346 960921 960263 956868 951266 943953 935642 927081 918345 908739 897765 885899 874035
58402 874035 862583 851663 841789 833616 827147 821901 817791 815140 813842 813224 812834 812830 813540 815117 817518
58387 817518 820300 822614 824052 825331 827424 830219 832835 835078 837636 840813 844156 847427 850996 855050
58373 855050 859274 863517 867955 872505 876921 881525 886884 892783 898632 904951 913180 923788 935869 948901
$$ packed form
58468I10510L204j381n062p718r636j0859j1145j0364q745o731m675k660o02J499
58454H35635L503N380P222Q985J0355J0991J0681R187O346K494j548n183q353
58441H95695j0963j2449j2365j1040r300p718o463n470m404k811p38J155K483
58428H15612L765N581P609R128J0245J1710J3608J4985J4994J3825J2245J0599
58416I43906Q585N855K575o58l395n602p313q311q561q736r606j0974j1866j1864
58402H74035j1452j0920r874q173o469n246m110k651j298o18l90mP10J577K401
58387H17518K782K314J438J279K093K795K616K243K558L177L343L271L569M054
58373H55050M224M243M438M550M416M604N359N899N849O319Q229J0608J2081J3032
$$ plain form
58359 948901 963474 979797 996888 1013878 1030723 1046859 1060609 1070959 1078716 1084895 1089148 1090925
58347 1090925 1091072 1090949 1090857 1090595 1090764 1092234 1094941 1098395 1102824 1108734 1115959 1124233 1134029 1145716 1158548
58332 1158548 1171761 1186040 1202564 1220940 1239445 1257023 1273774 1289656 1303979 1316243 1326459
58321 1326459 1334595 1340489 1344299 1346400 1347076 1346982 1347526 1349973 1354405 1360157 1366874 1374497 1382773 1391670 1401812
58306 1401812 1413668 1426699 1440095 1453909 1468697 1484522 1501108 1518448 1536415 1554337 1571759
58295 1571759 1589112 1606767 1624108 1640470 1656417 1673115 1690967 1709743 1729436 1750081 1771404
58284 1771404 1793564 1817549 1843917 1871844 1900285 1929198 1958691 1988043 2016818 2046024 2076802
58273 2076802 2108817 2141224 2174339 2209047 2245532 2284061 2326019 2372518 2422718 2475121 2529770
$$ packed form
58359I48901J4573J6323J7091J6990J6845J6136J3750J0350P757O179M253J777
58347A090925J47j23r2k62J69J470K707L454M429N910P225Q274R796J1687J2832
58332A158548J3213J4279J6524J8376J8505J7578J6751J5882J4323J2264J0216
58321A326459Q136N894L810K101O76r4N44K447M432N752O717P623Q276Q897J0142
58306A401812J1856J3031J3396J3814J4788J5825J6586J7340J7967J7922J7422
58295A571759J7353J7655J7341J6362J5947J6698J7852J8776J9693K0645K1323
58284A771404K2160K3985K6368K7927K8441K8913K9493K9352K8775K9206L0778
58273B076802L2015L2407L3115L4708L6485L8529M1958M6499N0200N2403N4649
$$ plain form
58262 2529770 2587641 2648796 2712762 2779854 2850301 2922806 2995656 3068576 3141918 3214993 3287004
58251 3287004 3358684 3431269 3504938 3580145 3659164 3744056 3834229 3928335 4027473 4133972 4248068
58240 4248068 4368491 4495503 4630622 4774088 4925334 5085245 5255302 5435327 5624915
58231 5624915 5826226 6042433 6274208 6520799 6783725 7066229 7369891 7695079 8044082
58222 8044082 8420574 8826781 9264475 9737918 10252604 10812410 11421547 12087986 12821207
58213 12821207 13628325 14516627 15498217 16587956 17799552 19149546 20663753 22375195
58205 22375195 24319357 26539053 29093148 32056308 35516489 39583590 44400629 50143035
58197 50143035 57018909 65289350 75292738 87444925 102225038 120170400 141863118
$$ packed form
58262B529770N7871O1155O3966O7092P0447P2505P2850P2920P3342P3075P2011
58251C287004P1680P2585P3669P5207P9019Q4892R0173R4106R9138J06499J14096
58240D248068J20423J27012J35119J43466J51246J59911J70057J80025J89588
58231E624915K01311K16207K31775K46591K62926K82504L03662L25188L49003
58222H044082L76492M06207M37694M73443N14686N59806O09137O66439P33221
58213A2821207Q07118Q88302R81590J089739J211596J349994J514207J711442
58205B2375195J944162K219696K554095K963160L460181M067101M817039N742406
58197E0143035O875874Q270441J0003388J2152187J4780113J7945362K1692718
$$ plain form
58190 141863118 167876538 198677721 234436139 274596224 317214840 358515129 393345581
58183 393345581 416708456 425567754 419791858 401774919 375258506 344157987 311770771
58176 311770771 280341739 250956228 223797900 198648171 175321425 153821850 134270688
58169 134270688 116780821 101383359 88010019 76510195 66686748 58330031 51236449
58162 51236449 45217153 40104802 35755107 32042271 28857249 26111287 23735387 21672590
58154 21672590 19872420 18291945 16896379 15655834 14544157 13541228 12632138 11802805
58146 11802805 11039765 10334855 9685960 9091601 8547775 8050517 7597502 7185511 6809601
58137 6809601 6466303 6154668 5872597 5614609 5374561 5148344 4933013 4725960 4526403
$$ packed form
58190A41863118K6013420L0801183L5758418M0160085M2618616M1300289L4830452
58183C93345581K3362875Q859298n775896j8016939k6516413l1100519l2387216
58176C11770771l1429032k9385511k7158328k5149729k3326746k1499575j9551162
58169A34270688j7489867j5397462j3373340j1499824r823447q356717p093582
58162E1236449o019296n112351m349695l712836l185022k745962k375900k062797
58154B1672590j800170j580475j395566j240545j111677j002929r09090q29333
58146A1802805p63040p04910o48895n94359n43826m97258m53015m11991l75910
58137F809601l43298l11635k82071k57988k40048k26217k15331k07053j99557
$$ plain form
58128 4526403 4335719 4155054 3984137 3822954 3672488 3532948 3403028 3281531 3168005
58119 3168005 3061345 2959681 2862224 2769544 2681689 2597880 2518313 2444179 2375380 2310209 2247830
58108 2247830 2189128 2134498 2082761 2032975 1985482 1940364 1896584 1853450 1811383 1770457 1729745
58097 1729745 1688828 1648555 1609604 1571671 1534668 1499305 1465811 1433524 1402416 1373661 1347954
58086 1347954 1324456 1302108 1280769 1260479 1240707 1220962 1201066 1180436 1158320 1135225 1112864
58075 1112864 1092126 1072208 1052245 1032583 1013886 996186 979419 963753 948826 933753 918496
58064 918496 904196 891677 880626 870621 861697 853391 844557 834875 825382 816705 807898 797828 786708
58051 786708 775457 764538 754228 745106 737319 730145 723105 716791 711823 707637 703122 697851 692037
$$ packed form
58128D526403j90684j80665j70917j61183j50466j39540j29920j21497j13526
58119C168005j06660j01664r7457r2680q7855q3809p9567p4134o8799o5171o2379
58108B247830n8702n4630n1737m9786m7493m5118m3780m3134m2067m0926m0712
58097A729745m0917m0273l8951l7933l7003l5363l3494l2287l1108k8755k5707
58086A347954k3498k2348k1339k0290j9772j9745j9896k0630k2116k3095k2361
58075A112864k0738j9918j9963j9662j8697j7700j6767j5666j4927j5073j5257
58064I18496j4300j2519j1051j0005q924q306q834r682r493q677q807j0070j1120
58051G86708j1251j0919j0310r122p787p174p040o314m968m186m515n271n814
$$ plain form
58038 692037 685878 679591 673587 668015 662542 656943 651284 645315 638493 630946 623434 615887 607059 596423
58024 596423 585394 575721 567456 559476 551369 543717 536919 530761 524961 519388 513926 508739 504420 501243
58010 501243 498571 495600 492434 489833 488118 486954 486027 485355 484940 484572 484010 483125 481860 480266 478523 476906
57994 476906 475875 476009 477438 479319 480461 480548 480279 480255 480379 480425 480439 480268 479408 477722 475772 474083 472625
57977 472625 471249 469984 468578 466485 463796 461496 460193 459269 457980 456760 456582 457390 458112 458150 458093 458846
57961 458846 460627 463036 465698 468597 471861 475362 478583 480941 482148 482146 480974 479088 477655 477838 479691
57946 479691 482215 484571 486706 488738 490487 491968 493750 496404 499952 504131 508835 514093 519979 526705
57932 526705 534303 542060 548847 554179 558363 561399 562520 561304 558506 555111 550998 545244 537499 528454
$$ packed form
58038F92037o159o287o004n572n473n599n659n969o822p547p512p547q828j0636
58024E96423j1029r673q265p980q107p652o798o158n800n573n462n187m319l177
58010E01243k672k971l166k601j715j164r27o72m15l68n62q85j265j594j743j617
57994D76906j031J34J429J881J142Q7k69k4J24M6J4j71q60j686j950j689j458
57977D72625j376j265j406k093k689k300j303r24j289j220j78Q08P22L8n7P53
57961D58846J781K409K662K899L264L501L221K358J207kj172j886j433J83J853
57946D79691K524K356K135K032J749J481J782K654L548M179M704N258N886O726
57932E26705P598P757O787N332M184L036J121j216k798l395m113n754p745r045
$$ plain form
57918 528454 519054 509723 500351 490721 480960 471672 463548 456809 451235 446689 443238 440779 439066 438172
57904 438172 438385 439482 440645 441312 441567 441478 440594 438512 435581 432665 430443 429035 427960 426407 424002 421331
57888 421331 419211 417474 415176 412123 409314 407612 406682 405664 404158 402118 399424 396046 392111 387436
57874 387436 381641 375053 368829 363678 359117 354466 349904 345958 342610 339590 336983 334874 332896 330835
57860 330835 329254 328780 329127 329584 330176 331663 334512 338410 342675 346782 350640 354671 359301 364180 368363
57845 368363 371545 374457 377603 380278 381515 381466 381083 380810 380326 379332 377903 376309 374999 374528 374926 375458
57829 375458 375500 375391 375904 377298 379396 382210 385761 389639 393408 397253 401576 406145 410232 413437 415889
57814 415889 417820 419418 420802 421652 421173 418876 415085 410178 403850 395730 386262 376250 365944 355423
$$ packed form
57918E28454r400r331r372r630r761r288q124o739n574m546l451k459j713q94
57904D38172K13J097J163O67K55q9q84k082k931k916k222j408j075j553k405k671
57888D21331k120j737k298l053k809j702r30j018j506k040k694l378l935m675
57874C87436n795o588o224n151m561m651m562l946l348l020k607k109j978k061
57860C30835j581m74L47M57N92J487K849L898M265M107L858M031M630M879M183
57845C68363L182K912L146K675J237m9l83k73m84r94j429j594j310m71L98N32
57829C75458M2j09N13J394K098K814L551L878L769L845M323M569M087L205K452
57814D15889J931J598J384Q50m79k297l791m907o328q120r468j0012j0306j0521
$$ plain form
57800 355423 345507 337311 330955 325588 320676 316541 313581 311609 310136 308861 307824 307308 307420 307645 307276
57785 307276 306655 307305 310220 314601 319043 323378 328392 334294 340612 347259 354428 361515 367437 372196 376972
57770 376972 382299 387133 390092 390890 390128 388372 385848 382533 378171 372509 365665 358065 350086 342156 334956
57755 334956 328896 323491 317920 312185 307074 303054 299889 297334 295472 294290 293559 293202 293160 292901 291756
57740 291756 289793 287734 286056 284815 284152 284055 283685 282001 279259 276933 275898 275619 275406 275453 276173 277386
57724 277386 278766 280336 281928 282824 282588 281767 281162 280841 280340 279401 278031 276214 274038 271752 269343 266459
57708 266459 263092 259876 257288 255007 252501 249819 247332 245077 242978 241350 240578 240441 240272 239783 239297
57693 239297 239269 239887 241065 242426 243348 243408 242878 242556 243065 244475 246608 249502 253398 258375 264293 271310
$$ packed form
57800C55423r916q196o356n367m912m135k960j972j473j275j037n16J12K25l69
57785C07276o21O50K915M381M442M335N014N902O318O647P169P087N922M759M776
57770C76972N327M834K959P98p62j756k524l315m362n662o844p600p979p930p200
57755C34956o060n405n571n735n111m020l165k555j862j182p31l57m2k59j145
57740B91756j963k059j678j241o63r7l70j684k742k326j035k79k13M7P20J213
57724B77386J380J570J592Q96k36q21o05l21n01r39j370j817k176k286k409k884
57708B66459l367l216k588k281k506k682k487k255k099j628p72j37j69m89m86
57693B39297k8O18J178J361R22O0n30l22N09J410K133K894L896M977N918P017
$$ plain form
57677 271310 280209 291844 306397 323894 345577 373934 410810 456257 510015 573344 647773 731634
57665 731634 818355 897976 959810 994771 997956 970715 919874 854155 781201 707177 637123 574219
57653 574219 519254 471696 431088 397033 368641 344878 325173 309167 296222 285767 277686 271820
57641 271820 267436 263758 260626 258096 255800 253381 251224 250056 249913 250131 250188 250088 250015 250117 250495 250922 250707
57624 250707 249305 246965 244378 241860 239310 236814 234714 233048 231401 229378 226968 224425 222026 219914
57610 219914 218011 216166 214469 213162 212095 210671 208688 206875 206101 206279 206569 206489 206305 206352 206456 206132 205035
57593 205035 203153 200721 197969 194857 191250 187505 184517 182838 181918 180681 178735 176588 174818 173512
57579 173512 172562 171959 171645 171399 171090 170780 170394 169460 167453 164415 161071 158280 156347 154948 153662 152422
$$ packed form
57677B71310Q899J1635J4553J7497K1683K8357L6876M5447N3758O3329P4429Q3861
57665G31634Q6721P9621O1834L4961L185k7241n0841o5719p2954p4024p0054o2904
57653E74219n4965m7558m0608l4055k8392k3763j9705j6006j2945j0455q081n866
57641B71820m384l678l132k530k296k419k157j168j43K18N7j00p3J02L78M27k15
57624B50707j402k340k587k518k550k496k100j666j647k023k410k543k399k112
57610B19914j903j845j697j307j067j424j983j813p74J78K90q0j84M7J04l24j097
57593B05035j882k432k752l112l607l745k988j679r20j237j946k147j770j306
57579A73512r50o03l14k46l09l10l86r34k007l038l344k791j933j399j286j240
$$ plain form
57563 152422 151347 150397 149473 148689 148129 147402 145985 144106 142802 142878 144224 146288 148743 151419 154114 156915
57547 156915 160216 163829 166456 166767 164999 162912 162087 162657 163776 164849 166015 167623 169553 171200 172058
57532 172058 172139 171708 170789 169294 167531 166134 165392 165109 165239 166152 167986 170168 171915 172859 172941 172164 170848
57515 170848 169744 169402 169689 170267 171139 172230 172889 172514 171513 170952 171231 171690 171589 170979 170455 170396 170622 170607
57497 170607 169971 168883 167905 167317 166753 165664 163929 161756 159300 156715 154398 152714 151526 150357 148962
57482 148962 147493 146169 145064 144148 143359 142680 142268 142244 142190 141227 138971 136145 133869 132576 131936 131511 131032
57465 131032 130326 129579 129433 130232 131271 131437 130585 129723 129698 130272 130623 130316 129496 128487 127521 126818 126697 127500
57447 127500 129259 131415 133134 134082 134632 135163 135530 135548 135541 135911 136473 136795 136930 137166 137251 136669 135727 135522 136536
$$ packed form
57563A52422j075r50r24p84n60p27j417j879j304P6J346K064K455K676K695K801
57547A56915L301L613K627L11j768k087q25N70J119J073J166J608J930J647Q58
57532A72058Q1m31r19j495j763j397p42k83J30R13J834K182J747R44Q2p77j316
57515A70848j104l42K87N78Q72J091O59l75j001n61K79M59j01o10n24n9K26j5
57497A70607o36j088r78n88n64j089j735k173k456k585k317j684j188j169j395
57482A48962j469j324j105r16p89o79m12k4n4r63k256k826k276j293o40m25m79
57465A31032p06p47j46P99J039J66q52q62k5N74L51l07q20j009r66p03j21Q03
57447A27500J759K156J719R48N50N31L67J8pL70N62L22J35K36Q5n82r42k05J014
$$ plain form
57428 136536 137869 138291 137691 137087 137451 138799 140323 141162 141053 140309 139220 137684 135588 133325 131577 130654
57412 130654 130333 130295 130422 130685 131089 131713 132534 133223 133392 133035 132464 131859 131151 130336 129598 129061 128704 128633 129246
57393 129246 130940 133644 136643 139040 140603 142053 144229 147060 149840 152431 155407 158869 162001 164303
57379 164303 166426 169005 171416 172608 172685 172638 172818 172721 172067 171077 169746 167850 165749 164213 163344 162531 161572
57362 161572 160913 160572 159804 158220 156466 155405 155254 155843 157004 158395 159538 160387 161256 161975 161901 161139 160933
57345 160933 162222 164378 165991 166439 166122 165541 164835 164024 163211 162552 162245 162380 162670 162668 162378 162296 162688 163241 163581
57326 163581 163648 163391 162694 161873 161624 162088 162491 162135 161270 160541 160076 159657 159349 159443 160046 161179 162923 165044
57308 165044 166792 167603 167721 167767 168017 168476 169231 170194 170932 171329 172092 173952 176586 178932 180356 180957 180955 180514
$$ packed form
57428A36536J333M22o00o04L64J348J524Q39j09p44j089j536k096k263j748r23
57412A30654l21l8J27K63M04O24Q21O89J69l57n71o05p08q15p38n37l57p1O13
57393A29246J694K704K999K397J563J450K176K831K780K591K976L462L132K302
57379A64303K123K579K411J192P7m7J80r7o54r90j331j896k101j536q69q13r59
57362A61572o59l41p68j584j754j061j51N89J161J391J143Q49Q69P19p4p62k06
57345A60933J289K156J613M48l17n81p06q11q13o59l07J35K90kk90q2L92N53L40
57326A63581O7k57o97q21k49M64M03l56q65p29m65m19l08R4O03J133J744K121
57308A65044J748Q11J18M6K50M59P55R63P38L97P63J860K634K346J424O01km41
$$ plain form
57290 180514 180100 180317 181269 182615 184251 186398 188971 191409 193298 194735 195978 197175 198526 200234 202124
57275 202124 203767 205272 207555 211355 216176 220608 223752 226017 228473 231663 235280 238820 242162 245379
57261 245379 248365 251050 253753 256874 260239 263240 265711 268222 271318 274946 278904 283394 288654 294359
57247 294359 299893 305128 310463 316100 321691 326724 331063 335040 339204 343965 349271 354533 358996 362290
57233 362290 364772 367387 371098 376229 382353 388935 395993 403839 412320 420804 429032 437480 446619 456187
57219 456187 465529 474423 483275 492606 502564 512876 523205 533654 544871 557377 570886 584616
57207 584616 598234 612036 626246 640743 655558 671009 687090 703362 719746 736781 754658
57196 754658 772637 790050 807438 826129 846978 869974 894720 920710 947385 974478 1002166
$$ packed form
57290A80514m14K17R52J346J636K147K573K438J889J437J243J197J351J708J890
57275B02124J643J505K283L800M821M432L144K265K456L190L617L540L342L217
57261B45379K986K685K703L121L365L001K471K511L096L628L958M490N260N705
57247B94359N534N235N335N637N591N033M339L977M164M761N306N262M463L294
57233C62290K482K615L711N131O124O582P058P846Q481Q484Q228Q448R139R568
57219D56187R342Q894Q852R331R958J0312J0329J0449J1217J2506J3509J3730
57207E84616J3618J3802J4210J4497J4815J5451J6081J6272J6384J7035J7877
57196G54658J7979J7413J7388J8691K0849K2996K4746K5990K6675K7093K7688
$$ plain form
57185 1002166 1030557 1059288 1087928 1116336 1144237 1170878 1195734 1219180 1241801 1263283 1282611
57174 1282611 1299188 1313259 1325454 1336552 1347528 1359186 1371786 1385501 1401081 1419488 1440963
57163 1440963 1464956 1490889 1518451 1547281 1576960 1607383 1638648 1670610 1702968 1735753 1769224
57152 1769224 1803279 1837356 1870856 1903329 1934464 1964392 1993898 2023764 2053840 2083115 2110668
57141 2110668 2136289 2160520 2184617 2210293 2238779 2269939 2302513 2334978 2365907 2394037 2418998
57130 2418998 2442067 2465632 2491875 2522257 2557930 2599663 2647174 2699095 2753709 2809399 2864554
57119 2864554 2917836 2968842 3018282 3067651 3119177 3175869 3240791 3315907 3401712 3497754 3603225
57108 3603225 3717474 3840750 3974640 4121713 4285416 4471007 4686311 4941046 5245968
$$ packed form
57185A002166K8391K8731K8640K8408K7901K6641K4856K3446K2621K1482J9328
57174A282611J6577J4071J2195J1098J0976J1658J2600J3715J5580J8407K1475
57163A440963K3993K5933K7562K8830K9679L0423L1265L1962L2358L2785L3471
57152A769224L4055L4077L3500L2473L1135K9928K9506K9866L0076K9275K7553
57141B110668K5621K4231K4097K5676K8486L1160L2574L2465L0929K8130K4961
57130B418998K3069K3565K6243L0382L5673M1733M7511N1921N4614N5690N5155
57119B864554N3282N1006M9440M9369N1526N6692O4922P5116Q5805R6042J05471
57108C603225J14249J23276J33890J47073J63703J85591K15304K54735L04922
$$ plain form
57099 5245968 5613661 6060041 6604681 7270359 8083223 9072757 10270119 11705918 13408526
57090 13408526 15401323 17698053 20299694 23195044 26360902 29758460 33330614 37003258
57082 37003258 40679876 44219409 47415289 50013943 51784035 52595211 52450450 51458260
57074 51458260 49778626 47580062 45016648 42216364 39276616 36268716 33248651 30266820
57066 30266820 27372266 24611751 22025690 19643505 17481337 15543261 13824095 12311849
57058 12311849 10989846 9839017 8839698 7972548 7219146 6562582 5987450 5479679 5027340
57049 5027340 4621924 4258093 3931676 3638137 3372808 3131655 2911423 2709638 2524838
57040 2524838 2356209 2202597 2062279 1933876 1816905 1711228 1616515 1532441 1458788 1395025
$$ packed form
57099E245968L67693M46380N44640O65678Q12864R89534J197362J435799J702608
57090A3408526J992797K296730K601641K895350L165858L397558L572154L672644
57082C7003258L676618L539533L195880K598654J770092Q11176j44761r92190
57074E1458260j679634k198564k563414k800284k939748l007900l020065k981831
57066C0266820k894554k760515k586061k382185k162168j938076j719166j512246
57058A2311849j322003j150829r99319q67150p53402o56564n75132n07771m52339
57049E027340m05416l63831l26417k93539k65329k41153k20232k01785j84800
57040B524838j68629j53612j40318j28403j16971j05677r4713q4074p3653o3763
$$ plain form
57030 1395025 1340409 1294752 1258439 1231510 1213581 1205085 1207652 1222548 1249319 1286239 1330561 1376723
57018 1376723 1414955 1433806 1425413 1388807 1329081 1254420 1173333 1092577 1016148 945942 883123
57007 883123 828417 781386 740588 704874 673984 647615 624725 604194 585537 568482 552331
56996 552331 536445 520997 506582 493162 479993 466647 453739 442552 434189 429070 426942 427244
56984 427244 429505 433342 438031 442206 444148 442304 435654 424078 408696 391541 374417 358146 343022
56971 343022 329558 318251 308951 301216 295275 291954 291554 293450 297050 302510 310241 320351 332982
56958 332982 348592 367105 386965 405577 420549 430205 433325 429331 418885 403763 385859 366552
56946 366552 346985 328483 312443 299957 291500 286748 284788 284921 287321 292672 301275 312974 327919
$$ packed form
57030A395025n4616m5657l6313k6929j7929q496K567J4896K6771L6920M4322M6162
57018A376723L8232J8851q393l6606n9726p4661q1087q0756p6429p0206o2819
57007H83123n4706m7031m0798l5714l0890k6369k2890k0531j8657j7055j6151
56996E52331j5886j5448j4415j3420j3169j3346j2908j1187q363n119k128L02
56984D27244K261L837M689M175J942j844o650j1576j5382j7155j7124j6271j5124
56971C43022j3464j1307r300p735n941l321m00J896L600N460P731J0110J2631
56958C32982J5610J8513J9860J8612J4972R656L120l994j0446j5122j7904j9307
56946C66552j9567j8502j6040j2486q457m752j960J33K400N351Q603J1699J4945
$$ plain form
56933 327919 346785 369957 396803 425712 454130 478323 494000 498259 491130 474985 452678 426593
56921 426593 398931 371802 346532 323336 302079 283049 266702 252957 241287 231438 223582 217649
56909 217649 212990 209023 205861 203847 202705 201749 200897 200808 201784 203193 204362 205539 207399 210037 213160
56894 213160 217039 222517 230139 239904 251836 266074 282393 300329 319849 340962 362314 380923
56882 380923 393903 400108 399904 394117 383768 370261 355101 339620 325330 313997 306703 303177 302688
56869 302688 305337 311864 322587 337409 356833 382152 414538 454438 501748 555576 613259 669942
56857 669942 719545 756392 776581 778902 765044 738699 704138 665423 626319 589965 558237 531860
56845 531860 511356 497580 491302 492939 503017 522414 551778 591114 640418 700312 771348 852476
$$ packed form
56933C27919J8866K3172K6846K8909K8418K4193J5677M259p129j6145k2307k6085
56921D26593k7662k7129k5270k3196k1257j9030j6347j3745j1670r849p856n933
56909B17649m659l967l162k014j142r56q52q9R76J409J169J177J860K638L123
56894B13160L879N478P622R765J1932J4238J6319J7936J9520K1113K1352J8609
56882C80923J2980O205k04n787j0349j3507j5160j5481j4290j1333p294l526m89
56869C02688K649O527J0723J4822J9424K5319L2386L9900M7310N3828N7683N6683
56857F69942M9603L6847K0189K321j3858k6345l4561l8715l9104l6354l1728k6377
56845E31860k0504j3776o278J637J0078J9397K9364L9336M9304N9894P1036Q1128
$$ plain form
56833 852476 940104 1028055 1107868 1169825 1205424 1210385 1185971 1137734 1073053 999296 922926 849025
56821 849025 781104 721332 670924 630252 598911 576248 562153 557306 562621 578555 604952 641289
56809 641289 686802 740368 800070 862320 921009 968017 995736 1000010 981138 942617 889484 827529
56797 827529 762667 699812 642008 590731 546654 509884 479982 456482 439383 428765 424218 425268
56785 425268 432264 446036 466517 492263 521487 552699 583681 610331 627539 631640 621962 600348
56773 600348 569772 533441 494420 455261 417668 382541 350324 321272 295544 273310 254759
56762 254759 239781 227581 216926 207036 198171 191083 185942 181985 178128 173649 168381 162708 157529
56749 157529 153811 151786 150764 149922 149111 148642 148476 147985 146543 144150 141518 139570 138779 138901 139419 140202
$$ packed form
56833H52476Q7628Q7951P9813O1957L5599M961k4414m8237o4681p3757p6370p3901
56821H49025o7921n9772n0408m0672l1341k2663j4095m847N315J5934K6397L6337
56809F41289M5513N3566N9702O2250N8689M7008K7719M274j8872l8521n3133o1955
56797H27529o4862o2855n7804n1277m4077l6770k9902k3500j7099j0618m547J050
56785D25268O996J3772K0481K5746K9224L1212L0982K6650J7208M101r678k1614
56773F00348l0576l6331l9021l9159l7593l5127l2217k9052k5728k2234j8551
56762B54759j4978j2200j0655r890q865p088n141l957l857m479n268n673n179
56749A57529l718k025j022q42q11m69j66m91j442k393k632j948p91J22N18P83
$$ plain form
56733 140202 141428 142875 143800 143781 143264 142904 142687 142228 141658 141653 142584 144054 145294 145804 145745 145993 147480 150047
56715 150047 152214 152678 151880 151460 152250 153526 154237 154238 154109 154430 155509 157270 159091 160229 160663 161079 161840
56698 161840 162548 162832 162904 162985 162810 162230 161732 161710 161709 161068 159929 158902 158104 157354 157066 157958 159760 161122 161135
56679 161135 160313 159763 159949 160658 161672 162899 164044 164617 164354 163472 162539 162079 162139 162304 162331 162692 164020 165971
56661 165971 167213 166845 165412 164160 163671 163717 164072 164786 165744 166646 167584 169072 171262 173532 175229 176500
56645 176500 178012 180026 182156 184044 185915 188259 191122 193887 195806 196695 197051 197524 198389 199622 201220
56630 201220 203107 204742 205299 204496 203003 201801 201331 201453 201939 202634 203309 203739 203855 203538 202400 200220 197491
56613 197491 195038 193101 191294 189552 188397 188036 187754 186753 185191 183878 183162 182631 181814 180712 179657
$$ packed form
56733A40202J226J447R25j9n17l60k17m59n70nR31J470J240N10n9K48J487K567
56715A50047K167M64p98m20P90J276P11Jj29L21J079J761J821J138M34M16P61
56698A61840P08K84P2Q1j75n80m98k2jo41j139j027p98p50k88Q92J802J362J3
56679A61135q22n50J86P09J014J227J145N73k63q82r33m60O0J65K7L61J328J951
56661A65971J242l68j433j252m89M6L55P14R58R02R38J488K190K270J697J271
56645A76500J512K014K130J888J871K344K863K765J919Q89L56M73Q65J233J598
56630B01220J887J635N57q03j493j202m70J22M86O95O75M30J16l17j138k180k729
56613A97491k453j937j807j742j155l61k82j001j562j313p16n31q17j102j055
$$ plain form
56598 179657 179030 179060 179572 179939 179674 179042 178731 178877 178817 177929 176400 174989 174289 174411 175161 176254 177428 178570
56580 178570 179802 181369 183446 186021 188826 191335 192961 193447 193108 192659 192694 193368 194555 196280 198838 202400
56564 202400 206707 211403 216679 223286 231822 242174 253681 265569 277025 287117 294998 300236 302937
56551 302937 303681 303425 303203 303608 304487 305101 304526 302103 297979 293264 289193 285922 282535 278419 274073 270243
56535 270243 266813 263152 259132 255113 251287 247736 244886 243032 241469 239017 235592 232483 230821 230381
56521 230381 230227 229888 229421 228781 227722 226138 224159 221984 219863 218085 216793 215933 215422 215146 214805 214118
56505 214118 213311 213019 213500 214244 214571 214325 213813 213409 213442 214069 214932 215255 214725 214038 214145 215126 216212 216766 216723
56486 216723 216084 214668 212672 211021 210607 211238 211751 211273 210049 208909 208284 208088 208345 209330 210969 212574
$$ packed form
56598A79657o27L0N12L67k65o32l11J46o0q88j529j411p00J22P50J093J174J142
56580A78570J232J567K077K575K805K509J626M86l39m49L5O74J187J725K558L562
56564B02400M307M696N276O607Q536J0352J1507J1888J1456J0092P881N238K701
56551C02937P44k56k22M05Q79O14n75k423m124m715m071l271l387m116m346l830
56535B70243l430l661m020m019l826l551k850j854j563k452l425l109j662m40
56521B30381j54l39m67o40j059j584j979k175k121j778j292q60n11k76l41o87
56505B14118q07k92M81P44L27k46n12m04L3O27Q63L23n30o87J07R81J086N54m3
56486B16723o39j416j996j651m14O31N13m78j224j140o25j96K57R85J639J605
$$ plain form
56470 212574 213537 214017 214616 215610 216835 218112 219373 220431 221073 221371 221569 221658 221438 221040 220973 221548 222548 223569
56452 223569 224413 225005 225188 224801 223872 222679 221700 221437 222083 223347 224732 225939 226865 227369 227347 226974 226585 226368
56434 226368 226382 226761 227617 228800 230025 231098 231797 231802 231162 230591 230791 231566 232135 232219 232288 232784 233694 234879 236229
56415 236229 237462 238407 239502 241359 243660 245192 245250 244478 243989 244178 244694 245087 245076 244505 243452 242320 241695
56398 241695 242191 244219 247453 250633 252470 252867 252819 253149 253853 254581 255095 255121 254488 253594 253134 253275 253680 254402
56380 254402 255917 258133 260234 261799 263268 264993 266653 267939 268951 269551 269292 268551 268725 270531 272836
56365 272836 274019 273839 273262 273132 273820 275551 278126 280702 282572 283859 284865 285349 285125 284790 284994 285490
56349 285490 285786 286223 287493 289457 291367 292946 294385 295610 296521 297671 299702 302286 304523 306256 308094
$$ packed form
56470B12574R63M80N99R94J225J277J261J058O42K98J98Q9k20l98o7N75J000J021
56452B23569Q44N92J83l87r29j193r79k63O46J264J385J207R26N04k2l73l89k17
56434B26368J4L79Q56J183J225J073O99No40n71K00P75N69Q4O9M96R10J185J350
56415B36229J233R45J095J857K301J532N8p72m89J89N16L93j1n71j053j132o25
56398B41695M96K028L234L180J837L97m8L30P04P28N14K6o33q94m60J41M05P22
56380B54402J515K216K101J565J469J725J660J286J012O00k59p41J74J806K305
56365B72836J183j80n77j30O88J731K575K576J870J287J006M84k24l35K04M96
56349B85490K96M37J270J964J910J579J439J225R11J150K031K584K237J733J838
$$ plain form
56334 308094 310303 312657 315281 318593 322271 325220 326810 327562 328466 330256 333273 337279 341283 344206 345880
56319 345880 346942 347799 348343 348562 348721 348910 349064 349446 350471 352025 353577 354947 356331 357599 358328 358583
56303 358583 359043 360209 362156 365068 369294 374682 380471 386116 391694 397316 402666 407384 411578 415685
56289 415685 420019 424492 428693 432398 436127 440822 446683 452834 458589 464469 471305 478942 486754 494958
56275 494958 504294 514694 525449 536549 548698 561982 575827 590481 607239 626693 647802 669365
56263 669365 691613 715715 742363 771511 803055 837252 874754 916600 963950 1017671 1078345
56252 1078345 1146680 1223523 1309574 1405529 1512318 1630557 1759797 1898908 2047035 2203361
56242 2203361 2366043 2532214 2699101 2864208 3024257 3174805 3311180 3429134 3524578 3593811
$$ packed form
56334C08094K209K354K624L312L678K949J590P52R04J790L017M006M004K923J674
56319C45880J062Q57N44K19J59J89J54L82J025J554J552J370J384J268P29K55
56303C58583M60J166J947K912M226N388N789N645N578N622N350M718M194M107
56289D15685M334M473M201L705L729M695N861O151N755N880O836P637P812Q204
56275D94958R336J0400J0755J1100J2149J3284J3845J4654J6758J9454K1109K1563
56263F69365K2248K4102K6648K9148L1544L4197L7502M1846M7350N3721O0674
56252A078345O8335P6843Q6051R5955J06789J18239J29240J39111J48127J56326
56242B203361J62682J66171J66887J65107J60049J50548J36375J17954R5444O9233
$$ plain form
56232 3593811 3634582 3646493 3630254 3587264 3519961 3431604 3325257 3203590 3069784 2927712
56222 2927712 2780892 2631949 2483345 2337801 2197599 2064099 1938122 1820096 1709700
56213 1709700 1606292 1510033 1421711 1341240 1267293 1198813 1135963 1079162 1028149 982456 941782
56202 941782 905275 871396 839310 809641 783209 759760 738663 720019 704159 690614 678486
56191 678486 667432 657552 648707 640687 633706 628079 623619 619860 616595 613714 610872 607800 604720 602058
56177 602058 599979 598352 596839 594918 592396 590042 589036 589545 590526 591191 591919 593375 595574 598313 601777
56162 601777 606117 611058 616466 622682 629831 637416 645077 653128 661916 671318 681312 692365 704768 718340
56148 718340 733267 750444 770497 793344 819349 850011 886708 929519 978099 1033042 1095529
$$ packed form
56232C593811M0771J1911j6239m2990o7303q8357j06347j21667j33806j42072
56222B927712j46820j48943j48604j45544j40202j33500j25977j18026j10396
56213A709700j03408r6259q8322q0471p3947o8480o2850n6801n1013m5693m0674
56202I41782l6507l3879l2086k9669k6432k3449k1097j8644j5860j3545j2128
56191F78486j1054r880q845q020o981n627m460l759l265k881k842l072l080k662
56177F02058k079j627j513j921k522k354j006N09R81O65P28J456K199K739L464
56162F01777M340M941N408O216P149P585P661Q051Q788R402R994J1053J2403J3572
56148G18340J4927J7177K0053K2847K6005L0662L6697M2811M8580N4943O2487
$$ plain form
56137 1095529 1166218 1245194 1332142 1425433 1521267 1614667 1701365 1778627 1845201 1901522 1949717
56126 1949717 1992612 2032476 2070379 2105679 2135694 2156891 2167367 2167936 2160649 2147250 2129285 2108145
56114 2108145 2083641 2053255 2013866 1963699 1902240 1829675 1747883 1661205 1574736 1491988 1414932
56103 1414932 1345382 1284955 1233970 1191579 1156820 1128796 1106329 1088383 1074519 1064190 1056154
56092 1056154 1049422 1044250 1041300 1040327 1040475 1041226 1042256 1043047 1043595 1044802 1047276 1050475 1053968 1058579 1065076
56077 1065076 1072579 1079685 1086462 1093897 1101992 1109973 1117987 1127032 1137412 1148713 1161114 1175308 1191098
56064 1191098 1207373 1223561 1240065 1257250 1275043 1293571 1313247 1334000 1355022 1375323 1394227
56053 1394227 1411718 1428682 1446138 1463741 1479875 1493881 1507235 1521723 1537480 1553844 1571026
$$ packed form
56137A095529P0689P8976Q6948R3291R5834R3400Q6698P7262O6574N6321M8195
56126A949717M2895L9864L7903L5300L0015K1197J0476N69p287j3399j7965k1140
56114B108145k4504l0386l9389n0167o1459p2565q1792q6678q6469q2748p7056
56103A414932o9550o0427n0985m2391l4759k8024k2467j7946j3864j0329q036
56092A056154o732n172k950r73J48P51J030P91N48J207K474L199L493M611O497
56077A065076P503P106O777P435Q095P981Q014R045J0380J1301J2401J4194J5790
56064A191098J6275J6188J6504J7185J7793J8528J9676K0753K1022K0301J8904
56053A394227J7491J6964J7456J7603J6134J4006J3354J4488J5757J6364J7182
$$ plain form
56042 1571026 1589665 1609594 1630431 1652599 1676504 1701448 1726573 1752070 1778268 1804577 1830792
56031 1830792 1858495 1889525 1923837 1960403 1999361 2041609 2087028 2134816 2184982 2237847 2292666
56020 2292666 2348283 2404623 2462172 2520746 2580180 2641376 2705198 2771246 2839146 2909882 2984335
56009 2984335 3061818 3141764 3225435 3314079 3406885 3502862 3603147 3709184 3820218 3935200
55999 3935200 4055700 4184206 4320896 4464867 4617125 4779406 4951457 5132551 5324362
55990 5324362 5529191 5746861 5976748 6221458 6484857 6767882 7070072 7393899 7743594
55981 7743594 8121046 8527046 8965507 9442364 9961682 10527112 11145724 11825958 12573563
55972 12573563 13394469 14300012 15304570 16420715 17663002 19054901 20626534 22409173
$$ packed form
56042A571026J8639J9929K0837K2168K3905K4944K5125K5497K6198K6309K6215
56031A830792K7703L1030L4312L6566L8958M2248M5419M7788N0166N2865N4819
56020B292666N5617N6340N7549N8574N9434O1196O3822O6048O7900P0736P4453
56009B984335P7483P9946Q3671Q8644R2806R5977J00285J06037J11034J14982
55999C935200J20500J28506J36690J43971J52258J62281J72051J81094J91811
55990E324362K04829K17670K29887K44710K63399K83025L02190L23827L49695
55981G743594L77452M06000M38461M76857N19318N65430O18612O80234P47605
55972A2573563Q20906R05543J004558J116145J242287J391899J571633J782639
$$ plain form
55964 22409173 24440356 26773652 29478285 32635165 36345127 40741530 45990054 52286671
55956 52286671 59874963 69069083 80253191 93865913 110396050 130373946 154323676
55949 154323676 182675284 215607106 252687669 292274685 331029815 364194573 386890217
55942 386890217 395835282 390417296 372543076 345602385 313309897 278925320 244906616
55935 244906616 212863522 183691974 157782559 135202215 115811265 99342855 85467933
55928 85467933 73838996 64112764 55969342 49131173 43367843 38487025 34328135 30762547
55920 30762547 27689143 25024759 22700506 20663506 18873211 17293590 15892220 14644893
55912 14644893 13534192 12542711 11652205 10848681 10122820 9465104 8865204 8316044 7813598
$$ packed form
55964B2409173K031183K333296K704633L156880L709962M396403N248524O296617
55956E2286671P588292R194120J1184108J3612722J6530137J9977896K3949730
55949A54323676K8351608L2931822L7080563L9587016L8755130L3164758K2695644
55942C86890217Q945065n417986j7874220k6940691l2292488l4384577l4018704
55935B44906616l2043094k9171548k5909415k2580344j9390950j6468410j3874922
55928H5467933j1628937r726232q143422o838169n763330m880818m158890l565588
55920C0762547l073404k664384k324253k037000j790295j579621j401370j247327
55912A4644893j110701r91481q90506q03524p25861o57716n99900n49160n02446
$$ plain form
55903 7813598 7352461 6926025 6531032 6167367 5832985 5523272 5235651 4970377 4726127
55894 4726127 4499006 4286817 4090438 3909799 3741983 3584520 3437452 3300950 3173694
55885 3173694 3054743 2944536 2843037 2749147 2662671 2584652 2515049 2452021 2393690 2338333 2282696
55874 2282696 2222975 2158422 2091867 2025947 1960825 1896078 1832477 1770903 1711391 1654242 1600586
55863 1600586 1551145 1505737 1464281 1426773 1392012 1358042 1324189 1291258 1259617 1228787 1198981
55852 1198981 1171098 1144846 1118690 1092053 1065820 1040313 1014625 988519 963178 939385 916549
55841 916549 894183 872847 852952 834054 815943 799070 783401 768174 753299 739605 727248
55830 727248 715326 703613 693145 684320 675874 666626 657068 648336 640572 633122 625408 616916 607176
$$ packed form
55903G813598m61137m26436l94993l63665l34382l09713k87621k65274k44250
55894D726127k27121k12189j96379j80639j67816j57463j47068j36502j27256
55885C173694j18951j10207j01499r3890q6476p8019o9603o3028n8331n5357n5637
55874B282696n9721o4553o6555o5920o5122o4747o3601o1574n9512n7149n3656
55863A600586m9441m5408m1456l7508l4761l3970l3853l2931l1641l0830k9806
55852A198981k7883k6252k6156k6637k6233k5507k5688k6106k5341k3793k2836
55841I16549k2366k1336j9895j8898j8111j6873j5669j5227j4875j3694j2357
55830G27248j1922j1713j0468q825q446r248r558q732p764p450p714q492r740
$$ plain form
55817 607176 596403 585523 575109 565009 555273 546476 538837 532028 526205 522121 519778 518002 515984
55804 515984 514329 514029 515264 517797 521744 527273 534073 541571 549215 556335 562357 567322 571575 574860
55790 574860 576436 576063 574030 570242 564366 556975 549471 542622 536181 530011 524273 518103 509471 497204
55776 497204 482332 466928 452533 440222 431105 425787 423896 424865 428684 435294 443584 451443 456619
55763 456619 457573 454174 447796 440177 432018 423115 413587 404056 394725 385325 376085 367698 360126 352562
55749 352562 344808 337556 331011 324415 317414 310679 304589 298447 291813 285620 281076 278244 276478 275469
55735 275469 275003 274372 273048 271528 270708 270607 270303 268933 266330 262931 259408 256109 252667 248510 243814
55720 243814 239402 235700 232471 229644 227559 226239 225314 224943 225888 228286 231309 234477 238445 243913 250517
$$ packed form
55817F07176j0773j0880j0414j0100r736q797p639o809n823m084k343j776k018
55804E15984j655l00J235K533L947N529O800P498P644P120O022M965M253L285
55790E74860J576l73k033l788n876p391p504o849o441o170n738o170q632j2267
55776D97204j4872j5404j4395j2311r117n318j891R69L819O610Q290P859N176
55763D56619R54l399o378p619q159q903r528r531r331r400r240q387p572p564
55749C52562p754p252o545o596p001o735o090o142o634o193m544k832j766j009
55735B75469m66o31j324j520q20j01l04j370k603l399l523l299l442m157m696
55720B43814m412l702l229k827k085j320r25l71R45K398L023L168L968N468O604
$$ plain form
55705 250517 257280 263365 267918 270052 269647 267503 264241 259739 254033 247776 241335 234443 227385 221474
55691 221474 217455 214393 211089 207773 205371 203923 202853 202239 202613 203882 205542 207692 210819 214749 218648
55676 218648 221978 224694 226736 228048 228923 229638 229893 229249 227991 226935 226509 226455 226237 225405 223828 222003
55660 222003 220789 220505 220721 221277 222797 225692 229304 232725 235885 239072 241959 243947 245068 245771 246216
55645 246216 246498 247033 247809 247715 245678 242138 238426 234864 230539 224861 218357 211819 205525 199439 193509
55630 193509 187660 182078 177419 174145 171766 169361 166758 164545 163059 162086 161461 161182 160910 160079 158588
55615 158588 156788 154790 152395 149664 146938 144342 141935 140227 139759 140081 139966 138805 137103 135460 133795
55600 133795 131888 129999 128482 127215 125771 123901 121660 119417 117885 117740 118888 120343 121020 120575 119488
$$ packed form
55705B50517O763O085M553K134m05k144l262m502n706o257o441o892p058n911
55691B21474m019l062l304l316k402j448j070o14L74J269J660K150L127L930L899
55676B18648L330K716K042J312Q75P15K55o44j258j056m26n4k18q32j577j825
55660B22003j214k84K16N56J520K895L612L421L160L187K887J988J121P03M45
55645B46216K82N35P76r4k037l540l712l562m325n678o504o538o294o086n930
55630A93509n849n582m659l274k379k405k603k213j486r73o25k79k72q31j491
55615A58588j800j998k395k731k726k596k407j708m68L22j15j161j702j643j665
55600A33795j907j889j517j267j444j870k241k243j532j45J148J455O77m45j087
$$ plain form
55585 119488 118579 118400 118800 119034 118496 117312 116067 115137 114585 114459 114769 115341 116122 117449 119522 121793 123482
55568 123482 124638 126035 128033 130146 131846 133133 134112 134600 134510 134194 134041 133999 133812 133542 133526 133875 134239 134127
55550 134127 133428 132576 132133 132261 132690 133159 133566 133729 133444 132909 132627 132687 132673 132510 132778 133733 134734 135284 135982
55531 135982 137590 139658 141095 141736 142321 143085 143492 143353 143129 142908 142076 140312 138108 135941 133688 131159
55515 131159 128552 126027 123447 120849 118652 117071 115889 114988 114510 114256 113576 112209 110649 109364 108263
55500 108263 107302 106918 107323 107865 107722 106880 105950 105290 104812 104433 104300 104663 105710 107310 108779 109290 108793 108165
55482 108165 108217 108956 110018 111227 112342 112815 112463 111977 112126 112685 112802 112251 111692 111730 112278 112850 112946 112129 110257
55463 110257 107885 106027 105248 105200 105173 104869 104454 104114 103898 103986 104727 106154 107578 108037 107302 106163 105491 105286
$$ packed form
55585A19488r09j79M00K34n38j184j245r30n52j26L10N72P81J327K073K271J689
55568A23482J156J397J998K113J700J287R79M88r0l16j53m2j87k70j6L49L64j12
55550A34127o99q52m43J28M29M69M07J63k85n35k82O0j4j63K68R55J001N50O98
55531A35982J608K068J437O41N85P64M07j39k24k21q32j764k204k167k253k529
55515A31159k607k525k580k598k197j581j182r01m78k54o80j367j560j285j101
55500A08263r61l84M05N42j43q42r30o60m78l79j33L63J047J600J469N11m97o28
55482A08165N2P39J062J209J115M73l52m86J49N59J17n51n59L8N48N72R6q17j872
55463A10257k372j858p79m8k7l04m15l40k16Q8P41J427J424M59p35j139o72k05
$$ plain form
55445 105286 105045 104811 105196 106306 107333 107544 107144 106738 106398 105787 104924 104242 103958 103891 103867 103947 104215 104715 105528
55426 105528 106537 107177 106895 105986 105536 106272 107790 109159 109911 110165 110085 109788 109709 110443 112020 113688 114697
55409 114697 115020 115011 114666 113678 112131 110605 109482 108528 107386 106120 105046 104239 103549 102954 102603 102569 102752 102991
55391 102991 103108 102948 102532 102129 102007 102238 102772 103545 104409 105174 105861 106626 107263 107183 106213 105118 104857 105543 106539
55372 106539 107353 107892 107974 107248 105695 103816 102229 101408 101688 103028 104745 106005 106700 107407 108366 108975 108556
55355 108556 107195 105593 104409 103949 104159 104598 104638 104016 103148 102743 103089 103800 104205 104045 103810 104240 105377 106388
55337 106388 106551 106156 106016 106388 106930 107534 108474 109645 110338 110070 109152 108218 107564 107131 106760 106250 105568 105089
55319 105089 105310 106167 107064 107665 108171 108735 109131 109297 109606 110237 110707 110471 109627 108693 107974 107499 107236 106956 106228
$$ packed form
55445A05286k41k34L85J110J027K11m00m06l40o11q63o82k84o7k4Q0K68N00Q13
55426A05528J009O40k82r09m50P36J518J369P52K54q0k97p9P34J577J668J009
55409A14697L23rl45r88j547j526j123r54j142j266j074q07o90n95l51l4J83K39
55391A02991J17j60m16m03j22K31N34P73Q64P65O87P65O37q0r70j095k61O86R96
55372A06539Q14N39Q2p26j553j879j587q21K80J340J717J260O95P07R59O09m19
55355A08556j361j602j184m60K10M39M0o22q68m05L46P11M05j60k35M30J137J011
55337A06388J63l95j40L72N42O04R40J171O93k68r18r34o54m33l71n10o82m79
55319A05089K21Q57Q97O01N06N64L96J66L09O31M70k36q44r34p19m75k63k80p28
$$ plain form
55300 106228 104982 103878 103701 104471 105515 106289 106846 107578 108767 110321 111760 112541 112561 112251 112064 112041 111931
55283 111931 111566 111014 110574 110636 111281 111997 112123 111665 111280 111395 111731 111831 111506 110553 108658 106003 103572 102342
55265 102342 102371 102955 103414 103443 103086 102783 103151 104268 105399 105756 105365 104876 104810 105358 106563 108243 109875 110990
55247 110990 111634 112144 112641 112987 113053 112788 112287 111984 112445 113616 114664 114912 114638 114541 114802 115142 115463 115789 115806
55228 115806 115107 113865 112752 112232 112318 112887 113727 114384 114461 114097 113777 113787 114158 114984 116159 116979 116662 115350
55210 115350 114087 113652 113860 114105 114082 113810 113376 112907 112571 112409 112381 112590 113158 113828 114021 113509 112799 112671 113332
55191 113332 114124 114093 112936 111426 110727 111227 112217 112796 112762 112451 112089 111750 111615 111773 111920 111682 111087 110347 109419
55172 109419 108318 107669 108246 109962 111827 113012 113441 113378 113005 112559 112354 112448 112676 113135 114150 115592 116707
$$ packed form
55300A06228j246j104j77P70J044P74N57P32J189J554J439P81K0l10j87k3j10
55283A11931l65n52m40O2O45P16J26m58l85J15L36J00l25r53j895k655k431j230
55265A02342K9N84M59K9l57l03L68J117J131L57l91m89o6N48J205J680J632J115
55247A10990O44N10M97L46O6k65n01l03M61J171J048K48k74r7K61L40L21L26J7
55228A15806o99j242j113n20Q6N69Q40O57P7l64l20J0L71Q26J175Q20l17j312
55210A15350j263m35K08K45k3k72m34m69l36j62k8K09N68O70J93n12p10j28O61
55191A13332P92l1j157j510o99N00R90N79l4l11l62l39j35J58J47k38n95p40r28
55172A09419j101o49N77J716J865J185M29o3l73m46k05R4K28M59J015J442J115
$$ plain form
55155 116707 116965 116749 116878 117675 118750 119497 119561 118957 117989 117062 116466 116275 116361 116412 116090 115450 115061 115469 116532
55136 116532 117598 118221 118385 118126 117393 116400 115677 115532 115670 115552 115037 114563 114761 115842 117347 118533 119047
55119 119047 119062 118749 118115 117545 117927 119630 121700 122798 122769 122603 122934 123364 123349 123027 122892 123222 124071 125338
55101 125338 126608 127355 127523 127599 127983 128668 129566 130628 131550 131920 131810 131734 131823 131626 130975 130446 130544 130907 130776
55082 130776 129908 128714 127769 127499 127929 128448 128202 127063 125859 125308 125145 124690 123934 123546 124096 125696 128110
55065 128110 130736 132689 133392 133036 132182 131107 129890 128823 128212 127920 127581 127246 127366 128110 129040 129504 129134
55048 129134 127974 126411 124993 124126 123974 124627 126051 127670 128415 127678 126088 124901 124738 125300 126114 126979
55032 126979 127699 128059 128314 129196 131002 132974 134013 133924 133524 133508 133560 132871 131333 129826 129249 129574 130083 130264
$$ packed form
55155A16707K58k16J29P97J075P47O4o04r68r27n96j91Q6N1l22o40l89M08J063
55136A16532J066O23J64k59p33r93p23j45J38j18n15m74J98J081J505J186N14
55119A19047J5l13o34n70L82J703K070J098k9j66L31M30j5l22j35L30Q49J267
55101A25338J270P47J68P6L84O85Q98J062R22L70j10p6Q9j97o51n29R8L63j31
55082A30776q68j194r45k70M30N19k46j139j204n51j63m55p56l88N50J600K414
55065A28110K626J953P03l56q54j075j217j067o11k92l39l35J20P44R30M64l70
55048A29134j160j563j418q67j52O53J424J619P45p37j590j187j63N62Q14Q65
55032A26979P20L60K55Q82J806J972J039q9m00j6N2o89j538j507n77L25N09J81
$$ plain form
55014 130264 130083 129579 128718 127805 127568 128496 130296 132152 133346 133542 132807 131634 130677 130175 129766 129047 128112
54997 128112 127330 126864 126721 127050 128028 129498 131053 132453 133787 135201 136616 137729 138218 138065 137662 137481
54981 137481 137651 138089 138925 140337 141895 142675 142357 141713 141648 142136 142558 142719 142929 143337 143746 143967 143916 143519 142976
54962 142976 142930 143811 145135 145988 146192 146405 147055 147766 147976 147667 147204 146835 146509 145985 144991 143544 142136 141404
54944 141404 141616 142645 144286 146214 147795 148462 148308 147827 147080 145682 143716 142059 141492 141899 142660 143419
54928 143419 144179 144989 145938 147256 149103 151378 153968 157047 160918 165716 171366 177737 184714 192310 200630
54913 200630 209418 217581 223667 227093 228538 228804 227660 224263 218488 211352 204161 197588 191608 185954
54899 185954 180519 175440 170875 166712 162721 159089 156516 155434 155320 155096 154154 152761 151636 151472 152663
$$ packed form
55014A30264j81n04q61r13k37R28J800J856J194J96p35j173r57n02m09p19r35
54997A28112p82m66j43L29R78J470J555J400J334J414J415J113M89j53m03j81
54981A37481J70M38Q36J412J558P80l18o44o5M88M22J61K10M08M09K21n1l97n43
54962A42976m6Q81J324Q53K04K13O50P11K10l09m63l69l26n24r94j447j408p32
54944A41404K12J029J641J928J581O67j54m81p47j398j966j657n67M07P61P59
54928A43419P60Q10R49J318J847K275K590L079L871M798N650O371O977P596Q320
54913B00630Q788Q163O086L426J445K66j144l397n775p136p191o573n980n654
54899A85954n435n079m565m163l991l632k573j082j14k24r42j393j125j64J191
$$ plain form
54884 152663 154935 157203 158314 158237 158173 159304 161683 164572 167628 171442 176980 184680 193989 203571 212010
54869 212010 218556 223259 226402 227923 227511 225118 221191 216379 211117 205435 199088 191971 184531 177681
54855 177681 172102 167640 163547 159239 154696 150261 146395 143594 142118 141617 141315 140724 139947 139174 138216 136814
54839 136814 135109 133493 132206 131428 131509 132546 133885 134632 134695 134817 135540 136697 138021 139543 141012 141567
54823 141567 140669 139033 137965 137899 138155 138071 137769 137711 138002 138381 138594 138557 138371 138293 138556 139077 139502 139625 139669 140127
54803 140127 141403 143462 145661 147040 147194 146851 147130 148146 148764 148020 146412 145307 145324 145810 145895 145567 145455
54786 145455 145841 146241 145968 144934 143796 143328 143728 144610 145674 147132 149277 151752 153665 154589 155202 156661
54770 156661 159448 163169 167345 172020 177377 183153 188842 194388 200374 207407 215501 224009 232020 238731
$$ packed form
54884A52663K272K268J111p7o4J131K379K889L056L814N538P700R309R582Q439
54869B12010O546M703L143J521m12k393l927m812n262n682o347p117p440o850
54855A77681n579m462m093m308m543m435l866k801j476n01l02n91p77p73r58j402
54839A36814j705j616j287p78Q1J037J339P47O3J22P23J157J324J522J469N55
54823A41567q98j636j068o6K56q4l02n8K91L79K13l7j86p8K63N21M25J23M4M58
54803A40127J276K059K199J379J54l43K79J016O18p44j608j105J7M86Q5l28j12
54786A45455L86M00k73j034j138m68M00Q82J064J458K145K475J913R24O13J459
54770A56661K787L721M176M675N357N776N689N546N986P033Q094Q508Q011O711
$$ plain form
54756 238731 243636 246467 247028 245185 241135 235476 228803 221329 213207 205055 197737 191561 186106 180970
54742 180970 176295 172342 168999 166095 163835 162498 161834 161240 160498 160007 160238 161244 162690 164151 165381
54727 165381 166498 167890 169804 172106 174593 177397 180866 185137 190096 195688 201976 208909 216204 223340
54713 223340 229427 233291 234166 232348 228825 224301 218900 212797 206605 200903 195711 190689 185626 180570
54699 180570 175700 171276 167567 164651 162367 160554 159177 158129 157124 156028 155138 154947 155586 156575 157097
54684 157097 156522 154788 152390 150026 148263 147491 147893 149140 150232 150084 148545 146643 145681 146158 147555 148902
54668 148902 149406 148812 147458 146022 145045 144613 144443 144204 143786 143483 143911 145559 148210 150864 152318 151928 149918
54651 149918 147164 144658 142990 142228 142255 143066 144529 146040 146860 146906 146919 147626 148943 150178 150837 151004 151033 151145
$$ packed form
54756B38731M905K831N61j843m050n659o673p474q122q152p318o176n455n136
54742A80970m675l953l343k904k260j337o64n94p42m91K31J006J446J461J230
54727A65381J117J392J914K302K487K804L469M271M959N592O288O933P295P136
54713B23340O087L864Q75j818l523m524n401o103o192n702n192n022n063n056
54699A80570m870m424l709k916k284j813j377j048j005j096q90j91O39R89N22
54684A57097n75j734k398k364j763p72M02J247J092j48j539j902r62M77J397J347
54668A48902N04n94j354j436r77m32j70k39m18l03M28J648K651K654J454l90k010
54651A49918k754k506j668p62K7Q11J463J511Q20M6J3P07J317J235O59J67K9J12
$$ plain form
54633 151145 151352 151533 151481 150924 149740 148259 147203 147092 147678 148196 148258 148242 148642 149334 149754 149577 148935 148162 147646
54614 147646 147717 148270 148666 148412 147797 147413 147251 146873 146307 146099 146427 146851 147061 147144 147003 146222 144910 143988 144212
54595 144212 145414 147078 148996 150847 151782 151174 149465 147651 146170 144857 143655 142724 142007 141292 140600 140051
54579 140051 139563 139148 139228 140119 141433 142629 143878 145631 147528 148597 148616 148464 148982 150155 151549 152806
54563 152806 153476 153093 151896 150930 150972 151728 152394 152566 152235 151394 150172 149075 148589 148675 148913 148951 148566 147656 146528
54544 146528 145918 146292 147374 148723 150449 152822 155412 157337 158400 159365 160942 163002 164974 166595 167900
54529 167900 168804 169075 168652 167809 167031 166773 167099 167418 166869 165275 163504 162512 162180 161626 160668 160298 161312 162935
54511 162935 163463 162175 160004 158230 157088 156001 154716 153674 153397 153930 154936 156033 156965 157627 158044 158266
$$ packed form
54633A51145K07J81n2n57j184j481j056j11N86N18O2j6M00O92M20j77o42p73n16
54614A47646P1N53L96k54o15l84j62l78n66k08L28M24K10Q3j41p81j312r22K24
54595A44212J202J664J918J851R35o08j709j814j481j313j202r31p17p15o92n49
54579A40051m88m15Q0Q91J314J196J249J753J897J069J9j52N18J173J394J257
54563A52806O70l83j197r66M2P56O66J72l31q41j222j097m86Q6K38L8l85r10j128
54544A46528o10L74J082J349J726K373K590J925J063R65J577K060J972J621J305
54529A67900R04K71m23q43p78k58L26L19n49j594j771r92l32n54r58l70J014J623
54511A62935N28j288k171j774j142j087j285j042k77N33J006J097R32O62M17K22
$$ plain form
54495 158266 158292 158111 157714 157051 156202 155643 156000 157247 158476 158880 158721 158834 159324 159392 158512 157102 155878 155082
54477 155082 154645 154554 154690 154774 154937 155968 158457 161876 165016 167204 168636 169648 170206 170160 169544 168507 167270
54460 167270 166204 165653 165580 165619 165512 165262 164889 164377 163917 163807 163997 164066 163792 163413 163147 162847 162366 161914 161614
54441 161614 160984 159428 157295 155947 156517 158767 161305 162827 163063 162640 162174 161612 160512 158890 157527 157208
54425 157208 157851 158691 159285 160000 161441 163634 165928 167531 168104 168008 168095 169046 170709 172177 172639 172083 171149
54408 171149 170503 170468 170965 171542 171601 170925 169964 169407 169510 170057 170849 171923 173288 174780 176244 177620 178787
54391 178787 179596 180124 180657 181341 182120 183086 184496 186212 187478 187574 186535 184930 183155 181293 179487 178034
54375 178034 177119 176723 176732 176793 176234 174662 172755 171916 172890 174963 176757 177519 177410 176939 176565 176704 177588 179007
$$ packed form
54495A58266K6j81l97o63q49n59L57J247J229M04j59J13M90O8q80j410j224p96
54477A55082m37r1J36Q4J63J031K489L419L140K188J432J012N58m6o16j037j237
54460A67270j066n51p3L9j07k50l73n12m60j10J90O9k74l79k66l00m81m52l00
54441A61614o30j556k133j348N70K250K538J522K36m23m66n62j100j622j363l19
54425A57208O43Q40N94P15J441K193K294J603N73r6Q7R51J663J468M62n56r34
54408A71149o46l5M97N77N9o76r61n57J03N47P92J074J365J492J464J376J167
54391A78787Q09N28N33O84P79R66J410J716J266R6j039j605j775j862j806j453
54375A78034r15l96RO1n59j572j907q39R74K073J794P62j09m71l74J39Q84J419
$$ plain form
54357 179007 180449 181593 182522 183423 184292 184953 185198 184920 184273 183712 183600 183728 183484 182655 181802 181667 182381 183557
54339 183557 184901 186371 187807 188974 190092 191897 194823 198422 201956 205378 209304 214045 219112 223783
54325 223783 227760 231082 233692 235362 235904 235191 233128 229871 225990 222059 218062 213559 208583 204047 200980
54310 200980 199439 198445 196928 194470 191192 187433 183800 181215 180379 181121 182533 183768 184479 184539 183864 182730
54294 182730 181838 181639 181784 181587 180839 179811 178704 177637 177080 177606 179057 180549 181573 182547 183962 185451
54278 185451 186237 186136 185595 184973 184317 183781 183623 183731 183647 183236 182934 183151 183711 184118 184115 183754 183135 182330 181548 181155
54258 181155 181472 182566 184217 186046 187714 188981 189636 189560 189007 188661 189098 190148 191032 191224 190997 191044 191691
54241 191691 192602 193107 192733 191547 190105 189001 188338 187674 186581 185181 184029 183517 183568 183919 184469 185194 185845
$$ packed form
54357A79007J442J144R29R01Q69O61K45k78o47n61j12J28k44q29q53j35P14J176
54339A83557J344J470J436J167J118J805K926L599L534L422L926M741N067M671
54325B23783L977L322K610J670N42p13k063l257l881l931l997m503m976m536l067
54310B00980j541r94j517k458l278l759l633k585q36P42J412J235P11O0o75j134
54294A82730q92j99J45j97p48j028j107j067n57N26J451J492J024R74J415J489
54278A85451P86j01n41o22o56n36j58J08q4m11l02K17N60M07ll61o19q05p82l93
54258A81155L17J094J651J829J668J267O55p6n53l46M37J050Q84J92k27M7O47
54241A91691R11N05l74j186j442j104o63o64j093j400j152n12N1L51N50P25O51
$$ plain form
54224 185845 186021 185605 184931 184381 184035 183850 183993 184620 185419 185770 185468 184971 184760 184782 184689 184376 184016 183777 183701 183695
54204 183695 183432 182467 180738 178824 177490 177100 177585 178686 179969 180953 181584 182332 183447 184423 184713 184708 185357
54187 185357 186901 188638 189969 190958 191746 192100 191916 191623 191667 191953 192110 192018 191750 191322 190823 190550 190620 190651 190144
54168 190144 189085 187913 186993 186310 185590 184582 183337 182298 181928 182128 182236 181701 180604 179407 178456 177821
54152 177821 177381 176946 176532 176541 177292 178296 178521 177643 176545 176225 176685 177361 178158 179357 180801 181947 182702 183502
54134 183502 184453 185005 184733 183997 183561 183836 184695 185768 186712 187374 187924 188744 190036 191540 192693 193078 192842
54117 192842 192752 193648 195597 197699 198953 199234 199168 199205 199239 199092 198916 198907 199013 199134 199347 199691 199934 199881 199752 199951
54097 199951 200454 200730 200368 199560 198783 198146 197357 196340 195552 195420 195690 195678 195193 194824 195213 196332 197645 198688
$$ packed form
54224A85845J76m16o74n50l46j85J43O27P99L51l02m97k11K2r3l13l60k39p6o
54204A83695k63r65j729j914j334l90M85J101J283R84O31P48J115R76K90nO49
54187A85357J544J737J331R89P88L54j84k93M4K86J57r2k68m28m99k73P0L1n07
54168A90144j059j172r20o83p20j008j245j039l70K00J08n35j097j197r51o35
54152A77821m40m35m14RP51J004K25q78j098l20M60O76P97J199J444J146P55Q00
54134A83502R51N52k72p36m36K75Q59J073R44O62N50Q20J292J504J153L85k36
54117A92842r0Q96J949K102J254K81o6L7L4j47j76rJ06J21K13L44K43n3j29J99
54097A99951N03K76l62q08p77o37p89j017p88j32K70j2m85l69L89J119J313J043
$$ plain form
54079 198688 199292 199439 199267 199085 199132 199382 199696 200064 200432 200516 200047 199212 198614 198824 200055 202107 204418 206295
54061 206295 207392 207933 208323 208665 208853 208909 208959 209016 209153 209756 211231 213451 215762 217551 218628 219245 219962 221380
54043 221380 223642 226316 229004 231901 235387 239335 243274 247082 251020 255276 260039 265890 273326 281846
54029 281846 290209 297795 305065 312566 320180 327673 335310 343454 352100 361228 371177 382268 394505 407952
54015 407952 422775 438248 452106 461588 465013 462106 453357 439818 423201 405286 387071 368979
54003 368979 351696 336176 322808 311201 300936 292066 284770 278962 274362 270644 267451 264571 262124
53990 262124 260240 258586 256623 254306 252078 250145 248270 246387 244845 243768 242648 240901 238502 235798
53976 235798 233047 230452 228314 226691 225180 223448 221873 221186 221556 222450 223410 224495 225812 227030 227720
$$ packed form
54079A98688O04J47j72j82M7K50L14L68L68Q4m69q35n98K10J231K052K311J877
54061B06295J097N41L90L42J88N6N0N7J37O03J475K220K311J789J077O17P17J418
54043B21380K262K674K688K897L486L948L939L808L938M256M763N851P436Q520
54029B81846Q363P586P270P501P614P493P637Q144Q646R128R949J1091J2237J3447
54015D07952J4823J5473J3858R482L425k907q749j3539j6617j7915j8215j8092
54003C68979j7283j5520j3368j1607j0265q870p296n808m600l718l193k880k447
53990B62124j884j654j963k317k228j933j875j883j542j077j120j747k399k704
53976B35798k751k595k138j623j511j732j575o87L70Q94R60J085J317J218O90
$$ plain form
53961 227720 227986 228407 229337 230541 231576 232285 232742 232933 232818 232645 232896 233781 235069 236630 238844 242157 246358
53944 246358 250657 254501 258002 261544 265338 269484 274178 279623 285783 292299 298555 303848 307777 310592
53930 310592 312933 315142 317000 318226 318910 319339 319765 320658 322802 326545 331090 335112 338239 341454 345868
53915 345868 351525 357734 364141 370895 377890 384528 390483 396249 402475 408899 414452 418447 421239 423473
53901 423473 425022 425115 423424 420592 417578 414841 412386 410259 408488 406602 403642 398926 392689 385798 378953
53886 378953 372313 365750 359228 352842 346648 340620 334765 329252 324403 320555 317839 316031 314700 313535
53872 313535 312485 311519 310331 308528 306200 304072 302898 302712 302913 303152 303958 306325 310805 317220 325274
53857 325274 335173 347492 362644 380762 401971 426262 452689 478760 500874 515546 520513 515263
$$ packed form
53961B27720K66M21R30J204J035P09M57J91j15j73K51Q85J288J561K214L313M201
53944B46358M299L844L501L542L794M146M694N445O160O516O256N293L929K815
53930C10592K341K209J858J226O84M29M26Q93K144L743M545M022L127L215M414
53915C45868N657O209O407O754O995O638N955N766O226O424N553L995K792K234
53901D23473J549R3j691k832l014k737k455k127j771j886k960m716o237o891o845
53886C78953o640o563o522o386o194o028n855n513m849l848k716j808j331j165
53872C13535j050r66j188j803k328k128j174j86K01K39Q06K367M480O415Q054
53857C25274R899J2319J5152J8118K1209K4291K6427K6071K2114J4672M967n250
$$ plain form
53845 515263 501045 480363 455983 430141 404614 381127 361031 344386 329929 316405 303790
53834 303790 292934 284307 277508 271878 267102 263177 260143 257958 256375 254958 253430 252053 251367 251526
53820 251526 252098 252540 252594 252187 251374 250536 250296 250953 252180 253515 255008 257152 260233 263914 267377 269837
53804 269837 271087 271715 272695 274664 277691 281643 286415 291628 296559 300722 304357 308023 311860 315566 318917
53789 318917 321907 324509 326755 328999 331629 334459 336836 338404 339382 339946 339816 338671 336599 333819 330297
53774 330297 325925 320840 315196 308906 302015 295154 289079 283851 278975 274475 271284 270205 270771 271495 271156
53759 271156 269643 267663 265957 264836 264178 263628 262795 261375 259226 256446 253439 250770 248774 247302 245947
53744 245947 244577 243511 243114 243278 243487 243412 243314 243739 244860 246257 247394 248207 249104 250386 251781 252615 252455
$$ packed form
53845E15263j4218k0682k4380k5842k5527k3487k0096j6645j4457j3524j2615
53834C03790j0856q627o799n630m776l925l034k185j583j417j528j377o86J59
53820B51526N72M42N4m07q13q38k40O57J227J335J493K144L081L681L463K460
53804B69837J250O28R80J969L027L952M772N213M931M163L635L666L837L706L351
53789C18917K990K602K246K244K630K830K377J568R78N64j30j145k072k780l522
53774C30297m372n085n644o290o891o861o075n228m876m500l191j079N66P24l39
53759B71156j513j980j706j121o58n50q33j420k149k780l007k669j996j472j355
53744B45947j370j066l97J64K09p5r8M25J121J397J137Q13Q97J282J395Q34j60
$$ plain form
53727 252455 251556 250682 250490 251084 252160 253485 255094 256992 258877 260452 261974 264184 267486 271395 274983
53712 274983 277744 279758 281175 282025 282608 283598 285417 287709 289827 291707 294003 297393 302062 307679 313471
53697 313471 318305 321252 322394 322855 323817 325672 328150 330870 333427 335316 336303 336770 337284 337911 338308 338404
53681 338404 338473 338488 337954 336613 334869 333223 331665 330038 328641 327937 327784 327491 326689 325697 324856 323893 322287
53664 322287 320070 317918 316437 315641 315243 315227 315846 317003 317939 317880 316988 316374 316974 318559 320098 320891 321084
53647 321084 321141 321236 321335 321516 321943 322606 323387 324349 325753 327700 329948 332172 334331 336653 339274 342021 344625
53630 344625 347090 349705 352632 355580 358007 359646 360747 361798 363100 364652 366365 368299 370640 373446
53616 373446 376444 379194 381592 384143 387596 392243 397699 403342 408777 413799 418176 421783 424931 428249
$$ packed form
53727B52455q99q74j92N94J076J325J609J898J885J575J522K210L302L909L588
53712B74983K761K014J417Q50N83R90J819K292K118J880K296L390M669N617N792
53697C13471M834K947J142M61R62J855K478K720K557J889R87M67N14O27L97R6
53681C38404O9J5n34j341j744j646j558j627j397p04j53k93q02r92q41r63j606
53664C22287k217k152j481p96l98j6O19J157R36n9q92o14O00J585J539P93J93
53647C21084N7R5R9J81M27O63P81R62J404J947K248K224K159K322K621K747K604
53630C44625K465K615K927K948K427J639J101J051J302J552J713J934K341K806
53616C73446K998K750K398K551L453M647N456N643N435N022M377L607L148L318
$$ plain form
53602 428249 432132 436349 440251 443223 444991 445731 446003 446384 446983 447359 447060 446154 445078 444063 442931 441402
53586 441402 439370 436911 434296 432076 430741 430109 429269 427457 424826 422099 419611 417066 414179 411206 408771
53571 408771 407386 407178 407771 408410 408551 408428 408775 409910 411455 413084 415139 418168 422190 426797 431733 436987
53555 436987 442480 448061 453633 458864 462943 465138 465531 464709 462815 459644 455695 452285 450219 449028 448092
53540 448092 447932 449557 452845 456512 459756 463111 467379 472449 477778 483554 490629 499320 508942 518778
53526 518778 529037 540469 553269 566818 580481 594196 608190 622510 637178 652511 668861
53515 668861 686177 704275 723525 744750 768262 793380 819126 845092 871382 898032 924918
53504 924918 952012 979275 1006301 1032422 1057247 1080881 1103641 1125869 1148004 1170489 1193317
$$ packed form
53602D28249L883M217L902K972J768P40K72L81N99L76k99r06j076j015j132j529
53586D41402k032k459k615k220j335o32q40j812k631k727k488k545k887k973k435
53571D08771j385k08N93O39J41j23L47J135J545J629K055L029M022M607M936N254
53555D36987N493N581N572N231M079K195L93q22j894l171l949l410k066j191r36
53540D48092j60J625L288L667L244L355M268N070N329N776P075Q691R622R836
53526E18778J0259J1432J2800J3549J3663J3715J3994J4320J4668J5333J6350
53515F68861J7316J8098J9250K1225K3512K5118K5746K5966K6290K6650K6886
53504I24918K7094K7263K7026K6121K4825K3634K2760K2228K2135K2485K2828
$$ plain form
53493 1193317 1215881 1237468 1257909 1277659 1297281 1316974 1336552 1355761 1374457 1392519 1409805
53482 1409805 1426413 1442917 1460020 1477861 1495865 1513302 1529685 1544488 1556879 1566137 1572159 1575254
53470 1575254 1575660 1573616 1569621 1564053 1556580 1546532 1533945 1519780 1505028 1490074 1475108 1460487
53458 1460487 1446250 1431587 1415280 1396617 1375690 1353069 1329489 1305663 1282074 1258903 1236277
53447 1236277 1214392 1193248 1172589 1152368 1133107 1115527 1099995 1086594 1075542 1067157 1061403 1057600
53435 1057600 1054578 1051163 1047015 1043219 1041557 1042683 1045423 1048409 1051916 1057286 1064834 1073477 1082496 1092499
53421 1092499 1104199 1117289 1131279 1146681 1164389 1184342 1205712 1228164 1252014 1277248 1303368
53410 1303368 1330440 1359466 1391269 1425521 1461259 1498036 1536242 1576623 1619827 1666158 1715272
$$ packed form
53493A193317K2564K1587K0441J9750J9622J9693J9578J9209J8696J8062J7286
53482A409805J6608J6504J7103J7841J8004J7437J6383J4803J2391R258O022L095
53470A575254M06k044l995n568p473j0048j2587j4165j4752j4954j4966j4621
53458A460487j4237j4663j6307j8663k0927k2621k3580k3826k3589k3171k2626
53447A236277k1885k1144k0659k0221j9261j7580j5532j3401j1052q385n754l803
53435A057600l022l415m148l796j662J126K740K986L507N370P548Q643R019J0003
53421A092499J1700J3090J3990J5402J7708J9953K1370K2452K3850K5234K6120
53410A303368K7072K9026L1803L4252L5738L6777L8206M0381M3204M6331M9114
$$ plain form
53399 1715272 1766179 1817855 1869970 1922943 1977379 2033526 2091134 2149678 2208763 2268372 2328618
53388 2328618 2389148 2448935 2506784 2562020 2614673 2665208 2714082 2761291 2806059 2847161 2883690
53377 2883690 2915457 2942586 2965030 2982733 2995914 3004722 3008704 3007064 2999450 2986028 2966747 2940931
53365 2940931 2907940 2867954 2821952 2771111 2716485 2659082 2599923 2539939 2479880 2420343 2361821
53354 2361821 2304759 2249598 2196676 2146124 2097911 2051937 2007886 1964983 1922208 1879032 1835825
53343 1835825 1793367 1752011 1711536 1671785 1633210 1596734 1563194 1532945 1505808 1481241 1458611
53332 1458611 1437600 1418507 1401997 1388195 1375940 1363259 1348850 1333001 1316849 1301050 1285560
53321 1285560 1270504 1256530 1244049 1232629 1221527 1210523 1199958 1190231 1181755 1175164 1171069 1169484
$$ packed form
53399A715272N0907N1676N2115N2973N4436N6147N7608N8544N9085N9609O0246
53388B328618O0530N9787N7849N5236N2653N0535M8874M7209M4768M1102L6529
53377B883690L1767K7129K2444J7703J3181Q808L982j640p614j3422j9281k5816
53365B940931l2991l9986m6002n0841n4626n7403n9159n9984o0059n9537n8522
53354B361821n7062n5161n2922n0552m8213m5974m4051m2903m2775m3176m3207
53343A835825m2458m1356m0475l9751l8575l6476l3540l0249k7137k4567k2630
53332A458611k1011j9093j6510j3802j2255j2681j4409j5849j6152j5799j5490
53321A285560j5056j3974j2481j1420j1102j1004j0565r727q476o591m095j585
$$ plain form
53309 1169484 1169777 1171213 1173401 1176303 1180184 1185584 1193062 1202801 1214566 1228002 1242846 1258941 1276371
53296 1276371 1295599 1317144 1340986 1366521 1393222 1421138 1450513 1481108 1512067 1542412 1571462
53285 1571462 1598829 1624267 1647667 1669110 1688665 1706011 1720410 1731235 1738498 1742596 1743580 1741072
53273 1741072 1735013 1726109 1715136 1702108 1686538 1668336 1647939 1625660 1601470 1575538 1548421 1520544
53261 1520544 1491936 1462743 1433537 1404715 1375909 1346496 1316546 1286832 1257968 1229891 1202192
53250 1202192 1174551 1146778 1118784 1090803 1063437 1037201 1011966 986978 961572 935877 910811
53239 910811 887327 865662 845437 826426 809000 793600 779980 767321 755154 743854 734019 725575
53227 725575 717789 710089 702464 694899 686728 676969 665267 652190 638530 624610 610431 596141 582024
$$ packed form
53309A169484K93J436K188K902L881N400P478R739J1765J3436J4844J6095J7430
53296A276371J9228K1545K3842K5535K6701K7916K9375L0595L0959L0345K9050
53285A571462K7367K5438K3400K1443J9555J7346J4399J0825P263M098R84k508
53273A741072o059q904j0973j3028j5570j8202k0397k2279k4190k5932k7117k7877
53261A520544k8608k9193k9206k8822k8806k9413k9950k9714k8864k8077k7699
53250A202192k7641k7773k7994k7981k7366k6236k5235k4988k5406k5695k5066
53239I10811k3484k1665k0225j9011j7426j5400j3620j2659j2167j1300r835q444
53227G25575p786p700p625p565q171r759j1702j3077j3660j3920j4179j4290j4117
$$ plain form
53214 582024 568127 554278 540534 527360 515294 504567 495085 486544 478528 470707 463042 455720 448839
53201 448839 442252 435660 428712 420993 412254 402857 393860 386347 380569 375826 371198 366329 361427 356712
53187 356712 352130 347705 343821 340740 337978 334736 331045 327965 326254 325372 324302 322955 322011 321631 321173
53172 321173 320219 319132 318385 318013 317935 318143 318244 317487 315780 314189 313803 314470 315186 315423 315491 315806 316444 317307
53154 317307 318159 318459 317670 315851 313622 311508 309684 308296 307526 307177 306578 305170 303062 300874 299112 297822
53138 297822 296759 295798 295158 295116 295535 295913 296038 296340 297374 299103 300916 302134 302290 301194 299200 297229
53122 297229 296067 295690 295672 296058 297226 298897 300034 300006 299361 299098 299567 300414 301221 301668 301338 299907 297658
53105 297658 295471 294134 293754 293743 293274 291810 289447 286767 284267 281970 279678 277517 275937 275171 274956 274940
$$ packed form
53214E82024j3897j3849j3744j3174j2066j0727r482q541q016p821p665p322o881
53201D48839o587o592o948p719q739r397q997p513n778m743m628m869m902m715
53187C56712m582m425l884l081k762l242l691l080j711q82j070j347r44l80m58
53172C21173r54j087p47l72p8K08J01p57j707j591l86O67P16K37O8L15O38Q63
53154C17307Q52L00p89j819k229k114j824j388p70l49n99j408k108k188j762j290
53138B97822j063r61o40m2M19L78J25L02J034J729J813J218J56j096j994j971
53122B97229j162l77j8L86J168J671J137k8o45k63M69Q47Q07M47l30j431k249
53105B97658k187j337l80j1m69j464k363k680k500k297k292k161j580p66k15j6
$$ plain form
53089 274940 275152 275819 276811 277591 277822 277743 277753 277820 277571 276847 275842 274743 273592 272649 272459 273235 274374 274913
53071 274913 274468 273522 272842 272791 273185 273671 274189 275064 276622 278746 280941 282821 284308 285375 285917 286041 286198
53054 286198 286749 287557 288198 288426 288318 288185 288425 289190 290053 290375 290142 290033 290374 290542 289792 288231 286460 284668
53036 284668 282754 280952 279639 278646 277536 276452 275929 275882 275541 274567 273573 273326 273984 275268 276794 278034
53020 278034 278541 278462 278386 278525 278525 278197 277829 277553 277076 276377 276044 276474 277238 277752 278187 279194 280993 283141 284957
53001 284957 285847 285586 284688 284196 284654 285480 285691 285024 283995 283161 282780 282937 283528 284106 284174 283665 282992 282717 283253
52982 283253 284668 286571 288423 290076 291726 293306 294415 295038 295771 296966 298246 299336 300780 303135 305882
52967 305882 307920 308871 309160 309090 308717 308520 309247 310908 312667 313958 315090 316480 317898 318808 318976 318389 316943
$$ packed form
53089B74940K12O67R92P80K31p9J0O7k49p24j005j099j151r43j90P76J139N39
53071B74913m45r46o80n1L94M86N18Q75J558K124K195J880J487J067N42J24J57
53054B86198N51Q08O41K28j08j33K40P65Q63L22k33j09L41J68p50j561j771j792
53036B84668j914j802j313r93j110j084n23m7l41r74r94k47O58J284J526J240
53020B78034N07p9p6J39%l28l68k76m77o99l33M30P64N14M35J007J799K148J816
53001B84957Q90k61q98m92M58Q26K11o67j029q34l81J57N91N78O8n09o73k75N36
52982B83253J415J903J852J653J650J580J109O23P33J195J280J090J444K355K747
52967C05882K038R51K89p0l73j97P27J661J759J291J132J390J418R10J68n87j446
$$ plain form
52950 316943 314619 311813 309223 307393 306329 305409 303793 301259 298595 296845 296175 295828 295093 293873 292384
52935 292384 290876 289760 289411 289591 289535 288851 287938 287296 286871 286368 285779 285238 284706 284174 283885 283973 284171 284214 284299
52916 284299 284723 285307 285655 285858 286436 287583 288893 289853 290226 289907 288864 287443 286375 286114 286310 286208 285534
52899 285534 284738 284366 284392 284289 283653 282632 281758 281455 281670 281884 281507 280451 279413 279437 280962 283246 284868
52882 284868 284919 283708 282324 281532 281106 280300 278935 277838 277965 279211 280468 280944 280983 281362 282237 283250 284301
52865 284301 285568 286881 287826 288564 289942 292492 295814 299187 302303 305035 306966 307750 307720 307545 307306 306331
52849 306331 303998 300409 296262 292376 289345 287238 285483 283314 280521 277575 275017 273021 271723 271505
52835 271505 272411 273502 273432 271894 270036 269183 269479 270170 270836 271755 273106 274544 275811 277232 279117 280975
$$ packed form
52950C16943k324k806k590j830j064r20j616k534k664j750o70l47p35j220j489
52935B92384j508j116l49J80n6o84r13o42m25n03n89n41n32n32k89Q8J98M3Q5
52916B84299M24N84L48K03N78J147J310R60L73l19j043j421j068k61J96j02o74
52899B85534p96l72K6j03o36j021q74l03K15K14l77j056j038K4J525K284J622
52882B84868N1j211j384p92m26q06j365j097J27J246J257M76L9L79Q75J013J051
52865B84301J267J313R45P38J378K550L322L373L116K732J931P84l0j75k39r75
52849C06331k333l589m147l886l031k107j755k169k793k946k558j996j298k18
52835B71505R06J091p0j538j858q53K96O91O66R19J351J438J267J421J885J858
$$ plain form
52819 280975 281835 281363 280329 279854 280324 281032 280778 278960 276220 273930 272981 273248 274270 275992 278467 281251
52803 281251 283682 285588 287143 288099 287844 286335 284348 282579 280997 279274 277324 275123 272498 269611 267249
52788 267249 266117 265972 265895 265298 264352 263594 263507 264307 265680 266801 267054 266743 266678 267108 267510 267524 267482 267777 268191
52769 268191 268371 268659 269789 271754 273488 273927 273075 271776 270695 269907 269308 268993 269043 269299 269622 270202 271328
52752 271328 272881 274317 275148 275333 275168 275016 275164 275771 276826 278174 279595 280857 281829 282705 283963 285820
52736 285820 287742 288836 288801 288246 287886 287760 287541 287400 288113 290157 292961 295294 296424 296786 297420 298785 300242
52719 300242 300830 300409 299820 299879 300434 300584 299679 297929 296028 294399 292921 291336 289784 288784 288724 289471 290481
52702 290481 291127 290965 289976 288761 288189 288530 289053 288837 287851 286860 286270 285614 284357 282803 281892 282277 283847
$$ packed form
52819B80975Q60m72j034m75M70P08k54j818k740k290r49K67J022J722K475K784
52803B81251K431J906J555R56k55j509j987j769j582j723j950k201k625k887k362
52788B67249j132j45p7n97r46p58q7Q00J373J121K53l11o5M30M02J4m2K95M14
52769B68191J80K88J130J965J734M39q52j299j081p88n99l15N0K56L23N80J126
52752B71328J553J436Q31J85j65j52J48O07J055J348J421J262R72Q76J258J857
52736B85820J922J094l5n55l60j26k19j41P13K044K804K333J130L62O34J365J457
52719C00242N88m21n89N9N55J50r05j750j901j629j478j585j552j000o0P47J010
52702B90481O46j62r89j215n72L41N23k16r86r91n90o56j257j554r11L85J570
$$ plain form
52685 283847 285938 287832 289157 290003 290640 291135 291415 291698 292468 293895 295548 296940 298127 299494 301131 302744
52669 302744 304084 305151 305958 306325 305961 304708 302776 300839 299685 299519 299640 299096 297692 296226 295654 296152
52653 296152 297029 297516 297631 298278 300423 304138 308412 311866 313576 313338 311483 308653 305633 303208 301993
52638 301993 302176 303187 303799 303083 301429 300275 300553 301695 302476 302528 302700 304137 307431 312476 318535 324294
52622 324294 328327 329860 329066 326607 323118 319194 315511 312553 310208 307890 305191 302355 300023 298532
52608 298532 297626 296915 296423 296480 297141 298039 298846 299632 300601 301690 302607 303140 303268 303121 303013 303346 304265 305472
52590 305472 306577 307578 308772 310265 311770 312920 313605 313912 313872 313428 312688 312121 312289 313265 314477 315328 315779
52573 315779 315999 315645 314126 311643 309454 308697 309355 310652 312044 313395 314504 315015 314718 313601 311737 309451
$$ packed form
52685B83847K091J894J325Q46O37M95K80K83P70J427J653J392J187J367J637J613
52669C02744J340J067Q07L67l64j253j932j937j154j66J21n44j404j466n72M98
52653B96152Q77M87J15O47K145L715M274L454J710k38j855k830l020k425j215
52638C01993J83J011O12p16j654j154K78J142P81N2J72J437L294N045O059N759
52622C24294M033J533p94k459l489l924l683k958k345k318k699k836k332j491
52608B98532r06p11m92N7O61Q98Q07P86R69J089R17N33J28j47j08L33R19J207
52590C05472J105J001J194J493J505J150O85L07m0m44p40n67J68R76J212Q51M51
52573C15779K20l54j519k483k189p57O58J297J392J351J109N11k97j117j864k286
$$ plain form
52557 309451 307411 306150 305592 305324 305119 304919 304606 304302 304594 305830 307314 307894 307357 306615 306429 306648 306878
52540 306878 307197 307801 308440 308716 308625 308356 307820 306809 305488 304369 303800 303736 303963 304386 305084 306140 307336 308053
52522 308053 307732 306522 305261 304676 304840 305501 306613 308201 309937 311287 312082 312760 314043 316488 320274 325146
52506 325146 330522 335739 340210 343343 344538 343562 340940 337768 334964 332673 330415 327730 324653 321554
52492 321554 318625 315720 312801 310320 308876 308482 308481 308294 308002 308038 308526 309204 309872 310621 311576 312687 313896
52475 313896 315373 317379 319878 322422 324520 326047 327211 328199 329053 329920 331212 333350 336433 340191 344108
52460 344108 347530 349943 351380 352370 353197 353395 352272 349801 346559 342911 338815 334529 330937 328756 327631
52445 327631 326401 324223 321244 318236 315747 313727 311987 310839 310937 312316 313950 314717 314600 314419 314466 314197
$$ packed form
52557C09451k040j261n58k68k05k00l13l04K92J236J484N80n37p42j86K19K30
52540C06878L19O04O39K76r1k69n36j011j321j119n69o4K27M23O98J056J196P17
52522C08053l21j210j261n85J64O61J112J588J736J350P95O78J283K445L786M872
52506C25146N376N217M471L133J195r76k622l172k804k291k258k685l077l099
52492C21554k929k905k919k481j444l94jj87k92L6M88O78O68P49R55J111J209
52475C13896J477K006K499K544K098J527J164R88Q54Q67J292K138L083L758L917
52460C44108L422K413J437R90Q27J98j123k471l242l648m096m286l592k181j125
52445C27631j230k178k979l008k489k020j740j148R8J379J634P67j17j81M7k69
$$ plain form
52429 314197 313365 312722 313078 314157 314912 314699 313655 312222 310843 310003 309953 310322 310408 309947 309367 309302 310122 311926
52411 311926 314607 317849 321328 325048 329304 334335 340247 347355 356286 367534 380927 395538 409863
52398 409863 422043 430243 433269 431050 424568 415379 405126 395165 386238 378368 371240 364807 359445 355441
52384 355441 352481 349927 347560 345781 344968 344976 345461 346399 347922 349855 351883 354130 357071 360833 365057 369599
52368 369599 374852 381018 387413 392882 396748 399118 400515 401469 402241 402570 401866 399970 397544 395439 393875
52353 393875 392656 391923 392126 393241 394585 395587 396330 397144 398062 398993 400208 402288 405574 409818 414394 418808
52337 418808 423010 427256 431716 436388 441466 447581 455391 464954 475713 487053 498731 510892 524030
52324 524030 538852 555730 574116 592803 610954 628713 646730 665389 684609 704015 722985
$$ packed form
52429C14197q32o43L56J079P55k13j044j433j379q40n0L69Q6m61n80o5Q20J804
52411C11926K681L242L479L720M256N031N912P108Q931J1248J3393J4611J4325
52398D09863J2180Q200L026k219o482r189j0253r961q927p870p128o433n362m004
52384C55441k960k554k367j779q13QM85R38J523J933K028K247K941L762M224M542
52368C69599N253O166O395N469L866K370J397R54P72L29p04j896k426k105j564
52353C93875j219p33K03J115J344J002P43Q14R18R31J215K080L286M244M576M414
52337D18808M202M246M460M672N078O115P810R563J0759J1340J1678J2161J3138
52324E24030J4822J6878J8386J8687J8151J7759J8017J8659J9220J9406J8970
$$ plain form
52313 722985 740903 757824 774806 793077 812825 833103 852965 872326 891601 910931 930100
52302 930100 948945 967377 985080 1001669 1017298 1032695 1048245 1063240 1076394 1086896 1094570 1099156
52290 1099156 1100153 1097674 1092904 1087174 1080792 1073290 1064614 1055516 1046710 1038183 1029639 1021247 1013655 1007386
52276 1007386 1002510 998849 996371 995341 996132 998790 1002818 1007551 1012789 1018968 1026773 1036720 1049008 1063332
52262 1063332 1078708 1093960 1108647 1123301 1138463 1153845 1168835 1183542 1198767 1214970 1231844
52251 1231844 1248898 1265797 1281861 1295817 1306655 1314526 1320264 1324104 1325325 1323195 1317921 1310557 1302244
52238 1302244 1293662 1284874 1275453 1264862 1252949 1240129 1227060 1214181 1201567 1189067 1176502 1163818
52226 1163818 1151131 1138621 1126430 1114770 1104064 1094663 1086402 1078754 1071639 1065766 1061854 1059754 1058788
$$ packed form
52313G22985J7918J6921J6982J8271J9748K0278J9862J9361J9275J9330J9169
52302I30100J8845J8432J7703J6589J5629J5397J5550J4995J3154J0502P674M586
52290A099156R97k479m770n730o382p502q676r098q806q527q544q392p592o269
52276A007386m876l661k478j030P91K658M028M733N238O179P805R947J2288J4324
52262A063332J5376J5252J4687J4654J5162J5382J4990J4707J5225J6203J6874
52251A231844J7054J6899J6064J3956J0838P871N738L840J221k130n274p364q313
52238A302244q582q788r421j0591j1913j2820j3069j2879j2614j2500j2565j2684
52226A163818j2687j2510j2191j1660j0706r401q261p648p115n873l912k100r66
$$ plain form
52213 1058788 1058779 1060209 1063259 1067211 1071115 1074788 1078835 1083785 1089408 1094843 1099264 1102530 1105285 1108359 1112051
52198 1112051 1116123 1120434 1125221 1130651 1136437 1142182 1147800 1153293 1158394 1162930 1167386 1172510 1178246 1183564
52184 1183564 1187563 1190329 1192299 1193116 1191663 1187255 1180465 1172597 1164612 1156650 1148347 1139359 1129670 1119739
52170 1119739 1110365 1102238 1095469 1089733 1084927 1081470 1079742 1079460 1079947 1081026 1083273 1087325 1093217 1100448
52156 1100448 1108232 1115506 1121103 1124472 1126125 1127047 1127723 1128053 1128007 1127893 1127996 1128427 1129417 1131276 1133870 1136547
52140 1136547 1138851 1140916 1142822 1143985 1143769 1142534 1141430 1141106 1141181 1141259 1141974 1144571 1149652 1156870 1165880 1177165
52124 1177165 1191723 1210079 1231868 1256265 1282633 1310690 1340226 1370897 1402375 1434579 1467459
52113 1467459 1500494 1532550 1562482 1589864 1614906 1637692 1657749 1674571 1688413 1700399 1711812
$$ packed form
52213A058788rJ430L050L952L904L673M047M950N623N435M421L266K755L074L692
52198A112051M072M311M787N430N786N745N618N493N101M536M456N124N736N318
52184A183564L999K766J970Q17j453m408o790p868p985p962q303q988r689r931
52170A119739r374q127o769n736m806l457j728k82M87J079K247M052N892P231
52156A100448P784P274N597L369J653R22O76L30m6j14J03M31R90J859K594K677
52140A136547K304K065J906J163k16j235j104l24P5P8P15K597N081P218R010J1285
52124A177165J4558J8356K1789K4397K6368K8057K9536L0671L1478L2204L2880
52113A467459L3035L2056K9932K7382K5042K2786K0057J6822J3842J1986J1413
$$ plain form
52102 1711812 1723323 1734748 1745429 1754879 1763165 1770624 1777242 1782536 1786230 1788787 1790861 1792197 1791344
52089 1791344 1786598 1777125 1763232 1745849 1725904 1704057 1680911 1657487 1635279 1615538 1598495 1583648
52077 1583648 1570900 1561012 1554639 1551205 1549158 1547368 1546082 1546600 1550285 1557793 1568919 1582831 1598416
$$ packed form
52102A711812J1511J1425J0681R450Q286P459O618N294L694K557K074J336q53
52089A791344m746r473j3893j7383j9945k1847k3146k3424k2208j9741j7043j4847
52077A583648j2748r888o373l434k047j790j286N18L685P508J1126J3912J5585
$$ [...]
##END NTUPLES=NMR SPECTRUM
##END=
