##TITLE=AC1579_ROEFFECT0024_8271261_KkX4UNjri4
##JCAMPDX= 6.0         $$ Bruker NMR JCAMP-DX V2.0
##DATA TYPE= NMR SPECTRUM
##DATA CLASS= NTUPLES
##ORIGIN= BRUKER
##OWNER= Administrator
$$ 1.72 TOPSPIN		Version 2.1
$$ 2014-08-04 16:15:32.287 -0700  Administrator@X
$$ Compression mode = diff/dup
##.OBSERVE FREQUENCY= 400.02188249412
##.OBSERVE NUCLEUS= ^1H
##.ACQUISITION MODE= SIMULTANEOUS (DQD)
##.ACQUISITION SCHEME= undefined
##.AVERAGES= 8
##.DIGITISER RES= 22
##SPECTROMETER/DATA SYSTEM= spect
##.PULSE SEQUENCE= zg30
##.SOLVENT NAME= COFFEE_meoh
##.SHIFT REFERENCE= INTERNAL, COFFEE_meoh, 1, 14.98509
##AUDIT TRAIL= $$ (NUMBER, WHEN, WHO, WHERE, PROCESS, VERSION, WHAT)
$$ ##TITLE= Audit trail, TOPSPIN		Version 2.1
$$ ##JCAMPDX= 5.01
$$ ##ORIGIN= Bruker BioSpin GmbH
$$ ##OWNER= Administrator
$$ $$ E:\/data/COFFEE/nmr/AC1579_ROEFFECT0024_8271261_KkX4UNjri4/20/pdata/1/auditp.txt
$$ ##AUDIT TRAIL=  $$ (NUMBER, WHEN, WHO, WHERE, PROCESS, VERSION, WHAT)
(   1,<2014-08-04 16:15:25.318 -0700>,<Administrator>,<X>,<go>,<TOPSPIN 2.1>,
      <created by zg
	started at 2014-08-04 16:14:18.577 -0700,
	POWCHK enabled, PULCHK disabled,
       configuration hash MD5:
       16 EA D6 F4 BB 67 03 14 9B FF E7 A0 43 5B 48 2E
       data hash MD5: 64K
       25 39 88 35 BE 54 4B 7A F6 5F 67 77 7D 15 37 59>)
(   2,<2014-08-04 16:15:28.381 -0700>,<Administrator>,<X>,<proc1d>,<TOPSPIN 2.1>,
      <Start of raw data processing
       efp LB = 0 FT_mod = 6 PKNL = 1 PHC0 = 0 PHC1 = 0 SI = 32K 
       data hash MD5: 32K
       D0 96 D7 DC DB C2 05 C7 BB 72 AE FC 9F 06 5C C8>)
(   3,<2014-08-04 16:15:28.677 -0700>,<Administrator>,<X>,<proc1d>,<TOPSPIN 2.1>,
      <pk PHC0 = 90.98877 PHC1 = 0 
       data hash MD5: 32K
       2E 44 7F CF D0 34 4D 27 CB 9E 2D E5 1A 3C 63 14>)
(   4,<2014-08-04 16:15:28.802 -0700>,<Administrator>,<X>,<proc1d>,<TOPSPIN 2.1>,
      <abs ABSG = 1 
       data hash MD5: 32K
       FA C3 DC FB E0 55 8F 58 A8 FC 09 F3 73 90 78 79>)
(   5,<2014-08-04 16:15:28.881 -0700>,<Administrator>,<X>,<proc1d>,<TOPSPIN 2.1>,
      <abs ABSG = 2 
       data hash MD5: 32K
       B9 3C 11 0D 01 69 6C B7 74 11 AB 73 55 32 F8 A9>)
(   6,<2014-08-04 16:15:28.959 -0700>,<Administrator>,<X>,<proc1d>,<TOPSPIN 2.1>,
      <abs ABSG = 3 
       data hash MD5: 32K
       14 04 B7 C5 C7 E0 C9 89 73 13 FD 12 07 99 B2 17>)
(   7,<2014-08-04 16:15:29.037 -0700>,<Administrator>,<X>,<proc1d>,<TOPSPIN 2.1>,
      <abs ABSG = 4 
       data hash MD5: 32K
       54 DC 11 A4 71 F1 E5 25 D2 E4 3A F5 E9 F6 67 3C>)
(   8,<2014-08-04 16:15:29.099 -0700>,<Administrator>,<X>,<proc1d>,<TOPSPIN 2.1>,
      <abs ABSG = 5 
       data hash MD5: 32K
       89 D5 84 11 9D 7C EF 23 BE E5 25 51 E0 36 BE 93>)
$$ ##END=
$$ 
$$ $$ hash MD5
$$ $$ 75 BE D1 C4 89 61 ED 6D 0B A7 94 76 AB ED 89 66
##$RELAX= 
##$RELAX= 
##$RELAX= 
##$RELAX= 
##$RELAX= 
##$RELAX= 
##$RELAX= 
$$ Bruker specific parameters
$$ --------------------------
##$DU= <E:\>
##$EXPNO= 20
$$ [...]
##$TP= (0..7)
150 150 150 150 150 150 150 150
##$TP07= 0
##$TPNAME0= <>
##$TPNAME1= <>
##$TPNAME2= <>
##$TPNAME3= <>
##$TPNAME4= <>
##$TPNAME5= <>
##$TPNAME6= <>
##$TPNAME7= <>
##$TPOAL= (0..7)
0.5 0.5 0.5 0.5 0.5 0.5 0.5 0.5
##$TPOFFS= (0..7)
0 0 0 0 0 0 0 0
##$TUNHIN= 0
##$TUNHOUT= 0
##$TUNXOUT= 0
##$USERA1= <user>
##$USERA2= <user>
##$USERA3= <user>
##$USERA4= <user>
##$USERA5= <user>
##$V9= 5
##$VALIST= <valist>
##$VCLIST= <CCCCCCCCCCCCCCC>
##$VD= 0
##$VDLIST= <DDDDDDDDDDDDDDD>
##$VPLIST= <PPPPPPPPPPPPPPP>
##$VTLIST= <TTTTTTTTTTTTTTT>
##$WBST= 1024
##$WBSW= 4
##$XGAIN= (0..3)
0 0 0 0
##$XL= 0
##$YL= 0
##$YMAX_a= 527126
##$YMIN_a= -453986
##$ZGOPTNS= <>
##$ZL1= 120
##$ZL2= 120
##$ZL3= 120
##$ZL4= 120
##$ABSF1= 14.98509
##$ABSF2= -5.573092
##$ABSG= 5
##$ABSL= 3
##$ALPHA= 0
##$AQORDER= 0
##$ASSFAC= 0
##$ASSFACI= 0
##$ASSFACX= 0
##$ASSWID= 0
##$AUNMP= <proc_prof1d_extract_pilot.lims>
##$AXLEFT= 0
##$AXNAME= <>
##$AXNUC= <1H>
##$AXRIGHT= 0
##$AXTYPE= 0
##$AXUNIT= <>
##$AZFE= 0.1
##$AZFW= 0.1
##$BCFW= 0
##$BC_mod= 0
##$BYTORDP= 0
##$COROFFS= 0
##$CY= 15
##$DATMOD= 1
##$DC= 0
##$DFILT= <>
##$DTYPP= 0
##$F1P= 0
##$F2P= 0
##$FCOR= 0.5
##$FTSIZE= 32768
##$FT_mod= 6
##$GAMMA= 0
##$GB= 0
##$INTBC= 1
##$INTSCL= 1
##$ISEN= 128
##$LB= 0
##$LEV0= 0
##$LPBIN= 0
##$MAXI= 10000
##$MC2= 0
##$MEAN= 0
##$ME_mod= 0
##$MI= 0
##$NCOEF= 0
##$NC_proc= -8
##$NLEV= 6
##$NOISF1= 0
##$NOISF2= 0
##$NSP= 0
##$NTH_PI= 0
##$NZP= 0
##$OFFSET= 14.98509
##$PC= 1
##$PHC0= 90.98877
##$PHC1= 0
##$PH_mod= 1
##$PKNL= yes
##$PPARMOD= 0
##$PPDIAG= 0
##$PPIPTYP= 0
##$PPMPNUM= 2147483647
##$PPRESOL= 1
##$PSCAL= 4
##$PSIGN= 0
##$PYNMP= <proc.py>
##$REVERSE= no
##$SF= 400.02
##$SI= 32768
##$SIGF1= 0
##$SIGF2= 0
##$SINO= 400
##$SIOLD= 32768
##$SPECTYP= <>
##$SREGLST= <1H.CDCl3>
##$SSB= 0
##$STSI= 32768
##$STSR= 0
##$SW_p= 8223.68421052631
##$SYMM= 0
##$S_DEV= 0
##$TDeff= 65536
##$TDoff= 0
##$TI= <>
##$TILT= no
##$TM1= 0
##$TM2= 0
##$TOPLEV= 0
##$USERP1= <user>
##$USERP2= <user>
##$USERP3= <user>
##$USERP4= <user>
##$USERP5= <user>
##$WDW= 1
##$XDIM= 32768
##$YMAX_p= 385948784
##$YMIN_p= -848340
##$CURPLOT= <Network HP LaserJet P1505>
##$CURPRIN= <$Network HP LaserJet P1505>
##$DFORMAT= <normdp>
##$LAYOUT= <+/1D_H.xwp>
##$LFORMAT= <normlp>
##$PFORMAT= <normpl>
##$SURQMSG= 1
$$ End of Bruker specific parameters
$$ ---------------------------------
##NTUPLES= NMR SPECTRUM
##VAR_NAME=  FREQUENCY,     SPECTRUM/REAL,   SPECTRUM/IMAG
##SYMBOL=    X,             R,               I
##VAR_TYPE=  INDEPENDENT,   DEPENDENT,       DEPENDENT
##VAR_FORM=  AFFN,          ASDF,            ASDF
##VAR_DIM=   32768,         32768,           32768
##UNITS=     HZ,            ARBITRARY UNITS, ARBITRARY UNITS
##FACTOR=    0.250966925370066, 1,           1
##FIRST=     8223.43324360094, -268268,      -43172
##LAST=      0,             18976,           15891
##MIN=       0,             -848340,         0
##MAX=       8223.43324360094, 385948784,    0
$$ Real data points
##PAGE= N=1
##DATA TABLE= (X++(R..R)), XYDATA
$$ [...]
19532I5016G960J25975n1335d78304a00309C3058j4247a53598L7799A283h0952
$$ 95016 7960 133935 82600 -478304 -100309 33058 18811 -153598 -115799 1283 -80952
19520G3924c5135j43765H685K8094h6273k0477h933o6180k28752i3713C8077b16145
$$ 73924 -35135 -178900 8685 36779 -86273 -106750 -8933 -75113 -303865 -93713 38077 -216145
19507b21203A34203d1886k04036C45765c07001e4570k98395j22500A42539d1992
$$ -221203 134203 -41886 -245922 345765 -307001 -54570 -352965 -475465 142539 -41992
19496H5520Q0719d8383j01542o8722h9066L4161p1934A48604n8985e0243j06326
$$ 85520 166239 -48383 -149925 -218647 -89066 -54905 -126839 148604 89619 -50243 -156569
19485a56569j2224A32604k3593d10450f5898G1032d0254j44395r3064O4388g6718
$$ -156569 -168793 132604 109011 -410450 -65898 71032 -40254 -184649 -277713 -213325 -76718
19473e9014q9172I4899l2743b61476J17402j08594b2708p1326E9490c0008i073
$$ -59014 -148186 94899 62156 -261476 -144074 -252668 -22708 -94034 59490 -30008 -9073
19461C04306a2853A12505E0541b38665a19134A60776A3781d3551A76652a06439
$$ 304306 -12853 112505 50541 -238665 -119134 160776 13781 -43551 176652 -106439
19450F4644R031a34990j372b2817A40304f7894D3233c3029n1908A1227M18180
$$ 64644 73675 -134990 -136362 -22817 140304 -67894 43233 -33029 -84937 11227 429407
19439D29407A22825n4780K05256j08918i1475k8819A1625h8326A5438c33077g5261
$$ 429407 122825 68045 273301 164383 -91475 -120294 11625 -88326 15438 -333077 -75261
19427D5669g4005k1298D717e5490j46882K6985A92551i8995A04978R4181k9208
$$ 45669 -74005 -95303 4717 -55490 -202372 -175387 192551 -98995 104978 199159 169951
19416A69951a13785j4918M0673I0540b49072i2121L9153H2604b78553a34653A54888
$$ 169951 -113785 -128703 -88030 90540 -249072 -92121 -52968 82604 -278553 -134653 154888
19404a62237E210J7696F022i6401j93456g2150j30811C5180J33813i962j32136
$$ -162237 5210 22906 6022 -96401 -289857 -72150 -202961 35180 168993 -9962 -142098
19393a42098f3722j78415a0956p1922c5137A28577b66573A09089a09368j09454
$$ -142098 -63722 -242137 -10956 -82878 -35137 128577 -266573 109089 -109368 -218822
19383b18822P4996j47221K4062M0838O3615g8421k3454j38034H8329L1880B5737
$$ -218822 -143826 -291047 -266985 -226147 -162532 -78421 -101875 -239909 88329 120209 25737
19371f8703j53314A80724a518G6477a38849G874a03611j16216F5496K0028i3022
$$ -68703 -222017 180724 -1518 76477 -138849 7874 -103611 -219827 65496 85524 -93022
19359B53277g1508l4031k95223a60189L9444A05287l0845b64700J14923g1586
$$ 253277 -71508 -105539 -400762 -160189 -120745 105287 74442 -264700 -149777 -71586
19348B79627a08222C5727c36252G7883e9442q2442a6747r6562A08279b54897H4913
$$ 279627 -108222 35727 -336252 77883 -59442 -141884 -16747 -113309 108279 -254897 84913
19336A123R0514a55129j09626J08999B11842M2499l2216c10066A22104f0747a7504
$$ 1123 91637 -155129 -264755 -155756 211842 254341 222125 -310066 122104 -60747 -17504
19324A00430a42455q9529A89849F7797K17002e89975a80846k8434f7334n4713
$$ 100430 -142455 -231984 189849 67797 284799 -589975 -180846 -209280 -67334 -122047
19314a22047B6300a50855C3958J7370J38497b222j65173k5533O8890C86394a64026
$$ -122047 26300 -150855 33958 51328 189825 -2222 -167395 -192928 -124038 386394 -164026
19302g116k31158C6254d6716j02816j96435A8986i7991B5647a45048G648d5817
$$ -7116 -238274 36254 -46716 -149532 -345967 18986 -97991 25647 -145048 7648 -45817
19290C7036R5855a34294j52330J14481c2904k4953D875e2703r3953m8466c6536
$$ 37036 132891 -134294 -286624 -172143 -32904 -57857 4875 -52703 -146656 -195122 -36536
19278b07274b0930l17055a30784I981b24808k7013e6375b6723q0354M4494B4491
$$ -207274 -20930 -337985 -130784 9981 -224808 -251821 -56375 -26723 -107077 -62583 24491
19266f7612r2081f3541A87146N8147c19377a36574d8369E4978c33643G9973b36297
$$ -67612 -159693 -63541 187146 245293 -319377 -136574 -48369 54978 -333643 79973 -236297
19254h7308J7375A54438a1875m04537J71913B36684c93568A23121k2587b5696
$$ -87308 -69933 154438 -11875 -416412 -244499 236684 -393568 123121 100534 -25696
19243C5127b89006d9396J6305r1122f0313m06942G7179J26789B5713e6909C12538
$$ 35127 -289006 -49396 -33091 -124213 -60313 -467255 77179 203968 25713 -56909 312538
19231a39828L4420C208g7919I9071K0350B0816K09012b54190M8647c8682B32999
$$ -139828 -105408 3208 -77919 99071 119421 20816 229828 -254190 -205543 -38682 232999
19219B0069a90438i1775k2557J1417A12351h9733p9747B00144D6499a60406O2473
$$ 20069 -190438 -91775 -114332 -102915 112351 -89733 -169480 200144 46499 -160406 -97933
19208i7933m2602d2003O195C58467b6235I0838a16249A39928a90342g188B16582
$$ -97933 -140535 -42003 -35808 358467 -26235 90838 -116249 139928 -190342 -7188 216582
19196f7725D4588J13156a31760A0027Q4066f2627a5758I2332B5662d45684B2528
$$ -67725 44588 157744 -131760 10027 94093 -62627 -15758 92332 25662 -445684 22528
19184c25456k441J18049B60137B6638P4271b1067j83113A60805p0498G144c6923
$$ -325456 -327897 -209848 260137 26638 100909 -21067 -204180 160805 90307 7144 -36923
19172g7888G4301L2156a18750J9574C4968K46548b66460A18711m0480c81270B4204
$$ -77888 74301 106457 -118750 -99176 34968 281516 -266460 118711 78231 -381270 24204
19160a49053q3182A28941f2921k1979G4134a70933m4874E91274c95398a38398
$$ -149053 -232235 128941 -62921 -84900 74134 -170933 -215807 591274 -395398 -138398
19149b31932A2751J3315h5499K7547j54361J03296F1058d38020A09939i1163H3612
$$ -231932 12751 26066 -85499 -57952 -212313 -109017 61058 -438020 109939 -91163 83612
19137f9843j8267K254j29768E6543g0295A23896a00107K0662j468q4695k10172
$$ -69843 -88110 -85856 -215624 56543 -70295 123896 -100107 -79445 -80913 -165608 -375780
19126c75780B62999A5155c7831I2504c14289a5981j79771q5971l603I1336B451
$$ -375780 262999 15155 -37831 92504 -314289 -15981 -195752 -281723 -285326 91336 2451
19114b2319D714b48728m7117a07158J0926j81236i5638l89161i476D8122Q0676
$$ -22319 4714 -248728 -295845 -107158 -96232 -277468 -95638 -484799 -9476 48122 128798
19103A28798m5302b9457l36569a5606j32273j91506b9208H2585d4314k68495J27177
$$ 128798 83496 -29457 -366026 -15606 -147879 -339385 -29208 82585 -44314 -312809 -185632
19092a85632a3705j19436I8413k9688b9891j74895f3332k14304D1889J67663f5814
$$ -185632 -13705 -133141 98413 68725 -29891 -204786 -63332 -277636 41889 209552 -65814
19080a9420m0371H615a0468n2120l3412C7566d82739A25166c42223d3757A25173
$$ -19420 -59791 8615 -10468 -62588 -96000 37566 -482739 125166 -342223 -43757 125173
19068i8031A90271h4297k1959B63240A18116a23286B14144a31506a3061n7986
$$ -98031 190271 -84297 -106256 263240 118116 -123286 214144 -131506 -13061 -71047
19058g1047e288j44633B5877a73625a4290D6787J32352a85706L0567N6240M7282
$$ -71047 -5288 -149921 25877 -173625 -14290 46787 179139 -185706 -155139 -98899 -51617
19047e1617A7335a32698c9797A13773a15493o3899A7038a88731f1153k63432j53524
$$ -51617 17335 -132698 -39797 113773 -115493 -179392 17038 -188731 -61153 -324585 -478109
19036d78109C5107a68654j90148A04594a14554C1422a37350K8644A86030p1325
$$ -478109 35107 -168654 -358802 104594 -114554 31422 -137350 -108706 186030 114705
19026A14705j4679f4130A36005J23257r9413o3558K06947p5789h9053k20126m7401
$$ 114705 100026 -64130 136005 259262 159849 96291 303238 227449 -89053 -309179 -356580
19015c56580a16962I537c48447a29857m20725A17825b64342N1298B21837H9780
$$ -356580 -116962 9537 -348447 -129857 -550582 117825 -264342 -213044 221837 89780
19004c2399n37977C2175J27855E9722K1072l5155m424a04561c9293E975a28955
$$ -32399 -570376 32175 160030 59722 80794 45639 41215 -104561 -39293 5975 -128955
18992i1855B13401f9551j87905d8022m7849C47704a58977k02207J17394c3949
$$ -91855 213401 -69551 -257456 -48022 -95871 347704 -158977 -361184 -243790 -33949
18981g7397A97082A1559i3269A11775C1119K6296g1499I1261j3227b69585a5117
$$ -77397 197082 11559 -93269 111775 31119 57415 -71499 91261 78034 -269585 -15117
18969a9951B3606b74694b327l33998i3109k74702E5529i672p2661A78525b4108
$$ -19951 23606 -274694 -2327 -336325 -93109 -367811 55529 -9672 -82333 178525 -24108
18957d73586J90056n3242f2535j41779G4851l332B399a59031a6769F18502A45910
$$ -473586 -283530 -336772 -62535 -204314 74851 71519 2399 -159031 -16769 618502 145910
18945C92663a05910A19683b00132K3612Q5712B77380r2936C4770J86627e6181
$$ 392663 -105910 119683 -200132 -176520 -90808 277380 184444 34770 221397 -56181
18934A4236O5743d9707b1864A49470c20281l1435G6231c19141A26575h7486F0291
$$ 14236 79979 -49707 -21864 149470 -320281 -351716 76231 -319141 126575 -87486 60291
18922b89325j59601e5911k39285h0031n6407j71212j24935i6014B06736a3807
$$ -289325 -448926 -55911 -295196 -80031 -136438 -307650 -432585 -96014 206736 -13807
18911C5021b93432b7184j06176A46187J39487i6834A45519N5871b44622A29410
$$ 35021 -293432 -27184 -133360 146187 285674 -96834 145519 201390 -244622 129410
18900H6718L6633d9604k02911A61454e8865j34641B3226J997a22557c9143A29488
$$ 86718 123351 -49604 -252515 161454 -58865 -193506 23226 25223 -122557 -39143 129488
18888A6687J76174a96934K3400d5118a8911K782A17458e9412j761A84059a1076
$$ 16687 192861 -196934 -173534 -45118 -18911 -16129 117458 -59412 -61173 184059 -11076
18876B18639a52206n5475A25882d03200A04706C0603a20402e6122H8737a07772
$$ 218639 -152206 -207681 125882 -403200 104706 30603 -120402 -56122 88737 -107772
18865a54729C03502b3773j4704A13129e9496A13185N8029D3637f8960j04351h451
$$ -154729 303502 -23773 -38477 113129 -59496 113185 171214 43637 -68960 -173311 -8451
18853B08545b71031C9981N0583c74475A38846a14542C7382h4601K06B5745b73811
$$ 208545 -271031 39981 90564 -374475 138846 -114542 37382 -84601 -84395 25745 -273811
18841E7399b99159A28731c681j55181H4430l3122k4582h4257k51467j12685B53102
$$ 57399 -299159 128731 -3681 -158862 84430 51308 26726 -84257 -335724 -448409 253102
18829d98903g9501C10339f347j0482l2292A20916f0046I0705b65947a1792A66984
$$ -498903 -79501 310339 -6347 -16829 -49121 120916 -60046 90705 -265947 -11792 166984
18817A82174b11265j62099C5581c01578C6221a13861j66888c2048j7210k01273
$$ 182174 -211265 -373364 35581 -301578 36221 -113861 -280749 -32048 -49258 -250531
18807b50531k9774m4679J15616n4486A36213c9395a4460C8267b11868J950k27973
$$ -250531 -280305 -324984 -209368 -263854 136213 -39395 -14460 38267 -211868 -209918 -437891
18796d37891D6767a77261g895k17540e4779A51453f0047j74239P1091M0905o4098
$$ -437891 46767 -177261 -7895 -225435 -54779 151453 -60047 -234286 -163195 -122290 -186388
18785a86388B92215J19320E8615a03277A01299b5144A84388b28340i408j3360
$$ -186388 292215 411535 58615 -103277 101299 -25144 184388 -228340 -9408 -22768
18775b2768C19264j25811f0994G8117c90131Q5091e4511A8935K77110E8871c09666
$$ -22768 319264 193453 -60994 78117 -390131 -305040 -54511 18935 296045 58871 -309666
18763b705j88803j6190L8268A38139C2988b66051g0042j35726B92546c1021j35389
$$ -2705 -191508 -207698 -169430 138139 32988 -266051 -70042 -205768 292546 -31021 -166410
18752a66410A73449n3230j5093d9336F1430P4129a19632k62024J61225n4682D538
$$ -166410 173449 120219 105126 -49336 61430 135559 -119632 -381656 -220431 -275113 4538
18740B03159d0596B4007a91143j32466B1476Q7427D4554a51197j59356i992j36455
$$ 203159 -40596 24007 -191143 -323609 21476 108903 44554 -151197 -310553 -9992 -146447
18729a46447H1809K67405A33270b27616A6483M1941J93687A15895a86859B03383
$$ -146447 81809 349214 133270 -227616 16483 58424 252111 115895 -186859 203383
18718B82505E7840a58549L1566j16219D8535a41629I1235g7386j45932J8285e6693
$$ 282505 57840 -158549 -126983 -243202 48535 -141629 91235 -77386 -223318 -205033 -56693
18706B31449a35960j14015P3669E3432J24522A0946c002l73370B98843b52710
$$ 231449 -135960 -249975 -176306 53432 177954 10946 -3002 -376372 298843 -252710
18695b97432R7249B39454c56125N4241R0887a05443K8919j3072j09743g7733r8385
$$ -297432 -200183 239454 -356125 -301884 -210997 -105443 -76524 -89596 -199339 -77733 -176118
18684a76118P3228j7943A36661a3500j70716K7954A55701F3897K2896a15o9621
$$ -176118 -102890 -120833 136661 -13500 -184216 -156262 155701 63897 86793 -115 -69736
18673f9736q7017J1246e535r1760C9508J4979p310a85486A50792a837k04754a47
$$ -69736 -156753 -145507 -5535 -97295 39508 54487 47177 -185486 150792 -1837 -206591 -147
18660G4740b20014A22707M3074i2667k06962j46050H061J61355B977O3952b12053
$$ 74740 -220014 122707 165781 -92667 -299629 -445679 8061 169416 2977 66929 -212053
18648d2368E0956B3110c43544J06170f0372j6826l4779L0459b6690j86325Q6556
$$ -42368 50956 23110 -343544 -237374 -60372 -77198 -111977 -81518 -26690 -213015 -126459
18637a26459o8926d2284j65768A742b5373j16331A23953a9022A24160n1451b32837
$$ -126459 -195385 -42284 -208052 1742 -25373 -141704 123953 -19022 124160 72709 -232837
18625a6024B99721A3095R8865d01447d777j94625j16334A27258m6397a39445C7801
$$ -16024 299721 13095 111960 -401447 -4777 -199402 -315736 127258 80861 -139445 37801
18613f5619A17804D8015d20363J15661J07363k003H4265a71639q2976c1596j54900
$$ -65619 117804 48015 -420363 -304702 -197339 -199342 84265 -171639 -254615 -31596 -186496
18602a86496N9613K3342C15917c9639l0978j13115O5849A02258a27253k6516f3452
$$ -186496 -126883 -103541 315917 -39639 -70617 -183732 -117883 102258 -127253 -153769 -63452
18590a21479G2444a77720r6279a3280E0012d4552B12683D911b00220K2837b6125
$$ -121479 72444 -177720 -273999 -13280 50012 -44552 212683 4911 -200220 -177383 -26125
18578A13318J72218E8544a71320j42771K9038J27711P4182j49120B07853a29328
$$ 113318 285536 58544 -171320 -314091 -285053 -157342 -83160 -232280 207853 -129328
18567B14418b62645J28024A31994a10152F0020a84566P990p6678A93125c394j04868
$$ 214418 -262645 -134621 131994 -110152 60020 -184566 -176576 -253254 193125 -3394 -108262
18556a08262A61782O5930b72657F5828a8831A31654b19598F1030B3799J19835
$$ -108262 161782 227712 -272657 65828 -18831 131654 -219598 61030 23799 143634
18546A43634a86510r061l13578g1461k19995A45031h6029L9742J3256k06950H5669
$$ 143634 -186510 -195571 -509149 -71461 -291456 145031 -86029 -46287 -33031 -239981 85669
18534A86967q069A6640b05912G8758b20293A23479L538h0802j52258C2340O2341
$$ 186967 178898 16640 -205912 78758 -220293 123479 127017 -80802 -233060 32340 94681
18523I4681B311b1808d343j08395j57138A99891a0280l21872A00357m1717J1760
$$ 94681 2311 -21808 -4343 -112738 -269876 199891 -10280 -332152 100357 58640 70400
18512G0400A4896e3284n6512D4279K20894F4738A3008J16035b03954A09318C6008
$$ 70400 14896 -53284 -109796 44279 265173 64738 13008 129043 -203954 109318 36008
18500A1810J14229O4197b56587A55335K2266a07421N1926k27008A49995c62380
$$ 11810 126039 190236 -256587 155335 177601 -107421 -55495 -282503 149995 -362380
18489b35632d8718j39869h7468Q278C3227b48939i1743j91969J36030d7687A69625
$$ -235632 -48718 -188587 -87468 -79190 33227 -248939 -91743 -283712 -147682 -47687 169625
18477I5601b61951f8057B93947j12121b8048l6782q5556A7584J17964A9679O5330
$$ 95601 -261951 -68057 293947 181826 -28048 -64830 -150386 17584 135548 19679 85009
18466H5009c21542O2156e8221B7175L5207d12990B43020j11351a97893Q5809A83207
$$ 85009 -321542 -259386 -58221 27175 62382 -412990 243020 131669 -197893 -112084 183207
18454A71072e2544B72957c0839k5398A37474e2332I986a32936N4033j86869h3636
$$ 171072 -52544 272957 -30839 -56237 137474 -52332 9986 -132936 -78903 -265772 -83636
18442A15965c7896o10j10614j75427O6496g6177k54248G2779J18734C5729j6845
$$ 115965 -37896 -38506 -149120 -324547 -258051 -76177 -330425 72779 191513 35729 18884
18431A8884a10002q5384I448c27836J17307r9598e745k94926C364J62534l0837
$$ 18884 -110002 -195386 9448 -327836 -210529 -310127 -5745 -300671 3364 165898 135061
18420A35061Q8490a97907H5622b64446C5227J2679a80491D2643J39861p7639b0311
$$ 135061 223551 -197907 85622 -264446 35227 47906 -180491 42643 182504 104865 -20311
18408a40638i134l8037D9071a68839M2580C58645a07199j61060C36485H8325G739
$$ -140638 -9134 -47171 49071 -168839 -126259 358645 -107199 -268259 336485 88325 7739
18396b12660b5454j35919G638b4253k36391B86864A28763a40487L2206m2307l3978
$$ -212660 -25454 -161373 7638 -24253 -260644 286864 128763 -140487 -108281 -150588 -184566
18385a84566A39839f4759q9651E3820f8581p475A30220J6635O125a13866k30547
$$ -184566 139839 -64759 -154410 53820 -68581 -76056 130220 146855 152980 -113866 -344413
18374c44413H5803f5627k5490I7398B0031f458j83303F2643a19817c9504l17855
$$ -344413 85803 -65627 -91117 97398 20031 -6458 -189761 62643 -119817 -39504 -357359
18363c57359J69983B08865F8047a43829j3860H9352c84492b4103j67727D7603
$$ -357359 -187376 208865 68047 -143829 -157689 89352 -384492 -24103 -191830 47603
18352b128I554c21735a33538L0688B57938a60833G9963J1839a88873B02329P1723
$$ -2128 9554 -321735 -133538 -102850 257938 -160833 79963 91802 -188873 202329 274052
18341B74052b6157C4842J20187a13827B12430d30683C33264a15123N6946A92790
$$ 274052 -26157 34842 155029 -113827 212430 -430683 333264 -115123 -58177 192790
18330F8108C3731M819M1594j8647a01608H192M38327A51789m3932a03087B19494
$$ 68108 33731 38550 80144 61497 -101608 8192 446519 151789 107857 -103087 219494
18318c8621k29426p0246B8782h1753L2234J0393A03575a00637l3416m3625O0642
$$ -38621 -268047 -338293 28782 -81753 -49519 -39126 103575 -100637 -134053 -177678 -117036
18307a17036p6016j16350B90535j18175c22224a20775I4641i4301A74395q4707
$$ -117036 -193052 -309402 290535 172360 -322224 -120775 94641 -94301 174395 89688
18297H9688L13075b76421B8945a40375o0944e3855l32778d2225k85487A12602
$$ 89688 402763 -276421 28945 -140375 -201319 -53855 -386633 -42225 -327712 112602
18286a37917a0719A07839e97454D1739a11941k64504b4824j21350B62911b39249
$$ -137917 -10719 107839 -597454 41739 -111941 -376445 -24824 -146174 262911 -239249
18275I7169c05851b5057E2421b14142J05809B24721p1912b99463A79547n4153
$$ 97169 -305851 -25057 52421 -214142 -108333 224721 152809 -299463 179547 125394
18265A25394c79051B2373a91619A0745P8411K6520L0863d3365A42959b48451c1416
$$ 125394 -379051 22373 -191619 10745 89156 115676 146539 -43365 142959 -248451 -31416
18253a32192B14826a44719l9309M4468K0701k42642F1742p924f5455j39505B6258
$$ -132192 214826 -144719 -184028 -139560 -118859 -361501 61742 53818 -65455 -204960 26258
18241b6141l9165G8819g3715B26765a5115C7842b2077j55373B42816e4071B1539
$$ -26141 -65306 78819 -73715 226765 -15115 37842 -22077 -177450 242816 -54071 21539
18229a057A40953a35948A31419a49466j7573q4257A34897m6718C451g2551A33412
$$ -1057 140953 -135948 131419 -149466 -167039 -251296 134897 88179 3451 -72551 133412
18217A45211A7203i9005A51156c91750b6223j26798a2784B65906D5304a35483
$$ 145211 17203 -99005 151156 -391750 -26223 -153021 -12784 265906 45304 -135483
18206a48513G584a67094b4660R366j36918C16995E4207M5918b18721N3329Q1564
$$ -148513 7584 -167094 -24660 -15294 -152212 316995 54207 100125 -218721 -165392 -83828
18195h3828I2473g1766A76939B4743N3564a22624m7279j726d0970M11k35861Q7976
$$ -83828 92473 -71766 176939 24743 78307 -122624 -169903 -171629 -40970 -40559 -276420 -188444
18183a88444N6882a4392E6345K23014a28916l03092a91598D08064D7750b75340
$$ -188444 -131562 -14392 56345 279359 -128916 -432008 -191598 408064 47750 -275340
18172A09705C8977L9800j764i1209L1766B35795a7005k01241B13111b16342B10227
$$ 109705 38977 78777 77013 -91209 -59443 235795 -17005 -218246 213111 -216342 210227
18160a90405L3230L4827G0623a19871O222A92684D3734f3910l9991F2594j5376
$$ -190405 -157175 -122348 70623 -119871 -113649 192684 43734 -63910 -103901 62594 47218
18149D7218h3599k53970h5619B46876b18808a02525E0194J2053d3251A95829b41058
$$ 47218 -83599 -337569 -85619 246876 -218808 -102525 50194 62247 -43251 195829 -241058
18137d40292K19397F9338o14b25436g8458K0324n9055j48985k05554a51188C20635
$$ -440292 -220895 69338 68724 -225436 -78458 -58134 -117189 -266174 -471728 -151188 320635
18125f0509F6172b96830f2822j6090M690G1786O387a54332a9645A29856E7666
$$ -60509 66172 -296830 -62822 -78912 -74222 71786 78173 -154332 -19645 129856 57666
18113I9953a1145l0461F5930a62431k13880F7233b92770d849A21209C6062i4310
$$ 99953 -11145 -41606 65930 -162431 -376311 67233 -292770 -4849 121209 36062 -94310
18101a48613j61319B17187E3181a2415l06121A93331b64904j02257e1505A47785
$$ -148613 -309932 217187 53181 -12415 -318536 193331 -264904 -367161 -51505 147785
18090b69626b0589D9700m512f1439C58945b98009i6382j24375p5183c9094q9549
$$ -269626 -20589 49700 45188 -61439 358945 -298009 -96382 -220757 -295940 -39094 -128643
18079a28643p6469g3289L3150k97529A8246b5344B24177A3046a35341A10035c3894
$$ -128643 -205112 -73289 -40139 -337668 18246 -25344 224177 13046 -135341 110035 -33894
18067F1006a88671A01598J45609c4594q2682e0406a7908A38818b00320A75280
$$ 61006 -188671 101598 247207 -34594 -117276 -50406 -17908 138818 -200320 175280
18056A4254a71889j1309n8859G8823b93388J39413A48672m0551m9670a40685A88434
$$ 14254 -171889 -183198 -242057 78823 -293388 -153975 148672 108121 58451 -140685 188434
18044i9819C22406c8390r1249b7559A58894a47151P1503b7826j29272A50576c36844
$$ -99819 322406 -38390 -129639 -27559 158894 -147151 -75648 -27826 -157098 150576 -336844
18032a09291B62814b29988R0494O3283J6379a5300A62942e9563F0767c54326A28314
$$ -109291 262814 -229988 -139494 -76211 -59832 -15300 162942 -59563 60767 -354326 128314
18020a89089f2548K752B84834c11711J48283D0512f9475b3042E1961J39635G6772
$$ -189089 -62548 -59796 284834 -311711 -163428 40512 -69475 -23042 51961 191596 76772
18008b68904a4302j9926B21538d4849A01163a55124I592e6007I9241j4467K9524
$$ -268904 -14302 -34228 221538 -44849 101163 -155124 9592 -56007 99241 84774 114298
17997A14298a29366D46035a52560J2675B2632R9717l5262J42163d76714A09379
$$ 114298 -129366 446035 -152560 -139885 22632 122349 87087 229250 -476714 109379
17986e1449p3140A59169c34193G9976b78015K7038A86373h4217j76044P7017e2570
$$ -51449 -124589 159169 -334193 79976 -278015 -250977 186373 -84217 -260261 -183244 -52570
17974b5993n3745j37508f8661C0586K46797f0104l514A18993i1575G760a82432
$$ -25993 -79738 -217246 -68661 30586 277383 -60104 -63618 118993 -91575 7760 -182432
17962H823J7764a8024m2329l809k90485J20097h5617b6627F0969b5633n84292
$$ 8823 26587 -18024 -60353 -64162 -354647 -234550 -85617 -26627 60969 -25633 -609925
17951f09925A6841a22870a4264B25278c76267a39743A59963G8384M6271e9185
$$ -609925 16841 -122870 -14264 225278 -376267 -139743 159963 78384 124655 -59185
17940F8232a63705A02919b60669G2693a09811B7810b31571A99595a66266B49474
$$ 68232 -163705 102919 -260669 72693 -109811 27810 -231571 199595 -166266 249474
17929a79593f0017B1090f8959m669C5946J78948a14067k5788j41387A65977p0902
$$ -179593 -60017 21090 -68959 -73628 35946 214894 -114067 -139855 -281242 165977 95075
17918I5075k1304c7190D8055e17893a1350p2434j54112A22726G607h1419B01493
$$ 95075 73771 -37190 48055 -517893 -11350 -83784 -237896 122726 7607 -81419 201493
17906h1738j2598A46415a25566F6020b40193D4945a18671C5037i6871A98093d4481
$$ -81738 -94336 146415 -125566 66020 -240193 44945 -118671 35037 -96871 198093 -44481
17894A14230c282A35316a27653C7969c61363h1006e099j27951A27638b14666P003
$$ 114230 -3282 135316 -127653 37969 -361363 -81006 -5099 -133050 127638 -214666 -207663
17883b07663Q6276l01628B01784e8546A41785f5391G2487d5322C3897i3440k27390
$$ -207663 -121387 -423015 201784 -58546 141785 -65391 72487 -45322 33897 -93440 -320830
17872c20830a41149B39132E1434a6099H490N5547a80358D2879a91452a0137j90135
$$ -320830 -141149 239132 51434 -16099 8490 64037 -180358 42879 -191452 -10137 -200272
17861b00272A02127J89614n5666c7746B90164n5856j11868g9871p449j39730B70309
$$ -200272 102127 291741 236075 -37746 290164 234308 122440 -79871 -87320 -227050 270309
17849e314k5320A6980a73050F4258J99119b8841j04964B10567a05552r9548R3955
$$ -5314 -30634 16980 -173050 64258 263377 -28841 -133805 210567 -105552 -205100 -111145
17838a11145A02185e0913B00855J05109a27207k8514A73776E0253a924G295J0120
$$ -111145 102185 -50913 200855 305964 -127207 -155721 173776 50253 -1924 7295 17415
17827A7415a3464j03394A60032a18601f430j16430o063e4243A00853c06649C86265
$$ 17415 -13464 -116858 160032 -118601 -6430 -122860 -128923 -54243 100853 -306649 386265
17815a64278c4115j17583e1841q8805j6213D6663N2369b7707k3099d750A92135
$$ -164278 -34115 -151698 -51841 -140646 -156859 46663 99032 -27707 -50806 -4750 192135
17803a55082A14751c03879g170A07370a39034A22782r596e2680A51635G246h2805
$$ -155082 114751 -303879 -7170 107370 -139034 122782 113186 -52680 151635 7246 -82805
17791a72129A29336f5947A04815g457C8597b53541e44l45250A02775K5660L7094
$$ -172129 129336 -65947 104815 -7457 38597 -253541 -544 -345794 102775 128435 165529
17780A65529K35837A34620a82892k4020O0129A58392b00927C24939r080H2893
$$ 165529 401366 134620 -182892 -206912 -146783 158392 -200927 324939 315859 82893
17769A66145a3061j55209m5001H519J98127c50342D62218d50770a86181B39979
$$ 166145 -13061 -168270 -213271 8519 206646 -350342 462218 -450770 -186181 239979
17758g5883e339F7797a3205A04987A6146K36236R9463a0631j76918c4823A36766
$$ -75883 -5339 67797 -13205 104987 16146 252382 351845 -10631 -187549 -34823 136766
17746b92875A55856b65002g0211B7905a75840A8564J26790b39303C56J88379H1794
$$ -292875 155856 -265002 -70211 27905 -175840 18564 145354 -239303 356 188735 81794
17734A7963a02893F0347b88394b780j1949m6710A96680a72370a7963A91141B9635
$$ 17963 -102893 60347 -288394 -2780 -14729 -61439 196680 -172370 -17963 191141 29635
17722c1695n5358k65406D60072A62233i4514F5168d05804B0497M3006K1650h9628
$$ -31695 -87053 -352459 460072 162233 -94514 65168 -405804 20497 63503 85153 -89628
17710B96847e0638m270A38766c16244A62886p3688a1174k31628p253F2895e9396
$$ 296847 -50638 -54908 138766 -316244 162886 89198 -11174 -242802 -250055 62895 -59396
17698A46919b39686E20798B8750J17467L2927a79226C18762p7683k86a39796A12782
$$ 146919 -239686 520798 28750 146217 179144 -179226 318762 241079 240793 -139796 112782
17686d1074k89824C6552K68405c4847G1152a0461B24689A10828b5972C749d04677
$$ -41074 -330898 36552 304957 -34847 71152 -10461 224689 110828 -25972 3749 -404677
17674i9959A63228a71236B14843a90072P1496C8318A105b01388G9619J13878o1444
$$ -99959 163228 -171236 214843 -190072 -118576 38318 1105 -201388 79619 193497 132053
17663A32053c35854A59771e9452k05008a9527D0495j5550a62581e2259B82822
$$ 132053 -335854 159771 -59452 -264460 -19527 40495 24945 -162581 -52259 282822
17652i6911A67180R962b42350g3781D3891J0637c5778n6100k99148A89532H2548
$$ -96911 167180 177142 -242350 -73781 43891 54528 -35778 -91878 -391026 189532 82548
17640B58003H0982R4110K913b52746B85811J08512h2103B22478A01060j9913J2380
$$ 258003 80982 175092 178005 -252746 285811 394323 -82103 222478 101060 81147 93527
17629I3527B8861J32856M3296a13872A83931C6233b9295j49732f4262n1609b1475
$$ 93527 28861 161717 205013 -113872 183931 36233 -29295 -179027 -64262 -115871 -21475
17617g9498A94020H7622a68648k6350j06690H7506k3324L25550b3353l11686H1105
$$ -79498 194020 87622 -168648 -194998 -301688 87506 64182 389732 -23353 -335039 81105
17605B27522q795G3062J84276r0705d0447j8073B51864b12551B47972b7914A28360
$$ 227522 218727 73062 257338 166633 -40447 -58520 251864 -212551 247972 -27914 128360
17593I5781J09287e8510I4154P0618e3663B7397P248n2g9927C12720b23541A39
$$ 95781 205068 -58510 94154 164772 -53663 27397 34645 34593 -79927 312720 -223541 139
17580A41991a33847D96438A46582c0042B6533J1812J2459a37904f5346n5797A07149
$$ 141991 -133847 496438 146582 -30042 26533 38345 50804 -137904 -65346 -121143 107149
17568c0422j47120B37021n9623B7588a23047j03024E15J03000D2307c4935j37127
$$ -30422 -177542 237021 177398 27588 -123047 -226071 515 103515 42307 -34935 -172062
17557a72062P2761A95760l7576a03701A06784b39500C76723f5031B29908a3624
$$ -172062 -99301 195760 158184 -103701 106784 -239500 376723 -65031 229908 -13624
17546a58881N7334j26603a0796p0798o0708A27351K37953I5368c43372e3714A49555
$$ -158881 -101547 -228150 -10796 -81594 -142302 127351 365304 95368 -343372 -53714 149555
17534b61508A62184a03414F5417h2214B31814J11351a52539C49334b31006d5394
$$ -261508 162184 -103414 65417 -82214 231814 343165 -152539 349334 -231006 -45394
17523b10922m0459d9010H7661e576C39600E7811a1747q410F6259b26091A48049
$$ -210922 -251381 -49010 87661 -5576 339600 57811 -11747 -20157 66259 -226091 148049
17511A50787P40m2186i7262C4455J27790j6551A5443J49888e1456A55137b02057
$$ 150787 151527 109341 -97262 34455 162245 145694 15443 165331 -51456 155137 -202057
17499a4839C78732a72127c4749C9541L9451C8135j4082J7738b0655G8966l7161
$$ -14839 378732 -172127 -34749 39541 78992 38135 24053 41791 -20655 78966 41805
17488D1805J20739k7043a36144A98205E0834b6385m6933A6259a9041A25021a89826
$$ 41805 162544 135501 -136144 198205 50834 -26385 -73318 16259 -19041 125021 -189826
17476A86266a45648C9282a02967j22322C42315p8161D8469J5376q85J93040f285
$$ 186266 -145648 39282 -102967 -225289 342315 264154 48469 63845 62960 256000 -6285
17464a34997B89946j09081p3615k2824J80239m3859m1711M036d1197B43896I9957
$$ -134997 289946 180865 107250 84426 264665 220806 179095 183131 -41197 243896 99957
17452A44381K79340j68854I8463J27898m1568J14852l2262j07029B2145h6742
$$ 144381 423721 254867 98463 226361 184793 299645 267383 160354 22145 -86742
17441C08140j45100J50829d0118m245C20736b02375o369C6893K09789I2204J26136
$$ 308140 163040 313869 -40118 -44363 320736 -202375 -208744 36893 246682 92204 218340
17430B18340J23920j43871D3718g5671C46224f8836j2717E1410R3925A1567L12521
$$ 218340 342260 198389 43718 -75671 346224 -68836 -81553 51410 145335 11567 324088
17419C24088M3163F8877J88459j10926Q8391K33598B20896q2694c08093h9107
$$ 324088 367251 68877 257336 146410 234801 468399 220896 138202 -308093 -89107
17408B06730b5236B95762j03281h8860B78247j7567D6317K53421j40730J73167
$$ 206730 -25236 295762 192481 -88860 278247 260680 46317 299738 159008 332175
17398C32175A25004J63265G7216A8422d0143D36801j14169h9371D32306m9945
$$ 332175 125004 288269 77216 18422 -40143 436801 322632 -89371 432306 382361
17388C82361p5157A36761k4160J27709a30937A3774J55546a85559j2219B49585
$$ 382361 307204 136761 112601 240310 -130937 13774 169320 -185559 -197778 249585
17377C26270G0858J4645a03433b3327C11138e5862E1915J67932P6246d12364F6432
$$ 326270 70858 85503 -103433 -23327 311138 -55862 51915 219847 296093 -412364 66432
17365B80974o3113M0778a09337D9693a065A76331O1595A16672J7146J5536p729
$$ 280974 217861 258639 -109337 49693 -1065 176331 237926 116672 133818 149354 141625
17354A41625a0765A56338B9971M737O5552L9385f6111H5641J00494l4204g1108
$$ 141625 -10765 156338 29971 34708 100260 139645 -66111 85641 186135 151931 -71108
17342D17267B00422J73466l3789I2020e606p998j53044B99248a71753A69002B585
$$ 417267 200422 373888 340099 92020 -5606 -13604 -166648 299248 -171753 169002 2585
17330A69186B1428J06743c08621E25593j22801b2516E6740b1962A49351J42321
$$ 169186 21428 128171 -308621 525593 402792 -22516 56740 -21962 149351 291672
17320B91672L3592A24599r193J78039l1843I256a0515k89249C5283K78580O6989
$$ 291672 325264 124599 115406 293445 261602 9256 -10515 -299764 35283 313863 380852
17309C80852A53499J47600a81630B98675B6464K55006r3694A2987R0593l1134
$$ 380852 153499 301099 -181630 298675 26464 281470 187776 12987 103580 72446
17299G2446L5356R3179p3686Q3941J38870D2434a42906C61769F6572J36778N5178
$$ 72446 107802 200981 127295 211236 350106 42434 -142906 361769 66572 203350 258528
17288B58528K02863A6062L9140J27615K62240j07677A49924a34922B72180D3202
$$ 258528 461391 16062 55202 182817 445057 337380 149924 -134922 272180 43202
17277C5873P0722K01320J50303B09197F8521A247a68149A47279o7152J99632m1022
$$ 35873 106595 307915 458218 209197 68521 1247 -168149 147279 80127 279759 238737
17266B38737M947d9901A16761O3732C1712L03552A47244l4757B8844L15378j45613
$$ 238737 243684 -49901 116761 180493 31712 335264 147244 112487 28844 344222 198609
17255A98609r0606Q2925K8692A08695L3794M25026k30720H5118l3264K22190J16517
$$ 198609 108003 190928 219620 108695 142489 567515 336795 85118 51854 274044 390561
17244C90561A43013K94648B7145K02906C8856J10443i1195E64047A59676L953
$$ 390561 143013 437661 27145 230051 38856 149299 -91195 564047 159676 163629
17234A63629a1973B28409M7223o7058q5853J9578L34570j01779m9254e84C68031
$$ 163629 -11973 228409 275632 208574 122721 142299 476869 375090 325836 -584 368031
17222A90429L38810D2460b7877D85208C451a83215H0894K85833j34071l8648Q6069
$$ 190429 529239 42460 -27877 485208 3451 -183215 80894 366727 232656 194008 280077
17211B80077J3693a4549A77029L41977F224J45245K20183F2149A4285M39011A34304
$$ 280077 293770 -14549 177029 519006 6224 151469 371652 62149 14285 453296 134304
17199E5931K15960j8363m3899e7787A36083D3681J4079L99748B24209P2826q066
$$ 55931 271891 253528 209629 -57787 136083 43681 57760 457508 224209 297035 288969
17188B88969J837C2643K35879E6861K59705A48559p2526L76020A726P3265j3049
$$ 288969 290806 32643 268522 56861 316566 148559 76033 452053 1726 74991 61942
17177F1942L4739K11237A7895K10965j6655k1561J78261A13196J69299n1200J4008
$$ 61942 96681 307918 17895 228860 212205 190644 368905 113196 282495 231295 245303
17166B45303j04631F0480J92804G1247g657C12457p7638n4755K21281f1296H6226
$$ 245303 140672 60480 253284 71247 -7657 312457 234819 180064 401345 -61296 86226
17154G6465d3841A29866L02165p2629j06601G5493J04581n4962c6665A96173l9600
$$ 76465 -43841 129866 432031 359402 252801 75493 180074 125112 -36665 196173 156573
17143A56573J51819L0258O8715R8879B01517K51905B2260M52044j18414j71961
$$ 156573 308392 338650 407365 506244 201517 453422 22260 474304 355890 183929
17133A83929m2495L29885a3849C47085A39760J70246j27658K31058j02083b9444
$$ 183929 141434 471319 -13849 347085 139760 310006 182348 413406 311323 -29444
17122A79393K38721p233A44124J68376j38974Q5658l8015J42226q1854J17969
$$ 179393 418114 410881 144124 312500 173526 259184 221169 363395 281541 399510
17112C99510E8564K60052O3808j39504P6027j50244R3306j2355K45207m899A92207
$$ 399510 58564 318616 382424 242920 318947 168703 262009 249654 494861 489962 192207
17100B96128L856Q0832j39613K85458N7598j12463O7239k05898L51152A87823
$$ 296128 299984 380816 241203 526661 584259 471796 539035 333137 684289 187823
17089C33387A49048J85987H5275J44872K60476j7961k27045J79811j00058P0409
$$ 333387 149048 335035 85275 230147 490623 472662 245617 425428 325370 395779
17079C95779E4428O08801k13492J32372k11084R8962K85832l34401J1830J30406
$$ 395779 54428 663229 449737 582109 371025 469987 755819 421418 433248 563654
17069E63654B68568L53411B89706J90497A36788k4420O29651C65425O5561O7762
$$ 563654 268568 621979 289706 480203 136788 112368 742019 365425 430986 498748
17059D98748J14567B43759L57859j2953j64125Q6390k02759L71587l22834N0650
$$ 498748 613315 243759 601618 588665 424540 510930 308171 679758 356924 407574
17049D07574j41289L214M8434L03506B31380J50363j46329Q9817M21742C66307
$$ 407574 266285 269499 317933 621439 231380 381743 235414 325231 746973 366307
17038E55230J6989k2828P2800B99510K38127j0042k14138K32694J56598l01750
$$ 555230 572219 549391 622191 299510 537637 527595 313457 546151 702749 400999
17028D00999j15386P46194B20030K15102J51449j26361Q8494K49962k22772m6152
$$ 400999 285613 1031807 220030 435132 586581 460220 548714 798676 575904 529752
17018E29752L84902m48288m1121r8112J68651K80544n0877B01006N17132j96359
$$ 529752 914654 466366 425245 327133 495784 776328 725451 201006 718138 521779
17008E21779k8425K03461B97415N28100C82709M70519l72585J94700J75682j93847
$$ 521779 493354 696815 297415 825515 382709 853228 480643 675343 851025 657178
16998F57178O2247m5042k6725J79994C98853L06046k59325L12315j15857m6304
$$ 657178 719425 674383 647658 827652 398853 704899 445574 757889 642032 595728
16988E95728K70596l47809K45000P3000K71671m83892k5385K1205K85931m00601
$$ 595728 866324 518515 763515 836515 1108186 624294 598909 620114 906045 505444
16978E05444L52886M355K672q8235Q5789p7747Q840k93703N44315m9738m24242
$$ 505444 858330 862685 865357 777122 862911 785164 794004 500301 1044616 994878 570636
16967E70636K60869k67024M18750o2551k43597K47762j60015M657O1349J43051
$$ 570636 831505 564481 983231 920680 677083 924845 764830 769487 830836 973887
16957I73887o7766j52269p8218J34149K31415K86860l98578J6904k32381K45190
$$ 973887 906121 753852 675634 809783 1041198 1328058 929480 946384 714003 959193
16947I59193j00708N9904j75237K16262O4852q4732J85280q2650j42921j8937
$$ 959193 858485 918389 743152 959414 1024266 939534 1124814 1042164 899243 880306
16937H80306N6706J68721k48734L17459n264l56260K52193J22105k96272L39309
$$ 880306 937012 1105733 856999 1174458 1169194 812934 1065127 1187232 890960 1230269
16927A230269k70068Q7763K89554l80665J28698j48525L88898Q4434k18098l7304
$$ 1230269 960201 1047964 1337518 956853 1085551 937026 1325924 1410358 1192260 1154956
16917A154956J50735l7973Q6789k03531J53233P695j42091J84924k12108J17039
$$ 1154956 1305691 1267718 1354507 1150976 1304209 1311904 1169813 1354737 1142629 1259668
16907A259668N5660J59618o90313M71821K59039l38104O0396K62740j88527k23390
$$ 1259668 1315328 1474946 784633 1256454 1515493 1177389 1237785 1500525 1311998 1088608
16897A088608j60217N41102j45035m877J82855K16495n09563M94644k03593j33464
$$ 1088608 928391 1469493 1324458 1319581 1502436 1718931 1209368 1704012 1500419 1366955
16887A366955m5061L69888q4108L5262J13946r7970m3827l13304J62528M38334
$$ 1366955 1321894 1691782 1607674 1642936 1756882 1658912 1615085 1301781 1464309 1902643
16877A902643o427l3099M09989n66010J9822K54746k8081j11384J3480O222l1224
$$ 1902643 1896216 1863117 2273106 1707096 1726918 1981664 1953583 1842199 1855679 1861901 1830677
16866A830677L64696l40218J69551j29907M8036j44404N56888l21342J62599k61294
$$ 1830677 2195373 1855155 2024706 1894799 1942835 1798431 2355319 2033977 2196576 1935282
16856A935282J86686N553J77947l08388J48214J9276J03105L51894J5551n97954
$$ 1935282 2121968 2127521 2305468 1997080 2145294 2164570 2267675 2619569 2635120 2037166
16846B037166N40014j45413K2140L1362K37993n108j09257k01971N06631l51674
$$ 2037166 2577180 2431767 2453907 2485269 2723262 2718154 2608897 2406926 2913557 2561883
16836B561883O58950k74885j28827j5813O032K77323j48812l441P0979J44645
$$ 2561883 3220833 2945948 2817121 2801308 2807340 3084663 2935851 2932410 3003389 3148034
16826C148034J30804j96675M5876K13575M99590j40885m21195L80940J99396l25306
$$ 3148034 3278838 3082163 3128039 3341614 3841204 3700319 3279124 3660064 3859460 3534154
16816C534154N24212l65604K18492N5648j18670K30364k3321K61001j35197K79061
$$ 3534154 4058366 3692762 3911254 3966902 3848232 4078596 4055275 4316276 4181079 4460140
16806D460140k5595k13868J31348J65845j40802K12833K45135P8433m1625L24259
$$ 4460140 4434545 4220677 4352025 4517870 4377068 4589901 4835036 4913469 4871844 5196103
16796E196103Q5538o8014K65266J10318j8220J29257K47954K41523K5110j99481
$$ 5196103 5281641 5213627 5478893 5589211 5570991 5700248 5948202 6189725 6214835 6015354
16786F015354L36956n4741J34428K86970p5958M85289J84397J57541n9935K46917
$$ 6015354 6352310 6297569 6431997 6718967 6643009 7128298 7312695 7470236 7410301 7657218
16776G657218L94182N4728l61488N87726J97847L45841J1471J00377M46483L56794
$$ 7657218 8051400 8106128 7744640 8332366 8530213 8876054 8887525 8987902 9434385 9791179
16766I791179J36024J06285K41182O30440J29647J38734L37790K82548N15989
$$ 9791179 9927203 10033488 10274670 10905110 11034757 11173491 11511281 11793829 12309818
16757A2309818L84504K63923M39863K64949L98570N24036L87580n1932R28428
$$ 12309818 12694322 12958245 13398108 13663057 14061627 14585663 14973243 14921311 15849739
16748A5849739K61059Q18883K89653N84884P62121O11846O72158M79072Q31726
$$ 15849739 16110798 16929681 17219334 17804218 18566339 19178185 19850343 20329415 21161141
16739B1161141Q84902Q43785J110695K57076J065315J238571Q26160J457390R64757
$$ 21161141 22046043 22889828 24000523 24257599 25322914 26561485 27387645 28845035 29809792
16730B9809792J110626J252779J263711J374981J857446J328461J843531J635956
$$ 29809792 30920418 32173197 33436908 34811889 36669335 37997796 39841327 41477283
16722D1477283J953101K274456J715802K187887K572905K634256K755119K817581
$$ 41477283 43430384 45704840 47420642 49608529 52181434 54815690 57570809 60388390
16714F0388390K755642L438936K957906L631930L773810L447446M100359M006078
$$ 60388390 63144032 66582968 69540874 73172804 76946614 80394060 84494419 88500497
16706H8500497M316062M165562M753372M180013M540710L958725M041254L728231
$$ 88500497 92816559 96982121 101735493 105915506 110456216 114414941 118456195 122184426
16698A22184426L884070K694604L285492K050282J837559J165313K55328j80354
$$ 122184426 126068496 128763100 132048592 134098874 135936433 137101746 137357074 137176720
16690A37176720n65206j884152k195736k263846l080141l529754l876425l951453
$$ 137176720 136611514 134727362 132531626 130267780 127187639 123657885 119781460 115830007
16682A15830007m343228m461777m338162m348228m430017l918356m492088m055955
$$ 115830007 111486779 107025002 102686840 98338612 93908595 89990239 85498151 81442196
16674H1442196m237213l538811l678687l491872l040160l200211k958829k615411
$$ 81442196 77204983 73666172 69987485 66495613 63455453 60255242 57296413 54681002
16666E4681002k452639k838068k118492k355501k022657k161680j652182j924006
$$ 54681002 52228363 49390295 47271803 44916302 42893645 40731965 39079783 37155777
16658C7155777j368441j593553j737133j241832j272586j315945j271285q92820
$$ 37155777 35787336 34193783 32456650 31214818 29942232 28626287 27355002 26462182
16650B6462182j248303r30571q43159r44400p69085q70397o93393j086101k83245
$$ 26462182 25213879 24283308 23440149 22495749 21726664 20856267 20162874 19076773 18793528
16641A8793528p70974k41740j011534n26412r04792r7735l89280p13019m73023
$$ 18793528 18022554 17780814 16769280 16242868 15338076 15240341 14851061 14138042 13665019
16632A3665019l85564l20932m92723j4073o94933j22459m48492k16097o25172
$$ 13665019 13279455 12958523 12465800 12451727 11756794 11634335 11185843 10969746 10344574
16623A0344574k89899q367l53113j85687k20794j20096j08293l08324m80665j08959
$$ 10344574 10054675 10046308 9693195 9507508 9286714 9166618 9058325 8750001 8269336 8160377
16613H160377j20244l82583j24330m12526M5375l44595P0694l40881o3586l9681
$$ 8160377 8040133 7657550 7533220 7120694 7166069 6821474 6892168 6551287 6487701 6448020
16603F448020m32267M8709l21433M02805l27836j30466l31781J19510m13147j71636
$$ 6448020 6015753 6064462 5743029 6145834 5817998 5687532 5355751 5475261 5062114 4890478
16593D890478K19380k57810j51787L4439K76447n34697j12802q7716q7246j30460
$$ 4890478 5109858 4852048 4700261 4734700 5011147 4476450 4363648 4275932 4188686 4058226
16583D058226k40789R5198j32463K05199k70351J87703k54847n2964J29962l89075
$$ 4058226 3817437 3912635 3780172 3985371 3715020 3902723 3647876 3594912 3724874 3335799
16573C335799K19693j99334k4535j25759j00804J89787k91728j77462Q457r4261
$$ 3335799 3555492 3356158 3331623 3205864 3105060 3294847 3003119 2825657 2834114 2739853
16563B739853L55893m51175Q0174j16860K63997k89738J82021j69101P3542j02232
$$ 2739853 3095746 2644571 2724745 2607885 2871882 2582144 2764165 2595064 2668606 2566374
16553B566374j66724J20650m04694K54917l33432L60070q1323n7084j74213K14696
$$ 2566374 2399650 2520300 2115606 2370523 2037091 2397161 2315838 2258754 2084541 2299237
16543B299237k46794N4512m56699N04396K78611l90681j76168L5128L34151k97873
$$ 2299237 2052443 2106955 1650256 2154652 2433263 2042582 1866414 1901542 2235693 1937820
16533A937820k66447J20162l53571K24014J37604J08250j55068j29656j25329
$$ 1937820 1671373 1791535 1437964 1661978 1799582 1907832 1752764 1623108 1497779
16524A497779P7166J23389j7747J01710j53887o7883k39431j23515L75260k12369
$$ 1497779 1574945 1698334 1680587 1782297 1628410 1560527 1321096 1197581 1572841 1360472
16514A360472p1771P418L1652q8511N1007p8012J11562q4837J42285o8440j30640
$$ 1360472 1288701 1296119 1327771 1239260 1290267 1212255 1323817 1238980 1381265 1312825 1182185
16503A182185O3185K08370k2956n57684L03171l9261n394M2789j68684J92335
$$ 1182185 1245370 1453740 1430784 873100 1176271 1137010 1131616 1174405 1005721 1198056
16493A198056J37573r0260j64323J08953m1197k46893P53712k84609l21051k96451
$$ 1198056 1335629 1245369 1081046 1189999 1148802 901909 1655621 1371012 1049961 753510
16483G53510P8506l2840M64755l93869J69820l24175Q5854L43738m17208Q5049
$$ 753510 832016 799176 1263931 870062 1039882 715707 801561 1145299 728091 813140
16473H13140l6952J34104J61972l45996M22871l47191j2217j93144Q0940j81703
$$ 813140 776188 910292 1072264 726268 1149139 801948 789731 596587 677527 495824
16463D95824J61094K85470k42995J66120j67341M94342l54437j9449k45650K84700
$$ 495824 656918 942388 699393 865513 698172 1192514 838077 818628 572978 857678
16453H57678n015k86662j58104L33474j47823K27100l03870K60477j32261j66768
$$ 857678 852663 566001 407897 741371 593548 820648 516778 777255 644994 478226
16443D78226P7705m9493M76845D79872J29390q503L58491m11925N7122L31145
$$ 478226 555931 506438 983283 479872 609262 600759 959250 547325 604447 935592
16433I35592k83872k10083J04635j11813P1143J28777j95671J2082l4793J98240
$$ 935592 651720 441637 546272 434459 505602 634379 438708 450790 415997 614237
16423F14237k42205J46892q2488K20615k71445L96414j03791l14154K67326n7929
$$ 614237 372032 518924 436436 657051 385606 782020 678229 364075 631401 573472
16413E73472j27617K4837J23802j08829J94649M430k66807O7262j0969Q691j41016
$$ 573472 445855 470692 594494 485665 680314 684744 417937 485199 474230 482921 341905
16402C41905M26302l61296r8562K896O8647J47608o9301J0147J56520B62942J05352
$$ 341905 768207 406911 308349 311245 379892 527500 458199 468346 624866 262942 368294
16391C68294B8403O76492C35363K17732q7752j0491k4846A34728k3782L55907
$$ 368294 28403 704895 335363 553095 465343 454852 430006 134728 110946 466853
16381D66853R6341n6041j46382L24293k44951m9407K30044k46152K3781A49851
$$ 466853 563194 507153 360771 685064 440113 390706 620750 374598 398379 149851
16370B54233J09809A18699K08778J96725j12898A79169O7955J67379A79480j7032
$$ 254233 364042 118699 327477 524202 411304 179169 247124 414503 179480 162448
16360A62448K98673j38045n529J8502a1396B42583j19108C7099J64293J51448
$$ 162448 461121 323076 317547 336049 -11396 242583 123475 37099 201392 352840
16350C52840j01988P6199L22819B58143J86389a23411N5532E33124e627B06214
$$ 352840 250852 327051 649870 258143 444532 -123411 -67879 533124 -5627 206214
16339B76086O1151j00977K12687q9457j60540a12471C96117A61373o0049B633
$$ 276086 337237 236260 448947 359490 198950 -112471 396117 161373 101324 2633
16328D78410k17692H2470L03264P266j32367l0630J54079G0061N6636E5519j9038
$$ 478410 260718 82470 385734 393000 260633 230003 384082 70061 126697 55519 36481
16317C6481M59263N8880B06702a24706e3673A44734f6863A18921M6626P9664p3196
$$ 36481 495744 554624 206702 -124706 -53673 144734 -66863 118921 165547 245211 172015
16306A72015N2644j9329H6582K9934K24566L21980A89726G6307L97242e6243F5958
$$ 172015 224659 205330 86582 116516 341082 663062 189726 76307 473549 -56243 65958
16294a6389B28574g941B32023N3695c5826A16982N8846J4534n5474J89824I4269
$$ -16389 228574 -7941 232023 285718 -35826 116982 175828 190362 134888 324712 94269
16282c63254E8009J0591d1178C1985L05932j56892G2341D27L1855K46670i0429
$$ -363254 58009 68600 -41178 31985 337917 181025 72341 427 32282 278952 -90429
16270e3598A25724K1033J44400A37083L07887A35923a55503B24135k3170m3418
$$ -53598 125724 146757 291157 137083 444970 135923 -155503 224135 200965 157547
16260A57547F7110L71999A51728P1104O4128A11027j7546c21954C50248e6007
$$ 157547 67110 439109 151728 222832 286960 111027 93481 -321954 350248 -56007
16249G9968A1106R1280d0542B74026G8864P7567O2666J01877r5593j3602Q3681
$$ 79968 11106 102386 -40542 274026 78864 156431 219097 320974 225381 211779 295460
16238B95460j15833L00933D6306K66214j07914i6539A08659b4790D36129G5226
$$ 295460 179627 480560 46306 312520 204606 -96539 108659 -24790 436129 75226
16227c1400C63501j38691k2137a33049D2646M9779J435J3949J04523J25451g0150
$$ -31400 363501 224810 202673 -133049 42646 92425 93860 107809 212332 337783 -70150
16215A56177N0867b27849B27256f5306A81736J06648j21084F0334M4602c0325
$$ 156177 207044 -227849 227256 -65306 181736 288384 167300 60334 104936 -30325
16204C77473A36375n2405a05969B58689I748J70468a26948B06880A01790j5036
$$ 377473 136375 83970 -105969 258689 9748 180216 -126948 206880 101790 86754
16194H6754c24845A00732A2047R3362J12472a77946B54619d4031P422k13266H3180
$$ 86754 -324845 100732 12047 105409 217881 -177946 254619 -44031 -36609 -249875 83180
16182a88081H2674K5342J8089A8900L59893a94647C05251p2278K84531b23312
$$ -188081 82674 108016 126105 18900 378793 -194647 305251 232973 517504 -223312
16171D2917b92687J45605d9492O170B84826A9471b29022A16816a36710B4980K92061
$$ 42917 -292687 -147082 -49492 -43322 284826 19471 -229022 116816 -136710 24980 317041
16160C17041b1555C47159A35208E892J92347A8489O8560c253j14759k88757H1064
$$ 317041 -21555 347159 135208 5892 198239 18489 87049 -3253 -118012 -406769 81064
16148A92034j5161m8485b12589m0281e1962A96097l5880j8082J32032j20840A0087
$$ 192034 176873 128388 -212589 -252870 -51962 196097 160217 142135 274167 153327 10087
16136b77963A00125J56138q8552m1525J41039h4008k5924j49004J08252a1349
$$ -277963 100125 256263 167711 126186 267225 -84008 -109932 -258936 -150684 -11349
16125b62549A23940a43900A27117D7980e8160q750a4368K955p9252H7197D345
$$ -262549 123940 -143900 127117 47980 -58160 -66910 -14368 -11413 -90665 87197 4345
16113b22272B4532O5720P2004C7495j1503N8486J60130j12682a7712B13439a96812
$$ -222272 24532 90252 162256 37495 25992 84478 244608 131926 -17712 213439 -196812
16101B11529f7501K151k01k19181H1360b33568A40067F8875R9494i3570K9319
$$ 211529 -67501 -65350 -65551 -284732 81360 -233568 140067 68875 168369 -93570 -64251
16090f4251C6966e3942q6461N587L4934d9430k13400A59267J25689I4025b86060
$$ -64251 36966 -53942 -140403 -134816 -99882 -49430 -262830 159267 284956 94025 -286060
16078C95177B7666R2794k4959M1087l7510J56983A21378b40434J03556d0566A22010
$$ 395177 27666 120460 95501 136588 99078 256061 121378 -240434 -136878 -40566 122010
16066i0269M739D7082e0328n13209B24980C1293L40986A23422g313A16194c04597
$$ -90269 -85530 47082 -50328 -563537 224980 31293 372279 123422 -7313 116194 -304597
16054C570L8119a09759r2202B24666N5997j12904b14367N9868C3866c1272B08773
$$ 3570 41689 -109759 -201961 224666 280663 167759 -214367 -154499 33866 -31272 208773
16042G9073N8744J01497b27570G7683I271a01192j37659J0532D7349L281l956
$$ 79073 137817 239314 -227570 77683 9271 -101192 -238851 -228319 47349 50630 46674
16031D6674a27926C9627J02376n7804c79388a31076D1188J16319g9050l53306
$$ 46674 -127926 39627 142003 84199 -379388 -131076 41188 157507 -79050 -432356
16021d32356a88658e3354k3239A44329b054A60285G7172b03901D0345a37702e3018
$$ -432356 -188658 -53354 -76593 144329 -2054 160285 77172 -203901 40345 -137702 -53018
16009I6070a26295l7115j03977k5924J28332C08541C1654a26709A08787R2666
$$ 96070 -126295 -163410 -267387 -293311 -164979 308541 31654 -126709 108787 201453
15999B01453A00495r456C5259a42224o4199c8243j66798O3664m2476A66794a18114
$$ 201453 100495 91039 35259 -142224 -206423 -38243 -205041 -141377 -183853 166794 -118114
15987e8567j60297B23644g3534E4206c7190k85953a20571l01741i5657A68190
$$ -58567 -218864 223644 -73534 54206 -37190 -323143 -120571 -422312 -95657 168190
15976f1129j8346m071K6544o4053B1623J75602e8940A22336A4217a48886b8859
$$ -61129 -79475 -83546 -57002 -121055 21623 197225 -58940 122336 14217 -148886 -28859
15964b9438j31638a3431A78971P6810d5888F8525a88132E43639A57996l0257K77440
$$ -29438 -161076 -13431 178971 255781 -45888 68525 -188132 543639 157996 127739 405179
15953D05179B01740C9544b4988A37807f0504E3089Q1443a40825a046j06640E2093
$$ 405179 201740 39544 -24988 137807 -60504 53089 134532 -140825 -1046 -107686 52093
15941a527o5398j56546N8293A96727q7929J04503L7484G4397J85333j16010g3833
$$ -1527 -66925 -223471 -165178 196727 108798 213301 250785 74397 259730 143720 -73833
15929H1551J02626a44842L1893A85611L6897a27692D5138N6242C5820b78637J13070
$$ 81551 184177 -144842 -112949 185611 222508 -127692 45138 101380 35820 -278637 -165567
15918a65567K9542C64740a54294B31378e0461C1192a32734A44810P8692b51102
$$ -165567 -136025 364740 -154294 231378 -50461 31192 -132734 144810 223502 -251102
15907H5287a38943A79245c31401J30646C7646J50378b13737e1216j64909e7058
$$ 85287 -138943 179245 -331401 -200755 37646 188024 -213737 -51216 -216125 -57058
15896a04893j06156J2298A74859i1508g492D0205a1437C19260a36612k99986A90694
$$ -104893 -211049 -198751 174859 -91508 -7492 40205 -11437 319260 -136612 -436598 190694
15884c04873i4357j92256J3059L7092f6360b3695q7439A93532b25084J08961F9930
$$ -304873 -94357 -286613 -273554 -236462 -66360 -23695 -111134 193532 -225084 -116123 69930
15872E272N1176a62158D85961d9894B7590e03911B1010a85803H7856d06504a82727
$$ 5272 56448 -162158 485961 -49894 27590 -503911 21010 -185803 87856 -406504 -182727
15860a37620j3436B23386b3801D8352O4691h3467h865l41699g4861K2102j79288
$$ -137620 -151056 223386 -23801 48352 113043 -83467 -8865 -350564 -74861 -52759 -232047
15849b32047B9170l696a33330e7562l0138J5145A89563g0007A92449a14119L4609
$$ -232047 29170 25474 -133330 -57562 -87700 -72555 189563 -70007 192449 -114119 -79510
15838g9510m7729r1935a496m47692H8835b10757j10134B81613b09711K3415E4974
$$ -79510 -127239 -219174 -1496 -449188 88835 -210757 -320891 281613 -209711 -186296 54974
15826C3247a32283e0244C6944p032K38013b73190f6453A13558Q0620a91333c4940
$$ 33247 -132283 -50244 36944 29912 267925 -273190 -66453 113558 194178 -191333 -34940
15814b48687a9523q8456q4257F0375b93182N1911c6125J3187Q436l85987a52539
$$ -248687 -19523 -107979 -192236 60375 -293182 -241271 -36125 -22938 -14502 -400489 -152539
15802a25750d3900l9122r0920a8664o3303m6830J1717m0768A84979h5632a416
$$ -125750 -43900 -83022 -173942 -18664 -81967 -128797 -117080 -157848 184979 -85632 -1416
15790B5513N7143h9425k1854c5143j31591Q1464F8234J9445H500c34240d8586
$$ 25513 82656 -89425 -111279 -35143 -166734 -85270 68234 87679 8500 -334240 -48586
15778E5666N860a29256G8848b03357A39553e5219k06164d1103q0204j55266A60917
$$ 55666 61526 -129256 78848 -203357 139553 -55219 -261383 -41103 -121307 -276573 160917
15766A84937a69143c5652E6198b0421E8119b74379B87434g6846k06391i6451r5969
$$ 184937 -169143 -35652 56198 -20421 58119 -274379 287434 -76846 -283237 -96451 -192420
15755a92420k891A30113F0702A0409d1279k71564a11832m3572F6714a58428j09676
$$ -192420 -195311 130113 60702 10409 -41279 -312843 -111832 -155404 66714 -158428 -268104
15744b68104a20070j04526J07756A50685a21578A99546G0439i5668A53754e8311
$$ -268104 -120070 -224596 -116840 150685 -121578 199546 70439 -95668 153754 -58311
15733C64406A36397O6641r7784E630i7088F8739k4090e4264C130a76370f5594
$$ 364406 136397 203038 105254 5630 -97088 68739 44649 -54264 3130 -176370 -65594
15721A03738l4260a02209k8831D0630J26346b10881a1066k8530O117F0646L8682
$$ 103738 69478 -102209 -131040 40630 166976 -210881 -11066 -39596 -33479 60646 99328
15710I9328J81445A3857h117m9628k38153b2898k9097A97457b28117G1133P2061
$$ 99328 280773 13857 -8117 -57745 -295898 -22898 -51995 197457 -228117 71133 143194
15699A43194Q8648a3269A52710N2897C6257g3167K8319j54461L8538d1375o2497
$$ 143194 231842 -13269 152710 205607 36257 -73167 -44848 -199309 -160771 -41375 -103872
15688a03872B32446c52562A36453a80300B48377b6931B5760R7701m6683b3623
$$ -103872 232446 -352562 136453 -180300 248377 -26931 25760 123461 76778 -23623
15677c65176C6135a09691l24728h4645B40731a14448A48788m0339a78748Q2386
$$ -365176 36135 -109691 -434419 -84645 240731 -114448 148788 108449 -178748 -96362
15667i6362B50874r7126c5874B2818b32965D03781H9367b43567A12444O7539L7627
$$ -96362 250874 153748 -35874 22818 -232965 403781 89367 -243567 112444 179983 217610
15656B17610d8307A33850e4659b5818A63951d146l4023l6780j24084Q4256K148
$$ 217610 -48307 133850 -54659 -25818 163951 -4146 -38169 -74949 -199033 -114777 -112629
15645a12629C8348b04543E715M0271D424J98594I3939d4385o579A27262c86579
$$ -112629 38348 -204543 5715 45986 4424 203018 93939 -44385 -50964 127262 -386579
15633a56954J6311F9915L7581c9899n9717K2333j76413b2224A74286q3859d7620
$$ -156954 -140643 69915 107496 -39899 -99616 -77283 -253696 -22224 174286 90427 -47620
15621C07539A33710A913b86738J20506F7684c7574B95165k9142F3494b13735P8493
$$ 307539 133710 1913 -286738 -166232 67684 -37574 295165 266023 63494 -213735 -135242
15610a35242A40949l2878a18032I649P2167J76270B8014Q7370f8200j36662B77607
$$ -135242 140949 108071 -118032 9649 81816 258086 28014 115384 -68200 -204862 277607
15598A85266b0488l13947J55962C04709r9641d9684m7979F8031q546b21115a07132
$$ 185266 -20488 -334435 -178473 304709 205068 -49684 -97663 68031 59485 -221115 -107132
15586a21759I8268a16554o7024A30129c35008L7887b4062l6662j04245A15266
$$ -121759 98268 -116554 -183578 130129 -335008 -297121 -24062 -60724 -164969 115266
15575a99833A1501J31536D421f7569A65953n1345b07854q174j6723B99589a25637
$$ -199833 11501 143037 4421 -67569 165953 114608 -207854 -216028 -232751 299589 -125637
15563A61669a7650A88148m690c1396B26025m0605p4379a40863o8308j15603J52188
$$ 161669 -17650 188148 183458 -31396 226025 185420 111041 -140863 -209171 -324774 -172586
15552a72586E0598d5469p624j31843l6260G4319f3715E8487h9957A64468B6908
$$ -172586 50598 -45469 -53093 -184936 -221196 74319 -63715 58487 -89957 164468 26908
15540h9759D2968j2386J19784b48954B03174B5560r448k146b25517d938A73098
$$ -89759 42968 30582 150366 -248954 203174 25560 16112 13966 -225517 -4938 173098
15528H8155a179C99563b81825d4315C9668b64105A34666f9294m5934c9526d010
$$ 88155 -1179 399563 -281825 -44315 39668 -264105 134666 -69294 -115228 -39526 -4010
15516a51243L7833k07862B34335a27212G9802a45660M373C42917j27469J62135
$$ -151243 -113410 -321272 234335 -127212 79802 -145660 -141287 342917 215448 377583
15506C77583b77222a06744I6454c8745j3343p7992K1011q6135B52397c80915A25194
$$ 377583 -277222 -106744 96454 -38745 -52088 -130080 -109069 -195204 252397 -380915 125194
15494A04161h8873B9910K01266b87070A09338b49365C12442D3028L2497e332j51270
$$ 104161 -88873 29910 231176 -287070 109338 -249365 312442 43028 75525 -5332 -156602
15483a56602c6109j92785D4411d9343a4522n8350A5808c07404d0360A24015c6974
$$ -156602 -36109 -228894 44411 -49343 -14522 -72872 15808 -307404 -40360 124015 -36974
15471a04498F9707B1180R5252Q7370D1807i2770j85675D3734N2367b03542l9776
$$ -104498 69707 21180 116432 203802 41807 -92770 -278445 43734 96101 -203542 -243318
15460b43318l0052A222b04163D6630a87617B78357G6491b05640A60910P3649c70944
$$ -243318 -273370 1222 -204163 46630 -187617 278357 76491 -205640 160910 234559 -370944
15448e6506j49096C7103j5223L9936J07696B9736a80659A9578b0958j33254G5397
$$ -56506 -205602 37103 21880 61816 169512 29736 -180659 19578 -20958 -154212 75397
15436c96789A71326h3011B00923a89087M43A57049G3255J77219E231h9855O476
$$ -396789 171326 -83011 200923 -189087 -188644 157049 73255 250474 5231 -89855 -83379
15425h3379F8933a56349A43197Q200a24066f1715j23414A98494a24948E9682N8152
$$ -83379 68933 -156349 143197 151397 -124066 -61715 -185129 198494 -124948 59682 117834
15414A17834a51177j15978A01745J34020j10749A7048J03704a65614G0017a38150
$$ 117834 -151177 -267155 101745 235765 125016 17048 120752 -165614 70017 -138150
15403B60745q9132m1769d7698B4595b7914C41189c55444g5284A10488l922a05403
$$ 260745 171613 129844 -47698 24595 -27914 341189 -355444 -75284 110488 106566 -105403
15391d2730A13490g2142j39349j32975B20339a20475B89255d12299A72586b65017
$$ -42730 113490 -72142 -211491 -344466 220339 -120475 289255 -412299 172586 -265017
15380A03855c4082k240j60919H87d0846B284c1256k30802q83A96603a92800k24841
$$ 103855 -34082 -36322 -197241 887 -40846 2284 -31256 -262058 -262941 196603 -192800 -417641
15368d17641A56326J27284j19783Q5613B7644l518d3070C54536c6470j7609n7645
$$ -417641 156326 283610 163827 249440 27644 24126 -43070 354536 -36470 -54079 -111724
15357a11724a3031C09605a9227I2177J1319a40243M5665M5861K2745P819B14787
$$ -111724 -13031 309605 -19227 92177 103496 -140243 -94578 -48717 -25972 -18153 214787
15345b01268f4285B37134b40965B05167a26197N6311D1982B0424d5334o0961M0278
$$ -201268 -64285 237134 -240965 205167 -126197 -69886 41982 20424 -45334 -106295 -66017
15334f6017A46395b5232K703H1675g7147C8248J04986c96411C4735K92967D2051
$$ -66017 146395 -25232 -22529 81675 -77147 38248 143234 -396411 34735 327702 42051
15322D3138j721e7393p4235B937K10638a4488k59970a2469B35271b32161G7798
$$ 43138 41417 -57393 -131628 2937 213575 -14488 -274458 -12469 235271 -232161 77798
15310a40613l10013D1644J6245j432J55976I1749L74656B13016c8145j13785O6542
$$ -140613 -450626 41644 57889 56457 212433 91749 466405 213016 -38145 -151930 -85388
15299h5388A66522b6665E623c43086J09406B23975d19131K08239J6697A91542
$$ -85388 166522 -26665 5623 -343086 -233680 223975 -419131 -210892 -194195 191542
15288H5714a50651O9661l8941C5972a40896A30568D1669Q8474c8853I3032h9775
$$ 85714 -150651 -80990 -119931 35972 -140896 130568 41669 130143 -38853 93032 -89775
15276A93930b1631B93145B1777d8155p3537J3691C01596G6544l3088L8315f5815
$$ 193930 -21631 293145 21777 -48155 -121692 -108001 301596 76544 43456 81771 -65815
15264I0150l3565P1192b99613A08849M0719f1188I5263A2176a64844A45880C2270
$$ 90150 56585 127777 -299613 108849 149568 -61188 95263 12176 -164844 145880 32270
15252a98628d0563A64833a46088l6185M5060M9341A14266a48958I7494J57963
$$ -198628 -40563 164833 -146088 -182273 -137213 -87872 114266 -148958 97494 255457
15242B55457g5030A97754b79617f2532H8469J66340A27087K26779a88305L4674
$$ 255457 -75030 197754 -279617 -62532 88469 254809 127087 353866 -188305 -153631
15232a53631C97098A52680D1425J23610L7636a19080H9843C1270O0260g6086E52417
$$ -153631 397098 152680 41425 165035 202671 -119080 89843 31270 91530 -76086 552417
15220A322079J6617m51582M35003E16760k55261f6261B86303K1715k564C503O9565
$$ 1322079 1338696 887114 1322117 516760 261499 -66261 286303 308018 305454 3503 73068
15209G3068C1102a3887B77246Q1867H57J23655D3240R1804K9748l3872f1716A888
$$ 73068 31102 -13887 277246 359113 857 124512 43240 135044 164792 130920 -61716 1888
15196C385a44818I5369J69479j29537J43148Q244a78072A8374J06306k1192J17873
$$ 3385 -144818 95369 264848 135311 278459 286703 -178072 18374 124680 103488 221361
15185B21361a25108A22792J85933K09420a65963D24431a90216c2451n9398c5904
$$ 221361 -125108 122792 308725 518145 -165963 424431 -190216 -32451 -91849 -35904
15174A31766m0530a66626j11177I0495J5849l7078C3714c7585k1040k29962B94747
$$ 131766 91236 -166626 -277803 90495 106344 69266 33714 -37585 -58625 -288587 294747
15162a39105a8109j41802A54226G4469P8930c2343L622D0851p054M21522C8041
$$ -139105 -18109 -159911 154226 74469 153399 -32343 -28721 40851 33797 455319 38041
15150A30098a18773b1984j27509b3103C54149a17099D56231a64768B03901D6739
$$ 130098 -118773 -21984 -149493 -23103 354149 -117099 456231 -164768 203901 46739
15139B06463i3960A53330J86503j22195E0231c27870B08968p7027h2268A65739
$$ 206463 -93960 153330 339833 217638 50231 -327870 208968 131941 -82268 165739
15128C7602J12021e5740G2500b11615A87983f9827B2354J79424f4519F4518N6629
$$ 37602 149623 -55740 72500 -211615 187983 -69827 22354 201778 -64519 64518 121147
15117A21147E2276e733j01090I3308L38602A44444E3262M1621a84885g0847A08158
$$ 121147 52276 -5733 -106823 93308 431910 144444 53262 94883 -184885 -70847 108158
15105d3221C72130C0023e5117q3973N8074C05722o932c3485A35716R2721o7100
$$ -43221 372130 30023 -55117 -139090 -81016 305722 298790 -33485 135716 228437 161337
15094A61337c7407B08430o896I263J7847K74606n5094j7519m243J8493a27107
$$ 161337 -37407 208430 201534 9263 27110 301716 246622 229103 224860 243353 -127107
15082d7485j68746B90910q0726B3774K3711J85035J088J06837D4842K24525c37118
$$ -47485 -216231 290910 210184 23774 47485 232520 233608 340445 44842 269367 -337118
15070A10201J36769j11655N8232b7539j3365C4623R1404J19901A06406b05527
$$ 110201 246970 135315 193547 -27539 -40904 34623 126027 245928 106406 -205527
15059E682K03335a18014A76459f7590r8180A58587a85759C44126A57298a17476
$$ 5682 209017 -118014 176459 -67590 -165770 158587 -185759 344126 157298 -117476
15048B04753L3359b3877A56171a31186A44472J27858D1957J70823R3156k6979
$$ 204753 238112 -23877 156171 -131186 144472 272330 41957 212780 305936 278957
15038B78957J30056f1118C22357h5706B79438j27246D1432R0216P5663a74137
$$ 278957 409013 -61118 322357 -85706 279438 152192 41432 131648 207311 -174137
15027A05476J20243E3710K48409q4124J10487r2665a63283A61980J69978d0519
$$ 105476 225719 53710 302119 217995 328482 235817 -163283 161980 331958 -40519
15016B04458j7314J4782K17516A66211J23180b1987E14905A48852L6775n0713
$$ 204458 187144 201926 419442 166211 289391 -21987 514905 148852 185627 134914
15006A34914K7730e3148C55068G8667M06968I9444b1276B7714J21750F8902b72844
$$ 134914 162644 -53148 355068 78667 485635 99444 -21276 27714 149464 68902 -272844
14994B00337K38829j46272b86873A14915E3744K7582K68075j16031J599r7475
$$ 200337 439166 292894 -286873 114915 53744 81326 349401 233370 234969 137494
14984A37494J88933j6089L2361j67965D860L5002J42638a12806A32128l7258C5168
$$ 137494 326427 310338 342699 174734 4860 39862 182500 -112806 132128 94870 35168
14972A89963c2517B5304K06373J90836o6654O6629j71635a08678l9558E79468
$$ 189963 -32517 25304 231677 422513 355859 422488 250853 -108678 -148236 579468
14961C90555j33408K19411A44634M33598j79737A2901h769B2706L00263h179C34905
$$ 390555 257147 476558 144634 578232 398495 12901 -8769 22706 322969 -8179 334905
14949A80444R578L16515A42651K77336q2264h352B52771O9685k1566b43198A31750
$$ 180444 190022 506537 142651 419987 337723 -8352 252771 322456 300890 -243198 131750
14937A64150J850D6042a06455K2433E2509N8140J14656j08752J51372A18188K89234
$$ 164150 166000 46042 -106455 -84022 52509 110649 225305 116553 267925 118188 407422
14926D07422o716B7450N03192j72695N4010A62183h7284C48240r833a1951B55427
$$ 407422 400706 27450 530642 357947 411957 162183 -87284 348240 338407 -11951 255427
14914C29751j27675K37918D0676J2477K24869F9532J60967Q1577A07123K89838
$$ 329751 202076 439994 40676 53153 278022 69532 230499 312076 107123 396961
14904C96961j39520K06589I6806M5306J28338R3822N2337A35678n6177M64739
$$ 396961 257441 464030 96806 142112 270450 364272 416609 135678 79501 544240
14894E44240j72722I3233L18472r6546J71669J3879A78183D0596J84318Q6358
$$ 544240 371518 93233 411705 315159 486828 500707 178183 40596 224914 311272
14884C11272L256K60998A9119M59436k5055A78072n6462R9512D8081J3265L12733
$$ 311272 314528 575526 19119 478555 453500 178072 121610 221122 48081 61346 374079
14873C74079A21568N2943o8698D6271M72565k43110R7178A30166P351J19707J70196
$$ 374079 121568 174511 105813 46271 518836 275726 372904 130166 137517 257224 427420
14862D27420p0057D0002N08463B45389n3332L7226K63948B19416K21562r3415
$$ 427420 357363 40002 548465 245389 192057 229283 493231 219416 440978 347563
14852C47563A59131j8922K64385r3082J83969k09499N336l4976A10853K60133
$$ 347563 159131 140209 404594 311512 495481 285982 291318 256342 110853 370986
14842C70986K44389r8864A98749M18503A47359K82979A95796J15690Q4376K3311
$$ 370986 615375 516511 198749 617252 147359 430338 195796 311486 395862 419173
14832D19173A5349J60671l0744K00865O4355j04686K89927A70772L25872B17446
$$ 419173 15349 176020 145276 346141 410496 305810 595737 170772 496644 217446
14821A9750N74726n2818k50575J81668j23852a4748B27416o3776L8269G2334K70366
$$ 19750 594476 541658 291083 472751 348899 -14748 227416 163640 201909 72334 342700
14810C42700K5444A72519L98894m8269j87549J30607j89041K07068j87990M4617
$$ 342700 368144 172519 571413 523144 335595 466202 277161 484229 296239 340856
14800C40856M3626A28734J18761A20759L66052K20291m3001B79071O2674K37185
$$ 340856 384482 128734 247495 120759 486811 707102 664101 279071 341745 578930
14790E78930k85625M1554j37325J20625N05401j21491B85871J01838J72151Q484
$$ 578930 293305 334859 197534 318159 823560 702069 285871 387709 559860 568344
14780E68344k16648j5142p4574K4814K05045A53424K05827R5890m0380M2915q4052
$$ 568344 351696 336554 261980 286794 491839 153424 359251 455141 414761 457676 373624
14769C73624K18915B84854J8757L7149n7195m4864L97476j37574K26151B84417
$$ 373624 592539 284854 303611 340760 283565 238701 636177 498603 724754 284417
14758E41052J70300k95099O352L13219j29706K3513k80376M6581P2627j96112
$$ 541052 711352 416253 422605 735824 606118 629631 349255 395836 468463 272351
14748B72351K25653j98403L38430j89106P9898Q703j94505K80110q9042r9990
$$ 272351 498004 299601 638031 448925 528823 537526 343021 623131 534089 434099
14738D34099J90297k40716Q304N9224j28605K3253J21232K39360B10769K59642
$$ 434099 624396 383680 391984 451208 322603 345856 467088 706448 210769 470411
14728D70411o1088N1151L02758C56420K02796N419k57599K25528J72371J60084
$$ 470411 409323 460474 763232 356420 559216 564635 307036 532564 704935 865019
14718H65019B84653O1979K19754k47545K25168k04713K14203j75953L06792O0713
$$ 865019 284653 346632 566386 318841 544009 339296 553499 377546 684338 745051
14708G45051j85101j99995K48289j80733M43424D31487J55326R2149j18265K27505
$$ 745051 559950 359955 608244 427511 870935 431487 586813 678962 560697 788202
14698G88202q531j37908R0898j65047m1450K10088J53330k24158J36182l26722
$$ 788202 779671 641763 732661 567614 526164 736252 889582 665424 801606 474884
14688D74884Q1536r563K54738J65093D75139M1806L71342j85286L19565l02824
$$ 474884 556420 546857 801595 966688 475139 516945 888287 703001 1022566 719742
14678G19742l55926K45909M00048j60137r4562j19538K39002j67463R8973k75488
$$ 719742 363816 609725 1009773 849636 755074 635536 874538 707075 806048 530560
14668E30560J50253N8454K01261p2134k43895K94554j23012K02416k71321r2018
$$ 530560 680813 739267 940528 868394 624499 919053 796041 998457 727136 635118
14658F35118J7172l0418k1994K20188J63296k27946R9260j2250J44923J18021
$$ 635118 652290 621872 599878 820066 983362 755416 854676 842426 987349 1105370
14648A105370k66323j51403n167K59268J70877k62371J2555m9224K40588j15479
$$ 1105370 839047 687644 682477 941745 1112622 850251 862806 813582 1054170 938691
14638I38691J69916r8885k51464r7158K32082p4771p9413L85976k39779L3567
$$ 938691 1108607 1009722 758258 661100 893182 818411 738998 1124974 885195 918762
14628I18762n1781q5835n0409K3145L17094p8181K38591j21843q7303K6086j14296
$$ 918762 866981 781146 730737 753882 1070976 992795 1231386 1109543 1022240 1048326 934030
14617I34030p4895R7123J54097o9767j4447J58290m04788L10506J58746J42137
$$ 934030 859135 956258 1110355 1040588 1026141 1184431 779643 1090149 1248895 1391032
14607A391032k54903m4472j68219K5927K37371j63746J16060l0414j36262L97458
$$ 1391032 1136129 1091657 923438 949365 1186736 1022990 1139050 1108636 972374 1369832
14597A369832k02858n5086k5842J60103m6760k2800L14039m41122J79006j66065
$$ 1369832 1166974 1111888 1086046 1246149 1199389 1176589 1490628 1049506 1228512 1062447
14587A062447R8064P1993J39879J57881j66137k753J41708m23280N079M3006J23682
$$ 1062447 1160511 1232504 1372383 1530264 1364127 1361374 1503082 1079802 1084881 1127887 1251569
14576A251569J8720K8126l65701P43171l14157J86613p5795Q2017m01008L40224
$$ 1251569 1270289 1298415 932714 1675885 1361728 1548341 1472546 1554563 1153555 1493779
14566A493779k43102M66826l30232J13878k24219K21846j79090M26396j90841
$$ 1493779 1250677 1717503 1387271 1501149 1276930 1498776 1319686 1746082 1555241
14557A555241P6150p3340M98680n39800J61403k51471m7565r5528K67716J2940
$$ 1555241 1631391 1558051 2056731 1516931 1678334 1426863 1379298 1283770 1551486 1564426
14547A564426J79514J33228j4085K1316M4950J41691R8825p5086j09167p8553
$$ 1564426 1743940 1877168 1863083 1884399 1929349 2071040 2169865 2094779 1985612 1907059
14537A907059P2814j93120M15370k96267O68137j07791M32893O3666L8650K07414
$$ 1907059 1979873 1786753 2202123 1905856 2573993 2466202 2899095 2962761 3001411 3208825
14527C208825j74890k7221r6529J046412J459314M415765J0700183K8621591j7228427
$$ 3208825 3033935 3006714 2910185 3956597 5415911 9831676 20531859 49153450 31925023
14518C1925023A1483150m382554C075422A395897o6997J87928J53371N80256l07904
$$ 31925023 11483150 7100596 3075422 1395897 1328900 1516828 1670199 2250455 1942551
14509A942551r264j75115L3620j3038l22028R7565k86018O54384n76161K45551
$$ 1942551 1933287 1758172 1791792 1778754 1456726 1554291 1268273 1922657 1346496 1592047
14499A592047L31475K26572K08626l5328K1410J15834k24692p6523l2400r097
$$ 1592047 1923522 2150094 2358720 2323392 2344802 2460636 2235944 2159421 2127021 2117924
14489B117924K9868P6158R1303L4559L25093j31618j88003L77472n45135K97488
$$ 2117924 2147792 2223950 2315253 2349812 2674905 2543287 2355284 2732756 2187621 2485109
14479B485109j99308K50039j17148K63579j12305J83837J67963m45760J28575
$$ 2485109 2285801 2535840 2418692 2682271 2569966 2753803 2921766 2476006 2604581
14470B604581R5600L47292m39708j50717K42318K40973p2624j53827L46942r9951
$$ 2604581 2700181 3047473 2607765 2457048 2699366 2940339 2867715 2713888 3060830 2960879
14460B960879j5006O2787L69277o94021N62433J14470J16428p12412N73015J44956
$$ 2960879 2945873 3008660 3377937 2683916 3246349 3360819 3477247 2764835 3337850 3482806
14450C482806l1431M3458P6857o4864Q4561j52347K03096O6143j03619o0691J40486
$$ 3482806 3451375 3494833 3571690 3506826 3591387 3439040 3642136 3708279 3604660 3543969 3684455
14439C684455K68379j71086k08639L67373j10985K36807n2852K42410J22389j30702
$$ 3684455 3952834 3781748 3573109 3940482 3829497 4066304 4013452 4255862 4378251 4247549
14429D247549N9443J06752l58528J91160L07192r8324L110J78914m57109M16556
$$ 4247549 4306992 4413744 4055216 4246376 4553568 4455244 4458354 4637268 4180159 4596715
14419D596715l4909J73010L08831j11441j8593R3087L92545l23920J13252Q7507
$$ 4596715 4561806 4734816 5043647 4932206 4913613 5006700 5399245 5075325 5188577 5276084
14409E276084L05750n4427J10762K39598J92592j90057L9155j93689j26446L88650
$$ 5276084 5581834 5527407 5638169 5877767 6070359 5880302 5919457 5725768 5599322 5987972
14399E987972K53117k5967K56540N9562o7680m6649O75634k71742Q093K58054
$$ 5987972 6241089 6215122 6471662 6531224 6463544 6416895 7092529 6820787 6828880 7086934
14389G086934K71894j36577K14358k66167N42909O3191n581j24071M21564k0099
$$ 7086934 7358828 7222251 7436609 7170442 7713351 7776542 7770961 7646890 8068454 8048355
14379H048355J03548K22308J28981j04228N92546j06484P9489M14043N3348j3549
$$ 8048355 8151903 8374211 8503192 8398964 8991510 8885026 8964515 9378558 9431906 9418357
14369I418357J95092K59951L84918k43887J37560K84463l74337M32555N07856
$$ 9418357 9613449 9873400 10258318 10014431 10151991 10436454 10062117 10494672 11002528
14360A1002528K71045K98028L1439K00799J17170N1777J78834L44797K89868O63272
$$ 11002528 11273573 11571601 11603040 11803839 11921009 11972786 12151620 12496417 12786285 13449557
14350A3449557l53075M20432L08766K89591J48737K55672O87156m5277P77354
$$ 13449557 13096482 13516914 13825680 14115271 14264008 14519680 15206836 15161559 15938913
14341A5938913n5598L66954M19835J62274M27911P62037L1675N20126L77688M55204
$$ 15938913 15883315 16250269 16670104 16832378 17260289 18022326 18054001 18574127 18951815 19407019
14331A9407019O91390j98789P78862N52218M35081M31280O61343O04739L21981
$$ 19407019 20098409 19899620 20678482 21230700 21665781 22097061 22758404 23363143 23685124
14322B3685124O84601O07101Q73122L49783O22676Q57250Q05788J081250M16730
$$ 23685124 24369725 24976826 25849948 26199731 26822407 27679657 28485445 29566695 29983425
14313B9983425P03521R20590J026793J137724P08932R53028J387770P87238J257717
$$ 29983425 30686946 31607536 32634329 33772053 34480985 35434013 36821783 37609021 38866738
14304C8866738J394768J329556J329850J451422J018859J744040J617901J953264
$$ 38866738 40261506 41591062 42920912 44372334 45391193 47135233 48753134 50706398
14296E0706398J686635K015921J844575J939946K342942K403685K365618K415730
$$ 50706398 52393033 54408954 56253529 58193475 60536417 62940102 65305720 67721450
14288F7721450L029884K691939L061333L183423L573513L490590L700395M232938
$$ 67721450 70751334 73443273 76504606 79688029 83261542 86752132 90452527 94685465
14280I4685465M392470M119979M611038M967195M907653N795536N731370O590976
$$ 94685465 99077935 103197914 107808952 112776147 117683800 123479336 129210706 135801682
14272A35801682O299521P067913P708215P711048Q116895R332129Q807040R985097
$$ 135801682 142101203 149169116 156877331 164588379 172705274 182037403 190844443 200829540
14264B00829540J0376852J0920629J1227428J1458804J2256958J2233240J2462827
$$ 200829540 211206392 222127021 233354449 244813253 257070211 269303451 281766278
14257B81766278J2081393J2323836J2723577J2456565J1547619J0930506J0354279
$$ 281766278 293847671 306171507 318895084 331351649 342899268 353829774 364184053
14250C64184053Q484348P370215M838584J071584j753416j023007j805699m381032
$$ 364184053 372668401 380038616 384877200 385948784 384195368 383172361 381366662 376985630
14242C76985630n683456n139770q001987q217253j0865380j1271733j1357915
$$ 376985630 371302174 366162404 358160417 349943164 339077784 327806051 316448136
14235C16448136j2794413j2782658j2849508j2848991j2627360j2036091j1541950
$$ 316448136 303653723 290871065 278021557 265172566 252545206 240509115 228967165
14228B28967165j1379663r427583j0530731r781320r314025q945722q168142p776638
$$ 228967165 217587502 208159919 197629188 187847868 178533843 169588121 161419979 153643341
14220A53643341p644444o536533o431064o464390o221865n152532n114048n190768
$$ 153643341 145998897 139462364 133031300 126566910 120345045 115192513 110078465 104887697
14212A04887697l772068m628694m211769m172155l602166l277575l146846k949539
$$ 104887697 101115629 96486935 92275166 88103011 84500845 81223270 78076424 75126885
14204G5126885l238366k507550k659604k279105k843283k292622k069520k004398
$$ 75126885 71888519 69380969 66721365 64442260 61598977 59306355 57236835 55232437
14196E5232437j826240j798416j855511j641082j646138j475240j370187j118916
$$ 55232437 53406197 51607781 49752270 48111188 46465050 44989810 43619623 42500707
14188D2500707j286393j496269j084965j206382j123278j232598n00083q90153
$$ 42500707 41214314 39718045 38633080 37426698 36303420 35070822 34570739 33680586
14180C3680586j332382q01980j158539q39156m49362o21975k19666j275044j056256
$$ 33680586 32348204 31546224 30387685 29548529 29099167 28477192 28257526 26982482 25926226
14171B5926226n29618o84505l64538p08850o68249n85282m24725m16700o38291
$$ 25926226 25396608 24712103 24347565 23638715 22970466 22385184 21960459 21543759 20905468
14162B0905468l20805m16122n99126n83438o0927n25044m83361o77176n3340k22975
$$ 20905468 20584663 20168541 19569415 18985977 18925050 18400006 17916645 17239469 17186129 16963154
14152A6963154n36288m33533l00551k97440j25949n04096l4191l41289m37976
$$ 16963154 16426866 15993333 15692782 15395342 15269393 14765297 14731106 14389817 13951841
14143A3951841m49123q4598j76943m94882N7716l63969j92368k08346l16341r9437
$$ 13951841 13502718 13418120 13241177 12746295 12804011 12440042 12247674 12039328 11722987 11623550
14133A1623550k29255m9083q3800m14504j98796o5147j2768n92218p9594o291
$$ 11623550 11394295 11345212 11261412 10846908 10648112 10582965 10570197 9977979 9898385 9892094
14123I892094k33729l38135l003l19831K013j28021K29447m57092j86006n7689
$$ 9892094 9658365 9320230 9317227 8997396 8999409 8871388 9100835 8643743 8457737 8400048
14113H400048K0106k17936R171j51584o65665N47085m13039J39174m90950L90181
$$ 8400048 8420154 8202218 8211389 8059805 7394140 7941225 7528186 7667360 7176410 7566591
14103G566591n30960K21655o5705l76213N3980j10301j20014J32811k27455l38938
$$ 7566591 7035631 7257286 7191581 6815368 6869348 6759047 6639033 6771844 6544389 6205451
14093F205451L1407p9730o65390Q53955k87348j98046N9620k86080j17578L15254
$$ 6205451 6236858 6157128 5491738 6345693 6058345 5860299 5919919 5633839 5516261 5831515
14083E831515m18116M1040K72092l23827j34768J62358k79635r0785J1801n8998
$$ 5831515 5413399 5454439 5726531 5402704 5267936 5430294 5150659 5059874 5071675 5012677
14073E012677l5869l15643o2525L37065m23021R7794j44400J4357J30856j3072
$$ 5012677 4976808 4661165 4598640 4935705 4512684 4610478 4466078 4480435 4611291 4598219
14063D598219k50764L43234k59280k89381J1156k69282J77138j04780L8371k010
$$ 4598219 4347455 4690689 4431409 4142028 4153184 3883902 4061040 3956260 3994631 3992621
14053C992621j93896j33705J86788k27808n6886N9470O2442j6097l09433p0556
$$ 3992621 3798725 3665020 3851808 3624000 3567114 3626584 3689026 3672929 3363496 3292940
14043C292940K99563k67437j22932K68568l81295M06229j1981k54327L97640m0420
$$ 3292940 3592503 3325066 3202134 3470702 3089407 3495636 3483655 3229328 3626968 3586548
14033C586548m21593J43878J26045n75420N9068J22929J03141k75550L14784k1545
$$ 3586548 3164955 3308833 3434878 2859458 2918526 3041455 3144596 2869046 3183830 3162285
14023C162285j62995l49848L68393j84330J37837l26570n2409J89774J18632l26339
$$ 3162285 2999290 2649442 3017835 2833505 2971342 2644772 2592363 2782137 2900769 2574430
14013B574430k08523O03972l04169n9510K73515j85566K10593l67701J11025k21177
$$ 2574430 2365907 2969879 2665710 2606200 2879715 2694149 2904742 2537041 2648066 2426889
14003B426889K5783j69000L7391J37003L7776k82113q5114o775L4510K40508k49110
$$ 2426889 2452672 2283672 2321063 2458066 2495842 2213729 2128615 2121840 2156350 2396858 2147748
13992B147748J33055m40610j7019K02623K5690J35604k94239K49245l14575J30189
$$ 2147748 2280803 1840193 1823174 2025797 2051487 2187091 1892852 2142097 1827522 1957711
13982A957711O9044M3060j49992j57862J49215m84018P2933L62445j43454j10619
$$ 1957711 2026755 2069815 1919823 1761961 1911176 1427158 1500091 1862536 1719082 1608463
13972A608463J4289L6712k3088N53111o1552j96764l28846l30589m10822N55139
$$ 1608463 1622752 1659464 1636376 2189487 2127935 1931171 1602325 1271736 860914 1416053
13962A416053K751173P501916K8005584M68344A6928877H370038l511170j138790
$$ 1416053 4167226 11669142 39674726 40143070 16928877 8370038 4858868 3720078
13954C720078o78293k70492L59487j00538M290l247r5625o59426o4998j34161
$$ 3720078 3041785 2771293 3130780 3030242 3034532 3031285 2935660 2276234 2211236 2077075
13944B077075j67768k61754K26552l0551K60914l07298M30475m62361M50889j37996
$$ 2077075 1909307 1647553 1874105 1843554 2104468 1797170 2227645 1765284 2216173 2078177
13934B078177l2645k92092j57661J77505l85858R1931J28405J71406k37651K21770
$$ 2078177 2045532 1753440 1595779 1773284 1387426 1479357 1607762 1779168 1541517 1763287
13924A763287l1632M6895j39916O2797M6258J45568l41267l84225J12411J24403
$$ 1763287 1731655 1778550 1638634 1701431 1747689 1893257 1551990 1167765 1280176 1404579
13914A404579j09658O1828R6055k05666l1134J90424j58870L30525j93744q2649
$$ 1404579 1294921 1356749 1452804 1247138 1216004 1406428 1247558 1578083 1384339 1301690
13904A301690J5451K6535O0968K3901k46230J72481p7480j89460K01927L72187
$$ 1301690 1317141 1343676 1404644 1428545 1182315 1354796 1277316 1087856 1289783 1661970
13894A661970l48757j10623J08289k82623K89313P0715l34677J26843j52104L91124
$$ 1661970 1313213 1202590 1310879 1028256 1317569 1388284 1053607 1180450 1028346 1419470
13884A419470k9569k64399N8631m417k42706J60873R5954k66216J22146r2881
$$ 1419470 1389901 1125502 1184133 1179716 937010 1097883 1193837 927621 1049767 956886
13874I56886R3027p4543J48605J08167m05625L18816J74146q0277n01323M42749
$$ 956886 1049913 975370 1123975 1232142 826517 1145333 1319479 1239202 737879 1180628
13864A180628l4812j26671M5839k06186L5432J16178q1087p1877J968K16233m2428
$$ 1180628 1145816 1019145 1064984 858798 894230 1010408 929321 857444 859412 1075645 1033217
13853A033217J0663k6043j87485K32395m3944q8446m6944k89288K09005M07747
$$ 1033217 1043880 1017837 830352 1062747 1018803 930357 883413 594125 803130 1210877
13843A210877l16761K78257l76617J61942j005J06274J67522j33239k24013J66474
$$ 1210877 894116 1172373 795756 957698 956693 1062967 1230489 1097250 873237 1039711
13833A039711l59414L90071l49194L6979L03416Q820k95943Q8814J1414N4530
$$ 1039711 680297 1070368 721174 758153 1061569 1070389 774446 863260 874674 929204
13823I29204k95847O6529j65428N36150M27070G10915L89213j88149l36176M926
$$ 929204 633357 699886 534458 1070608 1497678 710915 1100128 911979 575803 580729
13813E80729J35979K67589k66601J22976m0574J45710R464l9371R0170l75620
$$ 580729 716708 984297 717696 840672 800098 945808 955272 915901 1006071 630451
13803F30451K83328l10584R1355q1150M15122l56335J85252p4866j98168J93027
$$ 630451 913779 603195 694550 613400 1028522 672187 857439 782573 584405 777432
13793G77432o7709K35330l11201m9809o6386J63801r5304K9961j08611M81287
$$ 777432 709723 945053 633852 584043 517657 681458 586154 616115 507504 988791
13783I88791k71952k06972J69760K53452L38926D31666L91447q4408N2249j91719
$$ 988791 716839 509867 679627 933079 1272005 431666 823113 738705 790954 599235
13773E99235j55765K57729j12252L62363k47580j36016P4882j77554L6333L55334
$$ 599235 443470 701199 588947 951310 703730 567714 642596 465042 501375 856709
13763H56709k32619l9763J85310q1056P3359j11487K5154M9598k05843N1489j19341
$$ 856709 624090 584327 769637 688581 761940 650453 675607 725205 519362 570851 451510
13752D51510J3365J59634J24288M4649j54266J95402k19492o8014J96636k22044
$$ 451510 464875 624509 748797 793446 639180 834582 615090 547076 743712 521668
13742E21668j10542K4134L76094j94059j4307J44171k97195K07679q1233K20815
$$ 521668 411126 435260 811354 617295 602988 747159 449964 657643 576410 797225
13732G97225j17365k4366P4955l54059Q8052J95348B97242K83986A74096M52470
$$ 797225 679860 655494 730449 376390 464442 659790 297242 581228 174096 626566
13722F26566J58256j29629q5776j03068A68840J97002n6679K35612j0792k37826
$$ 626566 784822 655193 569417 466349 168840 365842 309163 544775 533983 296157
13712B96157J40586j04482L08522A44753L52602n9826r8483l9115M27105k88515
$$ 296157 436743 332261 640783 144753 497355 437529 339046 299931 727036 438521
13702D38521p7381J43605j0430J04479k9651k6762j19358J50810k05327k4204
$$ 438521 361140 504745 494315 598794 569143 542381 423023 573833 368506 344302
13692C44302n5432L18250j24335B04706J19560q0966J03624K99332k20007r1053
$$ 344302 288870 607120 482785 204706 324266 243300 346924 646256 426249 335196
13682C35196J02757p2487K77351k49400K21824m4055j03946J05369j84026A25187
$$ 335196 437953 365466 642817 393417 615241 571186 467240 572609 388583 125187
13671B14148m379Q3468M77144j25290j18888j18097K5150j74415k4821L4116M3680
$$ 214148 209769 293237 770381 645091 526203 408106 433256 258841 234020 268136 311816
13660C11816J74413n1841J29832B28571J68347J86857A58429K18662J62563j47771
$$ 311816 486229 434388 564220 228571 396918 583775 158429 377091 539654 391883
13650C91883j10359J15993K18923a07233C79652A15283M40284B30343J46543M9353
$$ 391883 281524 397517 616440 -107233 379652 115283 555567 230343 376886 426239
13640D26239k364J43237B68968L27177k63801m3432n1711J63310c1356D79179
$$ 426239 423875 567112 268968 596145 332344 288912 237201 400511 -31356 479179
13629C86683P4104j81585B9935o387K89885J74818r898A52625L92598j20592O0157
$$ 386683 460787 279202 29935 23548 313433 488251 478353 152625 545223 424631 484788
13618D84788k23212J25909o5771K63485k51486J58696j52187M7037j79374L09539
$$ 484788 261576 387485 321714 585199 333713 492409 340222 387259 207885 517424
13608E17424g731j37269E29638j19641F6559M1677J39474k7574R2404k7888k682
$$ 517424 -7731 -145000 529638 409997 66559 108236 247710 220136 312540 284652 281970
13597B81970J50447o1919A38520L21572k2507l74j99145r853L66508B51486L0781
$$ 281970 432417 370498 138520 460092 437585 437211 238066 228213 594721 251486 282267
13586B82267J6593j8326d5638B48340G6100j874K23559J12642o1809B2348M26855
$$ 282267 298860 280534 -45638 248340 76100 74226 297785 410427 348618 22348 449203
13575D49203r4764j657m4195J96605D2066L75398J67565I7223M02412j69053K01686
$$ 449203 354439 352782 308587 505192 42066 417464 585029 97223 499635 330582 532268
13564E32268j83634j1515Q2211n4665j65282I4341L70183q2167r0659j00672J9454
$$ 532268 348634 337119 419330 364665 199383 94341 464524 382357 291698 191026 210480
13553B10480J22182a36334D77826Q3736p1964k3980B3218A0294K57290N89875
$$ 210480 332662 -136334 477826 561562 489598 465618 23218 10294 267584 857459
13543H57459l24690A94649C7993M62411j25050K6016B2542K59619p141A32151
$$ 857459 532769 194649 37993 500404 375354 401370 22542 282161 275020 132151
13532A48228M46445A14973m8152J58244l4412K74512B03343J99233B00645K7338
$$ 148228 594673 114973 66821 225065 190653 465165 203343 402576 200645 227983
13522B27983J92397j37006K80610B05381P8319J66363A88396J02727K6962M0598
$$ 227983 420380 283374 563984 205381 283700 450063 188396 291123 318085 358683
13512C58683A51229p4552K28563O6344A26217q176J73501r135k8918J53374h9673
$$ 358683 151229 76677 305240 371584 126217 118041 291542 282407 253489 406863 -89673
13500D56257n9283f1871B73852K09917A62284g7524C49601N659H004Q4664K59451
$$ 456257 396974 -61871 273852 483769 162284 -77524 349601 355260 8004 92668 352119
13489C52119L9948j90529D570K43357J7622a09767g7B59993J79682k13370J43088
$$ 352119 392067 201538 4570 247927 265549 -109767 -77 259993 439675 226305 369393
13478C69393A42651O0891j0111K134c1888B9775J93644c8818n4107C63184m3068
$$ 369393 142651 203542 193431 195565 -31888 29775 223419 -38818 -92925 363184 320116
13467C20116A42598J16288a65959c6820B43991a39306E1841B2811C232J95204
$$ 320116 142598 258886 -165959 -36820 243991 -139306 51841 22811 3232 198436
13457A98436C0540J57068Q3107g8172B71106D9822k4693N93607B76147G6146K92303
$$ 198436 30540 187608 270715 -78172 271106 49822 25129 618736 276147 76146 368449
13446C68449i8894B30767m6836J74921D7066L41711G9835J79400K9698O4469j46740
$$ 368449 -98894 230767 183931 358852 47066 388777 79835 259235 288933 353402 206662
13435B06662a00503B4212J25035B7852J36664b59004a9454E92860e2670C6970
$$ 206662 -100503 24212 149247 27852 164516 -259004 -19454 592860 -52670 36970
13424A46821J05317G3414K65386B8793J44807e6411B45315j20091K0124K83511
$$ 146821 252138 73414 338800 28793 173600 -56411 245315 125224 145348 428859
13414D28859m6455j65387k4093A7476K00345K3997o8102J75156P6320A57843e7295
$$ 428859 382404 217017 192924 17476 217821 241818 173716 348872 425192 157843 -57295
13402h8480B34785J76432A94356C522K33625a29096a761B97349K4025p0932a44857
$$ -88480 234785 411217 194356 3522 237147 -129096 -1761 297349 321374 250442 -144857
13390A25662L01550G9955J67979A16280j6122O3951a60949c3063C46982A05077
$$ 125662 427212 79955 247934 116280 100158 164109 -160949 -33063 346982 105077
13379A52055c0024C80715C1549N4541A1369M18470j67892b22597f9465a0706C46460
$$ 152055 -30024 380715 31549 86090 11369 429839 261947 -222597 -69465 -10706 346460
13367C28793J0885b88100A3660m306J4678L83473I2226K05341k1017F6819K86211
$$ 328793 339678 -288100 13660 9354 24032 407505 92226 297567 276550 66819 353030
13356C53030A65135b0966p7977e493A70986D4625L50609j60518l5913I7545J6034
$$ 353030 165135 -20966 -98943 -5493 170986 44625 395234 234716 198803 97545 113579
13345A13579A7099J34089J41736I1278J43218M9274j07965M3034r7325J25718
$$ 113579 17099 151188 292924 91278 234496 283770 175805 218839 121514 247232
13335B47232K01831A82120F2458M7423P2839G9717Q4091B4390J16640J49846G9331
$$ 247232 449063 182120 62458 109881 182720 79717 163808 24390 141030 290876 79331
13323i69j9907G7423K80944A21510c3919B69448f2118B06441B3837J47420O6803
$$ -969 -20876 77423 358367 121510 -33919 269448 -62118 206441 23837 171257 238060
13312B38060J08235q5888F4145J73578J3094J15654n5499n7346r9341p2567M13656
$$ 238060 346295 260407 64145 237723 250817 366471 310972 253626 154285 81718 495374
13301D95374A79987b39715B8490J08864J98767p4884A01858M4296J33669n0035
$$ 495374 179987 -239715 28490 137354 336121 261237 101858 146154 279823 229788
13291B29788N8684k6638p0172r0982J89634j8375a98925H6365a6330C10948M4476
$$ 229788 288472 261834 191662 100680 290314 271939 -198925 86365 -16330 310948 355424
13280C55424n4379a53578A04593m6932J16025b39302B16816q6496b2756j18745
$$ 355424 301045 -153578 104593 57661 173686 -239302 216816 130320 -22756 -141501
13270a41501E96994B28525b4146A42936o7644a37884A21134C4543J19701j4793
$$ -141501 596994 228525 -24146 142936 75292 -137884 121134 34543 154244 139451
13260A39451F4369C0100M16698f2377k37322e3937C0328b21470a5504E9066K60782
$$ 139451 64369 30100 446798 -62377 -299699 -53937 30328 -221470 -15504 59066 319848
13249C19848H9014h401j34002A45210J01804O1082F7246Q4093h0197E6697J53424
$$ 319848 89014 -8401 -142403 145210 247014 308096 67246 151339 -80197 56697 210121
13238B10121L6105q4737b8617r5751E3622N9060e1304C8551a5636k10509B46900
$$ 210121 246226 161489 -28617 -124368 53622 112682 -51304 38551 -15636 -226145 246900
13226e8101h700C52932A52198f1721C31019n4464a53684o8784E1611J73946H0011
$$ -58101 -8700 352932 152198 -61721 331019 276555 -153684 -222468 51611 225557 80011
13214B13820I2824i280C57165a31802E8790a47477A0273d4523D2991K82377G9754
$$ 213820 92824 -9280 357165 -131802 58790 -147477 10273 -44523 42991 325368 79754
13202A89200a35838G9304a68354D3827A5025R371b1965B36829c87409h6597B01650
$$ 189200 -135838 79304 -168354 43827 15025 24396 -21965 236829 -387409 -86597 201650
13190B2297J48920B4162N0397D020a46874A80251J95000D3455K25704j22229A1887
$$ 22297 171217 24162 74559 4020 -146874 180251 375251 43455 269159 146930 11887
13178B63228b69062B03062a41587A13927J96478j02807I0513a74131C00897H4392
$$ 263228 -269062 203062 -141587 113927 310405 207598 90513 -174131 300897 84392
13167b6929D625J63988A3801a71428G5813d6396B81174r5237c8615A86642p0097
$$ -26929 4625 168613 13801 -171428 75813 -46396 281174 185937 -38615 186642 116545
13156A16545G016M7744K62093c9350A94241J6754a26169A23850J43225o3797K91555
$$ 116545 7016 54760 316853 -39350 194241 210995 -126169 123850 267075 203278 494833
13145D94833a18142C23350d1643A21019Q4459J18589A59994b60112A91093a00612
$$ 494833 -118142 323350 -41643 121019 205478 324067 159994 -260112 191093 -100612
13134D35439a8700B54893J2587A23554a59932A69649R930M2198m6113q4508J07325
$$ 435439 -18700 254893 267480 123554 -159932 169649 179579 221777 175664 91156 198481
13123A98481c9643k15338B54255g5907C18257C2096Q160b52548f7068q0659O8547
$$ 198481 -39643 -254981 254255 -75907 318257 32096 40256 -252548 -67068 -147727 -79180
13112g9180B13070Q5018b0695j3546o7239B67551f5946A19447b46591C6986J27212
$$ -79180 213070 298088 -20695 -34241 -101480 267551 -65946 119447 -246591 36986 164198
13101A64198a24377C10694j35758a39807C60600q6313n4266n847A04746D5959
$$ 164198 -124377 310694 174936 -139807 360600 274287 220021 214174 104746 45959
13090B0343K9034K0469g2347C04044j30301b4546j85108A84898n8428J65493i6528
$$ 20343 49377 69846 -72347 304044 173743 -24546 -209654 184898 126470 291963 -96528
13078a37384I1481a94081C77983A79932R0237A4763N1749K0836f691j3222o2639
$$ -137384 91481 -194081 377983 179932 270169 14763 66512 87348 -6691 -19913 -82552
13067h2552c8111J5817p156j12424C8567L24336J6776A7466g7384k56321j6689
$$ -82552 -38111 -22294 -29450 -141874 38567 362903 379679 17466 -77384 -333705 -350394
13056c50394A60624a00406A53243l9174b77105R2788j35980B39069H2277Q0993
$$ -350394 160624 -100406 153243 114069 -277105 -184317 -320297 239069 82277 163270
13046A63270c27078A53012C68N9124K31871A33937A0621K07604g3398A79977J35304
$$ 163270 -327078 153012 368 59492 291363 133937 10621 218225 -73398 179977 315281
13035C15281a02058A63049a70742H4287b03470N2461A12139e0322B00708o5481
$$ 315281 -102058 163049 -170742 84287 -203470 -151009 112139 -50322 200708 135227
13025A35227J12524a09094A65186P7885H2715J9963J01003L683a38827H4142a26931
$$ 135227 247751 -109094 165186 243071 82715 102678 203681 207364 -138827 84142 -126931
13013H2106i6687C15082j22269a50433B166P0563d3413A03601g8418A06706J4442
$$ 82106 -96687 315082 192813 -150433 2166 72729 -43413 103601 -78418 106706 121148
13002A21148J4420J57275A20215g1892A83559D9952i2931l9686I4391K3387J39526
$$ 121148 135568 292843 120215 -71892 183559 49952 -92931 -132617 94391 117778 257304
12991B57304n0025B5415J62638C5K07595o4778j6410K11462a20063C7339J78791
$$ 257304 207279 25415 188053 35 207630 142852 126442 337904 -120063 37339 216130
12980B16130d0116H4255R0858k2073d0006l5232A868e5939B86387l0740a56282
$$ 216130 -40116 84255 175113 153040 -40006 -75238 1868 -55939 286387 255647 -156282
12968B16969m8727G0909O9173o410C1082d5439a1400A53708f2679A47015d8816
$$ 216969 168242 70909 140082 133672 31082 -45439 -11400 153708 -62679 147015 -48816
12956A34776b06331C80091B9025K1148J56039j1875a56731G1540B6122K73426
$$ 134776 -206331 380091 29025 50173 206212 194337 -156731 71540 26122 299548
12946B99548f581j13857J9844B21334L4763a39870N6047b7155A77320J37904b04044
$$ 299548 -6581 -120438 -100594 221334 256097 -139870 -83823 -27155 177320 315224 -204044
12934A26488h9961A72983J20157a11618O222F3690l278f2781m385p6300d6706
$$ 126488 -89961 172983 293140 -111618 -105396 63690 60412 -62781 -67166 -143466 -46706
12922c0298A54082o2478a63883j63400A6905K00238a22029d0377B68696D16i7324
$$ -30298 154082 91604 -163883 -327283 16905 217143 -122029 -40377 268696 416 -97324
12910a1130A10960a09636C58675A20672b79288J03505j9172e3918q4692d3848
$$ -11130 110960 -109636 358675 120672 -279288 -175783 -194955 -53918 -138610 -43848
12899B57671c715j43009O0845B74016a28477I6712Q6909J53699A45496h850A24640
$$ 257671 -3715 -146724 -85879 274016 -128477 96712 183621 337320 145496 -8850 124640
12887a52153o4181G176a69105H7139J91836o8370E4946b3782G4673Q5998D4564
$$ -152153 -216334 7176 -169105 87139 278975 210605 54946 -23782 74673 160671 44564
12875c21364B10886b9583a4602B49064A23584i2908H6787b59650a07058B68972
$$ -321364 210886 -29583 -14602 249064 123584 -92908 86787 -259650 -107058 268972
12864b55569F1118A0774c8532G7977J04229J6070c35592c5804A96411b53633Q6325
$$ -255569 61118 10774 -38532 77977 182206 198276 -335592 -35804 196411 -253633 -167308
12853a67308P1885M5168B6852J03107B1337a56682K9682A15185b89408J9348i1174
$$ -167308 -95423 -50255 26852 129959 21337 -156682 -127000 115185 -289408 -270060 -91174
12841e7752I24K47774B3065J00511F0866R066a0938I2236C9837K18677J6649A13698
$$ -57752 924 248698 23065 123576 60866 69932 -10938 92236 39837 258514 275163 113698
12828E6593Q6207c7483C6683J5115f5611B31159J5662r0033J69191a95114B20814
$$ 56593 142800 -37483 36683 51798 -65611 231159 246821 156788 325979 -195114 220814
12816C18565A42931L0339f4291F553J47702K66782b5242B3324R7807J01390o486
$$ 318565 142931 173270 -64291 6553 154255 421037 -25242 23324 121131 222521 216035
12805B16035D2676K4710J22284P0544A23501J41654a1330A6093a44776m7075D06986
$$ 216035 42676 67386 189670 260214 123501 265155 -11330 16093 -144776 -191851 406986
12793d01143A29309e6274m7656A48979h4327A489b65856l0242A26977d40418A30079
$$ -401143 129309 -56274 -103930 148979 -84327 1489 -265856 -296098 126977 -440418 130079
12781a06464k70088K5966a2220B31214c77A5668c8630c818A80510D6661a74855
$$ -106464 -376552 -350586 -12220 231214 -377 15668 -38630 -3818 180510 46661 -174855
12769b30542E8995a75963O5067j9833j55844i7469m930H539f580B91132b8746
$$ -230542 58995 -175963 -110896 -130729 -286573 -97469 -102399 8539 -6580 291132 -28746
12757e6774r6575j33913A951R3444a44571O2938A62501a04048l3073A85620d0307
$$ -56774 -153349 -287262 1951 95395 -144571 -81633 162501 -104048 -137121 185620 -40307
12745A21605J21382D6832P3038h5727L9808a2731A06590J00304O5823m9323q5172
$$ 121605 242987 46832 119870 -85727 -45919 -12731 106590 206894 272717 223394 138222
12734A38222F7675K16371E4284f667A51333M5058f2616j09728B85422e8624p775
$$ 138222 67675 284046 54284 -6667 151333 196391 -62616 -172344 285422 -58624 -66399
12723f6399P947o3832H3746a16875A16410J27290D1751P4043C0525M9322a04023
$$ -66399 -58452 -122284 83746 -116875 116410 243700 41751 115794 30525 79847 -104023
12711A28947c6402j17204B77362A08006K9661o4882J17230F5759a5605B54318
$$ 128947 -36402 -153606 277362 108006 137667 72785 190015 65759 -15605 254318
12700f1681k5759F247J05408K7393a85998Q4573n8906R525B9466M5226L851K22275
$$ -61681 -87440 6247 111655 139048 -185998 -101425 -160331 -150806 29466 74692 78543 300818
12688C00818r6179i5124j58162R1631g4929D684J37718N4038q0838a7090A77510
$$ 300818 204639 -95124 -253286 -161655 -74929 4684 142402 196440 115602 -17090 177510
12676B95584C5895P5666h3117A65203N8430j01099b70453R3770B69062n5465C1531
$$ 295584 35895 111561 -83117 165203 223633 122534 -270453 -176683 269062 213597 31531
12664a04854A24207i6434B83307q1492A1737d3337F7914g1147C3617e6924B24842
$$ -104854 124207 -96434 283307 201815 11737 -43337 67914 -71147 33617 -56924 224842
12652h7932G9883C9573K47439h3024C46742f5650F498h3421a4859I687K08178
$$ -87932 79883 39573 287012 -83024 346742 -65650 6498 -83421 -14859 9687 217865
12641B17865A8784L9845a18509A01546J65079c33515c9157j03760C0532a08425
$$ 217865 18784 58629 -118509 101546 266625 -333515 -39157 -142917 30532 -108425
12630b7133c468j0155B98326A02286J8097J86726M8468a22414k0344A43572J0678
$$ -27133 -3468 -13623 298326 102286 120383 307109 355577 -122414 -142758 143572 154250
12619A54250l7260K7015d88C4093a0823a040k37549A49389j5746R5220c4563k22174
$$ 154250 116990 144005 -488 34093 -10823 -1040 -238589 149389 133643 228863 -34563 -256737
12607b56737D82970a59001A63576L79677A10626l905b11073h5065E4782K34642
$$ -256737 482970 -159001 163576 543253 110626 106721 -211073 -85065 54782 289424
12597B89424b64399A2864K40875j9723a47544B13435b09114D5611J61014J35301
$$ 289424 -264399 12864 253739 234016 -147544 213435 -209114 45611 206625 341926
12587C41926a78542N208A77564n7292b06035B43048d0316B15037q8539o28b13607
$$ 341926 -178542 -173334 177564 120272 -206035 243048 -40316 215037 126498 125870 -213607
12575B07949B7660a53363A1596b24847C6104K7227K79765e7130j7084D47757j01696
$$ 207949 27660 -153363 11596 -224847 36104 63331 343096 -57130 -74214 447757 346061
12564C46061b93653F1953a9230j37650A40160c89138i6419B38343H2814J00659
$$ 346061 -293653 61953 -19230 -156880 140160 -389138 -96419 238343 82814 183473
12554A83473n9987I985J2196f6402k9460C31937i3857g885G2808d0886B49855
$$ 183473 123486 9985 22181 -66402 -95862 331937 -93857 -7885 72808 -40886 249855
12542A56169l6842h0767l47282a78479A83367Q3112N9598F182P8986b2715j64282
$$ 156169 119327 -80767 -428049 -178479 183367 266479 326077 6182 85168 -22715 -186997
12531a86997d944n8247D1970a46984M9429A14367c0366m1701o0646c2578k55608
$$ -186997 -4944 -63191 41970 -146984 -97555 114367 -30366 -72067 -132713 -32578 -288186
12520b88186N5844H1673j8789b07610k3876E5291a63605c1354A1575k555c02257
$$ -288186 -232342 81673 62884 -207610 -231486 55291 -163605 -31354 11575 9020 -302257
12508A4193b37413C49843d9584B0325K10959c801k6849I6933a14368C75347j61005
$$ 14193 -237413 349843 -49584 20325 231284 -3801 -30650 96933 -114368 375347 214342
12497B14342E1118d319q6561r7077A99389J5929p8767J04627a50478B2260L06928
$$ 214342 51118 -4319 -90880 -187957 199389 215318 136551 241178 -150478 22260 329188
12486C29188A9228d96101a82260F1957J51900k786b07008E2642i3905E1781J60850
$$ 329188 19228 -496101 -182260 61957 213857 211071 -207008 52642 -93905 51781 212631
12475B12631C7586b1353F3926e833j94017b1835l2858o8576A3605J94204a12754
$$ 212631 37586 -21353 63926 -5833 -199850 -21835 -54693 -123269 13605 207809 -112754
12463E7042e231F6596b89168A13966B8786J06958m5459N484i7832m6811e6672
$$ 57042 -5231 66596 -289168 113966 28786 135744 90285 95769 -97832 -144643 -56672
12451D1942J82085L4814a54195G4177a29401N6764B73578g6449e816j14850J6124
$$ 41942 224027 258841 -154195 74177 -129401 -72637 273578 -76449 -5816 -120666 -104542
12440a04542B15265r9068e5583B14797l346C584K2095K3810A4468J13688L6088
$$ -104542 215265 116197 -55583 214797 211451 3584 25679 49489 14468 128156 164244
12429A64244b88687H396J36615K11366a49622A82529G0619b10746B4041J15575
$$ 164244 -288687 8396 145011 356377 -149622 182529 70619 -210746 24041 139616
12419A39616C3691f8241j83926I8724D4404a64439a9218H6657f8823A703J60061
$$ 139616 33691 -68241 -252167 98724 44404 -164439 -19218 86657 -68823 1703 161764
12408A61764D2158A3086J70494a3070J480B9009M02434b86770g7533k3686A61352
$$ 161764 42158 13086 183580 -13070 -11590 29009 431443 -286770 -77533 -101219 161352
12396c91167a19843E282L43745c7817r5053j76055F6426K2071b68043B977e7804
$$ -391167 -119843 5282 349027 -37817 -132870 -308925 66426 88497 -268043 2977 -57804
12384A33620h0935c2164q7198L6956F1534A05Q1581J55472a63762a2864k46199
$$ 133620 -80935 -32164 -119362 -82406 61534 105 81686 237158 -163762 -12864 -259063
12373b59063g4266A79206b2481C14066F6442a38274k01381H2070a15642j45225
$$ -259063 -74266 179206 -22481 314066 66442 -138274 -339655 82070 -115642 -260867
12363b60867a8849C0894l235M2387a06375H990J13427D6215c3220n879G2094L060
$$ -260867 -18849 30894 27659 70046 -106375 8990 122417 46215 -33220 -39099 72094 75154
12351G5154b59421c3775c407G6321b0295H8899l1353a62629j15160A99640A8476
$$ 75154 -259421 -33775 -3407 76321 -20295 88899 57546 -162629 -277789 199640 18476
12339f465p8985B02141H0426K1167d3053k8009K4853a6656B52163a08011d3116
$$ -6465 -85450 202141 80426 101593 -43053 -71062 -46209 -16656 252163 -108011 -43116
12327B00846a50232A10609a48533E0241K23294f01172a21647A17847a05519A23655
$$ 200846 -150232 110609 -148533 50241 273535 -601172 -121647 117847 -105519 123655
12316a09005J7532A11920E0803B75b21770I6737a3123E43928i7743C3364J49095
$$ -109005 -91473 111920 50803 275 -221770 96737 -13123 543928 -97743 33364 182459
12305A82459G0164d03482g1022d133A09265L8625h0543j28131g5119l2839j34748
$$ 182459 70164 -403482 -71022 -4133 109265 147890 -80543 -208674 -75119 -107958 -242706
12294b42706A21225J53409j19354a874k57903G0984a72479j30431C45824G5151
$$ -242706 121225 274634 155280 -1874 -259777 70984 -172479 -302910 345824 75151
12283A34988B5094c1120J3078o3764j06237C51967A44P2634e9663O317a3686A43956
$$ 134988 25094 -31120 -18042 -81806 -188043 351967 144 72778 -59663 -53346 -13686 143956
12270A14820M5703c54331E435a46213L9066A90733E6785J43779F0103M73577C7728
$$ 114820 160523 -354331 5435 -146213 -107147 190733 56785 200564 60103 533680 37728
12258A45198A2580b7988B79081c04408J33980h3645A15824O4393C3050N01699
$$ 145198 12580 -27988 279081 -304408 -170428 -83645 115824 180217 33050 534749
12248E34749B44708I5604b76359H9176c1496B39870d6172D13136j48611a8631
$$ 534749 244708 95604 -276359 89176 -31496 239870 -46172 413136 264525 -18631
12237a38365k01291J27459B80908H0908A9684J23394n6569Q0569b20346A84880
$$ -138365 -339656 -212197 280908 80908 19684 143078 86509 167078 -220346 184880
12226b5851J673C00588r7151P741O6478A6331a65117B05530d1990a6597m1590
$$ -25851 -24178 300588 203437 211178 277656 16331 -165117 205530 -41990 -16597 -58187
12215e8187B2429b8399j01290I1800a82091D9874g6401A72030c2375B31824f5513
$$ -58187 22429 -28399 -129689 91800 -182091 49874 -76401 172030 -32375 231824 -65513
12203A2661K02127G2576C0279O3786n33N1034O9311G0168R824h2537A61275k3784
$$ 12661 214788 72576 30279 94065 93532 144566 213877 70168 79992 -82537 161275 137491
12191A37491k5591K02996j20607D2536M9141j0921M251K47444b09214D13221A30922
$$ 137491 111900 314896 194289 42536 91677 80756 85007 332451 -209214 413221 130922
12179H9318a24851B64106C2597M9985a7354C49052B1253K9523q130L53525A27118
$$ 89318 -124851 264106 32597 82582 -17354 349052 21253 50776 42646 396171 127118
12167I5789A2458J67328a59356B31993P4856B1765i9339p3C47655n1910c43437
$$ 95789 12458 179786 -159356 231993 306849 21765 -99339 -99412 347655 295745 -343437
12155a9577k22674f3961F077J10638O3184P1440a0004A50002j706d8158I2726
$$ -19577 -242251 -63961 6077 116715 179899 251339 -10004 150002 148296 -48158 92726
12143A60200d6577B3812M1995a92133B44704L3117J38586C1343a29815B86290
$$ 160200 -46577 23812 65807 -192133 244704 277821 416407 31343 -129815 286290
12132g8516A82986g6720B50035d1642k06753F5400h2528A0517c3821A23753m1798
$$ -78516 182986 -76720 250035 -41642 -248395 65400 -82528 10517 -33821 123753 81955
12121H1955a32691j6885A4425d4208a5034A13645a31067A89138N6842m339h6145
$$ 81955 -132691 -149576 14425 -44208 -15034 113645 -131067 189138 245980 241641 -86145
12109A46696a86933q5781D2047R6666C1258K21078k0534n2310O7674R2086A66922
$$ 146696 -186933 -272714 42047 138713 31258 252336 231802 179492 247166 339252 166922
12097c20776C8750J8438b64508h3490D6929Q0974K1278d0381A6774a7881p4090
$$ -320776 38750 57188 -264508 -83490 46929 127903 149181 -40381 16774 -17881 -91971
12086i1971j46984A63973G4340C6730g0733A02075a04581c7648C22590A27714
$$ -91971 -238955 163973 74340 36730 -70733 102075 -104581 -37648 322590 127714
12075A88810b13542R9253A35737J69863i1580B69248H1946f2242A22516a80318
$$ 188810 -213542 -114289 135737 305600 -91580 269248 81946 -62242 122516 -180318
12064B4205R9911l0416c4297a0894j20756m4055B06596g7739A51245b85151I2204
$$ 24205 124116 93700 -34297 -10894 -131650 -175705 206596 -77739 151245 -285151 92204
12052C4379M7748C602J95864J28845J284988P46782D96612B23544A06373a24368
$$ 34379 82127 3602 199466 328311 1613299 2360081 496612 223544 106373 -124368
12041C1214K21609J0838b87970A94292j1984E5241J25693k5552G1679K9743L43062
$$ 31214 252823 263661 -287970 194292 182308 55241 180934 155382 71679 101422 444484
12030D44484d7841K3192m83725B51725g0362m2130d8796E8267g0373j14690i1597
$$ 444484 -47841 -24649 -508374 251725 -70362 -112492 -48796 58267 -70373 -185063 -91597
12018E692f2731o1616A4105J00817b51A59099c7364p7916N5658l1632N842P67
$$ 5692 -62731 -124347 14105 114922 -251 159099 -37364 -115280 -59622 -91254 -85412 -84645
12006h4645B67756G8142J11116c11867J17285d8972a3650A84866h0772B66495
$$ -84645 267756 78142 189258 -311867 -194582 -48972 -13650 184866 -80772 266495
11995b33455l6104i2762I7355a20079A2608d0409G5203J93558A14479a91646B644
$$ -233455 -269559 -92762 97355 -120079 12608 -40409 75203 268761 114479 -191646 2644
11983b0323D97468a58012b5923B0699c93622a71029A57686K0378H6850b9725A31200
$$ -20323 497468 -158012 -25923 20699 -393622 -171029 157686 178064 86850 -29725 131200
11971g9656A49807J43489a96736R2577B87595c36866o2990A64673b26592A92216
$$ -79656 149807 293296 -196736 -104159 287595 -336866 -399856 164673 -226592 192216
11960A61127d5177A59743h5327o8941B0200a89860K9800D1077a84794m2760c0611
$$ 161127 -45177 159743 -85327 -154268 20200 -189860 -160060 41077 -184794 -227554 -30611
11948h482A01722q678a67313M6835D2902a83639D0944O1478l9810M4323q675B7175
$$ -8482 101722 93044 -167313 -120478 42902 -183639 40944 102422 62612 106935 98260 27175
11935b9851j79191A12221a43232q6934g633l64542h2584C03413A16764J59586
$$ -29851 -209042 112221 -143232 -230166 -7633 -372175 -82584 303413 116764 276350
11925B76350a2049B10882D3979A3534a2922m50036f1617m8948B04596M5070m4564
$$ 276350 -12049 210882 43979 13534 -12922 -462958 -61617 -110565 204596 249666 205102
11914B05102i0379A75089E3266b16729O591l5529o5075N174E8502i6140A00423
$$ 205102 -90379 175089 53266 -216729 -210138 -245667 -310742 -305568 58502 -96140 100423
11902A6654K8469c482I5815a10449B98344b28737B321K85120a82725B33466d5387
$$ 16654 45123 -3482 95815 -110449 298344 -228737 2321 287441 -182725 233466 -45387
11890A27559C2339e1751j53330N0586b1813G0985i5660B5656b09473A68817b69902
$$ 127559 32339 -51751 -205081 -154495 -21813 70985 -95660 25656 -209473 168817 -269902
11878b31021i0800m6768F5030d1935j01035d9294k2632j23288F4237g7811B66030
$$ -231021 -90800 -137568 65030 -41935 -142970 -49294 -71926 -195214 64237 -77811 266030
11866A50815B8196c52509D6344e3048I5097c39657J68115e0584p5546I1476k7212
$$ 150815 28196 -352509 46344 -53048 95097 -339657 -171542 -50584 -126130 91476 64264
11855F4264L29996A26538a67877C048Q6187e0460E5885K52501a60637A09371f8944
$$ 64264 394260 126538 -167877 3048 89235 -50460 55885 308386 -160637 109371 -68944
11843D31679b55394b513B034O7956L21521a6915k33151e1061b2131j88174H8149
$$ 431679 -255394 -2513 2034 69990 391511 -16915 -250066 -51061 -22131 -210305 88149
11831a15139o7558g0438B07450N0159a31183N8975n9212A13878D4320a29462C79942
$$ -115139 -182697 -70438 207450 257609 -131183 -72208 -131420 113878 44320 -129462 379942
11819c8855j57225h9306j09205c1401n7848p8378A03501b90424A76539E2611b55453
$$ -38855 -196080 -89306 -198511 -31401 -89249 -167627 103501 -290424 176539 52611 -255453
11807a82563j01361g9741A3758Q434N22818F2006f3935E2021L9201a97671A82404
$$ -182563 -283924 -79741 13758 22192 545010 62006 -63935 52021 91222 -197671 182404
11795A14603c99284b3662k53580a0539I1148H521K51590m3872m6088h92l1540
$$ 114603 -399284 -23662 -277242 -10539 91148 8521 260111 216239 170151 -892 -32432
11784c2432l11843O7500a9976C6305J6748a68807C41452j15743I4277h9249A8178
$$ -32432 -344275 -276775 -19976 36305 53053 -168807 341452 225709 94277 -89249 18178
11772a65648N1260m9383c4325A0620a71408I0671a20499B66702b2806j20259A20614
$$ -165648 -114388 -163771 -34325 10620 -171408 90671 -120499 266702 -22806 -143065 120614
11760b13706a5108A09663b89687F4371h1707m7460L6930E8823c51924J01615J636
$$ -213706 -15108 109663 -289687 64371 -81707 -129167 -92237 58823 -351924 -250309 -248673
11749b48673P9964N2903p9409g2490A88826J9471b8002k8281A04332h3662j38931
$$ -248673 -168709 -115806 -195215 -72490 188826 208297 -28002 -56283 104332 -83662 -222593
11738b22593l1907A5727b37636C07075A12885a30568A07926A6409a1917B12747
$$ -222593 -254500 15727 -237636 307075 112885 -130568 107926 16409 -11917 212747
11727h1691a835A42800c31448I5351d7173o2719l3159B84768k3733b20861N001
$$ -81691 -1835 142800 -331448 95351 -47173 -109892 -143051 284768 261035 -220861 -215860
11716b15860J07583d2400F5945c3002j37410B14773a40925C8583J89880I6560
$$ -215860 -108277 -42400 65945 -33002 -170412 214773 -140925 38583 228463 96560
11705h1797k0196c5796k6177A98321c2541A27628O4592C6606a30464B35086c40737
$$ -81797 -101993 -35796 -61973 198321 -32541 127628 192220 36606 -130464 235086 -340737
11693d2016B64044Q3140D0811e5870J0684k7687m1923B12193f2985B869J74587
$$ -42016 264044 347184 40811 -55870 -45186 -72873 -114796 212193 -62985 2869 177456
11682A77456a27473q7606A96834J11870h1678A11934l4381p529M9117b5287B08895
$$ 177456 -127473 -215079 196834 308704 -81678 111934 77553 70024 119141 -25287 208895
11670a83800A16820J48968A957b7900l92B10924k4576a55082d2550B32268G45
$$ -183800 116820 265788 1957 -27900 -28292 210924 186348 -155082 -42550 232268 745
11658a49345f5158n21b0862j9087A80012E5049h9284m8293B45507J66340G6529
$$ -149345 -65158 -65679 -20862 -39949 180012 55049 -89284 -137577 245507 411847 76529
11646B27105a11896B5191J61307f8606j76432a15326D9573J8536i8595A37358
$$ 227105 -111896 25191 186498 -68606 -245038 -115326 49573 68109 -98595 137358
11635A02481O535b94438f7316r329K879F508a06322B58112q9980J9773E4732R6189
$$ 102481 109016 -294438 -67316 -76645 -73766 6508 -106322 258112 168132 187905 54732 150921
11623A50921K6365E5108o488O7942J18577d4359l81992a85220K3191j65526a18836
$$ 150921 177286 55108 48620 116562 235139 -44359 -426351 -185220 -162029 -327555 -118836
11611d193n7028K7963f951A414M2093J05794a79570r4360J34494k0050D5878M4375
$$ -4193 -61221 -33258 -6951 1414 43507 149301 -179570 -273930 -139436 -159486 45878 90253
11599I0253R1409b83227J15480F1424O8531e1735H6685K7518O2394b6830j17090
$$ 90253 181662 -283227 -167747 61424 129955 -51735 86685 114203 176597 -26830 -143920
11588a43920j05343d1256c491j45103C20560a28082B199P3667K51033f4562n2596
$$ -143920 -249263 -41256 -3491 -148594 320560 -128082 2199 75866 326899 -64562 -117158
11577a17158B15528J12423A04420D4197J92408j01352l7128d48380A23369j6939
$$ -117158 215528 327951 104420 44197 236605 135253 98125 -448380 123369 106430
11567A06430J60059h7095A940J86078J54879D7887M2003L8625l2251B3694R2625
$$ 106430 266489 -87095 1940 188018 342897 47887 89890 128515 96264 23694 116319
11556A16319L7554O2226J2995m202F9255M26485d1765j56981B08765a57198C0132
$$ 116319 153873 216099 229094 224892 69255 495740 -41765 -198746 208765 -157198 30132
11544C7358a83066B91621b772D23026A05944a39247A03616J85749c34084A10857
$$ 37358 -183066 291621 -2772 423026 105944 -139247 103616 289365 -334084 110857
11533A68309i5934G1346l0421b40667h1798A20242a98660A26756K26645b28550
$$ 168309 -95934 71346 40925 -240667 -81798 120242 -198660 126756 353401 -228550
11522B60547a55288B0280f3410k4952A01678c244A14237H869L24598E2658J78619
$$ 260547 -155288 20280 -63410 -88362 101678 -3244 114237 8869 333467 52658 231277
11511B31277a59376g6729A04343R7555c1705J0512A69127f1038j755A45863a09131
$$ 231277 -159376 -76729 104343 201898 -31705 -21193 169127 -61038 -62793 145863 -109131
11499a13158K1503B79189o2659F2803b09427j30592A25980P075n2229B2491O7361
$$ -113158 -91655 279189 216530 62803 -209427 -340019 125980 133055 80826 22491 89852
11488H9852b5264A73591F7252M46b4410L070D5291L34716i8541A03241M52815
$$ 89852 -25264 173591 67252 67698 -24410 -21340 45291 380007 -98541 103241 556056
11477E56056b03718f4532d244B21933p8215M5134Q977p5167J88919A06238b1349
$$ 556056 -203718 -64532 -4244 221933 143718 188852 197829 122662 311581 106238 -21349
11465A28790J1306g0354j75653C34296A01478J59452L7186f2496C17318F6279
$$ 128790 140096 -70354 -246007 334296 101478 260930 298116 -62496 317318 66279
11454B25381a50566A34441J79428l2929j37973n0305k7468R7109A5253K49335
$$ 225381 -150566 134441 313869 280940 142967 92662 65194 162303 15253 264588
11444B64588l3149J09710R7656C3813J0885R2889Q7386K810A07576b23654r128
$$ 264588 231439 341149 438805 33813 44698 137587 224973 227783 107576 -223654 -232782
11433b32782A00235J95098m5701m6333a79212c9681E0087i5481A7145K41262D0085
$$ -232782 100235 295333 249632 203299 -179212 -39681 50087 -95481 17145 258407 40085
11421b21229A05042J69086q7592a10466J3532L6188G0902h0834C0381P6478b79905
$$ -221229 105042 274128 186536 -110466 -96934 -60746 70902 -80834 30381 106859 -279905
11409g3772K2403j28387C33596A18668K7853J03248a6642B15178g8332A35194
$$ -73772 -51369 -179756 333596 118668 146521 249769 -16642 215178 -78332 135194
11398b09599P1951o1025C02067B5172f5042C5021J1733b69307b5432n3579A22274
$$ -209599 -137648 -198673 302067 25172 -65042 35021 46754 -269307 -25432 -79011 122274
11386a88161I5931a06557B20948K2312k8512K5501e4489l1717A34572g9066A13510
$$ -188161 95931 -106557 220948 243260 214748 240249 -54489 -86206 134572 -79066 113510
11374d5719j65026O4095K1221C14624j11655q1030l0739B1147J48672F8671c4842
$$ -45719 -210745 -146650 -125429 314624 202969 121939 91200 21147 169819 68671 -34842
11362I7476Q2786J06394p1387a16995M2698J017B85699b88020A99716I2092A4353
$$ 97476 180262 286656 215269 -116995 -74297 -73280 285699 -288020 199716 92092 14353
11350E608a4805D8849j0315b18641P6051B86619D1301J27681a25086C3838C131
$$ 5608 -14805 48849 38534 -218641 -142590 286619 41301 168982 -125086 33838 3131
11338C9881a32604F97c99046B50485a18224F7808N5018a96136o6118d1977j03412
$$ 39881 -132604 697 -399046 250485 -118224 67808 122826 -196136 -262254 -41977 -145389
11327a45389B79910A07321j0784J27515D3819e5042K5760l37883a40067j14659
$$ -145389 279910 107321 96537 224052 43819 -55042 -29282 -367165 -140067 -254726
11317b54726c9142o9067B70861j15408c32581a59710A35866k5351J76278b46672
$$ -254726 -39142 -108209 270861 155453 -332581 -159710 135866 110515 286793 -246672
11306D0028c98219J52338a07885G361i4892A23782E3046a11408A65L2053i52I7869
$$ 40028 -398219 -245881 -107885 7361 -94892 123782 53046 -111408 165 32218 -952 97869
11293F4077a50488k60437e924A02277g4061G0992d2443A20950d3592q4668k7887
$$ 64077 -150488 -410925 -5924 102277 -74061 70992 -42443 120950 -43592 -128260 -156147
11282a56147D6130d67427A06161a76704j33599B82362B1129K26602F9793P3287
$$ -156147 46130 -467427 106161 -176704 -310303 282362 21129 247731 69793 143080
11272A43080f3222A63422b08171b6587j6292j45171j56797a13698A12392J6661
$$ 143080 -63222 163422 -208171 -26587 -42879 -188050 -344847 -113698 112392 129053
11262A29053e7941q1442A00856J63458i6407p5885j033D8119b697D0821L166d241
$$ 129053 -57941 -139383 100856 264314 -96407 -172292 -173325 48119 -2697 40821 43987 -4241
11249D3188b3691j91995p1616H1259g6960E5180J5837a46840A02950A6605a56010
$$ 43188 -23691 -215686 -287302 81259 -76960 55180 71017 -146840 102950 16605 -156010
11237c89421E6633c82433J00664f6825j19662b9186j57429A16724L7685f0972
$$ -389421 56633 -382433 -281769 -66825 -186487 -29186 -186615 116724 154409 -60972
11226E8864A8660c17138a00061l921H7563P100a05152a2910A74671h6728j17658
$$ 58864 18660 -317138 -100061 -103982 87563 94663 -105152 -12910 174671 -86728 -204386
11215b04386I4951b15474C4317c88200I7345D8119a00524m0221A0854a10952k4920
$$ -204386 94951 -215474 34317 -388200 97345 48119 -100524 -140745 10854 -110952 -135872
11204a35872A56352a29593H8076J62758Q7414a23248A31801n5093c08447e640
$$ -135872 156352 -129593 88076 250834 338248 -123248 131801 76708 -308447 -5640
11193d3025j46170E9002L1454a80806A16931A0600L14770A9906K30847I7285j9109
$$ -43025 -189195 59002 90456 -180806 116931 10600 325370 19906 250753 97285 78176
11182G8176d6516o9063B1216R1262g8562k43238A96003M6727b31521k73938A54669
$$ 78176 -46516 -115579 21216 112478 -78562 -321800 196003 242730 -231521 -505459 154669
11170d8135l5663k32469O4869f6330B11283h2901m5925A44026B0771K2623b62018
$$ -48135 -83798 -316267 -251398 -66330 211283 -82901 -128826 144026 20771 43394 -262018
11158A19622b95689A6659J05589J46471r9323a62398F1071b30614A63215k8470
$$ 119622 -295689 16659 122248 268719 169396 -162398 61071 -230614 163215 134745
11148A34745o6781a40708d0985F6444O5411A3101b01576H9231J1196J3384a09553
$$ 134745 67964 -140708 -40985 66444 131855 13101 -201576 89231 100427 113811 -109553
11136h2005B16243i6525A04245f8870A78600a63194M6311L5971C3924c2856l9423
$$ -82005 216243 -96525 104245 -68870 178600 -163194 -116883 -80912 33924 -32856 -72279
11125g2279p8572f5020r3276B13356a29604A70383b81504A59509d35053b07105
$$ -72279 -150851 -65020 -158296 213356 -129604 170383 -281504 159509 -435053 -207105
11114d5015C9893b13041A09158a06993i741r3805n1277k23836a55285N9687j67218
$$ -45015 39893 -213041 109158 -106993 -9741 -103546 -154823 -378659 -155285 -95598 -262816
11103b62816C72338a78177B27867A794Q7429a09148B06467i658A20707e4014B83370
$$ -262816 372338 -178177 227867 1794 89223 -109148 206467 -9658 120707 -54014 283370
11091A63123j3410a37568M4949B44433b290G5612c4892B06029g5445q338o072
$$ 163123 149713 -137568 -92619 244433 -2290 75612 -34892 206029 -75445 -83783 -89855
11080h9855j34693b6986D3964P4448b71321E8074i5164C2618b37490A66392m8518
$$ -89855 -224548 -26986 43964 118412 -271321 58074 -95164 32618 -237490 166392 117874
11069A17874J80026b16730R5667A79979B3791M06155a65901D84863A92490J78287
$$ 117874 297900 -216730 -121063 179979 23791 429946 -165901 484863 192490 370777
11059C70777I8586J83550H7663J45871o0090L8494a0350E6248J65311O587J90197
$$ 370777 98586 282136 87663 233534 173444 211938 -10350 56248 221559 228146 418343
11048D18343j35233n1368r7445L83253A88843N17526I4780L62486A2260N3904
$$ 418343 283110 231742 134297 517550 188843 706369 94780 457266 12260 66164
11038F6164L02455J63554A12010M7068M07136k20284J5871k2700M1286m2008K7290
$$ 66164 368619 532173 112010 159078 566214 345930 361801 339101 380387 338379 365669
11027C65669K54159B95135K30520K7859J41123j93512K44714m5334J19405l51072
$$ 365669 619828 295135 525655 553514 694637 501125 745839 700505 819910 468838
11017D68838K6545J07266j28994L01037k21367m7031k34911J64173j23333L11387
$$ 468838 495383 602649 473655 774692 553325 506294 271383 435556 312223 623610
11007F23610j91271A47920L89572J62236o4234C14409N5511J80984j01181J9470
$$ 623610 432339 147920 537492 699728 635494 314409 369920 550904 449723 469193
10997D69193J04700k08438L44164j4486k62010p7584J30951A82586L3307L33734
$$ 469193 573893 365455 709619 695133 433123 355539 486490 182586 215893 549627
10987E49627Q4487J7142D7348O01856j48811J11155k80155Q9326p625L75171l67394
$$ 549627 634114 651256 47348 649204 500393 611548 331393 420719 413094 788265 420871
10976D20871G5503O09775B23078K85099R8738k10375J40553n5328K0651L2690
$$ 420871 75503 685278 223078 508177 606915 396540 537093 481765 502416 535106
10966E35106p7726J92114J58516j05058j51114p0047L03808j55189N7096L47827
$$ 535106 457380 649494 808010 702952 551838 481791 785599 630410 687506 1035333
10956A035333l79427k1372J24234j1337J68143L754q2881M73859J02316q9997
$$ 1035333 655906 634534 758768 747431 915574 919328 836447 1310306 1412622 1322625
10946A322625M55023Q9874J44018N43508l93158k69281k9290k03968l12542J86921
$$ 1322625 1777648 1867522 2011540 2555048 2161890 1892609 1863319 1659351 1346809 1533730
10936A533730o07466L20122j04552J37999j84968K80693k41776L86955k77441
$$ 1533730 926264 1246386 1141834 1279833 1094865 1375558 1133782 1520737 1243296
10927A243296L890k04313k15855J9850K61638k63189l24645R4728M9599A56871
$$ 1243296 1247186 1042873 827018 846868 1108506 845317 520672 615400 664999 156871
10916F01978k97924m0106R2211A368L02125a86247A01651J11725q4969K2567A0801
$$ 601978 304054 263948 356159 1368 303493 -186247 101651 213376 128407 150974 10801
10904C1113K12796C2715M9280b09888C71320j57219j00786J58838b2989j36729
$$ 31113 243909 32715 81995 -209888 371320 214101 113315 272153 -22989 -159718
10894a59718A73672a60824O3670D807a48633j38609h960l31419C9253N2306a91266
$$ -159718 173672 -160824 -97154 4807 -148633 -287242 -8960 -340379 39253 91559 -191266
10882d1188B15261a45299A96366n3387a7478k29703h2493j2841A76968q6644K42472
$$ -41188 215261 -145299 196366 142979 -17478 -247181 -82493 -95334 176968 90324 332796
10871C32796i9311C5479a865A76141i5131F8227d587C20951D6971M04500d6657
$$ 332796 -99311 35479 -1865 176141 -95131 68227 -4587 320951 46971 451471 -46657
10859i6256A88166K79071E0217a19730p5965A55068i0562k16131C85165b7339
$$ -96256 188166 467237 50217 -119730 -195695 155068 -90562 -306693 385165 -27339
10848a41186D0666j8968b58437H2439J81867a32569J0758r6612A54080N6282a43198
$$ -141186 40666 21698 -258437 82439 264306 -132569 -121811 -218423 154080 210362 -143198
10836g7815D3281a22127k656a4341o2304k96782a58685C8346J80226c12425P0301
$$ -77815 43281 -122127 -124783 -14341 -76645 -373427 -158685 38346 218572 -312425 -242124
10825b42124A63720d4505A4060N3053h4262A05953a06486G0635c7542j9118A42352
$$ -242124 163720 -44505 14060 67113 -84262 105953 -106486 70635 -37542 -56660 142352
10813F1286b57531J04642k08115a64410f4194A63949a50129A73164b43195J02105
$$ 61286 -257531 -152889 -361004 -164410 -64194 163949 -150129 173164 -243195 -141090
10803a41090j12328p5781e5105B3022c1959j66230J5832o7216J3600g6271A23002
$$ -141090 -253418 -329199 -55105 23022 -31959 -198189 -182357 -249573 -235973 -76271 123002
10791A40700a28232b1162o9558q2523B63101b80910d6390k2930A04867b5845l82584
$$ 140700 -128232 -21162 -90720 -173243 263101 -280910 -46390 -69320 104867 -25845 -408429
10780d08429J93537J03933g291D2715a262B2113J09836a8208B3265c0028j40900
$$ -408429 -214892 -110959 -7291 42715 -1262 22113 131949 -18208 23265 -30028 -170928
10769a70928H1375b72271a21673A57762a21335C58951c82700a26506A69832C2981
$$ -170928 81375 -272271 -121673 157762 -121335 358951 -382700 -126506 169832 32981
10758c23141K6044F24326a28599k682A49689P8751h8392B28152b3851I681K85220
$$ -323141 -297097 624326 -128599 -131281 149689 228440 -88392 228152 -23851 9681 294901
10747B94901g5377E1054a92904b8305l03705B37189P4629j52835a59761j003c8191
$$ 294901 -75377 51054 -192904 -28305 -332010 237189 311818 158983 -159761 -160764 -38191
10735e9604r5585f6034A72008m8767b65848a079D3938d8168m1900G5047a27665
$$ -59604 -155189 -66034 172008 123241 -265848 -1079 43938 -48168 -90068 75047 -127665
10723d41j11003b5907o1671b9383A31010a44171j3791f2377j8647j72502f2647
$$ -441 -111444 -25907 -87578 -29383 131010 -144171 -157962 -62377 -81024 -253526 -62647
10711e3387b2006B74465a3369l4132D8385h1145A56099D6794e2844B65005a24987
$$ -53387 -22006 274465 -13369 -47501 48385 -81145 156099 46794 -52844 265005 -124987
10699a73524P9664C5825c54983a43134A16454c10561a49512A76745M3008l6816
$$ -173524 -93860 35825 -354983 -143134 116454 -310561 -149512 176745 219753 182937
10689A82937a88245A72103m7899i0299r699r1197A12998c1461b047p2599D1871
$$ 182937 -188245 172103 124204 -90299 -99998 -191195 112998 -31461 -2047 -74646 41871
10677A00564a65089C02220H2312N5764a17018A73782b16321a04535J8513C640
$$ 100564 -165089 302220 82312 138076 -117018 173782 -216321 -104535 -86022 3640
10666D5825d9142B5949a85869m29015a27926M3510j3497K7820o7527d2203b595
$$ 45825 -49142 25949 -185869 -614884 -127926 -84416 -97913 -70093 -137620 -42203 -2595
10654d2877k710j6340B98110F9811b4496j74436A07139J50960e4579l5634a848
$$ -42877 -45587 -61927 298110 69811 -24496 -198932 107139 258099 -54579 -90213 -1848
10642d8945B6282f0713B2319J95483a91603j79474f2265j2326B3807a43815a8213
$$ -48945 26282 -60713 22319 217802 -191603 -371077 -62265 -74591 23807 -143815 -18213
10630B09343d7028k16237B2535a27831B10736L7854F8087f8424j08784a7995j93323
$$ 209343 -47028 -263265 22535 -127831 210736 248590 68087 -68424 -177208 -17995 -211318
10619b11318B07154a4942j87727C00295G698M4971a36174G2275A3322a22154p8901
$$ -211318 207154 -14942 -202669 300295 7698 52669 -136174 72275 13322 -122154 -201055
10608b01055j0559g8273m8718d6635D4404b1030J59k7477o4138E5895M5496b45592
$$ -201055 -211614 -78273 -126991 -46635 44404 -21030 -20871 -48348 -112486 55895 101391 -245592
10595a74917P2077B88K4410d161F7293a56615l8209Q8803A45583a50106k1486
$$ -174917 -102840 288 24698 -4161 67293 -156615 -194824 -106021 145583 -150106 -171592
10584a71592p8534e8638B63078a82081B37787e4577j6036C7350K545c38388E2661
$$ -171592 -250126 -58638 263078 -182081 237787 -54577 -70613 37350 39895 -338388 52661
10572g5928A71811l2906m9434C2469c04159J1126l0768i827k4593A70097a7107
$$ -75928 171811 138905 89471 32469 -304159 -293033 -323801 -9827 -34420 170097 -17107
10560a83612D257h6386A97831J49418f1538j12637N6393H3323J78478b3494G7719
$$ -183612 4257 -86386 197831 347249 -61538 -174175 -117782 83323 261801 -23494 77719
10548D3370D968O7078i4750F7405a56724j00055b3050j10168B9453R435a57231
$$ 43370 4968 72046 -94750 67405 -156724 -256779 -23050 -133218 29453 38888 -157231
10536a36963m9802B09068a02174n6495a07A21346l9702H9e7600C0316a15288L7954
$$ -136963 -186765 209068 -102174 -158669 -107 121346 81644 89 -57600 30316 -115288 -77334
10524g7334j5824i730A15930e9472j67062a0520l5133E7917c50383b10o2080p9216
$$ -77334 -93158 -9730 115930 -59472 -226534 -10520 -45653 57917 -350383 -210 -62290 -141506
10512a41506I975a58019f537H9844K5779a03226F1082c37429b3101A0350b92454
$$ -141506 9975 -158019 -6537 89844 115623 -103226 61082 -337429 -23101 10350 -292454
10500b15726B88743A28713C2317a27583A31041b47930A8142a28101C2787J39536
$$ -215726 288743 128713 32317 -127583 131041 -247930 18142 -128101 32787 172323
10490A72323i5336j44848c2948A62935G2458b53783g9555n6792C0951b11531F1127
$$ 172323 -95336 -240184 -32948 162935 72458 -253783 -79555 -136347 30951 -211531 61127
10478e7078l7342j30630C4058b05601q356B61314f7065k41703D4176J59914c65373
$$ -57078 -94420 -225050 34058 -205601 -213957 261314 -67065 -308768 44176 204090 -365373
10466b6918A29928g195C1429b72897J22232A77445o5635k739j2022L42569A1713
$$ -26918 129928 -7195 31429 -272897 -150665 177445 111810 109071 97049 439618 11713
10454b25728L6503B97333N2615L1840J83651j70932d9750D56603h4658a1895B30345
$$ -225728 -189225 297333 349948 381788 565439 394507 -49750 456603 -84658 -11895 230345
10442B82849a14922A96395a55984B6875i603F976P7199J01274b12847A04539L30212
$$ 282849 -114922 196395 -155984 26875 -9603 6976 84175 185449 -212847 104539 434751
10431D34751A91575e9371I8176b10075o9278a28939d9631p679C15597e4784l39279
$$ 434751 191575 -59371 98176 -210075 -279353 -128939 -49631 -57310 315597 -54784 -394063
10420c94063R2270A71600g1942A52262c8771j25434I0152h4493L3359k6383c7468
$$ -394063 -301793 171600 -71942 152262 -38771 -164205 90152 -84493 -51134 -77517 -37468
10408H7353d0144D9243J214R3570c06815A23139c06182B76841c76470c9384C832
$$ 87353 -40144 49243 50457 144027 -306815 123139 -306182 276841 -376470 -39384 3832
10396G7744k8667K20950c46427A56823a25903q4698g7230B26262b4031B84448
$$ 77744 49077 270027 -346427 156823 -125903 -210601 -77230 226262 -24031 284448
10385a18390C6912J66679o4811R9564c75647a7028j58087C27815F758K18124a81268
$$ -118390 36912 203591 138780 238344 -375647 -17028 -175115 327815 6758 224882 -181268
10373e7201B15724h5146D8858d3629F7931i6660b4865C98075a5770A12962N1517
$$ -57201 215724 -85146 48858 -43629 67931 -96660 -24865 398075 -15770 112962 164479
10362A64479J39591a53597D03889A30780J44082n6557c1629j26289c2977A15817
$$ 164479 304070 -153597 403889 130780 274862 218305 -31629 -157918 -32977 115817
10351A09141A2986J47702p0406B7344J63379E4114N56307A49092K3150p561O4350
$$ 109141 12986 160688 90282 27344 190723 54114 610421 149092 172242 164681 229031
10340B29031J73338j07712m0771j24480Q043J80736j46289J6400b70054A34336
$$ 229031 402369 294657 253886 129406 137449 318185 171896 188296 -270054 134336
10329c6327B11534C0754B086K54681i719C60983j75186k9828J43584e2747A27026
$$ -36327 211534 30754 2086 256767 -9719 360983 185797 155969 299553 -52747 127026
10317A26983K54481A41817J0091J39705A6111h2794C8928R1115N573F6301J14973
$$ 126983 381464 141817 151908 291613 16111 -82794 38928 130043 135616 66301 181274
10306A81274G4676b1418B44687E0912K31880a06434K6399l61319i7061p3137C2839
$$ 181274 74676 -21418 244687 50912 282792 -106434 -80035 -441354 -97061 -170198 32839
10294b9174I2250A6612K83870F5393N7454a09438A4512K22578a652j46423F2733
$$ -29174 92250 16612 300482 65393 122847 -109438 14512 237090 -1652 -148075 62733
10282B5162b22101Q4412B51405q9900b82824A30399b14102A54675J0013b29561
$$ 25162 -222101 -137689 251405 161505 -282824 130399 -214102 154675 164688 -229561
10271D5257M8870b5185k00997i494A97709r7633i0071l75415a50836d765A46808
$$ 45257 94127 -25185 -226182 -9494 197709 100076 -90071 -465486 -150836 -4765 146808
10259D291K75676b62078J255J07168A61091A023Q7356d4836I4909a86782A91689
$$ 4291 279967 -262078 -260823 -153655 161091 1023 88379 -44836 94909 -186782 191689
10247b02629g9936D3021b62518B7777b18923j7381k09188h5685r8420G4602a62303
$$ -202629 -79936 43021 -262518 27777 -218923 -236304 -445492 -85685 -184105 74602 -162303
10235G2493a35592D4668J19363K06374n4843j44145N78655b1725C97821C0003
$$ 72493 -135592 44668 164031 370405 315562 171417 750072 -21725 397821 30003
10224d6357A43005o3277b54976i9596p2585d4412B36512a6773n432o5112j30109
$$ -46357 143005 79728 -254976 -99596 -172181 -44412 236512 -16773 -22205 -87317 -217426
10213b17426l0371Q9568A47810a26804b2155q5804a6365A7324e6591A04243Q5391
$$ -217426 -247797 -158229 147810 -126804 -22155 -107959 -16365 17324 -56591 104243 189634
10202A89634a66691G5781b13943f4274A2544a95225j63992D33550e3125j09843
$$ 189634 -166691 75781 -213943 -64274 12544 -195225 -359217 433550 -53125 -162968
10192a62968l03398I6765a52766I6575g2778m5221C8737g7015K9730F2186a42412
$$ -162968 -466366 96765 -152766 96575 -72778 -117999 38737 -77015 -47285 62186 -142412
10180d03433a96516g3845l36062A48952a76295g8465F9639a17980a327k03128
$$ -403433 -196516 -73845 -409907 148952 -176295 -78465 69639 -117980 -1327 -204455
10170b04455A75724o6857B2099P223a68495A96505a75997D17064a74066j20809
$$ -204455 175724 108867 22099 29322 -168495 196505 -175997 417064 -174066 -294875
10160b94875P841C3852a26309J9224H3222O9320a68995j29526C42179C6808N874
$$ -294875 -287034 33852 -126309 -107085 83222 152542 -168995 -298521 342179 36808 42682
10149D2682i3791j22939A37008a31023B3785b7037B5536e8340k27173G6709b83475
$$ 42682 -93791 -216730 137008 -131023 23785 -27037 25536 -58340 -285513 76709 -283475
10137B57956m9564a29727p7390h0527F45a10761j42061C09659b19382A79206J20408
$$ 257956 208392 -129727 -207117 -80527 645 -110761 -252822 309659 -219382 179206 299614
10126B99614a57869B21900p7240c14167B51829a95557G2534I482a09028K7684
$$ 299614 -157869 221900 144660 -314167 251829 -195557 72534 9482 -109028 -81344
10116h1344A3878i5161F7428b24179H1981D0816a68826j9676Q3159q9368l7876
$$ -81344 13878 -95161 67428 -224179 81981 40816 -168826 -188502 -105343 -194711 -232587
10105b32587A50302J87356a50048b8477j66171A06092r578j3947l7132J28674
$$ -232587 150302 337658 -150048 -28477 -194648 106092 96514 82567 45435 174109
10095A74109b3460o9123C04151H6848c7541j97433c9916j48562b3715l15244A18341
$$ 174109 -23460 -92583 304151 86848 -37541 -234974 -39916 -188478 -23715 -338959 118341
10083C30071j08707A5914a09127j6822a7169j07369J2873k45650g1107K0239k86524
$$ 330071 221364 15914 -109127 -125949 -17169 -124538 -111665 -357315 -71107 -50868 -337392
10072c37392a0901k13979H0663b36947E6611h9508L0511B55465I2794L4030B4578
$$ -337392 -10901 -224880 80663 -236947 56611 -89508 -58997 255465 92794 126824 24578
10060a51210n6473J7216Q7572l6041e2329A3097K23269D4286L9782j5725J37036
$$ -151210 -207683 -190467 -102895 -138936 -52329 13097 236366 44286 84068 68343 205379
10049B05379n3615d23297h9089j71149a11262j40246k33530A27963f6658A7641
$$ 205379 151764 -423297 -89089 -260238 -111262 -251508 -485038 127963 -66658 17641
10038A17404h4466C5657R9078a59867P3202o4690k00848a51348A86669a43647
$$ 117404 -84466 35657 134735 -159867 -86665 -151355 -352203 -151348 186669 -143647
10027a5266H4215a72801B27904a09154B43599E6627f8887m4773C64320d0918A28037
$$ -15266 84215 -172801 227904 -109154 243599 56627 -68887 -113660 364320 -40918 128037
10015B44869a77800P2831j29739j69523a17397B9877L7325R5485c04076A34592
$$ 244869 -177800 -104969 -234708 -404231 -117397 29877 67202 162687 -304076 134592
10004g9537k02110i4481I764N5790c72826k5758J96121A26837a60593b342j59046
$$ -79537 -281647 -94481 9764 65554 -372826 -398584 -202463 126837 -160593 -2342 -161388
9993a61388L4357A39018F7808c80911e396k21400N226B07291a25217i066G5312
$$ -161388 -127031 139018 67808 -380911 -5396 -226796 -221570 207291 -125217 -9066 75312
9981B14392D2313g6522o051J9897b5470A70610A9402a63302k2722k49360a5748
$$ 214392 42313 -76522 -82573 -62676 -25470 170610 19402 -163302 -186024 -435384 -15748
9969E7609a63529B0364d4166F8905f047K403j16363g187K626k15296k7566N613
$$ 57609 -163529 20364 -44166 68905 -6047 -3644 -120007 -7187 -4561 -219857 -247423 -241810
9957b41810j24388a42603A21256c45025J68501b1405k8107F3246a15133a6893
$$ -241810 -366198 -142603 121256 -345025 -176524 -21405 -49512 63246 -115133 -16893
9946G2323b16964b650A2087c198q4661J4115j98148Q9585r6227B03620b22241
$$ 72323 -216964 -2650 12087 -3198 -87859 -73744 -271892 -182307 -278534 203620 -222241
9934b70880f8777B92841a0220B3706K02136a46690r8186A5124Q369J23062o6588
$$ -270880 -68777 292841 -10220 23706 225842 -146690 -244876 15124 23493 146555 79967
9923G9967d8245k72491f0566k44910H1108c3945G0422a63692K7728k39612J19478
$$ 79967 -48245 -320736 -60566 -305476 81108 -33945 70422 -163692 -135964 -375576 -256098
9912b56098C38030D3122a05496h403j52280j45881C9466e6375I3254b5096l23058
$$ -256098 338030 43122 -105496 -8403 -160683 -306564 39466 -56375 93254 -25096 -348154
9901c48154A32275k907b80971B96152h0816r6002p0720C8647J12155a5261A12596
$$ -348154 132275 129368 -280971 296152 -80816 -176818 -247538 38647 150802 -15261 112596
9889a25259j08663A2347g0194j65180h5372J5156j8314j78259G8983e2331K964
$$ -125259 -233922 12347 -70194 -235374 -85372 -70216 -88530 -266789 78983 -52331 -49367
9878d9367p43B05000C6489a61362p1324A62778A5496J01212D2222a59340D5393
$$ -49367 -50110 205000 36489 -161362 -232686 162778 15496 116708 42222 -159340 45393
9866G3553a48537k9672L7440J4304k43950e2544k7941A33993A0125b57539L9965
$$ 73553 -148537 -178209 -140769 -126465 -370415 -52544 -80485 133993 10125 -257539 -217574
9855b17574L6796f6462A15130a04385B38492o7144G935Q0870R5612j0513l615
$$ -217574 -180778 -66462 115130 -104385 238492 171348 7935 88805 184417 173904 170289
9844A70289A0964J27149Q3175a56457O0893a1034r0191O55A55979d7479A01518
$$ 170289 10964 138113 221288 -156457 -95564 -11034 -101225 -100570 155979 -47479 101518
9832i1233C7037d1618n5928A24547b56485j34385A09588R1252B3882d4755a4437
$$ -91233 37037 -41618 -97546 124547 -256485 -390870 109588 200840 23882 -44755 -14437
9820f2213A53568a50310O3426k1382E1955c38432e705k8000j18064G8309J0453
$$ -62213 153568 -150310 -86884 -108266 51955 -338432 -5705 -33705 -151769 78309 88762
9809H8762d54332K22093B23547c18144J20705P5561k22001A8244K48732A7541
$$ 88762 -454332 -232239 223547 -318144 -197439 -121878 -343879 18244 266976 17541
9798c0166a2639k80170G6164a31656B89492d8097J1301H6661O6695f5245m3442
$$ -30166 -12639 -292809 76164 -131656 289492 -48097 -36796 86661 153356 -65245 -108687
9787a08687B29924e3353E9581e6251r0068N1443A34718a98415o590A69763c11725
$$ -108687 229924 -53353 59581 -56251 -146319 -94876 134718 -198415 -205005 169763 -311725
9775a84943O7566B13382a9026I3039a24876D9600N125b1866j84279B27675i3544
$$ -184943 -117377 213382 -19026 93039 -124876 49600 54725 -21866 -206145 227675 -93544
9763e207j86267P5430A27044M7462c90918d6877k77563d6490E2307i2673G8104
$$ -5207 -191474 -116044 127044 174506 -390918 -46877 -324440 -46490 52307 -92673 78104
9751a69376k1659k5366K7977K3713a4435E8134d4518C1655N7640M236p331J0986
$$ -169376 -191035 -216401 -188424 -164711 -14435 58134 -44518 31655 89295 93531 86200 97186
9739I7186l9441b87207c8286A10350e2393J9100E0082d6110B1453b66622a0639
$$ 97186 57745 -287207 -38286 110350 -52393 -33293 50082 -46110 21453 -266622 -10639
9727b7438k9869j34517D06738a189k79015C502b61535B39565B8683L512i3514
$$ -27438 -57307 -191824 406738 -1189 -280204 3502 -261535 239565 28683 32195 -93514
9715a09105q0921b0429k14356c5377A10920a07777C7642h6054B73419a63802A892
$$ -109105 -190026 -20429 -234785 -35377 110920 -107777 37642 -86054 273419 -163802 1892
9703a20885j23863a3737j87520j20056i4790A40182i2343I7523a43762H5399a9364
$$ -120885 -244748 -13737 -201257 -321313 -94790 140182 -92343 97523 -143762 85399 -19364
9691A84219b50873B48298b96762B009J2151O0124a24348a7382j23722A98270B4671
$$ 184219 -250873 248298 -296762 2009 14160 74284 -124348 -17382 -141104 198270 24671
9679g1400j02348H9539b59180e3377r1679r4162d977l35469A02400c93638e0804
$$ -71400 -173748 89539 -259180 -53377 -145056 -239218 -4977 -340446 102400 -393638 -50804
9667a39355A3745a11291I206J11176g6187K7504A13339J9690a56760E7802f108
$$ -139355 13745 -111291 9206 120382 -76187 -48683 113339 133029 -156760 57802 -6108
9655a15734L6472j56695a2779k94498A29953b9641r6860o2585l888j4002d5133
$$ -115734 -79262 -235957 -12779 -307277 129953 -29641 -126501 -189086 -192974 -206976 -45133
9643a75543I062b79899J3117d7695n4087c3941r3496d3894j37063M0876D9625
$$ -175543 9062 -279899 -266782 -47695 -101782 -33941 -127437 -43894 -180957 -140081 49625
9631a20818n3996e4644a8987k34172A903a42226C7993L23953h2979C6320g7788
$$ -120818 -174814 -54644 -18987 -253159 1903 -142226 37993 361946 -82979 36320 -77788
9619e8067k75423a64636b8498c509j78549N4425d9542m04537J86226J1868A18868
$$ -58067 -333490 -164636 -28498 -3509 -182058 -127633 -49542 -454079 -267853 -255985 118868
9607C972J2432a7842C4072b68075k4822q24b7751A61008R874a16512A14434D5378
$$ 3972 16404 -17842 34072 -268075 -292897 -293721 -27751 161008 170882 -116512 114434 45378
9594a47036n3373A45240l1703b5007C4889f9246B56696c8138k18431B50697c261
$$ -147036 -200409 145240 113537 -25007 34889 -69246 256696 -38138 -256569 250697 -3261
9582b9632A21783a13653D2837a13056E7067a21843j25707A70358F1849f047H5269
$$ -29632 121783 -113653 42837 -113056 57067 -121843 -247550 170358 61849 -6047 85269
9570A99380j688b08050m5478l6234A29742f2072A10947b82524K3314A33273a34450
$$ 199380 197692 -208050 -253528 -289762 129742 -62072 110947 -282524 -259210 133273 -134450
9558b10345d4098p9355k56667B5934J69121b9031k48041b1582C7332J05797b54338
$$ -210345 -44098 -123453 -380120 25934 195055 -29031 -277072 -21582 37332 143129 -254338
9546a08355k34686J22116C53572G223d3142p8491p8763L6045j18629a04189e1937
$$ -108355 -343041 -220925 353572 7223 -43142 -121633 -200396 -164351 -282980 -104189 -51937
9534a10870C0093A0457N3383b21113j04503K098i0368k49258a37512D958a45745
$$ -110870 30093 10457 63840 -221113 -325616 -323518 -90368 -339626 -137512 4958 -145745
9522A02361M564i6073R364j69975B7899b4288C1956i837m3385j03025N65c0090
$$ 102361 106925 -96073 -86709 -256684 27899 -24288 31956 -9837 -53222 -156247 -155682 -30090
9509b39978B75549c98509f2582e520I4020e3706F2427M3640a02158J8065A02822
$$ -239978 275549 -398509 -62582 -5520 94020 -53706 62427 106067 -102158 -84093 102822
9497H4925a27548N8561C29283b75496b5686j55443A28647J666A0549f6870j08337
$$ 84925 -127548 -68987 329283 -275496 -25686 -181129 128647 130313 10549 -66870 -175207
9486a75207j65019i3339J0073R288o4441H4150g2238l17427A67991J3870d3551
$$ -175207 -340226 -93339 -83266 -73978 -138419 84150 -72238 -389665 167991 181861 -43551
9474b01833b9129k66871A58101B754f354k59384j27098J36809A9813J63668H0879
$$ -201833 -29129 -296000 158101 2754 -6354 -265738 -392836 -256027 19813 183481 80879
9462a79283A5115K40153l1572r2068a35274j81817a24654f0673k98253l049G9886
$$ -179283 15115 255268 223696 131628 -135274 -317091 -124654 -60673 -358926 -361975 79886
9450b04247c7898A88332h4471A00360a92198F5826e20689e2930D8909a34271A52478
$$ -204247 -37898 188332 -84471 100360 -192198 65826 -520689 -52930 48909 -134271 152478
9438D6788a48636B8478J33756D3208i9305m7641J1267j04359c5117l07550j70142
$$ 46788 -148636 28478 162234 43208 -99305 -146946 -135679 -240038 -35117 -342667 -512809
9427e12809A73412a8663n6481A10731d9164g473j84185L7968A23889n3629k4225
$$ -512809 173412 -18663 -75144 110731 -49164 -7473 -191658 -153690 123889 70260 46035
9416D6035a00275L4711o5674j4704n1936A56705b8435q3415o5599B04124d1564
$$ 46035 -100275 -65564 -131238 -145942 -197878 156705 -28435 -111850 -177449 204124 -41564
9404a55584A87425p4449C9013O5773d9647q1505F5559k699a43291d1187n7770
$$ -155584 187425 112976 39013 104786 -49647 -131152 65559 62860 -143291 -41187 -98957
9393i8957r1011B46936I3028L9880a39531I4502K0116a8H6020a13497r9902m3750
$$ -98957 -189968 246936 93028 132908 -139531 94502 114618 -18 86020 -113497 -213399 -257149
9381b57149J01153k1445N945B53863b96566a03772j24916C7514B967K20971D5246
$$ -257149 -155996 -177441 -171496 253863 -296566 -103772 -228688 37514 2967 223938 45246
9369a09300k53310A24855m1666D0746d41110b01581m1982F9939K38875b25556
$$ -109300 -362610 124855 83189 40746 -441110 -201581 -243563 69939 308814 -225556
9358A03360K16956c8776o3198B98665b0059C0079r052b08545j37102g9891H7377
$$ 103360 320316 -38776 -101974 298665 -20059 30079 21027 -208545 -345647 -79891 87377
9346A11489j8484Q4074i0141G1143B36b80444B58373a34155j65530a41850A0372
$$ 111489 93005 177079 -90141 71143 236 -280444 258373 -134155 -299685 -141850 10372
9334G05d1680J6089A21757a64241g5393k70418A95921a55036j17977R7130l5905
$$ 705 -41680 -25591 121757 -164241 -75393 -345811 195921 -155036 -273013 -175883 -211788
9323b11788k39640J61938c2867J1187B56441e3953R898j28908A20204a524m17891
$$ -211788 -451428 -289490 -32867 -21680 256441 -53953 -44055 -172963 120204 -1524 -419415
9312d19415B52593a80765N9213b6584m8658B16499a02377p413B12342a36318j18356
$$ -419415 252593 -180765 -121552 -26584 -75242 216499 -102377 -109790 212342 -136318 -254674
9301b54674A5026a17452j57580c1492A82609m9597a81602H8772c42135i6039A83555
$$ -254674 15026 -117452 -275032 -31492 182609 133012 -181602 88772 -342135 -96039 183555
9289b50229j58059l850I6742J5954i3784A22979B8058e15491a95224A29751a93489
$$ -250229 -408288 -412138 96742 112696 -93784 122979 28058 -515491 -195224 129751 -193489
9277b32998d5204C9690J29426a32472j51427c4408A82463b44377I8697e2812j8399
$$ -232998 -45204 39690 169116 -132472 -283899 -34408 182463 -244377 98697 -52812 -71211
9266g1211n3119A20697J14060G6419b5298k11204o8822a08242q4776c5518n7277
$$ -71211 -124330 120697 234757 76419 -25298 -236502 -305324 -108242 -193018 -35518 -92795
9255i2795A41567a07704l1327H1900e0410k15871F5543a9701k34931J20302q0415
$$ -92795 141567 -107704 -139031 81900 -50410 -266281 65543 -19701 -254632 -134330 -214745
9244b14745c5122j97996G4331f7007j14228D56995a57045b2770A93936a46938
$$ -214745 -35122 -233118 74331 -67007 -181235 456995 -157045 -22770 193936 -146938
9233E2282A2707a27364H1077b12916j14991A85593F676d885j6845p170B72289
$$ 52282 12707 -127364 81077 -212916 -327907 185593 6676 -4885 -21730 -28900 272289
9221a07259k12059C62812c23020J27066H9786g0904r9772M9386A24442R086b30939
$$ -107259 -319318 362812 -323020 -195954 89786 -70904 -170676 -121290 124442 133528 -230939
9209a9638o6576C83488a99351Q1846p4610h7333j4683A07808l2980i6375o4642
$$ -19638 -86214 383488 -199351 -117505 -192115 -87333 -102016 107808 74828 -96375 -161017
9198a61017n6137Q4103e4776B78e9783j52102q5684B23d3569k78929J58680p3766
$$ -161017 -217154 -133051 -54776 278 -59783 -211885 -297569 223 -43569 -322498 -163818 -237584
9186b37584j69J4524c3417C00575F7355J92050B0947a71445r0919H2440e076m1472
$$ -237584 -237753 -223229 -33417 300575 67355 259405 20947 -171445 -262364 82440 -5076 -46548
9174d6548A9024J10408b88028C20888a57937B7364J0632b6311j86581n1852I02
$$ -46548 19024 129432 -288028 320888 -157937 27364 37996 -26311 -212892 -264744 902
9162a15636G26J01403a74474P639o81505b50230n9222l6631J32271B8170d9925
$$ -115636 726 102129 -174474 -166835 -848340 -250230 -309452 -346083 -213812 28170 -49925
9150c22116R9547h3220l20599f4444m8565r5082O6011K6486C0292a36964A7328
$$ -322116 -222569 -83220 -403819 -64444 -113009 -208091 -142080 -115594 30292 -136964 17328
9138b61600F3517i0328C5761a34019k0042B91664d861o3696j38106A0801c3062
$$ -261600 63517 -90328 35761 -134019 -154061 291664 -4861 -68557 -206663 10801 -33062
9126a86231L7080p2138L858n7979A11595B4789a78720h2965p4108Q521J6277A36110
$$ -186231 -149151 -221289 -217431 -275410 111595 24789 -178720 -82965 -157073 -148552 -132275 136110
9113c42704b3094j55214N9422j11401M9923A40655b4406J0751l68037B9478a67765
$$ -342704 -23094 -178308 -118886 -230287 -180364 140655 -24406 -13655 -381692 29478 -167765
9101B62352m3871a69961i342j26414r9308B7385a50834C13430G9920a998B03624
$$ 262352 218481 -169961 -9342 -135756 -235064 27385 -150834 313430 79920 -1998 203624
9089b26285L7096A7905J92862a56483c6344C8712J01450b23132f3509A50795K3542
$$ -226285 -189189 17905 210767 -156483 -36344 38712 140162 -223132 -63509 150795 174337
9078A74337k2934a462j26080A61883F5349c5349C4966p502a4098l90390a2591
$$ 174337 151403 -1462 -127542 161883 65349 -35349 34966 27464 -14098 -404488 -12591
9066C13304c0136C35326b375C04200b29204D1151k0492a44942j97425A21427g9348
$$ 313304 -30136 335326 -2375 304200 -229204 41151 20659 -144942 -342367 121427 -79348
9054A49739b09805N7735C96235A42528e3944B6331N6761a81473A14264D1039b0142
$$ 149739 -209805 -152070 396235 142528 -53944 26331 83092 -181473 114264 41039 -20142
9042C6726c15534a14400C17082f0277A50928b90026e7927j19719A67587G4498
$$ 36726 -315534 -114400 317082 -60277 150928 -290026 -57927 -177646 167587 74498
9031c9423k42997Q3308G4173a96379i2576n3656F0490b56239a08548D9631c2027
$$ -39423 -282420 -199112 74173 -196379 -92576 -146232 60490 -256239 -108548 49631 -32027
9019A1396c16560a17011m2291j7626M6464c9896F7015J79089I5115a72908j50073
$$ 11396 -316560 -117011 -159302 -176928 -130464 -39896 67015 246104 95115 -172908 -322981
9008c22981A3036f2119C20834c69490J55685c7805j10000a1959B7048K41427b1886
$$ -322981 13036 -62119 320834 -369490 -213805 -37805 -147805 -11959 27048 268475 -21886
8996D6006R081J4425a48006j55948B00604c9785j51135A53648J72597A16113m3933
$$ 46006 55087 69512 -148006 -303954 200604 -39785 -190920 153648 326245 116113 72180
8985G2180a32049k43580B23628g9849A46693j0075R7184a04730L1527k42769e6708
$$ 72180 -132049 -375629 223628 -79849 146693 136618 233802 -104730 -73203 -315972 -56708
8973C5377c88189A27149m7489c94837C49572a22663D7353b0346G3305d38010e5821
$$ 35377 -388189 127149 79660 -394837 349572 -122663 47353 -20346 73305 -438010 -55821
8961B3100c19j7511k78095c2379j35595J9974N6594j43848K4471G7245e5105G2344
$$ 23100 -319 -17830 -295925 -32379 -167974 -148000 -91406 -235254 -210783 77245 -55105 72344
8948B61244I474b19192E8459J9026A142a20537B35232d4500A9776O9842J67684
$$ 261244 9474 -219192 58459 77485 1142 -120537 235232 -44500 19776 89618 257302
8937B57302j27996a03815A63219e111G4436a1698m3544f910j23816H8085C3275
$$ 257302 129306 -103815 163219 -5111 74436 -11698 -55242 -6910 -130726 88085 33275
8925a42517b8240h330j7151j39577A2569a87581A01924c82371A89734N810K25813
$$ -142517 -28240 -8330 -25481 -165058 12569 -187581 101924 -382371 189734 195544 421357
8914D21357e9544n4825A3852d04464F7007c04948I7294j8932a52381F7931J6573
$$ 421357 -59544 -114369 13852 -404464 67007 -304948 97294 78362 -152381 67931 84504
8903H4504K94741c57538O451i7219c966k65780J9360A03130J09799Q3221j26187
$$ 84504 379245 -357538 -351087 -97219 -3966 -269746 -250386 103130 212929 296150 169963
8892A69963d0714l7960j31240G6914K04471c3047m0915j83018E3878g5363n2075
$$ 169963 -40714 -78674 -209914 76914 281385 -33047 -73962 -256980 53878 -75363 -127438
8881a27438A78906a34339K1777l2741F3924a43833A03586a56172m7996c0175B37730
$$ -127438 178906 -134339 -112562 -145303 63924 -143833 103586 -156172 -204168 -30175 237730
8869a73764l33355A2464a51656A48508c32145J60250O2035k33511a6987A23295
$$ -173764 -507119 12464 -151656 148508 -332145 -171895 -109860 -343371 -16987 123295
8858e7637A0191P0579J877j3766B8278h2357l7449k23460I161P2293a04352I6607
$$ -57637 10191 80770 82647 68881 28278 -82357 -119806 -343266 9161 81454 -104352 96607
8845a76568E7329N8732a9705k14460B69837b13639J00367A04274N777b50354b8564
$$ -176568 57329 116061 -19705 -234165 269837 -213639 -113272 104274 110051 -250354 -28564
8833A47588a46010J4387F4370M3267J69661a72027e565k3857B50446b04323k02733
$$ 147588 -146010 -131623 64370 107637 277298 -172027 -5565 -29422 250446 -204323 -407056
8822d07056C6090e1458B44896d2593j87128e6618E8026h7758j55981B31795b08686
$$ -407056 36090 -51458 244896 -42593 -229721 -56618 58026 -87758 -243739 231795 -208686
8810g3618j14204j65711B62866e324j07397l64349B55101B367J70124b06109g7427
$$ -73618 -187822 -353533 262866 -5324 -112721 -477070 255101 2367 172491 -206109 -77427
$$ [...]
##END NTUPLES=NMR SPECTRUM
##END=
