##TITLE=AC1579_ROEFFECT0024_8271261_KkX4UNjri4
##JCAMPDX= 6.0         $$ Bruker NMR JCAMP-DX V2.0
##DATA TYPE= NMR SPECTRUM
##DATA CLASS= NTUPLES
##ORIGIN= BRUKER
##OWNER= Administrator
$$ 1.72 TOPSPIN		Version 2.1
$$ 2014-08-04 16:28:30.478 -0700  Administrator@X
$$ Compression mode = diff/dup
##.OBSERVE FREQUENCY= 400.02188249412
##.OBSERVE NUCLEUS= ^1H
##.ACQUISITION MODE= SIMULTANEOUS (DQD)
##.ACQUISITION SCHEME= undefined
##.AVERAGES= 64
##.DIGITISER RES= 22
##SPECTROMETER/DATA SYSTEM= spect
##.PULSE SEQUENCE= noesygpps1d.comp
##.SOLVENT NAME= COFFEE_meoh
##.SHIFT REFERENCE= INTERNAL, COFFEE_meoh, 1, 14.97781
##AUDIT TRAIL= $$ (NUMBER, WHEN, WHO, WHERE, PROCESS, VERSION, WHAT)
$$ ##TITLE= Audit trail, TOPSPIN		Version 2.1
$$ ##JCAMPDX= 5.01
$$ ##ORIGIN= Bruker BioSpin GmbH
$$ ##OWNER= Administrator
$$ $$ E:\/data/COFFEE/nmr/AC1579_ROEFFECT0024_8271261_KkX4UNjri4/22/pdata/1/auditp.txt
$$ ##AUDIT TRAIL=  $$ (NUMBER, WHEN, WHO, WHERE, PROCESS, VERSION, WHAT)
(   1,<2014-08-04 16:28:26.466 -0700>,<Administrator>,<X>,<go>,<TOPSPIN 2.1>,
      <created by zg
	started at 2014-08-04 16:16:57.070 -0700,
	POWCHK enabled, PULCHK disabled,
       configuration hash MD5:
       16 EA D6 F4 BB 67 03 14 9B FF E7 A0 43 5B 48 2E
       data hash MD5: 64K
       3D 44 C7 40 4A B9 EE F0 A0 62 8D 41 E1 34 1A 95>)
(   2,<2014-08-04 16:28:28.800 -0700>,<Administrator>,<X>,<proc1d>,<TOPSPIN 2.1>,
      <Start of raw data processing
       efp LB = 0.3 FT_mod = 6 PKNL = 1 PHC0 = 0 PHC1 = 0 SI = 128K 
       data hash MD5: 128K
       A5 F1 F8 42 3E 71 3B 30 92 40 39 B1 66 55 DA AB>)
(   3,<2014-08-04 16:28:29.517 -0700>,<Administrator>,<X>,<proc1d>,<TOPSPIN 2.1>,
      <pk PHC0 = -88.98376 PHC1 = 0 
       data hash MD5: 128K
       F7 7B 75 AC 2E A8 80 F0 C5 09 F3 AE E1 82 F8 54>)
(   4,<2014-08-04 16:28:29.919 -0700>,<Administrator>,<X>,<proc1d>,<TOPSPIN 2.1>,
      <abs ABSG = 1 
       data hash MD5: 128K
       72 1D C0 BA F6 7D 8E 35 0E 39 17 2A 96 6A 91 AC>)
(   5,<2014-08-04 16:28:30.040 -0700>,<Administrator>,<X>,<proc1d>,<TOPSPIN 2.1>,
      <abs ABSG = 2 
       data hash MD5: 128K
       AE CD DC 3C FD F0 D1 31 1C C4 18 5B 98 89 73 42>)
(   6,<2014-08-04 16:28:30.150 -0700>,<Administrator>,<X>,<proc1d>,<TOPSPIN 2.1>,
      <abs ABSG = 3 
       data hash MD5: 128K
       9B 54 83 5D 02 64 F3 0D 75 61 C8 1A 20 D1 DE CA>)
(   7,<2014-08-04 16:28:30.247 -0700>,<Administrator>,<X>,<proc1d>,<TOPSPIN 2.1>,
      <abs ABSG = 4 
       data hash MD5: 128K
       DA 0B BB B7 77 26 2F 7B 9F B8 CA 23 9D 43 5D 38>)
(   8,<2014-08-04 16:28:30.308 -0700>,<Administrator>,<X>,<proc1d>,<TOPSPIN 2.1>,
      <abs ABSG = 5 
       data hash MD5: 128K
       F7 BA 17 31 94 86 3F F6 0C 2C CF E6 73 D9 17 23>)
$$ ##END=
$$ 
$$ $$ hash MD5
$$ $$ F5 4B B2 F9 52 0D 46 E5 C7 CE 7D B6 73 4B 38 D6
##$RELAX= 
##$RELAX= 
##$RELAX= 
##$RELAX= 
##$RELAX= 
##$RELAX= 
##$RELAX= 
##$RELAX= 
$$ Bruker specific parameters
$$ --------------------------
##$DU= <E:\>
##$EXPNO= 22
$$ [...]
##$TP07= 0
##$TPNAME0= <>
##$TPNAME1= <>
##$TPNAME2= <>
##$TPNAME3= <>
##$TPNAME4= <>
##$TPNAME5= <>
##$TPNAME6= <>
##$TPNAME7= <>
##$TPOAL= (0..7)
0.5 0.5 0.5 0.5 0.5 0.5 0.5 0.5
##$TPOFFS= (0..7)
0 0 0 0 0 0 0 0
##$TUNHIN= 0
##$TUNHOUT= 0
##$TUNXOUT= 0
##$USERA1= <user>
##$USERA2= <user>
##$USERA3= <user>
##$USERA4= <user>
##$USERA5= <user>
##$V9= 5
##$VALIST= <valist>
##$VCLIST= <CCCCCCCCCCCCCCC>
##$VD= 0
##$VDLIST= <DDDDDDDDDDDDDDD>
##$VPLIST= <PPPPPPPPPPPPPPP>
##$VTLIST= <TTTTTTTTTTTTTTT>
##$WBST= 1024
##$WBSW= 4
##$XGAIN= (0..3)
0 0 0 0
##$XL= 0
##$YL= 0
##$YMAX_a= 11212510
##$YMIN_a= -12367371
##$ZGOPTNS= <>
##$ZL1= 120
##$ZL2= 120
##$ZL3= 120
##$ZL4= 120
##$ABSF1= 14.97781
##$ABSF2= -5.580372
##$ABSG= 5
##$ABSL= 3
##$ALPHA= 0
##$AQORDER= 0
##$ASSFAC= 0
##$ASSFACI= 0
##$ASSFACX= 0
##$ASSWID= 0
##$AUNMP= <proc_prof1d_extract.lims>
##$AXLEFT= 0
##$AXNAME= <>
##$AXNUC= <1H>
##$AXRIGHT= 0
##$AXTYPE= 0
##$AXUNIT= <>
##$AZFE= 0.1
##$AZFW= 0.1
##$BCFW= 0
##$BC_mod= 0
##$BYTORDP= 0
##$COROFFS= 0
##$CY= 15
##$DATMOD= 1
##$DC= 0
##$DFILT= <>
##$DTYPP= 0
##$F1P= 0
##$F2P= 0
##$FCOR= 0.5
##$FTSIZE= 131072
##$FT_mod= 6
##$GAMMA= 0
##$GB= 0
##$INTBC= 1
##$INTSCL= 1
##$ISEN= 128
##$LB= 0.3
##$LEV0= 0
##$LPBIN= 0
##$MAXI= 10000
##$MC2= 0
##$MEAN= 0
##$ME_mod= 0
##$MI= 0
##$NCOEF= 0
##$NC_proc= -1
##$NLEV= 6
##$NOISF1= 0
##$NOISF2= 0
##$NSP= 0
##$NTH_PI= 0
##$NZP= 0
##$OFFSET= 14.97781
##$PC= 1
##$PHC0= -88.98376
##$PHC1= 0
##$PH_mod= 1
##$PKNL= yes
##$PPARMOD= 0
##$PPDIAG= 0
##$PPIPTYP= 0
##$PPMPNUM= 2147483647
##$PPRESOL= 1
##$PSCAL= 4
##$PSIGN= 0
##$PYNMP= <proc.py>
##$REVERSE= no
##$SF= 400.020002914056
##$SI= 131072
##$SIGF1= 0
##$SIGF2= 0
##$SINO= 400
##$SIOLD= 131072
##$SPECTYP= <>
##$SREGLST= <1H.CDCl3>
##$SSB= 0
##$STSI= 131072
##$STSR= 0
##$SW_p= 8223.68421052631
##$SYMM= 0
##$S_DEV= 0
##$TDeff= 65536
##$TDoff= 0
##$TI= <>
##$TILT= no
##$TM1= 0
##$TM2= 0
##$TOPLEV= 0
##$USERP1= <user>
##$USERP2= <user>
##$USERP3= <user>
##$USERP4= <user>
##$USERP5= <user>
##$WDW= 1
##$XDIM= 131072
##$YMAX_p= 176184489
##$YMIN_p= -518789513
##$CURPLOT= <Network HP LaserJet P1505>
##$CURPRIN= <$Network HP LaserJet P1505>
##$DFORMAT= <normdp>
##$LAYOUT= <+/1D_H.xwp>
##$LFORMAT= <normlp>
##$PFORMAT= <normpl>
##$SURQMSG= 1
$$ End of Bruker specific parameters
$$ ---------------------------------
##NTUPLES= NMR SPECTRUM
##VAR_NAME=  FREQUENCY,     SPECTRUM/REAL,   SPECTRUM/IMAG
##SYMBOL=    X,             R,               I
##VAR_TYPE=  INDEPENDENT,   DEPENDENT,       DEPENDENT
##VAR_FORM=  AFFN,          ASDF,            ASDF
##VAR_DIM=   131072,        131072,          131072
##UNITS=     HZ,            ARBITRARY UNITS, ARBITRARY UNITS
##FACTOR=    0.0627417313425164, 1,          1
##FIRST=     8223.62146879497, 955,          -16446
##LAST=      0,             1450,            -16461
##MIN=       0,             -518789513,      0
##MAX=       8223.62146879497, 176184489,    0
$$ Real data points
##PAGE= N=1
##DATA TABLE= (X++(R..R)), XYDATA
$$ [...]
$$ plain form
62866 833185 809006 783020 755738 727600 699068 670508 642275 614869 588746 564073 540853
62855 540853 519240 499419 481268 464435 448761 434332 421110 408752 396893 385424 374480
62844 374480 364300 355087 346814 339206 332012 325276 319163 313630 308494 303790 299791 296603 293979 291586
62830 291586 289255 286979 284855 283095 281857 280997 280148 279172 278363 278053 278111 277981 277235 275979 274692 273738 273083
62813 273083 272444 271593 270428 268902 267119 265488 264475 264111 263937 263537 262909 262225 261502 260722 260016 259443 258804
62796 258804 257932 256988 256184 255377 254312 253102 252075 251240 250321 249328 248707 248830 249649 250901 252325 253600 254393
62779 254393 254629 254544 254370 254147 253867 253573 253274 252967 252788 252901 253171 253164 252555 251335 249664 247788 246180 245390
62761 245390 245540 246178 246793 247327 248019 248976 250034 250936 251493 251712 251884 252393 253297 254198 254653 254591 254281 254038 254079
$$ packed form
62866H33185k4179k5986k7282k8138k8532k8560k8233k7406k6123k4673k3220
62855E40853k1613j9821j8151j6833j5674j4429j3222j2358j1859j1469j0944
62844C74480j0180r213q273p608p194o736o113n533n136m704l999l188k624k393
62830B91586k331k276k124j760j238q60q49r76q09l10N8j30p46j256j287r54o55
62813B73083o39q51j165j526j783j631j013l64j74m00o28o84p23p80p06n73o39
62796B58804q72r44q04q07j065j210j027q35r19r93o21J23Q19J252J424J275P93
62779B54393K36q5j74k23k80k94k99l07j79J13K70po09j220j671j876j608p90
62761B45390J50O38O15N34O92R57J058R02N57K19J72N09R04R01M55o2l10k43M1
$$ plain form
62742 254079 254455 254916 255022 254576 253922 253555 253537 253453 252985 252309 251845 251748 251753 251503 250935 250305 249879 249718 249806 250249 251199
62721 251199 252581 254075 255410 256598 257848 259328 261051 262907 264745 266454 268007 269489 271069 272927
62707 272927 275098 277352 279342 280916 282235 283544 284974 286622 288624 290970 293385 295610 297789 300451
62693 300451 304155 309201 315506 322604 329960 337540 345946 355799 367142 379692 393454 408701 425482
62680 425482 443613 463178 484565 507898 532871 559353 587871 619300 654245 692791 734558
62669 734558 778786 824524 870865 916898 961419 1002962 1040206 1072115 1097646 1115635 1125229 1126273
62657 1126273 1119132 1104318 1082450 1054367 1021067 983598 943076 900649 857254 813525 770035
62646 770035 727542 686877 648635 613052 580081 549574 521490 495919 472844 451954 432904
$$ packed form
62742B54079L76M61J06m46o54l67j8q4m68o76m64r7Nk50n68o30m26j61Q8M43R50
62721B51199J382J494J335J188J250J480J723J856J838J709J553J482J580J858
62707B72927K171K254J990J574J319J309J430J648K002K346K415K225K179K662
62693C00451L704N046O305P098P356P580Q406R853J1343J2550J3762J5247J6781
62680D25482J8131J9565K1387K3333K4973K6482K8518L1429L4945L8546M1767
62669G34558M4228M5738M6341M6033M4521M1543L7244L1909K5531J7989R594J044
62657A126273p141j4814k1868k8083l3300l7469m0522m2427m3395m3729m3490
62646G70035m2493m0665l8242l5583l2971l0507k8084k5571k3075k0890j9050
$$ plain form
62635 432904 415681 400450 387057 375013 364018 354159 345495 337783 330813 324702 319615 315375 311602
62622 311602 308094 304946 302391 300623 299647 299208 299039 299217 300088 301775 304017 306593 309606 313241 317508
62607 317508 322407 328105 334751 342325 350811 360275 370641 381680 393439 406415 421083 437498 455612
62594 455612 475675 498028 522728 549704 579040 610733 644268 678767 713421 747478 779927
62583 779927 809560 835353 856547 872465 882532 886434 884013 875132 859961 839313 814390 786203
62571 786203 755452 722884 689428 655965 623218 591831 562251 534535 508561 484448 462509
62560 462509 442729 424629 407742 392042 377743 364903 353361 342935 333517 324984 317128 309708
62548 309708 302623 296048 290275 285413 281307 277839 275139 273314 272104 271047 269920 268806 267764 266632
$$ packed form
62635D32904j7223j5231j3393j2044j0995r859q664p712o970o111n087m240l773
62622C11602l508l148k555j768r76m39j69J78Q71J687K242K576L013L635M267
62607C17508M899N698O646P574Q486R464J0366J1039J1759J2976J4668J6415J8114
62594D55612K0063K2353K4700K6976K9336L1693L3535L4499L4654L4057L2449
62583G79927K9633K5793K1194J5918J0067L902k421q881j5171k0648k4923k8187
62571G86203l0751l2568l3456l3463l2747l1387k9580k7716k5974k4113k1939
62560D62509j9780j8100j6887j5700j4299j2840j1542j0426r418q533p856p420
62548C09708p085o575n773m862m106l468k700j825j210j057j127j114j042j132
$$ plain form
62534 266632 265192 263341 261081 258494 255768 253155 250874 249069 247780 246878 246154 245572 245355 245660 246308 246959
62518 246959 247436 247721 247817 247823 248001 248484 249024 249337 249610 250334 251650 253224 254807 256579 258813 261507 264543
62501 264543 267938 271728 275799 280103 284964 290954 298436 307362 317530 328927 341730 356059 371849
62488 371849 389070 407942 428715 451171 474515 497842 520528 542075 561820 579063 593345
62477 593345 604303 611362 613899 611728 605215 594934 581438 565335 547257 527672 506958 485748
62465 485748 464923 445121 426407 408554 391496 375440 360682 347439 335772 325539 316480 308373
62453 308373 301040 294263 287877 281982 276862 272598 268918 265502 262291 259413 256959 254980 253561 252656
62439 252656 251938 250976 249644 248193 246913 245826 244769 243678 242653 241757 240908 240105 239672 240121 241733 244327
$$ packed form
62534B66632j440j851k260k587k726k613k281j805j289r02p24n82k17L05O48O51
62518B46959M77K85R6OJ78M83N40L13K73P24J316J574J583J772K234K694L036
62501B64543L395L790M071M304M861N990P482Q926J0168J1397J2803J4329J5790
62488C71849J7221J8872K0773K2456K3344K3327K2686K1547J9745J7243J4282
62477E93345J0958P059K537k171o513j0281j3496j6103j8078j9585k0714k1210
62465D85748k0825j9802j8714j7853j7058j6056j4758j3243j1667j0233r059q107
62453C08373p333o777o386n895n120m264l680l416l211k878k454j979j419r05
62439B52656p18r62j332j451j280j087j057j091j025q96q49q03m33M49J612K594
$$ plain form
62423 244327 247447 250664 253737 256705 259931 263927 269006 275190 282511 291189 301351 312769 325120
62410 325120 338445 353149 369609 387969 408166 429868 452424 475192 497989 520983 544079
62399 544079 566605 587684 606742 623645 638548 651721 663359 673421 681769 688509 694171 699593
62387 699593 705754 713533 723091 733187 741338 745220 744149 739283 732419 724509 715045 702467 685158
62374 685158 662423 634994 604726 573673 543168 513575 484771 456733 429709 404087 380361
62363 380361 359173 341051 325966 313322 302471 293093 285022 277984 271789 266555 262457 259343 256866
62350 256866 254926 253657 253035 252769 252681 252888 253551 254635 256048 257856 260271 263446 267320 271549 275629 279195
62334 279195 282196 284678 286461 287254 287037 286086 284533 282122 278543 273930 268872 263975 259464 255193 250969
$$ packed form
62423B44327L120L217L073K968L226L996N079O184P321Q678J0162J1418J2351
62410C25120J3325J4704J6460J8360K0197K1702K2556K2768K2797K2994K3096
62399E44079K2526K1079J9058J6903J4903J3173J1638J0062Q348O740N662N422
62387F99593O161P779R558J0096Q151L882j071m866o864p910r464j2578j7309
62374F85158k2735k7429l0268l1053l0505k9593k8804k8038k7024k5622k3726
62363C80361k1188j8122j5085j2644j0851r378q071p038o195n234m098l114k477
62350B56866j940j269o22k66q8K07O63J084J413J808K415L175L874M229M080L566
62334B79195L001K482J783P93k17r51j553k411l579m613n058m897m511m271m224
$$ plain form
62319 250969 246799 242797 238942 235133 231444 228103 225100 222106 218949 215941 213492 211626 210203 209370
62305 209370 209373 210010 210717 211174 211457 211633 211631 211595 211930 212867 214292 216053 218089 220181 221994 223571 225429 227922
62287 227922 230795 233613 236352 239323 242726 246561 250723 254928 258687 261638 263844 265644 267340 269143
62273 269143 271192 273420 275564 277557 279754 282545 285892 289499 293356 297882 303535 310456 318515 327600
62259 327600 337924 350094 364748 382011 401455 422630 445382 469458 494098 518313 541383
62248 541383 562741 581553 596883 608386 616534 622072 625485 627019 626870 625046 621187 614787 605646
62235 605646 594059 580558 565600 549535 532827 516137 500061 484826 470388 456808 444273
62224 444273 432698 421553 410313 398983 387939 377372 367169 357268 347809 338831 330146 321656
$$ packed form
62319B50969m170m002l855l809l689l341l003k994l157l008k449j866j423q33
62305B09370LO37P07M57K83J76kl6L35R37J425J761K036K092J813J577J858K493
62287B27922K873K818K739K971L403L835M162M205L759K951K206J800J696J803
62273B69143K049K228K144J993K197K791L347L607L857M526N653O921Q059R085
62259C27600J0324J2170J4654J7263J9444K1175K2752K4076K4640K4215K3070
62248E41383K1358J8812J5330J1503Q148N538L413J534j49j824l859o400r141
62235F05646j1587j3501j4958j6065j6708j6690j6076j5235j4438j3580j2535
62224D44273j1575j1145j1240j1330j1044j0567j0203r901r459q978q685q490
$$ plain form
62212 321656 313654 306565 300463 295056 290086 285590 281719 278502 275915 274023 272892 272378 272160 272059 272134
62197 272134 272458 272974 273666 274666 275976 277203 277874 278032 278256 278996 280051 280812 280884 280389 279725 279182 278755 278307
62179 278307 277862 277689 278036 278854 279868 280863 281802 282796 284149 286339 289671 293961 298821 304269 310830 318991
62163 318991 328815 340180 353116 367772 384304 402949 424028 447669 473637 501569 531176 562076
62151 562076 593519 624446 653723 680256 703069 721514 735343 744508 748997 748979 744923 737319 726324
62138 726324 711770 693495 671600 646533 619099 590350 561325 532857 505607 480065 456434
62127 456434 434686 414871 397279 382122 369180 357901 347850 338938 331252 324756 319146 313981
62115 313981 308992 304276 300074 296406 293051 289866 286886 284110 281476 279142 277506 276741 276547 276572 276849
$$ packed form
62212C21656q002p089o102n407m970m496l871l217k587j892j131n14k18j01P5
62197B72134L24N16O92J000J310J227O71J58K24P40J055P61P2m95o64n43m27m48
62179B78307m45j73L47Q18J014R95R39R94J353K190L332M290M860N448O561Q161
62163C18991R824J1365J2936J4656J6532J8645K1079K3641K5968K7932K9607L0900
62151E62076L1443L0927K9277K6533K2813J8445J3829R165M489j8m056p604j0995
62138G26324j4554j8275k1895k5067k7434k8749k9025k8468k7250k5542k3631
62127D56434k1748j9815j7592j5157j2942j1279j0051q912p686o496n610n165
62115C13981m989m716m202l668l355l185k980k776k634k334j636p65j94K5K77
$$ plain form
62100 276849 277580 278659 279673 280339 280747 281254 282289 284137 286706 289621 292656 295942 299609 303440 307143
62085 307143 310822 314868 319417 324180 328829 333296 337650 341817 345515 348397 350281 351291 351767 352096 352711
62070 352711 354201 357119 361590 367380 374495 383458 394802 408543 424314 441693 460045 478308 495403
62057 495403 510738 524012 534678 542131 546429 548387 548800 547870 545402 541214 535208 527298 517511 506049
62043 506049 493244 479540 465510 451699 438471 426145 415153 405836 398110 391645 386341 382312
62031 382312 379398 377030 374700 372302 369936 367663 365612 364071 363278 363280 364133 366059 369260 373683 379094
62016 379094 385252 391942 399009 406473 414470 422936 431493 439776 447714 455234 461722 466040 467246 465340
62002 465340 461335 456687 452657 450016 449089 449770 451465 453256 454417 454821 454835 454899 455308 456250 457802 459853
$$ packed form
62100B76849P31J079J014O66M08N07J035J848K569K915L035L286L667L831L703
62085C07143L679M046M549M763M649M467M354M167L698K882J884J010M76L29O15
62070C52711J490K918M471N790P115Q963J1344J3741J5771J7379J8352J8263J7095
62057D95403J5335J3274J0666P453M298J958M13r30k468m188o006p910r787j1462
62043E06049j2805j3704j4030j3811j3228j2326j0992r317p726o465n304m029
62031C82312k914k368k330k398k366k273k051j541p93KQ53J926L201M423N411
62016C79094O158O690P067P464P997Q466Q557Q283P938P520O488M318J206j906
62002D65340m005m648m030k641r27O81J695J791J161M04J4O4M09R42J552K051
$$ plain form
61986 459853 462191 464665 467155 469447 471384 473117 474973 477021 478989 480716 482488 484812 488081 492575
61972 492575 498567 506105 514740 523794 532957 542415 552297 562192 571469 580004 588315 596855 605383 613180
61958 613180 619689 624658 627760 628542 626908 623403 618804 613584 607925 602018 596080 590141 583985 577196
61944 577196 569181 559364 547703 534907 521892 509054 496215 483151 469835 456268 442418 428383
61932 428383 414335 400317 386356 372827 360395 349497 340065 331813 324585 318356 313116 308803 305214
61919 305214 301923 298530 295071 291991 289604 287752 286060 284371 282821 281645 280998 280822 280822 280721 280582 280766
61903 280766 281542 282935 284933 287592 290797 294153 297283 300081 302528 304412 305423 305436 304530 302774 300146
61888 300146 296646 292403 287668 282739 277866 273172 268664 264307 260092 256055 252306 248975 246042 243318
$$ packed form
61986D59853K338K474K490K292J937J733J856K048J968J727J772K324L269M494
61972D92575N992P538Q635R054R163R458R882R895R277Q535Q311Q540Q528P797
61958F13180O509M969L102P82j634l505m599n220n659n907n938n939o156o789
61944E77196q015r817j1661j2796j3015j2838j2839j3064j3316j3567j3850j4035
61932D28383j4048j4018j3961j3529j2432j0898r432q252p228o229n240m313l589
61919C05214l291l393l459l080k387j852j692j689j550j176o47j76%j01j39J84
61903B80766P76J393J998K659L205L356L130K798K447J884J011J3r06j756k628
61888C00146l500m243m735m929m873m694m508m357m215m037l749l331k933k724
$$ plain form
61874 243318 240714 238422 236620 235073 233346 231419 229800 228958 228873 229259 229963 230960 232193 233604 235220 237047
61858 237047 238974 240911 242885 244907 246897 248874 251054 253547 256140 258592 261083 264037 267518 271094
61844 271094 274390 277565 281112 285365 290374 296142 302726 310068 317907 325961 334103 342263 350287 358044
61830 358044 365609 373180 380779 388211 395276 401833 407610 412213 415434 417373 418125 417562 415611 412521 408648
61815 408648 404165 399269 394527 390708 388339 387666 388917 392224 397339 403757 411128 419268 427756 435884
61801 435884 443026 448791 452809 454787 454820 453299 450365 445777 439485 431978 423874 415402 406526 397383 388354
61786 388354 379857 372197 365482 359553 354155 349204 344765 340719 336745 332718 328848 325329 322163 319489
61772 319489 317723 317098 317328 318027 319210 321044 323326 325595 327751 330166 333177 336729 340557 344556 348864
$$ packed form
61874B43318k604k292j802j547j727j927j619q42q5L86P04R97J233J411J616J827
61858B37047J927J937J974K022J990J977K180K493K593K452K491K954L481L576
61844B71094L296L175L547M253N009N768O584P342P839Q054Q142Q160Q024P757
61830C58044P565P571P599P432P065O557N777M603L221J939P52n63j951l090l873
61815D08648m483m896m742l819k369o73J251L307N115O418P371Q140Q488Q128
61801D35884P142N765M018J978L3j521k934m588o292p507q104q472q876r143r029
61786C88354q497p660o715n929n398m951m439m046l974m027l870l519l166k674
61772C19489j766o25K30O99J183J834K282K269K156K415L011L552L828L999M308
$$ plain form
61757 348864 353730 359332 365690 372792 380827 390129 400796 412523 424974 438157 452209 466971 482028
61744 482028 497133 512304 527449 542087 555500 567010 576048 582126 584913 584377 580860 575017 567666
61731 567666 559634 551670 544397 538327 533956 531877 532606 536122 541646 548092 554747 561330 567453 572317
61717 572317 575084 575301 572873 567821 560252 550418 538641 525222 510471 494744 478470 462244 446835
61704 446835 432834 420260 408734 398079 388490 380073 372608 365913 360137 355400 351408 347717 344223
61691 344223 341165 338711 336705 334770 332560 330079 327790 326180 325132 323985 322336 320459 318790 317369
61677 317369 316034 314807 313702 312476 310950 309365 308013 306722 305156 303457 302133 301365 300877 300479 300294
61662 300294 300414 300705 301046 301468 302004 302653 303524 304715 306024 307048 307586 307696 307380 306520 305200 303745 302330
$$ packed form
61757C48864M866N602O358P102Q035R302J0667J1727J2451J3183J4052J4762J5057
61744D82028J5105J5171J5145J4638J3413J1510R038O078K787n36l517n843p351
61731E67666q032p964p273o070m371k079P29L516N524O446O655O583O123M864
61717E72317K767K17k428n052p569r834j1777j3419j4751j5727j6274j6226j5409
61704D46835j4001j2574j1526j0655r589q417p465o695n776m737l992l691l494
61691C44223l058k454k006j935k210k481k289j610j048j147j649j877j669j421
61677C17369j335j227j105j226j526j585j352j291j566j699j324p68m88l98j85
61662C00294J20K91L41M22N36O49Q71J191J309J024N38J10l16q60j320j455j415
$$ plain form
61645 302330 300808 299056 297260 295761 294718 294015 293332 292332 290959 289602 288738 288422 288322 288250 288338 288644 288920
61628 288920 288937 288850 289001 289542 290389 291432 292643 294039 295638 297363 298952 300078 300666 301004 301477 302223 303090
61611 303090 303807 304161 304120 303815 303350 302620 301370 299439 296826 293600 289927 286175 282747 279725 276844 273881
61595 273881 270934 268200 265694 263373 261412 260087 259308 258467 256892 254466 251710 249238 247184 245219 243058
61580 243058 240810 238822 237290 236115 235051 233933 232761 231618 230465 229119 227540 226074 225142 224668 224123
61565 224123 223250 222424 222039 221845 221277 220236 219186 218509 218169 217968 217778 217485 217048 216696 216769 217251 217679 217686 217420
61546 217420 217332 217690 218419 219308 220252 221338 222710 224297 225741 226717 227253 227572 227681 227339 226406 224956 223028
61529 223028 220575 217706 214736 211862 209029 206234 203736 201774 200277 199036 198042 197424 197188 197188 197353 197690
$$ packed form
61645C02330j522j752j796j499j043p03o83j000j373j357q64l16j00p2Q8L06K76
61628B88920J7q7J51N41Q47J043J211J396J599J725J589J126N88L38M73P46Q67
61611C03090P17L54m1l05m65p30j250j931k613l226l673l752l428l022k881k963
61595B73881k947k734k506k321j961j325p79q41j575k426k756k472k054j965k161
61580B43058k248j988j532j175j064j118j172j143j153j346j579j466r32m74n45
61565B24123q73q26l85j94n68j041j050o77l40k01j90k93m37l52P3M82M28Pk66
61546B17420q8L58P29Q89R44J086J372J587J444R76N36L19J09l42r33j450j928
61529B23028k453k869k970k874k833k795k498j962j497j241r94o18k36%J65L37
$$ plain form
61513 197690 198079 198236 198037 197726 197623 197593 197019 195492 193363 191365 189674 187730 185128 182309 180013 178336
61497 178336 176747 174899 172947 171079 169279 167679 166622 166135 165693 164808 163605 162487 161513 160446 159301
61482 159301 158433 158107 158237 158580 158915 158983 158541 157645 156750 156355 156540 156958 157250 157366 157443 157504 157419 157176 156990 157063
61462 157063 157350 157695 158098 158683 159402 160011 160340 160418 160307 159958 159379 158819 158643 159019 159808 160773 161805 162885
61444 162885 163885 164584 164964 165363 166109 167040 167678 167927 168292 169221 170558 171921 173366 175260 177615 179957
61428 179957 181857 183243 184144 184473 184162 183260 181827 179941 177867 175997 174548 173515 172932 172900 173298 173715
61412 173715 173829 173692 173595 173811 174465 175375 175992 175784 174811 173650 172710 171896 171055 170358 170004 169867 169749 169744 170034
61393 170034 170516 170938 171275 171688 172202 172731 173341 174179 175106 175735 175908 175914 176146 176713 177452 178197 178871 179419 179784
$$ packed form
61513A97690L89J57j99l11j03l0n74j527k129j998j691j944k602k819k296j677
61497A78336j589j848j952j868j800j600j057m87m42q85j203j118r74j067j145
61482A59301q68l26J30L43L35O8m42q96q95l95J85M18K92J16P7O1q5k43j86P3
61462A57063K87L45M03N85P19O09L29P8j11l49n79n60j76L76P89R65J032J080
61444A62885J000O99L80L99P46R31O38K49L65R29J337J363J445J894K355K342
61428A79957J900J386R01L29l11r02j433j886k074j870j449j033n83l2L98M17
61412A73715J14j37r7K16O54R10O17k08r73j161r40q14q41o97l54j37j18nK90
61393A70034M82M22L37M13N14N29O10Q38R27O29J73OK32N67P39P45O74N48L65
$$ plain form
61374 179784 179973 180091 180267 180548 180893 181266 181700 182172 182504 182492 182188 181913 181925 182159 182371 182438 182446 182495 182558 182564 182543 182626
61352 182626 182917 183368 183835 184235 184577 184879 185161 185540 186156 186959 187692 188237 188839 189885 191546 193721 196197
61335 196197 198693 200941 202928 204945 207175 209382 211253 212847 214414 215908 217078 217955 218833 219803 220723
61320 220723 221669 222979 224681 226282 227262 227484 227039 226053 224822 223793 223152 222685 222145 221511 220784 219837 218659
61303 218659 217422 216162 214711 213095 211654 210565 209594 208535 207550 206793 206058 205145 204246 203616 203120 202487
61287 202487 201774 201216 200804 200401 200090 200045 200158 200219 200295 200616 201187 201856 202645 203627 204598 205268 205714 206271 207055 207995
61267 207995 209238 211035 213173 215029 216348 217572 219198 221142 223023 224823 226968 229816 233264 236895
61253 236895 240420 243950 247836 252304 257323 262820 268778 274961 280809 285869 290181 293953 297024 299027
$$ packed form
61374A79784J89J18J76K81L45L73M34M72L32j2l04k75J2K34K12O7QM9O3Ok1Q3
61352A82626K91M51M67M00L42L02K82L79O16Q03P33N45O02J046J661K175K476
61335A96197K496K248J987K017K230K207J871J594J567J494J170Q77Q78R70R20
61320B20723R46J310J702J601R80K22m45r86j231j029o41m67n40o34p27r47j178
61303B18659j237j260j451j616j441j089r71j059r85p57p35r13q99o30m96o33
61287B02487p13n58m12m03l11m5J13O1P6L21N71O69P89R82R71O70M46N57P84R40
61267B07995J243J797K138J856J319J224J626J944J881J800K145K848L448L631
61253B36895L525L530L886M468N019N497N958O183N848N060M312L772L071K003
$$ plain form
61239 299027 300020 300560 301100 301602 301760 301288 299994 297916 295507 293346 291545 289683 287458 285079 282893 280941
61223 280941 279164 277781 277100 277037 277114 276976 276708 276637 276962 277659 278624 279824 281307 283075 285065 287292 290040
61206 290040 293784 298885 305367 312949 321178 329496 337258 343844 348859 352246 354208 354988 354734 353624 352030
61191 352030 350342 348598 346424 343488 339839 335775 331541 327370 323601 320493 317927 315556 313230 311146
61177 311146 309569 308566 308009 307723 307649 307968 309005 310871 313248 315666 317913 320054 322162 324275 326563
61162 326563 329363 333035 337921 344331 352271 361206 370324 378960 386564 392357 395474 395643 393481 389968
61148 389968 385761 381054 375848 370171 364214 358420 353334 349216 345851 342844 340040 337599 335740 334465
61134 334465 333499 332443 331062 329479 328042 327039 326627 327007 328518 331391 335423 339952 344197 347785 350969
$$ packed form
61239B99027R93N40N40N02J58m72j294k078k409k161j801j862k225k379k186j952
61223B80941j777j383o81o3P7j38k68p1L25O97R65J200J483J768J990K227K748
61206B90040L744N101O482P582Q229Q318P762O586N015L387J962P80k54j110j594
61191C52030j688j744k174k936l649m064m234m171l769l108k566k371k326k084
61177C11146j577j003n57k86p4L19J037J866K377K418K247K141K108K113K288
61162C26563K800L672M886O410P940Q935R118Q636P604N793L117J69k162l513
61148C89968m207m707n206n677n957n794n086m118l365l007k804k441j859j275
61134C34465r66j056j381j583j437j003m12L80J511K873M032M529M245L588L184
$$ plain form
61119 350969 354245 357696 360912 363644 366293 369508 373463 377810 382189 386431 390333 393680 396574 399382
61105 399382 402316 405372 408788 413137 418748 425366 432601 440511 449426 459405 470174 481484 493310
61092 493310 505676 518437 531136 542973 553083 561020 566920 571054 573423 574009 573182 571487 568977
61079 568977 565119 559480 552293 544227 535723 526737 517062 506695 495833 484619 473036 461079 448900
61066 448900 436675 424426 412159 400152 388904 378726 369549 361224 353860 347711 342833 339011 336038
61053 336038 333932 332918 333194 334699 337044 339793 342821 346259 349970 353205 354991 354854 353077 350329 347240
61038 347240 344305 341945 340455 339912 340264 341515 343842 347523 352741 359472 367549 376825 387211 398570
61024 398570 410690 423443 436849 450914 465443 480161 494964 509908 524963 539911 554505
$$ packed form
61119C50969L276L451L216K732K649L215L955M347M379M242L902L347K894K808
61105C99382K934L056L416M349N611O618P235P910Q915R979J0769J1310J1826
61092D93310J2366J2761J2699J1837J0110P937N900M134K369N86q27j695k510
61079E68977l858n639p187q066q504q986r675j0367j0862j1214j1583j1957j2179
61066D48900j2225j2249j2267j2007j1248j0178r177q325p364o149m878l822k973
61053C36038k106j014K76J505K345K749L028L438L711L235J786j37j777k748l089
61038C47240k935k360j490n43L52J251K327L681N218O731Q077R276J0386J1359
61024C98570J2120J2753J3406J4065J4529J4718J4803J4944J5055J4948J4594
$$ plain form
61013 554505 568563 581841 593943 604526 613573 621323 627935 633345 637420 640103 641308 640771 638162
61000 638162 633337 626401 617516 606761 594222 580112 564767 548537 531734 514627 497475 480621
60988 480621 464572 449854 436652 424652 413315 402352 391926 382456 374283 367447 361676 356629
60976 356629 352233 348741 346396 345062 344308 343768 343315 342993 342966 343472 344567 345864 346816 347405 348331 350322 353401
60959 353401 357047 360943 365245 370208 375886 382347 389911 398930 409421 421068 433498 446433 459667
60946 459667 473084 486741 500802 515329 530172 545037 559624 573771 587528 601053 614322
60935 614322 627015 638797 649684 659950 669708 678797 687128 694978 702844 711145 720111 729832 740358
60922 740358 751846 764632 778997 794883 811985 830097 849124 868888 889395 911435 936495
$$ packed form
61013E54505J4058J3278J2102J0583R047P750O612N410M075K683J205n37k609
61000F38162m825o936q885j0755j2539j4110j5345j6230j6803j7107j7152j6854
60988D80621j6049j4718j3202j2000j1337j0963j0426r470q173o836n771n047
60976C56629m396l492k345j334p54n40m53l22k7N06J095J297R52N89R26J991L079
60959C53401L646L896M302M963N678O461P564R019J0491J1647J2430J2935J3234
60946D59667J3417J3657J4061J4527J4843J4865J4587J4147J3757J3525J3269
60935F14322J2693J1782J0887J0266R758R089Q331P850P866Q301Q966R721J0526
60922G40358J1488J2786J4365J5886J7102J8112J9027J9764K0507K2040K5060
$$ plain form
60911 936495 965878 1000268 1040287 1086847 1140527 1200998 1267650 1340605 1420956 1510748 1613511
60900 1613511 1734491 1879681 2054883 2266197 2520875 2827197 3194909 3638175 4179271
60891 4179271 4849866 5689242 6736593 8007930 9455517 10936266 12233190 13142322 13574020
60882 13574020 13592820 13370969 13104418 12953777 13020182 13323670 13774643 14177527 14301572 13989826
60872 13989826 13229423 12135191 10872682 9585943 8368861 7270993 6311648 5490336
60864 5490336 4795457 4211911 3724811 3319757 2983284 2704194 2473468 2282710 2123527
60855 2123527 1988514 1871952 1769463 1677758 1594745 1519073 1449343 1384219 1323195 1266492 1214152
60844 1214152 1165825 1121325 1080500 1042386 1005283 967961 930267 892492 854917 818177 783277
$$ packed form
60911I36495K9383L4390M0019M6560N3680O0471O6652P2955Q0351Q9792J02763
60900A613511J20980J45190J75202K11314K54678L06322L67712M43266N41096
60891D179271O70595Q39376J047351J271337J447587J480749J296924R09132M31698
60882A3574020J8800k21851k66551j50641O6405L03488M50973M02884J24045l11746
60872A3989826p60403j094232j262509j286739j217082j097868r59345q21312
60864E490336o94879n83546m87100m05054l36473k79090k30726j90758j59183
60855B123527j35013j16562j02489r1705q3013p5672o9730o5124o1024n6703n2340
60844A214152m8327m4500m0825l8114l7103l7322l7694l7775l7575l6740l4900
$$ plain form
60833 783277 750760 720336 691643 664850 640199 617471 596317 576733 558876 542770 528484
60822 528484 516172 505619 496078 486894 478051 469846 462389 455641 449643 444369 439648 435495 432243 430079
60808 430079 428672 427496 426283 424953 423356 421352 418942 416163 413019 409601 405994 402001 397340 392225
60794 392225 387333 383000 378877 374601 370386 366578 363074 359585 356200 353222 350622 348075 345415 342753
60780 342753 340251 338030 336154 334496 332772 330877 328967 327028 324622 321362 317436 313339 309326 305384
60766 305384 301615 298267 295470 293164 291228 289519 287870 286257 284828 283658 282643 281793 281407 281742 282671
60751 282671 283823 284874 285553 285590 284920 283838 282807 282242 282513 283847 286006 288296 290053 290934 290699 289136
60735 289136 286442 283316 280354 277611 275009 272812 271296 270254 269266 268313 267716 267597 267776 268150 268787 269657
$$ packed form
60833G83277l2517l0424k8693k6793k4651k2728k1154j9584j7857j6106j4286
60822E28484j2312j0553r541r184q843q205p457o748n998n274m721m153l252k164
60808D30079j407j176j213j330j597k004k410k779l144l418l607l993m661n115
60794C92225m892m333m123m276m215l808l504l489l385k978k600k547k660k662
60780C42753k502k221j876j658j724j895j910j939k406l260l926m097m013l942
60766C05384l769l348k797k306j936j709j649j613j429j170j015q50l86L35R29
60751B82671J152J051O79L7o70j082j031n65K71J334K159K290J757Q81k35j563
60735B89136k694l126k962k743k602k197j516j042r88r53n97j19J79L74O37Q70
$$ plain form
60719 269657 270523 271122 271328 271132 270627 269906 268942 267679 266281 265026 263888 262550 260974 259557 258495 257348
60703 257348 255580 253260 250895 248817 247007 245264 243256 240686 237731 235058 233077 231436 229555 227381
60689 227381 225247 223329 221618 220141 218762 217060 214909 212912 211721 211097 210216 208792 207349 206425 206067
60674 206067 206124 206518 207133 207822 208571 209409 210162 210691 211268 212336 213920 215672 217490 219692 222520 225797 229132
60657 229132 232168 234633 236492 238073 239772 241613 243317 244694 245705 246238 246185 245752 245364 245258 245388 245584
60641 245584 245511 244589 242365 238972 234935 230601 226051 221485 217287 213671 210524 207589 204667 201754 199184
60626 199184 197398 196330 195309 193869 192316 191104 190067 188817 187537 186662 186054 185260 184464 184310 184826 185332
60610 185332 185503 185694 186050 186121 185684 185229 185230 185551 185925 186467 187314 188270 189233 190495 192230 194110 195812 197526
$$ packed form
60719B69657Q66N99K06j96n05p21r64j263j398j255j138j338j576j417j062j147
60703B57348j768k320k365k078j810j743k008k570k955k673j981j641j881k174
60689B27381k134j918j711j477j379j702k151j997j191o24q81j424j443r24l58
60674B06067N7L94O15O89P49Q38P53N29N77J068J584J752J818K202K828L277L335
60657B29132L036K465J859J581J699J841J704J377J011N33n3m33l88j06J30J96
60641B45584p3r22k224l393m037m334m550m566m198l616l147k935k922k913k570
60626A99184j786j068j021j440j553j212j037j250j280q75o08p94p96j54N16N06
60610A85332J71J91L56P1m37m55JL21L74N42Q47R56R63J262J735J880J702J714
$$ plain form
60592 197526 199497 201483 203111 204490 206033 207897 210005 212387 215051 217670 219791 221292 222390 223305
60578 223305 224191 225238 226554 228009 229381 230552 231429 231869 231904 231905 232256 232915 233412 233238 232150 230273 227985
60561 227985 225595 223082 220296 217413 214891 212945 211367 209945 208728 207750 206861 206030 205528 205582 206105 206937
60545 206937 208026 209136 209718 209401 208382 207025 205337 203168 200718 198431 196500 194829 193449 192620 192489
60530 192489 192892 193509 194083 194513 194873 195311 195872 196471 197107 197898 198789 199437 199636 199682 200083 200951 201875 202362 202213
60511 202213 201520 200510 199426 198450 197678 197126 196726 196312 195803 195388 195348 195617 195740 195404 194810 194357 194118 193853
60493 193853 193446 193098 193130 193721 194824 196276 197957 199861 201937 203910 205430 206423 207122 207697 208051 208066 207846
60476 207846 207595 207407 207291 207271 207335 207454 207749 208456 209588 210827 211964 213311 215439 218523 222168 225905 229693
$$ packed form
60592A97526J971J986J628J379J543J864K108K382K664K619K121J501J098R15
60578B23305Q86J047J316J455J372J171Q77M40L5JL51O59M97j74j088j877k288
60561B27985k390k513k786k883k522j946j578j422j217r78q89q31n02N4N23Q32
60545B06937J089J110N82l17j019j357j688k169k450k287j931j671j380q29j31
60530A92489M03O17N74M30L60M38N61N99O36P91Q91O48J99M6M01Q68R24M87j49
60511B02213o93j010j084r76p72n52m00m14n09m15m0K69J23l36n94m53k39k65
60493A93853m07l48L2N91J103J452J681J904K076J973J520R93O99N75L54J5k20
60476B07846k51j88j16k0O4J19K95P07J132J239J137J347K128L084L645L737L788
$$ plain form
60459 229693 233885 238786 244380 250446 256819 263365 269704 275145 279040 281190 281799 281185 279628 277380 274602
60444 274602 271355 267819 264432 261656 259706 258680 258734 259851 261608 263602 266050 269590 274514 280604 287684
60429 287684 295849 305078 315024 325322 335639 345265 353085 358276 360831 361249 359987 357379 353812 349672
60415 349672 345237 340727 336324 332108 328148 324681 321956 319923 318367 317330 317000 317217 317528 317830 318503
60400 318503 319815 321652 324028 327386 332108 338165 345538 354628 365949 379750 396148 415262 436915
60387 436915 460529 485560 511662 538127 563583 586574 606159 621640 632103 636686 635026 627133
60375 627133 613149 593662 570014 543839 516439 488860 462206 437365 414541 393452 373895
60364 373895 355886 339496 324866 312147 301123 291186 282007 273935 267338 261864 256828 252042 247739
$$ packed form
60459B29693M192M901N594O066O373O546O339N441L895K150O09o14j557k248k778
60444B74602l247l536l387k776j950j026N4J117J757J994K448L540M924O090P080
60429B87684Q165R229R946J0298J0317R626P820N191K555M18j262k608l567m140
60415C49672m435m510m403m216l960l467k725k033j556j037l30K17L11L02O73
60400C18503J312J837K376L358M722O057P373R090J1321J3801J6398J9114K1653
60387D36915K3614K5031K6102K6465K5456K2991J9585J5481J0463M583j660p893
60375F27133j3984j9487k3648k6175k7400k7579k6654k4841k2824k1089j9557
60364C73895j8009j6390j4630j2719j1024r937r179q072o597n474n036m786m303
$$ plain form
60351 247739 243930 240404 237228 234653 232581 230661 228822 227251 225849 224284 222556 221038 219827 218588
60337 218588 217128 215716 214706 214161 214017 214259 214789 215340 215667 215638 215148 214203 213103 212322 212094 212273 212573 212762
60319 212762 212696 212421 212233 212435 213043 213890 214900 216010 216955 217463 217649 217865 218184 218299 217958 217257 216493 215964
60301 215964 215881 216237 216766 217282 217970 219113 220597 221992 223116 224161 225251 226240 227080 228067 229532 231427
60285 231427 233379 235041 236349 237514 238792 240231 241662 242983 244341 245932 247751 249651 251515 253198
60271 253198 254506 255453 256377 257555 258776 259570 259821 259914 260335 261245 262415 263415 263981 264312 264822 265546 266084
60254 266084 266317 266799 268107 270172 272694 275884 280204 285585 291486 297699 304480 311878 319421 326530 332756
60239 332756 337534 340244 340694 339195 336040 331330 325443 319134 312931 306800 300697 295072 290466 286849
$$ packed form
60351B47739l809l526l176k575k072j920j839j571j402j565j728j518j211j239
60337B18588j460j412j010n45j44K42N30N51L27k9m90r45j100p81k28J79L00J89
60319B12762o6k75j88K02O08Q47J010J110R45N08J86K16L19J15l41p01p64n29
60301B15964q3L56N29N16O88J143J484J395J124J045J090R89Q40R87J465J895
60285B31427J952J662J308J165J278J439J431J321J358J591J819J900J864J683
60271B53198J308R47R24J178J221P94K51R3M21R10J170J000N66L31N10P24N38
60254B66084K33M82J308K065K522L190M320N381N901O213O781P398P543P109O226
60239C32756M778K710M50j499l155m710n887o309o203o131o103n625m606l617
$$ plain form
60225 286849 283729 280818 278263 276244 274638 273160 271706 270429 269487 268806 268163 267494 267020 266985 267429 268268
60209 268268 269453 270972 272851 275277 278532 282660 287442 292868 299352 307192 316026 325158 334232 343222
60195 343222 351896 359667 365864 369882 371253 369994 366777 362270 356383 348577 338905 328299 317846 308186
60181 308186 299611 292229 285841 280048 274644 269729 265431 261806 259009 257160 255991 254932 253648 252223
60167 252223 250793 249332 247855 246507 245372 244479 243997 244112 244655 245204 245566 245882 246219 246459 246616 246904 247377
60150 247377 247851 248250 248666 249003 248916 248279 247397 246638 246090 245719 245514 245395 245230 245097 245235 245697 246248 246718 247168
60131 247168 247664 248193 248868 249907 251327 252925 254612 256492 258565 260689 262856 265235 267857 270626 273632
60116 273632 277109 280958 284691 287942 290763 293395 296078 299124 302685 306403 309667 312348 314847 317348
$$ packed form
60225B86849l120k911k555k019j606j478j454j277r42o81o43o69m74l5M44Q39
60209B68268J185J519J879K426L255M128M782N426O484P840Q834R132R074Q990
60195C43222Q674P771O197M018J371j259l217m507n887p806r672j0606j0453r660
60181C08186q575p382o388n793n404m915m298l625k797j849j169j059j284j425
60167B52223j430j461j477j348j135q93m82J15N43N49L62L16L37K40J57K88M73
60150B47377M74L99M16L37q7o37q82p59n48l71k05j19j65j33J38M62N51M70M50
60131B47168M96N29O75J039J420J598J687J880K073K124K167K379K622K769L006
60116B73632L477L849L733L251K821K632K683L046L561L718L264K681K499K501
$$ plain form
60102 317348 319498 320975 321887 322380 322325 321693 320845 320109 319357 318255 316662 314550 311859 308733 305631 302958
60086 302958 300766 298971 297557 296380 295144 293819 292780 292307 292196 292105 291951 291778 291501 291121 290881 290964 291261
60069 291261 291699 292531 293984 295844 297658 299226 300592 301757 302647 303255 303614 303741 303739 303750 303694 303291 302498 301742
60051 301742 301520 301995 303047 304482 306055 307603 309305 311551 314368 317262 319793 322001 324129 326264 328465
60036 328465 330862 333406 335838 338213 341102 345025 349910 355369 361051 366447 370716 373221 374033 373612 372231
60021 372231 370033 367370 364610 361813 358968 356364 354321 352694 351067 349285 347456 345531 343324 340906
60007 340906 338593 336544 334614 332607 330448 328168 325926 323992 322494 321291 320257 319522 319239 319264 319364
59992 319364 319601 320236 321369 322888 324698 326744 328892 331033 333305 336019 339369 343272 347385 351249 354566
$$ packed form
60102C17348K150J477R12M93n5o32q48p36p52j102j593k112k691l126l102k673
60086C02958k192j795j414j177j236j325j039m73j11r1j54j73k77l80k40Q3K97
60069B91261M38Q32J453J860J814J568J366J165Q90O08L59J27kJ1n6m03p93p56
60051C01742k22M75J052J435J573J548J702K246K817K894K531K208K128K135K201
60036C28465K397K544K432K375K889L923M885N459N682N396M269K505Q12m21j381
60021C72231k198k663k760k797k845k604k043j627j627j782j829j925k207k418
60007C40906k313k049j930k007k159k280k242j934j498j203j034p35k83K5J00
59992C19364K37O35J133J519J810K046K148K141K272K714L350L903M113L864L317
$$ plain form
59977 354566 357373 359711 361111 360762 358329 354243 349039 342847 335809 328534 321676 315341 309345 303789
59963 303789 298927 294688 290825 287402 284686 282618 280858 279322 278270 277851 277861 277999 278069 277984 277840 277969 278637
59946 278637 279702 280821 281967 283455 285423 287514 289134 289890 289802 289211 288446 287484 286002 283819 281143 278325
59930 278325 275554 272884 270329 267757 264976 262062 259376 257066 254855 252504 250179 248083 246076 243999
59916 243999 242072 240560 239287 237871 236238 234536 232752 230819 228937 227384 226184 225300 224990 225469 226372
59901 226372 227010 227129 227017 226977 227106 227565 228593 230170 231961 233643 235072 236217 237230 238456 240015 241455
59885 241455 242177 242160 241923 241838 241817 241601 240981 239784 238043 236194 234761 233831 233141 232611 232405 232512 232675 232779
59867 232779 232970 233343 233859 234655 236090 238359 241317 244727 248437 252245 255856 259088 261946 264441 266448
$$ packed form
59977C54566K807K338J400l49k433m086n204o192p038p275o858o335n996n556
59963C03789m862m239l863l423k716k068j760j536j052m19J0J38P0q5j44J29O68
59946B78637J065J119J146J488J968K091J620P56q8n91p65r62j482k183k676k818
59930B78325k771k670k555k572k781k914k686k310k211k351k325k096k007k077
59916B43999j927j512j273j416j633j702j784j933j882j553j200q84l10M79R03
59901B26372O38J19j12m0J29M59J028J577J791J682J429J145J013J226J559J440
59885B41455P22j7k37q5k1k16o20j197j741j849j433r30o90n30k06J07J63J04
59867B32779J91L73N16P96J435K269K958L410L710L808L611L232K858K495K007
$$ plain form
59852 266448 267749 268118 267433 265885 263959 262034 260082 257932 255658 253453 251246 248764 245921 242933 240116
59837 240116 237777 236114 235012 234103 233299 233054 233766 235151 236600 237957 239515 241373 243284 245125 247058
59822 247058 249217 251619 254385 257709 261600 265961 270837 276239 281823 287130 292101 296918 301443 305255
59808 305255 308275 310911 313477 315835 317666 318767 319064 318661 317863 316878 315528 313568 311198 308886 306793
59793 306793 304804 303014 301696 300823 300145 299721 299846 300448 301128 301907 303343 305732 308726 311972 315598 319756
59777 319756 324131 328221 331775 334694 336793 337992 338535 338823 339191 339880 340937 342003 342464 341943 340457 338138
59761 338138 335195 332105 329333 326687 323431 319278 314882 311061 307942 305144 302440 299870 297494 295442
59747 295442 294079 293774 294559 296184 298419 301137 304263 307848 312089 317125 322831 328832 334554 339320 342679
$$ packed form
59852B66448J301L69o85j548j926j925j952k150k274k205k207k482k843k988k817
59837B40116k339j663j102r09q04k45P12J385J449J357J558J858J911J841J933
59822B47058K159K402K766L324L891M361M876N402N584N307M971M817M525L812
59808C05255L020K636K566K358J831J101K97m03p98r85j350j960k370k312k093
59793C06793j989j790j318q73o78m24J25O02O80P79J436K389K994L246L626M158
59777C19756M375M090L554K919K099J199N43K88L68O89J057J066M61n21j486k319
59761C38138k943l090k772k646l256m153m396l821l119k798k704k570k376k052
59747B95442j363l05P85J625K235K718L126L585M241N036N706O001N722M766L359
$$ plain form
59732 342679 344824 346517 348515 351209 354701 358840 362969 365950 366704 364750 360207 353597 345733 337569
59718 337569 329854 322968 317065 312241 308495 305721 303749 302297 300915 299206 297114 294813 292390 289915
59704 289915 287731 286305 285714 285555 285395 285000 284146 282605 280482 278253 276273 274437 272427 270078 267447
59689 267447 264756 262328 260387 258840 257470 256279 255422 254855 254343 253829 253425 253040 252410 251539 250830 250678 251223
59672 251223 252450 254195 256025 257543 258878 260529 262693 265132 267709 270592 273802 277004 279972 282845
59658 282845 285786 288741 291706 294867 298275 301708 305017 308315 311698 315145 318789 322930 327570 332288
59644 332288 336712 340819 344614 347904 350529 352480 353606 353590 352409 350487 348220 345700 343029 340513 338302
59629 338302 336186 333991 331897 330140 328703 327466 326393 325394 324288 323036 321733 320305 318597 316847
$$ packed form
59732C42679K145J693J998K694L492M139M129K981P54j954m543o610p864q164
59718C37569p715o886n903m824l746k774j972j452j382j709k092k301k423k475
59704B89915k184j426n91j59j60l95q54j541k123k229j980j836k010k349k631
59689B67447k691k428j941j547j370j191q57n67n12n14m04l85o30q71p09j52N45
59672B51223J227J745J830J518J335J651K164K439K577K883L210L202K968K873
59658B82845K941K955K965L161L408L433L309L298L383L447L644M141M640M718
59644C32288M424M107L795L290K625J951J126j6j181j922k267k520k671k516k211
59629C38302k116k195k094j757j437j237j073r99j106j252j303j428j708j750
$$ plain form
59615 316847 315598 315003 314642 314206 313903 313928 314016 313822 313378 312916 312591 312622 313285 314482 315658 316436 316979 317479 317778
59596 317778 317767 317784 318227 319102 320242 321552 322754 323284 322877 321952 321093 320454 319999 319901 320280 320871 321349 321690 321798
59577 321798 321137 319237 316342 313139 310010 306878 303584 300019 296114 292036 288256 285115 282532 280359
59563 280359 278722 277703 277012 276334 275736 275413 275303 275322 275651 276398 277325 278275 279538 281308 283127 284384 285123
59546 285123 285739 286071 285433 283529 280857 278192 276070 274718 274034 273592 273005 272355 272032 272260 272989 274104 275409
59529 275409 276466 276787 276140 274519 271974 268719 265272 262176 259664 257726 256337 255377 254587 253819 253144 252509
59513 252509 251545 250012 248201 246637 245632 245373 246113 247866 250137 252327 254220 255841 257130 258088 258964
59498 258964 259911 260717 261210 261656 262370 263205 263842 264310 264785 265104 264965 264418 263719 262899 261845 260629 259342 257848
$$ packed form
59615C16847j249n95l61m36l03K5Q8j94m44m62l25L1O63J197J176P78N43N00K99
59596C17778j1J7M43Q75J140J310J202N30m07r25q59o39m55r8L79N91M78L41J08
59577C21798o61j900k895l203l129l132l294l565l905m078l780l141k583k173
59563B80359j637j019o91o78n98l23j10J9L29P47R27R50J263J770J819J257P39
59546B85123O16L32o38j904k672k665k122j352o84m42n87o50l23K28P29J115J305
59529B75409J057L21o47j621k545l255l447l096k512j938j389r60p90p68o75o35
59513B52509r64j533j811j564j005k59P40J753K271K190J893J621J289R58Q76
59498B58964R47Q06M93M46P14Q35O37M68M75L19j39n47o99q20j054j216j287j494
$$ plain form
59480 257848 256120 254564 253575 253000 252451 251901 251489 251025 250281 249564 249356 249537 249574 249402 249532 250263 251307 252230
59462 252230 252801 252912 252607 252205 252045 252110 252239 252534 253153 253827 254097 253972 253917 254252 254987 256108 257562 259041
59444 259041 260275 261492 263174 265434 268135 271474 275989 282105 290249 301163 315167 330873 345285
59431 345285 355605 360761 361344 358747 354633 350589 347636 346007 345401 345305 345147 344516 343353 341705 339348
59416 339348 335941 331556 326696 321764 316764 311526 305929 299975 293956 288507 284111 280580 277316 274083
59402 274083 271176 268883 267137 265705 264450 263376 262628 262386 262543 262655 262418 261986 261572 261079 260487 260211 260570
59385 260570 261199 261569 261818 262461 263489 264454 265319 266483 268015 269580 271162 273216 275997 279302 282921 286779
59369 286779 290603 294000 296954 299670 301953 303392 304215 305274 307042 309268 311741 314713 318326 322287
$$ packed form
59480B57848j728j556r89n75n49n50m12m64p44p17k08J81L7j72J30P31J044R23
59462B52230N71J11l05m02j60O5J29K95O19O74K70j25n5L35P35J121J454J479
59444B59041J234J217J682K260K701L339M515O116Q144J0914J4004J5706J4412
59431C45285J0320N156N83k597m114m044k953j629o06r6j58o31j163j648k357
59416C39348l407m385m860m932n000n238n597n954o019n449m396l531l264l233
59402B74083k907k293j746j432j255j074p48k42J57J12k37m32m14m93n92k76L59
59385B60570O29L70K49O43J028R65Q65J164J532J565J582K054K781L305L619L858
59369B86779L824L397K954K716K283J439Q23J059J768K226K473K972L613L961
$$ plain form
59355 322287 326434 331045 336184 341273 345658 349247 352251 354656 356300 357169 357326 356758 355429 353286 350128
59340 350128 345776 340429 334584 328616 322799 317649 313702 310896 308690 306904 305937 306030 306904 308328 310540
59325 310540 313839 318206 323580 330067 337651 346057 355073 364633 374415 383834 392620 400958 408888 416145
59311 416145 422898 430057 438145 446005 451084 451099 445505 435724 424288 413497 404546 397757 393521 392663
59297 392663 395788 402389 410570 417527 420636 418747 412680 404294 395103 385911 377303 369706 362987 356661
59283 356661 350624 345227 340591 336488 332914 330163 328180 326477 324839 323526 322588 321622 320449 319421 318788
59268 318788 318370 318157 318575 319777 321244 322548 324054 326438 329913 334330 339629 345758 352481 359651 367437
59253 367437 376037 385430 395634 406803 418806 431074 443132 454954 466584 477805 488351 497968
$$ packed form
59355C22287M147M611N139N089M385L589L004K405J644Q69J57n68j329k143l158
59340C50128m352n347n845n968n817n150l947k806k206j786r67R3Q74J424K212
59325C10540L299M367N374O487P584Q406R016R560R782R419Q786Q338P930P257
59311D16145O753P159Q088P860N079J5n594r781j1436j0791q951o789m236q58
59297C92663L125O601Q181O957L109j889o067q386r191r192q608p597o719o326
59283C56661o037n397m636m103l574k751j983j703j638j313r38r66j173j028o33
59268C18788m18k13M18J202J467J304J506K384L475M417N299O129O723P170P786
59253C67437Q600R393J0204J1169J2003J2268J2058J1822J1630J1221J0546R617
$$ plain form
59241 497968 506032 511579 514099 513936 511652 507436 501380 493816 485001 474879 463555 451612 439645
59228 439645 427814 416132 404758 393741 382952 372615 363426 355715 348977 342620 336738 331643 327103
59215 327103 322643 318299 314485 311306 308488 305874 303600 301871 300834 300481 300461 300281 299884 299691 299849 299893
59199 299893 299500 299110 299383 300423 302030 304379 307917 312870 319349 327727 338225 350061 361318 369770
59185 369770 373850 373222 368830 362292 355021 347948 341942 337929 336327 336780 338808 342363 347503 353910 361095
59170 361095 368692 376256 383168 389188 394650 399742 403921 406502 407478 407328 406320 404455 401852 398771 395441
59155 395441 392153 389207 386468 383364 379677 375968 372827 370160 367664 365549 364216 363627 363560 364208 365939
59140 365939 368686 372141 376240 380881 385400 388988 391488 393224 394182 393975 392523 390131 386900 382571 377071
$$ packed form
59241D97968Q064N547K520j63k284m216o056p564q815j0122j1324j1943j1967
59228D39645j1831j1682j1374j1017j0789j0337r189p711o738o357n882n095m540
59215C27103m460m344l814l179k818k614k274j729j037l53k0j80l97j93J58M4
59199B99893l93l90K73J040J607K349L538M953O479Q378J0498J1836J1257Q452
59185C69770M080o28m392o538p271p073o006m013j602M53K028L555N140O407P185
59170C61095P597P564O912O020N462N092M179K581R76j50j008j865k603l081l330
59155C95441l288k946k739l104l687l709l141k667k496k115j333n89o7O48J731
59140C65939K747L455M099M641M519L588K500J736R58k07j452k392l231m329n500
$$ plain form
59125 377071 370764 364100 357340 350609 343918 337195 330564 324502 319411 315150 311266 307570 304170 301079
59111 301079 298153 295340 292732 290415 288415 286660 284843 282610 280116 278107 277164 277091 277313 277550 277827 278154
59095 278154 278604 279450 280838 282511 284141 285739 287462 289313 291268 293436 295801 298101 300175 302097 303817
59080 303817 305110 306143 307529 309486 311499 313186 314911 317076 319449 321770 324443 327961 332191 336839
59066 336839 342101 348028 353758 358218 361269 363335 364253 363385 360655 356581 351441 345226 338317 331398 324714
59051 324714 318089 311561 305335 299318 293452 288333 284646 282044 279450 276402 273325 270473 267554 264492
59037 264492 261715 259420 257309 255276 253665 252604 251754 251007 250802 251423 252528 253686 254910 256351 257823
59022 257823 259012 259948 261052 262823 265506 268907 272602 276536 281309 287549 295171 303588 312414 321512
$$ packed form
59125C77071o307o664o760o731o691o723o631o062n091m261l884l696l400l091
59111C01079k926k813k608k317k000j755j817k233k494k009r43p3K22K37K77L27
59095B78154M50Q46J388J673J630J598J723J851J955K168K365K300K074J922J720
59080C03817J293J033J386J957K013J687J725K165K373K321K673L518M230M648
59066C36839N262N927N730M460L051K066R18q68k730m074n140o215o909o919o684
59051C24714o625o528o226o017n866n119l687k602k594l048l077k852k919l062
59037B64492k777k295k111k033j611j061q50p47k05O21J105J158J224J441J472
59022B57823J189R36J104J771K683L401L695L934M773O240P622Q417Q826R098
$$ plain form
59008 321512 330566 339167 347277 355063 362380 368850 374366 378977 382394 384160 384218 382800 379870 375335 369770
58993 369770 364257 359435 355222 351491 348442 346221 344702 343740 343172 342522 341184 338967 336077 332643 328705
58978 328705 324581 320689 317051 313477 310155 307450 305195 302815 300181 297759 295868 294391 293210 292320
58964 292320 291459 290260 288846 287690 286789 285613 283935 282099 280340 278477 276474 274684 273293 272073 270920
58949 270920 270169 270119 270650 271457 272272 272751 272616 272055 271564 271294 270969 270513 270224 270215 270219 270143 270408 271521 273656 276754
58929 276754 280699 285295 290424 296251 302964 310368 318058 325862 333575 340420 345418 348386 350003 350786
58915 350786 350554 348990 346212 342649 338762 334982 331544 328337 325300 322878 321654 321639 322473 324162 326959
58900 326959 330623 334510 338420 342647 347148 351401 355219 359029 363148 367344 371286 374771 377379 378519
$$ packed form
59008C21512R054Q601Q110P786P317O470N516M611L417J766N8j418k930m535n565
58993C69770n513m822m213l731l049k221j519r62n68o50j338k217k890l434l938
58978C28705m124l892l638l574l322k705k255k380k634k422j891j477j181q90
58964B92320q61j199j414j156r01j176j678j836j759j863k003j790j391j220j153
58949B70920p51n0N31Q07Q15M79j35n61m91k70l25m56k89rMp6K65J113K135L098
58929B76754L945M596N129N827O713P404P690P804P713O845M998K968J617P83
58915C50786k32j564k778l563l887l780l438l207l037k422j224j5Q34J689K797
58900C26959L664L887L910M227M501M253L818L810M119M196L942L485K608J140
$$ plain form
58886 378519 378051 376396 373902 370639 366910 363371 360502 358486 357619 358252 360251 363104 366650 371119 376377
58871 376377 381857 387322 393082 399321 405869 412682 419890 427247 434260 441018 448167 455911 463662 470795
58857 470795 476991 481694 484009 483441 480110 474121 465499 454919 443652 432435 421098 409536 398262
58844 398262 387707 377785 368536 360450 353766 348188 343656 340645 339280 338824 338528 338331 338322 338175 337625 336882
58828 336882 336125 335083 333539 331703 329744 327487 324919 322422 320194 318034 315972 314487 313748 313269 312696
58813 312696 312294 312290 312399 312409 312610 313276 314335 315892 318409 322024 326329 331176 336971 343859 351449 359750
58797 359750 369481 380894 393100 405218 417409 430148 443287 456632 470739 486275 503076 520511
58785 520511 538205 555603 571325 583875 592786 598453 601181 600973 597870 591891 582853 570790 556312
$$ packed form
58886C78519m68j655k494l263l729l539k869k016q67O33J999K853L546M469N258
58871C76377N480N465N760O239O548O813P208P357P013O758P149P744P751P133
58857D70795O196M703K315n68l331n989q622j0580j1267j1217j1337j1562j1274
58844C98262j0555r922r249q086o684n578m532l011j365m56k96j97rj47n50p43
58828C36882p57j042j544j836j959k257k568k497k228k160k062j485p39m79n73
58813C12696m02mJ09J0K01O66J059J557K517L615M305M847N795O888P590Q301
58797C59750R731J1413J2206J2118J2191J2739J3139J3345J4107J5536J6801J7435
58785E20511J7694J7398J5722J2550Q911N667K728k08l103n979r038j2063j4478
$$ plain form
58772 556312 540235 523275 506383 490781 477192 465489 455499 447508 441518 436677 432104 427737 423791
58759 423791 419959 415833 411608 407660 403880 400016 396298 393065 390144 387099 383709 379717 374633 368349
58745 368349 361468 354496 347228 339433 331589 324281 317404 310639 304242 298704 294048 290058 286754 284060
58731 284060 281550 279145 277557 277318 277858 278243 278378 278787 279660 280875 282588 285029 287960 290929 293764 296297
58715 296297 298079 298943 299436 300073 300674 300994 301450 302477 303664 304303 304374 304278 304001 303256 302025 300278 297660
58698 297660 294187 290764 288205 286154 283703 280645 277333 273859 270264 267150 265109 263903 263043 262828 263882
58683 263882 265969 268233 270363 272636 275003 277045 278752 280524 282553 284885 287856 291668 295671 298784
58669 298784 300473 300710 299367 296453 292698 289036 285689 282457 279677 278097 277936 278732 279923 280968 281222
$$ packed form
58772E56312j6077j6960j6892j5602j3589j1703r990p991n990m841m573m367l946
58759D23791l832m126m225l948l780l864l718l233k921l045l390l992n084o284
58745C68349o881o972p268p795p844p308o877o765o397n538m656l990l304k694
58731B84060k510k405j588k39N40L85J35M09Q73J215J713K441K931K969K835K533
58715B96297J782Q64M93O37O01L20M56J027J187O39P1r6k77p45j231j747k618
58698B97660l473l423k559k051k451l058l312l474l595l114k041j206q60k15J054
58683B63882K087K264K130K273K367K042J707J772K029K332K971L812M003L113
58669B98784J689K37j343k914l755l662l347l232k780j580j61P96J191J045K54
$$ plain form
58654 281222 280433 279076 277607 275800 273511 271541 270796 270991 271173 271189 271663 272808 274291 276095 278562 281649
58638 281649 285033 288791 293204 298043 302915 308069 313979 320371 326573 332587 338863 345163 350641 354947
58624 354947 358338 360823 362225 362983 364002 365604 367460 369394 371460 373327 374530 375229 375914 376493 376546 376260
58608 376260 376167 376054 375106 372992 369840 365287 358657 350120 340633 330715 320230 309391 298956 289250
58594 289250 279980 271167 263395 256968 251591 246978 243009 239283 235320 231296 227783 224772 221738 218627
58580 218627 215985 214116 212929 212535 213155 214471 215965 217826 220665 224429 228592 233334 239477 247259 256171
58565 256171 266050 277243 289516 301770 312982 322508 329383 332438 331448 327335 321018 312864 303386
58552 303386 293539 284090 275362 267727 261534 256506 252053 248257 245765 244691 244481 244869 246003 247568 248781
$$ packed form
58654B81222p89j357j469j807k289j970p45J95J82J6M74J145J483J804K467L087
58638B81649L384L758M413M839M872N154N910O392O202O014O276O300N478M306
58624C54947L391K485J402P58J019J602J856J934K066J867J203O99O85N79N3k86
58608C76260r3j13r48k114l152m553o630q537r487r918j0485j0839j0435r706
58594B89250r270q813p772o427n377m613l969l726l963m024l513l011l034l111
58580B18627k642j869j187l94O20J316J494J861K839L764M163M742O143P782Q912
58565B56171R879J1193J2273J2254J1212R526O875L055r90m113o317q154r478
58552C03386r847r449q728p635o193n028m453l796k492j074k10L88J134J565J213
$$ plain form
58537 248781 249414 249925 250460 250640 250405 250156 249933 249377 248612 248267 248471 248761 249080 249949 251514 253357 255406 258053
58519 258053 261253 264459 267608 271276 275639 280153 284387 288282 291544 293654 294628 294843 294163 292167 289255
58504 289255 286418 283928 281296 278534 276265 274475 272411 269879 267455 265233 262629 259761 257763 257361
58490 257361 258231 260058 263119 267466 272653 278615 285740 293735 301555 308784 315906 322899 328817 333177
58476 333177 336552 339288 340892 341276 341494 342567 344591 347595 352246 359046 367725 378019 390203 404317
58462 404317 419671 435551 451548 466793 479783 489457 495693 498534 497904 494400 489334 483605 477444
58449 477444 471462 466764 463604 460986 458034 454734 451034 446383 440618 434217 427266 419261 410305 401348
58435 401348 392840 384359 375960 368620 362833 358025 353891 351023 349674 349197 349341 350790 353717 357096 360214
$$ packed form
58537B48781O33N11N35J80k35k49k23n56p65l45K04K90L19Q69J565J843K049K647
58519B58053L200L206L149L668M363M514M234L895L262K110R74K15o80j996k912
58504B89255k837k490k632k762k269j790k064k532k424k222k604k868j998m02
58490B57361Q70J827L061M347N187N962P125P995P820P229P122O993N918M360
58476C33177L375K736J604L84K18J073K024L004M651O800Q679J0294J2184J4114
58462D04317J5354J5880J5997J5245J2990R674O236K841o30l504n066n729o161
58449D77444n982m698l160k618k952l300l700m651n765o401o951q005q956q957
58435D01348q508q481q399p340n787m808m134k868j349m77J44J449K927L379L118
$$ plain form
58420 360214 363598 367678 371698 374832 377206 379009 379670 378782 376805 374087 370220 365155 359915 355386 351342
58405 351342 347310 343392 339538 335137 330097 325334 321440 317865 314095 310535 307590 304945 302514 300951
58391 300951 300516 300486 300388 300735 301903 303459 305278 308048 311986 316312 320776 326349 333559 341454 349015 356181
58375 356181 362561 366602 367271 365365 362076 357469 351457 344999 339068 333429 327591 321995 317304 313524
58361 313524 310753 309665 310370 311990 314311 318460 324900 332135 338587 344383 350005 354514 356648 356574 355170
58346 355170 352514 348441 343629 338867 334105 329379 325676 323749 323021 322717 323014 324051 325026 325465 326234 328088
58330 328088 330417 332590 335305 339334 344122 348869 353773 358942 363342 366203 368198 369921 370545 369358
58316 369358 367247 365191 362605 358754 354413 350468 346149 340422 333932 327829 321886 315516 309507 304904
$$ packed form
58420C60214L384M080M020L134K374J803O61q88j977k718l867n065n240m529m044
58405C51342m032l918l854m401n040m763l894l575l770l560k945k645k431j563
58391C00951m35l0r8L47J168J556J819K770L938M326M464N573P210P895P561P166
58375C56181O380M041O69j906l289m607o012o458n931n639n838n596m691l780
58361C13524k771j088P05J620K321M149O440P235O452N796N622M509K134p4j404
58346C55170k656m073m812m762m762m726l703j927p28l04K97J037R75M39P69J854
58330C28088K329K173K715M029M788M747M904N169M400K861J995J723O24j187
58316C69358k111k056k586l851m341l945m319n727o490o103n943o370o009m603
$$ plain form
58302 304904 301234 297633 294708 293482 293485 293659 294168 295619 297483 299026 300733 303074 304956 305234 304719 304833
58286 304833 305352 305358 305378 306493 308283 309633 310780 312622 314817 316491 318002 320137 322403 323948 325307 327382
58270 327382 329602 330991 332217 334692 338462 342779 347808 353933 360344 366150 371897 378121 383547 386668
58256 386668 388016 388875 388922 387287 384751 382648 380674 378030 375699 375235 376294 377623 379525 383037 387692
58241 387692 392463 397947 405243 413618 421627 429526 438231 446967 454333 460684 466959 472280 475238 476511
58227 476511 477652 478390 477716 476428 475883 475418 473815 472137 472215 473435 474025 474372 475985 478324 479895 481462
58211 481462 484902 489725 493947 497571 502017 507045 511502 516160 522472 529456 535170 540277 546691 553771
58197 553771 559517 564510 570847 578056 583998 589040 595329 602645 608995 614709 621844 630089 637400 644246
$$ packed form
58302C04904l670l601k925j226LJ74N09J451J864J543J707K341J882K78n15J14
58286C04833N19OK0J115J790J350J147J842K195J674J511K135K266J545J359K075
58270C27382K220J389J226K475L770M317N029O125O411N806N747O224N426L121
58256C86668J348Q59M7j635k536k103j974k644k331m64J059J329J902L512M655
58241C87692M771N484P296Q375Q009P899Q705Q736P366O351O275N321K958J273
58227D76511J141P38o74j288n45m65j603j678P8J220N90L47J613K339J571J567
58211D81462L440M823M222L624M446N028M457M658O312O984N714N107O414P080
58197E53771N746M993O337P209N942N042O289P316O350N714P135Q245P311O846
$$ plain form
58183 644246 653107 664132 675351 686760 700076 714855 729013 742756 757885 773687 787791 800504
58171 800504 813962 827641 839294 849819 862438 877452 892469 907329 923925 941592 957730
58160 957730 972671 988924 1006034 1021339 1035413 1051365 1069155 1086073 1102450 1121231 1142246
58149 1142246 1162769 1183485 1207817 1235574 1263467 1291770 1324059 1360428 1397508 1435140 1476331
58138 1476331 1520649 1564603 1608675 1656906 1709477 1762946 1817734 1877764 1942770 2008994 2077481
58127 2077481 2153251 2236155 2321378 2409179 2504973 2609416 2718095 2831567 2955740 3091649
58117 3091649 3235239 3387925 3556533 3742053 3939908 4152107 4387127 4647124 4928281
58108 4928281 5234637 5577726 5961696 6383942 6851810 7382908 7988082 8672123 9453381
$$ packed form
58183F44246Q861J1025J1219J1409J3316J4779J4158J3743J5129J5802J4104J2713
58171H00504J3458J3679J1653J0525J2619J5014J5017J4860J6596J7667J6138
58160I57730J4941J6253J7110J5305J4074J5952J7790J6918J6377J8781K1015
58149A142246K0523K0716K4332K7757K7893K8303L2289L6369L7080L7632M1191
58138A476331M4318M3954M4072M8231N2571N3469N4788O0030O5006O6224O8487
58127B077481P5770Q2904Q5223Q7801R5794J04443J08679J13472J24173J35909
58117C091649J43590J52686J68608J85520J97855K12199K35020K59997K81157
58108D928281L06356L43089L83970M22246M67868N31098O05174O84041P81258
$$ plain form
58099 9453381 10364486 11433510 12687016 14174463 15966883 18131248 20735431 23882974
58091 23882974 27714957 32381882 38064556 45050693 53783572 64860172 78986919 96712950
58083 96712950 117716908 139959744 159643560 172571833 176184489 170704972 158589373
58076 158589373 142987310 126512143 110877883 97042743 85371487 75727577 67625413
58069 67625413 60473373 53814199 47460499 41471848 36005371 31164741 26959159 23351120
58061 23351120 20292298 17716868 15542905 13699067 12135182 10804973 9659761 8664852
58053 8664852 7804035 7061866 6416106 5850763 5360411 4936242 4561377 4224324 3924037
58044 3924037 3657193 3412699 3183280 2971149 2777655 2597762 2429004 2275793 2140271
$$ packed form
58099I453381R11105J069024J253506J487447J792420K164365K604183L147543
58091B3882974L831983M666925N682674O986137Q732879J1076600J4126747J7726031
58083I6712950K1003958K2242836J9683816J2928273L612656n479517j2115599
58076A58589373j5602063j6475167j5634260j3835140j1671256r643910q102164
58069F7625413p152040o659174o353700n988651n466477m840630m205582l608039
58061B3351120l058822k575430k173963j843838j563885j330209j145212r94909
58053H664852q60817p42169o45760n65343m90352m24169l74865l37053l00287
58044C924037k66844k44494k29419k12131j93494j79893j68758j53211j35522
$$ plain form
58035 2140271 2017686 1904722 1803882 1715935 1636179 1561716 1494557 1434187 1374722 1312999 1252357
58024 1252357 1195256 1139198 1083130 1030918 984879 942115 900515 862399 829107 797806 766751
58013 766751 738243 713454 689645 665314 642869 623487 604363 583761 563870 545998 527744
58002 527744 507546 487449 468784 449658 429244 410123 393769 378007 361473 346368 334171
57991 334171 322683 309996 297676 287439 278315 269540 262760 258909 256138 253038 250686 249461 247148
57978 247148 242295 236310 230334 223280 214852 207185 201441 195982 189828 184709 181672 178904 175017 171429
57964 171429 169362 167505 164763 162370 161170 159681 157010 154844 154399 154069 152241 149824 147870 145363 141530
57949 141530 137822 135413 133100 129777 126619 124732 122940 120056 117103 115183 113277 110254 107004 104549
$$ packed form
58035B140271j22585j12964j00840q7947p9756p4463o7159o0370n9465o1723o0642
58024A252357n7101n6058n6068n2212m6039m2764m1600l8116l3292l1301l1055
58013G66751k8508k4789k3809k4331k2445j9382j9124k0602j9891j7872j8254
58002E27744k0198k0097j8665j9126k0414j9121j6354j5762j6534j5105j2197
57991C34171j1488j2687j2320j0237r124q775o780l851k771l100k352j225k313
57978B47148m853n985n976p054q428p667n744n459o154n119l037k768l887l588
57964A71429k067j857k742k393j200j489k671k166m45l30j828k417j954k507l833
57949A41530l708k409k313l323l158j887j792k884k953j920j906l023l250k455
$$ plain form
57935 104549 102064 98737 95600 93568 91635 88924 86587 85686 85163 83826 82448 81922 81158 78883 75847
57920 75847 73318 71057 68655 67159 67385 68139 68001 67439 67451 67634 67319 67088 67447 67559 66960 66944 68499 70411
57902 70411 71192 71364 72062 72905 73117 73305 74219 75068 74930 74565 75051 75818 75820 75391 75182 74449 72238 69227 66654
57883 66654 64425 61896 59454 57667 55918 53506 51121 49669 48646 47226 45863 45278 44918 44035 43273
57868 43273 43515 44097 43822 42884 42221 41804 41085 40291 39806 39077 37644 36421 36454 37201 37420 36955 36324 35462 34279
57849 34279 33527 33663 33711 32716 31457 31261 31960 32565 33119 34337 36121 37949 40101 43033 46205 48946 51823
57832 51823 55744 60332 64561 68378 72316 76136 79162 81364 82867 83136 81916 80253 79238 78480 77102
57817 77102 75386 74013 72566 70373 68127 67022 66919 66926 67199 68470 70288 71419 71700 71968 72449 72662 72637
$$ packed form
57935A04549k485l327l137k032j933k711k337r01n23j337j378n26p64k275l036
57920G5847k529k261k402j496K26P54j38n62J2J83l15k31L59J12n99j6J555J912
57902G0411P81J72O98Q43K12J88R14Q49j38l65M86P67Km29k09p33k211l011k573
57883F6654k229k529k442j787j749k412k385j452j023j420j363n85l60q83p62
57868D3273K42N82k75r38o63m17p19p94m85p29j433j223L3P47K19m65o31q62j183
57849C4279p52J36M8r95j259j96O99O05N54J218J784J828K152K932L172K741K877
57832E1823L921M588M229L817L938L820L026K202J503K69j220j663j015p58j378
57817G7102j716j373j447k193k246j105j03PK73J271J818J131K81K68M81K13k5
$$ plain form
57800 72637 72793 72817 71982 70395 68729 67045 65042 63040 61477 59815 57249 54127 51481 49518 47755
57785 47755 46153 44891 43498 41522 39569 38443 37720 36541 35223 34641 34511 33848 32723 31995 31643 30974
57769 30974 30257 30561 32012 33665 35042 36412 37665 38389 39061 40743 43505 46416 49032 51645 54105
57754 54105 55779 56762 57818 59032 59702 59606 59177 58371 56644 54099 51455 48774 45414 41399 37603 34426
57738 34426 31379 28163 25077 22225 19374 16744 14915 13755 12457 10727 9019 7513 5915 4344
57724 4344 3422 3289 3469 3781 4428 5140 5222 4609 3898 3262 2270 893 -310 -1149 -1957 -2725 -3044 -2999 -3142 -3446
57704 -3446 -3296 -2738 -2696 -3728 -5451 -7444 -9774 -12311 -14434 -15791 -16631 -17115 -17029 -16396 -15632 -14883 -13839
57687 -13839 -12385 -10753 -8934 -6632 -3884 -1075 1716 4680 7595 10006 12051 14297 16715 18653
$$ packed form
57800G2637J56K4q35j587j666j684k003k002j563j662k566l122k646j963j763
57785D7755j602j262j393j976j953j126p23j179j318n82j30o63j125p28l52o69
57769C0974p17L04J451J653J377J370J253P24O72J682K762K911K616K613K460
57754E4105J674R83J056J214O70r6m29q06j727k545k644k681l360m015l796l177
57738C4426l047l216l086k852k851k630j829j160j298j730j708j506j598j571
57724D344r22j33J80L12O47P12Q2o13p11o36r92H93c10q39q08p68l19M5j43l04
57704c446J50N58M2j032j723j993k330k537k123j357q40m84Q6O33P64P49J044
57687a3839J454J632J819K302K748a075A716K964K915K411K045K246K418J938
$$ plain form
57673 18653 19887 20847 21698 22085 21895 21422 20633 19108 16877 14494 12108 9276 5857 2288 -1199 -4840
57657 -4840 -8592 -11947 -14732 -17316 -19838 -21910 -23308 -24328 -25267 -26183 -27187 -28279 -28881 -28349 -26962 -25583
57641 -25583 -24309 -22393 -19621 -16743 -14322 -12098 -9854 -7975 -6748 -5940 -5454 -5600 -6339 -7018 -7334 -7813
57625 -7813 -8931 -10422 -11916 -13572 -15603 -17697 -19441 -20893 -22322 -23755 -25116 -26487 -27999 -29779 -32069
57610 -32069 -34970 -38051 -40698 -42878 -45045 -47343 -49520 -51634 -54088 -56890 -59592 -62071 -64597 -67017
57596 -67017 -68712 -69625 -70551 -72062 -73847 -75398 -76702 -77896 -78906 -79783 -80861 -82233 -83557 -84606 -85521
57581 -85521 -86368 -86978 -87323 -87459 -87035 -85511 -82971 -79987 -76573 -72036 -65995 -58666 -49883 -38738 -24541
57566 -24541 -7257 13505 39133 70823 108004 147791 185168 213642 227298 223745 205294 177039
$$ packed form
57673A8653J234R60Q51L87j90m73p89j525k231k383k386k832l419B288a199l641
57657d840l752l355k785k584k522k072j398j020r39r16j004j092o02N32J387J379
57641b5583J274J916K772K878K421K224K244J879J227Q08M86j46p39o79l16m79
57625g813j118j491j494j656k031k094j744j452j429j433j361j371j512j780k290
57610c2069k901l081k647k180k167k298k177k114k454k802k702k479k526k420
57596f7017j695r13r26j511j785j551j304j194j010q77j078j372j324j049r15
57581h5521q47o10l45j36M24J524K540K984L414M537O041P329Q783J1145J4197
57566b4541g257A3505K5628L1690L7181L9787L7377K8474J3656l553j8451k8255
$$ plain form
57554 177039 144065 110252 78322 49753 24857 3481 -14497 -29528 -42470 -53835 -63364 -70840
57542 -70840 -76846 -82230 -87226 -91550 -95072 -97942 -100373 -102645 -105024 -107405 -109364 -110805 -112148 -113666
57528 -113666 -115096 -116176 -117039 -117784 -118145 -117947 -117496 -117162 -116970 -116879 -117073 -117631 -118311 -118919 -119596 -120531 -121774 -123438
57510 -123438 -125548 -127611 -128888 -129363 -129859 -130976 -132499 -134057 -135694 -137421 -138872 -139830 -140595 -141438 -142217 -142835
57494 -142835 -143546 -144456 -145312 -146118 -147354 -149161 -150985 -152487 -154158 -156461 -158943 -160853 -162179 -163472 -165013
57479 -165013 -166740 -168660 -170767 -172773 -174417 -175834 -177240 -178592 -179875 -181354 -183117 -184738 -185817 -186544
57465 -186544 -187316 -188148 -188894 -189693 -190720 -191771 -192529 -192992 -193327 -193552 -193688 -193936 -194399 -194864 -195165 -195449 -195899 -196500
57447 -196500 -197298 -198429 -199684 -200553 -200955 -201419 -202210 -202865 -202967 -202829 -202905 -203038 -202869 -202558 -202543 -202877 -203348 -203942 -204761
$$ packed form
57554A77039l2974l3813l1930k8569B4857C481a4497j5031j2942j1365r529p476
57542g0840o006n384m996m324l522k870k431k272k379k381j959j441j343j518
57528a13666j430j080q63p45l61J98M51L34J92R1j94n58o80o08o77r35j243j664
57510a23438k110k063j277m75m96j117j523j558j637j727j451r58p65q43p79o18
57494a42835p11r10q56q06j236j807j824j502j671k303k482j910j326j293j541
57479a65013j727j920k107k006j644j417j406j352j283j479j763j621j079p27
57465a86544p72q32p46p99j027j051p58m63l35k25j36k48m63m65l01k84m50o01
57447a96500p98j131j255q69m02m64p91o55j02J38p6j33J69L11J5l34m71n94q19
$$ plain form
57428 -204761 -205722 -206778 -208149 -209943 -211791 -213236 -214226 -214953 -215529 -216073 -216721 -217261 -217217 -216628 -216245 -216617 -217460
57411 -217460 -218305 -219212 -220340 -221372 -221964 -222319 -222757 -223112 -223161 -223244 -223832 -224797 -225681 -226417 -227221 -228092 -229007 -230321
57393 -230321 -232343 -234707 -236752 -238387 -240049 -241946 -243872 -245676 -247431 -249209 -251042 -253005 -255077 -257062
57379 -257062 -258903 -260811 -262857 -264741 -266230 -267473 -268606 -269459 -269985 -270532 -271327 -272140 -272880 -274029 -276011 -278555
57363 -278555 -281150 -283656 -285969 -287633 -288434 -288949 -289838 -291013 -292110 -293335 -295091 -297123 -298864 -300379 -302172
57348 -302172 -304232 -306062 -307564 -309128 -310886 -312513 -313801 -314860 -315748 -316445 -317163 -318216 -319566 -320906 -322086
57333 -322086 -323111 -323912 -324544 -325413 -326844 -328618 -330407 -332354 -334670 -336927 -338399 -339042 -339551 -340493 -341880 -343458
57317 -343458 -344955 -346130 -347069 -348288 -350125 -352221 -354072 -355788 -357759 -359825 -361461 -362636 -363808 -365158
$$ packed form
57428b04761r61j056j371j794j848j445r90p27n76n44o48n40M4N89L83l72q43
57411b17460q45r07j128j032n92l55m38l55m9q3n88r65q84p36q04q71r15j314
57393b30321k022k364k045j635j662j897j926j804j755j778j833j963k072j985
57379b57062j841j908k046j884j489j243j133q53n26n47p95q13p40j149j982k544
57363b78555k595k506k313j664q01n15q89j175j097j225j756k032j741j515j793
57348c02172k060j830j502j564j758j627j288j059q88o97p18j053j350j340j180
57333c22086j025q01o32q69j431j774j789j947k316k257j472o43n09r42j387j578
57317c43458j497j175r39j219j837k096j851j716j971k066j636j175j172j350
$$ plain form
57303 -365158 -366466 -367745 -369335 -371310 -373318 -375081 -376663 -378233 -379901 -381755 -383696 -385422 -386892 -388558
57289 -388558 -390679 -392752 -394146 -395070 -396264 -397931 -399620 -401028 -402235 -403256 -404005 -404703 -405726 -407025 -408245
57274 -408245 -409386 -410806 -412582 -414428 -416226 -418145 -420240 -422392 -424639 -427125 -429795 -432557 -435631 -439223
57260 -439223 -443004 -446443 -449537 -452688 -455991 -459204 -462320 -465546 -468808 -471870 -474855 -478073 -481390 -484398
57246 -484398 -487117 -489920 -492796 -495397 -497787 -500423 -503340 -506043 -508322 -510526 -512886 -515143 -517096 -518940
57232 -518940 -520891 -522920 -525036 -527360 -529797 -532077 -534245 -536698 -539631 -542862 -546234 -549783 -553481 -557214
57218 -557214 -561061 -565160 -569287 -573030 -576404 -579833 -583487 -587149 -590739 -594473 -598415 -602349 -606211 -610210
57204 -610210 -614370 -618353 -621878 -625012 -628002 -631100 -634528 -638277 -641963 -645204 -648056 -650809 -653516 -656146
$$ packed form
57303c65158j308j279j590j975k008j763j582j570j668j854j941j726j470j666
57289c88558k121k073j394r24j194j667j689j408j207j021p49o98j023j299j220
57274d08245j141j420j776j846j798j919k095k152k247k486k670k762l074l592
57260d39223l781l439l094l151l303l213l116l226l262l062k985l218l317l008
57246d84398k719k803k876k601k390k636k917k703k279k204k360k257j953j844
57232e18940j951k029k116k324k437k280k168k453k933l231l372l549l698l733
57218e57214l847m099m127l743l374l429l654l662l590l734l942l934l862l999
57204f10210m160l983l525l134k990l098l428l749l686l241k852k753k707k630
$$ plain form
57190 -656146 -659014 -662570 -666828 -671462 -676334 -681503 -686859 -692231 -697741 -703523 -709334 -714969 -720861 -727595
57176 -727595 -734974 -742241 -749179 -756273 -763778 -771325 -778481 -785041 -790652 -794846 -797645 -799652 -801376 -802863
57162 -802863 -804015 -804859 -805523 -806323 -807771 -810022 -812490 -814519 -816263 -818294 -820574 -822558 -824202 -826041 -828250
57147 -828250 -830408 -832285 -834135 -836073 -837819 -839214 -840445 -841630 -842746 -843987 -845647 -847563 -849196 -850270
57133 -850270 -850836 -850806 -850042 -848873 -847894 -847290 -846986 -847332 -848898 -851673 -855201 -859541 -865300 -872671 -881158 -890352
57117 -890352 -900230 -910586 -920819 -930407 -939029 -946275 -951905 -956378 -960464 -964383 -968055 -972092 -977690 -985548
57103 -985548 -995694 -1008375 -1024201 -1043251 -1064872 -1088505 -1114011 -1141090 -1169176 -1198030 -1227764
57092 -1227764 -1258214 -1288960 -1319977 -1351490 -1383236 -1414618 -1445581 -1476549 -1507538 -1538162 -1568410
$$ packed form
57190f56146k868l556m258m634m872n169n356n372n510n782n811n635n892o734
57176g27595p379p267o938p094p505p547p156o560n611m194k799k007j724j487
57162h02863j152q44o64q00j448k251k468k029j744k031k280j984j644j839k209
57147h28250k158j877j850j938j746j395j231j185j116j241j660j916j633j074
57133h50270n66L0P64J169R79O04L04l46j566k775l528m340n759p371q487r194
57117h90352r878j0356j0233r588q622p246n630m473m086l919l672m037n598p858
57103i85548j0146j2681j5826j9050k1621k3633k5506k7079k8086k8854k9734
57092a227764l0450l0746l1017l1513l1746l1382l0963l0968l0989l0624l0248
$$ plain form
57081 -1568410 -1598599 -1628638 -1658258 -1687825 -1717969 -1748445 -1778383 -1807587 -1836589 -1865525 -1894068
57070 -1894068 -1922359 -1950815 -1979032 -2006162 -2032455 -2059204 -2087022 -2115438 -2144349 -2174556 -2206556
57059 -2206556 -2240044 -2274990 -2312179 -2352330 -2395693 -2442751 -2494340 -2550888 -2612529 -2679970 -2754166
57048 -2754166 -2835145 -2922305 -3015807 -3116448 -3224231 -3338496 -3459442 -3588087 -3724703 -3868889
57038 -3868889 -4021290 -4183601 -4356513 -4539020 -4730065 -4929577 -5137858 -5355291 -5582664
57029 -5582664 -5820393 -6067597 -6323489 -6589386 -6867633 -7159041 -7463484 -7782621 -8119625
57020 -8119625 -8476395 -8853584 -9253407 -9679865 -10136266 -10625426 -11152583 -11725116 -12348925
57011 -12348925 -13027957 -13767858 -14577383 -15466110 -16444433 -17527058 -18733828 -20086927 -21611191
$$ packed form
57081a568410l0189l0039k9620k9567l0144l0476k9938k9204k9002k8936k8543
57070a894068k8291k8456k8217k7130k6293k6749k7818k8416k8911l0207l2000
57059b206556l3488l4946l7189m0151m3363m7058n1589n6548o1641o7441p4196
57048b754166q0979q7160r3502j00641j07783j14265j20946j28645j36616j44186
57038c868889j52401j62311j72912j82507j91045j99512k08281k17433k27373
57029e582664k37729k47204k55892k65897k78247k91408l04443l19137l37004
57020h119625l56770l77189l99823m26458m56401m89160n27157n72533o23809
57011a2348925o79032p39901q09525q88727r78323j082625j206770j353099j524264
$$ plain form
57002 -21611191 -23339218 -25315069 -27595155 -30252403 -33384275 -37118158 -41614336 -47073641
56994 -47073641 -53747338 -61936814 -71979131 -84225662 -99014865 -116634509 -137280961
56987 -137280961 -161030439 -187819778 -217423732 -249435002 -283263523 -318147185 -353162217
56980 -353162217 -387267674 -419421330 -448696570 -474253907 -495157901 -510264833 -518405987
56973 -518405987 -518789513 -511296723 -496462868 -475243386 -448793069 -418351231 -385180493
56966 -385180493 -350510114 -315489023 -281147664 -248348588 -217735701 -189719970 -164509658
56959 -164509658 -142153496 -122575283 -105607607 -91029078 -78592316 -68038352 -59109595
56952 -59109595 -51565775 -45192480 -39799526 -35220172 -31315099 -27972057 -25098398 -22615782
$$ packed form
57002b1611191j728027j975851k280086k657248l131872l733883m496178n459305
56994d7073641o673697q189476j0042317j2246531j4789203j7619644k0646452
56987a37280961k3749478k6789339k9603954l2011270l3828521l4883662l5015032
56980c53162217l4105457l2153656k9275240k5557337k0903994j5106932q141154
56973e18405987l83526P492790J4833855K1219482K6450317L0441838L3170738
56966c85180493L4670379L5021091L4341359L2799076L0612887K8015731K5210312
56959a64509658K2356162J9578213J6967676J4578529J2436762J0553964Q928757
56952e9109595P543820O373295N392954M579354L905073L343042K873659K482616
$$ plain form
56944 -22615782 -20460657 -18582828 -16939598 -15492937 -14212068 -13074070 -12059897 -11152243
56936 -11152243 -10337391 -9605014 -8944447 -8343796 -7793332 -7286728 -6818345 -6382577 -5976742
56927 -5976742 -5601363 -5256274 -4938999 -4647600 -4381894 -4140534 -3919712 -3716101 -3528660
56918 -3528660 -3356434 -3197280 -3050087 -2915404 -2791701 -2672994 -2552283 -2426473 -2297020
56909 -2297020 -2167517 -2042001 -1923887 -1814596 -1713504 -1619781 -1533346 -1453730 -1379565 -1309919
56899 -1309919 -1244825 -1183888 -1125778 -1069800 -1016511 -966065 -917286 -869190 -822161 -776856 -733195
56888 -733195 -691243 -651896 -615858 -582856 -552436 -524568 -498932 -474727 -451760 -430759 -412138
56877 -412138 -395496 -380701 -368274 -358156 -349236 -340601 -332154 -323546 -313734 -302250 -289832 -277171
$$ packed form
56944b2615782K155125J877829J643230J446661J280869J137998J014173R07654
56936a1152243Q14852P32377O60567O00651N50464N06604M68383M35768M05835
56927e976742L75379L45089L17275K91399K65706K41360K20822K03611J87441
56918c528660J72226J59154J47193J34683J23703J18707J20711J25810J29453
56909b297020J29503J25516J18114J09291J01092R3723Q6435P9616P4165O9646
56899a309919O5094O0937N8110N5978N3289N0446M8779M8096M7029M5305M3661
56888g33195M1952L9347L6038L3002L0420K7868K5636K4205K2967K1001J8621
56877d12138J6642J4795J2427J0118Q920Q635Q447Q608R812J1484J2418J2661
$$ plain form
56865 -277171 -264031 -250195 -236220 -222632 -209326 -196317 -184101 -172722 -161380 -149455 -137054
56854 -137054 -124209 -110676 -97066 -85081 -75951 -69482 -65063 -62488 -61258 -60188 -58512 -56487 -54254
56841 -54254 -51070 -46355 -40598 -34495 -28005 -20963 -13813 -7010 -325 6686 14227 22835 33595 47063
56827 47063 62465 78301 92941 104376 110558 110965 107198 101459 95062 88775 83476 79568 76499 73704
56813 73704 71471 70251 69793 69673 70019 71015 72302 73539 74954 76695 78268 79330 80447 82306 84699
56798 84699 87002 89147 91388 93568 95389 97063 99029 101303 103680 106280 109374 113012 117305 122704
56784 122704 129538 137585 146413 155611 164287 170987 174781 176090 176007 175239 174127 173080 172329 171625 170755 170025
56768 170025 169803 170025 170608 171907 174224 177327 180968 185515 191597 199551 209665 222413 237726 254199
$$ packed form
56865b77171J3140J3836J3975J3588J3306J3009J2216J1379J1342J1925J2401
56854a37054J2845J3533J3610J1985R130O469M419K575J230J070J676K025K233
56841e4254L184M715N757O103O490P042P150O803c25F686P541Q608J0760J3468
56827D7063J5402J5836J4640J1435O182M07l767n739o397o287n299l908l069k795
56813G3704k233j220m58j20L46R96J287J237J415J741J573J062J117J859K393
56798H4699K303K145K241K180J821J674J966K274K377K600L094L638M293N399
56784A22704O834Q047Q828R198Q676O700L794J309q3p68j112j047p51p04q70p30
56768A70025k22K22N83J299K317L103L641M547O082P954J0114J2748J5313J6473
$$ plain form
56754 254199 269487 281311 287952 288484 283300 274213 263508 252871 243247 235117 228505 223158 219133
56741 219133 216887 216521 217489 219411 222660 227765 234839 244049 256149 272024 292083 316271 343704
56728 343704 371533 394822 408714 411053 402902 387191 367313 346284 326097 307640 291360 277740
56716 277740 266953 258639 252480 248550 246758 246502 247393 249824 254379 261263 270838 284076 301606 322388
56702 322388 343625 361669 372969 375273 368904 356603 341528 325559 309664 294875 282019 271067
56690 271067 261644 253816 247747 243039 239177 236227 234432 233600 233629 235177 238984 244928 252506 261649 272016
56675 272016 281750 288082 289353 285848 278914 270048 260647 251674 243333 235535 228545 222732 217948 213836
56661 213836 210485 208053 206023 203656 201099 199262 198582 198586 198667 198573 198114 197109 195764 194595 193860 193442 193217
$$ packed form
56754B54199J5288J1824O641N32n184r087j0705j0637r624q130o612n347m025
56741B19133k246l66R68J922L249N105P074R210J2100J5875K0059K4188K7433
56728C43704K7829K3289J3892K339q151j5711j9878k1029k0187j8457j6280j3620
56716B77740j0787q314o159l930j792k56Q91K431M555O884R575J3238J7530K0782
56702C22388K1237J8044J1300K304o369j2301j5075j5969j5895j4789j2856j0952
56690B71067r423p828o069m708l862k950j795q32K9J548L807N944P578R143J0367
56675B72016R734O332J271l505o934q866r401q973q341p798o990n813m784m112
56661B13836l351k432k030k367k557j837o80MQ1r4m59j005j345j169p35m18k25
$$ plain form
56644 193217 193125 192939 192447 191799 191266 190788 190164 189512 189056 188669 188121 187607 187519 187820 188147 188373 188587 188728 188740 188902
56624 188902 189468 190170 190587 190819 191285 192021 192746 193441 194334 195419 196478 197446 198323 198934 199238 199612 200336 201047
56606 201047 201264 201176 201354 201899 202418 202662 202631 202321 201875 201712 201966 202075 201517 200594 199912 199470 198934 198408 198168
56587 198168 197941 197336 196718 196773 197374 197740 197610 197405 197294 196998 196522 196266 196303 196279 196119 196142 196446 196738 196867 196950
56567 196950 197022 197061 197316 198052 199110 200200 201409 202851 204137 204909 205635 207022 208853 210246 210933 211417 211964
56550 211964 212343 212542 212846 213155 213067 212723 212828 213689 214931 216143 217170 217769 217767 217518 217478 217380 216596 215237 214048
56531 214048 213237 212276 210922 209584 208565 207716 206908 206112 205016 203367 201675 200718 200392 199897 199020 198280 197834
56514 197834 197288 196686 196563 196847 196745 196014 195310 194987 194577 193853 193394 193603 194031 194148 194029 193862 193565 193250 193326
$$ packed form
56644A93217r2j86m92o48n33m78o24o52m56l87n48n14q8L01L27K26K14J41J2J62
56624A88902N66P02M17K32M66P36P25O95Q93J085J059R68Q77O11L04L74P24P11
56606B01047K17q8J78N45N19K44l1l10m46j63K54J09n58r23o82m42n36n26k40
56587A98168k27o05o18N5O01L66j30k05j11k96m76k56L7k4j60K3L04K92J29Q3
56567A96950P2L9K55P36J058J090J209J442J286P72P26J387J831J393O87M84N47
56550B11964L79J99L04L09q8l44J05Q61J242J212J027N99kk49m0r8p84j359j189
56531B14048q11r61j354j338j019q49q08p96j096j649j692r57l26m95q77p40m46
56514A97834n46o02j23K84j02p31p04l23m10p24m59K09M28J17j19j67k97l15P6
$$ plain form
56495 193326 193771 194046 194079 194489 195501 196466 196901 197146 197535 197730 197449 197130 197287 197818 198426 199120 199876 200369 200541
56476 200541 200847 201570 202442 203290 204377 205736 206806 207175 207118 207005 206787 206459 206423 206967 207894 209002 210399 212083
56458 212083 213855 215890 218739 222392 226040 229038 231432 233258 234149 234110 233905 234187 234820 235442 236018 236435
56442 236435 236296 235566 234776 234190 233446 232422 231644 231360 230984 229994 228665 227420 226147 224714 223393 222240
56426 222240 220764 218806 217043 215981 215170 214026 212764 211860 211199 210461 209773 209357 209065 208807 208839 209045 208637
56409 208637 207202 205410 204061 203063 202014 201089 200571 200099 199182 197980 196859 195734 194568 193894 194052 194408
56393 194408 194152 193410 192808 192424 192061 192027 192711 193672 194090 193921 193800 193963 194061 193891 193645 193471 193371 193421 193602 193634
56373 193634 193373 193159 193323 193663 193808 193765 193675 193404 192854 192298 191969 191678 191291 191119 191402 191857 192177 192503 192950
$$ packed form
56495A93326M45K75L3M10J012R65M35K45L89J95k81l19J57N31O08O94P56M93J72
56476B00541L06P23Q72Q48J087J359J070L69n7j13k18l28l6N44R27J108J397J684
56458B12083J772K035K849L653L648K998K394J826Q91l9k05K82O33O22N76M17
56442B36435j39p30p90n86p44j024p78k84l76r90j329j245j273j433j321j153
56426B22240j476j958j763j062q11j144j262r04o61p38o88m16k92k58L2K06m08
56409B08637j435j792j349r98j049r25n18m72r17j202j121j125j166o74J58L56
56393A94408k56p42o02l84l63l4O84R61M18j69j21J63R8j70k46j74j00N0J81L2
56373A93634k61k14J64L40J45m3r0k71n50n56l29k91l87j72K83M55L20L26M47
$$ plain form
56354 192950 193215 193165 193288 193980 194875 195382 195405 195081 194423 193746 193826 194936 196273 196953 197050 197090 197127 196985 196822 196722
56334 196722 196301 195371 194426 193841 193240 192368 191882 192402 193386 193861 193745 193570 193413 193001 192448 191984 191412 190637 190290
56315 190290 190915 192032 192847 193467 194466 195728 196674 197292 197966 198588 198768 198646 198629 198663 198568 198721 199522 200501 200889
56296 200889 200756 200747 200982 201150 201329 201820 202421 202761 203081 203852 204894 205707 206334 207057 207614 207618 207400 207529 207833 207795
56276 207795 207561 207649 207997 208214 208419 208898 209323 209281 209156 209480 209826 209471 208752 208588 208984 209236 209384 210138 211477
56257 211477 212545 213008 213350 213792 213975 213816 213709 213755 213677 213487 213486 213636 213743 214100 215119 216490 217551 218318 219278
56238 219278 220405 221262 221826 222304 222426 221926 221410 221712 222614 223243 223493 223982 224843 225646 226350 227244 228107 228459
56220 228459 228496 228784 229265 229598 230125 231380 232949 234007 234683 235671 236760 237155 237023 237345 238304 239200 239922 241126
$$ packed form
56354A92950K65n0J23O92Q95N07K3l24o58o77Q0J110J337O80R7M0L7j42j63j00
56334A96722m21r30r45n85o01q72m86N20R84M75j16j75j57m12n53m64n72p75l47
56315A90290O25J117Q15O20R99J262R46O18O74O22J80j22j7L4r5J53Q01R79L88
56296B00889j33rK35J68J79M91O01L40L20P71J042Q13O27P23N57Mk18J29L04l8
56276B07795k34Q8L48K17K05M79M25m2j25L24L46l55p19j64L96K52J48P54J339
56257B11477J068M63L42M42J83j59j07M6p8j90jJ50J07L57J019J371J061P67R60
56238B19278J127Q57N64M78J22n00n16L02R02O29K50M89Q61Q03P04Q94Q63L52
56220B28459L7K88M81L33N27J255J569J058O76R88J089L95j32L22R59Q96P22J204
$$ plain form
56202 241126 242918 244670 246229 248067 250248 252400 254685 257544 260547 262813 264546 266863 270073 273472
56188 273472 276796 280504 284535 288154 291167 294065 296901 299320 301644 304628 308075 311091 313670 316679
56174 316679 320274 323848 327552 332295 338116 344092 350027 356706 364312 372196 380426 389938 400856 412324
56160 412324 424338 438117 454184 471715 490323 510967 534545 561090 590891 624916 663495
56149 663495 706012 752479 804000 861088 922869 988565 1058366 1132141 1208525 1285914 1363152
56138 1363152 1438680 1510166 1575574 1633489 1682040 1718805 1742258 1752199 1748556 1731250 1701547 1662044
56126 1662044 1614721 1560368 1500213 1436498 1370879 1303808 1236090 1169509 1105246 1043195 983541
56115 983541 927517 875868 828005 783422 742578 705623 671629 639869 610592 583913 559253
$$ packed form
56202B41126J792J752J559J838K181K152K285K859L003K266J733K317L210L399
56188B73472L324L708M031L619L013K898K836K419K324K984L447L016K579L009
56174C16679L595L574L704M743N821N976N935O679P606P884Q230R512J0918J1468
56160D12324J2014J3779J6067J7531J8608K0644K3578K6545K9801L4025L8579
56149F63495M2517M6467N1521N7088O1781O5696O9801P3775P6384P7389P7238
56138A363152P5528P1486O5408N7915M8551L6765K3453R941l643j7306k9703l9503
56126A662044m7323n4353o0155o3715o5619o7071o7718o6581o4263o2051n9654
56115I83541n6024n1649m7863m4583m0844l6955l3994l1760k9277k6679k4660
$$ plain form
56104 559253 536471 516168 498269 481681 465936 451726 439318 427950 417392 408420 401106 394261
56092 394261 387325 381167 376253 371697 366944 362706 359370 356139 352655 349790 347876 345838 343071 340572
56078 340572 339124 338034 336731 335978 336296 336763 336595 336475 337136 338000 338334 338405 338505 338252 337827 338368 340133 341816
56060 341816 342683 343810 346139 348995 351648 354648 358386 361963 364825 367989 372391 377500 382757 388849
56046 388849 396282 404215 411983 420342 430113 441098 453402 468222 486228 506892 530455 558709
56034 558709 592672 631326 673759 720319 770117 819479 864556 903828 936815 962700 982218
56023 982218 998809 1015652 1032819 1048721 1062441 1072929 1078038 1076708 1070761 1062790 1053760 1043992 1034264
56010 1034264 1023810 1009094 986829 956903 920808 879282 833558 787028 743187 703165 667024
$$ packed form
56104E59253k2782k0303j7899j6588j5745j4210j2408j1368j0558q972p314o845
56092C94261o936o158m914m556m753m238l336l231l484k865j914k038k767k499
56078C40572j448j090j303p53L18M67j68j20O61Q64L34P1J00k53m25N41J765J683
56060C41816Q67J127K329K856K653L000L738L577K862L164M402N109N257O092
56046C88849P433P933P768Q359R771J0985J2304J4820J8006K0664K3563K8254
56034E58709L3963L8654M2433M6560M9798M9362M5077L9272L2987K5885J9518
56023I82218J6591J6843J7167J5902J3720J0488N109j330n947p971r030r768r728
56010A034264j0454j4716k2265k9926l6095m1526m5724m6530m3841m0022l6141
$$ plain form
55999 667024 635741 609962 588523 570228 555462 544319 535077 526502 519688 515603 512892 510200 508478
55986 508478 508709 509489 509338 509308 510806 512836 513969 515038 517312 519977 522023 524611 528963 533916 538241
55971 538241 543194 549986 556907 561965 566264 571690 577339 581387 584470 587969 590909 591889 592235 593971 596522
55956 596522 598592 601321 606222 612039 617072 622612 630501 639344 646781 653533 661482 669809 676878 683946
55942 683946 693050 703080 711947 720742 731715 744016 755497 766838 779684 792646 803487 813409
55930 813409 824883 837087 847856 858202 870424 883668 895856 908001 922039 936486 949022
55919 949022 961201 975778 991630 1006373 1021626 1040400 1061594 1082556 1104633 1130466 1158207
55908 1158207 1184364 1210095 1238666 1269177 1299093 1330434 1366728 1406218 1444928 1484031 1527148
$$ packed form
55999F67024l1283k5779k1439j8295j4766j1143r242q575o814m085k711k692j722
55986E08478K31P80j51l0J498K030J133J069K274K665K046K588M352M953M325
55971E38241M953O792O921N058M299N426N649M048L083L499K940R80L46J736K551
55956E96522K070K729M901N817N033N540P889Q843P437O752P949Q327P069P068
55942F83946R104J0030Q867Q795J0973J2301J1481J1341J2846J2962J0841R922
55930H13409J1474J2204J0769J0346J2222J3244J2188J2145J4038J4447J2536
55919I49022J2179J4577J5852J4743J5253J8774K1194K0962K2077K5833K7741
55908A158207K6157K5731K8571L0511K9916L1341L6294L9490L8710L9103M3117
$$ plain form
55897 1527148 1572920 1617747 1663464 1714505 1769734 1825020 1881592 1943596 2009796 2076268 2145027
55886 2145027 2221100 2303370 2387465 2475301 2572251 2677340 2786240 2901468 3029203 3168632
55876 3168632 3315353 3472501 3646924 3837284 4038337 4254126 4494013 4758810 5044848
55867 5044848 5358605 5712363 6108715 6545558 7033424 7591096 8228068 8950431 9781078
55858 9781078 10755109 11900983 13249946 14860493 16809934 19169102 22016356 25474257
55850 25474257 29705490 34889362 41258126 49176463 59167553 71855313 87801386 107078102
55842 107078102 128534290 149285650 165278666 173024094 171332447 161660495 146933621
55835 146933621 130014118 112918474 96839886 82406470 69848825 59132500 50102570
$$ packed form
55897A527148M5772M4827M5717N1041N5229N5286N6572O2004O6200O6472O8759
55886B145027P6073Q2270Q4095Q7836R6950J05089J08900J15228J27735J39429
55876C168632J46721J57148J74423J90360K01053K15789K39887K64797K86038
55867E044848L13757L53758L96352M36843M87866N57672O36972P22363Q30647
55858I781078R74031J145874J348963J610547J949441K359168K847254L457901
55850B5474257M231233N183872O368764P918337R991090J2687760J5946073J9276716
55842A07078102K1456188K0751360J5993016P745428j691647r671952j4726874
55835A46933621j6919503j7095644j6078588j4433416j2557645j0716325r029930
$$ plain form
55828 50102570 42563792 36290983 31055522 26676623 23026546 19990259 17452543 15322496
55820 15322496 13537115 12035735 10755126 9650703 8698556 7873706 7146019 6497923 5925898
55811 5925898 5422011 4970724 4564534 4205642 3890290 3606498 3348538 3119139 2916000
55802 2916000 2729716 2556570 2400537 2261124 2131257 2008660 1897829 1799134 1706730 1618696
55792 1618696 1538910 1467430 1398903 1331981 1270944 1216577 1164432 1113420 1067377 1026786 987402
55781 987402 948471 914150 885349 858007 830891 807553 789126 772558 757313 746485 739533 730777
55769 730777 716883 699634 680072 656477 629640 603744 580212 556349 531457 508510 488450
55758 488450 468630 448360 430439 415720 401561 387106 374798 365206 355550 344903 335839 329419
$$ packed form
55828E0102570p538778o272809n235461m378899l650077l036287k537716k130047
55820A5322496j785381j501380j280609j104423r52147q24850p27687o48096n72025
55811E925898n03887m51287m06190l58892l15352k83792k57960k29399k03139
55802B916000j86284j73146j56033j39413j29867j22597j10831r8695r2404q8034
55792A618696p9786p1480o8527o6922o1037n4367n2145n1012m6043m0591l9384
55781I87402l8931l4321k8801k7342k7116k3338j8427j6568j5245j0828o952q756
55769G30777j3894j7249j9562k3595k6837k5896k3532k3863k4892k2947k0060
55758D88450j9820k0270j7921j4719j4159j4455j2308r592r656j0647r064o420
$$ plain form
55746 329419 323359 316592 310917 306704 301686 295458 290561 287723 284428 279577 275090 271581 266892 260439
55732 260439 254685 250752 246735 241836 238066 236322 234762 232571 231485 232123 232620 232270 232741 234294 234686
55717 234686 233220 232122 232417 232236 230720 229860 230838 232201 233286 235871 240641 245462 248972 252548 256978
55702 256978 260441 261582 261524 261088 259131 255372 251797 249378 246254 240911 234441 228009 220937 213031 206097
55687 206097 201311 197556 193951 191613 191385 192284 193546 195652 198022 198394 196023 192942 190656 188284 185329
55672 185329 183351 183092 182683 180604 177980 176093 174090 170989 167646 164855 161700 157602 153831 151240 148657
55657 148657 145258 142374 141146 140483 139166 137922 137563 137076 135462 133608 132491 131272 128985 126423 124653
55642 124653 123238 121547 120173 119507 118595 116946 115722 115641 115461 114134 112664 112207 112107 111514 111199 111976 112975
$$ packed form
55746C29419o060o767n675m213n018o228m897k838l295m851m487l509m689o453
55732B60439n754l933m017m899l770j744j560k191j086O38M97l50M71J553L92
55717B34686j466j098K95j81j516q60R78J363J085K585M770M821L510L576M430
55702B56978L463J141n8m36j957l759l575k419l124n343o470o432p072p906o934
55687B06097m786l755l605k338k28Q99J262K106K370L72k371l081k286k372k955
55672A85329j978k59m09k079k624j887k003l101l343k791l155m098l771k591k583
55657A48657l399k884j228o63j317j244l59m87j614j854j117j219k287k562j770
55642A24653j415j691j374o66r12j649j224q1j80j327j470m57j00n93l15P77R99
$$ plain form
55625 112975 113226 113422 114333 115017 114410 113232 112582 111978 110567 108945 108086 107667 107056 106698 106974 106983 106022 105025
55607 105025 105023 105483 105656 106170 107650 109118 109473 109331 109711 110108 109596 108706 108458 108508 107996 107282 107219 107514 107417 107247
55587 107247 107789 108891 109961 111053 112289 113128 113391 114015 115644 117525 118945 120517 122781 124844 125818
55572 125818 126404 127564 128803 129282 129469 130136 130787 130704 130516 131092 131892 132058 132207 133449 135468 137221 138750
55555 138750 140618 142305 142801 142186 141086 139251 136198 132620 129600 127008 124099 121079 118611 116415 113837
55540 113837 111268 109540 108393 106931 105114 103517 102176 100926 100283 100657 101260 101036 100134 99260 98357 97185
55524 97185 96402 96587 96902 96235 95033 94476 94435 93873 92761 92002 91772 91468 91039 90942 90980 90565 89883 89559 89433
55505 89433 88880 88069 87697 87724 87537 87066 86653 86200 85537 85199 85691 86477 86783 86930 87658 88672 89101 88958 88860
$$ packed form
55625A12975K51J96R11O84o07j178o50o04j411j622q59m19o11l58K76Rr61r97
55607A05025kM60J73N14J480J468L55j42L80L97n12q90k48N0n12p14o3K95r7j70
55587A07247N42J102J070J092J236Q39K63O24J629J881J420J572K264K063R74
55572A25818N86J160J239M79J87O67O51q3j88N76Q00J66J49J242K019J753J529
55555A38750J868J687M96o15j100j835l053l578l020k592k909l020k468k196k578
55540A13837k569j728j147j462j817j597j341j250o43L74O03k24r02q74r03j172
55524I7185p83J85L15o67j202n57m1n62j112p59k30l04m29r7L8m15o82l24j26
55505H9433n53q11l72K7j87m71m13m53o63l38M92P86L06J47P28J014M29j43r8
$$ plain form
55486 88860 88735 88086 87139 86486 85986 85247 84762 85248 86253 86730 86639 86729 87130 87477 88050 89404 91140 92358
55468 92358 93088 94054 95339 96548 97953 100096 102554 104383 105564 106715 107695 107853 107420 107215 107145 106348 104767
55451 104767 103215 102014 100835 99775 99246 98930 98153 97256 97253 98176 99041 99438 99864 100438 100629 100352 100156 100172
55433 100172 100022 99792 99965 100335 100116 99187 98135 97075 95568 93701 92088 90770 89248 87636 86621 86214
55417 86214 85668 84744 83917 83266 82300 81024 80093 79690 79302 78750 78428 78409 78273 78000 78019 78357 78603 78760 79157
55398 79157 79542 79278 78477 77881 77649 77286 76775 76634 76829 76798 76641 77105 78205 79048 79244 79370 79758 79921 79537
55379 79537 78984 78549 78026 77408 77097 77154 77140 76937 76909 77126 77259 77395 77990 78908 79417 79341 79298 79599 79807 79624 79355
55358 79355 79246 79169 79121 79291 79493 79294 78787 78474 78401 78236 78090 78332 78651 78384 77736 77561 77861 77701 76777 75923
$$ packed form
55486H8860j25o49r47o53n00p39m85M86J005M77r1R0M01L47N73J354J736J218
55468I2358P30R66J285J209J405K143K458J829J181J151R80J58m33k05p0p97j581
55451A04767j552j201j179j060n29l16p77q97lR23Q65L97M26N74J91k77j96J6
55433A00172j50k30J73L70k19r29j052j060j507j867j613j318j522j612j015m07
55417H6214n46r24q27o51r66j276r31m03l88n52l22j9j36k73J9L38K46J57L97
55398G9157L85k64q01n96k32l63n11j41J95l1j57M64J100Q43J96J26L88J63l84
55379G9537n53m35n23o18l11N7j4k03k8K17J33J36N95R18N09p6m3L01K08j83k69
55358G9355j09p7m8J70K02j99n07l13p3j65j46K42L19k67o48j75L00j60r24q54
$$ plain form
55338 75923 75786 76136 76713 77635 78610 78862 78259 77600 77410 77356 77133 76915 76644 75921 74976 74737 75477 76340 76621
55319 76621 76595 76689 76833 77053 77787 79055 80192 80884 81649 82816 83900 84477 84872 85442 85948 86126 86135 85980 85232
55300 85232 83871 82683 82310 82509 82783 83062 83314 83174 82490 81713 81254 80953 80525 80003 79448 78755 78009 77507
55282 77507 77211 76795 76328 76266 76598 76764 76596 76555 76799 76845 76435 75980 75828 75831 75924 76385 77205 77937 78418 78922 79398
55261 79398 79377 78883 78591 78767 78929 78830 78919 79450 80000 80227 80255 80022 79160 77894 77103 77053 77020 76584 76335 76730 77258
55240 77258 77354 77279 77434 77598 77528 77521 77755 77777 77307 76814 76712 76683 76397 76191 76393 76655 76634 76648 77008 77360 77373 77428 77949
55217 77949 78599 78860 78886 79129 79547 79821 79915 79910 79712 79357 79146 79101 78810 78210 77863 78087 78441 78508 78486 78551 78404 77947
55195 77947 77698 77973 78371 78598 79019 79808 80351 80222 79996 80353 81019 81381 81471 81588 81513 80968 80332 80096 80049 79732
$$ packed form
55338G5923j37L50N77R22R75K52o03o59j90n4k23k18k71p23r45k39P40Q63K81
55319G6621k6R4J44K20P34J268J137O92P65J167J084N77L95N70N06J78Rj55p48
55300H5232j361j188l73J99K74K79K52j40o84p77m59l01m28n22n55o93p46n02
55282G7507k96m16m67o2L32J66j68m1K44M6m10m55j52LR3M61Q20P32M81N04M76
55261G9398k1m94k92J76J62r9Q9N31N50K27K8k33q62j266p91n0l3m36k49L95N28
55240G7258R6p5J55J64p0pK34K2m70m93j02k9k86k06K02K62k1J4L60L52J3N5N21
55217G7949O50K61K6K43M18K74R4nj98l55k11m5k91o00l47K24L54O7k2O5j47m57
55195G7947k49K75L98K27M21P89N43j29k26L57O66L62R0J17p5n45o36k36m7l17
$$ plain form
55175 79732 79282 79111 79128 79008 78840 78912 79196 79557 80074 80653 80800 80299 79642 79328 79260 79301 79745 80698 81655 82261
55155 82261 82853 83641 84098 83836 83352 83169 82947 82249 81504 81288 81290 80899 80285 80014 80089 80229 80571 81225 81666 81479
55135 81479 81218 81593 82246 82334 81885 81576 81509 81281 81005 81209 81844 82278 82192 81742 81027 80149 79557 79573 79773 79590
55115 79590 79212 79177 79395 79393 79204 79206 79373 79488 79787 80533 81288 81499 81488 81928 82640 82908 82766 82885 83327 83469 83149
55094 83149 82872 82807 82566 82085 81863 82090 82316 82165 81745 81300 81006 81157 81920 82921 83635 84077 84529 84769 84318
55075 84318 83340 82521 82132 81922 81856 82196 82843 83342 83593 83874 84209 84353 84379 84579 84867 84959 85042 85507 86073 86052 85479
55054 85479 85149 85404 85680 85466 84949 84491 84067 83563 83090 82780 82643 82744 83121 83497 83493 83151 82857 82780 82801 82873 83007
55033 83007 83039 82831 82549 82321 81901 81185 80672 80778 81036 80766 80259 80405 81335 82310 82877 83244 83551 83630 83550 83591
$$ packed form
55175G9732m50j71J7j20j68P2K84L61N17N79J47n01o57l14o8M1M44R53R57O06
55155H2261N92P88M57k62m84j83k22o98p45k16Kl91o14k71P5J40L42O54M41j87
55135H1479k61L75O53Q8m49l09o7k28k76K04O35M34q6m50p15q78n92J6K00j83
55115G9590l78l5K18kj89KJ67J15K99P46P55K11j1M40P12K68j42J19M42J42l20
55094H3149k77o5k41m81k22K27K26j51m20m45k94J51P63J001P14M42M52K40m51
55075H4318r78q19l89k10o6L40O47M99K51K81L35J44K6K00K88R2Q3M65N66k1n73
55054H5479l30K55K76k14n17m58m24n04m73l10j37J01L77L76ml42k94p7K1P2J34
55033H3007L2k08k82k28m20p16n13J06K58k70n07J46R30R75N67L67L07P9q0M1
$$ plain form
55013 83591 83654 83455 83267 83651 84453 84960 85069 85424 86254 86965 87110 86969 86902 86939 87163 87781 88525 88751 88347 87902
54993 87902 87778 87711 87522 87499 87805 88219 88683 89402 90187 90436 90065 89764 90001 90447 90732 91066 91699 92367 92733 92901
54973 92901 93107 93317 93425 93466 93379 93003 92494 92271 92360 92297 91834 91217 90642 90042 89581 89723 90453 91039 90896 90224
54953 90224 89533 89062 88928 89237 89746 89904 89576 89275 89376 89580 89468 89080 88653 88224 87861 87832 88218 88686 88901
54934 88901 88798 88312 87324 86092 85262 85142 85420 85782 86341 87157 87882 88221 88367 88617 88923 89080 89018 88679 88025
54915 88025 87383 87319 87904 88523 88702 88702 88988 89532 89974 90160 90195 90237 90468 90993 91596 91883 91855 91963 92474 93113 93467
54894 93467 93395 92946 92276 91745 91639 91705 91439 90896 90692 91084 91661 92078 92497 93047 93498 93704 93817 93813 93405 92717
54874 92717 92395 92703 93132 93250 93335 93737 94241 94567 94897 95408 95759 95641 95388 95492 95911 96339 96803 97437 98020
$$ packed form
55013H3591O3j99j88L84Q02N07J09L55Q30P11J45j41o7L7K24O18P44K26m04m45
54993H7902j24o7j89k3L06M14M64P19P85K49l71l01K37M46K85L34O33O68L66J68
54973I2901K06K10J08M1q7l76n09k23Q9o3m63o17n75o00m61J42P30N86j43o72
54953I0224o91m71j34L09N09J58l28l01J01K04j12l88m27m29l63k9L86M68K15
54934H8901j03m86r88j232q30j20K78L62N59Q16P25L39J46K50L06J57o2l39o54
54915H8025o42o4N85O19J79%K86N44M42J86L5M2K31N25O03K87k8J08N11O39L54
54894I3467p2m49o70n31j06O6k66n43k04L92N77M17M19N50M51K06J13mm08o88
54874I2717l22L08M29J18Q5M02N04L26L30N11L51j18k53J04M19M28M64O34N83
$$ plain form
54855 98020 98272 98364 98646 99082 99393 99503 99496 99379 99206 99180 99310 99299 99042 98877 99058 99401 99798 100553 101805 103067
54835 103067 103889 104592 105784 107494 109353 111355 113901 117240 121371 126289 131829 137410 142335 146206 148786
54820 148786 149726 148878 146628 143505 139640 135039 130119 125537 121593 118175 115160 112524 110224 108298 106932
54805 106932 106126 105509 104794 104142 103808 103699 103641 103738 104086 104409 104426 104360 104625 105229 105885 106543 107425 108695 110468
54786 110468 112962 116260 120126 124360 129055 134153 139032 142970 145775 147519 147974 146853 144374 141046
54772 141046 137086 132575 128008 124037 120705 117539 114407 111701 109589 107666 105577 103545 102018 101074
54758 101074 100405 99723 98981 98263 97571 96741 95646 94477 93668 93425 93495 93493 93263 92794 92059 91189 90557 90439 90724
54739 90724 91139 91569 91938 92085 91973 91799 91692 91542 91345 91345 91577 91670 91463 91460 92143 93179 93824 93922 93939 94144 94296
$$ packed form
54855I8020K52R2K82M36L11J10pj17j73k6J30j1k57j65J81L43L97P55J252J262
54835A03067Q22P03J192J710J859K002K546L339M131M918N540N581M925L871K580
54820A48786R40q48k250l123l865m601m920m582l944l418l015k636k300j926j366
54805A06932q06o17p15o52l34j09n8R7L48L23J7o6K65O04O56O58Q82J270J773
54786A10468K494L298L866M234M695N098M879L938K805J744M55j121k479l328
54772A41046l960m511m567l971l332l166l132k706k112j923k089k032j527r44
54758A01074o69o82p42p18o92q30j095j169q09k43P0kk30m69p35q70o32j18K85
54739I0724M15M30L69J47j12j74j07j50j97%K32R3k07lO83J036O45R8J7K05J52
$$ plain form
54718 94296 94140 93706 93129 92523 92081 91930 91925 91891 91985 92501 93363 94149 94573 94657 94508 94255 94124 94241 94402 94345 94191
54697 94191 94339 94960 95857 96754 97483 97970 98324 98856 99758 100807 101637 102154 102501 102765 103027 103539 104517 105843
54679 105843 107258 108755 110520 112586 114885 117555 120901 125066 129915 135134 140240 144671 148102 150562
54665 150562 152044 152243 150945 148458 145336 141885 138247 134733 131649 128969 126542 124460 122821 121334
54651 121334 119612 117743 116129 114859 113628 112280 110997 109984 109303 108942 108672 107986 106627 105198 104748
54636 104748 105703 107543 109565 111601 113887 116600 119748 123322 127320 131678 136149 140259 143485 145625
54622 145625 146806 147045 146004 143465 139815 135802 131935 128340 125006 121826 118568 115144 111862 109142
54608 109142 107093 105591 104604 104125 103920 103652 103165 102460 101585 100728 100174 99894 99483 98806 98388 98727 99533 100090
$$ packed form
54718I4296j56m34n77o06m42j51nl4R4N16Q62P86M24Q4j49k53j31J17J61n7j54
54697I4191J48O21Q97Q97P29M87L54N32R02J049Q30N17L47K64K62N12R78J326
54679A05843J415J497J765K066K299K670L346M165M849N219N106M431L431K460
54665A50562J482J99j298k487l122l451l638l514l084k680k427k082j639j487
54651A21334j722j869j614j270j231j348j283j013o81l61k70o86j359j429m50
54636A04748R55J840K022K036K286K713L148L574L998M358M471M110L226K140
54622A45625J181K39j041k539l650m013l867l595l334l180l258l424l282k720
54608A09142k049j502r87m79k05k68m87p05q75q57n54k80m11o77m18L39Q06N57
$$ plain form
54590 100090 100150 100002 99913 99987 100381 101097 101735 101954 102052 102550 103361 103931 104078 104084 104031 103699 103114 102601 102198 101561 100555
54569 100555 99451 98425 97388 96385 95687 95308 94914 94381 94038 94129 94375 94290 93757 93155 93046 93729 94916 95953
54551 95953 96509 96893 97421 97804 97583 96934 96466 96373 96330 96164 96025 95905 95595 95195 95117 95478 96007 96569 97259 97928
54531 97928 98169 97907 97475 97021 96372 95597 95121 95084 95150 95160 95414 96015 96488 96417 96034 95786 95724 95695 95815 96300 97002
54510 97002 97463 97382 96861 96288 96067 96310 96737 97043 97301 97729 98160 98184 97840 97649 97860 98102 97985 97551 96958 96186
54490 96186 95334 94812 94848 95108 95110 94772 94294 93766 93228 92924 93181 94049 95260 96459 97411 98049 98429 98575 98428
54471 98428 98065 97804 97852 97948 97698 97131 96568 96059 95463 95023 95274 96246 97329 98079 98635 99168 99454 99317 99004
54452 99004 98773 98500 98061 97756 98010 98866 100037 101213 102098 102481 102529 102711 103194 103633 103784 103981 104650 105679
$$ packed form
54590A00090O0j48q9P4L94P16O38K19R8M98Q11N70J47On3l32n85n13m03o37j006
54569A00555j104j026j037j003o98l79l94n33l43R1K46q5n33o02j09O83J187J037
54551I5953N56L84N28L83k21o49m68r3m3j66j39j20l10m00p8L61N29N62O90O69
54531I7928K41k62m32m54o49p75m76l7O6J0K54O01M73p1l83k48o2k9J20M85P02
54510I7002M61q1n21n73k21K43M27L06K58M28M31K4l44j91K11K42j17m34n93p72
54490I6186q52n22L6K60Kl38m78n28n38l04K57Q68J211J199R52O38L80J46j47
54471I8428l63k61M8R6k50n67n63n09n96m40K51R72J083P50N56N33K86j37l13
54452I9004k31k73m39l05K54Q56J171J176Q85L83M8J82M83M39J51J97O69J029
$$ plain form
54434 105679 106591 107130 107308 107123 106612 106006 105501 104949 104095 103015 102066 101440 101005 100534 99940 99340 98961 98937 99157
54415 99157 99425 99718 100104 100428 100448 100262 100257 100551 100883 101143 101553 102105 102316 101873 101145 100671 100448 100089 99467 98790
54395 98790 98219 97786 97623 97878 98414 98837 98885 98668 98529 98741 99230 99606 99558 99252 99123 99311 99583 99825 100221 100815
54375 100815 101294 101433 101453 101657 102017 102343 102610 102851 102974 102933 102887 102919 102833 102483 102102 102020 102232 102521 102880 103502 104431
54354 104431 105435 106182 106397 105977 105155 104398 103967 103674 103232 102690 102346 102362 102620 102906 103014 102798 102247 101533 100884
54335 100884 100449 100288 100388 100694 101198 101940 102813 103498 103814 103978 104242 104385 103983 103118 102350 102011 101997 102275 103001
54316 103001 104046 104937 105484 105971 106509 106770 106648 106655 107223 108065 108645 108898 109085 109299 109531 109883 110295 110373 109985
54297 109985 109702 110171 111211 112016 112100 111645 111051 110575 110331 110251 110079 109681 109290 109190 109303 109333 109191 108988 108753
$$ packed form
54434A05679R12N39J78j85n11o06n05n52q54j080r49o26m35m71n94o00l79k4K20
54415I9157K68K93L86L24K0j86nK94L32K60M10N52K11m43p28m74k23l59o22o77
54395I8790n71m33j63K55N36M23M8k17j39K12M89L76m8l06j29J88K72K42L96N94
54375A00815M79J39K0K04L60L26K67K41J23m1m6L2q6l50l81q2K12K89L59O22R29
54354A04431J004P47K15m20q22p57m31k93m42n42l44J6K58K86J08k16n51p14o49
54335A00884m35j61J00L06N04P42Q73O85L16J64K64J43m02q65p68l39j4K78P26
54316A03001J045Q91N47M87N38K61j22PN68Q42N80K53J87K14K32L52M12P8l88
54297A09985k83M69J040Q05Q4m55n94m76k44q0j72l98l91j00J13L0j42k03k35
$$ plain form
54278 108753 108457 108198 108125 108260 108612 109249 110066 110665 110747 110452 110103 109855 109803 110162 111006 112041 112958 113835 114886
54259 114886 116048 117130 118145 119186 120197 121261 122861 125415 128677 131991 134998 137710 140033 141700
54245 141700 142642 143001 142760 141748 140037 138036 136101 134293 132504 130619 128569 126408 124325 122449 120732
54230 120732 119160 117915 117123 116620 116173 115791 115580 115451 115244 115023 114989 115192 115497 115716 115629 115067 114161 113319 112764
54211 112764 112331 111872 111559 111526 111527 111317 111118 111323 111895 112432 112705 112828 112939 113008 112866 112298 111265 110164 109588
54192 109588 109657 109924 110111 110494 111260 111982 112205 112165 112361 112753 112921 112787 112594 112414 112187 112125 112446 112863 112847 112346
54172 112346 111784 111433 111267 111316 111640 112035 112260 112457 112898 113436 113738 113923 114398 115141 115718 116018 116362 116872 117288
54153 117288 117472 117567 117571 117258 116663 116127 115795 115500 115230 115215 115421 115446 115058 114461 113909 113460 113201 113296 113691 114124 114540
$$ packed form
54278A08753k96k59p3J35L52O37Q17N99Q2k95l49k48n2L59Q44J035R17Q77J051
54259A14886J162J082J015J041J011J064J600K554L262L314L007K712K323J667
54245A41700R42L59k41j012j711k001j935j808j789j885k050k161k083j876j717
54230A20732j572j245p92n03m47l82k11j29k07k21l4K03L05K19q7n62r06q42n55
54211A12764m33m59l13l3Jk10j99K05N72N37K73J23J11O9j42n68j033j101n76
54192A09588O9K67J87L83P66P22K23m0J96L92J68j34j93j80k27o2L21M17j6n01
54172A12346n62l51j66M9L24L95K25J97M41N38L02J85M75P43N77L00L44N10M16
54153A17288J84R5Ml13n95n36l32k95k70j5K06K5l88n97n52m49k59R5L95M33M16
$$ plain form
54132 114540 115115 115768 116123 116063 115939 116022 116152 116112 116003 116038 116239 116512 116810 117095 117318 117515 117739 117865 117695 117241
54112 117241 116638 115855 114796 113662 112847 112482 112410 112567 113027 113701 114345 114917 115516 116020 116173 116067 116128 116567 117179
54093 117179 117679 117887 117620 116895 116214 116132 116503 116634 116216 115593 115062 114537 114063 114008 114434 114846 114898 114908 115278 115817
54073 115817 116018 115723 115116 114331 113425 112588 112046 111829 111776 111703 111471 111080 110768 110814 111205 111664 112034 112373 112723 113063
54053 113063 113512 114214 115030 115706 116323 117160 118096 118655 118706 118654 118762 118795 118531 118154 117906 117754 117631 117632 117776 117945
54033 117945 118203 118766 119473 119804 119632 119503 119872 120522 121018 121278 121325 121015 120426 120114 120479 121190 121698 122012 122514
54014 122514 123281 124057 124702 125176 125263 124789 124013 123455 123360 123662 124251 124954 125381 125266 124877 124743 125003 125376 125719
53995 125719 126255 127210 128519 129954 131368 132728 134123 135763 137889 140661 144194 148659 154274 161223 169522
$$ packed form
54132A14540N75O53L55o0j24Q3J30m0j09L5K01K73K98K85K23J97K24J26j70m54
54112A17241o03p83j059j134q15l65p2J57M60O74O44N72N99N04J53j06O1M39O12
54093A17179N00K08k67p25o81q2L71J31m18o23n31n25m74n5M26M12N2J0L70N39
54073A15817K01k95o07p85r06q37n42k17n3p3k32l91l12M6L91M59L70L39L50L40
54053A13063M49P02Q16O76O17Q37R36N59N1n2J08L3k64l77k48j52j23JJ44J69
54033A17945K58N63P07L31j72j29L69O50M96K60M7l10n89l12L65P11N08L14N02
54014A22514P67P76O45M74Q7m74p76n58r5L02N89P03M27j15l89j34K60L73L43
53995A25719N36R55J309J435J414J360J395J640K126K772L533M465N615O949Q299
$$ plain form
53980 169522 178730 187676 194719 198544 198717 195546 189715 182189 174186 166787 160481 155155 150481 146268
53966 146268 142563 139529 137181 135271 133525 131936 130685 129822 129266 129073 129379 130090 130927 131812 132856 133976
53950 133976 134882 135549 136289 137285 138465 139960 142227 145529 149659 154366 159546 164812 169341 172526 174459
53935 174459 175479 175645 174989 173862 172616 171258 169837 168848 168763 169349 169964 170384 170911 171763 172731 173456 173762
53918 173762 173727 173619 173737 174190 174908 175871 177028 177945 177959 176931 175520 174383 173445 172247 170626 168672 166342
53901 166342 163593 160719 158108 155825 153779 152068 150779 149667 148469 147388 146822 146741 146702 146380 145695 144601
53885 144601 143168 141764 140747 140009 139184 138247 137538 137260 137303 137540 137951 138482 139036 139542 139831 139604 138819 137930
53867 137930 137403 137144 136758 136205 135783 135591 135450 135307 135292 135386 135423 135413 135504 135659 135728 135830 136302 137174 138090 138814 139532
$$ packed form
53980A69522R208Q946P043L825J73l171n831p526q003p399o306n326m674m213
53966A46268l705l034k348j910j746j589j251q63n56j93L06P11Q37Q85J044J120
53950A33976R06O67P40R96J180J495K267L302M130M707N180N266M529L185J933
53935A74459J020J66o56j127j246j358j421r89q5N86O15M20N27Q52R68P25L06
53918A73762l5j08J18M53P18R63J157R17J4j028j411j137r38j198j621j954k330
53901A66342k749k874k611k283k046j711j289j112j198j081n66q1l9l22o85j094
53885A44601j433j404j017p38q25r37p09k78M3K37M11N31N54N06K89k27p85q89
53867A37930n27k59l86n53m22j92j41j43j5R4L7j0R1J55O9J02M72Q72R16P24P18
$$ plain form
53846 139532 140587 142100 143889 145609 147019 148328 150118 152723 155824 158998 162474 166922 172598 179176
53832 179176 186445 194690 204313 215492 228376 243083 259044 274404 286412 292671 292339 286441 277106
53819 277106 266361 255517 245440 236902 230314 225372 221376 217917 215089 213211 212605 213462 215536 218067
53805 218067 220318 222146 223810 225403 226798 227951 228834 229190 228808 227951 227066 226174 224972 223443 221837 220078
53789 220078 217811 215072 212396 210097 207899 205457 202743 199754 196307 192413 188498 184978 181829 178844
53775 178844 176043 173609 171589 169870 168304 166778 165282 163943 162824 161727 160410 158948 157605 156372
53761 156372 155003 153477 152050 150787 149493 148179 147152 146486 145810 144833 143731 142791 142033 141409 141020 140844
53745 140844 140552 139906 139105 138472 138034 137659 137370 137204 137007 136677 136459 136644 137094 137344 137167 136753 136394 136246 136350
$$ packed form
53846A39532J055J513J789J720J410J309J790K605L101L174L476M448N676O578
53832A79176P269Q245R623J1179J2884J4707J5961J5360J2008O259l32n898r335
53819B77106j0745j0844j0077q538o588m942l996l459k828j878o06Q57K074K531
53805B18067K251J828J664J593J395J153Q83L56l82q57q85q92j202j529j606j759
53789B20078k267k739k676k299k198k442k714k989l447l894l915l520l149k985
53775A78844k801k434k020j719j566j526j496j339j119j097j317j462j343j233
53761A56372j369j526j427j263j294j314j027o66o76r77j102r40p58o24l89j76
53745A40844k92o46q01o33m38l75k89j66j97l30k18J85M50K50j77m14l59j48J04
$$ plain form
53726 136350 136648 136933 136992 136849 136742 136887 137339 138040 138844 139513 139856 139887 139767 139586 139351 139188 139384 140086 141031
53707 141031 141756 142129 142541 143485 145015 146752 148341 149712 150943 152202 153865 156397 159851 163665 167179
53692 167179 170192 172855 175235 177248 178859 180037 180645 180668 180425 180250 180098 179787 179458 179344 179190 178463 177191
53675 177191 176106 175742 175778 175485 174478 172839 170828 168764 166948 165402 163781 161749 159379 157073 155149
53660 155149 153598 152164 150595 148881 147261 145944 144894 143995 143271 142723 142088 141095 139909 138986 138465 138069
53644 138069 137608 137204 136973 136858 136892 137239 137801 138154 138083 137890 137925 138098 138072 137733 137260 136924 137000 137620 138532 139206
53624 139206 139380 139317 139366 139533 139703 139974 140477 141026 141317 141416 141744 142606 143930 145420 146777 147772 148303 148481 148606
53605 148606 149030 149984 151427 153055 154609 156154 157891 159712 161209 162198 162924 163632 164209 164484 164629 164985
$$ packed form
53726A36350K98K85N9j43j07J45M52P01Q04O69L43L1j20j81k35j63J96P02R45
53707A41031P25L73M12R44J530J737J589J371J231J259J663K532L454L814L514
53692A67179L013K663K380K013J611J178O08K3k43j75j52l11l29j14j54p27j272
53675A77191j085l64L6k93j007j639k011k064j816j546j621k032k370k306j924
53660A55149j551j434j569j714j620j317j050q99p24n48o35r93j186r23n21l96
53644A38069m61m04k31j15L4L47N62L53p1j93L5J73k6l39m73l36P6O20R12O74
53624A39206J74o3M9J67J70K71N03N49K91R9L28Q62J324J490J357R95N31J78J25
53605A48606M24R54J443J628J554J545J737J821J497R89P26P08N77K75J45L56
$$ plain form
53589 164985 165630 166367 167041 167632 168162 168698 169380 170259 171167 171919 172554 173191 173754 174079 174260 174649 175417 176320 176956
53570 176956 177165 177104 176984 176823 176451 175724 174695 173603 172735 172316 172383 172692 172848 172676 172413 172383 172565 172669 172587
53551 172587 172521 172667 173006 173442 173928 174381 174658 174684 174471 174010 173342 172709 172396 172370 172331 172175 172157 172498 173096 173712
53531 173712 174261 174785 175350 176030 176792 177336 177347 177025 177051 177852 179164 180475 181599 182606 183485 184207 184952 185897
53513 185897 186907 187722 188398 189287 190596 192192 193897 195724 197778 200006 202148 203960 205484 207104 209220
53498 209220 211884 214869 218096 221773 226027 230613 235208 239814 244633 249546 253908 256987 258548 258942
53484 258942 258617 257640 255803 253173 250273 247596 245168 242823 240690 239030 237733 236389 234837 233266 231751
53469 231751 230133 228453 227074 226195 225593 224998 224397 223816 223134 222360 221740 221373 220985 220338 219583 218955 218423 217903
$$ packed form
53589A64985O45P37O74N91N30N36O82Q79R08P52O35O37N63L25J81L89P68R03O36
53570A76956K09o1j20j61l72p27j029j092q68m19O7L09J56j72k63l0J82J04q2
53551A72587o6J46L39M36M86M53K77K6k13m61o68o33l13k6l9j56j8L41N98O16
53531A73712N49N24N65O80P62N44J1l22K6Q01J312J311J124J007Q79P22P45R45
53513A85897J010Q15O76Q89J309J596J705J827K054K228K142J812J524J620K116
53498B09220K664K985L227L677M254M586M595M606M819M913M362L079J561L94
53484B58942l25r77j837k630k900k677k428k345k133j660j297j344j552j571j515
53469B31751j618j680j379q79o02n95o01n81o82p74o20l67l88o47p55o28n32n20
$$ plain form
53451 217903 217555 217544 217734 217944 218301 218969 219679 219923 219575 219012 218620 218459 218432 218571 219035 219913 221046 222087 222825
53432 222825 223434 224272 225428 226686 227924 229251 230707 232131 233509 235159 237405 240281 243671 247464 251438
53417 251438 255365 259414 264103 269623 275564 281560 287774 294394 301059 307311 313336 319741 326742 333986
53403 333986 341066 347816 354249 360663 367714 375925 385130 394732 404438 414333 424376 434296 444049 453935
53389 453935 464142 474504 484781 494872 504692 514098 523069 531700 540048 548183 556365 564883 573630
53376 573630 582157 590188 597862 605419 612972 620637 628610 636903 645140 652792 659555 665462 670761 675708
53362 675708 680343 684394 687485 689460 690441 690592 689919 688298 685596 681791 677080 671815 666289 660605 654790
53347 654790 648874 642748 636125 628839 621076 613125 604973 596389 587336 578094 569003 560232 551803 543638
$$ packed form
53451B17903l48j1J90K10L57O68P10K44l48n63l92j61k7J39M64Q78J133J041P38
53432B22825O09Q38J156J258J238J327J456J424J378J650K246K876L390L793L974
53417B51438L927M049M689N520N941N996O214O620O665O252O025O405P001P244
53403C33986P080O750O433O414P051Q211R205R602R706R895J0043R920R753R886
53389D53935J0207J0362J0277J0091R820R406Q971Q631Q348Q135Q182Q518Q747
53376E73630Q527Q031P674P557P553P665P973Q293Q237P652O763N907N299M947
53362F75708M635M051L091J975R81J51o73j621k702l805m711n265n526n684n815
53347F54790n916o126o623p286p763p951q152q584r053r242r091q771q429q165
$$ plain form
53333 543638 535597 527587 519686 512124 505228 499391 494945 491874 489784 488232 486995 485962 485039 484371 484464
53318 484464 485777 488210 491208 494272 497242 500211 503388 506981 511053 515520 520407 525934 532254 539277
53304 539277 546887 555108 563870 572852 581875 591294 601683 613221 625656 638733 652408 666734 681846
53291 681846 697996 715404 734082 753941 774923 796873 819476 842487 865867 889558 913393
53280 913393 937446 962092 987373 1012666 1037336 1061432 1085266 1108597 1130853 1151963 1172354
53269 1172354 1192099 1210683 1227642 1242898 1256379 1267838 1277231 1284856 1290922 1295298 1297777 1298237 1296396
53256 1296396 1291717 1283740 1272335 1257636 1240034 1220245 1199087 1177061 1154372 1131300 1108228 1085268
53244 1085268 1062263 1039279 1016768 995150 974469 954585 935394 916746 898410 880273 862406
$$ packed form
53333E43638q041q010p901p562o896n837m446l071k090j552j237j033r23o68R3
53318D84464J313K433K998L064K970K969L177L593M072M467M887N527O320P023
53304E39277P610Q221Q762Q982R023R419J0389J1538J2435J3077J3675J4326J5112
53291F81846J6150J7408J8678J9859K0982K1950K2603K3011K3380K3691K3835
53280I13393K4053K4646K5281K5293K4670K4096K3834K3331K2256K1110K0391
53269A172354J9745J8584J6959J5256J3481J1459R393P625O066M376K479M60j841
53256A296396m679p977j1405j4699j7602j9789k1158k2026k2689k3072k3072k2960
53244A085268k3005k2984k2511k1618k0681j9884j9191j8648j8336j8137j7867
$$ plain form
53233 862406 844831 827412 810037 792743 775681 759145 743632 729584 717014 705568 694959
53222 694959 685153 676196 668146 661169 655380 650540 646103 641565 636602 630994 624731 618153 611632 605183
53208 605183 598688 592479 587200 583056 579534 576019 572387 568922 565956 563674 562102 561159 560885 561471 562868
53193 562868 564587 566286 568394 571637 576060 581055 586360 592408 599541 607478 615844 624741 634451 644928
53179 644928 655864 667021 678240 689349 700242 710832 720871 730058 738395 746146 753424 760073
53167 760073 766001 771176 775275 777768 778479 777667 775457 771674 766431 760376 754035 747227 739417 730348 720087
53152 720087 708778 696651 684073 671359 658627 645851 632834 619184 604765 590183 576380
53141 576380 563664 551589 539861 528742 518394 508462 498637 489022 479586 469811 459389 448771
$$ packed form
53233H62406j7575j7419j7375j7294j7062j6536j5513j4048j2570j1446j0609
53222F94959r806q957q050o977n789m840m437m538m963n608o263o578o521o449
53208F05183o495o209n279m144l522l515l632l465k966k282j572r43k74N86J397
53193E62868J719J699K108L243M423M995N305O048P133P937Q366Q897R710J0477
53179F44928J0936J1157J1219J1109J0893J0590J0039R187Q337P751P278O649
53167G60073N928N175M099K493P11q12k210l783n243o055o341o808p810r069j0261
53152G20087j1309j2127j2578j2714j2732j2776j3017j3650j4419j4582j3803
53141E76380j2716j2075j1728j1119j0348r932r825r615r436r775j0422j0618
$$ plain form
53129 448771 438520 428518 418356 408154 398452 389569 381594 374702 368938 363868 358993 354408 350564
53116 350564 347520 344861 342270 339682 336951 333795 330097 325905 321155 315725 309715 303386 296857 290168
53102 290168 283598 277608 272459 268043 264044 260119 256049 251929 248097 244748 241771 239063 236667 234397
53088 234397 231722 228351 224639 221027 217384 213402 209354 205895 203190 200810 198435 196191 194228 192443
53074 192443 190727 189097 187471 185634 183569 181564 179884 178506 177222 175844 174327 172872 171824 171291
53060 171291 170908 170194 169096 167967 167065 166339 165660 165020 164485 164147 164108 164325 164507 164331 163791 163173 162750 162593
53042 162593 162593 162536 162237 161752 161361 161265 161436 161812 162352 162772 162571 161612 160423 159623 159306 159238 159330 159506 159416 158811 158077
53021 158077 157898 158452 159359 160346 161450 162611 163604 164439 165370 166406 167237 167718 168062 168386 168452 168056 167347 166563
$$ packed form
53129D48771j0251j0002j0162j0202r702q883p975o892n764n070m875m585l844
53116C50564l044k659k591k588k731l156l698m192m750n430o010o329o529o689
53102B90168o570n990n149m416l999l925m070m120l832l349k977k708k396k270
53088B34397k675l371l712l612l643l982m048l459k705k380k375k244j963j785
53074A92443j716j630j626j837k065k005j680j378j284j378j517j455j048n33
53060A71291l83p14j098j129r02p26o79o40n35l38l9K17J82j76n40o18m23j57
53042A62593%n7k99m85l91r6J71L76N40M20k01r59j189q00l17o8R2J76r0o05p34
53021A58077j79N54R07R87J104J161R93Q35R31J036Q31M81L44L24O6l96p09p84
$$ plain form
53003 166563 165752 164926 164262 163927 163812 163626 163130 162216 160898 159392 158106 157417 157417 157892 158527 159163 159857 160667
52985 160667 161420 161847 161962 162082 162364 162550 162325 161748 161120 160646 160420 160512 160805 160940 160722 160407 160306 160344 160281 160151
52965 160151 160064 159786 159033 158077 157532 157550 157684 157561 157232 156796 156137 155223 154301 153599 153081 152621 152216 151931 151819
52946 151819 151904 152100 152222 152268 152608 153535 154748 155623 155965 156110 156281 156325 156167 156075 156292 156694 156990 157042 156854 156494
52926 156494 156099 155816 155675 155686 155935 156368 156596 156321 155844 155758 156193 156817 157494 158348 159140 159277 158690 158130 158233
52907 158233 158765 159192 159527 160136 161014 161734 162032 162003 161841 161686 161670 161857 162117 162251 162204 162070 162035 162375 163279 164538
52887 164538 165601 166133 166319 166455 166474 166130 165501 164992 164858 164984 165111 165140 165147 165212 165317 165424 165675 166370 167635 169191
52867 169191 170622 171792 172792 173599 174124 174532 175134 175900 176444 176593 176558 176450 176035 175199 174269 173577 173014 172321
$$ packed form
53003A66563q11q26o64l35j15j86m96r14j318j506j286o89%M75O35O36O94Q10
52985A60667P53M27J15J20K82J86k25n77o28m74k26R2K93J35k18l15j01L8o3j30
52965A60151q7k78p53r56n45J8J34j23l29m36o59r14r22p02n18m60m05k85j12
52946A51819Q5J96J22M6L40R27J213Q75L42J45J71M4j58r2K17M02K96N2j88l60
52926A56494l95k83j41J1K49M33K28k75m77q6M35O24O77Q54P92J37n87n60J03
52907A58233N32M27L35O09Q78P20K98k9j62j55j6J87K60J34m7j34l5L40R04J259
52887A64538J063N32J86J36J9l44o29n09j34J26J27K9PO5J05J07K51O95J265J556
52867A69191J431J170J000Q07N25M08O02P66N44J49l5j08m15q36r30o92n63o93
$$ plain form
52849 172321 171562 170945 170406 169722 168920 168278 167956 167865 167831 167692 167356 166921 166649 166645 166670 166428 165871 165114 164239 163400
52829 163400 162931 163085 163753 164636 165535 166263 166497 166063 165299 164804 164833 165134 165340 165259 164851 164203 163566 163220 163257 163604
52809 163604 164213 165007 165702 165957 165730 165318 164971 164634 164092 163240 162167 161128 160491 160534 161171 161971 162551 162908
52791 162908 163280 163804 164432 165140 165992 166904 167523 167566 167207 166887 166719 166309 165313 163922 162633 161717 161163 160945
52773 160945 161016 161156 161188 161330 161979 163079 164063 164506 164564 164684 165152 165987 166997 167833 168301 168732 169749 171500
52755 171500 173382 174725 175384 175531 175184 174324 173207 172126 170957 169287 167021 164639 162806 161804 161298
52740 161298 160624 159420 158024 157054 156624 156251 155603 154941 154633 154659 154858 155331 156154 157006 157528 157870 158375 158871
52722 158871 158803 158051 157100 156357 155796 155463 155831 157318 159722 162453 165168 167870 170449 172419 173217 172692 171211
$$ packed form
52849A72321p59o17n39o84q02o42l22r1l4j39l36m35k72mK5k42n57p57q75q39
52829A63400m69J54O68Q83Q99P28K34m34p64m95K9L01K06q1m08o48o37l46L7L47
52809A63604O09P94O95K55k27m12l47l37n42q52j073j039o37M3O37Q00N80L57
52791A62908L72N24O28P08Q52R12O19M3l59l20j68m10r96j391j289r16n54k18
52773A60945P1J40L2J42O49J100R84M43N8J20M68Q35J010Q36M68M31J017J751
52755A71500J882J343O59J47l47q60j117j081j169j670k266k382j833j002n06
52740A61298o74j204j396r70m30l73o48o62l08K6J99M73Q23Q52N22L42N05M96
52722A58871o8p52r51p43n61l33L68J487K404K731K715K702K579J970P98n25j481
$$ plain form
52705 171211 169298 167214 164940 162498 160164 158251 156823 155688 154622 153514 152382 151348 150565 150056 149725
52690 149725 149539 149578 149795 149916 149751 149479 149413 149586 149792 149939 150158 150557 151084 151629 152096 152402 152610 153019 153909
52671 153909 155148 156205 156611 156336 155728 155191 154949 154952 154979 154878 154675 154447 154153 153753 153371 153173 153111 152940 152540
52652 152540 152103 151954 152277 153005 153899 154724 155423 156120 156931 157801 158576 159164 159547 159738 159756 159609 159260 158744 158336
52633 158336 158456 159284 160564 161910 163159 164369 165652 167102 168675 169982 170434 169890 168932 168228 167786 167175
52617 167175 166325 165645 165354 165137 164647 163990 163481 163148 162723 162039 161271 160780 160791 161184 161598 161764 161748 161792 162006 162340
52597 162340 162790 163389 163981 164206 163836 163091 162548 162740 163786 165281 166564 167220 167357 167406 167707 168354 169263 170209
52579 170209 170851 170959 170619 170087 169470 168734 167955 167318 166835 166331 165778 165461 165632 166150 166607 166773 166776 166844 166963 166909
$$ packed form
52705A71211j913k084k274k442k334j913j428j135j066j108j132j034p83n09l31
52690A49725j86L9K17J21j65k72o6J73K06J47K19L99N27N45M67L06K08M09Q90
52671A53909J239J057M06k75o08n37k42LK7j01k03k28k94m00l82j98o2j71m00
52652A52540m37j49L23P28Q94Q25O99O97Q11Q70P75N88L83J91J8j47l49n16m08
52633A58336J20Q28J280J346J249J210J283J450J573J307M52n44r58p04m42o11
52617A67175q50o80k91k17m90o57n09l33m25o84p68m91J1L93M14J66j6M4K14L34
52597A62340M50N99N92K25l70p45n43J92J046J495J283O56J37M9L01O47R09R46
52579A70209O42J08l40n32o17p36p79o37m83n04n53l17J71N18M57J66LO8J19n4
$$ plain form
52559 166909 166608 166384 166660 167436 168259 168871 169659 171216 173526 175848 177371 177794 177313 176340 175352 174705 174409
52542 174409 174135 173593 172868 172346 172363 172950 173821 174569 174947 175007 174983 175054 175313 175890 176933 178378 179837 180773 180789
52523 180789 179827 178190 176409 174943 173929 173173 172398 171466 170445 169515 168798 168228 167650 167100 166852 167101 167690
52506 167690 168292 168793 169346 170082 170897 171521 171754 171691 171742 172277 173153 173780 173798 173476 173234 173025 172552 171955 171776 172264
52486 172264 173095 173924 174789 175808 176831 177614 178108 178343 178212 177625 176788 176105 175852 176042 176497 176942 177112 176931
52468 176931 176540 176093 175595 175034 174524 174197 174046 174002 174061 174187 174183 173847 173246 172663 172273 171968 171559 171017 170496 170178
52448 170178 170164 170441 170857 171155 171114 170708 170141 169679 169433 169296 169074 168660 168107 167576 167250 167249 167572 168109 168673 169049
52428 169049 169114 168967 168906 169164 169709 170378 171129 171995 172852 173510 174050 174783 175803 176853 177789 178880 180357 181967
$$ packed form
52559A66909l01k24K76P76Q23O12P88J557K310K322J523M23m81r73r88o47k96
52542A74409k74n42p25n22J7N87Q71P48L78O0k4P1K59N77J043J445J459R36J6
52523A80789r62j637j781j466j014p56p75r32j021r30p17n70n78n50k48K49N89
52506A67690O02N01N53P36Q15O24K33o3N1N35Q76O27J8l22k42k09m73n97j79M88
52486A72264Q31Q29Q65J019J023P83M94K35j31n87q37o83k53J90M55M45J70j81
52468A76931l91m47m98n61n10l27j51m4N9J26ml36o01n83l90l05m09n42n21l18
52448A70178j4K77M16K98m1m06n67m62k46j37k22m14n53n31l26jL23N37N64L76
52428A69049O5j47o1K58N45O69P51Q66Q57O58N40P33J020J050R36J091J477J610
$$ plain form
52410 181967 183295 184371 185605 187213 189044 190897 192619 193847 194065 193076 191240 189143 187191 185541 184182
52395 184182 182989 181860 180859 180138 179707 179465 179375 179425 179441 179230 178903 178798 179034 179396 179692 179930 180104 180124 180079
52376 180079 180244 180648 180980 181082 181235 181672 182106 182134 181909 182009 182716 183797 184958 186163 187455 188762 189971
52359 189971 190966 191515 191359 190528 189365 188110 186648 184844 182928 181289 179968 178631 177087 175620 174683
52344 174683 174399 174481 174548 174419 174147 173884 173708 173518 173134 172549 171957 171461 170882 170063 169267 168992 169343 169879 170123
52325 170123 170032 169821 169624 169494 169561 169930 170480 170926 171018 170634 169846 169038 168764 169303 170428 171757 173159 174681
52307 174681 176342 178280 180917 184654 189487 195163 201579 208674 215984 222619 227694 230587 230908 228640
52293 228640 224363 219019 213373 207848 202757 198359 194673 191598 189258 187921 187492 187446 187338 187135 186962 186846
$$ packed form
52410A81967J328J076J234J608J831J853J722J228K18r89j836k097j952j650j359
52395A84182j193j129j001p21m31k42r0N0J6k11l27j05K36L62K96K38J74K0m5
52376A80079J65M04L32J02J53M37M34K8k25J00P07J081J161J205J292J307J209
52359A89971R95N49j56q31j163j255j462j804j916j639j321j337j544j467r37
52344A74683k84Q2O7j29k72k63j76j90l84n85n92m96n79q19p96k75L51N36K44
52325A70123r1k11j97j30O7L69N50M46R2l84p88q08k74N39J125J329J402J522
52307A74681J661J938K637L737M833N676O416P095P310O635N075K893L21k268
52293B28640m277n344n646n525n091m398l686l075k340j337m29m6j08k03j73j16
$$ plain form
52277 186846 186815 186978 187345 187794 188345 189201 190445 191923 193544 195388 197390 199155 200292 200730 200601 200065 199392
52260 199392 198952 198912 199080 199223 199361 199622 199998 200424 200929 201541 202216 202953 203854 204921 205999 206994 207955 208824
52242 208824 209348 209435 209380 209529 209869 210191 210490 210981 211778 212794 213915 215123 216469 217998 219702 221527 223518
52225 223518 225889 228779 231984 235146 238210 241393 244720 247946 251030 254283 257860 261455 264780 267983
52211 267983 271365 274991 278913 283431 288711 294346 299796 305153 311058 317941 325699 334104 343112 352695
52197 352695 362663 372784 382845 392568 401646 409943 417564 424726 431682 438691 445887 453165 460311 467151
52183 467151 473495 479096 483883 488141 492208 496078 499530 502560 505426 508269 510933 513192 514925 516029
52169 516029 516451 516395 516315 516490 516669 516247 514819 512539 509958 507576 505546 503829 502474 501633 501358 501603 502497
$$ packed form
52277A86846l1J63L67M49N51Q56J244J478J621J844K002J765J137M38j29n36o73
52260A99392m40m0J68J43J38K61L76M26N05O12O75P37R01J067J078R95R61Q69
52242B08824N24Q7n5J49L40L22K99M91P97J016J121J208J346J529J704J825J991
52225B23518K371K890L205L162L064L183L327L226L084L253L577L595L325L203
52211B67983L382L626L922M518N280N635N450N357N905O883P758Q405R008R583
52197C52695R968J0121J0061R723R078Q297P621P162O956P009P196P278P146O840
52183D67151O344N601M787M258M067L870L452L030K866K843K664K259J733J104
52169E16029M22n6q0J75J79m22j428k280k581k382k030j717j355q41k75K45Q94
$$ plain form
52152 502497 504403 507566 511841 516829 522134 527405 532348 536885 541237 545764 550781 556517 562999 569858
52138 569858 576514 582709 588660 594556 600159 605088 609257 612771 615658 617975 619997 621940 623632 624727
52124 624727 625131 624964 624262 623001 621264 619127 616506 613372 609937 606313 602245 597552 592669 588275 584496
52109 584496 580934 577412 574173 571304 568462 565329 561983 558724 555853 553712 552575 552378 552816 553805 555497
52094 555497 557814 560315 562618 564590 565991 566394 565712 564505 563459 562787 562354 562088 561935 561603 560736 559364
52078 559364 557946 556934 556410 556097 555606 554720 553523 552205 550739 548901 546675 544440 542604 541156 539727
52063 539727 538045 536219 534653 533732 533526 533742 534013 534224 534432 534522 534204 533441 532644 532273 532410 532879 533654 534914
52045 534914 536747 538977 541264 543224 544515 544958 544639 543810 542692 541423 540148 539088 538520 538711 539822
$$ packed form
52152E02497J906L163M275M988N305N271M943M537M352M527N017N736O482O859
52138E69858O656O195N951N896N603M929M169L514K887K317K022J943J692J095
52124F24727M04j67p02j261j737k137k621l134l435l624m068m693m883m394l779
52109E84496l562l522l239k869k842l133l346l259k871k141j137j97M38R89J692
52094E55497K317K501K303J972J401M03o82j207j046o72m33k66j53l32q67j372
52078E59364j418j012n24l13m91q86j197j318j466j838k226k235j836j448j429
52063E39727j682j826j566r21k06K16K71K11K08R0l18p63p97l71J37M69P75J260
52045E34914J833K230K287J960J291M43l19q29j118j269j275j060n68J91J111
$$ plain form
52030 539822 541757 544102 546338 548200 549890 551909 554705 558425 562910 567777 572514 576694 580292 583736
52016 583736 587430 591237 594678 597653 600679 604283 608468 613013 618000 623677 629972 636535 643232 650273
52002 650273 657843 665837 673989 681990 689505 696325 702564 708533 714448 720420 726630 733200 739946 746623
51988 746623 753365 760516 767965 775133 781699 787927 794038 799654 804170 807372 809360 810109 809482 807518 804411
51973 804411 800272 795225 789640 783966 778382 772847 767519 762795 758871 755457 752087 748621 745365 742783
51959 742783 741152 740447 740456 740916 741587 742281 742949 743711 744709 745955 747393 749093 751239 753966 757342 761460 766330
51942 766330 771676 777060 782300 787545 792893 798205 803366 808449 813390 817758 821107 823419 824909 825535
51928 825535 824982 823046 819816 815516 810461 805167 800197 795786 791773 787986 784503 781514 779063 777035
$$ packed form
52030E39822J935K345K236J862J690K019K796L720M485M867M737M180L598L444
52016E83736L694L807L441K975L026L604M185M545M987N677O295O563O697P041
52002F50273P570P994Q152Q001P515O820O239N969N915N972O210O570O746O677
51988G46623O742P151P449P168O566O228O111N616M516L202J988P49o27j964l107
51973H04411m139n047n585n674n584n535n328m724l924l414l370l466l256k582
51959G42783j631p05RM60O71O94O68P62R98J246J438J700K146K727L376M118M870
51942G66330N346N384N240N245N348N312N161N083M941M368L349K312J490O26
51928H25535n53j936l230m300n055n294m970m411m013l787l483k989k451k028
$$ plain form
51914 777035 775237 773332 770821 767264 762523 756711 749946 742271 733797 724764 715387 705751 695994 686498
51900 686498 677720 669776 662334 654977 647539 640021 632320 624223 615606 606461 596720 586244 575070 563552
51886 563552 552137 541010 529951 518517 506376 493562 480429 467425 454940 443327 432900
51875 432900 423795 415957 409372 404174 400369 397625 395579 394285 394033 394712 395562 395612 394218 391196 386755
51860 386755 381383 375645 369919 364383 359215 354624 350705 347435 344854 343017 341774 340863 340304 340522 341926
51845 341926 344569 348275 352902 358325 364350 370781 377443 383987 389825 394462 397853 400374 402486 404449
51831 404449 406190 407358 407602 406890 405501 403695 401511 398897 395872 392579 389356 386743 385199 384823 385629
51816 385629 388123 393250 401661 413367 428203 446093 466349 486950 505013 518030 524543 523992 516503
$$ packed form
51914G77035j798j905k511l557m741n812o765p675q474r033r377r636r757r496
51900F86498q778p944p442p357p438p518p701q097q617r145r741j0476j1174j1518
51886E63552j1415j1127j1059j1434j2141j2814j3133j3004j2485j1613j0427
51875D32900r105p838o585n198l805k744k046j294k52O79Q50N0j394l022m441
51860C86755n372n738n726n536n168m591l919l270k581j837j243r11n59K18J404
51845C41926K643L706M627N423O025O431O662O544N838M637L391K521K112J963
51831D04449J741J168K44p12j389j806k184k614l025l293l223k613j544l76Q06
51816C85629K494N127Q411J1706J4836J7890K0256K0601J8063J3017O513n51p489
$$ plain form
51803 516503 502977 485006 464429 442897 421688 401636 383123 366309 351364 338399 327218
51792 327218 317358 308472 300605 294078 289162 285865 283982 283376 284189 286646 290635 295666 301374 307861 315310
51777 315310 323355 331070 337552 342306 345148 346005 344942 342222 338261 333549 328672 324266 320839 318562
51763 318562 317211 316310 315397 314264 312957 311662 310615 310035 309940 309955 309496 308219 306160 303400 299835 295415
51747 295415 290414 285265 280239 275481 271245 267814 265188 263082 261281 259912 259300 259629 260707 262069 263328
51732 263328 264456 265646 266939 268101 268905 269374 269694 269995 270344 270770 271237 271736 272502 273896 275884 277789
51716 277789 278782 278525 277219 275196 272718 270011 267249 264483 261790 259455 257808 256917 256591 256633 256915 257289
51700 257289 257622 257930 258309 258768 259299 260076 261383 263288 265470 267405 268670 269141 269004 268537 267830 266767 265310
$$ packed form
51803E16503j3526j7971k0577k1532k1209k0052j8513j6814j4945j2965j1181
51792C27218r860q886p867o527m916l297j883o06Q13K457L989N031N708O487P449
51777C15310Q045P715O482M754K842Q57j063k720l961m712m877m406l427k277
51763C18562j351r01r13j133j307j295j047n80r5J5m59j277k059k760l565m420
51747B95415n001n149n026m758m236l431k626k106j801j369o12L29J078J362J259
51732B63328J128J190J293J162Q04M69L20L01L49M26M67M99P66J394J988J905
51716B77789R93k57j306k023k478k707k762k766k693k335j647q91l26M2K82L74
51700B57289L33L08L79M59N31P77J307J905K182J935J265M71j37m67p07j063j457
$$ plain form
51683 265310 263682 262196 261040 260386 260475 261430 263110 265350 268271 272123 276887 282207 287605 292567 296501
51668 296501 298887 299500 298414 295878 292372 288632 285347 282777 280836 279425 278481 277789 277068 276276 275582 275007
51652 275007 274326 273360 272197 271037 269981 269047 268255 267676 267406 267504 267855 268197 268388 268556 268848 269167 269367 269650
51634 269650 270520 272277 274708 277239 279246 280290 280280 279494 278357 277248 276572 276857 278489 281362 284894 288338
51618 288338 290987 292331 292337 291527 290555 289742 289206 289226 290060 291459 292801 293805 294826 296416 298839 301963 305183
51601 305183 307379 307409 304998 301023 296844 293542 291826 292172 294662 298785 303580 307904 310579 310694 308186
51586 308186 304045 299672 295945 292904 290131 287257 284113 280621 276675 272206 267356 262563 258336 254962
51572 254962 252480 250818 249833 249326 249292 250102 252200 255668 260337 266260 273626 282143 290873 298836 305447
$$ packed form
51683B65310j628j486j156o54Q9R55J680K240K921L852M764N320N398M962L934
51668B96501K386O13j086k536l506l740l285k570j941j411r44o92p21p92o94n75
51652B75007o81r66j163j160j056r34p92n79k70R8L51L42J91J68K92L19K00K83
51634B69650Q70J757K431K531K007J044j0p86j137j109o76K85J632K873L532L444
51618B88338K649J344Oq10r72q13n36K0Q34J399J342J004J021J590K423L124L220
51601C05183K196L0k411l975m179l302j716L46K490M123M795M324K675J15k508
51586C08186m141m373l727l041k773k874l144l492l946m469m850m793m227l374
51572B54962k482j662r85n07l4Q10K098L468M669N923P366Q517Q730P963O611
$$ plain form
51557 305447 310248 312695 312644 310827 308421 306200 304367 303064 302666 303500 305581 308687 312535 316707 320464
51542 320464 322710 322314 318695 312246 304126 295555 287308 279798 273325 268070 263970 260835 258513 256841
51528 256841 255549 254459 253721 253639 254204 254996 255570 255820 255874 255774 255419 254833 254313 254188 254436 254654 254460 253826 252957
51509 252957 251981 250921 249898 249151 248850 248981 249448 250122 250842 251500 252160 252955 253938 255234 257328 260910 266321
51492 266321 273303 281260 289449 296852 302199 304496 303595 300222 295611 291107 287779 286095 285995 287443 290807
51477 290807 296624 305071 315733 327709 339844 351164 361541 371858 383136 395246 406547 414936
51465 414936 419360 420550 420582 421871 426374 435393 449739 469800 495316 525056 556737 587482 614762
51452 614762 637313 655189 668816 677989 681910 680029 672485 659696 641909 619410 592995 563994
$$ packed form
51557C05447M801K447n1j817k406k221j833j303l98Q34K081L106L848M172L757
51542C20464K246l96l619o449q120q571q247p510o473n255m100l135k322j672
51528B56841j292j090p38q2N65P92N74K50N4j00l55n86n20j25K48K18j94o34q69
51509B52957r76j060j023p47l01J31M67O74P20O58O60P95R83J296K094L582N411
51492B66321O982P957Q189P403N347K297r01l373m611m504l328j684j00J448L364
51477B90807N817Q447J0662J1976J2135J1320J0377J0317J1278J2110J1301Q389
51465D14936M424J190L2J289M503R019J4346K0061K5516K9740L1681L0745K7280
51452F14762K2551J7876J3627R173L921j881p544j2789j7787k2499k6415k9001
$$ plain form
51440 563994 533877 503917 475110 448174 423597 401684 382559 366145 352237 340601 330902 322615
51428 322615 315240 308665 303158 298940 295903 293731 292080 290631 289247 288156 287788 288322 289547 291159 292924
51413 292924 294505 295467 295612 295018 293685 291461 288542 285646 283386 281741 280381 279192 278138 276946 275423
51398 275423 273895 272816 272015 270813 268895 266625 264447 262413 260448 258726 257498 256736 256101 255213 253846
51383 253846 252034 250062 248222 246541 244806 242894 240969 239339 238225 237644 237435 237393 237470 237791 238416 239174
51367 239174 239838 240409 241050 241803 242509 242967 243029 242625 241833 240908 240107 239539 239295 239578 240571 242252 244480 247133
51349 247133 250040 252990 256073 259839 264898 271523 279784 289625 300198 309463 315336 317480 317444 316957 316730
51334 316730 317041 318456 321095 323661 324104 321373 316031 309289 302051 294940 288538 283147 278594 274588 271127
$$ packed form
51440E63994l0117k9960k8807k6936k4577k1913j9125j6414j3908j1636r699q287
51428C22615p375o575n507m218l037k172j651j449j384j091l68N34J225J612J765
51413B92924J581R62J45n94j333k224k919k896k260j645j360j189j054j192j523
51398B75423j528j079q01j202j918k270k178k034j965j722j228p62o35q88j367
51383B53846j812j972j840j681j735j912j925j630j114n81k09m2P7L21O25P58
51367B39174O64N71O41P53P06M58O2m04p92r25q01n68k44K83R93J681K228K653
51349B47133K907K950L083L766N059O625Q261R841J0573R265N873K144l6m87k27
51334C16730L11J415K639K566M43k731n342o742p238p111o402n391m553m006l461
$$ plain form
51319 271127 268335 266111 264220 262659 261654 261319 261480 261859 262241 262452 262421 262353 262708 263777 265344 266915 268257
51302 268257 269526 270840 271965 272558 272620 272521 272643 273144 274078 275557 277694 280510 283965 288064 292908 298705
51286 298705 305741 314234 324159 335300 347617 361587 378111 398027 421682 448949 479580 513524
51274 513524 550856 591293 633563 675161 712906 744030 767011 781477 787506 785204 774905 757446
51262 757446 733982 705606 673331 638348 602016 565564 529955 496066 464754 436620 411835
51251 411835 390282 371755 355930 342345 330557 320294 311356 303433 296140 289237 282755 276921 271926
51238 271926 267692 263867 260149 256601 253516 250996 248849 246916 245256 243938 242903 242142 241720 241465 240885
51223 240885 239721 238375 237519 237390 237759 238479 239693 241488 243686 246093 248754 251847 255451 259483 263695
$$ packed form
51319B71127k792k224j891j561j005l35J61L79L82K11l1o8L55J069J567J571J342
51302B68257J269J314J125N93O2r9J22N01R34J479K137K816L455M099M844N797
51286B98705P036Q493R925J1141J2317J3970J6524J9916K3655K7267L0631L3944
51274E13524L7332M0437M2270M1598L7745L1124K2981J4466O029k302j0299j7459
51262G57446k3464k8376l2275l4983l6332l6452l5609l3889l1312k8134k4785
51251D11835k1553j8527j5825j3585j1788j0263q938p923p293o903o482n834m995
51238B71926m234l825l718l548l085k520k147j933j660j318j035p61m22k55n80
51223B40885j164j346q56j29L69P20J214J795K198K407K661L093L604M032M212
$$ plain form
51208 263695 267691 271039 273454 274834 275130 274326 272556 270124 267309 264166 260577 256513 252262 248335 245049
51193 245049 242221 239442 236662 234313 232788 232036 231796 231940 232360 232746 232870 233028 233855 235696 238379 241598
51177 241598 245222 249146 253045 256421 258825 260101 260536 260735 261176 261906 262725 263559 264500 265605 266894 268436
51161 268436 270171 271669 272401 272214 271373 270140 268621 266993 265577 264602 264114 264140 264636 265221 265300 264610 263417
51144 263417 262036 260428 258450 256303 254480 253286 252588 251999 251258 250436 249762 249231 248528 247464 246311 245446
51128 245446 244821 244150 243493 243192 243199 243060 242678 242576 243108 243896 244480 245102 246302 248009 249635 251006 252649 255084
51110 255084 258258 261790 265353 268640 271296 273152 274381 275215 275643 275583 275214 274926 274872 274768 274183 272991 271451
51093 271451 269872 268330 266765 265260 264022 263108 262327 261502 260696 260083 259787 259963 260859 262515 264475 266077
$$ packed form
51208B63695L996L348K415J380K96q04j770k432k815l143l589m064m251l927l286
51193B45049k828k779k780k349j525p52k40J44M20L86J24J58Q27J841K683L219
51177B41598L624L924L899L376K404J276M35J99M41P30Q19Q34R41J105J289J542
51161B68436J735J498P32j87q41j233j519j628j416r75m88K6M96N85P9o90j193
51144B63417j381j608j978k147j823j194o98n89p41q22o74n31p03j064j153q65
51128B45446o25o71o57l01Pj39l82j02N32P88N84O22J200J707J626J371J643K435
51110B55084L174L532L563L287K656J856J229Q34M28o0l69k88n4j04n85j192j540
51093B71451j579j542j565j505j238r14p81q25q06o13k96J76Q96J656J960J602
$$ plain form
51077 266077 267109 267970 269097 270440 271636 272529 273257 273856 274054 273563 272444 271035 269634 268362 267291 266518
51061 266518 266084 265977 266263 267041 268164 269195 269807 270147 270584 271182 271617 271636 271353 271008 270606 269939 268846 267344
51043 267344 265539 263487 261182 258626 255957 253465 251437 249952 248866 247987 247211 246534 246041 245878 246168 246905
51027 246905 247956 249162 250396 251607 252925 254636 256887 259409 261653 263266 264360 265339 266541 268050
51013 268050 269737 271444 273158 274992 276929 278647 279706 279875 279274 278289 277443 277135 277340 277626 277622 277338 276889
50996 276889 276146 274987 273686 272640 271784 270753 269608 268908 268878 269028 268830 268417 268276 268501 268736 268728 268625 268717
50978 268717 269061 269386 269367 269018 268790 269091 269817 270611 271547 273119 275434 277864 279801 281410 283298 285717 288477
50961 288477 291463 294825 298716 303185 308359 314491 321827 330510 340434 350961 360916 369249 375810 381381
$$ packed form
51077B66077J032Q61J127J343J196Q93P28N99J98m91j119j409j401j272j071p73
51061B66518m34j07K86P78J123J031O12L40M37N98M35J9k83l45m02o67j093j502
51043B67344j805k052k305k556k669k492k028j485j086q79p76o77m93j63K90P37
51027B46905J051J206J234J211J318J711K251K522K244J613J094R79J202J509
51013B68050J687J707J714J834J937J718J059J69o01r85q46l08K05K86mk84m49
50996B76889p43j159j301j046q56j031j145p00l0J50j98m13j41K25K35qj03R2
50978B68717L44L25j9l49k28L01P26P94R36J572K315K430J937J609J888K419K760
50961B88477K986L362L891M469N174O132P336Q683R924J0527R955Q333O561N571
$$ plain form
50947 381381 387054 393659 401512 410271 418964 426430 431929 435357 436956 436839 434704 429906 422111 412109
50933 412109 401837 393300 387415 383877 381742 379864 377145 372991 367709 362167 357071 352764 349526 347654
50919 347654 347237 348174 350431 353898 358006 361893 365105 367826 370352 372688 374831 377124 380098 384135 389449
50904 389449 396133 404061 412847 422114 431609 441018 449844 457665 464355 469907 474254 477453 479833 481666
50890 481666 482734 482482 480640 477526 473750 469727 465510 461047 456633 453088 451425 452253 455557 461031 468367
50875 468367 477119 486512 495771 504660 513556 523031 533539 545496 559354 575397 593592 613801 636089
50862 636089 660680 687623 716658 747430 779668 813029 846848 880191 912173 942183 969801
50851 969801 994643 1016333 1034592 1049321 1060629 1068761 1073941 1076368 1076500 1075379 1074452 1074915 1077153 1080614
$$ packed form
50947C81381N673O605P853Q759Q693P466N499L428J599j17k135m798p795j0002
50933D12109j0272q537n885l538k135j878k719m154n282n542n096m307l238j872
50919C47654m17R37K257L467M108L887L212K721K526K336K143K293K974M037N314
50904C89449O684P928Q786R267R495R409Q826P821O690N552M347L199K380J833
50890D81666J068k52j842l114l776m023m217m463m414l545j663Q28L304N474P336
50875D68367Q752R393R259Q889Q896R475J0508J1957J3858J6043J8195K0209K2288
50862F36089K4591K6943K9035L0772L2238L3361L3819L3343L1982L0010K7618
50851I69801K4842K1690J8259J4729J1308Q132N180K427J32j121r27M63K238L461
$$ plain form
50837 1080614 1083959 1085318 1082946 1076117 1065511 1052638 1038903 1025144 1011614 997991 983508 967436
50825 967436 949505 929722 907995 884286 859047 833023 806612 779793 752770 726276 701028
50814 701028 677214 654734 633637 614077 596055 579523 564555 551183 539229 528534 519205 511295
50802 511295 504390 497870 491538 485694 480637 476380 472802 469722 466798 463745 460798 458645 457672 457559 457796
50787 457796 458339 459404 460889 462387 463774 465328 467217 469225 471152 473220 475837 479137 483000 487360
50773 487360 492196 497268 502193 506900 511795 517389 523890 531261 539483 548571 558455 569058 580512 593132
50759 593132 607230 623068 641024 661560 684936 711084 739927 771733 807038 846237 889421
50748 889421 936597 987877 1043363 1102967 1166535 1234053 1305515 1380507 1458033 1536752 1615184
$$ packed form
50837A080614L345J359k372o829j0606j2873j3735j3759j3530j3623j4483j6072
50825I67436j7931j9783k1727k3709k5239k6024k6411k6819k7023k6494k5248
50814G01028k3814k2480k1097j9560j8022j6532j4968j3372j1954j0695r329p910
50802E11295o905o520o332n844n057m257l578l080k924l053k947k153r73j13K37
50787D57796N43J065J485J498J387J554J889K008J927K068K617L300L863M360
50773D87360M836N072M925M707M895N594O501P371Q222R088R884J0603J1454J2620
50759E93132J4098J5838J7956K0536K3376K6148K8843L1806L5305L9199M3184
50748H89421M7176N1280N5486N9604O3568O7518P1462P4992P7526P8719P8432
$$ plain form
50737 1615184 1691542 1763542 1828712 1884968 1930861 1965436 1988209 1999436 2000187 1991863 1975683 1952784
50725 1952784 1924756 1893863 1862573 1832943 1806458 1784263 1767236 1755641 1748765 1745033 1742507 1739239
50713 1739239 1733344 1723114 1707341 1685419 1657041 1621930 1580118 1532325 1479755 1423491 1364349
50702 1364349 1303275 1241577 1180644 1121678 1065822 1014225 967698 926411 890068 858295 830749
50691 830749 807120 787291 771434 759759 752136 748018 746604 746944 748089 749410 750734 752066 753237
50678 753237 753967 754108 753551 752028 749267 745398 740937 736306 731507 726266 720316 713503 705829 697532 688974
50663 688974 680329 671348 661577 650845 639579 628643 618797 610255 602778 596166 590584 586361 583626
50650 583626 582238 581986 582751 584528 587379 591344 596375 602491 609978 619254 630472 643458 658219 675303
$$ packed form
50737A615184P6358P2000O5170N6256M5893L4575K2773J1227P51q324j6180k2899
50725A952784k8028l0893l1290k9630k6485k2195j7027j1595o876l732k526l268
50713A739239n895j0230j5773k1922k8378l5111m1812m7793n2570n6264n9142
50702A364349o1074o1698o0933n8966n5856n1597m6527m1287l6343l1773k7546
50691H30749k3629j9829j5857j1675p623m118j414L40J145J321J324J332J171
50678G53237P30J41n57j523k761l869m461m631m799n241n950o813p674q297q558
50663F88974q645q981r771j0732j1266j0936r846q542p477o612n582m223k735
50650E83626j388k52P65J777K851L965N031O116P487R276J1218J2986J4761J7084
$$ plain form
50636 675303 695471 719172 746475 777251 811154 847603 886136 926677 969124 1012740 1056332
50625 1056332 1099019 1140541 1180815 1219560 1256405 1290976 1322686 1350643 1373853 1391290 1401724
50614 1401724 1403867 1397075 1381936 1360099 1333648 1304635 1274873 1245839 1218725 1194592 1174343 1158420
50602 1158420 1146670 1138646 1133948 1132100 1132116 1132415 1131289 1127457 1120133 1108672 1092399 1070951 1044734
50589 1044734 1014794 982227 947912 912861 878453 846019 816309 789547 765854 745343 727993
50578 727993 713756 702759 695146 690822 689619 691610 696930 705387 716600 730440 746869 765337 784770
50565 784770 804286 823488 841960 858953 873844 886560 897281 906048 912957 918511 923396 927957
50553 927957 932082 935452 937762 938850 938862 938183 937104 935744 934406 933797 934619 937136 941371 947571 956174
$$ packed form
50636F75303K0168K3701K7303L0776L3903L6449L8533M0541M2447M3616M3592
50625A056332M2687M1522M0274L8745L6845L4571L1710K7957K3210J7437J0434
50614A401724K143o792j5139k1837k6451k9013k9762k9034k7114k4133k0249j5923
50602A158420j1750q024m698j848J6K99j126l832p324j1461j6273k1448k6217
50589A044734k9940l2567l4315l5051l4408l2434k9710k6762k3693k0511j7350
50578G27993j4237j0997p613m324j203J991N320Q457J1213J3840J6429J8468J9433
50565G84770J9516J9202J8472J6993J4891J2716J0721Q767O909N554M885M561
50553I27957M125L370K310J088J2o79j079j360j338o09Q22K517M235O200Q603
$$ plain form
50538 956174 967391 981083 997025 1015012 1034678 1055410 1076520 1097403 1117550 1136606 1154546
50527 1154546 1171824 1189330 1208213 1229702 1254763 1283338 1313192 1339374 1355519 1356864 1342797
$$ packed form
50538I56174J1217J3692J5942J7987J9666K0732K1110K0883K0147J9056J7940
50527A154546J7278J7506J8883K1489K5061K8575K9854K6182J6145J345j4067
$$ [...]
##END NTUPLES=NMR SPECTRUM
##END=
