##TITLE=AC1580_ROEFFECT0024_8271305_l7BeHsI5pb
##JCAMPDX= 6.0         $$ Bruker NMR JCAMP-DX V2.0
##DATA TYPE= NMR SPECTRUM
##DATA CLASS= NTUPLES
##ORIGIN= BRUKER
##OWNER= Administrator
$$ 1.72 TOPSPIN		Version 2.1
$$ 2013-10-18 23:19:30.277 -0700  Administrator@X
$$ Compression mode = diff/dup
##.OBSERVE FREQUENCY= 400.02188249412
##.OBSERVE NUCLEUS= ^1H
##.ACQUISITION MODE= SIMULTANEOUS (DQD)
##.ACQUISITION SCHEME= undefined
##.AVERAGES= 8
##.DIGITISER RES= 22
##SPECTROMETER/DATA SYSTEM= spect
##.PULSE SEQUENCE= zg30
##.SOLVENT NAME= COFFEE_meoh
##.SHIFT REFERENCE= INTERNAL, COFFEE_meoh, 1, 14.98509
##AUDIT TRAIL= $$ (NUMBER, WHEN, WHO, WHERE, PROCESS, VERSION, WHAT)
$$ ##TITLE= Audit trail, TOPSPIN		Version 2.1
$$ ##JCAMPDX= 5.01
$$ ##ORIGIN= Bruker BioSpin GmbH
$$ ##OWNER= Administrator
$$ $$ E:\/data/COFFEE/nmr/AC1580_ROEFFECT0024_8271305_l7BeHsI5pb/10/pdata/1/auditp.txt
$$ ##AUDIT TRAIL=  $$ (NUMBER, WHEN, WHO, WHERE, PROCESS, VERSION, WHAT)
(   1,<2013-10-18 23:19:23.339 -0700>,<Administrator>,<X>,<go>,<TOPSPIN 2.1>,
      <created by zg
	started at 2013-10-18 23:18:17.683 -0700,
	POWCHK enabled, PULCHK disabled,
       configuration hash MD5:
       C8 4E 4E 5D D3 5C D8 9E 9F 52 82 E0 59 8A DE 15
       data hash MD5: 64K
       06 78 86 5B DC 02 11 87 BF EF 53 9D 71 35 82 62>)
(   2,<2013-10-18 23:19:26.371 -0700>,<Administrator>,<X>,<proc1d>,<TOPSPIN 2.1>,
      <Start of raw data processing
       efp LB = 0 FT_mod = 6 PKNL = 1 PHC0 = 0 PHC1 = 0 SI = 32K 
       data hash MD5: 32K
       F5 D7 84 79 17 B8 64 B0 47 FE 65 08 73 E9 9E E3>)
(   3,<2013-10-18 23:19:26.730 -0700>,<Administrator>,<X>,<proc1d>,<TOPSPIN 2.1>,
      <pk PHC0 = 94.85046 PHC1 = 0 
       data hash MD5: 32K
       E4 92 8A C0 AF 4C 83 F4 16 F4 D1 2F 25 31 00 8D>)
(   4,<2013-10-18 23:19:26.871 -0700>,<Administrator>,<X>,<proc1d>,<TOPSPIN 2.1>,
      <abs ABSG = 1 
       data hash MD5: 32K
       33 F2 1B 3A D9 2D 6D 21 18 BC 03 2B 6D AC F2 B2>)
(   5,<2013-10-18 23:19:26.980 -0700>,<Administrator>,<X>,<proc1d>,<TOPSPIN 2.1>,
      <abs ABSG = 2 
       data hash MD5: 32K
       FC BC B0 F7 D6 E8 39 4D E0 80 17 25 21 92 AA 0F>)
(   6,<2013-10-18 23:19:27.027 -0700>,<Administrator>,<X>,<proc1d>,<TOPSPIN 2.1>,
      <abs ABSG = 3 
       data hash MD5: 32K
       27 5D 2F C1 B7 5D 85 4F D7 B6 C9 0D E2 EB EB 09>)
(   7,<2013-10-18 23:19:27.089 -0700>,<Administrator>,<X>,<proc1d>,<TOPSPIN 2.1>,
      <abs ABSG = 4 
       data hash MD5: 32K
       FC DB 2D 95 9A DC 7E 26 39 06 01 2E 20 6E 39 45>)
(   8,<2013-10-18 23:19:27.152 -0700>,<Administrator>,<X>,<proc1d>,<TOPSPIN 2.1>,
      <abs ABSG = 5 
       data hash MD5: 32K
       95 FB B4 93 ED 36 16 B2 76 A8 5F 1D 57 AA B7 FA>)
$$ ##END=
$$ 
$$ $$ hash MD5
$$ $$ C0 62 CF 4C 8C 22 56 50 2A EA 6C 77 EB E8 04 D4
##$RELAX= 
##$RELAX= 
##$RELAX= 
##$RELAX= 
##$RELAX= 
##$RELAX= 
##$RELAX= 
$$ Bruker specific parameters
$$ --------------------------
##$DU= <E:\>
##$EXPNO= 10
$$ [...]
150 150 150 150 150 150 150 150
##$TP07= 0
##$TPNAME0= <>
##$TPNAME1= <>
##$TPNAME2= <>
##$TPNAME3= <>
##$TPNAME4= <>
##$TPNAME5= <>
##$TPNAME6= <>
##$TPNAME7= <>
##$TPOAL= (0..7)
0.5 0.5 0.5 0.5 0.5 0.5 0.5 0.5
##$TPOFFS= (0..7)
0 0 0 0 0 0 0 0
##$TUNHIN= 0
##$TUNHOUT= 0
##$TUNXOUT= 0
##$USERA1= <user>
##$USERA2= <user>
##$USERA3= <user>
##$USERA4= <user>
##$USERA5= <user>
##$V9= 5
##$VALIST= <valist>
##$VCLIST= <CCCCCCCCCCCCCCC>
##$VD= 0
##$VDLIST= <DDDDDDDDDDDDDDD>
##$VPLIST= <PPPPPPPPPPPPPPP>
##$VTLIST= <TTTTTTTTTTTTTTT>
##$WBST= 1024
##$WBSW= 4
##$XGAIN= (0..3)
0 0 0 0
##$XL= 0
##$YL= 0
##$YMAX_a= 590164
##$YMIN_a= -502358
##$ZGOPTNS= <>
##$ZL1= 120
##$ZL2= 120
##$ZL3= 120
##$ZL4= 120
##$ABSF1= 14.98509
##$ABSF2= -5.573092
##$ABSG= 5
##$ABSL= 3
##$ALPHA= 0
##$AQORDER= 0
##$ASSFAC= 0
##$ASSFACI= 0
##$ASSFACX= 0
##$ASSWID= 0
##$AUNMP= <proc_prof1d_extract_pilot.lims>
##$AXLEFT= 0
##$AXNAME= <>
##$AXNUC= <1H>
##$AXRIGHT= 0
##$AXTYPE= 0
##$AXUNIT= <>
##$AZFE= 0.1
##$AZFW= 0.1
##$BCFW= 0
##$BC_mod= 0
##$BYTORDP= 0
##$COROFFS= 0
##$CY= 15
##$DATMOD= 1
##$DC= 0
##$DFILT= <>
##$DTYPP= 0
##$F1P= 0
##$F2P= 0
##$FCOR= 0.5
##$FTSIZE= 32768
##$FT_mod= 6
##$GAMMA= 0
##$GB= 0
##$INTBC= 1
##$INTSCL= 1
##$ISEN= 128
##$LB= 0
##$LEV0= 0
##$LPBIN= 0
##$MAXI= 10000
##$MC2= 0
##$MEAN= 0
##$ME_mod= 0
##$MI= 0
##$NCOEF= 0
##$NC_proc= -8
##$NLEV= 6
##$NOISF1= 0
##$NOISF2= 0
##$NSP= 0
##$NTH_PI= 0
##$NZP= 0
##$OFFSET= 14.98509
##$PC= 1
##$PHC0= 94.85046
##$PHC1= 0
##$PH_mod= 1
##$PKNL= yes
##$PPARMOD= 0
##$PPDIAG= 0
##$PPIPTYP= 0
##$PPMPNUM= 2147483647
##$PPRESOL= 1
##$PSCAL= 4
##$PSIGN= 0
##$PYNMP= <proc.py>
##$REVERSE= no
##$SF= 400.02
##$SI= 32768
##$SIGF1= 0
##$SIGF2= 0
##$SINO= 400
##$SIOLD= 32768
##$SPECTYP= <>
##$SREGLST= <1H.CDCl3>
##$SSB= 0
##$STSI= 32768
##$STSR= 0
##$SW_p= 8223.68421052631
##$SYMM= 0
##$S_DEV= 0
##$TDeff= 65536
##$TDoff= 0
##$TI= <>
##$TILT= no
##$TM1= 0
##$TM2= 0
##$TOPLEV= 0
##$USERP1= <user>
##$USERP2= <user>
##$USERP3= <user>
##$USERP4= <user>
##$USERP5= <user>
##$WDW= 1
##$XDIM= 32768
##$YMAX_p= 465193147
##$YMIN_p= -695706
##$CURPLOT= <Network HP LaserJet P1505>
##$CURPRIN= <$Network HP LaserJet P1505>
##$DFORMAT= <normdp>
##$LAYOUT= <+/1D_H.xwp>
##$LFORMAT= <normlp>
##$PFORMAT= <normpl>
##$SURQMSG= 1
$$ End of Bruker specific parameters
$$ ---------------------------------
##NTUPLES= NMR SPECTRUM
##VAR_NAME=  FREQUENCY,     SPECTRUM/REAL,   SPECTRUM/IMAG
##SYMBOL=    X,             R,               I
##VAR_TYPE=  INDEPENDENT,   DEPENDENT,       DEPENDENT
##VAR_FORM=  AFFN,          ASDF,            ASDF
##VAR_DIM=   32768,         32768,           32768
##UNITS=     HZ,            ARBITRARY UNITS, ARBITRARY UNITS
##FACTOR=    0.250966925370066, 1,           1
##FIRST=     8223.43324360094, -156093,      142252
##LAST=      0,             45228,           -381779
##MIN=       0,             -695706,         0
##MAX=       8223.43324360094, 465193147,    0
$$ Real data points
##PAGE= N=1
##DATA TABLE= (X++(R..R)), XYDATA
$$ [...]
23893 335174 256419 197837 -119411 -196478 -305060 -87459 236449 9193 46617 -350228 -332111
23882 -332111 46494 20053 261967 -13841 138208 245190 -5544 35469 280860 7227 -351009
23870 -385649 -94146 38961 -2612 -54258 90063 -118203 181578 51384 96308 90498 -281155
23858 -247007 260609 106152 128098 43225 235164 39773 -80236 -20542 -163577 -78813 -27018
23846 -96412 95890 150386 -96608 144552 -52351 -27241 651784 -200720 -128087 3285 17200
23835 17200 17702 -127021 -104530 -318961 136116 -140771 37845 -439837 -148261 -41382 187319
23823 -34412 -22434 112684 57572 16755 -200965 237381 192408 9115 110922 -199966 98346
23811 53310 -184022 154928 -87395 18038 -120657 -124040 134091 -62235 177351 88764 244086
23800 244086 -327100 106850 69731 23911 -7992 -198430 44282 117984 -257729 -233497 -125959
23789 -125959 86187 -11206 98168 -4917 76155 -101289 161248 -108845 -79599 158319 -180073
23777 -344190 -261089 -88837 87487 -145826 105061 -81592 -478346 -471340 341594 118044 56671
23765 -315722 300486 -134014 -98780 20461 -57407 -47928 -22751 -75447 121656 -37971 149810
23753 -236828 153126 164628 52822 -176819 -65431 253492 283110 -194543 9412 397726 195391
23741 -239156 242372 -178153 -66144 81082 -127737 59580 -141226 -155854 -82879 64518 113087
23730 113087 -60979 -77063 -73399 -274104 -139473 66627 204819 -322620 306192 -129554
23719 -114831 -102810 -187213 -214456 20142 163232 -34928 -165461 -246409 -42593 199509 -7559
23707 157290 221572 163843 125686 77419 55393 106832 -237873 -310391 146691 -138830 -26300
23695 254235 83435 42892 -246339 35076 -343055 -211084 159951 -274829 6721 108064
23685 108064 -209570 -162214 -19539 28678 7449 -94689 -418801 -57616 -115708 -144519 83852
23673 -71072 -187557 -38579 -211029 -74583 -175548 -224902 -479805 -220565 -230463 -211254 195801
23661 192461 -188087 -179269 374099 138039 -30183 -145705 -419550 104644 286716 -250343
23650 266899 -122643 198219 11903 294647 23988 -16842 -66572 -507 -90689 260900 -29016
23638 236311 -104713 -83157 29335 308979 -166079 124293 387876 -57259 -29467 -171235
23628 -171235 -30253 -176953 205442 -14962 -249075 -12155 132146 262092 -104800 -114188
23618 -114188 -19945 122274 107087 -354632 165166 -41799 -10602 64001 201107 -243394
23607 41466 -224442 -199423 -21074 -440614 59006 -36712 -180769 8922 -185174 -73842 96371
23595 133327 -203695 86549 -78261 27845 101972 89222 118109 -130911 41961 31289 260858
23584 260858 142199 -12286 -160256 61977 162854 -180867 130976 191654 78800 91138
23574 91138 39831 -144464 -210997 109853 -145867 229133 -28905 -190831 222711 390364
23564 390364 208996 -135777 -97682 -178511 -42421 148077 147207 70756 -236202 -258157 192905
23552 -411328 -250042 5017 284729 135998 180884 95034 -7286 -6446 -143255 53801 17509
23540 -163724 -63647 184999 88587 8507 170641 159604 5882 -49616 -31026 -283307 -25338
23528 38965 113337 195991 -131030 -51477 -2355 -5806 -82345 -210057 74376 185569 -38639
23516 -27242 -131731 -228028 -255867 175521 -150594 80255 77037 81949 -141753 295757 -32014
23504 218495 -295274 164107 124900 -297356 10212 174983 -161028 148492 2591 -432045
23493 -59140 7617 150225 -118585 -283810 -55314 -104243 -186165 -41752 56057 339585 -112355
23481 -122488 86040 -68938 417196 40407 -211867 -257195 -322965 48815 -196149 -333705 -191247
23470 -191247 -243848 -211049 120603 142331 428374 33357 -176432 -8264 56354 -320505 63419
23458 -61724 -36417 178590 -248827 -299779 115245 -82307 -27544 -165991 -179420 166508 37208
23446 -104161 267783 104349 301349 -41004 -21699 -118493 -240359 -223871 -322720 205194
23435 273459 -266848 4964 288226 -196583 5588 108366 335922 -115254 12977 64129 -107895
23423 345496 -322733 -116805 36123 -361513 289845 31115 -54614 -198190 -134006 -228545
23413 -228545 -73214 185140 -50275 -241701 66671 184214 -380441 131542 -230687 15112
23402 61952 -196379 -304356 31166 166165 -113769 28043 76496 -186664 -240461 97136 -125721
23390 14043 -236810 -166620 -116943 -130058 -608947 -245686 -331168 49749 -64441 -206784 30361
23378 419656 94688 248242 91240 134554 -471160 -197435 -68604 347479 -190766 -259539
23368 -259539 -180462 214796 13182 188183 -229042 255416 -63248 209933 -9064 -243321
23358 -243321 -150089 94965 73767 8902 137649 -161623 46301 -129576 305794 198652 -136076
23346 14401 -308006 -25416 44869 -31932 75479 164791 45810 -402912 136094 86518 -130791
23334 39724 -173561 144983 249256 6673 104348 -153230 -141134 -16569 161243 -224278 -194688
23323 -194688 172322 394876 -67775 -24564 -45947 272939 -190957 2145 87062 55505 -96308
23311 222498 -17376 78570 113833 -174399 -94085 257599 248495 -10844 26931 67033 -311360
23299 185017 -139328 -233399 -52590 48593 171695 -143764 363171 15338 -4967 -228014 373114
23287 -22529 151747 183214 -144626 253389 -103251 -76167 -7522 -392403 113773 181855 -179519
23275 41665 -361267 233906 -187456 315186 -384469 91680 354052 108347 -224711 -60675
23264 -200233 350026 52187 -205412 122150 -267260 36698 195934 -306719 -236934 240696
23253 36199 -125190 113221 -166748 -154477 306276 -195639 630908 -53489 -286021 212464
23242 -105025 121628 -3663 -30855 -104490 -116434 -54741 104794 -140679 -10350 46461 6136
23230 -105583 108633 247795 24268 -43778 148498 56784 -48505 256185 332105 101812
23219 -104141 76240 81311 221069 31450 -107422 -42283 -2606 106871 18411 224331 -278724
23207 -148719 -187892 -243327 -267728 66743 238508 -338616 -240708 -134436 349393 -253635
23196 -59392 47173 -18069 -24784 -29380 -251258 20908 181787 -1759 95780 -284415 467820
23184 -236597 613 68686 -178532 63313 -166055 -54225 -152256 -111970 -28295 132657 -168998
23172 101308 -242069 392030 -119216 185208 -137557 -55330 -112042 100609 -130255 -350860
23162 -350860 160688 68902 -204235 -123908 57833 -174745 57539 -196004 -3161 58641 -233130
23150 -57299 -42127 247764 321835 -176024 -8954 -129432 -330461 -15312 -206029 262527 89707
23138 -97211 -52885 110946 -119260 -35400 14922 30823 179704 -205090 -232987 82878 9374
23126 -57770 -293698 -249176 -8915 -143128 -144621 54632 159629 282965 41622 198074 33991
23114 16809 -322221 -65563 64549 -4004 86384 -165909 -95257 141354 -128964 -193032 37062
23102 -90240 18813 -127356 276892 -60029 170882 -68250 41119 -183453 58966 127290 560
23090 -20088 -157114 -263661 -108021 159391 4100 -147175 -304576 -122345 45257 -218839
23079 -208126 -118251 -286493 -42922 -281075 -109637 -6324 278262 146246 12999 107139 -145970
23067 -210293 -285313 -240127 328482 -137397 -22833 89463 -14444 -269123 -124650 -180394 -67633
23055 151811 -14750 513850 257279 -49095 209504 18129 98719 22288 61508 174379 294012
23044 294012 2363 -75589 230221 73930 -27329 190891 -61522 -211378 -124074 115663 219436
23033 219436 -23885 15398 205044 17791 214485 -69196 -5596 -103267 10277 209424 -113906
23021 -91766 -150957 146712 -173566 -269431 156284 104309 -283309 201160 64448 -160388
23010 111873 68 -92940 129129 -229573 -29799 -47990 -285809 -231900 -135204 59342 144101
22999 144101 5131 -16244 -28830 -73436 -160008 73755 32746 -142455 -111044 -4904 -57621 102339
22986 -347744 207478 55107 -21470 -115466 -131756 -603852 78122 -109599 -16346 -46194 -57999
22975 -57999 -36366 232476 145648 -166321 45503 -176406 136662 -13885 240646 81240 111540
22964 111540 148951 -30317 13501 115616 82979 915 -29026 -172912 232721 30928 -545980
22952 -244126 -116224 -11696 -121202 66134 -37078 -23693 433656 298158 -327508 -336164 -117615
22940 58004 -170891 78882 -148973 -41924 63683 -172204 -75934 -42124 -86062 68544 -190606
22928 -16096 -77535 -124130 54860 -137266 -18414 -222929 305807 -297266 150365 58238 -77768
22916 -139012 71599 -66758 131592 85446 -47345 -90473 28832 -46542 -119251 120299 381442
22905 381442 92556 -17789 10127 -91025 -197464 -64219 46996 -123699 -67584 -154309 93165
22893 -20717 81758 -221099 90673 31164 123099 106371 -76642 124146 -254246 -29367 -63202
22882 -63202 -77989 -96448 174895 -346562 -289091 244030 -229602 -34653 259342 158505
22872 158505 282608 -457444 245408 77831 -206788 -68048 55410 -57924 -120500 157855
22861 -340458 -148457 -248728 99720 -108744 103823 -269146 95404 31438 77024 -30084
22850 -242143 -271799 153265 292722 -204937 13865 166514 -74751 -27562 288225 131423
22839 -271679 22935 69083 189601 138324 -114805 -46923 -59834 71133 12978 -84535 -97749
22828 -97749 20729 461586 -183881 11854 -28212 -101940 80036 11709 226524 -55245 -275963
22817 -275963 -457963 -167715 -243457 -238680 66241 -194960 26143 55487 -27267 -379157 309681
22805 4822 116756 -180429 103013 70908 -193332 -267681 140180 -142966 96718 -163603
22794 235097 -316265 -80712 26207 -49451 337641 30103 17757 -74724 -25972 168456 -168663
22782 -23632 -19836 -119077 70263 70571 -187767 -105461 135998 74851 76282 -272242 136496 -56160
22769 273468 -179938 84643 -15813 -209545 -38733 -337222 -261369 -7634 -45444 3502 -189084
22757 136756 -167215 70765 -250928 126791 31062 -394819 -158642 462208 201069 201736
22747 201736 -515434 -187866 -89404 -51738 234589 -159805 -188340 -252485 139851 -246488
22736 -38670 -125705 -265067 -89903 434126 -293019 -46963 160340 31001 -145500 165335
22725 108794 -146425 -52356 141533 -235998 -16873 38516 -1617 -57550 -211080 -235536 -149229
22714 -149229 125315 4774 -116465 -446514 125349 6315 61759 134058 -182303 -141487 -12813
22702 -234774 -50455 -15134 96483 34176 -198423 -143305 -165966 -197689 154461 82812 272559
22691 272559 184919 51834 -28510 147747 -94574 60450 6045 137109 -99796 18607 -53897
22679 37546 -64116 -331420 -485729 -379433 46204 102540 -243090 13728 120060 30100 -127364
22667 391864 64696 180335 95979 -26905 399923 -59342 90850 -80289 -245450 -272084 -380812
22656 -380812 -238148 21650 -60465 -36183 -45295 -141243 144273 -283455 242986 -57440 154703
22644 -128770 33114 80107 205642 27978 161950 218540 -323548 -304113 -113737 -216797
22634 -216797 -104645 17586 4437 -176813 11303 336754 129040 32144 -176787 123700
22623 44777 -89122 199193 -27581 -248050 -456041 -69758 -22500 -55981 -55186 206600 21082
22611 73947 129734 64278 -126999 -323811 7931 -18203 -83651 -113589 208240 -298148 -85658
22599 146456 116534 122161 -78170 -140056 -147292 -325819 -218121 11358 -119085 125626 89499
22588 89499 70838 -84460 55031 336953 -76976 -28027 -32701 -197324 -101334 -252858 179140
22576 -212146 -5038 -103668 -286197 -189880 26246 -99015 139932 109876 360181 -251322 34426
22564 48829 150943 62479 26950 -214575 -87776 34843 201936 14261 29107 -285240 103396
22552 140835 104397 246876 110145 149306 107937 -204452 -87725 146499 102923 156338 -231454
22540 -845 -112 269947 -75092 183861 37894 -304903 29159 -182030 58811 74629 -11326 111809
22527 -49691 1376 -456462 -75219 -444556 -116257 1381 -36911 92685 326627 -62789 181313
22515 -45468 -146150 -426063 -10894 -68038 -22129 -332379 -459135 -11571 -13038 -19573 14917
22503 -215460 -179535 14433 84344 -339217 129563 214803 -220855 -107720 74780 -240856
22492 -237496 -338918 -204976 -73075 -133183 -256744 -10738 -143959 170736 -139056 -79504
22482 -79504 -206560 15977 98745 172019 41538 225541 -19699 133744 -268757 150855 405405
22471 405405 -150058 -431223 -183893 -99227 -89331 6963 -9800 -371939 71972 459453 97354
22459 -178296 141129 194408 -176314 69781 122895 101925 -81364 223570 -41413 -192287 86550
22447 135276 98275 8196 59491 -201206 -147025 197918 108999 170919 -54604 -127322 -131234
22436 -131234 252025 -16090 85615 -238278 -112819 -129504 -147285 -141044 -271567 12977 47968
22425 47968 -170518 -35747 47111 -110320 94427 62764 210249 155912 -125221 -83974 -240897
22414 -240897 44170 -25672 206191 -83038 -142449 77568 5573 -90276 -417541 252357 134033
22403 134033 43152 -52933 -56721 -56433 -145764 -258553 -312485 -93037 184917 100445 -40353 -143537
22391 -143537 216870 159864 112656 -185325 44598 77938 -17659 -62027 -153987 131092 -39173
22379 34020 -191274 -351378 -24461 167712 -47049 3505 6692 426382 -245492 130500 -134229
22367 -144902 -123813 -119344 9319 -177281 -172053 49452 -224139 -393086 47531 112043 -474879
22355 30806 -215729 69264 -66982 -204889 20729 61525 23948 114577 238172 -122169 -43309
22343 -234602 -237662 -141508 119194 94629 70270 350251 -294618 -63079 132668 -78462 16944
22331 23974 -71875 -106333 -74892 -44653 78248 -496658 -42703 -90053 -361575 -99851 201918
22319 -382610 -203085 104777 -60710 -57806 -152596 -29290 -75690 70821 -325834 -245222 -267626
22308 -267626 297780 -184058 14746 -233655 124074 165756 -68690 122560 1383 12415 -182778
22296 -252377 281767 118623 -49956 -156355 103442 -161102 -70705 -398172 173093 -96254
22285 -3605 117163 -63959 -194620 -49630 -76136 -46936 270699 83680 -113747 -48699 13747
22273 99947 -456810 124264 -236298 87161 -160676 185302 -121774 -27367 -278623 34250
22262 -59561 180153 -40729 -180265 -47627 -105152 -26450 -292322 -144805 -131773 71270 -6175
22250 -97212 -294422 67112 -239491 -40654 -236662 117179 230978 -56701 201069 1970 102276
22239 102276 -32659 -279569 -248570 -27839 -406206 163079 161086 132457 258709 -207839 -101328
22227 -58829 145281 93727 -300391 -152893 36134 -176428 20278 -37510 -148714 -91411 -114954
22216 -114954 -147826 -363386 -60871 -66269 30275 137112 45426 -144570 368737 -294836 54885
22204 -167182 99291 24332 -20013 -14832 141153 -291440 -275910 -38205 -369470 -181220 438866
22192 272413 -41910 -120495 -229142 -194843 132013 227330 201245 -289407 85504 -27067 -295394
22181 -295394 -92031 112159 -89663 -339261 244423 -357554 -408099 -100473 -88793 319032
22170 219271 101551 -17648 -12898 -77401 -91556 16270 182656 60007 51347 114191 -427634
22158 -229544 -90961 -41833 -36006 226325 -184010 32862 -242545 90735 -217096 -66640 -157276
22147 -157276 -241709 -115012 83141 102711 144952 49077 -145412 -1403 -141030 -206584 186229
22135 78597 254441 58308 -5781 141191 -128830 -3312 -413707 107971 280494 42674 -233792
22123 216229 187246 -155948 258709 -50922 166993 -190020 10546 -86288 28872 -317964
22112 15350 -273635 -68608 -108268 115668 -202295 -29533 -20344 -156004 -209769 -61484 -15353
22100 -70822 2726 -44564 -84089 255292 -199772 212100 179949 -38237 155508 -264675 86281
22088 -7074 -180929 -117077 -31612 102765 -32611 63029 -327202 -66255 33998 -201054 209043
22076 -348358 -1747 -343817 -193801 -206783 59866 55558 -63025 84735 -164090 -171011 -231926
22065 -231926 21299 66531 81519 -168959 -372954 -186313 695 8327 -92569 61454 -83360
22053 -251432 86572 98312 -90127 3026 -60639 60504 148239 23600 -183202 -62365 -90683
22042 -90683 -98638 -75989 6595 309282 -17020 -34557 58617 408124 -234553 117112 219701
22031 219701 -59172 -133198 110731 739 397411 -46627 -98122 65431 -90748 -71738 199068
22019 -81930 -219003 6888 -182930 47566 -115655 -116927 -109894 12896 -125193 -59529 154486
22007 -104970 169900 23292 -55002 37421 442577 -129819 -235520 243497 -203035 -190628
21997 -190628 149901 -197992 -109763 25199 146859 -19670 -38967 58226 -314205 -24243 -123894
21986 -123894 61062 -254976 -18669 -372278 -183852 394490 2974 -3853 -1040 -66848 -14116
21974 -216236 61772 -283153 -66632 -52060 50384 9863 127201 -245687 -160918 -171922 -142084
21963 -142084 22556 -51589 -28648 136303 -77826 179277 240373 -147231 227995 17772 -339217
21951 39814 718 -219458 -282920 157168 -112356 -85331 55353 -56403 -125335 8196 260007
21940 260007 -107432 -76231 62422 -175224 -297414 -193230 -257130 -177134 -91096 -235775
21930 -235775 129029 -212974 -61448 103951 112474 102587 -446304 142550 142641 -147062 -87082
21919 -87082 -81229 -314881 223167 -298324 -117605 34660 -10564 -201103 -99585 -171637 172071
21907 126372 275072 295672 28774 -52422 -139265 214281 -136489 5770 -64114 173464 -279048
21895 122465 -329023 139689 -56935 388627 52382 35044 344676 -255284 -163822 110071
21884 -186968 -39818 -11347 7279 -1249 170786 -86545 188192 -162216 -241621 98779 45071
21872 -248873 -111146 -86580 162731 108180 17702 57261 -396115 -159263 12059 93735 -191876
21860 -37270 12334 -78510 147362 -125719 -117406 -168673 43722 -17508 -63345 -104803 132600
21848 28582 -166434 -281865 -185416 -102524 -257382 -119241 258515 -102980 14126 -40986
21837 11855 141532 -110616 -29254 144659 253568 -226118 -129213 -81364 -835 -115027 -47340
21825 51611 -43279 -174526 -277913 88012 -466383 210 93956 124976 -352050 -282850 -182726
21814 -182726 -168383 9578 -89287 -360359 112159 -169186 -162766 53130 -374111 292331 -11464
21802 -175110 -92361 81519 103069 11215 358058 -63727 156687 -25331 -51106 -49880 19877
21790 100172 131414 -185749 -127176 -238598 218654 -235250 -81128 7031 196945 -148841
21779 245285 -55329 172745 -331162 24430 9468 -424851 206728 6230 20818 -196987 -23340
21767 -64398 -213825 -106688 4380 34604 -162755 90936 126586 322090 127708 68174 67685
21756 67685 -2035 -56114 241425 -79153 168866 -239326 -75502 9498 -266504 -30615 -195916
21745 -195916 147978 95515 -89571 -181706 -129220 -4754 327015 60809 138181 -209667 189247
21733 -248392 -154411 -201548 150921 -40859 -74460 152509 -23340 120487 313546 -78090 -48599
21722 -48599 -186165 -141747 251826 -328690 136165 -28180 -215269 -222612 -136306 372233 122417
21710 114751 6548 38812 41122 -23825 -84716 130179 17763 -216020 195392 -216600 -13091
21698 -132636 -90365 -17921 51447 -37071 -230748 -102821 -177170 -235526 -92144 -32931 110883
21686 15027 -106737 -52976 -511065 -27123 -189339 220938 -115152 -429858 -156678 -188483
21676 -188483 -248594 227929 -145264 -102637 -120805 65188 -291511 109025 -575137 272703
21665 -12163 -29590 -238337 237880 19014 -256955 -17288 -77480 76708 53869 -328189 93427
21653 72774 75264 -252995 13204 272914 -324007 65646 -194522 159362 -12807 13111 -64357
21641 -119554 -308048 133933 101679 191703 93942 -1978 -227675 114534 -121183 -10041 -424494
21630 -424494 146716 -289642 204155 -90409 -227055 -16596 -57281 112940 -165370 230345
21619 169667 -128532 -120174 295583 397541 -17558 -173729 92771 -94226 101113 268289
21609 268289 -75691 -252078 -97112 -246794 127633 57521 -180966 -264753 106812 17146
21598 -103218 20197 87834 -285020 -171485 21442 -102502 -87866 33373 -141509 -86270 -47652
21587 -47652 44126 -43414 -92813 -126554 273166 -55581 269433 -49479 166731 -224517 -75828
21575 -26573 -393024 38981 118091 78844 15375 67233 76513 -132413 -64719 -113816 86617
21563 -108492 197081 60976 -149469 45046 -172783 -440508 -40869 -87513 156428 -123741
21552 116227 -120968 95334 45970 -263978 -130351 -62805 -131437 27812 -127989 34332 -133140
21540 -219053 -168976 -306558 -258609 -291697 25313 -262581 46541 -178967 9085 -188079 111305
21528 94027 14251 -201353 32188 186087 -56945 -25904 -154086 -202766 -86991 -141659 -105822
21517 -105822 -114939 -1125 274939 -154170 -158919 -159202 99985 -36832 -200405 -19612 -83574 138836
21504 16864 -28582 -1519 5460 -85122 103434 -328229 23058 -443558 -48313 107704 61093
21493 61093 -78957 -78097 159359 -208211 -54667 -40162 125214 313598 -7082 320358 30082
21481 182576 -285794 -187914 -4550 44541 -2698 -272873 120930 170673 119414 -41488 273602
21469 -107236 -129864 303607 31134 37233 140940 267584 189986 -205634 -468472 -238144
21459 -238144 -136888 -99505 -48538 128016 -271723 157611 -8979 -101080 25073 103377 -206251
21447 -132026 -177893 36838 -45999 24160 13532 -117597 134863 52832 636025 168763 442440
21436 442440 380057 142953 422002 229587 27351 136502 -21877 -130059 -181264 -251471
21426 -251471 -274658 52689 47466 -84822 -135988 137301 -157739 35023 -327195 162191 148973
21415 148973 -141577 -436601 -153865 118013 111632 237325 -20041 -390191 -265917 -139361
21405 -139361 9931 -248601 -180994 -121645 103800 -155598 350658 156640 -167815 120296
21394 -212244 -402521 5959 -38367 36984 96589 -24845 101149 83017 -62762 -214423 -219038
21383 -219038 -58738 -21374 -60810 82063 -12443 -268540 -141373 151150 163311 -480955 -65913
21371 -58978 -287829 64649 -249365 -3751 -304934 -29692 40432 24838 -61631 -17325 197563
21359 -103235 -45532 152935 30050 -163591 -177296 62412 -8231 -118244 -376305 -74168 150018
21347 -272954 2421 58917 -126962 -205307 -214532 -79567 100492 122758 -218056 -122894 -95649
21336 -95649 -13808 48681 55057 -284602 22943 -376739 -24663 8650 -30108 168929 92977
21325 92977 108158 102764 97941 -118017 -67716 252549 -66755 -150853 -220754 -312949 -158126
21314 -158126 91048 -320162 1527 48731 -213526 37902 101592 -223055 313175 -162351 158603
21302 -181259 -166301 -309569 134418 45549 71562 -51604 67787 -3558 95868 -113176 -40467
21290 -65083 68014 -294820 17875 -127643 38705 -86423 -27348 97203 11308 251041 -51962
21278 24943 -58702 197854 190020 -19181 -439207 -171883 -250024 -10840 -100083 42152 -157247
21266 50527 -152142 -72923 -28029 71248 116268 42646 58972 -236848 -162066 -166358 -62137
21254 244716 -206368 -347528 -188179 -225770 -143523 137550 275255 -229899 -5137 145835
21243 52821 -112848 -187545 -36987 253322 -110011 -7209 -199685 95856 142228 -89401 -87411
21232 -87411 -29971 -144590 -117083 -316165 75458 -292618 -388499 -36237 235085 154344 -89029
21220 -49707 143818 -2444 -47671 45467 -231837 108025 -228640 -284984 -62126 -222963 81154
21208 27476 -125109 143270 81984 93501 -333384 131975 10959 14826 -209609 240062 113910
21196 -56113 81329 -173597 -243250 129726 -220888 -327175 -46980 -311712 282748 -104545
21185 20677 -282679 -237623 -80190 119959 118867 130836 -491648 124885 -1133 -96895 222231
21173 -75096 -112369 34677 15020 353636 220 -259934 -82785 6067 -53950 169299 191426 -206480
21160 264659 243089 -117813 -59074 123586 19138 -318922 76879 -131341 -152321 216506
21149 -385965 2678 9758 127956 -211692 -230543 -144844 -151055 -235962 -101671 -695706 -116209
21137 140224 369138 -133547 -201913 -177469 -145622 50960 -184644 -191372 261536 16918 165716
21126 165716 -146438 -146138 -337250 178939 -133114 -114246 111304 -159284 -37811 -205775
21116 -205775 231408 -9790 -29235 -165856 -67646 197720 177892 -149969 -14757 43517 -272084
21104 -509519 -145327 -247956 18767 -8443 1829 244446 110848 -192521 210789 -24342 -134685
21093 -134685 -198623 -206881 4171 -96956 -12019 -107443 -79648 164952 -149620 -149414 -147583 425645
21080 -260275 -206753 215698 -180538 -81926 384889 271375 -12245 23962 113665 163216 81919
21069 81919 -317351 50020 -113920 -20591 -199132 -110131 -35160 -105480 -114795 -279093 -140079
21058 -140079 -233812 41618 -119432 93187 -312162 211963 -27210 -270131 84380 -40399 246262
21046 111966 -152519 10020 -323471 367741 -234434 12781 -140035 128071 157412 -489507
21035 -229703 -201385 -94336 -354674 123694 -463 -26240 -243322 -289880 -109393 -216332 -29289
21023 -94359 401784 -276306 -502552 -62324 -433333 -259108 -74176 298303 174816 -38681
21012 -267512 -364402 186867 125644 -114478 210390 34554 -221417 -115131 249202 -141487
21001 -291440 137571 77819 -202274 101277 -71434 -169909 -296480 -389519 -68299 88966 -98563
20989 -75771 -257980 -359781 218514 -400395 72601 30739 236975 -102955 177147 79335
20978 287262 328852 -83815 -88102 -201617 -109729 -84774 -106540 52023 -106858 -327864 -198403
20967 -198403 -91828 50332 -70822 188716 -395863 -149587 208170 -99398 -122984 155159
20956 -214745 12239 90998 163474 -327563 -64548 -301007 150242 -13345 268726 -80572 -291305
20945 -291305 105948 -17983 -7732 391095 93613 15330 295588 55224 168399 -19267 -337544
20934 -337544 -19984 -50596 97833 37444 -32140 -164037 -27068 -137099 64903 170650 81389
20922 -194717 -95045 -27051 -121729 214718 2540 -8629 -116913 117196 207066 -186527 -431149
20911 -431149 305107 158279 -108196 -227727 -356857 501159 155395 -311023 -49920 135705
20900 221139 -339368 -162602 71944 37968 -342358 -252249 -56639 -291160 24683 -99883 -357328
20889 -357328 110216 92161 -100834 62955 58941 227705 -96194 253983 36996 20568 91740
20878 91740 102441 317529 -129840 -130253 -200317 128131 -524720 -295678 -174950 114068 -336906
20866 -193451 12368 214804 97526 -70534 15738 -346595 -129354 -238144 246861 -57548
20855 -165757 -3659 -193242 -182956 228665 64104 -71531 2731 30037 -252630 -255296 305502
20843 15921 -7635 16989 -150190 -29715 43951 -13540 -245378 -69851 -85671 67199 -30406
20831 61833 -29528 -89262 -79916 -15622 28056 175102 -57247 -325814 -340485 -21623 113248
20819 57399 -81875 -77003 -75648 108804 53806 49475 -132531 232398 124259 86345 -189821
20807 -115351 -256572 -115707 -125253 94382 -116033 113586 363925 -181509 80804 227931
20797 227931 40106 -172152 -147896 -191911 -130703 -131784 39366 -51207 23926 -222361 -49995
20785 53636 -9598 -54940 -169269 -168662 -348098 193696 179806 -65143 -220368 -184853 -76011
20773 94580 125406 33022 -268811 -156029 234330 -149951 159089 166785 96894 143978 360702
20762 360702 -180713 231733 -310750 -58548 170104 -5437 56041 -122088 44848 87108 343669
20751 343669 -262660 -13592 -224785 158665 30407 -28394 274622 -306534 -87461 57914
20740 -71919 19690 63500 -259862 20055 -130321 72889 -34681 -267457 -11178 82628 -194638
20728 -114592 154054 -317756 79782 -256575 -1347 -243114 30852 -104433 -41362 2440 -77267
20716 -330450 -59673 256792 -126527 -115656 -212314 60518 745 -393382 -32656 -107197 -6556
20704 14787 -124839 -178189 138020 -81163 -278135 -233264 -441908 102396 28027 -276381
20693 -89725 -57275 146211 -321715 153068 -18713 -78111 -93424 -141104 -92552 -65485 23217
20681 -76093 -40071 186089 -319342 -231478 87846 -74710 -184429 18437 -138526 -218472 40035
20669 253707 -251857 258130 101939 -105582 363233 -157468 -136072 -158831 -227280 -173648
20659 -173648 115317 -255574 106668 26703 -329814 58946 -70925 -151780 -121152 -141929 -203339
20648 -203339 137622 -19554 -235508 -203143 144913 54692 21355 -207169 -48541 103748
20637 -292848 204406 -203486 46845 -89749 -69956 -35377 -107791 -289050 215323 -27985 137390
20625 87231 40697 406160 -25319 200873 -17345 35957 119537 -456587 169540 60773 278113
20614 278113 121798 143856 -68123 163316 -131586 -137628 -180537 -108473 -210041 74250 -467740
20602 198007 -141984 -401261 -9752 41362 -18603 4655 -607406 192773 48266 -189804 32160
20590 -209596 -99844 -182303 -129549 76620 122768 345367 -243837 227449 226187 19428 80213
20579 80213 103968 344437 45257 -67850 381028 -114265 -137342 -98428 -420977 172 69785
20568 69785 60951 151035 -333763 -312055 -165958 -221180 -106253 -37735 273888 -154976 1017
20556 3978 -1411 -252315 -94699 96892 141293 45398 -175044 182799 -261440 -22428 146193
20544 100536 -20135 -85955 -287741 79173 217211 170532 -67547 71488 -161888 -97323 -52780
20533 -52780 -204729 -120265 172161 298455 -215345 -93653 67470 -39986 -188387 -128233 -266754
20522 -266754 -229125 193895 -441556 -23302 -241844 -450845 78779 192612 -122263 -207857
20512 -207857 233307 -87844 -47271 113114 -126047 -15992 205818 -92955 65139 90856 -260025
20500 65469 142079 64637 -194359 -185559 -45536 -779 -172040 28273 7127 -91698 -280002 57889
20487 -108355 123781 -280261 152769 -167903 160452 84305 71996 89370 -241168 -225603
20477 -225603 -240830 -106009 -78015 -155854 -98215 -160733 -253802 19018 -106886 -126335 501227
20465 -131575 -69563 -82564 303188 -138897 213698 265113 -98982 183671 80797 8081 33872
20454 33872 -107746 65155 -17611 -68014 -30808 -158422 -4053 -101685 -178266 -125466 -9936 -31612
20442 -31612 -15221 33842 -86421 -72631 -43069 129483 27056 20779 -409966 -52550 86640
20430 69933 -440432 -84234 -319209 -33934 -126934 -215763 -21089 -140468 -229408 88057 77092
20419 77092 -221851 -67799 -287734 74580 -182847 -69370 21727 -151195 178737 15112 -129895
20407 239437 -189753 111803 216028 -363563 55081 -385591 -188470 -39373 -252915 -272371
20397 -272371 -290572 83373 71523 49385 -234822 -225630 -265943 181549 -280908 -32950 21364
20385 -18860 -151221 -344415 -177388 -89602 198500 -162516 -316446 -64483 137358 -194528
20374 -329661 -50741 86641 41016 135545 90979 -155725 -257547 -173662 124476 -143417 68116
20362 -181811 -8083 -465749 198364 -149024 -176998 -421785 -231170 -42573 -505539 -62539
20351 21892 -80629 209046 -37995 788 159385 192294 -167876 148565 -89249 -172060 -160945
20340 -160945 -315316 -234426 225908 -48572 -427526 -74022 75548 123787 -124151 -37263 -65479
20329 -65479 -88885 -92724 71879 -189603 -231524 -27754 70804 43609 332493 -2141 -3923 -50443
20317 -50443 -342623 -303780 -170760 179333 102038 111465 176055 -43388 276839 -117804 377319
20305 25414 -227225 -299471 313504 -4289 -66188 99734 227479 190232 -88622 -12255 -72899
20294 -72899 247831 55883 2688 -99844 31197 -274973 -318657 -86113 -138917 164973 200460
20283 200460 -400622 17271 -247163 -251840 -24605 -266971 114752 -266564 36528 -163047
20272 141589 18819 86656 -237677 112992 344643 -234976 -196231 322090 205568 185013
20262 185013 -184245 -107688 -177368 308062 -4778 -47411 239117 19320 -172772 101056 -242802
20250 29179 137682 73111 -135652 17984 -204700 85878 -301458 -141018 -188167 -210975 83450
20238 157709 203807 -238491 -398604 -515010 -63226 322825 -77070 -74977 15194 -116787 -168124
20227 -168124 -23836 -225700 -174817 -14075 248133 -106008 -173731 140727 -7605 257930 -149364
20215 -301194 -597661 -86673 -12060 30350 -271698 -61565 79444 -199509 -181574 -164141 -232782
20204 -232782 -7741 -516732 -256245 46810 -249538 -229620 -59613 -115343 -137130 272221 -28912
20192 -146349 -117590 -384646 76675 -130647 136171 174763 287436 49986 108764 -125344
20181 6997 131206 -290087 -28541 181963 267441 59575 196125 115022 -141291 62644 -134405
20169 -122604 -154296 159501 -143305 70298 -273515 -58174 -5791 -308291 -180117 161456
20158 -152359 128311 -136990 -39017 -6567 -246613 -172298 220700 -42099 164243 -9998 7943
20146 -9118 -120387 41618 6844 233729 296589 215807 213396 -403001 -319650 24310 100408 -292924
20133 296006 -146105 -37170 221885 -196591 77861 -202523 -79625 74374 180635 105096
20123 105096 144272 -57880 -160620 -157245 -389571 -50902 -203802 188029 -211000 -126897 137659
20111 -116749 -297141 -316157 199264 -142066 156703 153893 165303 -174397 37379 -319354
20100 -163985 95395 -238941 -282520 38420 -57946 -131663 -129093 -28034 -55383 135252 -458151
20088 -66950 -9117 220722 254055 205425 -74224 -135484 133089 -431802 -39445 130110 -184789
20076 -11104 -203712 -53651 193108 -303838 -23357 367959 -686257 -194277 -36633 107329
20065 110372 95975 15806 124470 162295 67197 -127253 -116706 -59528 52524 -113206 20319
20053 91128 -211964 112759 -46134 -89660 -111305 -69191 -82016 -319169 -354138 30631 -60738
20041 166283 -282292 -357401 64959 64978 -412965 -57733 81452 10017 -423084 84471 -121563
20029 -9249 177080 -3381 -210896 513058 -148158 -248716 186495 93647 -248354 175649
20018 264466 -184891 -110904 -99591 -12400 -463036 -282883 -22341 -99471 -220701 16337 187185
20007 187185 91164 -488610 154233 -98052 -59223 -46609 -395005 -10493 -180976 149343
19996 -39572 111487 -370695 146497 214253 -312498 -39123 -38167 -259424 -216864 -44838 -101439
19985 -101439 120555 -194249 178388 -219126 -180703 -398678 -11282 -144639 -298325 -137123
19974 152460 -268132 30021 272801 -229958 104895 -142800 -85139 29492 -10912 95832
19963 -7231 -8057 20980 -139246 312167 88523 -99270 -182680 -204323 318341 256276 -31291 -292252
19951 -292252 167180 -26272 1550 4889 -9609 312805 -94062 32507 -194359 -43399 -374281
19940 -374281 -54491 -47281 37603 -71854 -356468 -128095 45890 50535 55091 330153 -96135
19928 307139 -278362 -204543 47361 -228964 112139 -114693 -201935 -166452 146424 -427208
19917 108591 259304 41625 -111752 -187069 56323 242605 -151174 -252477 -141081 -193016
19907 -193016 39680 -141620 2883 126133 -96355 -60068 -175887 98865 -205538 -28688 -43243
19896 -43243 108470 -189182 -199416 142764 -6782 69482 195635 -57540 -130502 -56488 71749
19884 52133 106158 -62905 312597 374025 -146996 -229328 41235 249653 -289097 -16732 -211079
19873 -211079 134212 90331 -5580 -108970 -410606 4383 -49478 -99660 121597 112122 -275841
19861 -85422 -134726 35588 -168985 -43889 -171137 -168519 -17579 158844 71322 -1693 43329
19849 334562 -40084 47671 -155245 -27193 -311211 -24809 -220841 -118053 -81003 -112455 122589
19837 85581 -164597 -370208 -206544 -26453 1484 155081 182192 -12758 -204781 -170598 -19810
19825 -204150 55837 366221 112249 136929 -424899 -24241 -240590 -10249 281287 -150292
19814 101250 165759 -125551 111487 -120860 4108 132315 -73167 -79815 -170162 -6849 293200
19802 161244 -429697 -173031 123285 -46798 -167508 -129784 260455 -31210 -214797 58946
19791 -91660 28970 -19306 13160 72698 -169516 -94100 -13957 -70457 37303 -408635 61890
19779 259723 149555 84902 -25076 -1740 192926 -149818 -141410 -8565 46457 305922 -40302
19767 -112038 49230 -377891 -192188 -51474 -7834 -116163 18011 -76541 -32425 -278922 -208824
19756 -208824 -95968 -238989 -155151 82492 -242531 260950 118326 -112028 -208288 -294158
19746 -294158 73462 -12297 -318415 -381385 30544 5521 -88575 -279069 -79140 -14754 226396
19734 -109319 204643 111033 -245870 79586 216332 -117268 93540 5908 -153984 -79198 12094
19722 -234200 -207543 -338533 318518 191901 -13785 -119567 -181026 335476 -221794 126855
19711 -115382 -397849 -96513 -205625 143633 141588 -72690 137590 -1012 171737 -61792 -410334
19700 -410334 256321 226578 -96415 -67597 -212949 -188856 93150 -259818 -28573 14305 -188644
19688 -319326 -185339 -91396 248486 -16742 -40706 -214399 93886 -128371 -106462 -45473 -6269
19676 -58429 -94143 201912 -93264 69566 192679 -122833 129127 66293 105232 104880 -37643
19664 -190266 -63375 149317 -390811 -167982 -112020 -41254 -69990 -118778 -5509 19431 -83710
19652 50131 -105381 -191959 -194357 200028 -148408 -21380 27397 -97600 -68895 107415 -167267
19640 -89683 185138 -103910 -138873 -207551 135601 5141 191722 204912 118265 -75454 233627
19628 -22022 -291208 170360 147118 266558 -27732 12321 -32604 -134818 -138497 -240629 -406373
19617 -406373 93098 -62762 -153736 -48376 -590391 -190968 -171227 -522059 159925 -323438
19606 13416 -44756 -122282 46853 130289 -121020 164927 -105536 167976 23280 -61087 34593
19594 75847 -190784 80627 81303 165538 -222379 -166177 -185096 36489 137848 20333 243944
19583 243944 -16085 65267 148698 -13640 -69948 -119936 28712 134154 -192337 8556 -360685
19571 54854 211739 -20859 237233 59202 129064 -302810 -30380 -114798 -125730 180117 270858
19560 270858 -333200 150010 95968 -127636 -99012 189850 -69020 -26365 -63820 -115291 -168057
19549 -168057 -309988 -86379 230039 -5066 -11801 -15769 31698 213664 229001 86293 -209831
19537 38074 -25438 191940 -127285 92962 -196879 -240885 -89223 -36278 -286383 -81058 -228121
19526 -228121 -521783 -351314 -312625 3423 -106415 -72564 230857 84854 -269223 -253343 -180789
19515 -180789 -44469 -266043 -138733 -424593 55343 -124959 -256442 -35992 -209064 -156841
19505 -156841 -109494 -349288 -239846 201569 19116 369719 -129841 -305999 -107485 106939
19494 -35133 -249964 183764 -34091 -408497 192560 -56806 27128 112615 85112 82378 -69577
19482 -202150 -168039 -91409 -269823 -75863 29963 -229588 -38129 -14539 -267654 -167634 -11187
19470 -38903 -189531 195129 -83641 46914 -7830 -387972 -219792 18303 -32965 98281 -131405
19458 -255979 73789 -209803 -94261 31088 164154 -23505 226997 426723 115174 -167269
19447 -30638 35167 -115395 97910 -252507 -99977 -94204 104909 384193 117461 -193975 -192775
19436 -192775 -175446 52634 -221003 -174524 176956 -502370 -207834 -306178 -289968 -120125
19425 -579288 -208953 -284856 -218194 54586 -59963 204452 34504 -168510 60065 23586 -26242
19413 -87487 187657 -415894 -451612 48195 194777 64878 -78163 -43869 -334937 8937 40207
19402 40207 -162791 87003 -266082 -142895 -80784 -367506 -103908 -77467 49682 39664 -97822
19390 -144418 -94947 -313310 -106819 -274525 -37924 -15717 15143 -118579 -158896 212747
19379 -205854 -371207 94519 234378 -69952 -98001 140158 -23746 163063 -278796 126321
19368 35088 -41542 259265 -148095 95660 -263114 -27515 -80165 -51397 -89255 -264311 -133119
19357 -133119 200849 -4794 -152112 90731 45252 152192 5597 334607 -28567 61748 555
19345 151 290253 74571 -123893 -128312 77246 -861 -97530 68833 -37246 65623 190760 119467
19333 119467 83947 84731 304868 -37813 -2446 -223262 82876 5973 -100119 -160762 -103686 -139380
19321 -139380 -147546 64921 -274078 -402649 -224498 -375997 46512 204117 -2276 -53811 -242376
19310 -242376 101741 -321678 51871 1595 58541 -179234 54359 -115060 -194348 30736 -279718
19298 -105017 -299495 5948 -69313 208046 -114676 -224479 -181932 -41199 7399 -111100 -17236
19286 110908 -173589 412591 -339666 -280871 -189126 259813 -407215 -138086 -95250 -7727
19275 332314 35085 92867 -152573 -53165 108512 -232398 128224 11707 -271710 -382196
19265 -382196 -179916 -122011 -6163 -118183 -210904 -248751 -133215 115244 24303 -382892 7152
19253 -256944 -101430 -115202 -84015 42051 -71856 247758 -155793 -192698 -142638 -207531 -190090
19242 -190090 -283437 15955 -38423 -42626 77349 -145438 37963 1194 92784 -30649 -202040
19231 -202040 -133992 127036 -164699 -6348 169634 -186119 -259407 -85613 40418 3707 -114984
19219 -162039 63238 -97601 -224061 174467 -392810 -15906 151909 -75281 -39223 -346866
19209 -346866 283249 -64622 -137658 -287814 125869 -213699 -323058 -282178 -81666 -117975
19199 -117975 197502 -256284 128125 69350 258421 -204762 -269906 7509 -306167 517685
19188 -216102 133633 -142394 21332 47409 288923 215794 200183 200943 -92322 -26349 -88965
19177 -88965 -141410 -271346 -24640 -151186 -145518 87621 -161025 -116667 -73140 -84535 -374457
19166 -374457 -67792 -63858 165107 -333974 -134435 -83654 -65073 -11285 106272 42408 270329
19155 270329 177783 -104846 206035 17597 49245 -18002 186957 -38343 -313095 -135524
19144 -176875 24187 20670 90221 308141 50609 -140921 -313685 3480 -197780 57420 -319726
19132 -130711 -324005 -52340 -139483 60991 -170302 -146627 68120 33388 -428383 222199 25359
19120 -285492 25224 20205 210211 216731 127311 -36120 -230205 -12834 -47421 366454 155752
19108 59620 38103 -215915 21954 -243515 236755 99192 73698 -292015 253124 -97120 -201444
19097 -201444 -34885 41347 -69426 -98827 60018 26595 -9855 -211441 38533 -95816 -241795
19086 -241795 -184380 -132653 -62203 -12202 -139734 -242291 -65364 -79664 -494496 -270603 -104784
19074 -27328 39888 41003 -75583 -327441 175011 -20092 -207687 -144429 -305612 -84877 -257168
19063 -257168 -99059 -235208 -129194 -239242 27140 189565 -388377 101997 -182470 102844
19052 -157121 -136888 -61609 -145847 -184689 -71996 63173 -284556 -119930 164289 -94767 95847
19040 139026 11128 1180 22712 -317202 17942 -16574 -64833 -262504 110560 -14681 -112781
19029 -112781 192666 52792 333650 6699 97125 169922 -38175 170903 314236 -64005 238344
19017 48856 238796 -2282 -222698 -325350 76498 -44421 -26177 -124469 198354 33648 -297672
19005 -105174 -78586 -154691 -329724 -135732 129580 -219983 -171207 -182683 95336 182129 -143200
18993 -85774 -1446 145785 -104943 -68563 -138321 58226 60807 -43599 -36737 -135514 -113661 -71510
18981 -71510 -192376 -212292 -13753 -16767 -195453 -20680 361868 126165 -33170 -59484 -60304
18970 -60304 -106974 130604 127985 37874 -171755 527 -15396 -204600 -141351 -179023 -202599 -14804
18957 -189074 -167175 -264030 75921 19427 -49718 36819 61811 -118357 -141090 -23928 59080
18945 -53259 -120614 203764 356800 -209908 -39972 -281263 -25750 69289 -47877 -73737 -76336
18934 -76336 -75693 56796 -19327 36877 -151872 103860 -97711 31062 117057 13248 83025 -18987
18921 -710 84555 233014 57418 -39827 154703 -90908 -15504 -196409 -110842 -122441 -44145
18909 119265 232144 108592 -242846 -113979 -355090 207532 65 232137 263821 116945
18898 43825 -222988 -93347 -207332 39012 -214804 -312487 164923 -76922 18573 16705 2487
18886 -140868 23652 172264 -80146 -123326 -164425 1734 15828 -336119 -160288 -223315 -238402
18875 -238402 65290 171406 -386581 133372 -200432 -355466 -252717 -416355 -173152 -250473
18865 -250473 -148 -169119 193096 -113669 -12968 251941 -142682 -397413 -264948 12292
18854 -282465 226027 106848 -227627 42944 164198 67494 358163 170684 143216 -190011
18843 -190561 -17019 48526 36136 -358508 -14102 121588 -309116 -15040 -138318 103728
18832 36010 14976 329644 57292 205641 -325768 -155140 -416684 60817 232252 34280
18821 22920 -57740 -16712 310670 -22162 92037 298519 -285054 -34411 -318421 -65295 252032
18809 133281 239809 -35115 9812 80425 -225644 -225847 -145907 -207201 64055 22052 -131151
18797 -141102 -11343 -35231 -54681 -108612 -132188 -189123 16289 75597 222040 -127135 -40537
18785 -25847 160514 281369 -22869 -154345 -470848 -152591 -184421 235470 -144522 383540
18774 -245302 124301 144609 89974 -247753 -174851 -7203 -258491 257313 192692 110747 -78080
18762 268258 -236163 454407 79857 147414 -218020 -946 -276773 -365848 -31290 -229352 -204792
18751 -204792 -237370 -30053 -341147 -169383 -121095 -385876 -205540 23961 27187 -211150 253267
18739 -172218 25043 -134011 21648 -118051 79529 38223 115723 -352180 -98829 247937 190550
18728 190550 50555 -138911 61817 -106577 71167 27881 -156989 29107 359585 -418354
18717 90742 -1177 8833 -121535 -6644 -304817 -160679 -92558 13108 -83001 -46618 -183730
18706 -183730 134646 104999 203967 -82423 -92189 -142876 -433376 17656 172304 -225783 58528
18694 126885 -229816 2851 -143119 -131111 -126843 23262 37422 -219312 -334657 -23601 7260
18682 6009 64516 -220512 -42034 -132467 -21483 116233 237793 -7208 55897 -128375 -16157
18670 -204308 -299659 158211 -91481 -87364 -259308 30010 13032 -98769 139353 -57844 -9851
18658 117444 178529 280736 10355 -177504 36727 -346121 -12664 -211955 -177440 -97575 -215771
18647 -215771 -12173 63943 -304919 -143960 -3758 -136270 9941 117869 -195368 -544653 147090
18635 -213582 -242383 -49010 161977 34999 -191610 -215730 -116560 -352375 46059 118124 -72377
18623 408742 -85491 45812 -28350 -113335 -165907 61461 -314396 -293532 -81762 -348347 7532
18611 -157348 -316524 -80368 -16355 131541 -41213 -75329 186588 284074 -254888 12785 151803
18600 151803 -68888 96375 -10763 470334 -466070 149540 -188635 -50108 -141343 208438
18589 28903 69866 405426 -28212 34941 -233443 -344019 -231053 -202173 69874 -277496 49817
18577 134223 -12093 -21804 18842 -76388 -44739 -41566 -61399 315093 231492 -51799 -124491 77630
18564 -135552 -290918 196058 -15833 -241649 155530 85779 34336 34866 -102583 -159314 49023
18552 82243 71926 -121434 27498 105142 223231 80348 -50640 38426 29843 -117145 -149939
18541 -149939 182117 -216916 63468 -136022 -149503 100073 174859 -18374 -116766 -114464 40901
18529 30411 -8006 -70405 159029 -37903 -272200 -27397 12056 -138340 167380 4584 -253809
18517 -121125 21631 93654 -143402 145454 -52563 -9104 -75631 -94234 -115622 180995 12559
18505 67174 134104 -80487 -438487 -88137 -11486 -355865 -109226 -47693 -335762 -563066 -79827
18493 -71742 -32579 -161777 16802 -28227 -141851 106670 -217082 8005 64924 179535 138289
18482 138289 43669 -139012 -5214 -122872 216158 81198 -280505 -256697 -346097 38262 -236886
18470 245290 145151 -316119 -52114 160251 -26604 -79871 103753 -101608 -510637 -323676
18460 -323676 -45534 -51679 533061 -59747 188873 -29996 -282908 1018 -127348 -450377 -120869
18448 105472 -187955 -223820 117581 -244892 -534765 -28710 80877 35388 -437291 43333
18437 -1647 -6286 -268998 269851 -355114 -143091 -214864 -111829 -148262 5675 47989 -102015
18425 -70242 31703 -81984 85664 135706 113937 33111 -438563 87183 188281 32108 -246771
18413 -364068 -30935 -125090 189232 -37550 -79654 13032 35361 33532 38617 -127053 -94017
18402 -94017 130252 -74237 371710 172310 108577 -61114 -212975 230444 -25052 156400
18391 -65952 -142536 -109695 23649 -50078 211566 72662 56504 -2192 131465 -87212 62107
18379 -216259 -15204 66368 -444529 126273 183398 -20318 18771 -85508 -101294 119585 -230071
18367 262524 -58159 -31548 247505 -70548 129452 306090 -330373 108145 7203 96054 -248935
18355 -404016 25686 124812 -132279 55332 8657 325722 142589 138345 -434675 156876 75697
18343 -20040 105686 207648 -267661 35012 9733 39717 21286 40080 -69681 -37117 143863
18331 73046 -30279 121670 -44835 -41077 -52399 200845 -219836 167228 54706 -158955 -119845
18320 -119845 70456 145086 -94621 -44755 121614 -300492 -166856 -91648 -42015 109169 -129738
18308 -35962 -103821 -22073 -442915 -363320 157835 5189 -59678 -103137 -9601 62002 -116637
18296 -16551 79708 -59571 11373 39324 -287602 31541 47240 -82093 -46692 -41681 52742 -89469
18283 -56107 385747 81745 264627 -46967 -144115 -65231 -248744 -116080 -316555 -33980 264562
18271 -180292 -52959 -115510 -234539 -17053 -231580 37857 -138660 -166697 170476 -153514
18260 62901 44164 33534 166982 94019 167352 29777 275202 144941 -148903 -316455 151454
18248 -9312 -34748 -333971 -109909 -904 -233422 261557 -38112 -313346 58895 56836 110657
18237 110657 -140453 -182342 86201 -243142 209480 -181054 20392 -99852 -446960 -119738
18226 -243524 -235127 -79407 -152187 -77020 175250 -275146 49530 -267164 82869 114773 16527
18214 -207190 8377 -31086 -1170 -10473 4908 -299564 -348789 -29810 -159509 63678 210571 290092
18202 290092 -83306 439653 305548 -129460 -125673 -67499 -5962 11989 241708 -316083 6021
18190 -306172 -7547 -69660 -54696 -295084 292028 277166 196274 -59924 -176360 -100143 -173885
18179 -173885 -96622 654 -40953 -262657 165679 -7868 -642184 10207 -337909 -102535 13926
18167 25448 -199974 -25750 175255 -80394 871 60683 -237820 -39931 -157149 108659 -148072
18155 -158231 -218693 126254 232737 -110862 -68396 216067 308776 50924 -69377 215667
18144 -196752 -321970 -114362 -89750 182320 -184781 150495 -120968 -207035 100059 -106638
18133 -301863 -91573 173982 -155947 -151226 45105 -43037 -87504 -170944 12873 14137 21791 -280223
18120 37254 -176668 -67872 -159010 14015 -82281 -73372 -193342 59177 84961 135448 -242405
18108 -109364 -28971 54242 -79357 252297 -151522 116292 117044 -35088 165747 -276217 85609
18096 -54563 -294245 124647 -193970 -253688 201346 -52578 -75790 204288 -21256 -165031
18086 -165031 116415 -60992 227035 42475 -37705 -253512 74200 105286 -420293 7625 -117901
18074 -147887 -153942 -29180 -416707 47446 -177964 -26720 -75186 271723 -239978 72578 -301904
18062 -122100 15080 -35012 250784 -95208 -14982 -36931 -43421 44010 -342108 89139 -54210
18050 275280 -12719 -221517 -81333 195960 13988 -255809 -16090 168061 39338 116321 -6335
18038 -190375 -209538 -40133 -73543 72667 79857 -33956 269496 370 379097 -54463 -3176 221970
18025 262469 175165 -154481 131393 17762 -100971 -343204 -25512 167084 -141881 261459
18014 116344 52973 399298 -249027 -20945 40138 -99032 -434032 114190 -268732 164041
18003 94187 -99283 100991 -217598 -528172 -30963 -59458 36052 -68849 -25055 -199536 -41939
17991 224439 181546 -6195 -113196 47115 44878 205733 91567 104414 -4760 91333 40735 373635
17979 373635 10623 27824 -89298 36247 -64102 -17587 -45577 73504 -167217 58874 -329525
17967 -21489 -26507 103308 -377921 44245 -115556 -101210 155429 -94754 -436173 239160 -77145
17955 -165732 -147952 56318 -294847 151280 -124785 206999 -161061 -240788 23490 -29409
17944 228997 63512 -49412 -181787 31201 68873 -317102 -99957 -15630 151245 65007 79846
17933 79846 -1782 81000 73378 -198160 51723 -70225 101783 -291113 291074 30512 146088
17922 146088 -44537 443 119380 -182829 -82380 -81514 -87595 -71569 -293595 25466 271800 10213
17909 -60682 41328 -184763 -315209 34619 79119 -89946 373656 274507 -245119 185583 -31183
17897 330654 276670 -234992 -123280 -105852 -354828 -48680 66142 -172469 -218723 -156990 106110
17885 -212722 198249 161757 150102 -169937 65992 -470155 -30959 45371 -349100 -346547 299007
17873 -222903 -305454 -374883 -260179 77262 -192116 40655 -77135 -34547 187646 141321 307557
17862 307557 -111209 55531 161265 -289879 -358073 91140 -176027 259460 -33038 -225706
17852 -225706 -130129 -474582 22033 324743 -149399 -82190 -371308 53389 143331 167875 -292504
17840 61240 -15541 123071 -2384 154775 -10338 -165264 24357 -23232 8722 39339 304809
17829 304809 223204 19161 -22436 221701 -71174 -162099 -110591 -178933 -45625 69110 193065
17818 193065 -61805 -286251 -190185 154293 288448 -191948 -16114 -260799 -125069 403971
17807 124417 -206692 -111819 489644 134588 215840 292954 -270205 -305123 256028 -28715
17796 -299778 -26243 -52799 100639 -79415 -132073 -204279 156943 74688 -52130 -113888 71202
17784 -154325 393645 8742 -112188 -93570 23318 -230869 -118215 -409854 -23644 -271917
17774 -271917 -300049 -198830 -69632 -39048 215796 146975 -195262 -165310 72445 -168294 18955
17762 -36901 -148862 214198 -192871 -164151 -364899 -198119 -163488 -266386 -293105 -87202
17751 125230 -225426 -156881 -276014 -127328 -145017 52669 -180260 72008 36822 -27527 189942
17739 -264504 -170283 147705 -203839 -81660 -300102 -372209 144478 280060 47796 227770
17729 227770 -23443 -133461 -126489 103072 -305464 -3999 -199930 216604 376066 200817
17719 200817 -228777 127073 8094 183588 -206246 164788 -41376 -156354 -33609 -109243
17709 -109243 -135259 271193 289717 -305486 -63320 -49007 254459 50623 187562 93010 248481
17698 248481 -1613 -276598 13704 -68633 45044 -211675 -49426 -176748 -488788 -64026 164787
17686 87913 -89150 -199176 7756 106175 -186543 23780 289988 239113 20969 24622 -24836
17674 10543 -493112 -56936 66389 -229876 232260 154316 149001 158969 27907 -79766 367072
17662 -194304 -10475 352140 114659 -95543 -288369 -68183 252466 -125341 -125211 107865 106780
17651 106780 31332 -195401 253224 -25157 -182752 94447 -242103 -109329 60051 -29876
17640 -86684 256199 -154991 -230956 14719 36105 101240 66912 -261283 -71159 208645 -95432
17628 -115398 -81745 7754 384347 41556 98271 -4720 -99201 -55313 121996 80793 132017
17617 132017 -61585 -36292 -2723 -31964 14112 151326 -225464 -88673 134836 -84522 196653
17605 115667 56340 -46755 120440 -307129 -159168 -191278 -97229 -288671 243616 141342
17595 141342 49774 59665 48405 -21104 -92956 396321 -189572 92967 -89380 -129424 63059
17583 35730 -299306 59053 22438 59389 -126976 -17183 140907 110413 -46420 -255462 -103496
17571 -72218 -95052 246194 105567 -10646 -59741 -110795 5436 109157 178057 226120 32482
17559 -78993 -143956 -38652 96657 -137775 -60694 57408 -163742 -74131 132426 118463 -55322
17547 157433 -55299 592575 73960 -169921 -96963 63480 143761 225836 -116233 504280 -276726
17535 252459 192836 135426 65388 14204 216307 253257 250817 4920 16825 93373 266498
17524 266498 24954 109648 384306 -300353 325718 338360 16960 -92206 -57020 206800 280913
17513 280913 -110933 107528 159163 -165637 -145340 111978 -66346 423701 -70327 -103150
17503 -103150 54647 218500 82180 -130677 168946 260257 260331 -296842 144328 -119082 -77322
17492 -77322 -23110 26006 13358 63391 132928 -84290 -6828 -139916 92146 -186055 166643
17480 44033 -42651 118988 54407 -12522 36244 113390 239094 465442 -27933 -125447 210902
17468 116496 -223362 -196634 -149260 225544 83019 63254 -336042 -178047 304110 -158904
17457 12734 -218403 233441 127661 223924 392332 -187814 141953 -6857 -178331 357679
17446 289199 119033 175097 112154 262381 123589 -13962 269016 96650 304360 285052
17436 285052 136537 438077 119781 104907 182876 218447 -141127 397426 -253220 475140
17425 121318 131652 45540 -76758 254235 233354 -10192 18815 248579 85160 133893 411943
17414 411943 34806 317249 146733 -42465 -4061 615654 190768 -46515 148995 -40502 210266
17402 276552 109851 308081 -39650 -86932 71673 212622 -43145 -52287 183386 118387 163313
17391 163313 49763 6702 -104471 42766 202760 160227 134945 271853 332918 204742 -278103
17379 121640 497773 293635 62449 161026 -20763 57669 69305 130169 -85315 38848 -93581
17367 13253 424437 -105495 26429 118425 103403 236111 48960 13689 127464 90830 19629
17355 108776 -11542 27576 312845 253926 241661 -60703 143077 268442 -78788 -98627 129680
17343 -99070 212993 -146421 612 1803 -110689 230071 -30707 145538 79389 67553 90375
17332 90375 101424 -98387 -84236 316920 32636 -55624 319280 192829 -71654 239298 197364
17321 197364 -73672 -112599 65221 161110 52268 10098 -45395 161528 34695 104553 137438
17310 137438 -93674 254316 297086 -73529 -73298 26750 32662 -397916 180270 433737 28136
17298 153762 38282 -52185 -28181 -181874 243564 -19597 124135 247883 67051 43597 -96734
17286 98336 -320462 -209419 118900 127309 39623 -4403 -34439 500726 239371 -37918 288123
17274 226714 8110 275187 -57446 -224972 281904 224772 551835 -190956 148473 198377
17264 198377 269068 134523 30436 417969 -51802 98486 307871 28911 24267 48270 368980
17253 368980 311906 34312 131728 276338 140792 23733 296284 37788 -52706 144391 -147028
17241 243512 57951 232923 138590 258387 352073 310036 221857 -7575 234343 273918 187950
17230 187950 364197 259221 -97010 -58228 -109649 117003 28708 276330 229425 230521 -215296
17218 189715 267962 -77767 -249158 201599 444633 145179 -29334 86694 179638 209010 -2260
17206 -166218 520197 207470 480791 307709 188381 244715 51616 89789 112242 144053
17196 144053 220115 137743 229494 101678 91546 415548 245491 496275 253499 185972
17186 185972 184702 2601 -90910 476983 312143 353012 123632 132544 220419 370568 264894
17175 264894 148135 193440 420363 615324 55242 -9200 -51002 602735 176954 13222 157767
17164 157767 188065 231267 342253 89656 481921 553161 96846 56114 328841 159681 91105
17153 91105 413775 191435 2382 46310 334361 118293 82558 318003 150163 -4536 262647
17141 115649 395575 445667 137313 190833 245965 46353 518888 258280 385283 144650
17130 314408 354211 246369 187390 102059 318987 -143453 74099 196484 197322 393368 188460
17118 47370 353105 526420 411329 13416 433458 436693 330025 208814 50632 294106
17108 294106 494500 265221 212720 384070 446000 245635 347786 66576 169705 453030
17098 453030 323827 242464 70196 452323 277622 106148 227758 259520 225899 302888
17088 302888 192694 77803 337767 90533 201688 391690 266152 196718 391047 234059
17078 234059 459324 260016 380245 477490 282771 329651 338330 383276 90185 289911 473395
17067 473395 -30653 293803 501134 336001 834864 240999 246254 481128 474031 413755 175734
17055 625904 708640 365381 231356 231824 322052 441995 336860 227977 313876 677756 578082
17044 578082 323276 333828 532980 254358 454893 626335 340693 526074 412487 375526
17034 375526 423633 223308 598018 349714 529778 521307 490329 516729 458662 370229 244167
17023 244167 224151 581065 561416 681705 325800 413787 9454 887459 252034 577081
17013 577081 763387 423624 448572 520265 669861 809791 304512 843764 440665 829342
17003 829342 370171 481574 553938 530459 447220 811609 604505 605895 536048 564665 436349
16992 436349 565879 571652 390157 374256 524117 526451 617164 513247 951581 595464 814857
16981 814857 571084 536730 513331 551548 527251 614455 757086 687797 681216 863035 536053
16970 536053 816819 524897 451078 1063899 797793 856873 866780 743255 986393 775512
16960 775512 662764 463904 780307 1163518 773308 851318 716745 762850 843632 727897
16950 727897 754501 756016 795423 958290 733093 999147 913005 1094825 672327 1151714
16940 1151714 1009944 706668 1234386 963163 810480 768064 1163287 1007563 809943 744709
16930 744709 995371 1123259 771910 875835 1082957 889040 1048702 1107480 966697 933289
16920 933289 1349672 1149787 1174845 1189858 873524 1154417 1266615 1035453 1248177 1022539
16910 1022539 1267365 1165417 1134338 1510067 1588151 1306635 1374181 1176517 1460438 1208116
16900 1208116 1689196 1555141 1385238 1420338 1549454 1251636 1250313 1722100 1220449 1465061
16890 1465061 1481087 1392736 1475834 1601147 1652189 1562499 1699643 1902558 1455844 1729148
16880 1729148 1840500 1583846 1783158 1949319 2108592 1881811 1563262 1639800 1866136 1866277
16870 1866277 1880323 1858116 1533819 2018026 2056416 2446651 1926496 2453278 2345692 1946098
16860 1946098 2179327 2291932 2424104 2597459 1878085 2590419 2576474 2586509 2654012 2561504
16850 2561504 2549290 2524099 2822258 2920882 2432927 2452812 2872310 2895331 2788136 2718089
16840 2718089 3056347 3119076 3280039 3038712 3353903 3210794 3256259 3207194 3360569 3755124
16830 3755124 3572299 3697801 3585867 3488742 4051308 3885865 3733749 4323191 4036945 4439062
16820 4439062 4068147 4299596 4295451 4804860 4509079 4316400 4971850 4677201 5092855 5236924
16810 5236924 5273279 5155527 5233900 5322834 5614210 5571740 5813393 5801409 5961648 6202314
16800 6202314 6240881 6727022 6848547 6867683 7133362 7088056 7366312 7430686 7917951 7941921
16790 7941921 8138666 8175993 8548081 8503491 9074258 8737111 9432488 9863474 10016698 10128141
16780 10128141 10797888 11351581 11353862 11793241 11924662 12755148 12883358 13057045 13623297 13877613
16770 13877613 14612837 15185252 15819815 16274357 16762386 17449265 18559227 18716073 19711857
16761 19711857 20359384 20983975 21888869 22875439 23809723 25119148 25916165 27412018 28426766
16752 28426766 29825068 31394459 32652217 34559478 36578175 37948282 40099149 42105478
16744 42105478 44527529 46864609 49992430 52821497 56039970 59377385 63073051 67277490
16736 67277490 71316116 75910416 81384571 86719543 92466501 98671322 105654628 112657052
16728 112657052 120328647 128188402 136305092 144766407 153253215 161140757 169344218 176458434
16720 176458434 183644159 188859722 193668857 196114213 197499415 197245899 194860922 191441054
16712 191441054 186662114 180704496 173525102 165536607 157413740 148320375 140377188 132031316
16704 132031316 123552351 115875838 108403335 101316017 94593808 88609620 82869759 77751732
16696 77751732 72249733 67700062 63915391 59839120 56269555 53213345 49692872 47041509
16688 47041509 44527544 41916139 39980029 37508792 35193669 33794647 31958664 30646427
16680 30646427 29164142 27721226 26285054 25057259 24127865 22989180 21971516 21044915
16672 21044915 20238573 19539191 18650918 18136105 17072707 16377480 15756567 15371762 14447139
16663 14447139 14194913 13858308 12695088 12870786 12287608 11860432 11335663 11026607 10882268
16654 10882268 10504012 10007419 9653598 9592821 9369972 8792099 8726389 8678081 8078147 8179053
16644 8179053 7651684 7344140 7517840 7317248 7172129 6392782 6665090 6229600 6347042
16635 6347042 6080522 5973351 5424529 5775949 5501363 5317013 5186728 5074362 5075167 4985019
16625 4985019 4846606 4575255 4420654 4140504 4208004 4009060 4271483 3729819 3824747 4326508
16615 4326508 3940234 3869303 3530065 3821827 3354273 3440659 3336026 3360377 3257598 3285713
16605 3285713 3356493 3182863 3085631 2919044 2764350 2915840 3177871 2721840 2579344 2660368
16595 2660368 2634226 2742414 2694488 2622345 2501105 2396338 2007756 2468962 2219297 2417232
16585 2417232 2069594 2118611 1905176 2369892 1997036 1861722 1859921 1787269 1906300 1854412
16575 1854412 2243095 1696239 2029811 1835439 1761909 1821896 1476361 1827548 1506103 1817695
16565 1817695 1688753 1772933 1319220 1567542 1710700 1638450 1467605 1645105 1295068 1560311
16555 1560311 1496973 1357019 1232299 1663343 1418689 1676086 1348712 1192319 1213256 1058077
16545 1058077 1148782 1072740 1214032 1411503 1051001 1306901 1375788 1162072 988474 1276738
16535 1276738 1061717 1161582 1211693 1149395 1315608 794902 1013098 949297 935656 1099221
16525 1099221 713415 1096249 819102 1006237 912345 865151 1077996 1158287 1069168 853749
16515 853749 697586 1007887 713208 839833 727583 650368 1090845 657386 644212 960396
16505 960396 735637 939122 783514 755240 754841 952548 833670 526333 640741 768690
16495 768690 696657 796926 625610 681268 547989 856038 850941 448773 810230 444869
16485 444869 661335 826145 676880 641824 677310 568403 636276 782134 850325 702569
16475 702569 623929 910813 752217 583423 713842 570592 737254 785746 397211 796184
16465 796184 692097 577659 294056 520536 708783 606707 464802 452852 735142 151272
16454 611170 716747 503195 308115 574728 189593 371830 313541 449759 681460 237675
16443 548297 419926 412682 411901 399643 411523 695569 193012 231904 359952 381930 259193
16432 259193 373453 650543 497796 161254 166536 478426 313519 541572 311510 621096
16422 621096 84018 179889 236600 786547 422612 347020 543403 429430 91362 476754
16412 476754 482402 294428 320444 425302 525482 410691 324555 235492 306010 318402 411939
16401 411939 121333 299652 288410 233723 124948 153227 125173 426701 139316 298399
16391 298399 45363 287020 304915 181372 355889 143940 1635 49304 354711 429580 -44001
16379 56613 350474 451942 89282 208492 382916 336133 110477 407421 153978 319614
16369 319614 199620 268064 95853 136516 33033 84178 338482 318161 396535 187764 57299
16357 150253 404392 346297 254597 398937 188275 -166089 11398 149764 261414 256599
16347 256599 470856 6179 251365 326000 148598 142618 -65865 266628 98282 -23910 135182
16335 458716 116146 288064 32090 259647 389756 -47643 -71944 112787 206189 535372
16325 535372 -36398 130338 173498 227651 -17035 502415 437390 137880 85959 -10906 187164
16313 37977 70886 33366 6328 196771 159538 19700 80166 -57408 112659 206478 -107141
16301 190484 189139 58271 33605 144350 54895 141527 -41237 247666 282017 340718 -172394
16289 158410 37726 144963 156061 -199740 353896 -237509 -36104 219836 19714 330173
16279 330173 274374 281538 346623 116239 284990 100674 144646 407627 47106 -131747 141394
16267 252243 9480 364234 208652 -86665 -230431 -18810 37454 301050 -50961 78693 266226
16256 266226 356373 -148390 218544 36254 -36269 234266 147972 107620 85683 290312 80233
16244 89905 138853 254790 -78740 -102837 152363 157744 71522 249729 423808 -65497 -166421
16233 -166421 -46624 -43447 -102479 -45273 144884 102869 60900 -188116 165475 313337 85448
16221 30150 145104 103141 18178 179302 177015 181974 -43747 384678 270786 382 -65730 -182717
16209 -182717 206242 -225405 -962 -54760 -309722 -198984 55030 191653 147194 84009 192661
16198 192661 -76429 -327975 139114 89341 9742 356457 108150 -99458 136046 -171279
16187 148643 -141622 120808 -104214 32333 194390 -179836 296834 -216101 277389 -110180
16176 302804 151393 320160 -271465 145557 164183 108974 86473 -111304 82372 -79930
16165 -96145 -44822 -75419 -165607 64404 -255862 190283 290055 -100024 -158118 85699 17755
16153 -252043 89920 145838 162149 12053 160544 -43304 130667 -50466 -55936 -144434 -206228
16142 -206228 53882 93316 -112817 168163 59440 -94279 91945 -114698 -78745 -32987 -143832
16131 -143832 -364959 64470 32684 152915 -18525 129774 -66070 21149 -269830 -192716 46597
16119 101203 -52221 177465 -131800 -34465 -64392 -10185 -30577 115907 205219 120255 155784
16108 155784 117025 196663 180619 74208 -119932 155716 153732 -136601 90801 14049 -58125
16096 12270 -108998 22259 218910 -243032 221309 -115711 111037 -51899 254511 162068
16086 162068 -226390 -150168 -99305 4563 4270 -113265 -2979 141100 -90579 141536 -70695
16074 -34871 150034 148089 -296420 3253 -114058 126015 -70241 -37506 -61607 -63841 -186613
16063 -186613 -17385 -277622 39655 -230737 -7355 241458 -128556 357217 196054 -14976
16052 152310 110354 -149929 -23612 -160554 -95341 123722 -122693 72233 211917 234031
16042 234031 -273085 -130568 -161106 -195777 57062 -243161 213286 -155387 115288 70698
16032 70698 153540 308995 -113768 -314697 -91185 124221 224045 197138 90928 -121762 -182400
16021 -182400 82098 -163194 -86516 -370792 -103316 100749 153700 -94382 -221500 171083
16010 -3210 20807 -26656 -272750 2998 -164608 -262056 -14946 109669 7757 37109 -46076 -367952
15998 -367952 4574 -35893 -443910 -158694 -13649 -66075 119364 -11703 343025 -28379 55041
15986 154142 -22543 -35663 -281164 173252 193079 307868 276101 110122 345366 -354084
15975 -253830 -127495 -225215 33720 67498 76548 -222659 -136912 26691 111191 345505 7283
15963 -195727 -408385 -110594 1496 -96877 -155366 53982 -148205 -326873 4756 160338 91599
15952 91599 137004 -17765 -55983 -61978 238274 -216643 -31586 15040 131236 -77398 -31432
15940 142553 -93361 -106969 169402 74296 -20373 -60206 -58087 -313242 -60540 -69349 297681
15928 -256363 -263550 -18686 116706 446083 98469 -140361 -14033 -93616 73087 -212883 -300780
15917 -300780 489790 -178514 -128262 -338432 254945 125948 150182 7824 -217454 810 167632
15906 167632 -174740 -96841 76585 -89638 -64028 35006 19427 144653 23089 187230 200123
15895 200123 226211 -35599 228988 -165145 -145994 -179540 -305294 -81612 -179020 1619 -68565
15883 -32685 -306455 -59711 -377046 -11787 -182664 -27628 156037 -200016 20611 -274800
15872 -207514 -99883 -55896 -40671 -60578 -84414 -428809 -109802 308281 -121336 165957
15861 -281148 -168897 -27996 -146211 -57269 313482 79764 94130 -80981 -448922 -83226 231679
15849 -173033 -214315 -26426 16991 148491 -224385 -107000 263921 106086 -74493 286393
15838 -203323 -256948 -478664 272969 98740 -192376 -43432 3366 -334323 316344 -67373 -126112
15827 -126112 -176281 49317 148350 -40349 52188 -296079 38204 123188 -217698 -209731 -217684
15816 -217684 435972 -148348 -294873 -260543 -223095 -3255 17792 -65893 161931 192836 -187563
15804 107248 -206841 -126652 59429 137383 -67525 13074 -164888 106632 -365017 266410
15793 119859 89752 -108001 -270599 -151572 -281654 -186465 20187 -109235 13309 -165291
15782 -111407 -225263 -143529 -228944 -191139 36739 327229 74496 -16348 266932 -130890 -308870
15771 -308870 -28375 354948 -467711 -113175 -191123 -241461 280365 -138425 -367279 -52114
15760 -127055 -225115 8971 92634 130259 -325184 11280 -338384 -105723 163802 -150667 170790
15748 159811 81167 217609 80786 -242613 -198489 77599 -135309 111486 333556 -146663
15737 312360 -212094 -23770 -100957 -271180 28991 -207238 -84056 130230 -270839 83429
15726 -176869 -163134 157192 -183151 416232 -154603 -37386 39763 107376 -1491 108711 -208697
15714 -136359 -336926 12611 -73501 -46948 -139131 -304228 139269 45734 112209 212783 50171
15702 24415 55879 -253600 154856 -309163 117187 -26703 -30064 -68169 -92278 -224218 -189766
15691 -189766 201141 -87338 -85664 134424 252467 390390 -4756 -120251 231997 91668 45106
15679 236393 -30666 150366 -119419 131454 53177 -313402 121107 -68614 134827 -187509
15668 55178 -143076 42523 146208 -263950 -171013 176744 289620 35007 93813 2818 -45558
15656 27160 -76123 -315131 -200263 -128075 -24358 -253828 -18664 133630 -518809 -13767 -244388
15645 -244388 135491 50457 -96362 98813 61938 203171 52763 -89396 -73011 119999 -286374
15633 -294856 55061 111553 256001 -115985 -331854 -362726 -194852 334537 -197982 -196841
15623 -196841 -140476 -138658 -224351 -213175 14840 -114829 -19172 26902 -60520 -295740 18395
15611 -69857 -1876 69182 135405 184351 2126 -289966 22496 132322 -76043 -53076 -266212
15600 -266212 -435623 -547389 200121 28775 -191560 117636 -36317 184473 228438 -54067
15589 -123608 162600 35068 16770 12211 257635 -42580 -257169 -66558 -113595 84444 450874
15578 450874 -176135 -161297 -326652 -33411 153057 70754 -9495 34643 -34901 162028 67548
15566 47439 108299 -52161 -149699 164966 232196 229417 -27667 244332 22690 157728 -94711
15554 9518 -221924 -306846 -73064 -182530 -339025 -21741 14761 -52182 -7557 165753 313721
15543 313721 164283 -4090 -51839 -97306 164572 19603 15681 -285973 69722 -185406 269542
15531 -147169 75817 179506 420126 -343698 93460 63836 -65555 -126571 258530 186540 -117389
15519 46946 -95519 -279306 310604 167975 108833 84294 84146 140979 -187201 139596 153630
15508 153630 -379458 -99511 73432 -128444 53209 -156051 -84061 75988 -120859 52971 10992
15496 168118 -209848 25229 -127433 204697 25227 -67192 244947 107150 66573 -69735
15485 -214573 -184373 -12504 -148418 -216966 -226376 -113874 -104247 -33785 40046 -30135 304483
15473 15324 -1513 -174616 189636 -13208 -304731 175686 124670 102274 -221522 -24714 -52915
15462 -52915 53257 -147615 122358 -34915 61924 14384 -122612 -117298 162981 21497 163094
15451 163094 27922 -75492 133065 -22599 -158991 3378 247407 151497 -50582 -139200 32306
15439 -108741 110294 -122329 116826 130085 -333324 129366 -122049 -279728 94586 -40056
15428 187142 84305 252245 -227610 148167 -177167 -203610 -73464 302015 -28081 7738 159274
15417 159274 -32129 118285 -372673 146829 275610 23562 50259 108033 35535 -28714 128223
15405 741 120161 51961 -233813 38600 -160267 235804 94023 -17077 148230 -254971 298179
15393 447108 -118233 -128775 -177716 -125850 -132910 -418335 121151 143444 -117006 -229911 -158603
15382 -158603 -218908 -147406 -34590 -105966 128168 -283043 71545 97525 -14838 2642 70078
15371 70078 71416 -117819 -132952 -109913 -10309 277713 -204164 -23801 -76639 270902 51908
15359 201012 -115336 -211507 -342254 -38253 -213500 242454 -147663 -62178 51205 32358
15349 32358 289306 7048 -200309 -136711 232936 71212 88432 18032 -55070 209078 66914
15337 -241820 -46439 158396 -50863 15431 181729 -233746 106665 -101678 -66850 297528
15326 172610 -195924 275235 -169975 -284605 -147754 80431 52498 107613 151243 3891 44926
15315 44926 -157918 -153365 203054 -46743 -233075 394228 -181799 -62999 3575 -18010 -40527
15304 -40527 140987 101042 -113745 -164266 -3478 -46039 6103 -60251 301214 -206100 63343
15292 97452 150250 38694 -153917 183045 -308781 -49075 102306 38519 52115 94457 3609
15280 48215 84307 -122110 167507 56091 59824 36823 6744 338397 -126626 25391 374328
15269 374328 200101 345883 135088 196787 11210 38950 180588 -288842 -132628 145268
15258 -63642 136592 -23858 44085 105953 -66169 339731 -171985 -234459 323132 377074 1016751
15247 1016751 1795546 1302984 1439454 908540 311307 245234 25258 11460 249154 259364
15237 259364 -120821 225084 -294395 -14359 108947 51154 256890 -7045 16243 110983 -34781
15225 213388 20682 -212003 383729 5217 -8478 314749 -147256 144269 209868 10348 375957
15214 375957 -28115 30614 -4863 151157 126073 4905 -200376 183936 13216 -129158 307806
15202 99235 78537 -106522 -133649 -24284 126403 293686 211934 296423 113637 152802 519758
15191 519758 14798 -119301 -155015 375476 -1734 130069 -154416 33767 -197731 -146132 160974
15179 -74395 313580 -303360 216035 163474 83805 330744 -112726 154 155193 8239 353314
15168 353314 58369 -85086 191014 -182754 49307 265330 -207989 88525 -264647 -9935 269134
15156 375786 -58436 -9309 -209842 260973 117305 329583 109985 41532 -13195 458251
15145 -22428 12495 81549 176289 3088 79156 214357 47286 85462 27752 127930 -10187
15133 -73365 273344 155094 -338036 129645 53344 198006 -464 -325293 144623 -115968
15122 -40753 276948 -232137 274296 56386 270504 102847 306481 456000 423131 -74092
15111 99600 71932 8987 -174314 147228 181580 22046 -166142 -64717 238749 20343 155128
15100 155128 -44061 -128658 78387 235509 -122163 -48087 102300 241467 92497 132786 354644
15089 354644 -332 154811 386534 -105444 -62359 75545 -7987 428198 1201 145231 82483
15078 82483 64426 340502 328174 -43167 -32842 284150 118773 -3449 -145701 -92591 166771
15066 127739 -104608 -62242 886 160534 25453 -184371 9890 -132632 -229484 255099 358719
15055 358719 256453 -143946 -32568 57340 131087 314949 49239 -112504 355410 156798
15044 1443 -32483 460879 125398 -47175 87777 179174 68526 -162851 -22909 -119843 520621
15032 -145664 -151650 159299 140826 317743 15355 -19259 118203 47693 -74402 383873 177240
15020 282167 285981 192882 -300217 163850 363142 47287 226005 429433 476242 223379
15009 465557 304082 68455 340689 66930 197613 391952 429148 118886 135724 343177
14999 343177 -161565 -101265 -9339 51555 176221 258670 102505 43359 189234 106425 340338
14988 340338 177625 192416 -64419 110188 503210 146431 234258 153000 227916 -75747 232362
14976 222648 70107 127946 642952 622172 228005 9913 346216 85297 -371108 230920 246396
14965 246396 48023 105748 396317 68507 90926 590320 349342 -11793 130395 111696 -75028
14953 275659 105528 -77916 -33167 164488 198374 17873 444291 396950 343836 475626 333312
14942 333312 152353 -2829 -133464 189777 152651 56755 63817 489796 400485 336898 -220303
14930 446695 436838 82095 256569 324446 222982 216744 524556 285019 176006 480881 29199
14918 292766 106850 348472 -65886 319431 267601 261431 421989 326736 179207 334606
14908 334606 116894 99037 202690 288754 340722 -3227 224604 10724 257316 417051 207431
14896 309208 127959 77679 61539 345518 267890 109982 298277 234449 121549 206892
14886 206892 215556 314581 310490 438372 163717 301904 188348 188399 102416 369034 122499
14874 546808 246314 86737 119928 21975 423506 337559 215553 424047 151442 373332
14864 373332 414098 1909 153005 529089 116487 278652 416275 299764 161013 265965
14854 265965 766531 413052 266464 391773 549296 604632 532884 420136 137727 339953
14844 339953 679043 359131 386711 295957 487175 427355 487962 184452 237781 552263
14834 552263 289045 348496 433211 456295 219417 308441 282172 243511 428996 203963 635018
14823 635018 249047 678414 315408 378444 120807 317683 261040 439831 249138 131576
14813 131576 473592 116976 521612 453151 432559 266271 463718 726949 713877 322932
14802 288556 138503 269933 661138 428352 300498 358565 294178 191190 289570 285953
14792 285953 553915 393664 437421 259865 505726 248002 628353 203070 389385 278629
14782 278629 571874 338896 445301 425550 315450 515564 405895 527246 421533 308860
14772 308860 373360 298442 784765 413375 870699 794971 266280 453375 449831 654004
14762 654004 173888 744484 727909 367328 266223 516741 598743 626397 404383 679126
14752 679126 463427 750800 471090 592261 633115 409110 643853 651264 432822 345269
14742 345269 348998 522131 570627 177122 531797 853721 606171 544836 454187 548528 707852
14731 707852 692588 620283 301389 491415 780552 678428 868927 804371 763306 716524
14721 716524 551837 544026 578755 661842 781415 357024 772258 604846 638137 817017
14711 817017 632677 458705 472849 320649 716823 587483 613516 580668 729606 542652
14701 542652 761167 812336 802190 550971 746426 689044 866191 789121 659107 944407
14691 944407 517344 878345 788062 807228 518226 771928 1144744 552982 859557 676718
14681 676718 705506 1068642 767724 890748 676939 794319 1203808 788950 743927 569601
14671 569601 1057226 905181 1000514 967461 731225 954468 871404 1168875 914005 791499
14661 791499 747105 845159 962569 1067857 741722 775436 882303 935784 1071530 1202817
14651 1202817 767567 1005565 861318 897748 980878 1399941 730244 881068 973830 824488
14641 824488 1080047 1024409 1176900 1268697 984236 1183181 1112466 1108723 1038871 1336593 1074339
14630 1074339 826352 993756 986412 1074672 877535 1179577 1117882 1267423 888553 1135812
14620 1135812 968931 1393985 1383545 1193196 1380950 1323424 1206564 1094022 1137492 1454054
14610 1454054 1321913 1304298 1408740 1432821 1575022 1389868 1213242 1398797 1039486 1476157
14600 1476157 1465470 1198548 1257679 1126033 1499928 1547402 1421947 1265775 1558151 1358999
14590 1358999 1511085 1778721 1665361 1638099 1717304 1650551 1774009 1553524 1315051 1417692
14580 1417692 1656158 1707184 1808540 1619800 1606531 1822574 1649489 1647194 1591874 1813086
14570 1813086 1597920 1909030 1953492 1832444 2066084 1811263 1987437 1744919 1997459 2113207
14560 2113207 2145363 2041506 2191189 2782755 2481184 2771839 2959041 3071910 3004606 3840020
14550 3840020 4411973 6389435 10614422 19789313 38478959 41802464 18230016 10399033
14542 10399033 4621431 2794341 2550385 1727945 1448107 1881991 1704915 1434709 1852332
14533 1852332 1480442 1583744 1700073 1617225 1939410 1798161 1641238 1698315 1867460 1963076
14523 1963076 1886403 1730563 1861103 2172704 1995699 1932945 1948053 2083767 1898793 2138842
14513 2138842 2477134 2624015 2453101 2209547 2286281 2541422 2755551 2235333 2353306 2455969
14503 2455969 2844877 2490780 2694727 2688056 2586265 2577515 2580408 2618726 2544523 2670496 2740694
14492 2740694 2726245 2901922 2942326 2810949 2967785 3052519 3181247 2883415 3071951 3020363
14482 3020363 3194044 3081064 3274871 3519978 3311601 3488261 3526622 3430695 3409281 3441333
14472 3441333 3576239 3364519 3672256 3755218 3610569 3702831 3819851 3838968 3589163 3674160
14462 3674160 3824855 4282636 4103909 3656997 4004505 4043623 4075190 4362540 4089004 4171906
14452 4171906 4304106 4243445 4460737 4101246 4327748 4734531 4399788 4728663 4776491 5074199
14442 5074199 4922767 4959828 4976953 5102506 5226084 5225657 5216186 5404024 5344316 5413805 5438047
14431 5438047 5624105 6333405 6085533 5637198 6129989 5920995 5986668 6118922 6322591 6239073
14421 6239073 6751692 6826003 6854983 6957380 6994184 7178484 7071519 7044201 7038073 7488999
14411 7488999 7655633 7553798 7573049 7924315 8044648 7973652 8029348 8380451 8451372 8823013
14401 8823013 8934525 9121146 9139451 9228611 9276450 9606713 9575098 9926383 9928241 9972860 10691352
14390 10691352 10488168 10846571 10867574 11252464 11323084 11855443 11287961 11765647 12346193 12221337
14380 12221337 12404752 12628726 13151842 13199637 13383263 13652528 14337224 14610403 14791097
14371 14791097 14783337 15146319 15385655 15796401 15911457 16183569 16525952 16911026 17360356 17518652
14361 17518652 18104493 18243195 19017507 19421361 19704971 20554555 20951863 20990511 21462626
14352 21462626 22237565 22730363 23270620 23988072 24508443 25348852 25771435 26409655 27168904
14343 27168904 27941202 28390517 29269883 30136167 30734994 31974671 32881883 33743193 34828780
14334 34828780 35736925 37037372 38290877 39337208 40398239 41572309 43091784 44486265
14326 44486265 46022305 47604142 48875889 50837522 52691456 54340561 56848966 58230961
14318 58230961 60252375 63197739 65551665 67598420 70688365 73346694 76486531 79704267
14310 79704267 83308647 86428437 90417820 94560684 99318007 103468964 108315723 113489920
14302 113489920 119023736 125085380 131574969 138126979 145247772 153006908 160920444 170096596
14294 170096596 179289851 188968493 199835525 210917316 222674805 235487424 248916694
14287 248916694 262790481 277693917 292945579 309195325 325383570 342197481 359358638
14280 359358638 376084737 392623543 408250457 423059165 436572585 448030631 457923864
14273 457923864 464120355 465193147 463616488 462646475 461122643 455651039 448442424 440204110
14265 440204110 430455479 418546513 404643927 389170242 372311327 354982761 337675110
14258 337675110 320567114 303919577 287800349 272444271 258649706 244730090 231586552
14251 231586552 218985215 207038753 195982556 185385691 175585590 166400770 158255462
14244 158255462 150508240 142809489 135961866 128804865 123005528 116899865 111674457 106789878
14236 106789878 101828870 97294637 93142259 88834956 85321473 82307752 78615004 75604393
14228 75604393 72422720 69367530 66715938 64105129 61597507 59379942 57291325 55278635
14220 55278635 53800376 51512927 49631631 48028572 46406939 44799976 43879272 43212477
14212 43212477 41306077 39657844 38549179 37246136 36629223 36152358 34907778 33693382
14204 33693382 32585072 31445226 30786860 30215158 29834336 28814837 27808174 26938533 26360804
14195 26360804 25794520 25010129 24502602 23941105 23597574 22339223 22308801 21279325 20938421
14186 20938421 20516716 20227458 19451512 19302811 18930304 18254936 17904730 17774462 17184009
14177 17184009 16852233 16565618 16138672 15784077 15553948 15240667 14868073 14580191 14562275
14168 14562275 14112165 13658642 13372626 13389133 13081828 13019532 12453831 12398864 11794467 11956725
14158 11956725 11806274 11465726 11104217 11157452 11008426 10801056 10596651 10363712 10374803 10224590
14148 10224590 9804236 9888213 9763871 9484349 9500943 9331092 9068469 8869753 8937698 8670866
14138 8670866 8558142 8535280 8460327 8271910 8033924 7889432 7584810 7594152 7690907 7695348 7352357
14127 7352357 7312009 7540901 6836287 7022192 7047832 6952415 6810825 6862007 6754389 6451385
14117 6451385 6539425 6429361 5914098 6013842 6183800 6152664 5943633 6159981 6007711 5652752
14107 5652752 5642314 5396550 5397700 5643257 5487495 5280328 5369538 5237645 5381444 5088147
14097 5088147 4916812 5299795 4956725 4696636 4627125 4917022 4458058 4246384 4931445 4507930
14087 4507930 4294400 4394092 4274126 4156224 4623453 4338690 4027652 4140189 3903391 4030864
14077 4030864 4006854 3731489 3957679 4268302 3758958 3639221 3741019 3387440 3898944 3938384
14067 3938384 3351195 3197497 3627943 3679543 3564367 3573532 3573606 3468508 3698543 3455541 3490101
14056 3490101 3730641 3357285 3235712 3314905 3257507 3297568 3267760 2605112 2779116 2921311
14046 2921311 2827263 2921638 2887249 2934496 2622496 2604744 2714827 2855762 2855329 2809497 2754087
14035 2754087 2527580 2552458 2598546 2687768 2256301 2637883 2315914 2551202 2519439 2810575
14025 2810575 2274931 2548726 2072230 2003404 2468576 2427851 2517144 2404812 2125984 2421731
14015 2421731 2192545 2275132 2179542 2039516 1911234 1664227 1941212 2062867 1890164 1892898
14005 1892898 1972934 1877970 2076208 2043689 1803092 1753687 2206364 1720969 1801560 1940396
13995 1940396 1418784 2005810 1801419 1795937 1444527 2459755 2924660 6048114 13448681
13986 13448681 32179664 44335949 21448755 11112265 7271585 5469755 4425814
13979 4425814 3478805 3362598 2990572 2605183 2908309 2531281 2213417 2469287 2064283
13970 2064283 2061785 2074329 2288315 1948270 2083572 1820884 2002114 2291317 1660329 1712409
13960 1712409 1848655 1842046 1611928 1780250 1647111 1881340 1757568 2123541 1670587 1566128
13950 1566128 1792327 1383373 1672162 1415966 1486100 1578562 1637713 1567667 1576656 1561951 1723273
13939 1723273 1431085 1514140 1359797 1457057 1534878 1205851 1519174 1733171 1315357 1470147
13929 1470147 1473194 1468238 1215975 1170007 1361431 1338165 867850 1245815 1415240 1234899
13919 1234899 1410672 1215269 1399685 1199621 1254696 1628562 1363203 1369010 1327413 1084050
13909 1084050 1132913 1167411 1123035 963382 1113923 1202138 1077253 1109078 997990 832035
13899 832035 1327796 851797 1388713 1382706 1502903 1170816 1218218 1092525 1166888 1000659
13889 1000659 923462 926864 1029895 929763 1425523 822539 969104 993744 1168923 777998
13879 777998 729773 1077685 833843 523166 845020 1197347 902075 839067 688297 656656
13869 656656 1024474 836433 634786 737677 974274 1043011 913404 958814 833279 960553
13859 960553 962324 750784 995085 1098907 906617 771063 908181 861691 865295 728984
13849 728984 908520 911872 595952 793536 719612 614661 899353 787426 904146 1102464
13839 1102464 827196 1096454 1237955 568368 846173 954765 422969 780992 741123 1019734
13829 1019734 591669 846035 818643 677949 773994 683089 846291 787924 902866 795354
13819 795354 312657 934837 1111228 756670 683755 586001 851537 776866 600994 810622
13809 810622 641827 861579 572360 950428 473237 749275 948536 733254 653739 843625
13799 843625 872465 699958 943808 810563 601981 892922 571648 623300 748145 710732
13789 710732 538670 747643 775661 887038 663322 868402 730316 759416 569210 11695
13778 939346 455110 762218 529150 742527 843270 745025 521956 670613 659211 891083
13768 891083 143535 501362 508672 312930 417433 737507 515000 471040 785227 735551
13758 735551 527465 464871 761629 433705 709899 725329 639128 583539 469629 597824
13748 597824 593712 617386 733387 530746 694164 366131 338629 622603 597967 491161
13738 491161 493127 225557 564083 586742 588553 743092 364417 603347 509449 659931 376609
13727 376609 499785 617436 676455 734873 490257 792100 429747 786600 356870 318061
13717 318061 129 235705 648847 296549 667698 574470 264472 401003 308584 721777
13707 721777 491237 708712 294442 249425 462473 440653 751804 78522 323369 562601
13697 562601 205237 348530 459034 544920 520006 91681 326769 247263 460814 595041
13687 595041 445926 454545 302658 247782 578614 409339 440290 682586 422151 409481
13677 409481 535954 339160 170681 596087 576062 120842 399874 460694 467691 618218
13667 618218 298623 476271 395460 311204 375973 226511 233350 307438 260653 573204 591111
13656 591111 454792 177783 375660 369413 363986 572229 298288 264555 439627 8304 319866
13645 319866 246649 310616 572190 174502 504728 258818 43952 571849 294927 15572
13634 -24948 375173 233138 487799 265252 159618 425335 325484 496063 213420 247827
13624 247827 491763 347045 119888 487545 237532 563731 435132 447726 265809 482911
13614 482911 121697 282769 477399 446122 452265 -29076 182231 640051 510883 235181
13603 335117 160490 281520 193374 217584 300963 495591 575423 307301 239468 535002
13593 535002 157528 -20300 399961 131269 -220034 502041 385887 258153 270523 168049
13583 168049 224004 410786 284640 118128 335258 417901 285928 297534 417949 334545
13573 334545 370601 371857 233659 459098 222401 38231 385798 224788 297519 148262
13562 393824 371614 283262 550266 365669 108656 404423 318860 59392 375276 103486
13551 514805 201872 358370 221846 51405 346909 398188 327644 329508 485270 362627
13541 362627 171253 176443 181036 272084 490955 103719 231844 295252 237877 77548 144140
13530 144140 23989 278054 216893 347734 254918 238233 554746 287882 316887 477611
13520 477611 157440 -97291 294041 191753 121722 135997 125855 51711 307307 291966 314412
13509 314412 -199498 34118 293536 340199 -12849 341270 213696 -134635 70860 174699
13499 174699 179348 148121 243571 214439 74238 176341 74934 36252 -52025 619317 328405
13488 328405 280312 91850 307204 121620 -60141 77097 168804 215401 255054 282821 58003
13476 116822 147118 190442 27161 271026 292643 177150 -151944 243850 540137 37256
13465 97707 365773 260913 224671 76083 333041 64275 588784 162996 77299 364605
13455 364605 285736 198552 483371 342654 142893 151072 4813 121799 271897 371712 366599
13444 366599 471202 347823 288017 310572 262267 -105656 306932 25470 157752 -20456
13433 311746 -43356 -139955 325786 68423 191575 260171 69756 147160 -96261 151797 294216
13422 294216 187196 125556 229951 360439 178035 408840 -64517 226024 276746 242249
13412 242249 228251 -106849 78170 126681 -108008 -327396 232090 95410 332087 -145811
13401 -33786 -26568 299450 193115 -82916 -201946 -18661 277680 129952 89199 119437 -268433
13389 25683 185756 -133665 314377 32642 117240 105152 503513 -56930 304744 10163 -147686
13377 144066 355947 163365 328429 367457 260164 275155 221617 544023 321166 -7146
13366 -109927 623650 -311808 412845 67485 13783 346127 276575 385362 353066 8619 186557
13355 186557 199892 5407 396646 79557 40039 102975 -51925 288479 261069 147285 481340
13344 481340 49671 106251 283721 579333 331234 291949 209419 391877 399526 -11197 63545
13332 346155 362088 -20135 179923 38800 272398 358433 107630 525754 97413 246636
13322 246636 304829 130305 -57760 177336 328062 -8386 215707 -128027 109578 33410
13311 230389 10196 194265 372223 -110327 -74143 104959 109370 180002 145002 324405 266021
13300 266021 231353 -187895 134278 87342 71658 176759 216502 34512 71158 74270 -130312
13288 138984 -22469 209102 81361 116385 253004 262019 283036 136226 150486 327579 159598
13276 273158 338516 218472 -29896 238788 109718 90731 -30851 102944 -42966 193387
13265 205179 -42373 -30817 49222 -5145 213646 38039 -6263 469656 39329 -99434 21677
13253 172426 160979 -41581 153066 95788 290782 264773 280456 138818 171394 109008 76278
13242 76278 11002 -159401 76715 272837 455877 31985 342380 7217 240112 -186820 -264023
13231 -264023 527569 -109435 454619 258949 273005 149582 -179432 -200321 710 -2302 -138547
13220 -138547 -194636 47305 161577 62657 129215 -107279 137828 -423 154465 170555 -189455
13208 356770 -182070 -137681 290056 164555 -269791 162607 -115896 46543 -193821 -191496
13198 -191496 96572 413157 -54591 -196443 -49277 201751 157408 316794 56480 82027 207531
13187 207531 163838 52109 122994 149197 66472 32904 -75772 -51808 467809 460359 125361
13175 -156575 96531 77043 161291 163840 54755 27589 -164356 -71956 344318 196019 73219
13163 -272040 59219 60311 60517 89818 -82229 -21733 17159 -92180 390560 92787 -85668 338210
13150 -43177 -4171 318624 81492 -67871 422498 -209636 100686 89897 -44237 5491 146335
13139 146335 -75372 194868 276194 -129437 -327965 154870 -17847 56951 120605 91130 220541
13128 220541 -122454 190608 259947 15425 260712 -266925 150330 180393 -181832 22998
13117 199147 -221918 345414 -97226 503214 141807 102267 43902 291500 246611 306516
13107 306516 12575 -224724 183738 166418 -125764 129912 -75597 507752 654 170744 -135255
13095 162016 -85289 -131198 -16625 373490 286413 208902 190036 12933 -18565 -107070 -228665
13084 -228665 -20264 -119244 -49724 56851 189558 213677 218020 300322 77559 158153 181823
13073 181823 162929 -58603 278892 70577 131566 218590 193789 -7375 165775 703 81034 -2868
13060 425601 142285 169586 114313 388738 -109173 -292277 257845 243969 -5481 199100
13049 -261820 177880 -73403 -341197 -83665 109685 186512 79946 -225420 1280 -76832 -250690
13038 -250690 -75264 73064 -80102 171646 -132090 155560 85201 261053 196058 -179973
13027 316667 215147 191633 -83897 233619 381044 402789 240507 109694 224865 416822
13017 416822 247976 240961 -57687 113848 538962 69283 125486 -136017 -26234 24968 -24710
13005 -15146 60800 -8621 218058 100129 570118 271655 208816 159916 120000 247724 -161597
12993 113047 16073 -109285 223335 116472 168808 -281753 57090 79487 -73637 -145214 -20997
12981 -204589 213187 238582 243826 -57589 -94983 76288 139259 -27770 -1063 83826 -154855
12969 -943 185689 251841 243003 15097 245450 73646 33504 88643 135011 289637 -135711
12957 136651 -188022 138875 15798 -252644 249453 111312 -26124 -16593 201755 -108188
12946 -118326 181595 460320 -82778 124123 -420586 -12537 126756 -149013 376359 73624
12935 -96044 -84114 -14202 -113409 -234414 407346 -51894 146640 -86549 -17713 49527 -96557
12923 30657 -19808 -257264 -90333 -51556 123328 -85481 -131475 126692 41667 -92549 37092
12911 -311229 32686 25119 -167549 18880 163409 -181757 523246 361063 53536 14423 54437
12900 54437 160136 -143758 -53080 179089 110913 182447 -210228 -201085 -18610 152938 13179
12888 334703 -154782 -45774 130020 -31283 23433 -186889 -4465 139625 336273 -31449 -83858
12877 -83858 -44666 -51126 -110651 -134762 -10817 -20731 66466 -336419 -227994 67954 -70233 -249593
12865 -249593 20483 106305 17085 166092 189287 -234044 73249 -187829 52468 -139694 -82712
12854 -82712 -11704 285414 185082 144476 27003 66734 10607 -310491 193744 237175 182955
12843 182955 70041 206932 49026 46219 150793 -532 -52994 332094 -183376 -315811 -111641
12831 -439980 35042 166534 -124846 -37826 37965 211072 32453 141610 -178107 -244819
12821 -244819 42466 -312652 37228 -289212 -14615 255943 -291672 38406 -109965 92436
12810 100845 142356 -105230 -37073 -53049 247563 -98714 213389 -98381 -97310 251798 -119179
12798 -64370 -300111 -339462 346485 132294 101280 -277229 -21233 86344 42789 -115028 56810
12786 357204 -322230 90386 68114 29183 173599 235388 -141253 168112 79966 -8084 101160
12774 -157982 212235 266057 94820 -95450 -287500 112345 89531 250766 -251861 -4971 10250
12762 117340 268699 22067 -69720 -98597 -278576 -70137 -347314 170362 -175878 9884 -194875
12750 -111053 52255 -69808 -321811 -117546 -436339 -51394 224261 47233 -172450 24167
12739 -228031 222543 -4837 136977 -253858 -240392 317997 52419 330763 43595 286583
12729 286583 42506 -33359 287196 207023 531540 280834 -172928 544018 -42669 29607
12718 -475968 142875 140335 92810 120007 -327839 -232515 -20448 91077 227929 265314 360478
12707 360478 325680 171729 32741 321971 -211380 69325 552708 97204 202578 118653
12697 118653 263581 -15673 86835 -186498 -178509 -26055 -133856 -47799 -165680 -19578 81747
12685 -60368 286225 113055 123485 25233 137563 248840 291350 161922 169256 158663 231525
12674 231525 225971 119730 400071 -125853 77184 92513 54993 -229602 -39033 272380 287100
12663 287100 13407 93079 140745 413998 140728 141695 25608 136626 154414 211861 58808
12651 51753 -200878 161880 210649 250596 -558740 108093 143973 -32298 34726 -66777 -407907
12640 -407907 -99234 232226 -153159 321337 -160348 373387 -171675 40213 17386 -196478
12629 -31703 83999 80039 288337 188449 97033 43421 105992 127919 174832 82654 137507 -135742
12616 -77837 -60224 175239 -250667 -23463 41950 171651 45781 16237 -143207 -150392 289852
12604 -147148 -11076 260748 119874 143593 148588 46944 -25388 177283 94677 -207931 -23367
12592 249391 89377 32120 -71682 8617 106320 185452 143679 160805 -392918 -90868 -519767
12581 -519767 103585 49251 66991 -10297 3186 168223 251982 146576 131137 407932 150654
12569 -269603 8294 264045 11625 -1656 26922 -11498 226114 70346 -294717 -164183 45998
12557 103045 393977 78976 289685 154897 183238 -194816 -143397 -47951 -173893 -163162
12547 -163162 -193432 38762 -6125 -122643 228747 -252956 64572 -97165 165026 -82396 -202585
12536 -202585 -60237 80994 -182912 299995 -47368 -152300 937 144552 103036 223327 -171423
12524 157734 239534 -1051 208952 37 291306 8345 -93586 38985 -220639 82693 -334116 -163947
12511 -170064 355047 164311 75810 -175914 -380751 262145 86056 307364 169095 116187
12501 116187 -277952 -91573 -36663 91779 -390862 37409 88773 -337510 155369 -194037
12490 -66833 -343207 -143680 -149024 283112 -126375 42740 268875 -225438 93456 -89092 -152756
12479 -152756 -108349 221511 -299290 244295 -155170 74635 -8156 19344 180533 184095 -163790
12467 -104426 -146002 -33683 -263236 29251 -146759 163536 124047 114209 512809 -46149 277378
12455 -273458 66286 -146131 167600 -94095 -157367 10501 -226522 98478 -74115 -216799 -158153
12444 -158153 134497 -261959 55900 96695 -238692 -292888 -71084 -138489 -217098 66674 -21640
12432 55201 54397 -43870 -140327 -239691 -33370 89195 -223659 -22054 304573 149194 -179521
12420 74672 262564 102724 122890 -149483 84400 54562 85176 -305710 -409909 155613
12409 -74061 -71695 13993 234355 -28070 32606 -93205 194481 303296 61112 61414 52545 -69362
12396 -263506 130255 6679 107278 -88223 -213389 -405236 72546 174384 28673 152867
12386 152867 6493 -295771 37930 53880 104514 149061 346909 -94043 -437274 230864 -261087
12374 187326 261683 -6437 79849 -103100 31833 96539 -195997 97523 174175 -83802 -6394
12362 -8835 -112169 -241176 137008 -190956 46019 -175555 195610 27133 59178 142226 97123
12351 97123 171137 82342 -220628 146225 -27091 200670 56450 -292949 12176 -85600 221184
12339 53983 6936 130300 -241602 24404 -15007 34875 132016 88174 160042 196478 -28541
12327 -67224 148437 -180973 -343244 191853 211881 19238 202574 -88048 -28618 4008 -136377
12315 -340882 -25744 -37420 68740 204307 157478 207553 125514 -113477 -173642 -366747 4356
12303 50034 -33209 -107053 -215297 80136 -165010 320195 75956 340503 79629 219321 131254
12292 131254 -15056 193202 162386 110156 17262 -239607 -52749 318141 -310338 -3780 -16824
12281 -16824 436587 -176748 320728 63969 80681 15443 323236 307090 540861 47766 478215
12270 478215 -93274 33472 -164049 116069 87433 137329 276393 323587 -65259 76037 56145
12259 56145 113252 117900 76278 78497 166012 -51864 337008 258353 -161882 148464 103781
12248 103781 68487 -222634 14401 -32315 96295 -38306 20964 -38768 73107 201035 158897
12237 158897 129982 153792 -75401 189779 233136 -104607 87225 257765 205732 2736 361505
12226 361505 170105 72637 473588 157026 305091 357911 429172 394638 354053 271358 291979
12215 291979 407881 -50797 285532 153964 233456 426671 14944 198052 45484 292258
12205 292258 278638 151345 19736 -57474 -170305 186630 198 313308 145766 166679 299893
12194 299893 100788 73662 -177065 -24010 4006 138939 168872 214709 150985 -22570 55387
12182 -243228 111159 132457 -33269 61728 -90301 151293 -189851 126602 81983 -4468 82192
12170 -51224 17156 -105244 -77841 -78550 80228 -325539 100196 317001 111787 -214377 -38664
12158 48708 61408 101700 412152 -324496 -92217 -320518 124031 320004 401784 131819
12147 334757 -57218 25134 821 -289259 105302 -99211 441952 -214734 283271 223846 42816
12135 -157135 123092 -5006 -265966 202428 42120 -100489 -142048 129864 -178542 162743
12124 133 -71248 213174 -183127 238 -55949 108785 96570 -215729 -277729 -10916 -35935 42757
12111 58667 -149425 -151306 1431 281726 -5102 -161300 -7824 -32795 341630 -84154 302561
12099 -290635 -81853 77028 317315 172415 -29750 53723 -17892 -157495 22912 55923 37744
12088 37744 -20202 201497 -53246 160553 256502 -96019 169456 342052 -251032 -106935
12077 -289219 -291980 -76372 160612 -45418 181730 -265305 -133411 93313 128270 -3036 94608
12065 240401 348989 1369246 2196782 736332 -220865 -23567 -175270 -120085 -155232 -120700
12055 -120700 229424 15197 -139858 203679 -113572 -173948 -140908 125416 -355225 53667
12044 -32972 35652 104002 158055 -391028 -214849 26692 177310 311409 -50680 -372302 57063
12032 -94706 63628 -235161 117575 6665 307999 -297622 77960 -257070 7788 -76059 -227299
12021 -227299 193591 -73760 -342064 -181694 78078 90161 219026 -408923 59809 -270832
12010 -111216 112066 -210651 449719 110132 284916 -41157 453406 -2943 -288381 -235598
12000 -235598 -52305 -104411 -174324 -415752 91445 -144439 -214548 3816 140847 -153071 -60582
11988 213558 -137154 -193916 -160587 106775 26516 39651 348159 316799 -260426 98183 165619
11977 165619 -71506 128681 -368277 88306 -133562 17933 14444 -210830 51703 -179059 -10074
11965 372079 -232829 454562 111073 -47747 -554640 -130871 -279936 14714 -43388 346583
11954 -103922 31803 -96871 87943 -20009 150524 282182 -189972 -151297 -179946 21438 137341
11943 137341 53174 221761 -119216 23763 -176035 -172050 -136548 -134179 83625 216057 -2159
11931 -59477 -172763 47269 184993 -160343 -20185 -65713 -122483 -2072 -80766 -17761 -18734 132209
11918 -164295 -485306 152969 -43203 -5815 305193 69590 284195 -151308 -100028 -166687 46421
11906 -60565 80430 278427 18820 311409 279385 -201320 -109047 -190038 -290909 -98841 -185683
11895 -185683 107515 86894 346001 -197445 -13991 -188423 42445 250202 -128598 -113868
11885 -113868 243837 -312642 87400 -275795 -2564 137539 307602 -326906 -10574 -39402
11875 -39402 27629 -97755 325633 -33435 -142404 73228 -162236 -69417 194826 -58396 96178
11863 47604 -203511 267941 96305 -21482 -26564 323239 25355 153 105460 -116135 -232382
11852 -232382 48810 178292 24782 90874 109691 396636 -84825 130667 -596177 -8852 -33476
11841 -33476 423524 -78939 -168268 192536 -95117 -67807 -108117 -156525 -180858 30325 -178710
11829 219806 -85333 34948 -42413 -318438 285327 -163097 100867 286294 -651066 -22450
11818 182286 13717 337933 91500 -211544 -87499 -46885 -27890 -74038 34934 173837 -132475
11806 161372 -13480 138822 -14041 50266 -18591 -28623 218651 159062 127969 -257103 -163045
11795 -163045 -183591 -99987 -63911 -180345 -43687 236098 -25350 -115199 -71274 -172860 -102059
11784 -102059 -134870 11960 121886 -63389 255890 -221870 -98710 63340 257322 -455583
11773 19633 -184424 -135876 -287897 -122683 42860 -56869 -74966 59332 -11131 6792 -191298
11761 -124609 -163991 -137996 -229325 -107062 162044 -120190 193353 -3431 -186425 21315 -239793
11749 415932 -129455 -74922 -62582 -141900 -78530 -263279 -121972 153906 -340113 -129163
11738 87118 79315 -122000 8348 61622 -202910 -138294 149722 -97866 -75519 -130516 -97820
11727 -97820 200587 -187355 -94329 244729 21579 446463 90666 -259345 3156 92122 -99150
11715 93202 -16627 130474 90175 214614 -149121 -357384 -274278 291299 14062 -42671 136059
11703 239874 36386 128337 -188650 -143285 163822 61209 35186 -50354 174884 -109441 44625
11691 144786 136120 23098 201815 -70428 238734 65266 114960 75729 -176355 118931 14243
11679 -125645 -15694 154625 -87867 -50977 64096 114284 493867 80434 -166929 -353282 -90790
11667 -53790 19872 72435 -32494 51647 -35248 993 59355 -26287 85338 111762 -30782 53879
11654 226030 199761 -147609 -52206 -359156 192359 -353643 -276366 36664 206012 377754
11644 377754 168108 503762 -80658 68868 -363870 -30825 305996 79310 119340 -114002
11633 -168670 -61819 143427 -97446 62677 -239196 243623 195825 85600 235449 77069 78715
11622 78715 329534 -114920 204575 -24807 275215 56861 66948 18341 94645 -165812 215373
11610 -150277 -540 -169099 139328 184116 -159112 32867 -146033 184159 107137 59767 143865
11599 143865 305460 243898 -124904 188967 179282 208389 89921 -202118 192660 27769 257461
11588 257461 -116504 165203 22129 38101 -26558 -7885 498368 -393964 -194319 -141738 99340
11576 -352554 -52989 88395 -232579 118261 110610 481623 -190007 -160201 234662 250133 -141572
11564 -61187 -35861 195991 -3594 523568 164231 348018 -162784 -67427 -187615 45337 260655
11553 260655 205766 18775 207272 142711 -159232 183660 294762 93525 248605 425324
11543 425324 163195 60633 28325 -11466 -19675 1244 -24229 -115211 210486 -58460 200130
11531 -63490 221701 13751 40754 203989 56531 189920 81900 268504 231865 -7703 60050
11519 262221 -61474 109646 306799 24976 152883 -19271 32882 112090 113615 460216 109795
11507 -102147 245140 279686 63955 57804 38541 124040 166647 319807 -95085 266023 316724
11496 316724 144745 -11568 -31720 384465 221920 39202 444486 235419 84036 67394
11486 67394 47322 389799 14561 8693 -2935 -111887 328071 198857 174190 258984 -58894
11474 212786 139683 325813 238115 319260 457346 254297 21737 74145 79849 135625 223829
11463 223829 239581 130686 118055 57231 182138 5896 -275005 16106 -32311 310072 69477
11451 108272 24007 311975 143898 153999 343364 -86736 99792 152192 -240999 -10203 -26946
11440 -26946 45861 94226 105452 278355 -238930 155763 200316 122829 -20611 -25694 -216839
11429 -216839 -246426 -191902 -80497 102398 7652 -6420 -78894 89479 218437 -210923 146891
11417 44033 -264048 231329 283510 -49896 144975 -177326 263 -65939 267265 -27075 24828
11405 -166978 24956 27169 -357245 -38720 119684 87943 -71416 292345 404398 35534 -110805
11393 -10407 256535 -29744 106698 -89716 -38965 268946 -182528 174130 179384 378284 75655
11381 -140689 -89116 292714 -34009 -6982 -15945 40605 66950 -2844 28421 46960 -47237 -196523
11369 -196523 -214749 -37469 257926 -45596 10354 -131079 163434 -146207 -29465 205160
11358 -79044 41297 -76480 -184158 -367676 -14731 31841 -269392 127578 165614 -174257 51409
11346 -127538 82967 -146641 51608 48096 -1055 187152 -135009 117079 137138 184620 -389790
11334 -263811 -191432 24863 -159195 77692 -196815 133272 140217 56650 -371967 -20698 -270705
11323 -270705 -154504 -11637 -232178 -99067 229821 248844 -328851 89637 90987 -57836 81873
11311 -122472 -121817 67520 49726 80404 73234 -102995 -587339 71406 -109936 377412 -506476
11299 -76005 -149110 -71864 -141287 -82762 -77969 -152430 17089 286478 -37613 76022 34176 -70773
11286 61450 59173 111938 159672 181835 -292847 -16051 -439100 -300561 77989 315706 -344032
11274 95673 60193 -388403 119434 -443694 -160712 -400109 -192258 179048 -334702 -212114
11264 -212114 -224045 61885 -275164 72891 -294552 -140043 -155092 47809 -23439 -78998 -67968
11253 -67968 -51381 -39423 35795 -131967 54357 -29359 -43313 22500 -4537 140657 90354
11242 90354 301129 -2737 -30915 178784 -157587 19142 24636 109486 65947 471 169103 202535
11230 202535 70449 96089 220465 126066 117710 -238573 104768 -28939 46481 -13902 -202266
11219 -202266 101891 -176545 -24346 -16687 -94162 246929 135965 -149560 -47773 -91314 243439
11207 -79250 164782 227661 47490 108098 -67253 -237850 -86333 -29729 -196753 53214 -259130
11195 -30677 87275 215122 -172329 -35047 357458 -229382 -103423 23234 -327974 -83207
11184 -146524 -79405 52020 -258235 -212350 84735 -21609 109226 17646 35140 36400 -45292
11172 -250162 -110960 -167256 24136 -34395 88249 -415840 -22786 80605 105572 61065 -100189
11160 -270249 24002 -127507 462705 24218 -190350 128219 9576 272664 -35646 -211030
11150 -211030 227974 276148 9488 -116025 -242799 33630 126971 -192333 166890 5061 -92806
11138 -74669 -115071 242565 -370867 -10604 173539 -67240 -122149 200697 241181 113768 65852
11127 65852 42667 302839 168185 -58531 557969 -109483 167673 -119893 233358 199392
11117 199392 69666 -79345 86295 112960 107811 146694 135833 -186021 88863 -150038 -13586
11105 -43909 154056 -195643 204717 73427 122577 225860 87949 293958 -173760 89589
11094 135613 84179 -55843 360368 43167 224370 108476 -129332 -9794 136715 258112
11084 258112 339288 49018 384977 213195 -47343 201022 386864 258006 357106 79083
11073 -23729 400480 212731 501833 225542 515691 81509 286985 172155 408248 444892
11063 444892 310140 689184 414652 377879 292621 487051 382874 682647 261213 622592
11053 622592 531288 548789 454350 780186 678371 534029 982483 1146277 636229 349645
11043 349645 514008 338313 760061 751559 742137 602325 807464 424679 1237940 826542
11033 826542 572407 436922 832878 931684 870026 520554 705062 768516 757904 731516
11023 731516 215259 637588 405696 757899 475317 513559 516619 319984 532234 207505
11012 674219 968480 706896 477231 918476 394613 519753 486003 109975 541827 513800
11002 513800 662848 414856 894128 702119 372320 661442 505923 437044 693974 308651
10991 436952 859851 711745 874656 797136 828290 738897 845130 801626 1172856 1013643
10981 1013643 915341 1138279 1505123 1325060 1076398 1701068 1943203 2353940 2633000 2824268
10971 2824268 2295204 2280746 2757293 2344112 2647668 2120643 1507617 1541151 1845532 1365958
10961 1365958 1121356 1892360 1851571 1889829 1620656 1483018 1876189 1635456 1261633 1505950
10951 1505950 932288 640886 375200 649896 578423 281282 337728 232107 297647 261031
10941 261031 291160 303094 1235 -52149 54063 -108961 379112 122389 96938 66802 -82889
10929 101760 88059 309867 112049 -283456 -114981 17942 212761 300931 -120358 -302137
10919 -302137 -113233 25881 8575 186689 -8840 63406 -40129 7219 -156510 -185095 -75947
10907 -94692 254797 110 89233 249525 -121901 18494 13617 -217144 -43882 191722 -242284
10895 201542 183102 72417 -119380 469 12818 -142592 190383 -75388 167431 80241 186850
10884 186850 -40556 98363 309762 334220 199371 142654 -442270 -164966 -52535 -143768 -108705
10873 -108705 -35904 15803 250922 40806 -71392 132258 9480 -303300 128913 183313 -63258
10861 5792 -34020 -407943 -140975 -12643 -174728 -100297 -10755 -188228 -62583 213246 124582
10850 124582 -170699 152818 -335869 106638 -59362 4200 160563 -196340 -124980 333857
10839 -126908 -19889 -48858 -61332 -180806 -119746 27388 -16334 -171017 216727 -237091 -60002
10827 -65713 -185036 38980 41719 76282 -77277 -394139 -72996 79049 -9938 -131589 89436
10815 197544 -288465 -30507 142485 169654 -256648 27612 28859 -317270 119182 48939 63150
10804 63150 -191686 -263657 -74318 197600 -60749 -117862 -62723 -579768 -65417 162220 -86736
10792 -204635 -53371 -205636 -61151 50188 128611 218970 -17187 -25588 138972 -65938 342756
10780 -359891 -10132 252225 356450 -46785 145954 103727 -32550 -47657 394590 -74749 -15107
10768 34508 281285 43594 92647 -161275 67711 25543 -90137 135525 -123092 -194110 349569
10756 117249 -7923 134605 115024 85589 88407 -244487 325864 -227111 -154314 11123 192042
10745 192042 239773 -209772 -245202 -33109 -142324 -338756 110010 -185816 -203555 -192195
10735 -192195 -130055 -128256 -146550 281566 134114 -244932 -105471 158793 68334 80959 -3229
10723 -121165 -157420 81623 -43898 -231273 138103 224355 -189397 -136984 -133892 -570074 -132183
10711 -345162 116408 -61152 72472 48505 -332912 135106 -431755 -70249 20971 -212429
10700 124285 -162986 -50464 224112 23803 -330612 -61856 72427 -148254 85008 4811 -157146
10688 -83957 -173262 -117084 -172204 -45325 -71891 -68004 -62564 -136799 156665 389276 142114
10676 142991 -141668 49634 101036 140307 6645 -185165 -336908 -58088 -129249 -219492 -145076
10665 -145076 -78748 -310767 -189578 -185640 349227 29776 -248487 -273064 -77711 -106545 274788
10653 -208241 -179460 -356553 49147 -155381 -80921 -200774 78479 142857 253905 -71969 -73290
10642 -73290 -102556 69310 124679 323305 -99517 -72624 64543 42555 -49766 -230634 175210
10630 -3500 -16276 9912 -346211 -155999 -105665 -139555 153747 -14202 243589 -97102 -8297
10618 -258523 -78033 -270109 6026 219587 173664 -252292 -29490 124460 -256235 107127
10607 47342 -69152 -6405 -110388 -22050 43361 -375484 -163544 105915 -178670 -30136 325790
10595 189429 -74804 -48130 -327814 145367 163935 -19614 19890 -329157 6434 -339952 -20324
10583 194857 -125629 -42355 411427 18013 -80601 -45792 -75831 -251967 -88445 -246171 -165921
10572 -165921 -287984 -144774 -191844 -185720 -120562 -27365 -45198 -173495 -111764 5933 398162
10561 398162 -37550 -147392 -119714 -130842 251616 -20315 94078 -466048 -430050 -235196 -82429
10549 -236366 70615 -68406 7252 -164998 186071 -51078 21004 -182608 132600 -332616 -128200
10537 -159084 45126 117983 193822 -231847 192972 -250215 28300 74317 -106813 65488 -165911
10525 -26413 119722 -51978 264672 -90828 370750 -202287 47409 -141482 -185183 -142959 49279
10513 -210368 190529 157662 191850 -79308 45823 -32527 21452 -162065 192596 374335 81517
10501 -236937 -23182 -77041 -248873 11815 -16159 204219 84285 59127 78870 318630 -247912
10489 -8334 259447 -442665 12948 -149099 151805 -18161 -16332 260593 572493 617356 408575
10478 408575 543949 -282339 -55246 219614 97166 -44668 -196118 190063 86193 -67657
10467 180940 151503 156519 209415 34811 -82736 -175478 227809 326253 12304 -91204 59891
10455 77704 -121464 -16237 41619 -212625 -83677 -56332 -250426 171397 -121418 -190427 163678
10443 -155269 138218 -176450 -71398 54541 -269498 28718 -40959 -231220 -62 12285 356844
10432 356844 17206 -14719 26160 -114411 -413709 -35436 -140705 -97707 -39056 -280940 89430
10420 -168427 -62844 -159981 8684 14372 -103316 -183933 38578 121584 -100973 -95880 39487 -223163
10407 -181941 -70670 -271174 140371 -8623 135457 -159658 -432948 -40701 -244031 117327
10396 133848 -92510 63070 -20309 199105 187118 -180639 -39079 414045 523399 239620
10385 -21668 -45144 84528 97921 204393 247833 392314 90304 137683 256384 186456 481874
10374 481874 287131 436740 121857 262754 236980 26349 406718 38342 501250 451629
10364 451629 127861 231114 199817 375115 334268 371907 270315 180368 98489 106242 96710
10353 96710 43670 561816 646732 560517 244765 264739 358925 -9502 240156 221655 351951
10342 351951 16322 -175161 49520 350933 348755 623565 -277740 348475 413333 123171
10331 364755 268758 -255402 -46144 28256 182348 160903 -15391 138331 91543 166001 171953
10320 171953 97840 223485 411726 323350 -138923 79578 -81511 -19746 42034 -6296 -200806
10309 -200806 11344 -89383 48124 210341 35502 110246 -31572 46735 63943 -152742 311321
10297 52802 -70820 39553 84942 56909 330184 -149209 282367 -12619 -218501 1257 -38395
10285 -468518 146328 -182296 -361345 94705 -173186 -147229 -358825 -6674 76073 11471 9713
10274 9713 104169 -1781 -127974 -20065 -15487 179560 316263 -103875 66988 -228548 -75652
10262 209771 197724 17704 152183 680775 -315953 362691 117215 238445 15455 146366
10252 146366 191576 180839 100168 -285434 9407 101902 -306000 -46210 228451 68725 -457
10240 56059 -76647 30433 68399 -366417 -214169 42540 84055 -249752 -284299 -185960 65014
10228 147714 -92270 -187366 -168453 -7467 11251 -82930 -384465 179348 -298807 -322372 589601
10216 7123 28738 -280053 -37468 208522 -43965 118076 -177540 -247414 -493664 2001 111326
10205 111326 60104 63433 18248 -310755 -79031 -300491 -89133 -345866 197149 -75513 206758
10193 112173 -308953 -171902 -276723 19394 4520 274338 47161 -99874 130713 -69924 -270758
10182 -270758 308546 -174086 -240795 160179 -58293 -64166 -150993 152897 79493 -287429 -423178
10171 -423178 -50365 -267566 73726 -124013 -135459 81312 32261 -73664 134787 131877 25450
10159 -204172 38877 -312811 -239105 -29012 -128206 29269 279705 18804 245152 -86330 -121658
10148 -121658 -95738 167783 63004 -58645 195409 -409801 5412 -278829 -95111 166716 -8426
10136 -212881 179857 152886 38323 -30187 -106350 -5186 -135634 -71802 -115852 153728 -197581
10124 43679 -120709 -163652 101711 -120977 -200513 -235672 3849 -250688 -40412 -189352 91365
10112 40373 -211558 -100541 101399 -241719 -63857 12711 64376 36912 -131473 101234
10101 304427 18678 -137654 87462 231242 20154 73418 -160943 -356072 -99039 -156012 -250312
10090 -250312 143765 61058 -236242 115533 374724 -371125 -58518 -49592 95598 6046 -240600
10078 -248746 -27712 -275223 200080 -127650 97493 -5040 -111649 27710 -97249 -165600 -250390
10067 -250390 -151894 -203875 7125 -43302 -165707 466498 -114131 -13876 -318041 32145 -227264
10055 -113051 339222 477836 -51907 171413 -119523 -455023 120367 60726 -87465 227461
10044 150061 -227696 -53798 -418052 -127764 155079 270369 -245853 -229554 210155 7506
10033 231135 -123096 -244750 -438528 221479 -100391 -7768 -233299 -136623 -63931 -74141
10023 -74141 4613 8255 146362 -159337 -196390 -223462 92920 4355 -123512 44166 -271186
10011 229535 -237370 192794 -316953 -46742 236907 -11437 133487 -59855 20858 -228423
10000 -31455 -310436 -218390 150075 -36939 24023 -36664 109993 -205610 -37269 217983 -418872
9988 80682 37436 -249449 -188471 -156468 28575 -43814 161464 -8512 178172 -292110 -21773
9976 -274629 -351554 -59837 -59111 87241 -154072 -301025 -97722 84089 -128005 -371321 -229139
9965 -229139 11929 27408 -145276 -385967 -29561 93378 209283 -218335 -38094 -156960 97483
9953 -639 22514 40552 -246407 99784 86746 145783 -398660 -10084 -219341 -4867 230147 249975
9941 249975 95870 -93116 123619 -242495 -25903 -106598 -167009 -1553 -244611 -69997 118665
9929 -193078 -225728 -37910 -104943 -208029 134853 -61910 -79509 -23897 367570 -9333 -148637
9918 -148637 -343216 -297594 -207109 -173011 -425560 -220540 80347 45871 -285898 -154243 -196322
9907 -196322 70155 -56358 -313274 18423 107772 97910 196352 -10686 -256747 -378601 400877
9895 292497 42498 -123666 148021 9302 115659 -134797 -131938 -112040 -112665 -6056 73057 209669
9883 209669 -88630 -223170 109551 297511 -146265 -201225 168397 -224454 140246 36466
9872 136703 -321557 -31218 85943 -225667 -133629 -507412 146274 -23177 -3679 58217 -258490
9860 84315 179919 122216 -379272 62903 -63758 -323102 -46960 129487 -289902 -78084 -477369
9849 -477369 -343406 -135373 93939 -28304 -139649 -73984 -284142 -109808 2238 -501712 -190554
9837 -171800 -225048 -160401 21097 -242337 -130999 -142815 -29079 198190 100125 -199685 -85349
9825 -283576 242460 -126841 80385 203966 109441 -42545 230683 -252550 -61123 -32946 9998
9813 249055 -285967 -247685 -132294 73823 -4558 61012 220583 -122142 -130744 -119239 -48783
9801 40931 -127667 -270265 -242768 210481 -317801 -298049 185460 -44840 -306109 -59893 -167651
9790 -167651 405 29666 40911 80165 -93671 -207031 -19645 -218514 137813 -210193 109256
9778 -335248 -39137 32410 -88601 24216 -189885 85157 53610 48974 51121 -65624 -31050 218501
9765 -313752 31320 245895 43661 -61226 -87998 129592 299097 -388503 204454 423448
9755 423448 -254323 -57292 75738 -385549 232730 50684 -134091 -15130 -1780 84272 -135204
9743 -193860 -70855 -239066 -5887 76938 72619 -191041 170512 -264464 -59825 -54677 -63229 -153389
9731 -153389 -267735 -217150 2260 39066 1701 126630 75216 165503 24701 -214918 -16096
9719 -80285 16471 30989 119026 -45085 -73617 104930 -319792 176144 -3498 -77866 49070
9707 -303233 -323654 137002 -113207 -128979 18907 -90315 -224949 -112652 211880 -187908
9696 -59742 -57092 -73656 237616 -30104 130925 193056 -82601 -121606 88277 14202 200209
9685 200209 -86352 -129471 70982 27698 -155761 95772 -214766 -112181 98111 -184066 -217794
9674 -217794 -37518 -109496 106764 -149267 -109827 118885 -39530 155990 72766 -48039 -449053
9663 -449053 -600903 -177008 -272850 147503 -8915 -156650 61554 -229818 -33796 66509 248126
9652 248126 -474079 -282984 109761 -334032 136373 -78932 41111 -18875 -196715 22734
9641 -175763 -70003 154096 103489 -16932 109236 -135842 90838 35612 -320542 148479 81406
9630 81406 -282109 64140 314783 383259 -114218 -96814 278100 -75981 -142144 -76455 -33045
9618 -347479 -55694 -316869 31891 -307934 -12577 -116582 336242 -114099 177759 403397
9608 403397 31148 -75571 -170763 3976 -154767 -351546 -55056 -38711 179971 67059 170969
9597 170969 101060 -102720 -30776 80738 -13912 -352665 86274 -21417 -109987 92134 -105917
9585 64186 28853 -51399 23236 21629 -13269 -48198 -283360 -90119 72621 -35901 -48072 -51377
9573 -51377 -50696 -193651 -195806 -70332 113379 129600 -45109 167732 80741 -202121 111445
9561 -4128 295608 -127549 -460911 -112460 137103 -303918 -23493 -195077 -408534 -55007
9550 -276310 122261 -46957 -156879 -127171 -23930 -8301 274400 -102266 75411 -169809 147422
9538 98561 -298191 501321 -188747 -94481 28317 -14313 -21404 -10103 -80689 -9291 100768
9526 37242 -151354 -32741 -124993 -171131 -108755 -92039 -1192 -159891 248317 -78648 112047
9514 21380 250959 -17166 -127786 -167742 -4092 -434376 -182651 18224 -146009 -466815 -157599
9502 133639 -259658 -35799 -41599 96699 -85369 -337010 -79681 -499373 -186981 138963 121517
9491 121517 110929 -103887 172916 -203880 -109222 183647 -246217 36690 -576330 -345663
9481 -345663 11850 -71243 159339 -96587 -235026 144979 -62503 -15437 -426296 -77527 -104491
9470 -104491 -217933 97446 -328142 158514 -264821 9156 77740 -237405 -455146 219087
9459 -108378 -131447 -56736 -269433 13001 69387 -385712 -57371 -39724 -264502 -62738 -179933
9448 -179933 -200478 -112453 105535 -114087 -15457 -28655 9267 -42346 10686 -180318 110817
9436 -52189 4317 -56367 67927 -206217 -10723 -132544 164152 -6164 -190853 -226589 -121005
9425 -121005 161198 -15026 308410 196220 57195 -63908 37446 -39129 -39562 -341884 -154634
9413 -219571 -45666 -79161 370291 -164973 -138922 -55365 91046 284241 -199226 11267 -125275
9401 78624 -8069 45134 13851 -52068 -82698 -110853 103707 -163190 275774 63306 43208
9390 43208 -117981 239636 -177272 -33795 -66778 132452 70434 -171063 -49422 -307076 -90395
9378 -10393 -302683 -152366 -56558 -248564 -119397 207680 -20461 94326 -226517 -69741 1013
9366 38218 -7453 -66733 -297239 -129703 -122673 -221331 23397 382015 -50102 -232188 -290960
9355 -290960 59287 -219303 18754 34293 17945 -167575 -138040 94170 -112775 -42665 -9186
9343 30121 -64528 -129772 -192792 -28906 -430580 -237488 -218088 16666 294488 -193724 -23180
9331 -58077 126476 -205172 -389911 40352 41727 53391 -192436 -39999 -70236 -261038 13703
9319 -326656 179918 -45088 -126917 -160583 21074 -94925 -307478 -442586 -38633 -33316 202878
9307 118815 120548 -149033 -395070 -69922 -244012 -145094 40113 -15860 2628 -199388 -291616
9296 -291616 -167980 -18327 -76450 -40110 138148 -319257 -57146 72173 157990 99246 -312107
9284 6277 -41744 -139237 -227672 -115971 -64917 -244870 131342 162429 25607 77101 9270 -56159
9271 192696 190860 -198095 89063 -149809 94334 -266429 109443 -102823 -49321 -205532 -194566
9260 -194566 -30952 244491 -18173 158854 -22838 -81905 -70257 -105716 30954 -150659 70507
9248 311054 72285 -37146 -48592 85404 -151518 44075 -63993 -127360 -298649 -497 15288 6424
9235 -195878 207963 103057 -29083 -248316 -313302 13499 113782 -218845 -368654 -74079
9224 -177237 55229 -174470 -59624 224799 40614 -289695 96052 -28329 -280507 -66468 -307021
9213 -307021 -101972 -10399 166245 -283187 -256487 -5149 -89870 -115531 142703 75656 -434212
9201 77854 205371 -15719 -181305 160128 28525 26183 -323251 32684 143130 141436 -2868
9189 32341 191625 -316214 -29605 249743 -159315 -220046 -119329 42314 175402 -78416 101114
9177 -23261 -366625 -394076 -151049 79253 33417 -264408 -277820 -197461 51805 -74021 -206079
9166 -206079 249053 -68799 -277423 192342 -134083 202828 6987 -167597 -143901 -209915 -125368
9155 -125368 98581 -154479 -44673 139482 -166775 27778 -241586 -180605 -93804 66023 -44672
9143 -197906 14439 -287049 -130995 103826 -13876 -181707 39158 95338 208475 -115248
9132 124473 -115204 -45853 153808 219579 358064 -283857 -94879 -56472 -146308 -23930 -190162
9121 -190162 -465287 -77951 -13702 -105402 151342 -122217 124815 107855 15597 -324950 -64724
9109 23130 117029 -160480 -300444 -120706 -11334 56467 -325725 -298583 250989 -4563 73657
9097 46925 -121658 5574 -167598 -221164 -14324 169384 -23745 -236343 -385005 -327786 -355919
9086 -355919 -351380 101372 -168171 -48113 -62240 -70699 270310 -109634 -103299 -219606 -238347
9075 -238347 249722 116330 -45992 -40430 -64970 282502 -212806 -109359 -15906 8125 115865
9064 115865 9380 370539 -164071 -15648 -203572 -193056 -28203 310837 -76531 -231652 -74069
9052 -194371 -260369 212896 -123621 -289420 36808 519 -59558 48856 46395 795 86922 -213463
9039 -307300 -371669 164586 118710 148354 -122292 -130615 -101329 285025 -189346 -58080 -6207
9027 -3752 -99269 -75060 -212991 -134303 -294914 231531 65254 -72823 -354343 -180573 -234203
9016 -234203 -45135 -165517 19585 -24679 -217441 -147161 -51099 -244556 82762 196794 -193568
9004 -143092 -208846 9999 -67657 85843 -141255 -28382 -24718 -467188 155573 -95852 -71803
8993 -71803 -68205 46407 -72877 41405 25468 103894 -44361 -364806 -94205 176490 214648 125675
8981 125675 228812 -49 -278724 -62711 -265713 32697 34143 -374226 173183 106418 -369421
8969 -182425 -317553 69346 133171 187271 -463821 -227654 -443649 -185314 -140485 232477
8958 -87639 -104793 244615 54168 -250016 -107991 -380360 172686 -59595 -4465 213034 -319284
8946 18655 90265 235153 55978 68858 -144839 9272 -9448 -106422 65001 -262118 -110974
8934 848315 233726 123941 -178387 423415 80681 36666 -69330 25437 -100013 388386
8923 1731232 6122092 20798944 4944091 1366018 626918 557294 474882 344374 460641
8914 460641 13080 36714 -69056 145711 -251024 359970 -137801 -57853 -28481 -290158 38835
8902 -161700 206038 -29665 -23791 391488 -335259 -206912 124143 -139228 99331 -54960 -105425
8891 -105425 -171575 100511 -80075 -98660 -260730 83062 48446 -19294 172561 -61421 -134509
8880 -134509 -179992 212650 32254 74129 301344 -247012 -26385 9286 -409493 309293 78082
8868 -187601 108022 1234 -105118 -335957 -128492 80507 -354222 -57937 47979 -182065 -65702
8856 -195957 163635 -205274 59092 -217933 215729 -74126 -215449 212326 13133 -16699
8845 -100861 296826 -80790 -233209 350794 -339181 99657 249489 -72803 -176367 -65425
8834 -108330 -380115 -270311 -68553 16662 -54202 282288 -168343 99061 -928 4495 7006 175056
8822 175056 128730 -81135 -223266 -421513 -206352 -276308 -438049 177750 38729 -159308
8811 135370 115285 -192781 -80178 -308327 262932 -124436 -103187 152765 -60959 38548 -72009
8799 -399542 379831 -271660 -201346 -79195 -182989 66651 -11046 -119658 114164 143900 -47070
8787 -5562 -36449 -38721 -178417 -235594 -76425 23658 12991 -19360 -196743 -139785 74528 -79759
8774 213336 30534 48902 412458 214255 146789 -96200 114270 134363 103149 209468 -150335
8762 -32773 -176734 -84413 -118694 -55295 148357 32973 109864 55516 -314583 -123379 166796
8750 -55614 -184379 27325 130011 375289 -84921 251136 -205463 -50715 -202783 -259690 -173640
8739 -173640 -196646 8709 -210831 -275912 216840 -43045 57269 48352 68652 -125434 -399258
8728 -399258 91631 -92844 -236338 -274942 -225075 -179245 114339 -157817 -232799 -268393 24380
8716 -34035 -131329 423878 -298455 138122 398669 -132255 20266 130743 -98415 -195020 11735
8704 69651 -244125 -225634 -31462 93195 118743 116215 156865 62068 -294079 117287 -43689
8692 126846 -42848 -418084 292446 154873 -96919 97166 -100367 164032 -137851 82597
8681 73947 -196989 -165561 137158 -18786 -35130 33403 175458 -93746 -80462 -283736 57563
8669 -55859 -58445 -304824 -186436 4067 -85607 -7524 72575 -179761 -185642 -208350 -242425 86269
8656 -177805 48868 -337004 -204831 -113802 78714 -74402 -73613 -172848 -96109 36853 -102092
8644 -158139 37152 -56722 90523 -25049 -89187 107860 -22601 92149 -96376 -45064 316077
8632 174495 157330 121607 16407 -27985 102453 19151 -130401 13 -217970 -46614 -353440
8621 -353440 -92587 -169129 92372 -147228 -219495 -150521 -144 -261791 -256103 -137611 -355225
8610 -355225 -259432 72750 -112858 -223431 26654 17052 -337658 -249554 -87423 -18600 -9749
8599 -9749 -122860 -122512 -34647 -36043 85560 13840 -39709 -22186 -137085 -62278 -327556 -138908
8586 129516 114916 19142 -155217 95729 16646 -163403 -233587 -254890 -44191 -478627 -38896
8574 84594 -150690 -380915 -74369 162125 -5956 4060 54231 35597 -297410 -169889 -49475
8562 -21280 184630 -81249 212153 -66410 -141997 165201 -244572 97416 -129598 -48391 95885
8550 278349 -270598 147589 -220017 -230040 567418 -27693 76148 32194 202382 -528847
8539 -344675 76599 -22319 -497178 -346851 -25061 56862 118794 -226492 -157147 -186945 -53003
8527 385583 -12490 -25735 -325780 -108014 -132063 -150201 2021 17894 -75997 -169905 -301382
8516 -301382 -143433 206508 -64463 -35470 132341 63000 -185055 -12852 76153 110436 58088
8505 58088 22979 30278 -227292 156068 249803 -254938 -156689 -80876 -157605 -148924 277861
8493 -343469 -61378 87103 -88385 -292652 -248823 -94279 258581 -336535 98314 -119174 16575
8481 48372 120650 -123194 -96860 -141277 -504703 -141693 -78878 -81281 232578 -104332 30841
8469 -229522 37553 52320 17657 21239 -88469 -173487 -136688 -112072 -68942 196737 -372469
8457 -252631 -214380 318568 -302273 150225 144715 115542 -92908 114541 720 -61381 36766
8445 108542 57138 118749 -16712 -127918 -133142 -62675 -78077 -168726 -10426 125124 5626 -8079
8432 -41958 120931 8274 -178685 49091 -195585 -77964 150353 60966 -123809 -155426 -261278
8421 -261278 -65680 -42056 -285424 63880 104927 -127778 -59363 -185651 -111322 147330 -101740
8409 35843 36423 -67720 -70634 22453 -87576 71548 -123969 -72414 2141 162998 38815 -170515
8396 71515 -80981 -195332 42717 62840 -133949 108181 497 26614 -193216 27463 -4303 -5252
8384 -5252 -372676 -156052 -314432 -93118 -215348 -181838 295343 3575 -36881 137036 72375
8373 72375 -96156 68597 30244 -114161 62817 -123658 -76793 -253864 -50278 146809 24644
8361 178776 132334 -189603 -25108 -62116 49749 -56053 -194365 88627 -107536 -45002 -49398
8350 -49398 -42974 -50581 -135587 -146855 -72050 427366 52094 -94071 -107826 -26228 416487 -55926
8337 -383380 97632 76439 -112659 -173151 -47803 125796 195936 20443 -51968 -165141 149927
8325 -267878 4133 62480 -131 -1121 140735 7266 -361966 49818 22186 10407 -295248 43706
8312 -343605 -71587 -153970 69321 2083 -109376 -144262 54014 24184 -211606 25734 -29598
8300 -171564 299204 -284970 45643 104592 43012 -201211 -34247 -54042 265623 13437 -122849
8288 -26062 -154097 -128142 192330 212102 -146161 115528 -157680 -139166 68343 44819 -84001
8276 82945 -26433 62990 -175623 -151715 -1414 -584867 98519 -104063 -96971 294817 14597
8264 83833 248245 -191421 -217017 17739 56555 -52799 -53687 114776 45245 149781 -290936
8252 -342480 -494 48973 -2334 5596 47782 -36888 213361 -281266 -74040 439172 92434 -68201
8239 -13061 221488 87768 48751 208235 -160775 261553 -262174 144188 189089 -250541
8228 -118189 -301741 183734 97085 54281 -72703 -158741 186850 5187 -44052 -164236 40942
8216 -40104 204077 -181217 -201395 114390 -139194 55558 -174699 -106614 -117300 63833 49783
8205 49783 32703 -220992 178311 -53095 134873 356111 -125938 -54675 58049 -70933 52641
8193 24586 -173770 -215165 -89074 -57116 -466304 -165441 76011 -39223 -210777 -123926 -14371
8181 217504 -200261 173571 -74799 101500 154445 -120743 -342451 89975 -315054 52457
8170 -84915 -59550 -238724 232370 107716 -99915 -108357 -38295 -183066 56909 68788 323094
8159 323094 -209619 -211325 -69557 -240256 -189 -79646 -228092 -151382 17729 298321 193987
8148 193987 76286 161215 64733 99880 102176 -18096 81210 -84446 -9339 24432 71879 -254931
8135 -237873 -57240 -292738 304024 -298334 -336542 -135863 -287330 -18117 -29589 114806
8124 128786 -58647 -292948 100238 -24529 325135 -491289 -251830 -111960 -13471 -139361
8114 -139361 117348 -40462 -65277 177159 -191798 -223312 -82166 -107930 70652 37077 164118
8103 164118 -179802 -278677 -129311 -66221 -7069 -76470 -399313 -104497 -257891 -208598 36565
8091 -212318 -64665 -215892 21420 -200141 -210159 -20027 -403771 -331861 -311425 168855 3345
8079 -119012 51875 -74257 -32437 -72680 -176735 118047 60777 -140212 93449 78039 -95040
8067 54357 336953 308083 86070 179262 163854 -158553 110824 140832 14056 -17791 -102791
8056 -102791 153118 111908 -182702 114142 -257401 32981 -104147 -55640 -245070 87019
8045 198521 218920 -627599 165815 -63302 54998 207083 64936 51871 -108564 325078 -10531
8033 340691 -170888 -71249 -140368 -180214 -193618 249923 -216540 -62094 -325152 -18988 -390379
8022 -390379 8774 -76638 -19032 -14518 -313859 -13598 163141 274478 -229110 43301 77472
8011 77472 255750 -5934 203367 -173040 55837 -195917 416049 50460 -91057 -18168 339626
7999 122182 57442 78672 -52435 -148535 171332 -251629 -350069 180765 -250369 136906 -195193
7987 -190061 -192078 -202198 -161836 -155393 -103911 -148650 -92341 -126416 107637 161062 78501 -46614
7974 112816 -111514 -172987 -47316 123914 -50688 50501 32700 15375 115993 106888 24597
7962 159130 -311172 -164725 -90202 -362243 -73250 -51819 -324202 -34555 14037 226223 -126321
7950 -455958 302299 42113 71054 -24929 10837 -179116 -134434 69018 -303867 14833 -285498
7938 -226509 9603 -98452 -190329 159612 98569 79621 165408 -76562 -14083 30523 -193884
7926 564641 17556 -301211 27917 202138 103633 -394459 -74732 -324526 -140168 -157180 -135316
7915 -135316 431127 -161334 -155511 -199330 -123921 65569 -181777 -199137 126699 -70205 -1240
7903 -5088 -217869 193391 -250648 -251737 -285653 -21612 162886 -289982 224622 103700 165066
7892 165066 -203336 70136 -269159 -148451 66597 -66809 191029 51290 339486 -77954 248123
7880 -155802 -144287 -856 -114740 33247 -269704 220143 -40932 -4911 -75428 115205 -54531
7868 182631 -70199 64790 12225 -300823 -118895 -294861 -163927 -187377 92652 -272065 170578
7856 -47811 -185887 265645 -47903 16557 65568 330348 180668 140137 -89047 -81809 161020
7844 301343 201647 -34178 -72907 35125 65953 -148164 -251278 -197273 25099 -129348 -174406
7833 -174406 170956 237171 -65312 108218 -240424 139820 -190216 -331431 -13320 -338538
7823 -338538 76841 -130275 -307384 91510 39609 178806 -185625 -83472 -311792 -169334
7813 -169334 -79645 -126483 162010 152332 192808 180168 -132530 -49448 137072 61447 -165296
7801 -359136 -312282 -329129 8333 -85790 -19791 -134259 -353355 -136033 8844 15501 104151 -217298
7788 -177502 -119258 246287 185189 69569 -334092 51163 -95604 -21039 -194708 337486 145944
7776 41792 -283092 -153040 -187996 -79105 104019 145536 -282421 55358 -133598 34608 -48162
7764 18387 111522 -86154 -157731 -338851 23528 244942 -520762 -54316 -19148 -132539 55564
7752 82282 21473 -139702 -122983 -169428 -35308 254089 24504 19389 -42011 -264399 139148
7740 -59069 -114038 364590 -89690 135375 408810 -555887 -41756 12561 -134373 164601 52850
7728 188179 -181288 72248 45249 63955 120460 -36025 -103300 48898 -65291 -53253 -195852
7717 -195852 -11437 16370 -225006 -102110 -62043 143274 -280293 77061 -160326 -69091 -142256
7706 -142256 234830 -21036 -171605 26451 -65248 102566 -31603 -60427 -95143 -21814 246915
7694 247070 -277612 -121048 -9177 -81756 -177565 -105915 73195 -360283 -80262 -159991 -180840
7683 -180840 127621 47341 267248 207277 -171572 -460873 80322 105996 167585 1465 203022
7672 203022 11007 11992 40384 86996 139975 -16990 356943 177862 -48273 -487707 -61053
7660 163186 -304262 90784 -227306 -27316 -350159 -16047 84437 261898 273801 80461 21323
7648 -237679 100416 -285508 -422100 158735 -144436 66827 34337 -380156 51624 -145551
7637 141770 82258 -17727 69492 -180564 135405 -333447 -16669 272539 -43228 -147456 -110123
7626 -110123 148089 30128 -110391 -66111 25359 -105177 -43504 -222739 38815 -91238 -183351
7615 -183351 229078 -29894 -92140 89884 240881 -31388 188880 -128830 -277472 -287622 234643
7603 -355993 -110434 193129 182518 35000 -211473 106206 155439 -251466 6570 -185848 10024
7591 10522 -364975 129235 -170718 337122 15802 40231 1343 63345 90814 44753 348602
7580 348602 -96270 -150298 27780 140678 145687 -36210 37270 -59914 -201725 -126793 -233941
7569 -233941 17395 227478 -127193 -268905 28900 183000 -604367 -285100 -127934 -280413
7559 -280413 -221776 -507681 -242634 82341 -442662 -91799 -50674 -199527 -24763 219584 -73338
7547 -144140 11639 -410271 96375 -148576 -105357 -140124 -268356 -267874 -22873 -296442 -22201
7535 -226878 160571 -54144 -219743 -19678 -143750 10736 -146216 407907 193027 -274718
7524 127841 -89858 55896 -316755 -78348 68284 -87829 206619 -90947 1682 154428 -160382
7512 -55830 18123 -196087 91902 -147536 3875 185750 150319 -19746 265192 -37723 61403
7500 -188684 231231 -60010 291657 -236944 -53434 -35745 -8918 -176744 -64714 -184689 -7141
7488 -192526 77444 -89703 16120 -108134 -58935 -8318 -55014 -923 168241 -200462 64783 265413
7476 265413 -94713 -44878 -168279 193054 -321048 47069 43151 -53703 445489 233407 -60429
7464 228898 -57489 -259984 -358070 -146282 -38244 45804 48191 27309 206049 -350903 63892
7452 -179843 84599 -37490 243052 -156490 -155272 -243942 22787 -6169 204984 -130687 209303
7440 -141286 104363 -186718 81365 -103998 -1167 83266 216815 105890 -73952 55923 -182544
7428 -19765 250674 374471 -42810 -128006 -127364 10310 189157 -73743 -115210 -358954 223496
7416 -221996 -44239 -26925 17007 -221919 136585 248151 -168100 -131210 17208 -148240 -202193
7405 -202193 174026 -88359 -136853 -214103 -129751 13141 237027 95870 -87139 -61642 -137390
7394 -137390 301896 -84159 51428 -158923 -351170 17245 100898 7394 1890 145231 117924
7383 117924 57433 13003 -41600 334447 -184542 8399 -127242 -142496 -404534 -69140 21171
7371 -51060 -189384 -135765 38778 156705 22172 154038 -48884 -36708 157982 116454 81497
7360 81497 -220140 962 93194 -119286 -105825 139159 40377 109139 8567 -10635 -32603 66142
7347 -10657 -59730 -174565 -148471 -67449 -61743 -116540 161689 192702 -269261 -65927 615687
7335 -72731 -63105 70261 286509 -12677 58152 -18085 -86583 113550 258727 -19419 -86402
7324 -86402 232642 -24571 24307 -252227 -94311 441381 160221 -119290 -113868 323173 -34090
7312 70265 -176340 -230964 -134799 -127244 -209850 -125525 -183529 -173625 -70049 -356838 210911 8295
7299 -48229 53304 -4286 -216038 -327006 -128112 162102 4043 338197 26491 256462 26685
7287 83331 -177454 151624 28390 -62363 -90085 -251147 147754 -26319 19142 125009 55976
7275 107881 227915 -177091 -282357 -52516 11666 -45005 295012 -218201 211670 225657
7265 225657 -110888 138651 93391 198373 -202805 -166007 -226157 61696 -38513 344266 11566
7253 -9383 -132973 -16500 -323096 313795 16444 -198086 -453210 145684 -41089 -60152 -214639
7242 -214639 -45897 -88497 205320 -235199 -251040 -264221 65150 -28225 -137677 -176919 -193037
7231 -193037 4061 98296 -142596 143720 29688 334413 -62932 72130 52669 99882 -303633
7219 183627 -217001 -243432 -166697 -109950 196641 287438 -156639 25545 -51114 -310668 495656
7207 161134 14446 146432 -17521 146955 -233288 104788 90028 35891 -85419 -152272 66789
7195 -131147 124588 6062 -27882 90352 153002 3124 -377654 -133697 -10755 -146674 -353925
7184 -353925 127397 -207366 231120 11545 -71417 63545 -80092 47507 154451 -86491 -214142
7173 -214142 -236284 -109001 -20004 -21798 75688 86007 -291074 43140 -134719 30238 -475642
7161 -323045 114190 50060 201536 -43154 -152185 -104517 46933 112282 22083 257649 -237615
7149 -246059 12488 -64267 277386 -105944 -224634 -87925 -78266 -7728 -49054 -84437 23622
7137 -51442 284445 -178478 -140578 69689 134611 43513 -35175 -382608 189389 -39591 -212269
7126 -212269 -94545 174115 -154375 21031 -225605 9382 -15498 -16319 -121945 232460 -102141
7114 439796 -11556 -2995 83775 -140760 -102624 129462 -41677 -51096 261175 -1676 -168666
7103 -168666 123274 46177 -35912 -238819 -183874 -31766 -173030 107979 -22880 4094 9560
7092 9560 -135903 15644 -171033 46315 -120538 78071 82099 -226622 -206279 -28168 59647
7080 -278232 174834 41292 -117649 202208 91853 -330743 45541 137911 -277014 -141650
7070 -141650 -27873 20969 110779 -65053 397780 21617 192619 139312 -102788 -14735 -886
7058 95009 404899 188158 161813 96995 63600 -257948 -501551 -315700 -139866 243730
7047 44554 -29460 -211775 -27219 81036 -17752 -222005 2224 29574 36984 10466 -63070 133186
7034 37787 -118775 -312882 131998 100323 332588 100378 -125185 178084 -87027 -157040
7024 -157040 -140345 -199581 -156793 -64077 -72470 88912 -207475 -149292 -64311 228881 -3566 485999
7011 -55523 58455 -337850 -85656 211682 153236 81200 -137242 204941 211086 -138218 -94022
7000 -94022 73511 -232377 -121030 -151669 241351 -299176 -279231 -121249 -192127 -309499 -168151
6989 -168151 -11009 -492607 21818 -74473 20846 313539 107345 -100909 95986 86820 66343
6978 66343 243897 -260419 -146840 -70114 -13101 -103053 425546 202829 10882 -255680 -91596
6966 43899 41509 -223960 139544 -46389 -370072 115333 33253 -209141 -323346 197502 -302506
6954 31299 155502 -221130 199517 -126278 -60024 -18083 18364 -7915 -200337 -78428 -311475
6943 -311475 111016 -158530 -204540 142261 -40967 -3299 175970 -72185 -64925 -251217 -8644
6931 -311728 165883 66303 230756 60143 150465 164512 -123961 -202425 -20676 143803 -58435
6919 -475033 266511 -86233 -59412 89554 26424 -37638 52579 196671 168527 -49663 -88643
6908 -88643 -7746 -39014 -60685 90163 112509 127791 -171387 -219938 -216868 98347 84939 225925
6896 225925 -189243 -89011 15367 67135 -5654 107450 -190087 -3267 -41448 274857 44441
6884 -201212 167894 -140097 -14359 -206117 196515 -119209 -220675 135048 72298 -103410
6873 -86859 29339 -143343 -326866 -62654 8292 71304 -328815 -42159 55645 -407550 -127978
6861 43682 287293 96608 -92955 138854 -55759 -160208 -61458 24962 -97237 68815 -84590
6849 57845 47052 47537 107844 170850 321197 -224281 58394 148944 35969 201940 7695 -268366
6836 -23063 33261 135248 42764 -269944 -54125 -228062 -93608 -161565 162291 -64722 -61467
6825 -61467 -62237 24195 159969 -148503 -219104 -71733 40393 -410407 -29092 -381581 102621
6813 266108 27655 -130405 147899 290610 -18321 183410 -226708 13637 178439 3413 148539
6802 148539 -170004 180918 -73949 -181347 110242 -48274 43606 14156 -218361 -88443 -130062
6791 -130062 -90065 -111280 -217680 -31386 -149311 -45700 -239045 51393 -17758 -151639 -21788
6779 91643 -120751 -188806 49330 -46222 200505 -209160 151783 -176114 -141864 -39195 -11472
6767 -174367 -387823 -334685 -10026 -125727 9563 -105968 -59012 113217 50863 108813 -237967
6755 -118716 425622 13976 -8847 129174 -225946 -38274 351158 -268682 -101416 -126442 146090
6743 54266 82172 161016 -240907 90505 55281 275049 184771 -30215 97288 383657 320654
6732 320654 -41004 296553 -5906 137717 106521 -94706 40992 -90390 56020 -28356 -252154
6721 -252154 216101 -47038 -332013 -46893 -165357 31280 -12999 110504 124375 -198847 -126200
6710 -126200 -84502 -181349 -120534 -2145 82904 18795 71339 41406 144464 -123979 -278322
6699 -278322 28523 221538 -26457 -99556 -46083 155706 96304 129376 86166 -59299 -65185
6688 -65185 -22396 135718 102820 142405 141470 200682 7335 29869 146750 -408812 60603 -131602
6675 -40451 72743 52289 -102058 15857 -48996 79674 -360105 -220730 61912 -151738 68397
6663 -145967 171740 304166 -326993 -146141 45873 7917 -168380 -368114 -5097 -29118 1437
6651 60191 -138716 -112995 -231359 -45528 216296 119727 -150213 25568 37091 412 -229903
6639 25771 116678 -349204 -174169 -72519 -180929 -144147 -115542 38555 249231 -263833 -87613
6627 110395 99388 -71972 -236074 -52787 17465 110057 106191 -15218 191565 -87620 -34863
6615 29449 185539 -33682 -1504 442284 170357 -308148 141331 -28328 57634 -53297 -267575
6604 -267575 143235 -37182 -152846 332626 -115707 -281197 299199 -220676 -16000 64324
6593 185172 -230606 -205306 -46615 285997 142845 43078 139155 -115355 -144366 -157624 14039
6581 61046 13431 159177 -167021 -57418 -84249 -262117 722 -123860 -44667 -130016 -49731
6569 -117122 257626 -313744 37590 117831 -160034 2651 -182769 -122743 425447 -46802 -48060
6558 -48060 -33972 -149937 -102626 -308893 187502 -18716 -265470 323938 -187901 220813
6547 239291 241832 -233905 -66458 -199151 62831 13401 170019 88946 -91114 -276337 -496572
6536 -496572 76956 -214229 -120822 -192946 -145035 -142921 -89728 132395 11299 113225 -115489
6524 93959 166744 -87898 -80894 97777 -135484 -294738 200570 234797 61410 -153376 139512
6512 73446 -55979 -96583 272255 4688 15678 -335911 -166553 72475 -26629 62505 -97661
6500 -152860 407021 130308 -64786 -209392 132259 49861 104879 19260 -138794 71898 145523
6489 145523 178496 -87500 -264486 -119087 -206925 324631 150672 -79223 -113699 -210892 -5099
6477 -96340 -243687 -44105 -32012 -127369 14802 154292 244166 -300302 -65823 273672 -67500
6465 17652 -210630 -43459 -90389 213577 59233 112503 -20674 25506 90692 -42827 -128797
6454 -128797 195692 218637 145100 184897 46592 -201910 290022 -5672 79723 -81333 -85148
6443 -85148 -211836 81626 43827 -163878 -5258 58522 115732 106982 46555 -33203 -52550 116622
6430 26888 256194 -156766 113290 -64088 175044 -216011 97597 -78326 -72153 168025 256640
6419 256640 13080 38168 272221 -315625 16688 -78618 55233 181901 -20267 140546 99341
6408 99341 122171 283550 421118 -19987 -210901 113562 -117084 119242 -224265 -238916
6398 -238916 297788 -39289 128048 124477 -461172 368301 -11625 -22615 113491 -301805 235151
6386 -151662 34316 -40874 172953 -218884 -54984 171015 -122088 -18561 192249 -191273
6375 283999 -66928 133728 -276122 -169729 -68836 14267 -208805 -56610 60821 40944 -66467
6363 571308 50146 -125015 -226824 -12122 -148071 114874 -482886 -174953 -62799 -268259
6353 -268259 -158083 -58489 -15478 -135495 -196875 -364648 224949 174012 -104339 80112 140138
6342 140138 -231275 -34788 8525 -69456 -66732 -242149 217894 -93001 236245 -104820 -322548
6331 -322548 70924 -31915 -37915 -156495 136557 135813 -607954 -86447 -94365 -97678 11646 51741
6319 51741 -81329 -16886 215307 218180 267395 13615 -260203 -193358 -21568 76579 33554 -213981
6306 -28538 23207 81259 171720 323401 -210557 -188222 194067 -39919 111621 -85032 237547
6294 -55838 264056 -107145 -367665 350107 -327422 378010 29217 403914 -14152 198957
6283 -27225 158744 136756 -263784 216584 -295862 -4602 143566 -141747 -161524 -98444 -92961
6272 -92961 118414 64702 -114741 -88790 -330351 184690 -60137 130122 -34984 -30978 5624
6260 149674 -228389 -253130 122843 -136154 -427611 -151600 -57023 154997 195499 -112443
6249 61973 -63315 37749 107659 285323 -138922 361986 274410 -205735 -404335 192852 -137186
6237 115160 -22809 -59695 -246775 186269 21307 -50915 -194215 60026 -114303 67808 -154879
6225 -98840 -113896 85543 -53718 206574 -62192 -172438 35650 -47349 137497 -34586 -78252
6214 -78252 -83310 6300 40507 159474 15090 388778 -92128 79168 -268750 -79379 89444 232574
6202 232574 -135418 -85616 -70340 218861 75231 -503078 -25012 -139449 152776 104396 -59051
6190 100146 -139258 218862 67478 97706 64436 -145075 -153062 -13233 -73195 -55385 -58466
6179 -58466 -178958 -183094 13814 152125 -130775 -45932 129620 75802 85699 -51792 -21170
6167 -221446 133598 6154 431622 170428 4878 25568 -9142 -53741 100755 -12657 -195755
6156 -195755 -266693 89936 -98111 106513 278904 -101091 375785 111526 273805 25795
6145 -149155 -423588 -72150 -70535 -44854 65214 283797 90415 114217 -161853 -92425 -121951
6134 -121951 83007 -52541 -244815 11248 217294 77976 16217 -227206 -161236 115134 -252327
6122 -271760 -238888 378107 -84510 -139558 -170711 5949 -121636 -31967 -85624 311 325587 57351
6109 -45649 30083 -157486 59106 271475 -191662 138649 -116486 -116755 -235577 -34041 111223
6097 20888 127186 302186 101081 34922 226757 -274931 128406 -81031 70754 98967 -454904
6085 -188804 -343638 -145169 66951 386786 287658 92705 -136597 15690 -134983 -132684 -216290
6074 -216290 -69039 199125 -23015 5526 242740 -89620 6954 159237 -82581 -145183 -43890
6062 65064 310219 -923 164510 -18668 -32644 -138816 -66574 -17729 -315272 35581 217997
6051 217997 -67334 -285611 102298 166763 392295 -48577 237302 243226 323402 -258730 -33000
6039 -186864 53534 -201016 231899 -21318 179920 130697 -418763 -84048 367223 110868
6028 -29129 335960 -235456 15155 -26832 -420511 -279315 138083 55261 -109463 -14758 220502
6016 5765 1499 -47237 86610 196931 -116163 -285673 -192417 138308 172455 55457 -190367
6004 18519 237370 -227749 -64112 130161 91959 26596 -297145 -14192 34856 -6065 52205
5992 -140489 -24684 -30349 -26796 -30108 182232 289623 -242816 -211050 -194443 -225938 -212660 -164663
5980 -164663 -278749 -55992 152205 -49894 21177 81351 19413 -206667 -127687 46406 -107692
5968 331099 -83504 45936 -199973 -296059 96478 162547 271321 7270 -115025 182159 75000
5956 111427 -84186 -100048 -181626 -113145 174990 -288567 -73161 -90389 48816 -88903 -297856
5945 -297856 -36627 -48645 -187475 -63013 280942 74398 -21025 -183246 -190376 -531375 296781
5933 -265712 107909 164961 -13027 102021 -116542 16602 325248 -40421 21571 310163 -316316
5921 35397 -159402 -176625 20987 -287357 -236980 -156319 102647 86375 -251324 -77840 54769
5909 20465 -48507 -151010 93122 -117964 -180166 -53601 282997 291195 318306 45324 199055
5898 199055 8641 -91433 -26236 90972 -92783 16917 -146371 57523 -269698 -42986 -222387
5887 -222387 -74613 67905 -188746 -74415 230257 -218527 135209 -312803 -27346 -9110 252390
5875 -289606 71841 -27150 82531 341918 195899 -209602 -17449 -267938 -137714 -442889
5865 -442889 101445 -86519 66102 -127558 -14278 -112222 43945 -114641 -170149 -131112 169407
5853 -31206 -172988 230836 -12460 100261 -258129 205691 287603 -24467 86562 -230792 -107416
5841 301212 287600 32090 -214114 -6173 121358 -150555 -117002 -171838 -271295 419081 -26121
5829 223069 173830 159961 -36008 191286 -172733 -63626 179726 140494 -405348 96173 -134022
5817 -241761 99236 -208748 131165 253419 -165199 46014 324779 -6895 177196 24717 -101638
5805 41394 7893 -19903 63306 -35667 -43317 -265710 39506 92185 -416696 246541 104213
5793 182965 219746 371066 334305 -40998 -7142 -113945 -167896 67628 307949 106013 -334589
5781 -230365 -32200 -188844 178586 374948 239149 -179558 -139129 -213687 -71906 -10370 184347
5769 -107682 -219992 53428 -187792 358279 -55302 -67832 241824 -102167 -173364 -301838
5759 -301838 -199224 -247524 334596 -240432 78589 -198697 352814 -319502 91574 -270612
5748 11807 -57688 127526 163051 5432 -74686 144678 189420 -149953 -93485 -1117 321856
5736 233748 -447787 -129700 -150612 169997 152331 -151846 -4483 -150972 -22194 143363 144722
5725 144722 -145309 136134 266597 -166910 80332 -169284 -185480 20535 -259836 240270
5714 33605 142265 -45977 -49078 -44865 182077 -30109 112146 12601 5591 189176 -128762
5702 -163675 161845 3760 -145636 47038 126607 -147331 4421 -258548 106735 -141627 -102480
5691 -102480 -151133 134586 45754 46968 -84788 -103161 227801 -72391 -17972 -170423 301569
5679 104233 73355 63002 208466 203137 -84139 -219564 38295 127800 45386 -91505 -94038 -84873
5667 -84873 1621 142638 -596425 -125019 194380 -120938 209018 46967 77325 -10708 -37324
5656 -37324 315644 -265129 -266815 290703 -194085 53185 91176 89650 -91652 -83878 265971
5644 -202192 -323689 -143208 4276 63688 -13995 -66256 -564044 -102807 -57251 -72364 -87967
5633 -87967 -213017 36988 -92886 44134 40433 42284 -89164 -392396 -103458 -244854 -360355
5622 -360355 208051 -178954 -198418 310512 202094 -15703 -98782 -65345 -128274 -271457 -320020
5611 -320020 -147818 -136749 13524 -162505 52967 -239312 211459 -26822 -221381 60374 105360
5600 105360 42979 94079 77669 14897 95313 -38506 199948 -98130 -70517 444028 -53005
5588 -127060 -34484 36989 -269356 -35550 50168 63590 -14789 16885 -13688 23495 148984
5577 148984 9123 415986 -55041 199748 -67765 236964 205699 246406 75751 44647 -76646
5565 64517 322555 -111589 21917 -79132 8343 276645 -137686 -74054 228385 -260568 -217681
5554 -217681 -349159 36665 -80408 1243 -228456 -155769 -41500 -9881 220761 84072 -104866
5542 -232621 16112 99088 71488 -79911 3873 190767 -20335 -77553 212405 -34831 227023
5530 -111893 -139179 -86591 224065 219711 269804 -23099 171637 260381 188699 301084 -310185
5518 -19068 -309542 33344 -224321 -256249 92877 6639 -369274 -129193 87890 -225583 -80446
5506 262182 -58841 -165422 -47987 -192084 121507 -217763 -202976 138735 161805 -52848 44284
5494 -214060 -384281 98597 7040 -338620 -226713 39289 -14804 55055 188037 -279068 -397064
5483 -397064 -39766 -6185 -236165 57056 -30900 388701 175660 82667 38652 111029 -62997
5471 -164119 -20063 -99162 -213571 279612 -255199 -21018 115530 -132399 -157088 95101 -143499
5459 8505 307805 247933 217304 202627 50308 109971 -89028 11739 -54484 -377390 -154384
5447 40282 155018 -1812 216036 -204098 115332 131127 -87117 -240454 157395 -200677 69211
5435 -412657 10656 -109549 221822 -251957 111958 305001 63529 187410 -297577 -65440
5424 -138492 124143 -40131 169901 46304 -365563 -91400 163900 -4750 -176996 189671 114999
5413 114999 -104133 -550 176148 141460 222913 -54504 63907 38214 -27040 46653 -223633
5401 -39098 213032 164700 135081 52361 250192 273749 122124 78990 19295 -105897 30550
5389 193765 -303210 -23566 12040 -67130 -7869 274751 220823 -80530 240933 -208595 -369349
5378 -369349 -512471 278826 47857 -100595 -25732 -136306 -56850 14761 25146 14417 -49412
5366 -193088 94513 -112367 -59449 -62073 39194 179594 -407763 -127923 91278 -6289 232149
5354 79467 338831 111898 22920 63418 158471 197644 38571 356063 26848 -65922 -143706
5343 -143706 -171201 -24848 -100249 162586 -189038 184100 150960 188704 258393 44277 -54953
5331 -236968 183386 -47730 -101361 5956 -62980 54001 -122391 8810 -218864 -170558 -173987 -299914
5319 -299914 -33919 -145420 388986 -100886 175098 45073 19549 -323748 -53919 256323
5308 112101 177993 -94418 342039 -68919 166196 -248575 -22469 -195462 -186289 -142845 -185690
5297 -185690 -336112 -73959 -68084 50730 33370 67114 123626 -398664 -11964 -355603 108490
5285 44597 -36129 -91660 72565 345358 -1684 -222907 -252822 38909 -202040 75533 72 -238349
5272 -64112 -365248 59416 -162199 -315334 570523 -264132 254908 -61135 -9948 -408533 70507
5260 -201239 84322 96293 -25588 -17338 135847 107544 415 -107951 -130821 -30544 -99053 -123283
5248 -123283 93862 -36798 -153771 -23643 -115591 -5120 -142266 -27085 -146012 -182978 -7350
5236 522047 263140 -204458 137495 116628 228152 -94659 -86414 331981 -181144 -142920 108716
5224 174130 -232704 -219915 96893 276129 57287 384447 362270 271291 -76914 152791 466155
5213 466155 19551 280957 243300 195203 -5330 167427 288807 102685 -78038 -145606 296380
5201 -45637 -264768 54229 -40493 286091 172331 93111 -6062 158801 -65042 286730 46276
5189 -7340 -154051 -54814 -14382 -117522 32218 58171 197267 142317 172998 83082 -240351
5177 17988 -99775 136658 2152 -123066 -101956 188963 149209 236243 -165505 12670 -109301
5165 -85343 -55893 -124544 44192 108581 216440 -127076 -163589 267682 83867 -53864 -27000
5154 -27000 -134841 -200071 -52594 -205133 140870 -303001 -92219 104447 -419621 -85147 188860
5142 107519 -298333 123532 -225128 321148 51208 -36541 -32143 270185 229572 -9761 262682
5130 -222089 -249231 69756 51937 -42931 -151175 -6903 -244482 -329837 45238 52962 -60153 -199331
5118 -199331 -14048 68352 56739 -38496 261521 -405119 -58585 8296 164883 -231727 -102577
5106 -93501 193865 147803 33420 101652 158737 18748 -225920 83882 -250903 205666 -133838
5094 -268531 -139788 -260222 72748 97167 86515 -131784 82928 288158 -137284 -158471 74667
5082 -480171 -66088 3139 225684 -70018 -107117 79591 6555 -121835 -189522 89598 189134 192237
5070 192237 167007 -181981 162591 -64977 344463 148469 -89268 191912 125730 -197645
5059 -93016 206159 -189923 211331 162587 -322315 97382 97185 -162515 200305 27941 305354
5048 305354 75950 214891 -139950 289311 -238363 -86371 156767 -325800 62820 -184406
5037 -173360 -28890 190604 270211 10470 15998 287310 -118993 -18933 68968 133996 66840
5025 115746 26553 249589 125722 -48632 -265993 -19270 113912 142666 89274 6631 117439
5014 117439 182712 -276187 22488 124268 5625 -18816 208834 16686 -132898 -3547 70318
5002 -87141 -249218 80561 221827 -110541 170756 93501 68593 39489 -112372 -148328 -16419
4990 -311348 -65800 -116456 119012 -17367 -159890 42406 304974 325098 146385 98431 14145
4978 -119896 -143755 -154688 -82059 -194259 -134655 -134183 384966 333643 6376 -31010 349200 -197597
4965 -131634 85491 -137189 88477 343747 50422 -70009 507 -238014 -61663 181985 64852
4953 -119929 -131638 28733 -277334 -22190 82399 237626 -175711 -20287 -391733 5589 11484
4942 11484 -410387 219366 235476 9323 -5834 -192187 -194628 -187372 -271237 -338055 -28505 66410
4929 80471 73756 -41614 57968 -106128 186178 349516 125137 -269634 -60277 -245238 73464
4917 17990 105101 -232925 -68960 -142115 42431 138673 180769 57139 74782 339861 129142
4905 -211534 208140 -42457 -197287 170882 240199 -141 -225468 238182 113486 -30374 283863
4893 248782 153479 -28052 151761 -303236 -124176 77104 -27277 -123573 109382 283801 222092
4882 222092 -62688 -152687 35636 86646 1427 -69049 -34710 177154 -108475 -56324 -263626
4871 -263626 -16020 -1116 -12373 298696 -94401 145607 147520 5981 -168215 81050 -5758 -205170
4859 -205170 5284 -131406 -162828 -4668 -70747 -194920 267916 68068 59262 11686 -137576
4847 -113690 -117286 82433 -211284 -170409 -63556 50042 255631 138477 147638 52962 -30626
4835 1056 -162972 -45357 -346346 20622 192802 77484 -58989 12108 126761 -355495 -296543
4824 -296543 -124532 -352801 323018 195964 -274575 60382 217127 91388 254552 -85117
4813 -360473 -53017 -199152 -24170 -101383 -90483 -131966 -111541 97469 185509 140701 -282495
4801 -306288 22014 -164155 -167364 163077 72759 -262955 100385 -299602 -72215 138760 -200905
4789 -81409 -17097 -211549 16359 -131278 242056 125629 -165999 -301524 292845 -48131
4778 -123148 25644 68847 -305485 -46179 -98581 -350678 173196 1913 77320 57387 101023
4767 101023 77480 -15008 324458 -59434 -9706 -273011 -123563 -203606 99897 242735 23134
4755 252457 69751 271416 131674 204179 217471 88501 174145 -46029 -44977 51522 150819
4744 150819 50224 150457 17150 -35932 -292348 13674 -189842 18156 132771 151318 -138333
4732 298820 -372056 280603 243053 -230714 -18877 38350 -19647 -33492 -160305 -27043 119350
4720 74176 295286 -354272 -37734 38352 -140250 160312 -113723 152666 11334 57435 -21939
4708 99513 -201436 -225632 -15414 -157001 159172 145514 310879 52463 -118516 106064 -163325
4696 125597 -116099 80938 105533 -209555 130763 10612 59594 158809 149965 60174 -173957
4684 -93834 120398 282408 165484 78129 124440 -210966 176375 130693 -128921 -19782 -53746
4673 -53746 91270 -171833 50750 -238882 -63151 39941 82447 171114 223707 66157 192224
4662 192224 238492 -208085 -379837 -238449 247718 -75670 -127716 268575 113649 -300038
4651 -114817 130447 -89592 20187 31731 -66086 -189657 230955 65699 -97261 44379 -91115
4639 221725 104761 194450 -128187 51983 129307 238136 -211901 139666 -156369 15433
4628 -132080 -16679 -169930 -122756 -154849 -191103 -92080 -106694 70191 39803 -120712 57524
4616 -77731 -51412 554732 54905 -12829 -5136 89787 23684 96462 185845 3399 -326130 -72376
4603 -139264 73163 239009 14356 273801 -84262 205901 -89500 161494 -56200 136035 -390860
4591 -305125 198867 180251 171804 145896 63836 39312 52714 405930 -78029 310915 45689
4579 46687 -338362 245573 -32617 -109884 -9660 169514 -4105 242040 9721 69029 147492 268322
4567 268322 233759 -20160 47876 75733 -188679 67033 9538 151296 -161323 -363653 105463
4555 -129428 -147016 123440 -179123 -113013 -72530 -237571 388275 -41109 35282 -144229 -286209
4544 -286209 -75662 -145800 87522 175426 -176708 -18768 -69505 -291404 203111 127272 -84985
4532 214319 -222790 45844 -221238 -191389 -131668 -186345 246608 -120167 -122630 152776 -77043
4520 193348 153013 195835 5753 -96240 -155566 -176557 258101 -118457 154858 -81449 -194992
4509 -194992 105083 -36570 60650 232278 129904 143841 -310899 -52338 173379 66438 -166367
4497 39274 -93970 -34316 36838 -309634 144104 81068 -6436 61773 -2650 6218 144457 -143089
4484 178894 -149894 259798 -22265 129395 -83619 -55761 9364 -28877 129297 71267 23647
4472 75003 -47582 108570 -81700 -97134 -126565 -40755 34763 -63896 -24138 42223 231079
$$ [...]
##END NTUPLES=NMR SPECTRUM
##END=
