##TITLE=AC1580_ROEFFECT0024_8271305_l7BeHsI5pb
##JCAMPDX= 6.0         $$ Bruker NMR JCAMP-DX V2.0
##DATA TYPE= NMR SPECTRUM
##DATA CLASS= NTUPLES
##ORIGIN= BRUKER
##OWNER= Administrator
$$ 1.72 TOPSPIN		Version 2.1
$$ 2013-10-18 23:32:30.044 -0700  Administrator@X
$$ Compression mode = diff/dup
##.OBSERVE FREQUENCY= 400.02188249412
##.OBSERVE NUCLEUS= ^1H
##.ACQUISITION MODE= SIMULTANEOUS (DQD)
##.ACQUISITION SCHEME= undefined
##.AVERAGES= 64
##.DIGITISER RES= 22
##SPECTROMETER/DATA SYSTEM= spect
##.PULSE SEQUENCE= noesygpps1d.comp
##.SOLVENT NAME= COFFEE_meoh
##.SHIFT REFERENCE= INTERNAL, COFFEE_meoh, 1, 14.96055
##AUDIT TRAIL= $$ (NUMBER, WHEN, WHO, WHERE, PROCESS, VERSION, WHAT)
$$ ##TITLE= Audit trail, TOPSPIN		Version 2.1
$$ ##JCAMPDX= 5.01
$$ ##ORIGIN= Bruker BioSpin GmbH
$$ ##OWNER= Administrator
$$ $$ E:\/data/COFFEE/nmr/AC1580_ROEFFECT0024_8271305_l7BeHsI5pb/12/pdata/1/auditp.txt
$$ ##AUDIT TRAIL=  $$ (NUMBER, WHEN, WHO, WHERE, PROCESS, VERSION, WHAT)
(   1,<2013-10-18 23:32:24.779 -0700>,<Administrator>,<X>,<go>,<TOPSPIN 2.1>,
      <created by zg
	started at 2013-10-18 23:20:55.261 -0700,
	POWCHK enabled, PULCHK disabled,
       configuration hash MD5:
       C8 4E 4E 5D D3 5C D8 9E 9F 52 82 E0 59 8A DE 15
       data hash MD5: 64K
       71 FD DB F3 80 82 C4 30 93 17 8E 7E A6 AD 5C 61>)
(   2,<2013-10-18 23:32:27.904 -0700>,<Administrator>,<X>,<proc1d>,<TOPSPIN 2.1>,
      <Start of raw data processing
       efp LB = 0.3 FT_mod = 6 PKNL = 1 PHC0 = 0 PHC1 = 0 SI = 128K 
       data hash MD5: 128K
       B3 4C 13 3E 4B E1 D8 C4 DD 8D E5 BE EC 9B 3D 60>)
(   3,<2013-10-18 23:32:28.904 -0700>,<Administrator>,<X>,<proc1d>,<TOPSPIN 2.1>,
      <pk PHC0 = -83.0072 PHC1 = 0 
       data hash MD5: 128K
       73 BE 9C 96 A0 A1 47 36 4E 34 A5 E1 46 C1 4E 24>)
(   4,<2013-10-18 23:32:29.357 -0700>,<Administrator>,<X>,<proc1d>,<TOPSPIN 2.1>,
      <abs ABSG = 1 
       data hash MD5: 128K
       C0 78 05 A3 B9 1D B1 63 73 02 82 57 46 65 EC A3>)
(   5,<2013-10-18 23:32:29.497 -0700>,<Administrator>,<X>,<proc1d>,<TOPSPIN 2.1>,
      <abs ABSG = 2 
       data hash MD5: 128K
       9D 9A 03 99 50 8B 31 62 9A 24 D0 5A 86 A8 00 07>)
(   6,<2013-10-18 23:32:29.607 -0700>,<Administrator>,<X>,<proc1d>,<TOPSPIN 2.1>,
      <abs ABSG = 3 
       data hash MD5: 128K
       93 16 7B 0C 19 EF 94 50 AF D2 40 A9 D6 DD B3 55>)
(   7,<2013-10-18 23:32:29.685 -0700>,<Administrator>,<X>,<proc1d>,<TOPSPIN 2.1>,
      <abs ABSG = 4 
       data hash MD5: 128K
       BE 26 28 B7 5B 74 33 3A 73 09 EC 69 E2 07 3F F7>)
(   8,<2013-10-18 23:32:29.825 -0700>,<Administrator>,<X>,<proc1d>,<TOPSPIN 2.1>,
      <abs ABSG = 5 
       data hash MD5: 128K
       E5 A1 26 CB 8E 12 5B 0E 7C 57 25 3C 17 90 C6 86>)
$$ ##END=
$$ 
$$ $$ hash MD5
$$ $$ 6A A4 A3 85 1E 84 84 0C 6C CA 4D A8 09 AF 54 60
##$RELAX= 
##$RELAX= 
##$RELAX= 
##$RELAX= 
##$RELAX= 
##$RELAX= 
##$RELAX= 
##$RELAX= 
$$ Bruker specific parameters
$$ --------------------------
##$DU= <E:\>
##$EXPNO= 12
$$ [...]
150 150 150 150 150 150 150 150
##$TP07= 0
##$TPNAME0= <>
##$TPNAME1= <>
##$TPNAME2= <>
##$TPNAME3= <>
##$TPNAME4= <>
##$TPNAME5= <>
##$TPNAME6= <>
##$TPNAME7= <>
##$TPOAL= (0..7)
0.5 0.5 0.5 0.5 0.5 0.5 0.5 0.5
##$TPOFFS= (0..7)
0 0 0 0 0 0 0 0
##$TUNHIN= 0
##$TUNHOUT= 0
##$TUNXOUT= 0
##$USERA1= <user>
##$USERA2= <user>
##$USERA3= <user>
##$USERA4= <user>
##$USERA5= <user>
##$V9= 5
##$VALIST= <valist>
##$VCLIST= <CCCCCCCCCCCCCCC>
##$VD= 0
##$VDLIST= <DDDDDDDDDDDDDDD>
##$VPLIST= <PPPPPPPPPPPPPPP>
##$VTLIST= <TTTTTTTTTTTTTTT>
##$WBST= 1024
##$WBSW= 4
##$XGAIN= (0..3)
0 0 0 0
##$XL= 0
##$YL= 0
##$YMAX_a= 5959219
##$YMIN_a= -12065633
##$ZGOPTNS= <>
##$ZL1= 120
##$ZL2= 120
##$ZL3= 120
##$ZL4= 120
##$ABSF1= 14.96055
##$ABSF2= -5.597631
##$ABSG= 5
##$ABSL= 3
##$ALPHA= 0
##$AQORDER= 0
##$ASSFAC= 0
##$ASSFACI= 0
##$ASSFACX= 0
##$ASSWID= 0
##$AUNMP= <proc_prof1d_extract.lims>
##$AXLEFT= 0
##$AXNAME= <>
##$AXNUC= <1H>
##$AXRIGHT= 0
##$AXTYPE= 0
##$AXUNIT= <>
##$AZFE= 0.1
##$AZFW= 0.1
##$BCFW= 0
##$BC_mod= 0
##$BYTORDP= 0
##$COROFFS= 0
##$CY= 15
##$DATMOD= 1
##$DC= 0
##$DFILT= <>
##$DTYPP= 0
##$F1P= 0
##$F2P= 0
##$FCOR= 0.5
##$FTSIZE= 131072
##$FT_mod= 6
##$GAMMA= 0
##$GB= 0
##$INTBC= 1
##$INTSCL= 1
##$ISEN= 128
##$LB= 0.3
##$LEV0= 0
##$LPBIN= 0
##$MAXI= 10000
##$MC2= 0
##$MEAN= 0
##$ME_mod= 0
##$MI= 0
##$NCOEF= 0
##$NC_proc= -2
##$NLEV= 6
##$NOISF1= 0
##$NOISF2= 0
##$NSP= 0
##$NTH_PI= 0
##$NZP= 0
##$OFFSET= 14.96055
##$PC= 1
##$PHC0= -83.0072
##$PHC1= 0
##$PH_mod= 1
##$PKNL= yes
##$PPARMOD= 0
##$PPDIAG= 0
##$PPIPTYP= 0
##$PPMPNUM= 2147483647
##$PPRESOL= 1
##$PSCAL= 4
##$PSIGN= 0
##$PYNMP= <proc.py>
##$REVERSE= no
##$SF= 400.020009817607
##$SI= 131072
##$SIGF1= 0
##$SIGF2= 0
##$SINO= 400
##$SIOLD= 131072
##$SPECTYP= <>
##$SREGLST= <1H.CDCl3>
##$SSB= 0
##$STSI= 131072
##$STSR= 0
##$SW_p= 8223.68421052631
##$SYMM= 0
##$S_DEV= 0
##$TDeff= 65536
##$TDoff= 0
##$TI= <>
##$TILT= no
##$TM1= 0
##$TM2= 0
##$TOPLEV= 0
##$USERP1= <user>
##$USERP2= <user>
##$USERP3= <user>
##$USERP4= <user>
##$USERP5= <user>
##$WDW= 1
##$XDIM= 131072
##$YMAX_p= 382875861
##$YMIN_p= -11647
##$CURPLOT= <Network HP LaserJet P1505>
##$CURPRIN= <$Network HP LaserJet P1505>
##$DFORMAT= <normdp>
##$LAYOUT= <+/1D_H.xwp>
##$LFORMAT= <normlp>
##$PFORMAT= <normpl>
##$SURQMSG= 1
$$ End of Bruker specific parameters
$$ ---------------------------------
##NTUPLES= NMR SPECTRUM
##VAR_NAME=  FREQUENCY,     SPECTRUM/REAL,   SPECTRUM/IMAG
##SYMBOL=    X,             R,               I
##VAR_TYPE=  INDEPENDENT,   DEPENDENT,       DEPENDENT
##VAR_FORM=  AFFN,          ASDF,            ASDF
##VAR_DIM=   131072,        131072,          131072
##UNITS=     HZ,            ARBITRARY UNITS, ARBITRARY UNITS
##FACTOR=    0.0627417313425164, 1,          1
##FIRST=     8223.62146879497, -2674,        -57018
##LAST=      0,             -2003,           -58108
##MIN=       0,             -11647,          0
##MAX=       8223.62146879497, 382875861,    0
$$ Real data points
##PAGE= N=1
##DATA TABLE= (X++(R..R)), XYDATA
$$ [...]
63871G41250K3365K7807L2358L5957L8551M0866M3233M5389M7134M8636N0037
$$ 741250 764615 792422 824780 860737 899288 940154 983387 1028776 1075910 1124546 1174583
63860A174583N1233N1993N1947N0604M7759M3818L9387L4618K9330K3598J7609
$$ 1174583 1225816 1277809 1329756 1380360 1428119 1471937 1511324 1545942 1575272 1598870 1616479
63849A616479J1033L197n888j5183k3606l1012l7828m4115m9364n3178n5705n7382
$$ 1616479 1627512 1630709 1624821 1609638 1586032 1555020 1517192 1473077 1423713 1370535 1314830 1257448
63837A257448n8439n8770n8141n6566n4390n2017m9568m6999m4428m2118m0003
$$ 1257448 1199009 1140239 1082098 1025532 971142 919125 869557 822558 778130 736012 696009
63826F96009l7577l4490l1121k8239k6235k4832k3413k1465j8830j5912j3560
$$ 696009 658432 623942 592821 564582 538347 513515 490102 468637 449807 433895 420335
63815D20335j2368j1988j1430j0182q739p793p274o584n594m840m632m497l839
$$ 420335 407967 395979 384549 374367 365628 357835 350561 343977 338383 333543 328911 324414 320575
63802C20575k807k069j918k097k382k808l215l158k593k195k628l696m607m869
$$ 320575 317768 315699 313781 311684 309302 306494 303279 300121 297528 295333 292705 289009 284402 279533
63788B79533m536l869l215l019l326l395k453q92l4n34j610k154j920j271l76
$$ 279533 274997 271128 267913 264894 261568 258173 255720 254828 254794 254260 252650 250496 248576 247305 246929
63773B46929N98J021L44j006j995k225k166k205k085j530p47n3N11Q97P91L7r68
$$ 246929 247527 248548 248892 247886 245891 243666 241500 239295 237210 235680 234933 234880 235391 236288 237079 237116 236148
63756B36148j683j979k016j789j151j53R35J872K426K359J716J006P10P04N51
$$ 236148 234465 232486 230470 228681 227530 227377 228312 230184 232610 234969 236685 237691 238401 239105 239656
63741B39656K77M00J095J830K029J760J548J719K159K440K072R12m17p83M29K594
$$ 239656 239933 240333 241428 243258 245287 247047 248595 250314 252473 254913 256985 257897 257480 256697 257126 259720
63725B59720M457N308N352N087M762M452M263M240M275M181L833L189K367J585
$$ 259720 264177 269485 274837 279924 284686 289138 293401 297641 301916 306097 309930 313119 315486 317071
63711C17071Q79k7j297k451k759k185j542j486j737j622j069n86m45l48J17J025
$$ 317071 317950 317923 316626 314175 311416 309231 307689 306203 304466 302844 301775 301189 300744 300396 300513 301538
63695C01538K156L163L668L478K869K464K647L231L705L732L338K733K089J446
$$ 301538 303694 306857 310525 314003 316872 319336 321983 325214 328919 332651 335989 338722 340811 342257
63681C42257P95K00k36m95o67p12m18L07J159J655J617J335J225J384J525J291
$$ 342257 343052 343252 343016 342521 341854 341142 340724 341031 342190 343845 345462 346797 348022 349406 350931 352222
63665C52222P13K95M22O79J65j339k905l606l696m128n093n787n629m988m462
$$ 352222 352935 353230 353652 354331 354496 353157 350252 346646 342950 338822 333729 327942 322313 317325 312863
63650C12863m069l556k988k538k015j115L4R31J301J325J384J785K594L525M121
$$ 312863 308794 305238 302250 299712 297697 296582 296616 297547 298848 300173 301557 303342 305936 309461 313582
63635C13582M277M389M749N045M860M452M521N209N875N986N842O055O689P227
$$ 313582 317859 322248 326997 332042 336902 341354 345875 351084 356959 362945 368787 374842 381531 388758
63621C88758P283O986O684O648P156Q583J0975J3680J5768J6985J8030J9661K1835
$$ 388758 396041 403027 409711 416359 423515 432098 443073 456753 472521 489506 507536 527197 549032
63608E49032K4011K6047K8248L0545L2221L2594L1578K9297K5605K0445J4389
$$ 549032 573043 599090 627338 657883 690104 722698 754276 783573 809178 829623 844012
63597H44012Q467L466l81l154n065o374p274p850q305r035j0306j2030j4087j6567
$$ 844012 852479 855945 855564 852410 847345 840971 833697 825847 817542 808507 798201 786171 772084 755517
63583G55517j9414k2013k3590k3955k3561k2847k1887k0566j8775j6456j3736
$$ 755517 736103 714090 690500 666545 642984 620137 598250 577684 558909 542453 528717
63572E28717j1035q757o919n285l742k298q39O87J952K615K967L709M987O153
$$ 528717 517682 508925 502006 496721 492979 490681 489842 490529 492481 495096 498063 501772 506759 512912
63558E12912O660O699O780P127P891R438J1931J4845J7442J9719K2427K6219L1140
$$ 512912 519572 526271 533051 540178 548069 557507 569438 584283 601725 621444 643871 670090 701230
63545G01230L7008M3646N0289N4990N5382N0334M0762K8673J5721L038q015j5827
$$ 701230 738238 781884 832173 887163 942545 992879 1033641 1062314 1078035 1081073 1073058 1057231
63533A057231j9621k0032j8342j5486j2200r500q358r038j1307j5027j9940k5034
$$ 1057231 1037610 1017578 999236 983750 971550 962050 953692 944654 933347 918320 898380 873346
63521H73346k9034l1650l3663l5513l6483l5581l2791k9088k5597k2993k1396
$$ 873346 844312 812662 778999 743486 707003 671422 638631 609543 583946 560953 539557
63510E39557k0380j9310j7841j6033j4003j1880j0042q940q484q073p394o690
$$ 539557 519177 499867 482026 465993 451990 440110 430068 421128 412644 404571 397177 390487
63498C90487o152n606n042m776m738m258l048j746j025p13m39m27q76j168o22
$$ 390487 384335 378729 373687 368911 364173 359915 356867 355121 354096 353383 352944 352517 351641 350473 349851
63483C49851L61R36J242K078L320L901L491L046L392M255N054N631N711M596K129
$$ 349851 350212 351148 352390 354468 357788 361689 365180 368226 371618 375873 380927 386558 392269 396865 398994
63468C98994o39k513l342l598l473l002k614k573k317j225J82P20J97l59k11K18
$$ 398994 398355 395842 392500 388902 385429 382427 379813 377240 374923 373698 373880 374600 374797 374438 374227 374445
63452C74445K70Q3J92O72J222J807K675L846M955N667O000O314P074Q552J0616
$$ 374445 374715 374798 374990 375662 376884 378691 381366 385212 390167 395834 401834 408148 415222 423774 434390
63437D34390J2857J5124J7800K1599K6986L3708M0544M5546M6888M3927L7386
$$ 434390 447247 462371 480171 501770 528756 562464 603008 648554 695442 739369 776755
63426G76755K8569J8662Q773K06n859q834q668n621m05N822J2154J8497K4934
$$ 776755 805324 823986 832759 832965 827106 818272 809604 803983 803578 809400 821554 840051 864985
63413H64985L0695L4467L5640L4553L1402K5915J8456J0568L691k040o918j0333
$$ 864985 895680 930147 965787 1000340 1031742 1057657 1076113 1086681 1090372 1088332 1081414 1071081
63401A071081j1400j0649r870j0133j1072j2327j4633j8730k3995k8915l2554
$$ 1071081 1059681 1049032 1039162 1029029 1017957 1005630 990997 972267 948272 919357 886803
63390H86803l4940l6317l6696l6069l4525l2217k9516k7054k5154k3311k0708
$$ 886803 851863 815546 778850 742781 708256 676039 646523 619469 594315 571004 550296
63379E50296j7324j4098j1865j0371q613o024l092p11R93K788N124P219P997P816
$$ 550296 532972 518874 507009 496638 488025 482001 478909 478198 479191 481979 487103 494322 502319 510135
63365E10135Q376J0677J3828J6425J8417K0813K3969K7160K9806L2254L5121L8398
$$ 510135 518511 529188 543016 559441 577858 598671 622640 649800 679606 711860 746981 785379
63353G85379M1452M3471M3805M2140L8592L3420K6758J8885J0666L334k236n829
$$ 785379 826831 870302 914107 956247 994839 1028259 1055017 1073902 1084568 1087902 1085666 1079837
63341A079837p635q119q022q057q554r694j1872j5300j9370k3122k6338k9527
$$ 1079837 1072202 1064083 1056061 1048004 1039450 1029756 1017884 1002584 983214 960092 933754 904227
63329I04227l2744l5083l5672l4586l2433k9580k6093k2001j7126j1152m344J994
$$ 904227 871483 836400 800728 766142 733709 704129 678036 656035 638909 627757 623413 625407
63317F25407O162P103M736k76o768j3456j9500k4509k7915k8824k6968k3415j9790
$$ 625407 631569 638672 643408 643132 636364 622908 603408 578899 550984 522160 495192 471777 451987
63304D51987j6968j4883j3257j1926j0608r018p229n590m253l170k511k550l069
$$ 451987 435019 420136 406879 394953 384345 375327 368098 362508 358255 355085 352574 350024 346955
63291C46955l316k794j889j473k031l180m036l959l051j893r54l74k36n51q86
$$ 346955 343639 340845 338956 337483 335452 332272 328236 324277 321226 319333 318379 318005 317769 317218 316332
63276C16332n27N69J424J134J12m04R1R07J320J522K114L039L518K964J704P04
$$ 316332 315805 316374 317798 318932 319044 318640 318731 319638 320958 322480 324594 327633 331151 334115 335819 336523
63260C36523O03J112J553J901K848M666O407O838N939M899M637M924N066M935
$$ 336523 337126 338238 339791 341692 344540 349206 355613 362451 368390 373289 377926 382850 387916 392851
63246C92851M992N642O832Q167R202R792J0246J1065J2445J4211J6122J7988J9517
$$ 392851 397843 403485 410317 418484 427686 437478 447724 458789 471234 485445 501567 519555 539072
63233E39072K0450K0960K1574K2533K3476K3943K3927K3771K3644K3442K3055
$$ 539072 559522 580482 602056 624589 648065 672008 695935 719706 743350 766792 789847
63222G89847K2567K2228K2314K2983K4142K5467K6524K6852K6087K4160K1345
$$ 789847 812414 834642 856956 879939 904081 929548 956072 982924 1009011 1033171 1054516
63211A054516J7881J3659Q542K821l025q967j5319k1793k7270l0866l2908l4364
$$ 1054516 1072397 1086056 1094598 1097419 1094394 1085427 1070108 1048315 1021045 990179 957271 922907
63199I22907l5494l5563l3909l0868k7419k4199k1079j7620j3683r511n440j735
$$ 922907 887413 851850 817941 787073 759654 735455 714376 696756 683073 673562 668122 666387
63187F66387J349L667N503P515J0109J3051J5819J8105J9721K0333J9871J9008
$$ 666387 667736 671403 676906 684421 694530 707581 723400 741505 761226 781559 801430 820438
63175H20438J8630J8788J8704J7909J6803J5934J5312J4685J3936J2777J0538
$$ 820438 839068 857856 876560 894469 911272 927206 942518 957203 971139 983916 994454
63164I94454O858K265k408p044j2115j7659k2856k6779k9212l0662l1728l2582
$$ 994454 1001312 1003577 1001169 994125 982010 964351 941495 914716 885504 854842 823114 790532
63152G90532l2916l2393l1056k9266k7239k4966k2537k0231j8013j5431j2359
$$ 790532 757616 725223 694167 664901 637662 612696 590159 569928 551915 536484 524125
63141E24125r527p857p353p084o238m857l598l009l072l240k934k131j319p95
$$ 524125 514598 506741 499388 492304 486066 481209 477611 474602 471530 468290 465356 463225 461906 461111
63127D61111l15L93J129J625K032K616L197L477L698M316N157N549N308M936M759
$$ 461111 460796 461189 462318 463943 465975 468591 471788 475265 478963 483279 488436 493985 499293 504229 508988
63112E08988M503L946L351K997K786K634K732L072L184K770K208J987J952J641
$$ 508988 513491 517437 520788 523785 526571 529205 531937 535009 538193 540963 543171 545158 547110 548751
63098E48751J096P39O07L35o5O6J219K970M348M723M176L116J882O98k05o67q18
$$ 548751 549847 550586 551193 551528 551463 551529 552748 555718 560066 564789 568965 572081 573963 574661 574456 573789 572971
63081E72971j003j368j620j364n79M09J372K372L472M631N866P271Q694R722J0183
$$ 572971 571968 570600 568980 567616 567037 567446 568818 571190 574662 579293 585159 592430 601124 610846 621029
63066F21029J0446J0973J1823J2825J4013J5599J7618J9933K2521K5490K8794
$$ 621029 631475 642448 654271 667096 681109 696708 714326 734259 756780 782270 811064
63055H11064L2246L5771L9441M3217M6864N0170N3048N5398N7135N8407N9524
$$ 811064 843310 879081 918522 961739 1008603 1058773 1111821 1167219 1224354 1282761 1342285
63044A342285O0514O0932O0345N8926N7368N6315N6043N6573N7771N9179O0100
$$ 1342285 1402799 1463731 1524076 1583002 1640370 1696685 1752728 1809301 1867072 1926251 1986351
63033A986351O0078N9128N7222N3758M7972L9826L0041J9139P011o401k0472l4334
$$ 1986351 2046429 2105557 2162779 2216537 2264509 2304335 2334376 2353515 2360526 2354125 2333653 2299319
63021B299319m7461n9297o8797p5156p8801q0796q1303p9501p5148o9291o2989
$$ 2299319 2251858 2192561 2123764 2048608 1969807 1889011 1807708 1728207 1653059 1583768 1520779
63010A520779n6198m8513m0321l2376k4717j6832q697r75N734J1275J5672J9090
$$ 1520779 1464581 1416068 1375747 1343371 1318654 1301822 1293125 1292150 1297884 1309159 1324831 1343921
62998A343921K1973K4654K6887K8240K8841K9213K9478K9402K9116K9118K9400
$$ 1343921 1365894 1390548 1417435 1445675 1474516 1503729 1533207 1562609 1591725 1620843 1650243
62987A650243K9289K8301K6554K4115K0583J5622R396K144o085j4895k3295l0651
$$ 1650243 1679532 1707833 1734387 1758502 1779085 1794707 1804103 1806247 1800162 1785267 1761972 1731321
62975A731321l7428m4409n1327n6897o0092o0909n9981n7911n5151n2059m8864
$$ 1731321 1693893 1649484 1598157 1541260 1481168 1420259 1360278 1302367 1247216 1195157 1146293
62964A146293m5654m2446l9177l5718l2098k8662k5890k4008k2858k2039k1154
$$ 1146293 1100639 1058193 1019016 983298 951200 922538 896648 872640 849782 827743 806589
62953H06589k0075j9002j8153j7391j6420j5331j4540j4071j3443j2511j1919
$$ 806589 786514 767512 749359 731968 715548 700217 685677 671606 658163 645652 633733
62942F33733j2194j2770j2589j1482j0232r361q476p067n373m078l455l161k721
$$ 633733 621539 608769 596180 584698 574466 565105 556629 549562 544189 540111 536656 533495 530774
62929E30774k043j451j335j704k143k232j917j398q14k81m4k94q21j182j119p38
$$ 530774 528731 527280 525945 524241 522098 519866 517949 516551 515737 515456 515412 515118 514297 513115 511996 511258
62913E11258l10j23l19o37n76j55k20j400l032l836l625l464m001m458l851k435
$$ 511258 510948 510825 510506 509869 509293 509138 508918 507518 504486 500650 497025 493561 489560 485102 481251 478816
62897D78816j278q02m88K19J252K173K565K223J321M33N3P3m5o07j337j636j004
$$ 478816 477538 476736 476248 476467 477719 479892 482457 484680 486001 486434 486487 486560 486515 485908 484571 482935 481931
62880D81931N61K392L506L396K457J447P26K11k20o35j233k132l036l501l500
$$ 481931 482492 484884 488390 491786 494243 495690 496416 496627 496407 495772 494539 492407 489371 485870 482370
62865D82370l441l588l778l734l315k459j206R9R42J127R16O20K92o6k43l5M14
$$ 482370 478929 475341 471563 467829 464514 462055 460849 460948 461890 463017 463933 464553 464845 464779 464536 464501 464915
62848D64915P06N89K77K88R17J808K161J529L11p21j255j518j676j595j231q54
$$ 464915 465621 466210 466487 466775 467692 469500 471661 473190 473501 472780 471525 470007 468331 466736 465505 464651
62832D64651p01p02p31q23r36p28J11J340K317K584K227J652J253J242J732K755
$$ 464651 463950 463248 462517 461694 460758 460030 460141 461481 463798 466382 468609 470261 471514 472756 474488 477243
62816D77243M137N374N892N608N087M870M786M278L367K799L126M058M955N588
$$ 477243 481380 486754 492646 498254 503341 508211 512997 517275 520642 523441 526567 530625 535580 541168
62802E41168O138O769P538Q469R431J0126J0558J1209J2362J3510J3988J4122
$$ 541168 547306 554075 561613 570082 579513 589639 600197 611406 623768 637278 651266 665388
62790F65388J5096J7575K1024K4570K8008L1626L5551L9770M4575N0384N7113
$$ 665388 680484 698059 719083 743653 771661 803287 838838 878608 923183 973567 1030680
62779A030680O4179P1193P8244Q5388R2077R7486J01177J03216J03655J02029
$$ 1030680 1094859 1166052 1244296 1329684 1421761 1519247 1620424 1723640 1827295 1929324
62769A929324R7526Q9576P8318O4572M9301L3049J5897j953j9679l6088n0379
$$ 1929324 2026850 2116426 2194744 2259316 2308617 2341666 2357563 2355610 2335931 2299843 2249464
62758B249464o2514p2773q1197q7603r1959r4398r4984r3738r0896q6948q2279
$$ 2249464 2186950 2114177 2032980 1945377 1853418 1759020 1664036 1570298 1479402 1392454 1310175
62747A310175p7068p1570o6231o1312n6612n1796m6897m2239l7994l4055l0347
$$ 1310175 1233107 1161537 1095306 1033994 977382 925586 878689 836450 798456 764401 734054
62736G34054k6937k3793k0794j8055j5938j4448j2923j0721q174o337n649n343
$$ 734054 707117 683324 662530 644475 628537 614089 601166 590445 582271 575934 570285 564942
62724E64942m476l158k231j943j641p98K88J161K014L315N013O596P794Q739R622
$$ 564942 560466 557308 555077 553134 551493 550695 550983 552144 554158 557473 562486 569082 576876 585615 595237
62709E95237J0689J2461J5234J8434K1097K3235K6079L0529L5892M0646M4199
$$ 595237 605926 618387 633621 652055 673152 696387 722466 752995 788887 829533 873732
62698H73732M7358N1159N5706O0252O4063O6990O9265P0880P1357P0139O7028
$$ 873732 921090 972249 1027955 1088207 1152270 1219260 1288525 1359405 1430762 1500901 1567929
62687A567929O1981N4702M4962L3301K0845Q212m858j8516l1959m4004n4006o1771
$$ 1567929 1629910 1684612 1729574 1762875 1783720 1791932 1787074 1768558 1736599 1692595 1638589 1576818
62675A576818o7072o9941p1119p1414p0718o8408o4615o0407n6541n2773m8646
$$ 1576818 1509746 1439805 1368686 1297272 1226554 1158146 1093531 1033124 976583 923810 875164
62664H75164m4334m0267l6472l2761k9371k6813k5130k3608k1430j8480j5445
$$ 875164 830830 790563 754091 721330 691959 665146 640016 616408 594978 576498 561053
62653E61053j3066j1431j0124r007q447q600q915q796q380q130p845o839n070
$$ 561053 547987 536556 526432 517425 508978 500378 491463 482667 474287 466157 458312 451473 446403
62640D46403l427k666k539k271j493n11P8l7m55k93P58J750J479R0j082j263j005
$$ 446403 442976 440310 437771 435500 434007 433496 433574 433537 433082 432789 433547 435297 436776 436866 435784 434521 433516
62623D33516r87j045q63p35q53o17M84J863K521K375K131K218K665L612M965N904
$$ 433516 432529 431484 430621 429886 429033 428416 428900 430763 433284 435659 437790 440008 442673 446285 451250 457154
62607D57154N780N389O216Q404J0604J1988J3168J4759J6268J7319J8947K2511
$$ 457154 462934 468323 474539 482943 493547 505535 518703 533462 549730 567049 585996 608507
62595F08507K7742L2942L6947M0054M2992M5831M8150M9657N0238M9657M7496
$$ 608507 636249 669191 706138 746192 789184 835015 883165 932822 983060 1032717 1080213
62584A080213M3371L7192K9326K0523J1477K441o618j5492k3599l0406l5831m0004
$$ 1080213 1123584 1160776 1190102 1210625 1222102 1224543 1217925 1202433 1178834 1148428 1112597 1072593
62572A072593m2862m4233m4331m3847m3223m2065l9640l6023l2376k9808k8291
$$ 1072593 1029731 985498 941167 897320 854097 812032 772392 736369 703993 674185 645894
62561F45894k6882k4777k1831j8334j4781j1792r739q438p468o753o459o392o044
$$ 645894 619012 594235 572404 554070 539289 527497 517758 509320 501852 495099 488640 482248 476204
62548D76204n282m506m024l770l660l681l506k625j138J76R60J705K657K956J731
$$ 476204 470922 466416 462392 458622 454962 451281 447775 445150 444012 444188 445148 446853 449510 452466 454197
62533D54197l51j575j138J39J054J314J413J903L000M591O360Q147J0180J2623
$$ 454197 453846 452271 451133 451272 452326 453640 455053 456956 459956 464547 470907 479054 489234 501857
62519E01857J5014J6693J7820J9377K1973K5196K8418L1634L5062L8325M0709
$$ 501857 516871 533564 551384 570761 592734 617930 646348 677982 713044 751369 792078
62508G92078M1987M2458M2265M1172L9001L5828L1686K6460K0215J3346O280p34
$$ 792078 834065 876523 918788 959960 998961 1034789 1066475 1092935 1113150 1126496 1132776 1132042
62496A132042p383j3172j7683k0814k2540k2717k1338j8815j5624j1684o497n5
$$ 1132042 1124659 1111487 1093804 1072990 1050450 1027733 1006395 987580 971956 960272 953775 953720
62484I53720O701J2611J7377K1656K6205L1120L5914L9900M2324M2367L9532L4224
$$ 953720 960421 973032 990409 1012065 1038270 1069390 1105304 1145204 1187528 1229895 1269427 1303651
62472A303651K7730K1324J5248Q613M56r132j9004k8089l6282m3978n0988n6305
$$ 1303651 1331381 1352705 1367953 1376566 1377022 1367890 1348886 1320797 1284515 1240537 1189549 1133244
62460A133244n9104n9564n8491n6386n3297m9438m5377m1448l7286l2384k7020
$$ 1133244 1074140 1014576 956085 899699 846402 796964 751587 710139 672853 640469 613449
62449F13449k2238j8780j6248j3597j0383p193m791l232k007p83M54J753L141
$$ 613449 591211 572431 556183 542586 532203 525010 520219 516987 514980 514197 514651 516404 519545
62436E19545M219M426L881L397L390L181J933k01k359m149n897p769r322j0044
$$ 519545 523764 528190 532071 535468 538858 542039 543972 543771 541412 537263 531366 523597 514275 504231
62422E04231r898r175q219p362o785o307n683n103m953n078m835m074l401l187
$$ 504231 494333 485158 476939 469577 462792 456485 450802 445699 440746 435668 430833 426759 423358 420171
62408D20171k980k371j902k311l257l639l071k226j691j285p44l54l64k82N59
$$ 420171 417191 414820 412918 410607 407350 403711 400640 398414 396723 395438 394694 394340 393976 393694 394253
62393C94253J979L041L237K990K949L137L113K718K289K185K397K784L369M254
$$ 394253 396232 399273 402510 405500 408449 411586 414699 417417 419706 421891 424288 427072 430441 434695
62379D34695N272O046O417O612O944P505Q226R075R967J0647J0839J0562J0209
$$ 434695 439967 446013 452430 459042 465986 473491 481717 490792 500759 511406 522245 532807 543016
62366E43016J0297J1172J2765J4635J6404J8324K1158K5329L0370L5431M0182
$$ 543016 553313 564485 577250 591885 608289 626613 647771 673100 703470 738901 779083
62355G79083M4858M9577N4035N7786O0338O0926N8754N3752M6834L9067L0878
$$ 779083 823941 873518 927553 985339 1045677 1106603 1165357 1219109 1265943 1305010 1335888
62344A335888K2257J3491N179k380r437j6287k2773k8446l3058l6712l9508m1243
$$ 1335888 1358145 1371636 1376815 1374435 1364998 1348711 1325938 1297492 1264434 1227722 1188214 1146971
62332A146971m1549m0351l8019l5035l1725k8432k5703k3867k2521k0924j9060
$$ 1146971 1105422 1065071 1027052 992017 960292 931860 906157 882290 859769 838845 819785
62321H19785j7838j8044j9418k1048k2300k2976k2938k2158k1043k0127j9388
$$ 819785 801947 783903 764485 743437 721137 698161 675223 653065 632022 611895 592507
62310E92507j8322j6740j5034j3520j2012j0292q645p479o671n661m222k800j999
$$ 592507 574185 557445 542411 528891 516879 506587 497942 490463 483792 478131 473909 471109 469110
62297D69110j925k090j852q97N63J943K697K727K481K538K961L215K868K317K392
$$ 469110 467185 465095 463243 462346 462909 464852 467549 470276 472757 475295 478256 481471 484339 486656 489048
62282D89048L207L901L780L281L247L640L648K963K187J858J822J839K150K972
$$ 489048 492255 496156 499936 503217 506464 510104 513752 516715 518902 520760 522582 524421 526571 529543
62268E29543L994M898N949P538R420J1116J2879J5596J9739K4892L0419L6006
$$ 529543 533537 538435 544384 551922 561342 572458 585337 600933 620672 645564 675983 711989
62256G11989M1477M6545N1034N5045N8684O1769O3793O4050O1815N6798M9475
$$ 711989 753466 800011 851045 906090 964774 1026543 1090336 1154386 1216201 1272999 1322474
62245A322474M0723L1181K1186J1257K079o194j4204k2650l1454l9765m6615n1478
$$ 1322474 1363197 1394378 1415564 1426821 1428900 1422706 1408502 1385852 1354398 1314633 1268018 1216540
62233A216540n4527n6462n7748n7942n6130n2258m7559m3306l9526l5435l0838
$$ 1216540 1162013 1105551 1047803 989861 933731 881473 833914 790608 751082 715647 684809
62222F84809k6482k3116k0702j8684j6635j4512j2574j1179j0450j0017r295q092
$$ 684809 658327 635211 614509 595825 579190 564678 552104 540925 530475 520458 511163 503071
62210E03071o828o053n881n954n859n446m740l727k366q72K48O93Q84J580K947
$$ 503071 496243 490190 484309 478355 472496 467050 462310 458583 456217 455345 455593 456286 457170 458750 461697
62195D61697M273M795M550M210M389N302O764Q239R152R550J0131J1275J2309
$$ 461697 465970 470765 475315 479525 483914 489216 495980 504219 513371 522921 533052 544327 556636
62182E56636J2306J1312J0225R564R026Q315P638P252P089P131P610Q658J0177
$$ 556636 568942 580254 590479 600043 609069 617384 625022 632274 639363 646494 654104 662762 672939
62169F72939J2378J5910K1068K7220L3380L9003M4003M8349N2049N5108N7058
$$ 672939 685317 701227 722295 749515 782895 821898 865901 914250 966299 1021407 1078465
62158A078465N6819N3554M7494L9654L1009K2314J4213O879k66p839j5556k2576
$$ 1078465 1135284 1188838 1236332 1275986 1306995 1329309 1343522 1350401 1350135 1342296 1326740 1304164
62146A304164k8553l3762l8215m1436m3167m3641m3002m1152l8322l5113l1672
$$ 1304164 1275611 1241849 1203634 1162198 1119031 1075390 1032388 991236 952914 917801 886129
62135H86129k7483k2454j7502j3543j0454p655n235l661k717j622j67J117J993
$$ 886129 858646 836192 818690 805147 794693 787038 781803 778142 775425 773803 773636 774753 776746
62122G76746L016M685O763Q754J0583J2430J4180J5443J5852J5128J3105R973
$$ 776746 779762 784447 791210 799964 810547 822977 837157 852600 868452 883580 896685 906658
62110I06658O247K266j941o010q894r719q806p390o400n966n948o219o414o013
$$ 906658 912905 915171 913230 907220 898326 888607 879801 872411 866011 860045 854097 847878 841464 835451
62096H35451m987l854k818j401P29L015M641N562O308O946O996O348N631N466
$$ 835451 830464 826610 823792 822391 823120 826135 830776 836338 842646 849592 856588 862936 868567 874033
62082H74033N795O270O868P833R243J0973J2887J4855J6684J8223J9414K0135
$$ 874033 879828 886098 892966 900799 910042 921015 933902 948757 965441 983664 1003078 1023213
62070A023213K0201J9645J8832J8100J7527J7198J7450J8610K0585K2990K5392
$$ 1023213 1043414 1063059 1081891 1099991 1117518 1134716 1152166 1170776 1191361 1214351 1239743
62059A239743K7197K7559K5964K2808J9054J5293J1519P675L828j98m788r845
$$ 1239743 1266940 1294499 1320463 1343271 1362325 1377618 1389137 1396812 1400640 1400442 1395654 1385809
62047A385809j4666j8866k3019k7914l3375l8293m1709m3548m4324m4551m4486
$$ 1385809 1371143 1352277 1329258 1301344 1267969 1229676 1187967 1144419 1100095 1055544 1011058
62036A011058m4155m3427m2133m0187l7572l4379l0965k7835k5221k2831k0268
$$ 1011058 966903 923476 881343 841156 803584 769205 738240 710405 685184 662353 642085
62025F42085j7630j5394j3820j2709j1779j0989j0432j0077r763r306q673q071
$$ 642085 624455 609061 595241 582532 570753 559764 549332 539255 529492 520186 511513 503442
62013E03442p772p653p160o025m804m182l837k657k17K538M406N163N349N398
$$ 503442 495670 488017 480857 474832 470028 465846 462009 459352 459135 461673 466079 471242 476591 481989
61999D81989N555O156P247Q158Q107P136N819M272K258K14r20j107j544l040m908
$$ 481989 487544 493700 500947 509105 517212 524348 530167 534439 536697 536911 535991 534884 533340 530300 525392
61984E25392o083o670p439q314q442p676o902o746o784o433n917n812o068o047
$$ 525392 519309 512639 505200 496886 488444 480768 473866 467120 460336 453903 447986 442174 436106 430059
61970D30059n371m300l258k369j504o68j26j26n17q58j014j341k041k545k088
$$ 430059 424688 420388 417130 414761 413257 412589 412463 412337 411820 410962 409948 408607 406566 404021 401933
61955D01933p76M48R09Q00O31P03J263K490L964M814M883N166O512Q377R623J0193
$$ 401933 401157 401605 402514 403314 403945 404648 405911 408401 412365 417179 422062 427228 433740 442117 451740 461933
61939D61933J1098J2835J4745J6015J6567J6678J6350J5432J4017J2429J1039
$$ 461933 473031 485866 500611 516626 533193 549871 566221 581653 595670 608099 619138
61928F19138J0171R829R473Q498P006N583M294K529N3k498m516o117p384p616
$$ 619138 629309 639138 648611 657109 664115 669698 673992 676521 676574 674076 669560 663443 656059 648443
61914F48443o109l334n12J821M064O519Q934J1127J3305J5459J7060J7652J7313
$$ 648443 642334 639000 638488 640309 644373 650892 659826 670953 684258 699717 716777 734429 751742
61901G51742J6289J4505J1734Q004L653p80m603p309r036j0402j1773j2953j3738
$$ 751742 768031 782536 794270 802274 805927 805147 800544 793235 784199 773797 762024 749071 735333
61888G35333j4280j4688j4727j4219j3382j2441j1327j0146r440r454r564r092
$$ 735333 721053 706365 691638 677419 664037 651596 640269 630123 620683 611229 601665 592573
61876E92573q357q163q475q479p897p267o764n807m162k568j649r81J15J491K741
$$ 592573 584216 576053 567578 559099 551202 543935 537171 531364 527202 524634 522985 522004 522119 523610 526351
61861E26351M158O217Q460R984J0884J2167J4164J6092J7444J8803K0824K3191
$$ 526351 530509 536726 545186 555170 566054 578221 592385 608477 625921 644724 665548 688739
61849F88739K5135K6443K7347K7900K7990K7615K6633K4606K1435J7726J3982
$$ 688739 713874 740317 767664 795564 823554 851169 877802 902408 923843 941569 955551
61838I55551R828M687r98n997r688j2443j4559j5490j4514j1748q214n014k515
$$ 955551 965379 970066 969068 963071 953383 940940 926381 910891 896377 884629 876415 871401 868886
61825H68886j47K973O919J0593J2770J3251J2577J0852P560K629l131q787j3921
$$ 868886 868739 871712 878631 889224 901994 915245 927822 938674 946234 948863 945732 936945 923024
61812I23024j8287k1571k3903k5975k8064k9357k8872k6803k4401k2635k1402
$$ 923024 904737 883166 859263 833288 805224 775867 746995 720192 695791 673156 651754
61801F51754j9966j7801j5054j2413j0542r446q464p066n479m367m044m156l968
$$ 651754 631788 613987 598933 586520 575978 566532 558068 551002 545523 541156 537112 532956 528988
61788E28988k947j379m23j046k693l630k961j594p15r3J138K656L147K301J389
$$ 528988 526041 524662 524239 523193 520500 516870 513909 512315 511600 511507 512645 515301 518448 520749 522138
61773E22138J551K454L072K999K506J919J517J571K014K405K587K944L625L986
$$ 522138 523689 526143 529215 532214 534720 536639 538156 539727 541741 544146 546733 549677 553302 557288
61759E57288L375K128J184R16R93J203J743K492K675J649k26j857k481k275k008
$$ 557288 560663 562791 563975 564891 565884 567087 568830 571322 573997 575646 575420 573563 571082 568807 566799
61744E66799k298l210m314n015m916m069k939k013j423j046r08j186j715j874
$$ 566799 564501 561291 556977 551962 547046 542977 540038 538025 536602 535556 534648 533462 531747 529873
61730E29873j258k21N82R91J248J355J092O01M37Q69J604K252K594K406J539M10
$$ 529873 528615 528394 528976 529967 531215 532570 533662 534263 534700 535569 537173 539425 542019 544425 545964 546374
61714E46374k02p8J99J55l1j82o61j744k912l460l464l588m164m878n219m827
$$ 546374 546172 546094 546293 546448 546417 546235 545574 543830 540918 537458 533994 530406 526242 521364 516145 511318
61698E11318l751k681k549l372l994l569k769k707l171l049k243j846k297k651
$$ 511318 507567 504886 502337 498965 494971 491402 488633 485926 482755 479706 477463 475617 473320 470669
61684D70669k168j505j552j974j862j283j169j827k476k415j959j904k414k838
$$ 470669 468501 466996 465444 463470 461608 460325 459156 457329 454853 452438 450479 448575 446161 443323
61670D43323k553j740j139j115j272j152r63j186j699j911j664j369j173p39q8
$$ 443323 440770 439030 437891 436776 435504 434352 433389 432203 430504 428593 426929 425560 424387 423648 423560
61655D23560J20m31j016q00N6P69J072J273J490J524J407J430J673J963K290K779
$$ 423560 423680 423249 422233 421433 421489 422258 423330 424603 426093 427617 429024 430454 432127 434090 436380 439159
61639D39159L256L325K934K377J771R40j00j047j693k053k062j658j270j597k658
$$ 439159 442415 445740 448674 451051 452822 453762 453662 452615 450922 448869 446807 445149 443879 442282 439624
61624D39624l494l243k223j545j850k755l403l223k221r04ml8r19k049k796l006
$$ 439624 436130 432887 430664 429119 427269 424514 421111 417888 415667 414763 414759 414721 413802 411753 408957 405951
61608D05951l060l454m289n184n696n765n625n408n045m466l723k849j865j013
$$ 405951 402891 399437 395148 389964 384268 378503 372878 367470 362425 357959 354236 351387 349522 348509
61594C48509p23j175k040k741k971k893k867l045l186k943k341j873j946k389
$$ 348509 347786 346611 344571 341830 338859 335966 333099 330054 326868 323925 321584 319711 317765 315376
61580C15376k672k527k099j593j078p19q04j411k197k677k584k024j406j162j273
$$ 315376 312704 310177 308078 306485 305407 304688 303884 302473 300276 297599 295015 292991 291585 290423 289150
61565B89150j151l59O71J129R36P42P68M10n98j422j203l44J07k8kN09J035J310
$$ 289150 287999 287640 288311 289440 290376 291118 291886 292296 291698 290276 289073 288729 288836 288808 288806 289315 290350 291660
61547B91660J753K547L016K518J457Q29J012J524J851J944J967K002K112K305
$$ 291660 293413 295960 298976 301494 302951 303780 304792 306316 308167 310111 312078 314080 316192 318497
61533C18497K373K009J272O39M60M25j12j343k685l361l195k717k518k629k617
$$ 318497 320870 322879 324151 324790 325250 325675 325563 324220 321535 318174 314979 312262 309744 307115 304498
61518C04498k160j357n43K2K48K12J27K02L57K36l64j153j660j762j711j645j417
$$ 304498 302338 300981 300438 300460 300708 300920 301047 301249 301606 301842 301478 300325 298665 296903 295192 293547 292130
61501B92130r76n92n15o26o43n59n16m48k05K9r4m08k58N96J467J559R33K79M
$$ 292130 291154 290562 290047 289421 288778 288219 287703 287255 287050 287079 286985 286577 286319 286915 288382 289941 290874 291153 291157
61482B91157N5M11J068J607J459P41K56M18P85R23J098J579J865J280J09o30m49
$$ 291157 291212 291623 292691 294298 295757 296498 296754 297172 297957 298880 299978 301557 303422 304702 304811 304181 303732
61465C03732J37M45L42P7o8J97R61J750J770P97m76j184j111n26L84J536K611
$$ 303732 303869 304314 304656 304733 304665 304862 305823 307573 309343 310140 309664 308480 307369 306843 307227 308763 311374
61448C11374L080K657J515J80o98o74M0O08M30j17j26O68J565J888J859K121K695
$$ 311374 314454 317111 318626 318806 318108 317434 317474 318082 318512 318395 318269 318937 320502 322390 324249 326370 329065
61431C29065K951K509J706R98M01j93m69NJ042J890K106J970J964K158K394K636
$$ 329065 332016 334525 336231 337229 337630 337437 336968 336973 338015 339905 342011 343981 345945 348103 350497 353133
61415C53133K845K792K328J709J251Q75K92m73j140j620j954j925j254l17j4p19
$$ 353133 355978 358770 361098 362807 364058 364933 365225 364752 363612 361992 360038 358113 356859 356542 356528 355809
61399C55809j747k214k074j859j768j480q53k59p5j78k02j19k60p21j065q16j06
$$ 355809 354062 351848 349774 347915 346147 344667 343814 343555 343480 343302 343100 342981 342721 342000 340935 340119 340013
61382C40013M85P19R08J263J468J241R09R31J146J100R41J258K046K531K298J863
$$ 340013 340498 341217 342125 343388 344856 346097 347006 347937 349083 350183 351124 352382 354428 356959 359257 361120
61366C61120J809J965J920J825K093K635K878K567K027J707J807K268K894L504
$$ 361120 362929 364894 366814 368639 370732 373367 376245 378812 380839 382546 384353 386621 389515 393019
61352C93019M111M826N494N797N856O367P720R266R911R324Q162P174O534N987
$$ 393019 397130 401956 407450 413247 419103 425470 433190 442456 452367 461691 469853 477027 483561 489548
61338D89548N351M753M496M646M733M071K515O77p85j735k352k741k975l149l068
$$ 489548 494899 499652 504148 508794 513527 517598 520113 520790 520005 518270 515918 513177 510202 507053 503985
61323E03985k411j510j360k264l086k597j063L46J270K204L222L858M211M955
$$ 503985 501574 500064 498704 496440 493354 490757 489694 490040 491310 493514 496736 500594 504805 509760
61309E09760O147P117P878R357J1710J3586J3853J3205J3111J3807J4205J3352
$$ 509760 515907 523024 530902 540259 551969 565555 579408 592613 605724 619531 633736 647088
61297F47088J1129P778L717k63l273n061o090o939p823q596q952q786q476q595
$$ 647088 658217 665995 669712 669449 666176 661115 655025 648086 640263 631667 622715 613929 605453 596858
61283E96858r096r205q408p157o248n861n566m920l661j678O17K265K687K403
$$ 596858 587762 578557 570149 562992 556744 550883 545317 540397 536736 535058 535675 537940 540627 543030
61269E43030K355K778L245L540L774L855L599L294L522M389N541O836Q403R990
$$ 543030 545385 548163 551408 554948 558722 562577 566176 569470 572992 577381 582922 589758 598161 608151
61255F08151J1030J1360J1283J0750R269O915M708L488K926K150R84n0o92j356
$$ 608151 619181 630541 641824 652574 661843 668758 673466 676954 679880 682030 683014 682964 682272 680916
61241F80916k545m204n817o882p224o925o164n170m287l824l666l190j912j13
$$ 680916 678371 674167 668350 661468 654244 647319 641155 635985 631698 627874 624208 621018 619106 618993
61227F18993J400K216K729L613N128O949Q467R192R072Q497P959P662P587P670
$$ 618993 620393 622609 625338 628951 634079 641028 649495 658687 667759 676256 684215 691877 699464 707134
61213G07134P760P551O915O184N791N693N509N032M339L427K295J261Q15J062
$$ 707134 714894 722445 729360 735544 741335 747028 752537 757569 761908 765335 767630 768891 769706 770768
61199G70768J766K925M761P106R362J1322J3479J6189J8974K0965K1701K1226
$$ 770768 772534 775459 780220 787326 796688 808010 821489 837678 856652 877617 899318 920544
61187I20544J9722J7452J4864J2404J0277Q514P110N955M811L558K244R12l79
$$ 920544 940266 957718 972582 984986 995263 1003777 1010887 1016842 1021653 1025211 1027455 1028367 1027988
61174A027988j366j781j965k778m596o737q238q992r729j0999j2573j3863j4708
$$ 1027988 1026622 1024841 1022876 1020098 1015502 1008765 1000527 991535 981806 970807 958234 944371 929663
61161I29663j5584j7009j8817k0162k0393j9742j8858j7906j6608j4978j3398
$$ 929663 914079 897070 878253 858091 837698 817956 799098 781192 764584 749606 736208
61150G36208j1966j0374q530o661m734k526n43Q0j062l027m814o472q265r575
$$ 736208 724242 713868 705338 698677 693943 691417 690874 690954 689892 686865 682051 675579 667314 657739
61136F57739r536q344o984n886m687l132j385M34K284L887N006O035P657R994
$$ 657739 648203 639859 632875 626989 622302 619170 617785 618219 620503 624390 629396 635431 643088 653082
61122F53082J2627J5285J7912K0238K2037K3732K5947K8560L0882L2741L4510
$$ 653082 665709 680994 698906 719144 741181 764913 790860 819420 850302 883043 917553
61111I17553L6137L7006L6917L6321L5429L3976L2087L0391K8947K6952K4037
$$ 917553 953690 990696 1027613 1063934 1099363 1133339 1165426 1195817 1224764 1251716 1275753
61100A275753K0920J8126J4921J0354M690j064o550j2013j7152k1092k3585k5438
$$ 1275753 1296673 1314799 1329720 1340074 1344764 1343700 1337150 1325137 1307985 1286893 1263308 1237870
61088A237870k7570l0100l2479l4024l4316l3481l2248l1427l1175l0927l0041
$$ 1237870 1210300 1180200 1147721 1113697 1079381 1045900 1013652 982225 951050 920123 890082
61077H90082k8341k6108k3801k1724j9820j7813j5658j3705j2256j1136r881q282
$$ 890082 861741 835633 811832 790108 770288 752475 736817 723112 710856 699720 689839 681557
61065F81557o515m961l986l657l420k397l23J977L511M215M827N743O596P023
$$ 681557 675042 670081 666095 662438 659018 656621 656298 658275 661786 666001 670828 676571 683167 690190
61051F90190P286P989R376J1180J2938J4352J5473J6654J8291K0488K2994K5350
$$ 690190 697476 705465 714841 726021 738959 753311 768784 785438 803729 824217 847211 872561
61039H72561K7166K8303K8926K9371K9954L0884L2232L3775L5084L6053L7236
$$ 872561 899727 928030 956956 986327 1016281 1047165 1079397 1113172 1148256 1184309 1221545
61028A221545L9241M1760M3764M4720M5124M5534M5719M5225M4359M4060M5074
$$ 1221545 1260786 1302546 1346310 1391030 1436154 1481688 1527407 1572632 1616991 1661051 1706125
61017A706125M7706N2132N8375O6069P4586Q3342R1950J00606J10615J24215J43490
$$ 1706125 1753831 1805963 1864338 1930407 2004993 2088335 2180285 2280891 2391506 2515721 2659211
61006B659211J70132K06396K55226L18785L98119M95437O15755P65808R54304
$$ 2659211 2829343 3035739 3290965 3609750 4007869 4503306 5119061 5884869 6839173
60997F839173J194996J501301J861629K211023K437009K434742K172430J708606
$$ 6839173 8034169 9535470 11397099 13608122 16045131 18479873 20652303 22360909
60989B2360909J150618O04010J58642j04017j31042N0582L10767M70615M02528
$$ 22360909 23511527 24115537 24274179 24170162 24039120 24089702 24400469 24871084 25273612
60980B5273612R1233l87930r33384j457929j889473k167018k257345k174843j975173
$$ 25273612 25364845 24976915 24043531 22585602 20696129 18529111 16271766 14096923 12121750
60971A2121750j724215j470119j236965j033208q60008p14689n92977m91450m08213
$$ 12121750 10397535 8927416 7690451 6657243 5797235 5082546 4489569 3998119 3589906
60962C589906l41505k88582k46286k12213j84963j63408j45970j30775j16480
$$ 3589906 3248401 2959819 2713533 2501320 2316357 2152949 2006979 1876204 1759724
60953A759724j02717q9629p7259o5725n5628m7709m2051l8101l5526l4457l4707
$$ 1759724 1657007 1567378 1490119 1424394 1368766 1321057 1279006 1240905 1205379 1170922 1136215
60942A136215l5332l5370l4643l3488l2026l0247k8515k7329k6597k5676k4290
$$ 1136215 1100883 1065513 1030870 997382 965356 935109 906594 879265 852668 826992 802702
60931H02702k2858k1709k0517j8907j7193j5880j4738j3135j1191r840r454r173
$$ 802702 779844 758135 737618 718711 701518 685638 670900 657765 646574 636734 627280 618107
60919F18107q062o406n219m898m996n054m870m159k809j456j034j511j789j138
$$ 618107 610045 603639 598420 593522 588526 583472 578602 574443 571634 570178 569144 567633 565844 564706
60905E64706l5O95Q95Q32N97L34M77J112J494Q50o34k127l159l757l963l835l726
$$ 564706 564671 565366 566261 567093 567690 568024 568501 569613 571107 571957 571323 569196 566037 562280 558317 554482 550756
60888E50756l878l938l552l115l249l706l642k923k254k022j847j471j196j206
$$ 550756 546878 542940 539388 536273 533024 529318 525676 522753 520499 518477 516630 515159 513963 512757
60874E12757j235j181j240j093Q4K197L703L364J951J391K590M845P030Q502R076
$$ 512757 511522 510341 509101 508008 508092 510289 513992 517356 519307 520698 523288 528133 535163 543665 552741
60859E52741Q988Q913R301R658R183Q007P077O746O413N779N553O317P402P686
$$ 552741 561729 570642 579943 589601 598784 606791 613868 620614 627027 632806 638359 644676 652078 659764
60845F59764P075O401O009N308L784J835K44o54j019j030q42p74j133j788k188
$$ 659764 666839 673240 679249 684557 688341 690176 690420 689766 688747 687717 686875 686101 684968 683180 680992
60830F80992j854p11R77K784M267N235N968O898Q010Q874R345R798J0436J0761
$$ 680992 679138 678427 679404 682188 686455 691690 697658 704556 712566 721440 730785 740583 751019 761780
60816G61780J0262R331Q923R374J0119J0568J0706J0692J0462R983R434Q824P855
$$ 761780 772042 781373 790296 799670 809789 820357 831063 841755 852217 862200 871634 880458 888313
60803H88313O477N202M463L982L185K009Q33k02j372k845m468o027p405q441r024
$$ 888313 894790 899992 904455 908437 911622 913631 914464 914262 912890 910045 905577 899550 892145 883704 874680
60788H74680r330r724j0282j0672j0615j0278j0089j0284j0689j0885j0631j0135
$$ 874680 865350 855626 845344 834672 824057 813779 803690 793406 782717 771832 761201 751066
60776G51066r855r998j0269j0247r790r051q276p739p618p703p525o986o596o773
$$ 751066 741211 731213 720944 710697 700907 691856 683580 675841 668223 660520 652995 646009 639413 632640
60762F32640p223p421p415p558p712p412o792o642p284q058q195p729p204o896
$$ 632640 625417 617996 610581 603023 595311 587899 581107 574465 567181 559123 550928 543199 535995 529099
60748E29099o650o190n302l982k657j974k151k746l260l645m046m444m797n166
$$ 529099 522449 516259 510957 506975 504318 502344 500193 497447 494187 490542 486496 482052 477255 472089
60734D72089n373m973l943l048k993l461l522k823j840j120p81o89o50m07M1K13
$$ 472089 466716 461743 457800 454752 451759 448298 444776 441953 440113 438993 438212 437523 436873 436466 436507 436720
60718D36720k86j023j260j096j327k038k261j491p40j268k782l797l563k774k386
$$ 436720 436434 435411 434151 433055 431728 429690 427429 425938 425198 423930 421148 417351 413788 411014 408628
60703D08628k510k780l041l283l275k815k176j877k059k339k306j946j555j385
$$ 408628 406118 403338 400297 397014 393739 390924 388748 386871 384812 382473 380167 378221 376666 375281
60689C75281j397j326r55l88M4J96L08O98J304J737J728J477J414J696J990J842
$$ 375281 373884 372558 371603 371215 371259 371455 371763 372461 373765 375502 377230 378707 380121 381817 383807 385649
60673C85649J299J040J665K854L526L012J833J040J013J252J220R39O36L45K4
$$ 385649 386948 387988 389653 392507 396033 399045 400878 401918 402931 404183 405403 406342 406978 407323 407347
60658D07347j78j48J7L09J059K514M184N098M792L886L478M118N389O375O408
$$ 407347 407169 407021 407038 407347 408406 410920 415104 420202 424994 428880 432358 436476 441865 448240 454648
60643D54648N459L870J922j87k045l105l314l350l812m347m079k904j797j654
$$ 454648 460107 463977 465899 465712 463667 460562 457248 453898 450086 445739 441660 438756 436959 435305
60629D35305k214k484j986j166o99q07j270j823k338k710k754k315j556r84j038
$$ 435305 433091 430607 428621 427455 426756 425949 424679 422856 420518 417808 415054 412739 411183 410199 409161
60614D09161j618k163k219j807j173m96L6J23l11q92j123r99q76q14m02N27J411
$$ 409161 407543 405380 403161 401354 400181 399685 399721 399844 399533 398641 397518 396519 395643 394829 394427 394954 396365
60597C96365J474O50l94j022j166j010o02L2O03P71N39K33Q0Q6K05L99M93L12
$$ 396365 397839 398489 398095 397073 395907 394897 394295 394327 394930 395701 396240 396473 396553 396639 396844 397243 397736 398048
60579C98048k0j51NK44N55J215K254L253L968M652N491O205O734P741R731J1998
$$ 398048 398028 397877 397882 398126 398681 399896 402150 405403 409371 414023 419514 425719 432453 440194 449925 461923
60563D61923J3386J3814J4066J4113J2801R503N167J210j834m142n849p065p982
$$ 461923 475309 489123 503189 517302 530103 539606 544773 545983 544149 540007 534158 527093 519111
60550E19111q381p574n520l280j769o11R78K785M098N090O529Q356R769J0686
$$ 519111 510730 503156 497636 494356 492587 491976 492954 495739 499837 504927 511456 519812 529581 540267
60536E40267J1856J3338J4049J3376J2064J0869R248O295K412r39k906l928m781
$$ 540267 552123 565461 579510 592886 604950 615819 625067 631362 633774 632835 629929 626001 621220
60523F21220n589n958n668n088m882n266n599n009l487j961j149p90l16K90P21
$$ 621220 615631 609673 604005 598917 594035 588769 583170 578161 574674 572713 571564 570774 570458 570748 571469
60508E71469R95J330J640J786K130L218N003P030R384J2755J7372K2436K7002
$$ 571469 572464 573794 575434 577220 579350 582568 587571 594601 603985 616740 634112 656548 683550
60495F83550L1018L5110L9612M4137M7859M9893M9545M6613M1443L4389K5275
$$ 683550 714568 749678 789290 833427 881286 931179 980724 1027337 1068780 1103169 1128444
60484A128444J3799N87j2572k3859l2694l9566m4882m8398m9821m9341m7340m3940
$$ 1128444 1142243 1142830 1130258 1106399 1073705 1034139 989257 940859 891038 841697 794357 750417
60472G50417l9327l4258k9745k6218k3384k0851j8566j6563j4778j3218j1962
$$ 750417 711090 676832 647087 620869 597485 576634 558068 541505 526727 513509 501547
60461E01547j0829r386p545n837m866m629m639m475m044l429k808k435k505l005
$$ 501547 490718 481332 473787 467950 463084 458455 453816 449341 445297 441868 439060 436625 434120 431115
60447D31115l704m274m421m099l641l416l374l094k323j210L4J199J836J465L41
$$ 431115 427411 423137 418716 414617 410976 407560 404186 401092 398769 397559 397593 398792 400628 402093 402434
60432D02434n52o12k93k92n69p19q02j114j443j289o84k1P05J691K492K254J038
$$ 402434 401882 401270 400977 400685 400116 399397 398595 397481 396038 394749 394065 394044 394749 396440 398932 401186 402224
60415D02224Nj4N79J016J217J446J624J551J430J505J518J131O39O88J308J827
$$ 402224 402229 402215 402794 403810 405027 406473 408097 409648 411078 412583 414101 415232 415871 416559 417867 419694
60399D19694J710J109N29L67P42J460K073K273K246K412K802L057K995K819K696
$$ 419694 421404 422513 423042 423409 424151 425611 427684 429957 432203 434615 437417 440474 443469 446288 448984
60384D48984K509K202K016K093K080J516N16j67R6J145K222K708K636K508K673
$$ 448984 451493 453695 455711 457804 459884 461400 461916 461749 461845 462990 465212 467920 470556 473064 475737
60369D75737K920K703J813P53K95O24J050P95l6n28r6P95J272J158J067J484K285
$$ 475737 478657 481360 483173 483926 484221 484845 485895 486690 486654 486126 486030 486825 488097 489255 490322 491806 494091
60352D94091L127L890M537N008N553O792Q955J1298J2702J2791J2028J0856R217
$$ 494091 497218 501108 505645 510653 516206 522998 531953 543251 555953 568744 580772 591628 600845
60339F00845O995M347J409j915n493q567j0320j0691j0333r797r103q123p001
$$ 600845 607840 612187 613596 611681 606188 597621 587301 576610 566277 556480 547377 539254 532253
60326E32253n987n127m377l872l738l683l185k240j545j706k396k701k177j191
$$ 532253 526266 521139 516762 512890 509152 505469 502284 500044 498499 496793 494397 491696 489519 488328
60312D88328j70R79K442L920M937N637O793Q966J1960J5224J8416K1366K3672
$$ 488328 488158 489137 491579 495499 500436 506073 512866 521832 533792 549016 567432 588798 612470
60299F12470K4745K4212K2190J9024J4976J0185M908l85n194r271j2614j5213
$$ 612470 637215 661427 683617 702641 717617 727802 732710 732325 727131 717860 705246 690033
60287F90033j6887j7469j7081j6122j4976j3828j2683j1497j0268r108q204p657
$$ 690033 673146 655677 638596 622474 607498 593670 580987 569490 559222 550114 541910 534253
60275E34253p326o962o441n866n445n375n672n980n680m539l201k597k802k924
$$ 534253 526927 519965 513524 507658 502213 496838 491166 485186 479506 474967 471766 469169 466367 463443
60261D63443k320j435j040j101j018p38p85j212j286n82K69M27K6l3P71K083L144
$$ 463443 461123 459688 458648 457547 456529 455791 455006 453794 452508 451926 452195 452622 452648 452615 453386 455469 458613
60244D58613L341K498J086N8r2M7m08j320j707j229o63o74q77o30l4N51J385K837
$$ 458613 461954 464452 465538 465596 465504 465551 465143 463823 462116 460887 460224 459550 458673 458043 458009 458560 459945 462782
60226D62782M343M891M491M164M361M314L354K024J292J294J550J978K917M271
$$ 462782 467125 472016 476507 480671 485032 489346 492700 494724 496016 497310 498860 500838 503755 508026
60212E08026N401N895N933N838N733N725N952O318O533O537O573O679O534O032
$$ 508026 513427 519322 525255 531093 536826 542551 548503 554821 561354 567891 574464 581143 587677 593709
60198E93709N563N394N129M297L263K899L292L425K529J189N89Q89J034K21j164
$$ 593709 599272 604666 609795 614092 617355 620254 623546 626971 629500 630689 631278 632167 633201 633422 632258
60183F32258k347l280m362n392n668n140m713n005n486n302m538l997l979m032
$$ 632258 629911 626631 622269 616877 611209 606069 601356 596351 590865 585563 581025 577028 573049 569017
60169E69017l796l389k850j893n83L43L19k67n95n21n56r17j154p93N1R15J426
$$ 569017 565221 561832 558982 557089 556506 556849 557168 556901 556306 555785 555229 554312 553158 552365 552416 553331 554757
60152E54757J434R80M01J77N33J254K036K744L308L650L935M549N497O143O037
$$ 554757 556191 557171 557572 557749 558282 559536 561572 564316 567624 571274 575209 579758 585255 591398 597435
60137E97435N800O552Q359R920J0104R302Q732Q774Q597P366N188K780P07p68
$$ 597435 603235 609787 618146 628066 638170 647472 656204 664978 673575 680941 686129 688909 689616 688848
60123F88848j501j621j633j962k402k372j706q81l72o6M28J144J698J741J247
$$ 688848 687347 685726 684093 682131 679729 677357 675651 674770 674398 674332 674760 675904 677602 679343 680590
60108F80590M43l19o85n89m60q39j746k718l516m405n460o085n748m896m486m628
$$ 680590 681033 680714 680029 679440 678980 678141 676395 673677 670161 665756 660296 654211 648463 643567 639081 634453
60092F34453m406l219j602k94Q48K372M044N004N040M999N679O833P518P122N830
$$ 634453 630047 626828 625226 624932 625780 628152 632196 637200 642240 647239 652918 659751 667269 674391 680221
60077F80221M319L165K368J340m39k700m620n831o813q087r465j0370j0589j0316
$$ 680221 684540 687705 690073 691413 690974 688274 683654 677823 671010 662923 653458 643088 632499 622183
60063F22183r734q967q322q137q390q708q722q213p134n767m742m427m405l905
$$ 622183 612449 603482 595160 587023 578633 569925 561203 552990 545856 540089 535347 530920 526515 522610
60049E22610k762j527o12K03J303K664L943M819N143M992M838N252O273P216P421
$$ 522610 519848 518321 517709 517912 519215 521879 525822 530641 535784 540776 545614 550866 557139 564355 571776
60034E71776O891O056N100L937K643J552Q17P1j228l197n289o717p252p474q137
$$ 571776 578667 584723 589823 593760 596403 597955 598772 598843 597615 594418 589129 582412 575160 567686 559549
60019E59549r295j0311j0673j0475r992r215q103o985o298o060n798n038l653
$$ 559549 550254 539943 529270 518795 508803 499588 491485 484500 478202 472142 466344 461306 457653
60006D57653j922m28K60J88J30Q42K201L349L620L102K381J970K001K231K374
$$ 457653 455731 455303 455563 455751 455881 456723 458924 462273 465893 468995 471376 473346 475347 477578 479952
59991D79952K510K986L793M350M246L879L893M242M398M327M515M999N115M425
$$ 479952 482462 485448 489241 493591 497837 501716 505609 509851 514249 518576 523091 528090 533205 537630
59977E37630L262K074Q23n29j600k068k228k502k789k740k329j679o13R61K457
$$ 537630 540892 542966 543789 543260 541660 539592 537364 534862 532073 529333 527004 525325 524712 525673 528130
59962E28130L028K646K233K559L443M072L872K934J811R10R7r59k066k557k304
$$ 528130 531158 533804 536037 538596 542039 546111 549983 552917 554728 555638 555735 554776 552710 550153 547849
59947E47849k116k597l164k887j934j308j360j521j496j667k198k655k893l349
$$ 547849 545733 543136 539972 537085 535151 533843 532483 530962 529466 527799 525601 522946 520053 516704
59933E16704m048m216l484k661k514k541j813n28K88L19K01L79O71R72J516K231
$$ 516704 512656 508440 504956 502295 499781 497240 495427 494899 495187 495506 495707 496086 496757 497729 499245 501476
59917E01476K628K606K699L234L863M191M409M839N293N313M893M493M468M809
$$ 501476 504104 506710 509409 512643 516506 520697 525106 529945 535238 540551 545444 549937 554405 559214
59903E59214N351N970O433O363N538M257L137K352J254p88l199m361l430j456
$$ 559214 564565 570535 576968 583331 588869 593126 596263 598615 599869 599081 595882 591521 588091 586635
59889E86635j78j1J07J017K364L367L881M327N100O307P711Q705Q739P997P287
$$ 586635 586457 586446 586553 587570 589934 593301 597182 601509 606609 612916 620627 629332 638071 646068 653355
59874F53355P027O759N851M295K467N59j434l407n160o530p269p179o568o193
$$ 653355 660382 667141 672992 677287 679754 680313 678879 675472 670312 663782 656513 649334 642766 636573
59860F36573o378o611o354n871n731n892n844n409m779l899k464m97J663L899
$$ 636573 630195 623584 617230 611359 605628 599736 593892 588483 583704 579805 577341 576844 578507 582406
59846E82406O366Q888J0848J1794J1715J0673Q629N797K784K41j378j692n27J543
$$ 582406 588772 597660 608508 620302 632017 642690 651319 657116 659900 660141 658763 657071 656544 658087
59832F58087L254L551K384N33j154k333l237m348n791p087p735p892q116q520
$$ 658087 661341 664892 667276 667809 666655 664322 661085 656737 650946 643859 636124 628232 620116 611596
59818F11596q798q977r428r929r562q027o381n757n885n628m701l856l537l209
$$ 611596 602798 593821 584393 574464 564902 556875 550494 544737 538852 533224 528523 524667 521130 517921
59804E17921k280j003m9L38M19M99O47O29K9j294k765l543l504l378l681m053
$$ 517921 515641 514638 514589 514927 515346 515845 516492 517121 517150 515856 513091 509548 506044 502666 498985 494932
59788D94932l985l679l564l412k690j651j182j411j339l27P46N51q08j776j263
$$ 494932 490947 487268 483704 480292 477602 475951 474769 473358 472019 471692 472438 472989 472181 470405 469142
59773D69142J08R53Q25N14Q17J518J793J297N94N05J278K476L474L895L732L344
$$ 469142 469250 470203 471028 471542 472359 473877 475670 476967 477561 478066 479344 481820 485294 489189 492921 496265
59757D96265L323M009N050N777O094O588P528Q271Q174P645P657Q377R047R194
$$ 496265 499588 503597 508647 514424 520518 527106 534634 542905 551079 558724 566381 574758 583805 592999
59743E92999R136R039Q327O535M255K551J788J501J132M35n73j559j938j529r75
$$ 592999 602135 611174 619501 626036 630291 632842 634630 636131 637263 637698 637125 635566 633628 632099 631124
59728F31124r92j412j563j414j515j864j729q81j23j72o84r89j158j593k004j724
$$ 631124 630132 628720 627157 625743 624228 622364 620635 619754 619631 619459 618775 617786 616628 615035 613031 611307
59712F11307q69l05l77m50j4N06N18L03N90J313J543P40m60j019p11j51J93N55
$$ 611307 610438 610133 609756 609306 609292 609798 610316 610619 611209 612522 614065 614805 614345 613326 612615 612464 612657 613212
59694F13212J329K341K993K941K347J484M45o88j625k050j906j365n54L98J180
$$ 613212 614541 616882 619875 622816 625163 626647 627092 626404 624779 622729 620823 619458 618904 619302 620482
59679F20482J377R12J77m34r71j749k791l784m628n589o701p322o830n659n011
$$ 620482 621859 622771 622948 622514 621543 619794 617003 613219 608591 603002 596301 588979 582149 576490 571479
59664E71479n395n927n464l974k410j483j148j093j130r76k37J080K409L206L501
$$ 571479 566084 560157 554693 550719 548309 546826 545678 544585 543455 542479 542242 543322 545731 548937 552438
59649E52438L643L692L356K423J048l24j215j449j352j524k262l248l891l886
$$ 552438 556081 559773 563129 565552 566600 566276 565061 563612 562260 560736 558474 555226 551335 547449
59635E47449l344k566j830j286q40k34O30J442J779J573J076M56l51j237j757
$$ 547449 544105 541539 539709 538423 537583 537349 537979 539421 541200 542773 543849 544305 543954 542717 540960
59620E40960j613j223j376k248l124l292k974k890l056k661j348K5L98m6j02Q96
$$ 540960 539347 538124 536748 534500 531376 528084 525110 522220 519164 516503 515155 515180 515578 515532 515430 516326
59604E16326K378L489M052M319M192L290J653k1r74j055p77p62j161j586j641
$$ 516326 518704 522193 526245 530564 534756 538046 539699 539678 538704 537649 536872 536110 534949 533363 531722
59589E31722j342r66o84n65p56j293j839k048k141k620l327l435k582j507j153
$$ 531722 530380 529414 528730 528165 527409 526116 524277 522229 520088 517468 514141 510706 508124 506617 505464
59574E05464j512j886j917j845j842j700j263p57n33o09o24j97O83J652K305K536
$$ 505464 503952 502066 500149 498304 496462 494762 493499 492742 492209 491600 490976 490779 491462 493114 495419 497955
59558D97955K403J856R54K04J68O68R52Q02Q57J475J990J651P92L24N07J027J908
$$ 497955 500358 502214 503168 503372 503540 504208 505160 505962 506819 508294 510284 511935 512727 513051 513558 514585 516493
59541E16493L453N426P267R164J1920J5461J8348J9199J7939J5175J1109N805
$$ 516493 519946 525372 532639 541803 553723 569184 587532 606731 624670 639845 650954 656759
59529F56759J38m313o431o178m284j656R40L117M972O791Q499R533R226P363M445
$$ 656759 656897 652584 646153 639975 635691 634035 634975 638092 643064 649855 658354 667887 677113 684476 688921
59514F88921J393j115l017m585n997p397r061j0995j2490j2710j1813j0819j0229
$$ 688921 690314 689199 686182 681597 675600 668203 659142 648147 635657 622947 611134 600315 590086
59501E90086r500q239p082o710o577n590l783k306j794j625j033j33M81O32N49
$$ 590086 580586 572347 565265 558555 551978 546388 542605 540299 538505 536880 535847 535714 536195 536827 537376
59486E37376M64O24J357K673M022M886N417O089O980P844Q688R751J0869J1520
$$ 537376 537840 538464 539821 542494 546516 551402 556819 562908 569888 577732 586420 596171 607040 618560
59472F18560J1526J1195J0508Q784N663K014p47k047k394k364k015j320m88M37
$$ 618560 630086 641281 651789 660573 666236 668250 667503 665456 663062 660698 658683 657363 656875 657312
59458F57312J777L683N800P841J0082J2828J5730J8190K0183K2074K3688K4252
$$ 657312 659089 662772 668572 676413 686495 699323 715053 733243 753426 775500 799188 823440
59446H23440K3345K1290J8374J4251Q479J366o056j2702j7862k1231k2832k2867
$$ 823440 846785 868075 886449 900700 909179 910545 904489 891787 873925 852694 829862 806995
59434H06995k1559j9339j7065j5652j5206j4901j3982j2554j1084r509p360m519
$$ 806995 785436 766097 749032 733380 718174 703273 689291 676737 665653 656144 648784 644265
59422F44265j320J979N374Q772J1994J5080J8114K0821K2944K5134K8582L3184
$$ 644265 642945 644924 650298 659070 671064 686144 704258 725079 748023 773157 801739 834923
59410H34923L6461L5163K8092J7030N001n912j5028k2015k5989k5826k1198j3322
$$ 834923 871384 906547 934639 951669 956670 950758 935730 913715 887726 861900 840702 827380
59398H27380m713J914M836L763n47o889j3966k0526k5610k8758k9831k8711k5428
$$ 827380 822667 824581 829417 833180 832633 825744 811778 791252 765642 736884 707053 678342 652914
59385F52914k0689j5930j2443j0395q966p398n655m021k556j251l85j93k98J0
$$ 652914 632225 616295 603852 593457 584491 577093 571438 567417 564861 563610 563225 563032 562734 562744
59371E62744Q55J559J612J390J575K199K760L157L850M977N936O209O131O367
$$ 562744 563599 565158 566770 568160 569735 571934 574694 577851 581701 586678 592614 598823 604954 611321
59357F11321O951P454P961R105J1000J2865J4098J5170J6866J9079K0985K2177
$$ 611321 618272 625726 633687 642792 653792 666657 680755 695925 712791 731870 752855 775032
59345G75032K2937K3464K3649K3641K3817K3916K2916K0310J6824J3356R711N217
$$ 775032 797969 821433 845082 868723 892540 916456 939372 959682 976506 989862 999573 1004790
59333A004790J30m550q533j2473j6613k0164k2475k3938k5138k5790k5294k3865
$$ 1004790 1004920 1000370 991837 979364 962751 942587 920112 896174 871036 845246 819952 796087
59321G96087k2223k0456j8071j5146j2543j0730r209p438n677m465l777l253k854
$$ 796087 773864 753408 735337 720191 707648 696918 687709 680271 674594 670129 666352 663099 660245
59308F60245k679k343j261M65K035K993L812N207P171R007J0244J1271J2923J5402
$$ 660245 657566 655223 653962 654427 656462 659455 663267 668474 675645 684652 694896 706167 719090 734492
59294G34492J7593J7727J4932R998M387j201o876j2318j6302j7731j6759j4505
$$ 734492 752085 769812 784744 794742 799129 797928 791052 778734 762432 744701 727942 713437
59282G13437j1984r643p593n848m237k448k56K299M887P111Q868J0596J2913J5835
$$ 713437 701453 691810 684217 678369 674132 671684 671428 673727 678614 685725 694593 705189 718102 733937
59268G33937J8544K0071K0041J8746J6670J4075J0880O899K347j969n416q342
$$ 733937 752481 772552 792593 811339 828009 842084 852964 859863 862210 860241 854825 846483
59256H46483j1553j4842j6892j6994j6054j5286j4673j3617j2378j1672j1141
$$ 846483 834930 820088 803196 786202 770148 754862 740189 726572 714194 702522 691381
59245F91381r646p131m882l636k600r28R06K069K838M098N787O932P063O752O629
$$ 691381 681735 674604 669722 666086 663486 662558 663464 665533 668371 672469 678256 685188 692251 699003 705632
59230G05632O592O157N152L776K270O64j236l609o294q739j0495j1644j2501j3004
$$ 705632 712224 718381 723533 727309 729579 730243 729007 725398 719104 710365 699870 688226 675725 662721
59216F62721j2760j1679j0257r070q226p417o407n280m187l085j892q58m41o22
$$ 662721 649961 638282 628025 618955 610729 603312 596905 591625 587438 584353 582461 581603 581162 580540
59202E80540n88M71K302L704L844L137K697L175M274N208N394M830L929L026K122
$$ 580540 579952 580423 582725 586429 590273 593410 596107 599282 603556 608764 614158 618988 622917 625943 628065
59187F28065J201N11K42J01k65n63j49R59K044K753L448M253M569M101L571L714
$$ 628065 629266 629777 630019 630120 629855 629292 629143 630102 632146 634899 638347 642600 647169 651270 654841 658555
59171F58555M168M150L888M372N923P886R732J1542J3267J4277J4062J2809J1019
$$ 658555 662723 666873 670761 675133 681056 688942 698674 710216 723483 737760 751822 764631 775650
59158G75650Q950O756M681K736N23k295n442q283j0459j2032j3084j3436j2930
$$ 775650 784600 791356 796037 798773 799296 797001 791559 783276 772817 760785 747701 734265 721335
59145G21335j1797j0626r837r297q546p434o315n607n380n483n770n981n729m938
$$ 721335 709538 698912 689075 679778 671232 663798 657483 651876 646496 641013 635243 629262 623533 618595
59131F18595m106l738l635l118j919n02N25J052J457K130L122M210N272O497P982
$$ 618595 614489 610751 607116 603998 602079 601577 602102 603154 604611 606741 609863 614073 619345 625842 633824
59116F33824R233R555R048Q639Q847R037Q421P196O160N540M971M304L691L092
$$ 633824 643057 652612 661660 670299 679146 688183 696604 703800 709960 715500 720471 724775 728466 731558
59102G31558K454K166K512K798J974J64j417k175k738l541l902l165j913j220
$$ 731558 734012 736178 738690 741488 743462 743626 742209 740034 737296 733755 729853 726688 724775 723555
59088G23555j247j296r03k38K69R6j218l451n554o712p312q214r349r861r566
$$ 723555 722308 721012 720109 719871 720140 720236 719018 715567 710013 703301 695989 687775 678426 668565 658999
59073F58999r353r761r968q804o475m612m527n752o598n957m317k974k500k367
$$ 658999 649646 639885 629917 621113 614638 610026 605499 599747 593149 587192 582875 579901 577401 575034
59059E75034j895j172p90r97j441j683j668j613j646j654j495j237j098j127j091
$$ 575034 573139 571967 571177 570180 568739 567056 565388 563775 562129 560475 558980 557743 556645 555518 554427
59044E54427p40k6R59K023K681K337J048k23n74j66K72O22J258J966K050J688
$$ 554427 553687 553661 554620 556643 559324 561661 562709 562486 561912 561746 562018 562640 563898 565864 567914 569602
59028E69602K108L869N859O786O974P814R897J2532J4876J6549J7263J6694J4940
$$ 569602 571710 575579 581438 588224 595198 603012 612909 625441 640317 656866 674129 690823 705763
59015G05763J2558R918O963L672L48k670n174o890p499p064o108n119m107k744
$$ 705763 718321 728239 735202 738874 739222 736552 731378 724488 716989 709925 703817 698698 694591 691847
59001F91847p76J705M220O186P394Q143Q759R098Q887Q401Q317Q787R032Q140
$$ 691847 691071 692776 696996 703182 710576 718719 727478 736576 745463 753864 762181 770968 780000 788140
58987G88140O098L801K081R51k12j806l533m795n334n275m666l389j584K97K053
$$ 788140 794238 798039 800120 801071 800859 799053 795520 790725 785391 780116 775450 772061 770477 770774 772827
58972G72827L946O136Q296J0102J1727J3374J4755J5517J5989J6810J7848J8163
$$ 772827 776773 782909 791205 801307 813034 826408 841163 856680 872669 889479 907327 925490
58960I25490J7123J5138J2999J0848Q074M153n92n144q855j2159j5839j9631k2235
$$ 925490 942613 957751 970750 981598 989672 993825 993233 988089 979234 967075 951236 931605 909370
58947I09370k3080k3211k3636k3530k1321j7307j3809j2392j2156j1302r359p095
$$ 909370 886290 863079 839443 815913 794592 777285 763476 751084 738928 727626 718267 711172
58935G11172n031l060j175K60R84J040O19J25R2O16R98M32j051k687l821m263
$$ 711172 706141 703081 701906 702166 703150 704190 704809 704934 705026 705642 706640 707072 706021 703334 699513 695250
58919F95250m048l385k739k443k285j889j376j077p51K06J725K979L570M060N006
$$ 695250 691202 687817 685078 682635 680350 678461 677085 676008 675257 675463 677188 680167 683737 687797 692803
58904F92803O220P473R245J1884J4521J5853J5900J5948J6624J7085J6515J5486
$$ 692803 699023 706496 715741 727625 742146 757999 773899 789847 806471 823556 840071 855557
58892H55557J5122J5619J6541J8099K1034K5189K9188L1794L2889L2908L2007
$$ 855557 870679 886298 902839 920938 941972 967161 996349 1028143 1061032 1093940 1125947
58881A125947L0144K7407K3747J8887J2948O711Q31m814j0552j6068k0747k4477
$$ 1125947 1156091 1183498 1207245 1226132 1239080 1245791 1246622 1241808 1231256 1215188 1194441 1169964
58869A169964k7395k9132k9102k7465k5068k2486j9787j7220j5268j3979j3013
$$ 1169964 1142569 1113437 1084335 1056870 1031802 1009316 989529 972309 957041 943062 930049
58858I30049j2461j2757j3544j3688j2889j2281j2666j3133j2355j0612r202q400
$$ 930049 917588 904831 891287 877599 864710 852429 839763 826630 814275 803663 794461 786061
58846G86061p342n870n086n716p024p952q436r006r701j0079r882r225q350p629
$$ 786061 778719 772849 767763 762047 755023 747071 738635 729629 719928 709849 699967 690742 682392 674763
58832F74763p363p296o720n488m429m262m530m214l062j599j49J318K523K980
$$ 674763 667400 660104 653384 647896 643467 639205 634675 630461 627399 625800 625651 626969 629492 632472
58818F32472K886L189M423O093P376P930P766O927N652M382L290K072N33j076
$$ 632472 635358 638547 642970 649063 656439 664369 672135 679062 684714 689096 692386 694458 694991 693915
58804F93915k452l527m170m127l603l301l526l815l892m262n227o015n855n322
$$ 693915 691463 687936 683766 679639 676036 672735 669209 665394 661502 657240 652013 645998 640143 634821
58790F34821n466o013n659m092k472j610r26L55J978L226L967M490M850M965M893
$$ 634821 629355 623342 617683 613591 611119 609509 608583 608938 610916 614142 618109 622599 627449 632414 637307
58775F37307M547L571J954L14q04j554k349l267m217n163n823n737n070m744n183
$$ 637307 641854 645425 647379 647693 646889 645335 642986 639719 635502 630339 624516 618779 613709 608965 603782
58760F03782n550m837l186j430J81J880L458M414M809N085N114M385L127K379
$$ 603782 598232 593395 590209 588779 588960 590840 594298 598712 603521 608606 613720 618105 621232 623611
58746F23611K733L655M308M475M514M854N649O626P257P341P260P249O833N629
$$ 623611 626344 629999 634307 638782 643296 648150 653799 660425 667682 675023 682283 689532 696365 701994
58732G01994M338M044M689N240N317N574O247O514N867N093N166N781N872N141
$$ 701994 706332 710376 715065 720305 725622 731196 737443 743957 749824 754917 760083 765864 771736 776877
58718G76877M344M175M582N192N937P037Q507R790J0067R063P319N380K985k75
$$ 776877 781221 785396 789978 795170 801107 808144 816651 826441 836508 845571 852890 858270 861255 860980
58704H60980l809o424p992r722j2383j5199j7102j8291j9619k1018k1606k1126
$$ 860980 857171 850747 842755 833033 820650 805451 788349 770058 750439 729421 707815 686689
58692F86689k0286j9451j7926j5016j1305q288o794o299n938n716o184p103p289
$$ 686689 666403 646952 629026 614010 602705 594417 587623 581324 575386 569670 563486 556383 549094
58679E49094o203m908m661n050m636l166j875j489j216j97J226K420L655N478
$$ 549094 542891 537983 533322 528272 523636 520470 518595 517106 515890 515693 516919 519339 522994 528472
58665E28472P591R322J0635J1817J2501J2019J0426Q377O196L865J675N1j151
$$ 528472 536063 545385 556020 567837 580338 592357 602783 611160 617356 621221 622896 622947 621796
58652F21796k443l834m835n234n216m839m124l579l844m758n433n291m503l378
$$ 621796 619353 615519 610684 605450 600234 595395 591271 587692 583848 579090 573657 568366 563863 560485
58638E60485k070q45N6Q99K160L640M545M587M262L978L579K977K468K124J524
$$ 560485 558415 557570 557626 558525 560685 564325 568870 573457 577719 581697 585276 588253 590721 592845 594369
58623E94369M84n25j014r69l83J000L016M793N833O836Q757J1299J3121J3332
$$ 594369 594853 594328 593314 592345 591962 592962 595978 600771 606604 613440 622197 633496 646617 659949
58609F59949J2175J0325Q228O111M116K143K1k059l506l971l858m021m965o326
$$ 659949 672124 682449 690677 696788 700904 703047 703068 701009 697503 693532 689674 685653 680688 674362
58595F74362p194o977n951m887m125l338k148o22J056K953N120P269R078J0636
$$ 674362 667168 660191 654240 649353 645228 641890 639742 639120 640176 643129 648249 655518 664596 675232
58581F75232J2102J3179J3303J2358J0831R283Q045P262O850O391N574M783M846
$$ 675232 687334 700513 713816 726174 737005 746288 754333 761595 768445 774836 780410 785193 790039
58568G90039O149Q345J0980J3835J6567J8610J9911K1303K3544K6170K7774K7366
$$ 790039 796188 804533 815513 829348 845915 864525 884436 905739 929283 955453 983227 1010593
58556A010593K5075K1593J7434J2802P812K679k141o020q569r947j0467j0125
$$ 1010593 1035668 1057261 1074695 1087497 1095309 1097988 1095847 1089827 1081258 1071311 1060844 1050719
58544A050719q903p479o951p684q970j0190j1728j4239j7371j9916k1161k1527
$$ 1050719 1041816 1034337 1027386 1019702 1010732 1000542 988814 974575 957204 937288 916127 894600
58532H94600k1753k1929k1434j9614j6409j2492q828n994l874k067l94J138K577
$$ 894600 872847 850918 829484 809870 793461 780969 772141 766147 762273 760206 759812 760950 763527
58519G63527L898M788M924M333L296K067R71M16L16r2j203k167j944j025j010
$$ 763527 767425 772213 777137 781470 784766 786833 787804 788220 788536 788444 787241 785074 783130 782105 781095
58504G81095k310l533l546l020l109l623l628l233l457m466n181m809l811l005
$$ 781095 778785 775252 771706 768686 765577 761954 758326 755093 751636 747170 741989 737180 733369 730364
58490G30364k459j781r26j31O28J621K805L804M504N405P107R488J1748J3333
$$ 730364 727905 726124 725198 725067 725695 727316 730121 733925 738429 743834 750941 760429 772177 785510
58476G85510J4502J5686J6525J6145J4340J1855R282O265K302k139n901q336r717
$$ 785510 800012 815698 832223 848368 862708 874563 883845 890110 892412 890273 884372 876036 866319
58463H66319j0515j0730j0032q347o150m167k624q83J775N000P577Q942R836J0998
$$ 866319 855804 845074 835042 826695 820545 816378 813754 812871 814646 819646 827223 836165 846001 856999
58449H56999J1850J1173Q674N097J111l023o816r471j0659j0814j0497r874q930
$$ 856999 868849 880022 888696 893793 894904 891881 885065 875594 864935 854121 843624 833750 824820
58436H24820p668o021m010k016n23M97J492K650L771M855O271Q168J0157J1797
$$ 824820 817152 811131 807121 805105 804582 805079 806571 809221 812992 817847 824118 832286 842443 854240
58422H54240J3001J3781J3961J3314J1807R488O459L060j33k678m524n806o671
$$ 854240 867241 881022 894983 908297 920104 929592 936051 939111 938978 936300 931776 925970 919299
58409I19299p339q100r024r788j0002r701r398r520r784r366p931o209n148m599
$$ 919299 911960 903860 894836 885048 875046 865345 855947 846427 836643 827277 819346 813137 807989 803390
58395H03390l567j764q0Q17J408K282K962K678J711R78O50K44j67L4Q26J445J612
$$ 803390 799823 798059 797979 798796 800204 802486 805448 808126 809837 810815 811465 811709 811542 811576 812402 813847 815459
58378H15459J949K836L735M014L854L896M420N210N888O188O157O158O507P188
$$ 815459 817408 820244 823979 827993 831847 835743 840163 845373 851261 857449 863606 869764 876271 883459
58364H83459Q163R618J1513J3245J4334J5082J5857J6250J5766J4950J4620J4217
$$ 883459 891622 901240 912753 925998 940332 955414 971271 987521 1003287 1018237 1032857 1047074
58352A047074J2281Q627M785J933k48k231l373k859j095P46K031K936L824M901
$$ 1047074 1059355 1067982 1072767 1074700 1074452 1072221 1068848 1065989 1064894 1065640 1067671 1070607 1074431 1079332
58338A079332O126P199P925Q761J0415J2774J4852J6000J6574J7180J7840J8088
$$ 1079332 1085458 1092657 1100582 1109343 1119758 1132532 1147384 1163384 1179958 1197138 1214978 1233066
58326A233066J7338J5132J1700Q249N940M610L336K114J812K443K921K811K943
$$ 1233066 1250404 1265536 1277236 1285485 1291425 1296035 1299371 1301485 1303297 1305740 1308661 1311472 1314415
58313A314415L797M655N039N714P317R190J0468J1370J2446J3417J3785J3843
$$ 1314415 1318212 1322867 1327906 1333620 1340937 1350127 1360595 1371965 1384411 1397828 1411613 1425456
58301A425456J4190J4774J5227J5506J5583J5234J4700J4764J5545J6161J6260
$$ 1425456 1439646 1454420 1469647 1485153 1500736 1515970 1530670 1545434 1560979 1577140 1593400
58290A593400J6801J8553K0775K2341K3219K3882K4253K4267K4604K5781K7285
$$ 1593400 1610201 1628754 1649529 1671870 1695089 1718971 1743224 1767491 1792095 1817876 1845161
58279A845161K8428K9228K9645K9143K8005K7775K9120L0533L0600L0345L1596
$$ 1845161 1873589 1902817 1932462 1961605 1989610 2017385 2046505 2077038 2107638 2137983 2169579
58268B169579L4130L6306L7834L9922M3175M7102N1290N5435N8622O0231O1224
$$ 2169579 2203709 2240015 2277849 2317771 2360946 2408048 2459338 2514773 2573395 2633626 2694850
58257B694850O2927O4917O5617O4682O3265O2331O2182O3231O5589O8278P0354
$$ 2694850 2757777 2822694 2888311 2952993 3016258 3078589 3140771 3204002 3269591 3337869 3408223
58246C408223P2518P6187Q1425Q7241R3212R9361J05122J10229J15888J23259
$$ 3408223 3480741 3556928 3638353 3725594 3818806 3918167 4023289 4133518 4249406 4372665
58236D372665J31541J39350J47134J56203J66316J76487J87272J99866K13751
$$ 4372665 4504206 4643556 4790690 4946893 5113209 5289696 5476968 5676834 5890585
58227E890585K27831K43026K60974K81041L01578L23365L48715L77870M09462
$$ 5890585 6118416 6361442 6622416 6903457 7205035 7528400 7877115 8254985 8664447
58218H664447M43766M82160N24386N70033O21693O82493P51733Q27586R12924
$$ 8664447 9108213 9590373 10114759 10684792 11306485 11988978 12740711 13568297 14481221
58209A4481221J013333J130871J265930J424105J614553J843098K115152K444332
$$ 14481221 15494554 16625425 17891355 19315460 20930013 22773111 24888263 27332595
58201B7332595K849666L347413L958932M726322N706516O951807Q515066J0473122
$$ 27332595 30182261 33529674 37488606 42214928 47921444 54873251 63388317 73861439
58193G3861439J2921874J5955500J9688339K4257525K9615919L5116235L9299461
$$ 73861439 86783313 102738813 122427152 146684677 176300596 211416831 250716292
58186B50716292M0341546L7012824K9387708J8717007O700484n114947j5468130
$$ 250716292 291057838 328070662 357458370 376175377 382875861 377760914 362292784
58179C62292784k3350746k8171859l0007986k9570970k7824747k5568489k3272392
$$ 362292784 338942038 310770179 280762193 251191223 223366476 197797987 174525595
58172A74525595k1135165j9180318j7324613j5463577j3566678j1703848r981825
$$ 174525595 153390430 134210112 116885499 101421922 87855244 76151396 66169571
58165F6169571q467838p172798o080163n167855m409451l775557l242423k794723
$$ 66169571 57701733 50528935 44448772 39280917 34871466 31095909 27853486 25058763
58157B5058763k419384k102360j832455j603217j409234j244009j102791r83933
$$ 25058763 22639379 20537019 18704564 17101347 15692113 14448104 13345313 12361380
58149A2361380q85380q02203p29317o64481o06900n54641n05431m58794m15679
$$ 12361380 11476000 10673797 9944480 9279999 8673099 8118458 7613027 7154233 6738554
58140F738554l76567l41156l09225k80725k55628k34425k17957k05892j96240
$$ 6738554 6361987 6020831 5711606 5430881 5175253 4940828 4722871 4516979 4320739
58131D320739j87307j79272j72805j66984j59879j50780j40690j30932j22162
$$ 4320739 4133432 3954160 3781355 3614371 3454492 3303712 3163022 3032090 2909928
58122B909928j14471j07554j00814r4001q7578q2044p7223p2730o8608o4984o1596
$$ 2909928 2795457 2687903 2587089 2493088 2405510 2323466 2246243 2173513 2104905 2039921 1978325
58111A978325n8277n5395n3148n0959m8305m5603m3540m2006m0580l9553l9466
$$ 1978325 1920048 1864653 1811505 1760546 1712241 1666638 1623098 1581092 1540512 1500959 1461493
58100A461493l9876l9600l8166l6227l4508l3049l1519k9711k7613k5408k3386
$$ 1461493 1421617 1382017 1343851 1307624 1273116 1240067 1208548 1178837 1151224 1125816 1102430
58089A102430k1604j9878j8307j7363j7104j6833j6078j5313j5083j5028j4621
$$ 1102430 1080826 1060948 1042641 1025278 1008174 991341 975263 959950 944867 929839 915218
58078I15218j4274j4709j5588j5881j5439j5083j5158j5057j4358j3483j2899
$$ 915218 900944 886235 870647 854766 839327 824244 809086 794029 779671 766188 753289
58067G53289j2528j2193j1977j1776j1128r848q405p368o890o885p312q056q826
$$ 753289 740761 728568 716591 704815 693687 683839 675434 668066 661176 654291 646979 638923 630097
58054F30097r363r527r230q537p810p302o762n833m765m203m260m389m208l935
$$ 630097 620734 611207 601977 593440 585630 578328 571566 565733 560968 556765 552505 548116 543908 539973
58040E39973l831l800l727l789m126m557m832m929m938m916n041n607o714q027
$$ 539973 536142 532342 528615 524826 520700 516143 511311 506382 501444 496528 491487 485880 479166 471139
58026D71139q986r183q592p618o885o811p292p818p833o985n439l994l509l851
$$ 471139 462153 452970 444378 436760 429875 423064 415772 407954 400121 393136 387697 383703 380194 376343
58012C76343l910l030j943j722k236k466k043j554j366j126o59m63q94j423j270
$$ 376343 372433 369403 367460 365738 363502 361036 358993 357439 356073 354947 354288 353825 352931 351508 350238
57997C50238m21L98N87L00K63J028K322L216L130K480J983J663J069L32J84Q08
$$ 350238 349817 350215 350802 351102 351365 352393 354715 357931 361061 363541 365524 367187 368256 368588 368772 369580
57981C69580J375R92k29j384j720j246o21n58j069j437j140o24o78j216j344o14
$$ 369580 370955 371947 371718 370334 368614 367368 366747 366189 365120 363683 362543 361919 361241 360025 358681 358067
57965C58067M06R72R89R15J232K105L142L577L104K440K403K692K330J212K42
$$ 358067 358473 359445 360434 361349 362581 364686 367828 371405 374509 376949 379352 382044 384374 385586 385828
57950C85828n2j2J91R29K076K744K570K337K650L045L086L341M263N077M909M406
$$ 385828 385776 385764 385955 386884 388960 391704 394274 396611 399261 402306 405392 408733 412996 418073 422982 427388
57934D27388M871O208P021O562N451M417L409K138O29j022k822m584o004p061
$$ 427388 432259 438467 445488 452050 457501 461918 465327 467465 468094 467072 464250 459666 453662 446601
57920D46601p908q424q482q459q821r265r022p998o864n903m648k824r17N39J558
$$ 446601 438693 430269 421787 413328 404507 395242 386220 378222 371358 365455 360807 357983 357066 357605 359163
57905C59163K223K298J749J104P69M13m58j641k456k631k493k394k344k209j962
$$ 359163 361386 363684 365433 366537 367306 367719 367261 365620 363164 360533 358040 355646 353302 351093 349131
57890C49131j682j488j432j419j320j192j230j420j518j505j778k627l719m423
$$ 349131 347449 345961 344529 343110 341790 340598 339368 337948 336430 334925 333147 330520 326801 322378
57876C22378m578m649n068n669n907n536m881m407m138l690k889k113j859k157
$$ 322378 317800 313151 308083 302414 296507 290971 286090 281683 277545 273855 270966 268853 266994 264837
57862B64837k567k620k046q03P80K035K549K660L047L802M361M349M012L728L498
$$ 264837 262270 259650 257604 256801 257581 259616 262165 264825 267872 271674 276035 280384 284396 288124 291622
57847B91622L257L222L557L859L417K046M29m66l03L15N11J10k17M4M52K60l76
$$ 291622 294879 298101 301658 305517 308934 310980 311409 310943 310640 310955 311466 311576 311359 311403 311855 312115 311739
57830C11739n19K04J122J696K374L706N164N657M969L958L367L184L141L105K777
$$ 311739 311220 311424 312546 314242 316616 320322 325486 331143 336112 340070 343437 346621 349762 352867 355644
57815C55644J716J54p44j36J192J364n47l513n746o600o918p665q749r344r031
$$ 355644 357360 357514 356770 356634 357826 359190 358643 355130 349384 342784 335866 328201 319452 310108 301077
57800C01077q140p079n858m512l493l209l341l163k517j928j648j137P6J426J827
$$ 301077 292937 285858 280000 275488 271995 268786 265445 262282 259765 257837 256189 255052 255128 256554 258381
57785B58381J122L76O58J914L328M364N089N708O291O882P462P788P564O884O125
$$ 258381 259503 259879 260537 262451 265779 270143 275232 280940 287231 294113 301575 309363 316927 323811 329936
57770C29936N364M275K762J241N9j026k354l716m702n464o518p788q461q016o915
$$ 329936 335300 339575 342337 343578 343637 342611 340257 336541 331839 326375 319857 312069 303608 295592 288677
57755B88677o000n584n381n085m595l913l104k326j722j292j004r25j075j332
$$ 288677 282677 277093 271712 266627 262032 258119 255015 252689 250967 249675 248671 247746 246671 245339
57741B45339j584j839j997j749r81j53Q4l22p67p75n00l73m84n94n77n54n63m11
$$ 245339 243755 241916 239919 238170 237189 237036 237120 236798 236031 235256 234756 234383 233899 233305 232728 232174 231611 231200
57723B31200L9N53P33M80Q6j92m44q12j110j038p49q45j620k562k884k492k046
$$ 231200 231239 231792 232525 233005 233091 232899 232455 231643 230533 229495 228746 227901 226281 223719 220835 218343 216297
57706B16297k157k729l218l267k863k107j141l53k06p08j181r08P0R97J256Q88
$$ 216297 214140 211411 208193 204926 202063 199956 198815 198462 198256 197548 196367 195459 195529 196526 197782 198670
57690A98670L19j19k16J58Q44J382J495J446J637K118K809L990N991Q658J1658
$$ 198670 198989 198870 198654 198812 199656 201038 202533 203979 205616 207734 210543 214533 220524 229182 240840
57675B40840J5277K0179K6362L3103M0320M9057N9902P1248P9690Q1881P5711
$$ 240840 256117 276296 302658 335761 376081 425138 485040 556288 635978 717859 793570
57664G93570O0541L7580J0222j6957m0098n7071o7056p0106o7388o1046n3221
$$ 793570 854111 891691 901913 884956 844858 787787 720731 650625 583237 522191 468970
57653D68970m5254l7856l1463k6119k1518j7558j4576j2620j1020r142p262o074
$$ 468970 423716 385860 354397 328278 306760 289202 274626 262006 250986 241844 234582 228508
57641B28508n549m963l964k919k130j414p02m26q03j297j234o55o1L69P56R40
$$ 228508 222959 217996 214032 211113 208983 207569 206867 206441 205638 204341 203107 202452 202391 202760 203516 204456
57625B04456N42m07j474k435l332l894l531k177o46K01J63n15j499k203j972r89
$$ 204456 204998 204591 203117 200682 197350 193456 189925 187748 187102 187303 187466 186951 185452 183249 181277 180288
57609A80288l89q21j457j272o80p76j344j061K43J063M51o03q65p02j150k052
$$ 180288 179899 179078 177621 176349 175669 174893 173549 172488 172731 173794 174245 173642 172777 172075 170925 168873
57593A68873k468k352k457k808k647j886j392j567j759j485j235j503j921j940
$$ 168873 166405 164053 161596 158788 156141 154255 152863 151296 149537 148052 146817 145314 143393 141453
57579A41453j741j738j738j315o17j89j43j51j48m62j206k027k452k294j677r70
$$ 141453 139712 137974 136236 134921 134304 134115 133972 133821 133673 133211 132005 129978 127526 125232 123555 122585
57563A22585n86o16p48p28p33r44r64j59J411K804L065K109O53m05o09j67K98
$$ 122585 121999 121383 120635 119907 119174 118230 117266 117107 118518 121322 124387 126496 127149 126744 126135 125968 126266
57546A26266L91L43N74R87R92L81k42q9Q78J863K027J255J53n69p48p68r24r97
$$ 126266 126657 127000 127574 128561 129553 129934 129692 129603 130481 132344 134371 135626 135779 135210 134462 133694 132770 131773
57528A31773o82k14j51n24o97k93J81M2n40p26j31P59J313J402J254J037R24J138
$$ 131773 131091 130877 130726 130202 129505 129212 129393 129435 128895 128169 128038 128797 130110 131512 132766 133803 134727 135865
57510A35865J634J871J328J79q07j019m42N34J416J736J300M30l24q70j632k772
$$ 135865 137499 139370 140698 140877 140070 139051 138609 139143 140559 142295 143595 144025 143701 142831 141199 138427
57494A38427l699l699k888k080j786j724j390p50k21j34m20p28p80o11m78n15
$$ 138427 134728 131029 128141 126061 124275 122551 121161 120411 120190 120056 119636 118908 118128 117517 117039 116524
57478A16524n86n93p60j312j978k202j924j711j951k300k216j719j210p57j26
$$ 116524 115938 115345 114585 113273 111295 109093 107169 105458 103507 101207 98991 97272 96062 95305 95179
57463I5179N40P02K17k92j65N48J275J578J332N89k75n36J04Q59O59l58q71k22
$$ 95179 95719 96421 96638 96346 96181 96729 98004 99582 100914 101503 101228 100692 100796 101655 102314 101956 101085 100863
57445A00863O13M46l67n44J96Q54Q06N78P22Q62M53k38o04o49p45q55o90l42p9
$$ 100863 101476 101922 101555 101011 101207 102061 102867 103445 104167 105029 105482 105244 104640 103991 103246 102391 101701 101359 101280
57426A01280K28Q16J352J278P61M64M33qj049j950k080j703j324q77j04P45J152
$$ 101280 101508 102324 103676 104954 105715 106179 106612 106604 105555 103605 101525 99822 98498 97621 97517 98262 99414
57409I9414J035P42M99K34j80p33j173j048j75Q16R27O1p17m93L97J016J081R89
$$ 99414 100449 101191 101690 101924 101744 101011 99838 98790 98615 99431 100358 100419 99702 99209 99606 100622 101703 102692
57391A02692J045J321J943K735K933K076J056J199K348K896K052R68R93J724J736
$$ 102692 103737 105058 107001 109736 112669 114745 115801 117000 119348 122244 124296 125264 126257 127981 129717
57376A29717P16k10k43P6j81j025j711j768j430j198j323j705k006j852j120j11
$$ 129717 130433 130223 129980 130056 129875 128850 127139 125371 123941 122743 121420 119715 117709 115857 114737 114626
57360A14626P18J148J279J223R70O10M49O13P63M83o6k33L39J225J667J292L54
$$ 114626 115344 116492 117771 118994 119964 120574 121023 121636 122399 122882 122816 122583 122922 124147 125814 127106 127460
57343A27460n37q68n84j83k08n97p76m29L1K6m06o95m78P3N55P61P35N63K67j24
$$ 127460 126923 126055 125471 125288 125080 124483 123707 123278 123309 123335 122929 122234 121756 121829 122384 123145 123880 124443 124710 124586
57323A24586l76j32O08J250J107J95q24j486j820j844j298k25O85Q04L11j11l7
$$ 124586 124210 124078 124686 125936 127043 127238 126414 124928 123108 121264 119966 119741 120426 121230 121541 121430 121393
57306A21393N02J270J863J824J168N70O23J104J370J201Q20M07O6M8M64R75J261
$$ 121393 121895 123165 125028 126852 128020 128590 129213 130317 131687 132888 133708 134115 134181 134229 134693 135668 136929
57289A36929J561K260L146L653L580L053K082Q55J16L44P91K77j146k292k553
$$ 136929 138490 140750 143896 147549 151129 154182 156264 157119 157235 157579 158370 158647 157501 155209 152656
57274A52656k418k214j622p33l61o20l40J227L047L567K699J526O44r3n51k37
$$ 152656 150238 148024 146402 145669 145308 144688 144348 145575 148622 152189 154888 156414 157058 156965 156414 156177
57258A56177P36J500J484R66M94L10M44Q38J188J081M85j52l78q5N48J217J572
$$ 156177 156913 158413 159897 160863 161357 161667 162111 162949 164137 165218 165703 165551 165173 165088 165636 166853 168425
57241A68425J452J072P66N75L24P1J62P81J609K079J936J514J414J861K441K592
$$ 168425 169877 170949 171715 172290 172614 172685 172847 173628 175237 177316 179252 180766 182180 184041 186482 189074
57225A89074K233J697J253J058J418K481L569L613K522J550J769K731L238K991
$$ 189074 191307 193004 194257 195315 196733 199214 202783 206396 208918 210468 212237 214968 218206 221197
57211B21197K755L091L736M114L923L124K014J316J697K905L805L593K672K119
$$ 221197 223952 227043 230779 234893 238816 241940 243954 245270 246967 249872 253677 257270 259942 262061
57197B62061K405K990L115K644J913J034j61j312j380J94K523M222N116O136P586
$$ 262061 264466 267456 270571 273215 275128 276162 276001 274689 273309 273503 276026 280248 285364 291500 299086
57182B99086Q648Q893R125R998J0747J0275Q948Q200Q661R640J0296J0447J0297
$$ 299086 307734 316627 325752 335750 346497 356772 365720 373920 382581 392221 402517 412964 423261
57169D23261J0102J0191J0681J1242J1577J1980J2794J3588J3668J3224J3145
$$ 423261 433363 443554 454235 465477 477054 489034 501828 515416 529084 542308 555453
57158E55453J3715J4357J4788J5504J6843J8333J9436K0310K1325K2295K2698
$$ 555453 569168 583525 598313 613817 630660 648993 668429 688739 710064 732359 755057
57147G55057K2448K2063K2135K2845K3856K4622K4942K5210K5929K7003K7743
$$ 755057 777505 799568 821703 844548 868404 893026 917968 943178 969107 996110 1023853
57136A023853K7596K6658K5475K4622K4443K4967K5996K7303K8726L0086L1331
$$ 1023853 1051449 1078107 1103582 1128204 1152647 1177614 1203610 1230913 1259639 1289725 1321056
57125A321056L2858L5366L9214M4217M9984N5904O0863O3941O5768O8306P2798
$$ 1321056 1353914 1389280 1428494 1472711 1522695 1578599 1639462 1703403 1769171 1837477 1910275
57114A910275P8759Q5487R3425J03180J14361J26570J40532J57051J75752J96421
$$ 1910275 1989034 2074521 2167946 2271126 2385487 2512057 2652589 2809640 2985392 3181813
57104C181813K20829K51701K90692L39005L99448M76082N72588O92941Q43252
$$ 3181813 3402642 3654343 3945035 4284040 4683488 5159570 5732158 6425099 7268351
57095G268351J031005J262597J542694J873757K252527K666872L098064L525076
$$ 7268351 8299356 9561953 11104647 12978404 15230931 17897803 20995867 24520943
57087B4520943L924893M272613M545689M721116M754044M559256M036785L142669
$$ 24520943 28445836 32718449 37264138 41985254 46739298 51298554 55335339 58478008
57079E8478008J944883O07572o82311j782679k621178l189935l530238l707384
$$ 58478008 60422891 61030463 60348152 58565473 55944295 52754360 49224122 45516738
57071D5516738l777999l770253l690579l542549l336041l084909k804525k511755
$$ 45516738 41738739 37968486 34277907 30735358 27399317 24314408 21509883 18998128
57063A8998128k222264j946620j690973j460482j259124j087002r41048q18393
$$ 18998128 16775864 14829244 13138271 11677789 10418665 9331663 8390615 7572222
57055G572222p16801o32414n60088m96465m40721l92217l49431l11388k78073
$$ 7572222 6855421 6223007 5662919 5166454 4725733 4333516 3984085 3672697 3394624
57046C394624k48950k22690j98662j77257j58465j41559j26416j13620j02994
$$ 3394624 3145674 2922984 2724322 2547065 2388600 2247041 2120625 2007005 1904011
57037A904011r3429q4490p6782p0361o4197n7650n1116m4719l7725k9804k1462
$$ 1904011 1810582 1726092 1649310 1578949 1514752 1457102 1405986 1361267 1323542 1293738 1272276
57026A272276j2423j006J3709K9892M4002N2766N3341M3041K1189q619l9499o5021
$$ 1272276 1259853 1258847 1272556 1302448 1346450 1399216 1452557 1495598 1516787 1508168 1468669 1403648
57014A403648q1875q9721q9977q4982p7250o8614o0038n2077m5023l8773l3139
$$ 1403648 1321773 1232052 1142075 1057093 979843 911229 851191 799114 754091 715318 682179
57003F82179k8434k5183k3244k1654j9621j7286j5299j3982j3170j2522j1770
$$ 682179 653745 628562 605318 583664 564043 546757 531458 517476 504306 491784 480014
56992D80014j0712r284p613n856l952j670J068L899O167P376P386O159L484o80
$$ 480014 469302 460018 452405 446549 442597 440927 441995 445894 452061 459437 466823 472982 476466 475786
56978D75786n635j0084j3111j4823j5799j6195j5710j4315j2501j0709q878o785
$$ 475786 470151 460067 446956 432133 416334 400139 384429 370114 357613 346904 338026 331241
56966C31241m545k465n54J477L727O004Q316J1139J4710J8138J9717J8325J4294
$$ 331241 326696 324231 323677 325154 328881 334885 343201 354340 369050 387188 406905 425230 439524
56953D39524Q662K095n027j1770j6757j9358k0168j9982j8794j6309j3015j0022
$$ 439524 448186 450281 445254 433484 416727 397369 377201 357219 338425 322116 309101 299079
56941B99079p827n884l461m50K876O408J0190J4152J8226K2313K5734K6988K4731
$$ 299079 291252 285368 281907 281457 284333 290741 300931 315083 333309 355622 381356 408344 433075
56928D33075J9113J1639L689m345j2215j8907k3256k5195k5606k5052k3303k0334
$$ 433075 452188 463827 467516 463171 450956 432049 408793 383598 357992 332940 309637 289303
56916B89303j7030j4469j2870j1681j0428r043p575o139n005m373m067l788l533
$$ 289303 272273 257804 244934 233253 222825 213782 206207 200068 195063 190690 186623 182835 179302
56903A79302l361l000k216j533j740k597k766j434O80K487M060O284R403J2783
$$ 179302 175941 172941 170725 169192 167452 164855 162089 160655 161335 163822 167882 174166 183569 196352
56889A96352J6012J9324K2727K5433K6485K5471K2392J7303J0564L181l508q552
$$ 196352 212364 231688 254415 279848 306333 331804 354196 371499 382063 385244 381736 373184
56877C73184j1656j2984j2851j1546r325o629m087k001K02L462P922J2778J7537
$$ 373184 361528 348544 335693 324147 314822 308193 304106 302105 302307 305769 313691 326469 344006
56864C44006K2840K9568L7510M5417N1935N5780N5340M9230L7538K2099N356j0545
$$ 344006 366846 396414 433924 479341 531276 587056 642396 691626 729164 751263 756619 746074
56852G46074k3712l2595l6770l7188l5197l1622k6967k1839j6477j0331k833N610
$$ 746074 722362 689767 652997 615809 580612 548990 522023 500184 483707 473376 470543 476153
56840D76153J4113K2711L2511M4360N7886P1736Q3953R1831R2264Q3299O5408
$$ 476153 490266 512977 545488 589848 647734 719470 803423 895254 987518 1070817 1136225
56829A136225M1036J3190j5211m1036o1066p3163p7338p5489o9946o2258n3115
$$ 1136225 1177261 1190451 1175240 1134204 1073138 999975 922637 847148 777202 714944 661829
56818F61829m3117l3140k3884j5318o889J852J1140K1353L2877M5197N6407O3861
$$ 661829 618712 585572 561688 546370 539481 541333 552473 573826 606703 651900 708307 772168
56806G72168O5344N9787M7431K9835R449j1277l0452m6416n7450o2512o2251n8647
$$ 772168 837512 897299 944730 974565 984014 972737 942285 895869 838419 775907 713656 655009
56794F55009n3494m7504m0895l4091k7496k1024j4373p573q78N770J2728K0021
$$ 655009 601515 554011 513116 479025 451529 430505 416132 408559 407681 413451 426179 446200
56782D46200K6945L2231L4498L2701K6615J7003N270p102j8760k8420l5077l8418
$$ 446200 473145 505376 539874 572575 599190 616193 621463 614361 595601 567181 532104 493686
56770D93686l8896l7367l4709l1599k8324k4739k0766j6923j4119j2735j2197
$$ 493686 454790 417423 382714 351115 322791 298052 277286 260363 246244 233509 221312
56759B21312j1545j0296q659p140o125n581n062m207l255k773k744k451j516n52
$$ 221312 209767 199471 190812 183672 177547 171966 166904 162697 159442 156669 153925 151474 149958 149406
56745A49406l68q85j442j791k114k214j670p90n27j051j229j33J522K167J336
$$ 149406 149038 148153 146711 144920 142806 140592 138922 138132 137605 136554 135325 135192 136714 138881 140217
56730A40217J46j62M54J095J074N55K02L68P22O90K19j80j28J66L44M51P53J209
$$ 140217 140363 140201 140655 141750 142824 143379 143581 143949 144671 145361 145580 145400 145272 145438 145782 146233 146986 148195
56712A48195J442J183N08k64p05m71L96J435K140K323K019J365O51J96r2n96j230
$$ 148195 149637 150820 151328 151064 150359 149888 150284 151719 153859 156182 158201 159566 160217 160413 160321 159725 158495
56695A58495j312o46j37n94j385j216p1O74K18o02n71L28J151J270Q96O10P72
$$ 158495 157183 156537 156400 155806 154421 153205 153134 153808 154026 153424 152853 153181 154332 155602 156498 157108 157880
56678A57880J182J234N99j66k29K93L91l53j100j003m23k69o19q08n22n8L28O48
$$ 157880 159062 160296 160895 160729 160500 160793 161184 160831 159731 158728 158305 158036 157417 156609 156087 156029 156357 157005
56660A57005Q46Q43Q92J273J660J395N26j2M81J586K313K217J718J400J333J118
$$ 157005 157851 158694 159586 160859 162519 163914 164440 164428 164909 166495 168808 171025 172743 174143 175476 176594
56644A76594N55M0J42Q54J612K042K293K461K203J308K19m85p80q68n35M19J394
$$ 176594 177149 177189 177331 178185 179797 181839 184132 186593 188796 190104 190323 189838 189058 188190 187655 188074 189468
56627A89468J484P67K76N02P83N06O5R5L93K49m32j074j324j430j688k011k160
$$ 189468 190952 191719 191995 192497 193280 193786 193851 193946 194339 194588 194156 193082 191758 190328 188640 186629 184469
56610A84469k053j693j078m17k09q12j864k449k009r77k14K3K04O06Q27N20J03
$$ 184469 182416 180723 179645 179228 179019 178207 176343 173894 171885 170908 170694 170717 170921 171527 172354 172874 172977
56593A72977J90O46Q25N42K34J69K21L69P74J217J143N18rr9j98o13p37Q9J381
$$ 172977 173167 173813 174638 175180 175414 175583 175804 176173 176947 178164 179307 179825 179816 179717 179519 178906 178169 178258 179639
56574A79639J948J411N82L60P90J417K000K638L362L984M314M511N130O751R360
$$ 179639 181587 182998 183580 183940 184730 186147 188147 190785 194147 198131 202445 206956 212086 218837 228197
56559B28197J2103J3684J3238J0963Q039N727M307L015J212o03j400j065n54n91
$$ 228197 240300 253984 267222 278185 286224 291951 296258 299273 300485 299882 298482 297417 296863 296272
56545B96272r06j072j375k248l390m086m171m091m137m165m015l736l379k996
$$ 296272 295366 294294 292919 290671 287281 283195 279024 274933 270796 266631 262616 258880 255501 252505
56531B52505k737k712k773k743k667k624k451j977j443j253j437j655j657j468
$$ 252505 249768 247056 244283 241540 238873 236249 233798 231821 230378 229125 227688 226033 224376 222908
56517B22908j215j069j176j434j532j423j413j547j387q28n13q23r92k37P91P75
$$ 222908 221693 220624 219448 218014 216482 215059 213646 212099 210712 209884 209371 208548 207556 207319 208110 208885
56501B08885j36l59P59J930J769O13k81m92n10o07n78l74k57l73o09q37r92j070
$$ 208885 208749 208390 209149 211079 212848 213461 213180 212688 212178 211571 210993 210619 210362 209989 209380 208543 207551 206481
56483B06481j256j719k105j699n17L44L2p74o50P44K294K899K570J987J530J152
$$ 206481 205225 203506 201401 199702 199185 199529 199561 198787 198137 198881 201175 204074 206644 208631 210161 211313
56467B11313P95N54M92M68K65j09l86l78l20m76n47M9J149J752J311N02J60N3
$$ 211313 212108 212662 213154 213622 213887 213778 213392 213014 212694 212218 211671 211720 212869 214621 215932 216434 216594 216647
56449B16647m94j203j057J14J293J670J535J450J339Q69J99k28l29l21k52rL70
$$ 216647 216153 214950 213893 214007 215300 216970 218505 219955 221294 222163 222362 222134 221805 221484 221232 221223 221593
56432B21593O84Q13P39M94K74L55O98Q18L61l79q27q59p72o37j47P95J692J931
$$ 221593 222277 223090 223829 224323 224597 224952 225650 226468 226829 226450 225623 224764 223992 223355 223208 224003 225695 227626
56414B27626J467Q33N49O63Q11O67K53j46l23l11k06N4N18R82J111Q43M28O1k26
$$ 227626 229093 229926 230475 231138 231949 232616 232869 232723 232400 232089 231883 231937 232455 233437 234548 235391 235819 235880 235654
56395B35654k15N06J863K909K741J633P33O29Q39Q72R52J350J668J472J068J004
$$ 235654 235439 235945 237808 240717 243458 245091 245824 246453 247292 248164 249116 250466 252134 253606 254674 255678
56379B55678J144J081J018J379J733J246J53l66R0O71Q20J036J555J549N88j88
$$ 255678 256822 257903 258921 260300 262033 263279 263432 263066 263156 263827 264647 265683 267238 268787 269375 269187
56363B69187L70J519J651P27J88O04R22L11n71p08r2O43J236J741K002J802J389
$$ 269187 269557 271076 272727 273454 273642 274246 275168 275479 274908 274200 274108 274751 275987 277728 279730 281532 282921
56346B82921J306J741K268K263J511N30K03Q92K072K952L255L064K391J424Q82
$$ 282921 284227 285968 288236 290499 292010 292540 292743 293635 295707 298659 301914 304978 307369 308793 309675
56331C09675J324K280K766K588K404K527K573K280J852J336N47k08k49L85Q02
$$ 309675 310999 313279 316045 318633 321037 323564 326137 328417 330269 331605 332152 331944 331695 332080 332882
56316C32882O16M60P89J034O66J81K51N81N01J72K88R32J608K211L154M519N781
$$ 332882 333498 333958 334747 335781 336447 336628 336879 337460 337961 338133 338421 339353 340961 343172 346326 350845 356626
56299C56626O448O489O135N555M799L809K663J822J776K341K767K820L151M227
$$ 356626 363074 369563 375698 381253 386052 389861 392524 394346 396122 398463 401230 404050 407201 411428
56285D11428N510O268O611P073P604P773P653P759Q312R169J0232J1311J1877
$$ 411428 416938 423206 429817 436890 444494 452267 459920 467679 475991 485160 495392 506703 518580
56272E18580J1671J1363J1835J2984J4040J4899J6257J8373K0575K2310K3960
$$ 518580 530251 541614 553449 566433 580473 595372 611629 630002 650577 672887 696847
56261F96847K6282K9506L3341L7509M1975M6855N2287N8401O5403P3668Q3464
$$ 696847 723129 752635 785976 823485 865460 912315 964602 1023003 1088406 1162074 1245538
56250A245538R4411J05516J16065J26152J36072J45504J53696J60052J64112J65326
$$ 1245538 1339949 1445465 1561530 1687682 1823754 1969258 2122954 2283006 2447118 2612444
56240B612444J63323J57995J48893J35057J16170R3343O8016M0698J1721j7307
$$ 2612444 2775767 2933762 3082655 3217712 3333882 3427225 3495241 3535939 3547660 3530353
56230C530353m4034o7351q7668j05344j19914j30973j38697j43271j44750j43675
$$ 3530353 3486319 3418968 3331300 3225956 3106042 2975069 2836372 2693101 2548351 2404676
56220B404676j40890j36588j30453j22943j15307j08018j00336r1868q3557p6392
$$ 2404676 2263786 2127198 1996745 1873802 1758495 1650477 1550141 1458273 1374716 1298324
56210A298324p0129o4047n8230n3166m8674m4112l9405l5072l1400k8183k5201
$$ 1298324 1228195 1164148 1105918 1052752 1004078 959966 920561 885489 854089 825906 800705
56199H00705k2502k0194j8295j6682j5147j3585j2197j1200j0438r543q482p516
$$ 800705 778203 758009 739714 723032 707885 694300 682103 670903 660465 650922 642440 634924
56187F34924o654n743n013m814m839m372l384k639k469k314j764j218j080j085
$$ 634924 628270 622527 617514 612700 607861 603489 600105 597466 594997 592683 590919 589701 588621 587536
56173E87536q59m86n6O61J613K224K229K141K428K854L136L512M099M415M232
$$ 587536 586677 586191 586135 586796 588409 590633 592862 595003 597431 600285 603421 606933 611032 615447 619679
56158F19679M266N244O773P940Q596R331J0382J1404J2098J2618J3429J5159J8354
$$ 619679 623945 629189 635962 643902 652498 661829 672211 683615 695713 708331 721760 736919 755273
56145G55273K2957K8284L3764L9440M5619N2523O0427O9468P8881Q7048R2515
$$ 755273 778230 806514 840278 879718 925337 977860 1038287 1107755 1186636 1273684 1366199
56134A366199R4480R2244Q5392P5089O4170N5105M8492M3908M1068L9144L6148
$$ 1366199 1460679 1552923 1638315 1713404 1777574 1832679 1881171 1925079 1966147 2005291 2041439
56123B041439L0397K2214J3217M541l256r381j3456j6673k1095k7818l6715m7460
$$ 2041439 2071836 2094050 2107267 2111808 2108552 2099171 2085715 2069042 2047947 2020129 1983414 1935954
56111A935954n9508p1234q0382q5575q6643q3761p7371o8858o0084n1954m4174
$$ 1935954 1876446 1805212 1724830 1639255 1552612 1468851 1391480 1322622 1262538 1210584 1166410
56100A166410l6455k9174k2830j7634j3656j0704q190n757l860k973k522j534
$$ 1166410 1129955 1100781 1077951 1060317 1046661 1035957 1027767 1022010 1018150 1015177 1012655 1011121
56088A011121r9Q55J065J189J599K024K456L318M521N298N382N474O199P265P977
$$ 1011121 1011022 1011877 1012942 1014131 1015730 1017754 1020210 1023528 1028049 1033347 1038729 1044203 1050402 1057667 1065644
56073A065644Q133Q099Q444R476J0915J2039J2571J3086J4093J5140J5497J5360
$$ 1065644 1073777 1081876 1090320 1099796 1110711 1122750 1135321 1148407 1162500 1177640 1193137 1208497
56061A208497J5563J6394J7456J8336J8698J8093J6682J5651J5858J6430J5965
$$ 1208497 1224060 1240454 1257910 1276246 1294944 1313037 1329719 1345370 1361228 1377658 1393623
56050A393623J4770J4507J5720J7166J7773J7916J8315J8960J9599K0360K1381
$$ 1393623 1408393 1422900 1438620 1455786 1473559 1491475 1509790 1528750 1548349 1568709 1590090
56039A590090K2527K3777K5281K6847K8020K8684K9050K9159K9102K9468L0777
$$ 1590090 1612617 1636394 1661675 1688522 1716542 1745226 1774276 1803435 1832537 1862005 1892782
56028A892782L2710L4708L6967L9841M2628M4211M4689M5254M6574M8388N0452
$$ 1892782 1925492 1960200 1997167 2037008 2079636 2123847 2168536 2213790 2260364 2308752 2359204
56017B359204N2738N4919N6791N8865O1529O4037O5740O7559P0795P5010P8786
$$ 2359204 2411942 2466861 2523652 2582517 2644046 2708083 2773823 2841382 2912177 2987187 3065973
56006C065973Q2023Q5534Q8988R1416R3553R7315J02969J09008J14849J21400
$$ 3065973 3147996 3233530 3322518 3413934 3507487 3604802 3707771 3816779 3931628 4053028
55996D053028J28896J36401J43794J52118J61695J71907J82853J95124K08145
$$ 4053028 4181924 4318325 4462119 4614237 4775932 4947839 5130692 5325816 5533961
55987E533961K21023K34766K51100K69469K88149L07981L31671L59555L89636
$$ 5533961 5754984 5989750 6240850 6510319 6798468 7106449 7438120 7797675 8187311
55978H187311M21795M58242M99627N44780N94479O51355P15958P87435Q68097
$$ 8187311 8609106 9067348 9566975 10111755 10706234 11357589 12073547 12860982 13729079
55969A3729079R62462J072060J197255J344015J522153J737215J992453K299484
$$ 13729079 14691541 15763601 16960856 18304871 19827024 21564239 23556692 25856176
55961B5856176K678302L147906L730107M464479N405515O603685Q108051R990679
$$ 25856176 28534478 31682384 35412491 39876970 45282485 51886170 59994221 69984900
55953F9984900J2345581J5264708J8854112K3252817K8466926L3968248L8415008
$$ 69984900 82330481 97595189 116449301 139702118 168169044 202137292 240552300
55946B40552300L9980922L7265042L0091281J9531053P238311n211621j6514144
$$ 240552300 280533222 317798264 347889545 367420598 374658909 369447288 352933144
55939C52933144k5555791l1495570l4054968l3672095l1281956k7881674k4211052
$$ 352933144 327377353 295881783 261826815 228154720 196872764 168991090 144780038
55932A44780038k0691510j7519642j4765246j2425744j0460828q820838p459848
$$ 144780038 124088528 106568886 91803640 79377896 68917068 60096230 52636382
55925E2636382o334236n401330m624130l974465l430096k971473k582589k251985
$$ 52636382 46302146 40900816 36276686 32302221 28872125 25900652 23318063 21066078
55917B1066078j970661j730006j522776j344059j189603j054606r35554q31675
$$ 21066078 19095417 17365411 15842635 14498576 13308973 12254367 11318813 10487138
55909A0487138p42742o66559o00246n42618m93322m50668m12406l77959l47912
$$ 10487138 9744396 9077837 8477591 7934973 7441651 6990983 6578577 6200618 5852706
55900E852706l21803k98240k76649k57120k39003k21431k04857j90365j77726
$$ 5852706 5530903 5232663 4956014 4698894 4459891 4238460 4033603 3843238 3665512
55891C665512j65817j54447j44094j34383j24665j15690j08609j02535r5165q5926
$$ 3665512 3499695 3345248 3201154 3066771 2942106 2826416 2717807 2615272 2520107 2434181
55881B434181p6527o8378o1491n6111n3373n3574n5491n7905o0422o2478o3200
$$ 2434181 2357654 2289276 2227785 2171674 2118301 2064727 2009236 1951331 1890909 1828431 1765231
55870A765231o2743o2213o1703n9964n6515n2567m9152m5879m2329l9241l7241
$$ 1765231 1702488 1640275 1578572 1518608 1462093 1409526 1360374 1314495 1272166 1232925 1195684
55859A195684l5692l3802l1915l0630k9560k7951k5902k4028k2491k1119j9993
$$ 1195684 1159992 1126190 1094275 1063645 1034085 1006134 980232 956204 933713 912594 892601
55848H92601j9280j8915j8965j9682k0755k1119k0054j8063j6171j4936j4440
$$ 892601 873321 854406 835441 815759 795004 773885 753831 735768 719597 704661 690221
55837F90221j4579j4843j4363j2827j0993r945j0049j0791j1261j0689r071p387
$$ 690221 675642 660799 646436 633609 622616 612671 602622 591831 580570 569881 560810 553423
55825E53423o674o828o966o915p328q330r093r209r284r679r646q579p181o535
$$ 553423 546749 539921 532955 526040 518712 510382 501289 492080 482796 473117 463471 454892 447711 441176
55811D41176o596o495n780m588l016j200L61J276J875K790M147N700P343Q934
$$ 441176 434580 428085 422305 417717 414701 413501 413862 415138 417013 419803 423950 429650 436993 445927
55797D45927R883R640Q424O931N466L836J924k02k575n184p494q644q260o870
$$ 445927 455810 465450 473874 480805 486271 490107 492031 491829 489254 484070 476576 467932 459672 452802
55783D52802n528n151o042p692r184j0016j0484j1046j1479j1023r207o220k522
$$ 452802 447274 442123 436081 428389 419205 409189 398705 387659 376180 365157 355950 349730 347208
55770C47208J556N576Q681R868Q790O085K694j015n057q845j1092j1215j0196
$$ 347208 348764 354340 363021 372889 381679 387764 390458 389443 384386 375541 364449 353234 343038
55757C43038r415r007q150o656n322m718m629m836n529o597p384p550p498p496
$$ 343038 333623 324616 316466 309810 304488 299770 295141 290305 284776 278179 270795 263245 255747 248251
55743B48251p124o124n074m501l900k498p13R5o46j927k325j590o99n83j128j615
$$ 248251 241127 235003 229929 225428 221528 219030 218317 218412 217766 215839 213514 211924 211225 210642 209514 207899
55727B07899j893k590l972n195n245m326l516l235k907k170j457j088o82R9R31
$$ 207899 206006 203416 199444 194249 189004 184678 181162 177927 175020 172850 171393 170305 169623 169722 170653
55712A70653J523K266L603N204O318O626O269N435M349L264K051J83k414m897
$$ 170653 172176 174442 178045 183249 189567 196193 202462 207897 212246 215510 217561 217744 215330 210433
55698B10433o319o617o400o123n913n794n589m919l766k747k334k142j483l49
$$ 210433 204114 197497 191097 184974 179061 173267 167678 162759 158993 156246 153912 151770 150287 149938
55684A49938O95J396K034K851L739M534N158N517N426M721L362J616P8p66j130
$$ 149938 150633 152029 154063 156914 160653 165187 170345 175862 181288 186009 189371 190987 191065 190299 189169
55669A89169j566k046j971j251o21n45n60k30M2j41k16N11J592J985J589J291
$$ 189169 187603 185557 183586 182335 181714 181169 180609 180379 180421 180280 180064 180575 182167 184152 185741 187032
55653A87032J619K215K616K812K874K722K344J820J117K29o46j429k402l658m683
$$ 187032 188651 190866 193482 196294 199168 201890 204234 206054 207171 207400 206754 205325 202923 199265 194582
55638A94582n142n565o475p219o798n599n052n490n625m545l050k368k422k279
$$ 194582 189440 183875 177400 170181 163383 157784 152732 147242 141617 137072 134022 131654 129232 126953
55624A26953j650j098j034j221j220q73m06k65p11j387j569j105o67q55j365j516
$$ 126953 125303 124205 123171 121950 120730 119857 119451 119186 118475 117088 115519 114414 113747 112892 111527 110011
55608A10011j261j161j494j846j667r04k2L91O0p74j497j668j401j130j026q91
$$ 110011 108750 107589 106095 104249 102582 101678 101656 102047 102107 101333 99836 98168 96767 95637 94611 93720
55592I3720o08m81q82j647k121j897j266p32l90m3K36K10R8M55J277J811J619
$$ 93720 93112 92631 91749 90102 87981 86084 84818 84086 83696 83653 83889 84099 84197 84652 85929 87740 89359
55575H9359J242J354J713J594J014P74J336K240K729K549K032J706J814J999J586
$$ 89359 90601 91955 93668 95262 96276 97050 98386 100626 103355 105904 107936 109642 111456 113455 115041
55560A15041M28p45j182j026r43j126j299j438j769k100j914j191m81o6K48M92
$$ 115041 115469 114724 113542 112516 111573 110447 109148 107710 105941 103841 101927 100736 100255 100189 100437 100929
55544A00929L63n5j59K67O79O46N00O66R12Q52P37J114J983K722K798K152J045
$$ 100929 101292 101237 101078 101345 102024 102670 103170 103836 104748 105600 106337 107451 109434 112156 114954 117106 118151
55527A18151j44j056j529j619j413j061r60j444k210k525k228j964k190k503k449
$$ 118151 118007 116951 115422 113803 112390 111329 110369 108925 106715 104190 101962 99998 97808 95305 92856
55512I2856k320k490k482j579j35O36K38n13o39j38K99K36j85n91p72q26r78j158
$$ 92856 90536 88046 85564 83985 83850 84486 84724 84211 83572 83434 83733 83969 83784 83193 82421 81595 80617 79459
55494G9459r48j85N40M35m04j003p26l4K53N0j3M70J180J443R03q3o66k28Q97
$$ 79459 78511 78326 78866 79301 78897 77894 77168 77134 77387 77437 77424 77894 79074 80517 81420 81337 80671 80443 81340
55475H1340J660J440P43M52O01L99n33j519j656r35j91j18o17j009o62M26J408
$$ 81340 83000 84440 85183 85635 86236 86635 86102 84583 82927 81992 81801 81683 81066 80057 79395 79821 81229
55458H1229J195l16j827j960q85m9k36o99m71K67P51Q70R99J007M19m86p48n1
$$ 81229 82424 82108 80281 78321 77436 77387 77151 76452 75981 76248 76999 77869 78868 79875 80294 79808 79060 79009
55440G9009P98J028P75M58L0n72r04n75L5L10K90M18O51N33R9p9K24N76O25N31
$$ 79009 79807 80835 81610 82068 82098 81526 80622 80047 80082 80392 80682 81100 81751 82284 82383 82304 82528 83104 83729 84260
55420H4260M97L78P6j57j43o5p2O0M94R18R56O76K70m05j433k224k044j092l56
$$ 84260 84757 85135 85211 85054 84911 84846 84774 84834 85328 86246 87202 87878 88148 87743 86310 84086 82042 80950 80594
55401H0594l07m47l48l65q73j395j136j13R21J406J326P89n9p93r22n22j46p0
$$ 80594 80287 79840 79492 79127 78254 76859 75723 75610 76531 77937 79263 80052 79993 79200 78278 77756 77610 77540
55383G7540kL57R18J406J571J131M7j052j263n11K89L96R7K8J40q0p39j375j515
$$ 77540 77538 77895 78813 80219 81790 82921 82968 81916 80653 80142 80431 80827 80924 80952 81092 81012 80273 78898 77383
55364G7383j065k97K54J69k97l74K21Q57Q99O27O34Q24O78K23j3R0J76J38J47
$$ 77383 76318 76021 76275 76444 76147 75773 75994 76851 77750 78377 79011 79835 80513 80736 80723 80813 80989 81127 81274
55345H1274J1o65j578j770q08O02J525J712J405Q01O2n32p89p47m72J6N72R82
$$ 81274 81285 80620 79042 77272 76464 77066 78591 80303 81708 82509 82571 82039 81250 80503 80031 80047 80619 81601
55327H1601J207J226P74k11j042r05q5K63l03r84j104j001j115j085n50m5k28
$$ 81601 82808 84034 84808 84597 83555 82650 82565 82828 82525 81541 80437 79436 78321 77236 76686 76641 76413
55310G6413o99n93Q4O00P04P54P79M14j60j85N07J064P40j41p27o88k89J61N63
$$ 76413 75714 75121 75205 75805 76509 77263 78042 78456 78296 78111 78618 79682 80422 80281 79554 78866 78577 78738 79301
55291G9301Q58R97J006R13P08M56L14L13K92J37o7k30l84m94l11K77Q51P12k53
$$ 79301 80159 81156 82162 83075 83783 84239 84553 84866 85158 85295 85228 84998 84614 84120 83809 84086 84937 85649 85396
55272H5396j285j486p96L0L79L91N20Q41J103J204J224J125Q08M40K86K27o3m51
$$ 85396 84111 82625 81829 81859 82238 82629 83149 83990 85093 86297 87521 88646 89454 89894 90180 90407 90344 89893
55254H9893l07N76J496J586P61l08r27q89m90k82n51r52q80l14O1k37q92j287
$$ 89893 89586 90162 91658 93244 94005 93697 92770 91881 91391 91109 90558 89606 88726 88412 88473 88236 87344 86057
55236H6057j170o02L16J286J755J467P32q7r24j575j470m49O69J030P88N90M34
$$ 86057 84887 84285 84601 85887 87642 89109 89841 89754 88830 87255 85785 85336 86005 87035 87823 88413 88847
55219H8847j45r42j179o92j72n5NL12N45M04K22M57R90J335J309J104Q91O19J20
$$ 88847 88702 87760 86581 85889 85717 85662 85667 85979 86524 86928 87150 87607 88597 89932 91241 92345 93236 93855 93975
55200I3975o41j352j430o25M40P74J49o45q08l83Q7L39M67M78K05k96o48n53k12
$$ 93975 93334 91982 90552 89927 90367 91141 91290 90645 89837 89454 89541 89880 90347 90825 91030 90734 90086 89533 89321
55181H9321j69o64j209j052j36P14P39J42k46L1O95J202J218P43J68O5N69J118
$$ 89321 89152 88488 87279 86227 86091 86805 87544 87686 87440 87471 88166 89368 90586 91329 91497 91562 92131 93249
55163I3249J126O94K49k17q88j403j164l29K60K00j24l33m30l47J04O54P47M92
$$ 93249 94375 95069 95318 95101 94213 92810 91646 91317 91577 91777 91653 91320 90890 90543 90647 91301 92048 92540
55145I2540N24P33J95j117j728o31J110J786J343J070J403J455O46m25j012j163
$$ 92540 93064 93797 93992 92875 91147 90516 91626 93412 94755 95825 97228 98683 99329 98904 97892 96729
55129I6729j233j194q34j78N57J139J263P57l2m22j75K48L10Mk89k55J06N12O34
$$ 96729 95496 94302 93468 93290 93847 94986 96249 97006 96974 96552 96377 96625 96935 96939 96650 96395 96501 97013 97647
55110I7647M73L95N68N64op08p41j21L07J29q4K45P66P97L44M7L35J042J682J756
$$ 97647 98120 98515 99083 99647 99641 98933 98192 98071 98378 98507 98423 98668 99434 100231 100575 100622 100957 101999 103681 105437
55090A05437J089J44k76Q3O11P85R14J459J983J654N80k02k22j48n74r75n81L16
$$ 105437 106526 106670 106394 106477 107088 107873 108787 110246 112229 113883 114463 114261 114039 113891 113317 112342 111761 112077
55072A12077O84J43o61j082j192j306j353j052m67pK6k98o58p32m27N3M35P01
$$ 112077 112761 112904 112243 111161 109969 108663 107310 106258 105791 105784 105810 105512 104854 104122 103695 103748 104183 104884
55054A04884R83J146P78k38j346j815j524r65n71k54K75J036J696J866J455P44
$$ 104884 105867 107013 107791 107553 106207 104392 102868 101903 101332 101078 101353 102389 104085 105951 107406 108150
55038A08150J51j39l08n96r53j114r33n25r1K61N38P60Q50O46J66j95k7M59N25
$$ 108150 108301 108162 107854 107258 106305 105191 104258 103733 103642 103903 104441 105201 106051 106697 106863 106668 106641 107100 107625
55019A07625j66j057j482j489j437j207n23K22L45N3K91J197J677R88q3k91M34
$$ 107625 107459 106402 104920 103431 101994 100787 100264 100486 100831 100884 101175 102372 104049 105037 104954 104663 105097
55002A05097J142J258J012P18M47L08M45O67O27L48J40M0j25j56L77J287J713
$$ 105097 106239 107497 108509 109227 109674 109982 110427 111094 111721 112069 112209 112249 112124 111968 112345 113632 115345
54985A15345J254O07O35J164J275N62m34r85r54o42k78N0J71l4l00j44M58Q35
$$ 115345 116599 117206 117841 119005 120280 120842 120408 119423 118469 117827 117549 117599 117770 117736 117436 117292 117750 118585
54967A18585M75j93k58M37J114J145P54L91M8l53m27J24P79P30M1m72l95j07K7
$$ 118585 119060 118867 118609 119046 120160 121305 122059 122450 122498 122145 121718 121842 122621 123351 123392 122920 122525 122418 122445
54948A22445O5j1m35r72q82NP49M92k73l65M13J010N65n07j073n79N08J333J488
$$ 122445 122510 122499 122064 121092 120210 120215 120964 121456 121183 120818 121231 122241 122806 122299 121226 120647 121155 122488 123976
54929A23976J276J192J343J508J672K148L037L960M578N043N634O240O670P159
$$ 123976 125252 126444 127787 129295 130967 133115 136152 140112 144690 149733 155367 161607 168277 175436
54915A75436P931Q413P639N508K973P52j434l896n913o513n952n552o038o762
$$ 175436 183367 191780 199419 204927 207900 208652 207218 203322 197409 190896 184944 179392 173354 166592
54901A66592o816o211n526m941m204l321k602k039j234j36O65O45J12j21K95R20
$$ 166592 159776 153565 148039 143098 138894 135573 132971 130932 129698 129562 130227 130872 130984 130863 131158 132078
54885A32078J159R61Q27J193J979K705L055L200L505M076M797N739P061Q405Q804
$$ 132078 133237 134198 135025 136218 138197 140902 143957 147157 150662 154738 159535 165274 172335 180740 189544
54870A89544P604N229K701N85j193k670l686m448n603p364q887r044p642n584
$$ 189544 197148 202377 205078 205663 204470 201800 198114 193666 188063 180699 171812 162768 155126 149542
54856A49542l952l139k786k331j574r35j050j987k961l087k353j597j514j930
$$ 149542 145590 142451 139665 137334 135760 134825 133775 131788 128827 125740 123387 121790 120276 118346
54842A18346k144j748r08j1P18J228J464J327Q28J93k66m02k83p0O4j7k98n49
$$ 118346 116202 114454 113546 113535 114253 115481 116945 118272 119100 119293 119027 118625 118342 118272 118336 118319 118021 117472
54824A17472o32q22j520k471k713j632J32J370J680J656J739J664J246R99J340
$$ 117472 116840 116018 114498 112027 109314 107682 107814 109184 110864 112520 114259 115923 117169 118168 119508
54809A19508J736J356L85j72K1J84k58p54n24J84N00K19m3J04M28P43J214J754
$$ 119508 121244 122600 122985 122813 122834 123018 122760 122006 121482 121666 122166 122385 122342 122446 122874 123617 124831 126585
54791A26585J766R91P2j84J77N17N19L81K50J26J69N90J127J214P86L73L12L23
$$ 126585 128351 129342 129414 129230 129407 129924 130443 130824 131074 131200 131369 131959 133086 134300 135086 135459 135771 136094
54773A36094J40J10P58K063L492M639N449O035O554P188P989Q766R192Q997P989
$$ 136094 136234 136344 137102 139165 142657 147296 152745 158780 165334 172522 180511 189277 198469 207466 215455
54758B15455O159L843J523p18l177n748p569p939p291o648o304n719m735m063
$$ 215455 221614 225457 226980 226262 223085 217337 209768 201829 194538 187890 181586 175867 171132 167069
54744A67069m291m929m972m105k910k020j512j130p66n47n56n91k75N52J590K305
$$ 167069 162778 157849 152877 148772 145862 143842 142330 141200 140434 139887 139331 138740 138465 139017 140607 142912
54728A42912K417K069J640J540K079L195M396N238N885O745P594P579O302M385
$$ 142912 145329 147398 149038 150578 152657 155852 160248 165486 171371 178116 185710 193289 199591 203976
54714B03976K661J256j09j468k757m186n745o704o449n662n634o379o424m908
$$ 203976 206637 207893 207784 206316 203559 199373 193628 186924 180475 174813 169179 162800 156376 151468
54700A51468k884j895k013k119j634r83o32n57p23j221j781j840j364j018j233
$$ 151468 148584 146689 144676 142557 140923 139940 139308 138751 138028 136807 135026 133186 131822 130804 129571
54685A29571j574j432q58l06J00N31R24R88O55J21m98j150j498j065P5J103J199
$$ 129571 127997 126565 125707 125401 125501 126032 126956 127944 128599 128720 128222 127072 125574 124509 124584 125687 126886
54668A26886L96n09p97n22l21o93j436j843j433m37M96R65J045R96R66R50Q04
$$ 126886 127282 126773 125976 125454 125133 124440 123004 121161 119728 119291 119787 120752 121797 122793 123759 124709 125513
54651A25513L53l53q04m38O10J463J455Q70M29K53j62r55j403p42P34J854J776
$$ 125513 125866 125513 124709 124271 124881 126344 127799 128669 129098 129351 129189 128234 126831 126089 126823 128677 130453
54634A30453P93j36l87j33P5o0l31l74j48m0m14j076j390r59j15M59M37J9m72
$$ 130453 131246 131110 130723 130590 130665 130605 130274 129900 129752 129712 129298 128222 126832 125873 125758 126217 126654 126673 126201
54615A26201q17p93k25O13R95N17l01n19J38J007J298Q78K30j18L4M61O55K31
$$ 126201 125384 124591 124366 124979 125974 126491 126190 125671 125809 126816 128114 128992 129222 129104 129138 129599 130254 130485
54597A30485o65j500j927k004j809j199j60Q80J467J603J540J253N95j71n23m17
$$ 130485 129820 128320 126393 124389 122580 121381 121221 122101 123568 125171 126711 127964 128559 128388 127865 127448
54581A27448m36r36j481j460r26m41k38jN30J128J440J518J681J931J785Q83l82
$$ 127448 127012 126076 124595 123135 122209 121768 121530 121529 122059 123187 124627 126145 127826 129757 131542 132425 132043
54564A32043j132r33k50J84K28K21K68O7m31p42m80R9M84N25L53j4n20p06j42
$$ 132043 130911 129978 129728 129912 130140 130361 130629 130696 130265 129523 129043 129142 129626 130151 130504 130490 129970 129264 129122
54545A29122Q28J299R22L10J56L73M88M84Q14J677K668L195K985K191J153J35
$$ 129122 129950 131249 132171 132481 132637 133010 133498 133982 134796 136473 139141 142336 145321 147512 148665 148800
54529A48800p43j325j332o75J75N04J72k67l81l73n32n95k08L10K82l08p21m83
$$ 148800 148057 146732 145400 144725 144900 145404 145576 145309 144928 144555 144023 143428 143220 143530 143812 143504 142783 142300
54511A42300Q2M26M32K49o6m84q62j112j265j243q54j56N01Q78J013Q23Q3r68
$$ 142300 142382 142808 143240 143489 143423 142939 142077 140965 139700 138457 137603 137447 137948 138826 139839 140662 140745 139777
54493A39777j540j233o10l23j54M32J127J063J29q32j189j063o16K68J233J322
$$ 139777 138237 137004 136394 136071 135917 136349 137476 138539 138668 137836 136647 135584 134968 135236 136469 137791
54477A37791K66p65n27O02J200P49J35J47M68M00r6n35o18l25K85J005J408J199
$$ 137791 138057 137292 136765 137367 138567 139316 139451 139598 140066 140466 140370 139835 139217 138892 139177 140182 141590 142789
54459A42789N59j37o79q87m41O54J635J563M19q01j231r59o00m43k97M4N05P77
$$ 142789 143348 143211 142532 141645 141204 141858 143493 145056 145475 144674 143443 142484 141884 141441 141144 141188 141693 142470
54441A42470N33k24r16p59L03J365J507Q74L63M42P30P25L83j13p18j336j665
$$ 142470 143003 142779 141863 141104 141407 142772 144279 145153 145516 145958 146688 147413 147796 147683 146965 145629 143964
54424A43964j510j048n24O0P10J152J165R72R26R55P20K41r9j26k1J38M51P36
$$ 143964 142454 141406 140882 140942 141652 142804 143969 144941 145867 146822 147542 147783 147684 147558 147537 147675 148126 148862
54406A48862N10j84m90K44J449J940J400O75N33P48P31N47P34J327J593R43j92
$$ 148862 149372 149188 148698 148942 150391 152331 153731 154406 154939 155687 156418 156965 157699 159026 160619 161562 161370
54389A61370p06n0J102J483N98p35j263o66K16M80J37j70j33l3j51l80n14n49
$$ 161370 160664 160614 161716 163199 163797 163062 161799 161133 161349 161829 161966 161796 161663 161630 161479 161099 160585 160036
54371A60036m79j58L83P26N43J15MK69M53L60L67P77J224J108M12k36l08J53P45
$$ 160036 159557 159399 159782 160508 161051 161166 161170 161439 161892 162252 162619 163396 164620 165728 166140 165904 165596 165749 166494
54352A66494J115J079N69k69j043j383j257r36o48l64L0M50O64O05M93O14J098
$$ 166494 167609 168688 169257 168988 167945 166562 165305 164369 163721 163357 163387 163837 164501 165106 165599 166213 167311
54335A67311J864K700L325L620L867M563N691O443N952M284K349Q02m93j895l224
$$ 167311 169175 171875 175200 178820 182687 187250 192941 199384 205336 209620 211969 212771 212278 210383 207159
54320B07159m011m209m312m677n062m904m034k932k255k078j862j202l89Jo2j26
$$ 207159 203148 198939 194627 189950 184888 179984 175950 173018 170763 168685 166823 165621 165232 165233 165171 165045
54304A65045j5m4l91p92j060j383j770j734j014k30j83p04q22q3Q73J152O25r9
$$ 165045 165030 164986 164595 163803 162743 161360 159590 157856 156842 156612 156429 155725 154903 154820 155693 156845 157470 157371
54286A57371m08k09J62M15O41J032J341J027J35m59q8P67J150Q70M87K87Q1p0
$$ 157371 156963 156754 156916 157331 157972 159004 160345 161372 161507 161048 160960 161727 162877 163747 164234 164521 164602 164532
54268A64532J86O64O06j84q94q16k88l7j04L3O10J417K102K260J523J36q60o49
$$ 164532 164718 165382 165988 165804 164910 164094 163806 163769 163665 163698 164308 165725 167827 170087 171610 171746 170886 170237
54250A70237L10P95K97n59r85q71n86m40m93n73m13k1J43l11r92j064l95K08J25
$$ 170237 170547 171342 171639 171080 170095 169224 168638 168198 167705 167132 166719 166698 166841 166530 165538 164474 164079 164287 164412
54231A64412k22q3M71O61J38n75q29n62j01L60Q24J222J402J297R49M14j80n91
$$ 164412 164190 164107 164578 165239 165377 164802 163973 163411 163310 163670 164494 165716 167118 168415 169364 169778 169598 169007
54213A69007o84o74q63j187j288j028o25k31K01N38M14j96o86n37J7L89M35L65
$$ 169007 168323 167649 166786 165599 164311 163283 162658 162427 162628 163166 163580 163384 162698 162161 162178 162567 163002 163367
54195A63367J53l15p04n09J47O45P99J015J374J370Q08K88L13N43M19M8j39k30
$$ 163367 163520 163205 162501 161992 162139 162784 163583 164598 165972 167342 168150 168438 168751 169294 169713 169761 169622 169392
54177A69392o60j363j726j414q35o11q73j151q73j6P42O86j69j162j799k049j971
$$ 169392 168732 167369 165643 164229 163394 162783 161910 160759 159886 159870 160612 161298 161129 159967 158168 156119 154148
54160A54148j566j112r89j023o18K19P99R56J393K259K419J116n48r40j79K89
$$ 154148 152582 151470 150481 149458 148840 149059 149858 150814 152207 154466 156885 158001 157453 156513 156334 156623
54144A56623o7m27l00j52j75K04J138J847J802J494J384J101K76n87q21n56k77
$$ 156623 156556 156129 155829 155677 155502 155706 156844 158691 160493 161987 163371 164472 164748 164161 163340 162784 162507
54127A62507l4K75L35o5l47K13J366K059J743R11M20O27J173J344P66o2k38L58
$$ 162507 162473 162748 163083 163018 162671 162884 164250 166309 168052 168963 169383 170010 171183 172527 173293 173231 172993 173351
54109A73351P70K92m15j44J198K433K578J771P35j25q05j357j749j949j951j767
$$ 173351 174121 174413 173998 173854 175052 177485 180063 181834 182569 182444 181639 180282 178533 176584 174633 172866
54093A72866j430r82m43J36O57R91R78M86k71o54j75Q21J466J385R62N32J0n02
$$ 172866 171436 170454 170011 170147 170804 171795 172773 173259 172988 172334 172159 172980 174446 175831 176793 177325 177335 176833
54075A76833m65K52R56J111J147J588J983J575O56K28M54M95p1o52o67l00L1K34
$$ 176833 176368 176620 177576 178687 179834 181422 183405 184980 185636 185864 186318 186813 186742 186090 185423 185123 185154 185388
54057A85388K58n9m49j92R14K081K461K082J486R69P09J090K210L351L678L355
$$ 185388 185646 185587 185138 184946 185860 187941 190402 192484 193970 194939 195648 196738 198948 202299 205977 209332
54041B09332L288L849M487M697M730N056N626O047O223O390O632O753O671O711
$$ 209332 212620 216469 220956 225653 230383 235439 241065 247112 253335 259725 266357 273110 279781 286492
54027B86492P330Q647J0306J1849J3140J4352J5525J6206J5659J3453R830N458
$$ 286492 293822 302469 312775 324624 337764 352116 367641 383847 399506 412959 422789 428247
54015D28247R13l496p571j1063j3792j5693j6671j6583j5535j4008j2442j0829
$$ 428247 429160 425664 418093 407030 393238 377545 360874 344291 328756 314748 302306 291477
54003B91477r050p403o361n817n181m371l995m234m231l196j663q60j121j656
$$ 291477 282427 275024 268663 262846 257665 253294 249299 245065 240834 237638 235975 235115 233994 232338
53989B32338j769j512j138p36n36q62j495j781j631j717k293k561j844p78n51
$$ 232338 230569 229057 227919 227183 226647 225785 224290 222509 220878 219161 216868 214307 212463 211685 211134
53974B11134j289j984j877j230o39k98n3K94Q69J621K115J851Q48l04j069j340
$$ 211134 209845 207861 205984 204754 204115 203817 203764 204058 204927 206548 208663 210514 211362 211058 209989 208649
53958B08649j157n24L72J037J160J039J232J838K358K322J874J681K201L157L818
$$ 208649 207492 206968 207340 208377 209537 210576 211808 213646 216004 218326 220200 221881 224082 227239 231057
53943B31057L876L805M152M714M803M332M075M669N683O033N167L528J992J168
$$ 231057 234933 238738 242890 247604 252407 256739 260814 265483 271166 277199 282366 285894 287886 289054
53929B89054J114J415J506J207R40J219K012K773L124L141L015K827K798L345
$$ 289054 290168 291583 293089 294296 295236 296455 298467 301240 304364 307505 310520 313347 316145 319490
53915C19490M518N767O547O979P431P715P264O102N010M511M173L308J969Q43
$$ 319490 324008 329775 336322 343301 350732 358447 365711 371813 376823 381334 385507 388815 390784 391627
53901C91627L02K3m48j160j825k241k481k764l196l648l962m247m800n624o290
$$ 391627 391929 391952 391504 390344 388519 386278 383797 381033 377837 374189 370227 365980 361180 355556 349266
53886C49266o483o445o566o693o266n153l922l172k879k627k198j732j336q59
$$ 349266 342783 336338 329772 323079 316813 311660 307738 304566 301687 299060 296862 295130 293794 292935
53872B92935p6R27J763K276K954M468O661Q458R053Q906R069R965J1423J3508
$$ 292935 292859 293786 295549 297825 300779 305247 311908 320366 329419 338325 347394 357359 368782 382290
53858C82290J6304J8805J9099J6150J0754M320k544r680j6360k1503k4534k5384
$$ 382290 398594 417399 436498 452648 463402 467722 465178 455498 439138 417635 393101 367717
53846C67717k4021k0792j6912j3731j1536r696p857o193m755l469k761l132l955
$$ 367717 343696 322904 305992 292261 280725 271029 263172 256979 252224 248755 245994 242862 238907
53833B38907l778k208n68j35o70j202j388j248m84Q61J658Q52r25k030j880j241
$$ 238907 235129 232921 232353 232218 231548 230346 228958 227710 227226 228087 229745 230597 229672 227642 225762 224521
53817B24521o15K88J311J539Q15L80J142K259K401J659J143J287J677K241L339
$$ 224521 223906 224194 225505 227044 227859 228239 229381 231640 234041 235700 236843 238130 239807 242048 245387
53802B45387M660N231M833M426M753N304N210M474L702L096K428J785J622K089
$$ 245387 250047 255278 260111 264537 269290 274594 279804 284278 287980 291076 293504 295289 296911 299000
53788B99000K701K799K106R49P2L0N45P24R9q61j596k321l476m669n080m747m606
$$ 299000 301701 304500 306606 307555 307627 307657 308202 308926 309025 308164 306568 304247 300771 296102 291022 286275 281669
53771B81669n028n208m470l404l044l404l625l271k707k282j874j392j076j032
$$ 281669 276641 271433 266963 263559 260515 257111 253486 250215 247508 245226 243352 241960 240884 239852
53757B39852r46n51o4J32n6o02j602k915l827l610k428j204n59l05j06n6k54k96
$$ 239852 238906 238355 238291 238423 238367 237765 236163 233248 229421 225811 223383 222179 221620 221315 221209 221153 220899 220603
53739B20603K34R70J122N71j8k41m42q32q61m4J076J547J369J349J707J719R92
$$ 220603 220837 221807 222929 223500 223482 223241 222799 221967 221106 221062 222138 223685 225054 226403 228110 229829 230821
53722B30821K46L22J095J887K469K929L008K417J619J476K071K553K352J812J433
$$ 230821 231067 231389 232484 234371 236840 239769 242777 245194 246813 248289 250360 252913 255265 257077 258510
53707B58510J177Q97Q47J193J514J482J659K796M464N219M356K876K249K741L353
$$ 258510 259687 260584 261431 262624 264138 265620 267279 270075 274539 279758 284114 286990 289239 291980 295333
53692B95333L171K246J217O01N07P42R27P09L5q03j422j617j381q44k85m8k68
$$ 295333 298504 300750 301967 302568 303075 303817 304744 305453 305488 304685 303263 301646 300265 299421 299136 299088 298820
53675B98820p16j023r71n30K18R80J217N68o01j415j383q82n42m58k86O0K47Q8
$$ 298820 298104 297081 296110 295580 295798 296778 297995 298563 297962 296547 295164 294282 293740 293282 292996 293056 293303 293391
53657B93391j24oM41R29J233J308J148Q13M84K93J22k36p26r93p48j07M90O27
$$ 293391 293267 293261 293702 294631 295864 297172 298320 299133 299617 299910 300032 299796 299070 298077 297329 297222 297712 298339
53639B98339K08m32p02k21P69J541J593J153Q65J041J440J713J888K185K595K877
$$ 298339 298547 298115 297413 297192 297961 299502 301095 302248 303113 304154 305594 307307 309195 311380 313975 316852
53623C16852K873K655K377K186K256K679L243L576L615L743M243M855N073M775
$$ 316852 319725 322380 324757 326943 329199 331878 335121 338697 342312 346055 350298 355153 360226 365001
53609C65001M265L807L364K848K332J996K001K375K886L062K658K085J962K277
$$ 365001 369266 373073 376437 379285 381617 383613 385614 387989 390875 393937 396595 398680 400642 402919
53595D02919K314J617N97j08m71q69j326j549j584j856k397k591j971r20k46k97
$$ 402919 405233 406850 407447 407339 406868 405999 404673 403124 401540 399684 397287 394696 392725 391805 391559 391262
53579C91262p92j355j850k161k117j758j465j563j871j846j163o5Q76J319J377
$$ 391262 390470 389115 387265 385104 382987 381229 379764 378201 376330 374484 373321 373256 374132 375451 376828
53564C76828J426J786K549L597M710N625O066N786M787L513K639K351J926L94
$$ 376828 378254 380040 382589 386186 390896 396521 402587 408373 413160 416673 419312 421663 423589 423983
53550D23983k261m844o134n958m920l407j487L81J336J127O59J084K516M036M779
$$ 423983 421722 416878 410744 404786 399866 396459 394972 395353 396689 397816 398475 399559 402075 406111 410890
53535D10890M713M392M367M873N794O812P713Q581R578J0546J1115J1274J1472
$$ 410890 415603 419995 424362 429235 435029 441841 449554 458135 467713 478259 489374 500648 512120
53522E12120J2053J2777J3173J3221J3414J4210J5662J7511J9386K0797K1344
$$ 512120 524173 536950 550123 563344 576758 590968 606630 624141 643527 664324 685668
53511F85668K1169K1052K1762K3281K4870K5847K6087K5849K5380K4755K3942
$$ 685668 706837 727889 749651 772932 797802 823649 849736 875585 900965 925720 949662
53500I49662K2897K1735K0858K0571K0564K0104J8984J7941J7732J8131J8254
$$ 949662 972559 994294 1015152 1035723 1056287 1076391 1095375 1113316 1131048 1149179 1167433
53489A167433J7787J7280J7241J7587J8071J8655J9135J8979J8007J6869J6303
$$ 1167433 1185220 1202500 1219741 1237328 1255399 1274054 1293189 1312168 1330175 1347044 1363347
53478A363347J6145J5615J4377J2735J0830Q362N274K172l37k397m662p417j0253
$$ 1363347 1379492 1395107 1409484 1422219 1433049 1441411 1446685 1448857 1448520 1446123 1441461 1434044 1423791
53465A423791j2506j3847j4486j4919j5443j5843j5708j5109j4769j5401j7005
$$ 1423791 1411285 1397438 1382952 1368033 1352590 1336747 1321039 1305930 1291161 1275760 1258755
53454A258755j8957k0689k1974k2688k2611k1743k0562j9751j9493j9234j8182
$$ 1258755 1239798 1219109 1197135 1174447 1151836 1130093 1109531 1089780 1070287 1051053 1032871
53443A032871j6138j3712j1710j0324r038p323n322l723k937k536j722k89J129
$$ 1032871 1016733 1003021 991311 980987 971949 964626 959304 955581 952644 950108 948386 948097 949226
53430I49226J952K507L579N185O425O768O994Q269J0533J2521J3384J3753J4827
$$ 949226 951178 953685 957264 962449 968874 975642 982636 990905 1001438 1013959 1027343 1041096 1055923
53417A055923J6811J8676J9449J9405J9810K1563K4247K6655K8150K9169L0432
$$ 1055923 1072734 1091410 1110859 1130264 1150074 1171637 1195884 1222539 1250689 1279858 1310290
53406A310290L2078L3837L5658L7674L9763M1778M3958M6558M9098N0698N1276
$$ 1310290 1342368 1376205 1411863 1449537 1489300 1531078 1575036 1621594 1670692 1721390 1772666
53395A772666N1676N2463N3301N3829N4375N5217N5769N5259N3857N2438N1407
$$ 1772666 1824342 1876805 1930106 1983935 2038310 2093527 2149296 2204555 2258412 2310850 2362257
53384B362257N0358M8765M6456M3473L9979L6275L2484K8336K3640J8780J4236
$$ 2362257 2412615 2461380 2507836 2551309 2591288 2627563 2660047 2688383 2712023 2730803 2745039
53373B745039R852N153K39m349q711j3764k0091k7188l4063m0124m5220m9233
$$ 2745039 2754891 2760044 2760283 2755934 2747223 2733459 2713368 2686180 2652117 2611993 2566773 2517540
53361B517540n2064n3749n4432n4377n4009n3598n2859n1317m9053m6685m4562
$$ 2517540 2465476 2411727 2357295 2302918 2248909 2195311 2142452 2091135 2042082 1995397 1950835
53350A950835m2588m0950m0262m0584m0973m0596l9738l9091l8472l7096l4877
$$ 1950835 1908247 1867297 1827035 1786451 1745478 1704882 1665144 1626053 1587581 1550485 1515608
53339A515608l2606l0777k8991k6759k4273k1974j9782j7295j4596j2437j1468
$$ 1515608 1483002 1452225 1423234 1396475 1372202 1350228 1330446 1313151 1298555 1286118 1274650
53328A274650j1574j2151j2851j3685j4507j4769j4146j3042j2080j1280j0322
$$ 1274650 1263076 1250925 1238074 1224389 1209882 1195113 1180967 1167925 1155845 1144565 1134243
53317A134243r385r044r152q635o865m547k758j582l73J048K278L178M130N376
$$ 1134243 1124858 1115814 1106662 1098027 1091162 1086615 1083857 1082275 1081902 1082950 1085228 1088406 1092536 1097912
53303A097912O725P992R240J0579J2199J4502J7614K0719K2642K3329K4046K5773
$$ 1097912 1104637 1112629 1121869 1132448 1144647 1159149 1176763 1197482 1220124 1243453 1267499 1293272
53291A293272K7884K8986K8572K7289K5886K4556K3298K2203K1179J9792J7722
$$ 1293272 1321156 1350142 1378714 1406003 1431889 1456445 1479743 1501946 1523125 1542917 1560639
53280A560639J5110J2240R078N502J865j150l427n708q665j1900j4445j6049j7406
$$ 1560639 1575749 1587989 1597067 1602569 1604434 1603284 1599857 1594149 1585484 1573584 1559139 1543090 1525684
53267A525684j9032k0605k1751k2770k4037k5217k5767k5932k6406k7243k7875
$$ 1525684 1506652 1486047 1464296 1441526 1417489 1392272 1366505 1340573 1314167 1286924 1259049
53256A259049k8170k8575k9076k8876k7556k5844k4760k4504k4612k4761k4847
$$ 1259049 1230879 1202304 1173228 1144352 1116796 1090952 1066192 1041688 1017076 992315 967468
53245I67468k4689k4177k3566k3166k2894k2434k1644k0461j8732j6573j4579
$$ 967468 942779 918602 895036 871870 848976 826542 804898 784437 765705 749132 734553
53234G34553j3165j1915j0190q210o861o461o408o200o131o645p665q872j0288
$$ 734553 721388 709473 699283 691073 684212 677751 671343 665143 659012 652367 644702 635830 625542
53221F25542j2020j3714j4757j4940j4535j3818j2922j2116j1744j1744j1525
$$ 625542 613522 599808 585051 570111 555576 541758 528836 516720 504976 493232 481707
53210D81707j0602r154p780o796o123n754o008p043q371r183r185q767q387p980
$$ 481707 471105 461951 454171 447375 441252 435498 429490 422447 414076 404893 395708 386941 378554 370574
53196C70574p275o400n855n882o170o228n838n140m403l830l433l029k518k131
$$ 370574 363299 356899 351044 345162 338992 332764 326926 321786 317383 313553 310120 307091 304573 302442
53182C02442k152k347k042j007LO6p02j264r97l62r1j94k33j57k73n30n01j14
$$ 302442 300290 297943 295901 294894 294897 294963 294261 292997 292000 291638 291547 291353 291120 290963 290690 290160 289659 289545
53164B89545K01K41M00R35J413J302P87L90J13m55j250j699j647j663k099k465
$$ 289545 289746 289987 290387 291322 292735 294037 294824 295214 295327 294872 293622 291923 290276 288613 286514 284049
53148B84049k163j450j112j343j542j200n36p3N4Q4J56J26r3k82j96Rq9o06j121
$$ 284049 281886 280436 279324 277981 276439 275239 274703 274630 274684 274768 274924 275050 274957 274675 274479 274488 274399 273793 272672
53129B72672j166p51k25K11N20N56J51m64p54m67J17O48J046J308J288R70O03
$$ 272672 271506 270755 270530 270741 271261 271817 271968 271504 270750 270283 270400 271048 272094 273402 274690 275660 276263
53112B76263L99K42m5m43q77j406j981k279k065j574j233j215j418j713j915j740
$$ 276263 276662 276904 276859 276416 275539 274133 272152 269873 267808 266234 265001 263786 262368 260655 258740 257000
53096B57000j169o25n22p54r30r43q88o42K7R86J742J952J602Q14j54q04p74l19
$$ 257000 255831 255206 254684 253930 253000 252057 251169 250527 250554 251540 253282 255234 256836 257650 257496 256692 255918 255599
53078B55599m2k04n76q89r88o67J33R19J041N64K44N02R43J082R90Q82O04o8q69
$$ 255599 255557 255353 254777 253888 252900 252233 252366 253285 254326 254890 255134 255636 256579 257661 258651 259533 260137 260069 259200
53059B59200j257j002l47L03O80Q01R10J087J071P33N59R87J425P72q91k083j852
$$ 259200 257943 256941 256594 256897 257577 258378 259288 260375 261446 262179 262738 263725 265150 265922 265031 262948 261096
53042B61096j003o87p06k18M91L02q73j786j574p49j99q4j50l55o09m37M33J446
$$ 261096 260093 259406 258700 258482 258973 259275 258402 256616 255042 254293 254094 254010 253860 253505 252896 252459 252892 254338
53024B54338J662Q05m99j377j374o59K01O79O87N38N03N14L89J23n2J32P60J535
$$ 254338 256000 256805 256306 254929 253555 252896 253097 253776 254463 255001 255504 256018 256407 256530 256478 256610 257370 258905
53006B58905J864J369L59m38o01l29k0J18M1k63o71q83o70j10M52O70M23k9k71
$$ 258905 260769 262138 262497 262059 261458 261129 261109 261227 261268 261005 260334 259451 258781 258671 259123 259793 260216 260187 259916
52987B59916j56N7J77M49J101J792J906J413R02Q57J258J861K355K332J681J068
$$ 259916 259760 259817 259994 260443 261544 263336 265242 266655 267557 268414 269672 271533 273888 276220 277901 278969
52971B78969J356K349K800J951M96l42r3Q78J979K606K342J503J043J327J497
$$ 278969 280325 282674 285474 287425 287921 287579 287486 288364 290343 292949 295291 296794 297837 299164 300661
52956C00661O80o43j269r78o84j025j659k069k269k438k447k075j389o51j61k05
$$ 300661 301341 300698 299429 298451 297767 296742 295083 293014 290745 288307 285860 283785 282396 281745 281584 281379
52940B81379q89j868k593k832k737k413j797r81k98m6l11j015j762j840q98M33
$$ 281379 280490 278622 276029 273197 270460 268047 266250 265269 264971 264925 264614 263599 261837 259997 259099 259532
52924B59532J093P75N1n55r75j067m69P32J855K435K653K625J962N64p45j058
$$ 259532 260625 261400 261451 260896 259921 258854 258385 259117 260972 263407 266060 268685 270647 271211 270466 269408
52908B69408n56j70l45p01q17o71m10r8J29J07j21l51n17o83p71n83j63J33Om38
$$ 269408 268852 268682 268337 267636 266819 266148 265738 265640 265769 265876 265755 265404 264887 264204 263433 262850 262687 262820 262826 262388
52888B62388p77o59j69J68r5o99q70k81M66N91J28k66k92k62l85l58J12P05P85
$$ 262388 261611 260952 260783 260951 260856 260157 259287 259006 259472 260063 260191 259925 259633 259371 258986 258628 258740 259445 260230
52869B60230J88n58q00m17K16P97J430K282L109L417L065K446K008J876J952J975
$$ 260230 260418 259860 259060 258643 258859 259656 261086 263368 266477 269894 272959 275405 277413 279289 281241 283216
52853B83216J513L04j175j961j739j293j454k063k392k201j796j337q02m52o22
$$ 283216 284729 285033 283858 281897 280158 278865 277411 275348 272956 270755 268959 267622 266820 266368 265746
52838B65746j120j474j720k287l028l144k357j438j200j438j312m35P55J508J345
$$ 265746 264626 263152 261432 259145 256117 252973 250616 249178 247978 246540 245228 244793 245548 247056 248401
52823B48401M15n53q99p80r31j564j972j509m92L23P83J287K006K712L269L696
$$ 248401 248816 248263 247364 246584 245653 244089 242117 240608 240116 240439 241222 242509 244515 247227 250496 254192
52807B54192L773L159K073J346J565K365K831K365J005q56k735m112m572m106
$$ 254192 257965 261124 263197 264543 266108 268473 271304 273669 274674 273818 271083 266971 262399 258293
52793B58293l143k217j601j353j473j847k096j778r58k93l16p64q97m15L00P83
$$ 258293 255150 252933 251332 249979 248506 246659 244563 242785 241827 241534 241218 240454 239557 239142 239442 240225
52777B40225R69R79Q82Q10R71J268J238O74P8J05O82J111R81O15M89N77M58q3
$$ 240225 241194 242173 243055 243865 244836 246104 247342 248016 248094 248199 248881 249992 250973 251588 252077 252654 253112 253029
52759B53029q00j281j331j121r51r07p51k14N51R66N82l64j078r57q8J046K110
$$ 253029 252229 250948 249617 248496 247545 246638 245887 245673 246224 247190 247772 247408 246330 245373 245285 246331 248441
52742B48441K989L430L127K213J311Q56O75N38O54J214J669J262J97l93P7Q74
$$ 248441 251430 254860 257987 260200 261511 262367 263042 263580 264234 265448 267117 268379 268576 268183 268260 269134
52726B69134R92M65Q4J76K97P0k66l42k85n91j471k553l212l132k453j500n06
$$ 269134 270126 270591 270675 270851 271148 271218 270952 270610 270325 269734 268263 265710 262498 259366 256913 255413 254907
52709B54907L00O24M06P5J47O01Q91O42Ro56j111j163p22r3J79l1k30m5K63L26
$$ 254907 255207 255831 256237 256312 256459 257060 257951 258593 258602 257946 256835 255672 254950 254857 255036 255005 254775 254730 254993 255319
52689B55319L05N97J126J465J527J622J866J999J849J590J314P17m53j737k139
$$ 255319 255624 256221 257347 258812 260339 261961 263827 265826 267675 269265 270579 271296 270843 269106 266967
52674B66967j167L92J130M98o05j024o93l61k81nN23O67J80j80J85P07M63l76
$$ 266967 265800 266192 267322 267820 267215 266191 265498 265137 264856 264851 265374 266041 266221 266041 266226 266933 267396 267020
52656B67020q10l19P33J852K768L200K985K466K079J631N94q84j983k304k280
$$ 267020 266210 265891 266624 268476 271244 274444 277429 279895 281974 283605 284199 283315 281332 279028 276748
52641B76748k333k281j804r80o5P64J278J268J011J122J692K045J731J294J627
$$ 276748 274415 272134 270330 269350 269285 270049 271327 272595 273606 274728 276420 278465 280196 281490 283117
52626B83117K810M010M328L499J897J61j238k233k935l241k998k452k160k257
$$ 283117 285927 289937 294265 297764 299661 299822 298584 296351 293416 290175 287177 284725 282565 280308
52612B80308k265j795j074n48k98j32O5L47Q14J390J695J442P80J35k19k53j11
$$ 280308 278043 276248 275174 274626 274328 274196 274261 274608 275422 276812 278507 279949 280729 280864 280645 280392 280281
52595B80281q4l36o07m15K70Q96J054R44R00Q27M91J8k37j17K84P81J078Q84L78
$$ 280281 280197 279861 279254 278839 279109 280005 281059 282003 282903 283730 284221 284239 284002 283885 284169 284950 286028 286912 287290
52576B87290J91O06J027P65k7o16p11o31n96m52j40N8q4m00n59m50k62k84o05
$$ 287290 287481 288087 289114 289879 289852 289236 288525 287894 287298 286846 286706 286764 286680 286280 285721 285271 285009 284725 284120
52557B84120r04p43k12k4o14j406j431n59L86P02N32M11N46P49P68M93K3l01j17
$$ 284120 283216 282473 282261 282237 281623 280217 278786 278227 278613 279315 279847 280258 280804 281553 282321 282814 282837 282536 282419
52538B82419N27J067R10k5j201j918j819j102k47L74O18M91K12K95J096K099K165
$$ 282419 282946 284013 284923 284898 283697 281779 279960 278858 278611 278985 279603 280094 280306 280601 281697 283796 285961
52521B85961Q37r59j895j612o86L88J496K377K654K511K671L371L896L496K405
$$ 285961 286798 285839 283944 282332 281646 282034 283530 285907 288561 291072 293743 297114 301010 304506 306911
52506C06911J588J673K398K918K477R36j137k927l970m254l885k976j888j140
$$ 306911 308499 310172 312570 315488 317965 318901 317764 314837 310867 306613 302728 299752 297864 296724
52492B96724q77p66o01o90j340k193k497j912q09J95P30P06J96m97q83o10J55
$$ 296724 295847 295081 294480 293790 292450 290257 287760 285848 285039 285234 285964 286670 286866 286369 285486 284876 285031
52475B85031Q61J168J325J737K280K416K047J812K224K899L053K591K135K139
$$ 285031 285892 287060 288385 290122 292402 294818 296865 298677 300901 303800 306853 309444 311579 313718
52461C13718K434K740K975K936K145M64j470k720k928k545k298k563l148l549
$$ 313718 316152 318892 321867 324803 326948 327412 325942 323222 320294 317749 315451 312888 309740 306191
52447C06191l479l100k654k090j310o35n39r24j207j138j065j148r66k81L66L00
$$ 306191 302712 299612 296958 294868 293558 292923 292384 291460 290253 289115 288050 286902 285936 285655 286021 286321
52431B86321l35q04p76n47l93k37K7K81M13M94O22P63Q25P73O24L89P4j76KR56
$$ 286321 285986 285182 284406 283859 283466 283229 283256 283537 283950 284444 285066 285829 286654 287427 288051 288440 288514 288338 288340 289296
52411B89296K516L870M365M405N047O667Q559J0053J1291J2520J3158J2322R894
$$ 289296 291812 295682 300047 304452 309499 316166 324725 334778 346069 358589 371747 384069 393963
52398C93963O426K361j930n649q066r415j0454j1089j0429q451o504n636n218
$$ 393963 400389 402750 400820 395171 387105 377690 367236 356147 345718 337267 330763 325127 319909
52385C19909m026k078n45j48m70p39n86Q1J262K705L925M579M705M590M600M987
$$ 319909 315883 313805 313260 313112 312642 311903 311317 311398 312660 315365 319290 323869 328574 333164 337764 342751
52369C42751N596N795N072L704K535K074K048J810R23n73k070k635j851m62K63
$$ 342751 348347 354142 359214 362918 365453 367527 369575 371385 372308 371735 369665 367030 365179 364717 364980
52354C64980p2o90q10n85m86m27k0P07J411J999K501K630K196J794K282L493M247
$$ 364980 364908 364218 363408 362823 362337 361910 361890 362597 364008 366007 368508 371138 373334 375128 377410 380903 385150
52337C85150L902L203L210L979M908N816O975Q402R771J1051J2508J4076J5299
$$ 385150 389052 392255 395465 399444 404352 410168 417143 425545 435316 446367 458875 472951 488250
52324D88250J6011J6597J7347J7971J8035J7518J6708J5886J5306J5224J5616
$$ 488250 504261 520858 538205 556176 574211 591729 608437 624323 639629 654853 670469
52313F70469J6109J6523J7197J8332J9298J9239J8360J7911J8515J9222J8782
$$ 670469 686578 703101 720298 738630 757928 777167 795527 813438 831953 851175 869957
52302H69957J7481J6790J7278J7788J7061J5323J3605J2041R892P019M270K096
$$ 869957 887438 904228 921506 939294 956355 971678 985283 997324 1007216 1014235 1018505 1020601
52290A020601j87l106n850p230p411p678q590r294q988q113p623p540o967n370
$$ 1020601 1020414 1017308 1011458 1004228 996817 989139 980549 971255 962267 954154 946531 938991 932024 926654
52276I26654l264j513l93M43J251J887K349L236N239Q090J0558J1761J2070J2380
$$ 926654 923390 921877 921484 921927 923178 925065 927414 930650 935889 943979 954537 966298 978368 990748
52262I90748J2912J3323J3632J4204J4898J5150J5006J5239J6145J6985J7042
$$ 990748 1003660 1016983 1030615 1044819 1059717 1074867 1089873 1105112 1121257 1138242 1155284
52251A155284J6484J5628J4143J1761R147P121N345K779p68m402p325r384j0461
$$ 1155284 1171768 1187396 1201539 1213300 1222447 1229568 1234913 1237692 1236924 1232522 1225197 1215813 1205352
52238A205352j0448j0020j0363j1601j2461j2064j1239j1245j1930j2219j1946
$$ 1205352 1194904 1184884 1174521 1162920 1150459 1138395 1127156 1115911 1103981 1091762 1079816
52227A079816j1917j2264j2019j0672r028p952p137n956m835m706n283n125l555
$$ 1079816 1067899 1055635 1043616 1032944 1023916 1015964 1008827 1002871 998036 993330 988047 982922 979367
52214I79367j647p25o11r8J319K965M141M936N636O043N827N195M764M829N126
$$ 979367 977720 976995 976384 976286 977605 980570 984711 989647 995283 1001326 1007153 1012348 1017112 1021941 1027067
52199A027067N210M799L882K806K238K646L725M608M815M674M734M982N007M660
$$ 1027067 1032277 1037076 1040958 1043764 1046002 1048648 1052373 1056981 1061796 1066470 1071204 1076186 1081193 1085853
52185A085853M190L669K780J313m56k180l994o187q449r979j0431j0311j0107
$$ 1085853 1090043 1093712 1096492 1097805 1097349 1095169 1091175 1084988 1076539 1066560 1056129 1045818 1035711
52172A035711r551q181o345m982m406l989l125j964q80K47J720L343M590N348
$$ 1035711 1026160 1017979 1011634 1006652 1002246 998257 995132 993168 992288 992535 994255 997598 1002188 1007536
52158A007536N935O403O279N140L150R43q06j610j314l09O36J028J100J417K081
$$ 1007536 1013471 1019874 1026153 1031293 1034443 1035386 1034580 1032970 1031656 1031347 1031983 1033011 1034111 1035528 1037609
52143A037609K595K503J939J420J252J310J274Q74Rj094j788j419L8J951L795
$$ 1037609 1040204 1042707 1044646 1046066 1047318 1048628 1049902 1050776 1050785 1049691 1047903 1046484 1046522 1048473 1052268
52128A052268N731Q165J1013J3809J6360J8866K1399K3728K5766K7711K9599L0979
$$ 1052268 1057999 1066164 1077177 1090986 1107346 1126212 1147611 1171339 1197105 1224816 1254415 1285394
52116A285394L1366L0769K9651K8490K7473K6382K4743K2266J9259J6341J3793
$$ 1285394 1316760 1347529 1377180 1405670 1433143 1459525 1484268 1506534 1525793 1542134 1555927
52105A555927J1529R707Q827Q967R467R612R315Q810Q137P271O324N188L422R06
$$ 1555927 1567456 1577163 1585990 1594957 1604424 1614036 1623351 1632161 1640298 1647569 1653893 1659081 1662503 1663409
52091A663409j863m649q150j2902j7914k1321k2461k2345k2060k1503k0005j7433
$$ 1663409 1661546 1656897 1648747 1635845 1617931 1596610 1574149 1551804 1529744 1508241 1488236 1470803
52079A470803j4277j1148q586o952o047n113l524j288J259L947O698R221J1084
$$ 1470803 1456526 1445378 1436792 1429840 1423793 1418680 1415156 1413868 1415127 1419074 1425772 1434993 1446077
52066A446077J2122J2661J3365J4655J6096J6563J5388J3275J1673J1321J1814
$$ 1446077 1458199 1470860 1484225 1498880 1514976 1531539 1546927 1560202 1571875 1583196 1595010
52055A595010J2411J2601J1991J0437Q474O914N741M093J584j089l285n382p980
$$ 1595010 1607421 1620022 1632013 1642450 1650924 1657838 1663579 1667672 1669256 1668167 1664882 1659500 1651520
52042A651520j0766j3020j4745j6491j8183j9019j8544j7242j5934j5033j4510
$$ 1651520 1640754 1627734 1612989 1596498 1578315 1559296 1540752 1523510 1507576 1492543 1478033
52031A478033j4107j3504j2562j1514j0752j0404j0302j0228j0059r771r508r508
$$ 1478033 1463926 1450422 1437860 1426346 1415594 1405190 1394888 1384660 1374601 1364830 1355322 1345814
52019A345814r765j0029j0243j0639j1039j0565q680o218m759m939n961o775p170
$$ 1345814 1336049 1326020 1315777 1305138 1294099 1283534 1274854 1268636 1263877 1258938 1252977 1246202 1239032
$$ [...]
##END NTUPLES=NMR SPECTRUM
##END=
