##TITLE=AC1581_2782_8202388_tz30C9GtBx
##JCAMPDX= 6.0         $$ Bruker NMR JCAMP-DX V2.0
##DATA TYPE= NMR SPECTRUM
##DATA CLASS= NTUPLES
##ORIGIN= BRUKER
##OWNER= Administrator
$$ 1.72 TOPSPIN		Version 2.1
$$ 2013-09-27 01:04:43.596 -0700  Administrator@X
$$ Compression mode = diff/dup
##.OBSERVE FREQUENCY= 400.02188249412
##.OBSERVE NUCLEUS= ^1H
##.ACQUISITION MODE= SIMULTANEOUS (DQD)
##.ACQUISITION SCHEME= undefined
##.AVERAGES= 8
##.DIGITISER RES= 22
##SPECTROMETER/DATA SYSTEM= spect
##.PULSE SEQUENCE= zg30
##.SOLVENT NAME= COFFEE_meoh
##.SHIFT REFERENCE= INTERNAL, COFFEE_meoh, 1, 14.98509
##AUDIT TRAIL= $$ (NUMBER, WHEN, WHO, WHERE, PROCESS, VERSION, WHAT)
$$ ##TITLE= Audit trail, TOPSPIN		Version 2.1
$$ ##JCAMPDX= 5.01
$$ ##ORIGIN= Bruker BioSpin GmbH
$$ ##OWNER= Administrator
$$ $$ E:\/data/COFFEE/nmr/AC1581_2782_8202388_tz30C9GtBx/20/pdata/1/auditp.txt
$$ ##AUDIT TRAIL=  $$ (NUMBER, WHEN, WHO, WHERE, PROCESS, VERSION, WHAT)
(   1,<2013-09-27 01:04:36.471 -0700>,<Administrator>,<X>,<go>,<TOPSPIN 2.1>,
      <created by zg
	started at 2013-09-27 01:03:31.533 -0700,
	POWCHK enabled, PULCHK disabled,
       configuration hash MD5:
       C8 4E 4E 5D D3 5C D8 9E 9F 52 82 E0 59 8A DE 15
       data hash MD5: 64K
       0B 00 06 E8 9F 3F 5C 81 3D 41 83 A6 F9 6F AD 6B>)
(   2,<2013-09-27 01:04:39.471 -0700>,<Administrator>,<X>,<proc1d>,<TOPSPIN 2.1>,
      <Start of raw data processing
       efp LB = 0 FT_mod = 6 PKNL = 1 PHC0 = 0 PHC1 = 0 SI = 32K 
       data hash MD5: 32K
       AA 88 F3 04 20 8A 49 72 73 25 10 23 9C D5 7E 2E>)
(   3,<2013-09-27 01:04:39.768 -0700>,<Administrator>,<X>,<proc1d>,<TOPSPIN 2.1>,
      <pk PHC0 = 93.93311 PHC1 = 0 
       data hash MD5: 32K
       89 19 4C 27 21 2C DD D6 78 96 11 6A CB 3D 38 49>)
(   4,<2013-09-27 01:04:39.862 -0700>,<Administrator>,<X>,<proc1d>,<TOPSPIN 2.1>,
      <abs ABSG = 1 
       data hash MD5: 32K
       22 79 DB F4 2F 7C 37 8D B7 6D 56 49 F6 1F 14 0B>)
(   5,<2013-09-27 01:04:40.080 -0700>,<Administrator>,<X>,<proc1d>,<TOPSPIN 2.1>,
      <abs ABSG = 2 
       data hash MD5: 32K
       15 A1 1D E9 46 86 B7 C0 14 BA 1C 34 F6 62 F9 E5>)
(   6,<2013-09-27 01:04:40.158 -0700>,<Administrator>,<X>,<proc1d>,<TOPSPIN 2.1>,
      <abs ABSG = 3 
       data hash MD5: 32K
       E3 5F 8E 07 F0 E8 E6 B7 61 10 8F BF D3 62 ED 0C>)
(   7,<2013-09-27 01:04:40.252 -0700>,<Administrator>,<X>,<proc1d>,<TOPSPIN 2.1>,
      <abs ABSG = 4 
       data hash MD5: 32K
       83 51 5F BC 27 13 D9 8F 03 9A 0A A4 66 68 53 31>)
(   8,<2013-09-27 01:04:40.315 -0700>,<Administrator>,<X>,<proc1d>,<TOPSPIN 2.1>,
      <abs ABSG = 5 
       data hash MD5: 32K
       62 DD 14 AA 8F 18 D9 B5 08 58 70 ED 0E D7 06 A2>)
$$ ##END=
$$ 
$$ $$ hash MD5
$$ $$ 3F 68 08 94 14 87 FC 4C 5A 62 26 4A D1 61 07 EE
##$RELAX= 
##$RELAX= 
##$RELAX= 
##$RELAX= 
##$RELAX= 
##$RELAX= 
##$RELAX= 
$$ Bruker specific parameters
$$ --------------------------
##$DU= <E:\>
##$EXPNO= 20
##$NAME= <AC1581_2782_8202388_tz30C9GtBx>
##$PROCNO= 1
$$ [...]
##$TP= (0..7)
150 150 150 150 150 150 150 150
##$TP07= 0
##$TPNAME0= <>
##$TPNAME1= <>
##$TPNAME2= <>
##$TPNAME3= <>
##$TPNAME4= <>
##$TPNAME5= <>
##$TPNAME6= <>
##$TPNAME7= <>
##$TPOAL= (0..7)
0.5 0.5 0.5 0.5 0.5 0.5 0.5 0.5
##$TPOFFS= (0..7)
0 0 0 0 0 0 0 0
##$TUNHIN= 0
##$TUNHOUT= 0
##$TUNXOUT= 0
##$USERA1= <user>
##$USERA2= <user>
##$USERA3= <user>
##$USERA4= <user>
##$USERA5= <user>
##$V9= 5
##$VALIST= <valist>
##$VCLIST= <CCCCCCCCCCCCCCC>
##$VD= 0
##$VDLIST= <DDDDDDDDDDDDDDD>
##$VPLIST= <PPPPPPPPPPPPPPP>
##$VTLIST= <TTTTTTTTTTTTTTT>
##$WBST= 1024
##$WBSW= 4
##$XGAIN= (0..3)
0 0 0 0
##$XL= 0
##$YL= 0
##$YMAX_a= 624199
##$YMIN_a= -529339
##$ZGOPTNS= <>
##$ZL1= 120
##$ZL2= 120
##$ZL3= 120
##$ZL4= 120
##$ABSF1= 14.98509
##$ABSF2= -5.573092
##$ABSG= 5
##$ABSL= 3
##$ALPHA= 0
##$AQORDER= 0
##$ASSFAC= 0
##$ASSFACI= 0
##$ASSFACX= 0
##$ASSWID= 0
##$AUNMP= <proc_prof1d_extract_pilot.lims>
##$AXLEFT= 0
##$AXNAME= <>
##$AXNUC= <1H>
##$AXRIGHT= 0
##$AXTYPE= 0
##$AXUNIT= <>
##$AZFE= 0.1
##$AZFW= 0.1
##$BCFW= 0
##$BC_mod= 0
##$BYTORDP= 0
##$COROFFS= 0
##$CY= 15
##$DATMOD= 1
##$DC= 0
##$DFILT= <>
##$DTYPP= 0
##$F1P= 0
##$F2P= 0
##$FCOR= 0.5
##$FTSIZE= 32768
##$FT_mod= 6
##$GAMMA= 0
##$GB= 0
##$INTBC= 1
##$INTSCL= 1
##$ISEN= 128
##$LB= 0
##$LEV0= 0
##$LPBIN= 0
##$MAXI= 10000
##$MC2= 0
##$MEAN= 0
##$ME_mod= 0
##$MI= 0
##$NCOEF= 0
##$NC_proc= -8
##$NLEV= 6
##$NOISF1= 0
##$NOISF2= 0
##$NSP= 0
##$NTH_PI= 0
##$NZP= 0
##$OFFSET= 14.98509
##$PC= 1
##$PHC0= 93.93311
##$PHC1= 0
##$PH_mod= 1
##$PKNL= yes
##$PPARMOD= 0
##$PPDIAG= 0
##$PPIPTYP= 0
##$PPMPNUM= 2147483647
##$PPRESOL= 1
##$PSCAL= 4
##$PSIGN= 0
##$PYNMP= <proc.py>
##$REVERSE= no
##$SF= 400.02
##$SI= 32768
##$SIGF1= 0
##$SIGF2= 0
##$SINO= 400
##$SIOLD= 32768
##$SPECTYP= <>
##$SREGLST= <1H.CDCl3>
##$SSB= 0
##$STSI= 32768
##$STSR= 0
##$SW_p= 8223.68421052631
##$SYMM= 0
##$S_DEV= 0
##$TDeff= 65536
##$TDoff= 0
##$TI= <>
##$TILT= no
##$TM1= 0
##$TM2= 0
##$TOPLEV= 0
##$USERP1= <user>
##$USERP2= <user>
##$USERP3= <user>
##$USERP4= <user>
##$USERP5= <user>
##$WDW= 1
##$XDIM= 32768
##$YMAX_p= 441905367
##$YMIN_p= -761649
##$CURPLOT= <Network HP LaserJet P1505>
##$CURPRIN= <$Network HP LaserJet P1505>
##$DFORMAT= <normdp>
##$LAYOUT= <+/1D_H.xwp>
##$LFORMAT= <normlp>
##$PFORMAT= <normpl>
##$SURQMSG= 1
$$ End of Bruker specific parameters
$$ ---------------------------------
##NTUPLES= NMR SPECTRUM
##VAR_NAME=  FREQUENCY,     SPECTRUM/REAL,   SPECTRUM/IMAG
##SYMBOL=    X,             R,               I
##VAR_TYPE=  INDEPENDENT,   DEPENDENT,       DEPENDENT
##VAR_FORM=  AFFN,          ASDF,            ASDF
##VAR_DIM=   32768,         32768,           32768
##UNITS=     HZ,            ARBITRARY UNITS, ARBITRARY UNITS
##FACTOR=    0.250966925370066, 1,           1
##FIRST=     8223.43324360094, 2897,         -24511
##LAST=      0,             -145498,         -34555
##MIN=       0,             -761649,         0
##MAX=       8223.43324360094, 441905367,    0
$$ Real data points
##PAGE= N=1
##DATA TABLE= (X++(R..R)), XYDATA
$$ [...]
$$ plain form
19531 -52529 -50584 -53936 -61060 -130894 -109440 278711 -264295 -445772 28407 -210231 -466225
19520 -466225 284665 -138772 -212601 46124 9108 -25146 69485 -85687 55827 50070 -2519 -55949
19508 -55949 177647 -338034 -207997 -134976 168886 -231648 -32665 -286474 -148019 -170751
19498 -170751 99829 52607 -469133 72730 -246289 -254449 -6426 -141862 309968 -417144 -98791
19486 -330198 90590 7298 -105816 -136891 -139425 -51417 -86323 73465 329435 -558218 -167768
19474 28956 55583 -311050 -110403 -87290 -173936 -108049 202389 -64226 37359 -60570 -204447
19463 -204447 56499 -62141 -94639 -328251 -11441 -164705 174123 -231393 -10079 29725 30991
19452 30991 -169279 39706 -77462 -166128 40919 -49152 -9094 -178366 30356 108174 43443
$$ packed form
19531e2529J945l352p124o9834K1454B78711b64295j81477B8407b10231k55994
19520d66225B84665a38772p3829D6124I108b5146F9485h5687E5827n757b519n3430
19508e5949A77647c38034J30037P3021A68886b31648c2665k53809J38455k2732
19498a70751I9829m7222d69133G2730b46289q160f426j35436C09968d17144i8791
19486c30198I0590G298a05816l1075k534e1417l4906G3465K55970e58218a67768
19474B8956K6627c11050a10403K3113q6646O5887B02389f4226C7359f0570j43877
19463b04447E6499f2141l2498k33612a1441j53264A74123b31393a0079B9725J266
19452C0991a69279C9706g7462q8666D0919d9152i094j69272C0356P7818D3443
$$ plain form
19440 -14282 372225 -27933 -228509 76991 -54965 226588 -6698 -249284 537324 -222649 88274
19428 -260065 214670 -178003 -55334 -99893 -59116 83887 60985 -142404 -206417 -102611 57012
19416 119611 13472 -328925 -259618 132267 -129746 -162515 -19314 45402 -159868 -104445 -95625
19405 -95625 -134775 -195272 278368 37069 -25836 62557 -142676 -152546 228873 -17299 33365
19393 -316647 65593 11280 -187717 -3851 -266951 -87052 -107365 172505 185661 -68096 -197087
19382 -197087 -162590 -392048 -383460 121883 -283371 157101 65256 111781 73153 -152143 -144401
19371 -144401 -5114 -193276 108452 41058 -779 -107083 -98375 -115923 -252156 197406 -229297
19359 15075 152528 129535 -266092 178563 -41329 183729 28151 150223 98183 72279 -4516
$$ packed form
19440a4282C72225b7933k00576G6991e4965B26588f698k42586E37324b22649H8274
19428b60065B14670a78003e5334m4559M0777H3887k2902a42404o4013a02611E7012
19416A19611A3472c28925O9307A32267a29746l2769a9314D5402a59868N5423Q820
19405i5625l9150o0497B78368C7069b5836F2557a42676r870B28873a7299C3365
19393c16647F5593A1280a87717c851k63100h7052k0313A72505J3156f8096j28991
19382a97087L4497k29458Q588A21883b83371A57101F5256M6525l8628a52143P742
19371a44401e114j88162A08452D1058g79j06304Q708j7548j36233A97406b29297
19359A5075J37453k2993b66092A78563d1329A83729B8151J22072n2040k5904d516
$$ plain form
19347 -273541 -285988 -96737 -132958 -292204 -25020 127963 -258094 -309555 -137679 39133 -456438
19335 -89440 45718 -311474 -92885 -212885 191323 -75163 -414160 -9198 274679 -138584 22593
19323 168274 -142363 -160109 -354881 301695 -198399 -535971 -264740 39956 -186029 124352
19312 -24055 -327097 -53633 -201379 -34017 -293271 22539 -23433 44814 117521 -30866 6013
19300 -387942 211403 28992 -242161 -206527 -171914 26103 120583 41974 -204685 -158219 -107170
19289 -107170 -109458 44982 -158430 -48959 -147388 -99156 13377 160081 -144118 131916 -71401
19277 8894 -27479 -172097 -213330 -156272 221329 -377989 82559 16972 457105 44883 -341324
19265 -21643 -161091 424844 -156352 -235426 -1604 -38267 108300 -363659 -79277 10471 -55640
$$ packed form
19347b73541j2447i6737l6221j59246b5020A27963b58094n1461a37679C9133d56438
19335h9440D5718c11474i2885j20000A91323g5163l38997i198B74679a38584B2593
19323A68274a42363j7746j94772C01695a98399l37572b64740C9956a86029A24352
19312b4055l03042e3633j47746c4017k59254B2539b3433D4814P2707c0866F013
19300c87942B11403B8992b42161L5634L4613B6103R4480D1974b04685M6466N1049
19289a07170k288D4982a58430d8959r8429M8232A3377J46704a44118A31916g1401
19277H894b7479j44618m1233N7058B21329c77989H2559A6972M40133D4883c41324
19265b1643j39448D24844a56352p9074a604l6663A08300c63659g9277A0471e5640
$$ plain form
19253 -488828 92485 77512 -108707 78650 -83918 5677 -254085 -85054 -137584 125666 159659
19242 159659 114516 -153494 -56617 105868 37135 -149848 -159160 -381814 -29995 -13966 -308025
19231 -308025 -153968 274947 -151096 178529 232892 -318445 -20039 -77680 19779 38547
19221 38547 421264 -261545 -215147 -152388 49484 -129244 -289239 -18275 222769 -243410
19210 -139726 -200334 -53160 300928 101803 -156339 158901 -237471 -117659 73598 -63058
19199 -292229 -803 75858 243092 102597 119529 94355 -377415 -217037 -224480 -208265 -118145
19188 -118145 -108336 -52028 -109729 -50451 -186272 -111435 266382 -196492 -229154 -326160 88546
19176 -234773 -178179 -7205 -395735 358311 30411 -241488 -249694 209977 -409965 118491 25785
$$ packed form
19253d88828I2485j4973a08707G8650h3918E677b54085h5054n2530A25666L3993
19242A59659m5143a53494e6617A05868C7135a49848r312k22654b9995a3966k94059
19231c08025a53968B74947a51096A78529N4363c18445b0039n7641A9779J8768
19221C8547L82717b61545M6398O2759D9484a29244j59995a8275B22769b43410
19210a39726o0608e3160C00928A01803a56339A58901b37471a17659G3598f3058
19199b92229h03G5858J67234A02597J6932k5174c77415J60378p443J6215R0120
19188a18145R809e2028n7701e0451j35821P4837B66382a96492l2662r7006H8546
19176b34773N6594g205l88530C58311C0411b41488q206B09977d09965A18491B5785
$$ plain form
19164 -61890 -345046 175260 -201810 227854 -413731 -114862 82644 99195 237288 -393134
19153 -55245 -124998 156908 -90281 -89290 -83816 12809 -170489 -166286 61749 -156941 -217718 -172508
19141 -172508 -210464 -83984 -361105 -59094 38989 57482 186583 -212543 -14377 -133352 -57309
19129 107980 72840 305207 -95061 -466313 -165837 -501227 -189540 -202856 35289 -96123
19118 -206177 182209 -215883 184014 1567 85349 30044 230179 93708 66125 -314690 -192792
19107 -192792 263541 -119146 -141961 178896 -62688 -378240 96301 -7225 -34476 154147 27228
19095 -20391 -60170 -93556 -336894 -27623 -167021 -62940 -283816 171242 -285334 -63357 77654
19083 170715 12295 44731 -4135 162609 201143 -210736 -66039 154278 91950 251921 378034
$$ packed form
19164f1890k83156A75260b01810B27854d13731a14862H2644J6551J38093c93134
19153e5245o9753A56908i0281R91N474A2809a70489M203F1749a56941o0777M5210
19141a72508l7956h3984k77121e9094C8989J8493J29101b12543a4377j18975e7309
19129A07980l5140K32367i5061l71252a65837l35390a89540j3316C5289i6123
19118b06177A82209b15883A84014A567Q3782C0044K00135I3708k7583c14690J21898
19107a92792B63541a19146k2815A78896f2688l15552I6301g225k7251A54147B7228
19095b0391l9779l3386k43338b7623j39398f2940k20876A71242b85334f3357G7654
19083A70715A2295L2436d135A62609L8534b10736f6039A54278o2328J59971J26113
$$ plain form
19072 378034 228761 -134274 -24981 136913 61111 -165459 -83793 -185707 -310305 -143432
19061 193342 -58583 -300044 125997 11700 -115891 -325458 224588 -341367 238191 -63677
19050 -14445 -121842 -181629 -75557 145854 -147497 -356550 -111363 -114489 -83800 -2224 -194542
19039 -194542 -124648 70642 -37960 -165192 78213 -40459 -346921 152691 151357 381912 -5434
19027 -269379 318598 271009 334408 209661 -71210 60187 -84202 158311 -28005 -143482 228105
19015 -77764 32925 -101439 -89987 8312 43560 40483 69970 -27025 -241577 -25812 -92853 -270740
19003 -270740 -94736 -313826 188700 274351 -88132 -395745 -224763 117926 -190515 -108285
18993 -108285 -289647 -181356 -101339 69737 -106193 -159118 -87949 -12511 -177500 -205075 -51959
$$ packed form
19072C78034j49273a34274b4981A36913F1111a65459Q1666j01914j24598a43432
19061A93342e8583k41461A25997A1700a15891k09567B24588c41367B38191f3677
19050a4445j07397n9787g5557A45854a47497k09053a11363l126L0689b224j92318
19039a94542O9894G0642c7960j27232G8213d0459l06462A52691j334K30555e434
19027b69379C18598m7589O3399j24747g1210F0187h4202A58311b8005j15477B28105
19015g7764C2925a01439J1452H312L5248l077K9487b7025k14552b5812o7041j77887
19003b70740i4736k19090A88700Q5651h8132l07613J70982A17926a90515Q2230
18993a08285j81362J08291Q0017F9737a06193n2925P1169a2511j64989k7575e1959
$$ plain form
18981 -70004 27823 -155318 -190031 -34689 109162 -83603 -42398 88538 -211902 -195643 58803
18969 -527032 70818 196123 440543 143207 -310407 -199213 145254 -370889 62621 -66243
18958 335477 48508 -292534 -78680 63380 89181 -176281 -50113 41405 -330663 141366 152662
18947 152662 -58780 7661 -38774 -69947 226958 -34186 -191163 -336442 -105500 -50769 258758
18935 19875 15116 157466 -95940 -23871 -140942 -24989 -277044 -40452 -158779 73087 -45243
18923 34093 -30476 -112930 13742 -245130 -212729 -5686 -69771 24211 -267985 -77202 23857
18911 -542314 -335493 -157543 -86833 352522 -151757 -108301 72832 144854 -232366 83811
18900 -9427 -54458 -88191 -129394 -11685 304738 217488 -316673 -21237 -75733 -308656 -224152
$$ packed form
18981g0004B7823a55318l4713c4689A09162h3603M1205H8538b11902J6259E8803
18969e27032G0818J25305K44420A43207c10407J11194A45254c70889F2621f6243
18958C35477D8508b92534g8680F3380K5801a76281e0113D1405c30663A41366J1296
18947A52662e8780G661c8774l1173B26958c4186j56977j45279a05500e0769B58758
18935A9875m759J42350i5940b3871j17071b4989k52055d0452j18327G3087d5243
18923C4093c0476q2454A3742b45130L2401e686o4085B4211b67985g7202B3857
18911e42314K06821a57543P0710C52522a51757M3456G2832P2022b32366H3811
18900i427m5031l3733m1203a1685C04738q7250c16673b1237n4496k32923Q4504
$$ plain form
18889 -224152 71146 -8752 -51801 -318794 -286259 -77612 -3099 -446799 -65383 226135 -109632
18877 -52500 33635 -90013 306674 -339161 -67184 137584 -299922 -103228 -171288 235829
18866 -129885 432713 -203217 -11281 -363730 -86028 -198586 -45056 -55977 110781 -1838 3746
18854 273712 -386619 144515 -15870 -42697 287705 87965 -44188 80428 165617 61766 48529
18843 48529 -7934 21158 -173125 109865 294162 -32670 -7900 -182113 44437 -68144 -216824
18832 -216824 -256405 -43614 -94132 -356854 17596 78006 -229609 -460058 -67350 4486 -277331
18820 -18926 -112846 67000 100081 -153375 43605 24820 88785 -155238 -148827 -164297 426513
18808 -32992 -156165 45241 35491 -41211 -56055 -67990 -461976 -59945 6750 -225378 -13200
$$ packed form
18889b24152G1146h752m3049k66993L2535g7612c099m43700f5383B26135a09632
18877e2500C3635i0013C06674c39161f7184A37584b99922a03228o8060B35829
18866a29885D32713b03217a1281l52449h6028j12558d5056j0921A10781a838C746
18854B73712c86619A44515a5870k6827B87705H7965d4188H0428Q5189F1766j3237
18843D8529g934B1158a73125A09865J84297c2670g900j74213D4437f8144j48680
18832b16824l9581d3614n0518k62722A7596O0410b29609k30449f7350D486b77331
18820a8926r3920F7000L3081a53375D3605j8785O3965a55238O411j5470D26513
18808c2992j23173D5241r750d1211j4844j1935l93986e9945F750b25378a3200
$$ plain form
18796 -15124 -120697 -18915 50152 -313332 6361 -155883 61550 161689 324160 -24831 -63603
18785 -63603 -73883 -179053 45695 -374927 15640 68744 273585 63924 -30008 7683 167363
18774 167363 6509 10952 74109 215835 -270021 -213766 -117661 -485747 -102699 155737 10900
18762 -60456 243545 -42807 33981 -241232 -58782 -178615 39002 -169575 -133341 299688 46591
18750 184446 -68628 -8253 -109403 167587 169403 -25493 133565 -143183 -92176 72183 1570
18738 -97023 -210544 -210889 236724 -68544 -4192 168770 -249618 133884 89967 -183929 211615
18726 -209115 -357705 103327 -37584 9437 133920 40565 -50197 195515 176369 -242023 80795
18714 29677 -2457 -195741 92376 197597 30154 -488381 19996 199135 256106 -376722 89797
$$ packed form
18796a5124j05573a8915E0152c13332F361a55883F1550J00139J62471b4831l8772
18785f3603j0280j05170D5695c74927A5640N3104K04841F3924c0008G683J59680
18774A67363F509M443O3157J41726b70021N6255R6105l68086a02699A55737A0900
18762f0456B43545d2807C3981b41232e8782j19833C9002a69575L6234B99688D6591
18750A84446f8628h253j01150A67587J816b5493A33565a43183N1007G2183A570
18738i7023j13521l45B36724f8544d192A68770b49618A33884m3917a83929B11615
18726b09115j48590A03327c7584I437J24483D0565e0197A95515j9146b42023H0795
18714B9677b457j93284I2376J05221C0154d88381A9996J79139N6971c76722H9797
$$ plain form
18702 -460954 -226440 -6920 -182846 -217597 -150235 293370 407761 -57289 -121272 168883 31453
18690 185116 -192892 18891 26761 62046 -213042 -207910 -482318 47086 -128017 -23896 -316243
18679 -316243 79492 -183400 -228846 -147633 35465 127761 21815 -171884 245072 144598 -281151
18667 -13656 -92604 -19913 -166683 -60980 104301 -34376 -313097 -31691 35728 49881 -297778
18655 470387 -56939 -129996 -329367 -212698 225587 113912 205323 2411 55004 -131867 -48739
18643 245846 126822 -475670 -5988 23938 -246277 -246364 -117613 162995 -50158 -3284 -123784
18632 -123784 84695 -388192 -52420 -440548 115122 112971 -117907 208431 206160 -184892 47737
18620 -35093 153044 76034 -115902 -49681 113808 -79878 -30295 4538 -231220 -174274 -19763
$$ packed form
18702d60954b26440f920j75926l4751O7362B93370J14391e7289o3983A68883C1453
18690A85116a92892A8891P870L5285b13042N132k74408D7086a28017b3896k92347
18679c16243G9492a83400m5446Q1213C5465R2296B1815a71884B45072j00474b81151
18667a3656p8948a9913j46770f0980A04301c4376k78721c1691C5728J4153b97778
18655D70387e6939p3057j99371J16669B25587j11675R1411B411N2593a31867d8739
18643B45846j19024d75670e988B3938b46277q7a17613A62995e0158c284j20500
18632a23784H4695c88192e2420l88128A15122k151a17907B08431k271a84892D7737
18620c5093A53044G6034a15902d9681A13808g9878c0295D538b31220N6946a9763
$$ plain form
18608 -27897 -276672 -165751 112660 -29058 -4779 -23004 -6879 -22834 -168957 -96272 68485
18596 -324669 -43477 -364791 -176912 80730 -347988 -115592 36813 180509 -54591 -11930
18585 27794 59018 -159853 39383 69436 -328821 -42823 52143 58591 29672 -214619 -47069
18573 -351188 83622 267536 -106416 -110740 -207710 -139578 -154000 -126056 -130075 61307 287811
18562 287811 118992 224034 183472 -464091 -235550 32302 -35111 10659 -21273 -143952
18552 -143952 44385 -659258 -123693 81912 -79649 -160907 -221132 287798 -189326 -66941 333613
18540 -61846 -222379 89682 303779 -258764 -43503 -265 -4359 -87236 -212129 101879 -262373
18528 -227805 -15661 -350064 42165 326833 -270943 154276 187455 104867 -253023 94282
$$ packed form
18608b7897k48775J10921A12660b9058d779j8225f879j5955j46123P2685F8485
18596c24669d3477l21314a76912H0730c47988a15592C6813J43696e4591a1930
18585B7794L1224a59853C9383L0053c28821d2823E2143O448k8919b14619d7069
18573c51188H3622J83914a06416m324r6970O8132j4422K7944m019F1307K26504
18562B87811A18992J05042m0562d64091K28541C2302c5111A0659b1273j22679
18552a43952D4385f59258a23693H1912g9649q1258o0225B87798a89326f6941C33613
18540f1846j60533H9682K14097b58764d3503b65m094q2877j24893A01879b62373
18528b27805a5661l34403D2165K84668b70943A54276L3179q2588b53023I4282
$$ plain form
18517 -30239 -87825 -497581 -19895 5257 812 198586 108470 -223661 -239574 7421 -38886 -221493
18505 -221493 -1123 -245735 82254 -78917 -108626 3264 -386901 -113418 -135898 -332365 224999
18493 184990 -50478 -36495 -96778 -121253 -66480 -195873 110507 -182141 -18053 -83801 154649
18481 -172560 -6800 -186074 -19228 3496 -147972 -146638 -177573 103037 1314 -139744 108107
18469 74875 133009 272486 285148 -459929 -270753 299680 -49618 -134948 77435 -95745 -131293
18458 -131293 -154467 -183427 12096 24629 -21501 -269322 292195 -176396 10757 -202458 -344258
18447 -344258 -75981 112144 -54960 55458 27419 -258649 49484 11376 -166259 -12519 114009
18435 24146 102379 90307 -12408 -305479 479614 -107135 54405 64846 -391144 -123558 37886
$$ packed form
18517c0239n7586m09756a9895E257H12J97774r0116b23661j5913G421c8886j82607
18505b21493a123k44612H2254g8917k9709C264c86901a13418k2480j96467B24999
18493A84990e0478J3983o0283k4475N4773j29393A10507a82141a8053o5748A54649
18481a72560f800j79274a9228C496a47972J334l0935A03037A314a39744A08107
18469G4875N8134J39477J2662d59929J89176B99680d9618q5330G7435i5745l5548
18458a31293k3174k8960A2096J2533b1501k47821B92195a76396A0757b02458j41800
18447c44258g5981A12144e4960E5458B7419b58649D9484A1376a66259a2519A14009
18435B4146P8233j2072a2408k93071D79614a07135E4405J0441c91144a23558C7886
$$ plain form
18423 383224 -80380 186280 -114957 373588 171477 275531 90072 -357161 115812 59394
18413 59394 132214 -475266 64324 52521 -367631 -155419 17495 102499 -263247 395069 -120976
18401 137863 -75427 380045 160198 -105473 -42445 -148700 -329121 13536 21549 -218219
18390 20898 -55791 -249398 -188540 68826 -77258 83977 -195129 26796 -80211 135063 88636
18379 88636 -215283 -74907 -86654 192126 -137968 -208720 22150 17034 -223434 86823 245680
18368 245680 -19860 56342 -170248 90378 124067 -113554 -127786 102083 -184232 107533
18357 -187284 -226401 115590 -28396 60440 179393 -89602 83953 98181 254963 -55941 -341224
18346 -341224 -133575 85640 -379040 -117465 104149 4048 -364508 -157611 -146175 -112852
$$ packed form
18423C83224h0380A86280a14957C73588A71477J04054I0072c57161A15812n6418
18413E9394P2820d75266F4324j1803c67631a55419A7495Q5004b63247C95069a20976
18401A37863g5427C80045A60198a05473d2445j06255j80421A3536Q013b18219
18390B0898e5791j93607O0858F8826g7258H3977a95129B6796h0211A35063m6427
18379H8636b15283g4907j1747A92126a37968p0752B2150n116b23434H6823J58857
18368B45680a9860E6342a70248I0378L3689a13554j4232A02083a84232A07533
18357a87284l9117A15590b8396F0440J18953h9602H3953J4228J56782e5941k85283
18346c41224a33575H5640c79040a17465A04149D048c64508a57611J1436L3323
$$ plain form
18336 -112852 115580 270162 -443140 -132017 155392 -209376 -367176 -104453 36431 -136397
18325 -35412 17040 -104110 6724 -141940 14772 -48634 37876 -181545 -387448 -108399 84315
18313 -3008 -50667 43878 -165472 -259934 2016 -175335 143315 -51446 109245 -181144 35793
18301 16012 -238541 109905 3735 78365 -27279 -167268 -175581 210997 -209006 -215535 -215091 -218006
18289 -218006 125751 -188647 381950 259382 -269570 -13238 248962 107587 -84514 34158
18278 -154154 -167678 -156261 -104071 -290799 209767 -249047 -151326 -28763 -238180 3689 -113657
18266 -64705 254905 -82667 -109605 357701 78165 -410261 158263 190680 -185914 -254640 -6606
18254 172822 -24756 103923 -255537 -99436 215822 -50526 -134421 -472253 -236162 305340
$$ packed form
18336a12852A15580J54582d43140a32017A55392b09376j57800a04453C6431a36397
18325c5412A7040a04110F724a41940A4772d8634C7876a81545k05903a08399H4315
18313c008m7659D3878a65472r4462B016a75335A43315e1446A09245a81144C5793
18301A6012b38541A09905C735P4630b7279j39989q313B10997b09006o529M44k915
18289b18006A25751a88647C81950j22568b69570a3238B48962A07587h4514C4158
18278a54154j3524J1417N2190j86728B09767b49047R7721b8763k09417C689a13657
18266f4705B54905h2667k6938C57701G8165d10261A58263L2417a85914o8726f606
18254A72822b4756A03923b55537i9436B15822e0526q3895l37832K36091C05340
$$ plain form
18243 -114788 -392428 -188236 -228647 365302 -164650 147032 73912 39570 -241101 -139501
18233 -139501 -90898 -100350 124529 -90737 -165325 -116003 9099 104726 205864 -92149 -271546
18222 -271546 98464 151173 107309 87764 143523 -46540 -120167 -104387 -154277 -217735 -247467
18211 -247467 -309541 -14888 -135652 -192945 -38421 -84969 -391553 126091 -166506 101284
18200 -195206 -162652 93335 -95496 -216170 181913 -174000 -251609 -181198 -242451 -163193 -225822
18189 -225822 -68549 -107103 259290 -12422 14745 161373 46909 125313 107263 -136737 103745
18177 -158147 9442 -315510 -84186 -178303 -116954 -16645 -39193 -37111 -322589 160209 -170617
18165 45594 129590 229152 2110 170422 -183682 -185373 2338 67983 -88087 196665 39451 221311
$$ packed form
18243a14788k77640a88236m0411C65302a64650A47032p3120l4342b41101J01600
18233a39501M8603r452A24529i0737p4588M9322I099R5627J01138i2149j79397
18222b71546I8464N2709m3864j9545N5759d6540p3627J5780m9890o3458k9732
18211b47467o2074a4888j20764n7293c8421m6548l06584A26091a66506A01284
18200a95206L2554I3335i5496j20674A81913a74000p7609P0411o1253P9258o2629
18189b25822f8549l8554B59290a2422A4745J46628D6909P8404j8050a36737A03745
18177a58147I442c15510h4186r4117O1349a6645k2548K082k85478A60209a70617
18165D5594Q3996R9562B110J68312a83682j691B338O5645h8087A96665C9451J81860
$$ plain form
18153 221311 47249 43060 26152 116761 103204 -163834 117874 -79482 28616 -175522 -5750
18141 66088 38296 77137 110773 164588 -35534 299957 -228600 -3249 30561 64929 69301 -44398
18128 148245 71037 -221496 -157461 65659 -106631 -33260 -194213 -223846 -108603 107584
18117 133383 195323 -136615 62540 -264271 42323 -79934 -226663 -27986 -197380 -266138 124503
18105 497786 226508 -95365 -31263 -17985 145711 -3096 -172335 -88774 -48786 23092 -136504
18093 -246470 -66692 -305867 -32159 -78382 -386958 -38407 -220046 -34203 -8812 -88124 -18349
18081 -179764 -279672 213310 -101698 -303906 84717 -419614 311331 -167880 -191930 56261
18070 -303839 158399 -408661 173366 204702 -168807 167228 201912 -479452 66672 41155
$$ packed form
18153B21311D7249m189j6908R0609j3557a63834A17874g9482B8616a75522e750
18141F6088k7792L8841L3636N3815c5534B99957b28600c249C0561L4368M372d4398
18128A48245G1037b21496O4035F5659a06631c3260j60953k9633a08603A07584
18117A33383O1940a36615F2540b64271D2323g9934j46729b7986j69394o8758A24503
18105D97786B26508i5365c1263J3278A45711c096j69239Q3561L9988B3092a36504
18093b46470f6692k39175c2159m6223l08576c8407j81639c4203h812p9312a8349
18081a79764r9908B13310a01698k02208H4717d19614C11331a67880k4050E6261
18070c03839A58399d08661A73366L1336a68807A67228L4684d79452F6672k5517
$$ plain form
18060 41155 -70658 -336097 188571 134798 148248 20562 -110612 -314249 -178641 -48750 84947
18048 -152712 -75306 -166511 99564 122328 27114 50718 -93993 -1159 -76661 -217054 -154483
18037 -154483 -224184 -75258 204674 -232308 159131 -70064 -21335 -104484 -189643 -69557 -302283
18026 -302283 96308 -110938 -131137 109314 134776 92760 -414704 -72351 338136 -72996 -128175
18015 -128175 -33708 -29001 -23006 188606 -178793 -117462 177503 76257 -146569 5115 -135113
18003 100103 106954 -22263 41561 245097 53323 88953 -382981 -69296 -191405 -121497 -152708
17992 -152708 16442 -70146 -274569 -141310 224464 43502 376726 -245365 370244 20900
17981 40345 -57658 -69065 321194 93275 144747 -177946 56150 143838 -424527 14875 -230695
$$ packed form
18060D1155g0658k65439A88571n3773J3450B0562a10612k03637J35608d8750H4947
18048a52712g5306r1205I9564K2764B7114K3604i3993a159p5502j40393O2571
18037a54483o9701g5258B04674b32308A59131g0064b1335q3149q5159f9557k32726
18026c02283I6308a10938k0199A09314K5462m2016d14704g2351C38136g2996n5179
18015a28175c3708M707N995A88606a78793O1331A77503G6257a46569E115a35113
18003A00103O851b2263D1561K03536E3323L5630c82981f9296j22109O9908l1211
17992a52708A6442g0146k04423J33259B24464D3502L33224b45365C70244B0900
17981D0345e7658j1407C21194I3275N1472a77946E6150Q7688d24527A4875b30695
$$ plain form
17969 134197 84030 -208343 -129589 -161994 212851 -97910 -346637 99746 401356 97583 -380013
17957 25600 49522 51225 -245153 -31863 118941 342145 -24138 25236 141561 235440 200336
17946 200336 43425 -244910 -122175 301234 -199662 -144941 -70887 -67433 -250948 6712 -159533
17934 -173957 171602 -190151 -104592 3367 -205001 -311522 -15034 108079 135415 -269282
17923 23791 -152773 -76365 -311717 -108631 92077 318934 -263627 -163821 73682 -26863 -11805
17911 60739 -162444 -58466 -101214 54798 113656 -206903 421589 -336605 27815 115298 -84882
17899 297135 -395203 132553 -234827 -3268 -37047 61128 -17276 9444 92881 -123669 -231360
17888 -231360 -21149 335500 39483 -237922 -303380 -107320 153255 98096 10394 -238587
$$ packed form
17969A34197n0167b08343P8754l2405B12851i7910k48727I9746L01610I7583c80013
17957B5600K3922J703b45153c1863A18941K23204b4138B5236J16325R3879l5104
17946B00336D3425b44910a22175C01234a99662N4721g0887L454j83515F712a59533
17934a73957A71602a90151Q5559C367b05001j06521a5034A08079K7336b69282
17923B3791a52773g6365k35352a08631I2077K26857b63627R9806G3682b6863a1805
17911F0739a62444e8466m2748E4798N8858b06903D21589c36605B7815Q7483h4882
17899B97135c95203A32553b34827c268l3779F1128a7276I444Q3437a23669j07691
17888b31360b1149C35500C9483b37922o5458a07320A53255n5159A0394b38587
$$ plain form
17877 -162705 -74616 169113 247083 163067 122335 100988 -134679 184122 -156938 20708 86569
17866 86569 -119238 161244 -88806 273861 -93229 20746 -11653 -34372 205274 -102470 -226385
17855 -226385 213304 138934 10871 -91277 53001 -217130 150846 -109558 -47361 158822
17844 1362 -61994 -78005 -193499 -95158 27200 -258419 35337 77790 -394554 256756 287355
17833 287355 279824 -1641 94379 169257 158343 -102096 -67637 -139210 81664 247279 36632
17821 36902 190757 -8565 -41035 92254 -52713 232962 -570601 256930 209445 86689 77483
17810 77483 4021 -128884 -96887 202218 99498 -187637 -5296 -40280 202175 229140 43049
17798 7047 -77581 102789 -60423 -98861 61330 203496 34664 83094 -79230 137771 -51459
$$ packed form
17877a62705g4616A69113P7970q4016m0732k1347a34679A84122a56938B0708O5861
17866H6569a19238A61244h8806B73861i3229B0746a1653k2719B05274a02470j23915
17855b26385B13304p4370A0871i1277E3001b17130A50846a09558d7361A58822
17844A362f1994j6011j15494i5158B7200b58419C5337M2453c94554B56756L0599
17833B87355p531a641I4379P4878j0914a02096L4459p1573H1664J65615C6632
17821C6902J53855h565l2470I2254e2713B32962e70601B56930m7485H6689r206
17810G7483D021a28884L1997B02218I9498a87637e296l4984B02175K6965D3049
17798G047g7581A02789f0423l8438F1330J42166C4664M8430g9230A37771e1459
$$ plain form
17786 268918 -252093 -129229 -31320 -88794 431255 210120 -113161 -208157 123414 -222949
17775 -131153 -106814 -114938 5713 -92416 163767 115756 114113 -89308 -244243 63872 -41111 -262040
17763 -262040 -37792 203692 80142 245250 218528 -307552 242767 -243606 -74264 100563
17752 -308012 -154140 94196 15285 -223713 325420 -193583 -58493 2556 -211918 -12486 -145819
17741 -145819 -27408 74505 -126885 -119706 195728 128727 -3157 70344 -167718 -25379 -159909
17730 -159909 -30229 -231112 -210149 -218639 -120441 3692 359769 -138343 184649 -88839 248482
17718 -91792 -120999 -305860 36280 -88296 -144228 -16764 126724 192747 -56268 305569 11741
17706 144914 -159586 105028 281227 -254784 -35315 -56307 -125454 -152647 7495 -2832 -4155
$$ packed form
17786B68918b52093J22864c1320n7474D31255B10120a13161r4996A23414b22949
17775a31153K4339q124E713i2416A63767m8011j643h9308j54935F3872d1111k20929
17763b62040c7792B03692H0142J65108k6722c07552B42767b43606g4264A00563
17752c08012J53872I4196A5285b23713C25420a93583e8493B556b11918a2486j33333
17741a45819b7408G4505a26885P179A95728o7001c157G0344a67718b5379j34530
17730a59909c0229k00883K0963q490R8198C692L56077a38343A84649h8839B48482
17718i1792k9207j84861C6280h8296n5932a6764A26724O6023e6268C05569A1741
17706A44914a59586A05028J76199b54784c5315k0992o9147k7193G495b832j323
$$ plain form
17695 -4155 57847 29092 -100110 -97755 126623 -3648 -192761 31098 249581 -199591 352522
17683 -258361 -20614 35219 -259448 -84046 -257771 163496 -13393 18109 -113769 141846
17672 -104317 214709 439601 9745 -97325 -74806 139440 -356073 21135 80583 108954 -279556
17660 -231738 60872 44627 72225 40141 108141 -187403 14848 53049 -43788 -146187 43032
17648 18013 137382 -180624 -196871 390945 233929 162277 7572 -32205 -132668 -75543 227897
17636 184682 52973 34661 -27149 10038 318137 25770 240423 -71614 -56029 305425 -13776
17624 3104 54626 74386 353575 -107753 -29512 -119006 201365 93519 383859 -115628 -319141
17613 -319141 -136881 -47492 -37484 1430 -69494 88266 -109899 60402 229422 -72820 419549
$$ packed form
17695d155E7847k8755a00110K355A26623c648j89113C1098K18483a99591C52522
17683b58361b0614C5219b59448h4046j73725A63496a3393A8109a13769A41846
17672a04317B14709K24892I745i7325K2519A39440c56073B1135N9448K8371b79556
17660b31738F0872j6245K7598l2084O8000a87403A4848L8201d3788j02399D3032
17648A8013J19369a80624j6247C90945j57016p1652G572c2205j00463N7125B27897
17636A84682E2973j8312b7149A0038L08099B5770K14653g1614J5585C05425a3776
17624C104N1522J9760K79189a07753b9512q9494B01365I3519K90340a15628k03513
17613c19141a36881d7492J0008A430f9494H8266a09899F0402J69020g2820D19549
$$ plain form
17601 237705 397470 298641 -36929 -17523 -355445 447923 -99915 315429 -132421 -53627
17590 -107686 116118 173073 267784 471361 70571 -125972 81526 202584 -66718 -101505 79882
17578 61916 537603 77515 -36204 333782 -230296 -204036 -200024 579261 330362 -291119 31247
17566 1573 326861 64855 -68568 35629 173313 218338 59338 16820 -218485 7899 9230 140246
17554 140246 191139 279756 -84456 283139 33935 271837 13815 42000 21194 -237248 193569
17542 -102514 216492 272255 65641 72837 110612 -61417 54817 167570 17810 317974 -145574
17530 -247415 127414 197709 -76987 -56148 392263 178273 -30931 326237 61809 -20982 -19579
17519 -19579 176107 -147526 -246293 -39917 -117947 13762 73611 -124169 -168045 56287 341397
$$ packed form
17601B37705J59765r8829c6929a7523l37922D47923i9915C15429a32421e3627
17590a07686A16118N6955R4711K03577G0571a25972H1526J21058f6718l4787G9882
17578F1916M75687G7515c6204C33782b30296K6260M012E79261k48899b91119C1247
17566A573L25288F4855f8568C5629J37684M5025E9338A6820b18485G899J331J31016
17554A40246N0893Q8617h4456B83139C3935K37902A3815K8185k0806b37248A93569
17542a02514B16492N5763F5641P196L7775f1417E4817J12753A7810L00164a45574
17530b47415A27414P0295g6987K0839C92263A78273c0931C26237F1809b0982J403
17519a9579A76107a47526r8767c9917p8030A3762N9849a24169m3876E6287K85110
$$ plain form
17508 341397 70485 113039 204865 102479 -87591 96266 329796 -11580 -92308 104887 26921
17496 389322 156253 228844 15432 386086 80626 35014 -235761 -23226 260749 -9254 314713
17484 251075 201547 150628 381981 151290 -22431 111030 157443 -281847 154816 439600
17474 439600 414206 156716 306689 268153 115730 260525 133057 65506 293230 202508
17464 202508 76036 -100959 426873 -80004 -164230 312751 326823 -255539 168081 368733
17454 368733 -56225 127338 128899 126069 407345 275788 626778 125869 -132343 -250528
17444 -250528 152968 457696 188118 -75027 184108 271214 86599 61484 11818 182230
17434 182230 285092 460527 253909 216890 367189 435309 303331 125489 106600 189667
$$ packed form
17508C41397G0485M2554R1826j02386h7591I6266K33530a1580q0728A04887B6921
17496C89322A56253P2591A5432L70654H0626C5014b35761b3226B60749i254C14713
17484B51075m9528n0919K31353A51290b2431A11030M6413b81847A54816K84784
17474D39600k5394A56716J49973l8536A15730J44795j27468F5506K27724r0722
17464B02508G6036a00959D26873h0004q4226C12751J4072b55539A68081K00652
17454C68733e6225A27338J561k830K81276j31557L50990A25869a32343j18185
17444b50528A52968L04728A88118g5027A84108Q7106H6599k5115A1818J70412
17434A82230J02862J75435k06618l7019J50299O8120j31978A25489j8889Q3067
$$ plain form
17424 189667 136937 268583 121696 -79026 366881 300769 61208 370054 126233 484125
17414 484125 209304 118417 20449 283390 -21943 360480 331331 26535 103640 230205 -60330
17402 240423 -270835 28829 42945 -48434 -48107 341881 164559 590832 259980 -1655 56514
17390 379898 29204 12568 -148577 332225 1669 90951 -64093 210755 177935 35594 188022
17379 188022 227654 -39099 77428 159250 8749 15802 327214 -68713 37484 62475 255622
17368 255622 415618 96508 323982 -319378 147731 81493 -20466 13926 100780 81949 382718
17357 382718 150178 493811 178838 353594 89849 -87381 -178800 116649 -34982 -442129
17347 -442129 330693 90241 238772 84738 -143091 -100155 327751 58747 -184299 227507
$$ packed form
17424A89667n2730J31646A21696g9026C66881o6112F1208L08846A26233L57892
17414D84125B09304r0887B0449K62941b1943C60480k9149B6535P7105J26565f0330
17402B40423b70835B8829J4116d8434L27C41881A64559M26273B59980a655E6514
17390C79898B9204A2568a48577C32225A669Q9282f4093B10755l2820C5594J52428
17379A88022L9632c9099G7428Q1822H749P053L11412f8713C7484K4991J93147
17368B55622J59996I6508K27474c19378A47731o6238b0466A3926Q6854j8831L00769
17357C82718A50178L43633A78838J74756H9849h7381r1419A16649c4982m07147
17347d42129C30693I0241J48531H4738a43091M2936C27751E8747a84299B27507
$$ plain form
17336 173368 -35701 401607 -38154 328415 -69750 69316 347582 249793 28772 135105 147477
17325 147477 114242 131542 524725 479585 69862 12450 182224 323226 180423 249440 262524
17314 262524 155769 -61201 53402 -147389 230640 518569 143667 105800 -97748 -112708
17304 -112708 80153 -129190 239509 233567 160236 -18658 237621 187638 -114789 212727 384771
17293 384771 142612 597990 63942 369592 114069 169510 154578 380727 19421 146167
17283 146167 188907 -301658 453411 344718 326647 -303921 23171 583167 481823 -127475
17272 -87305 63539 234080 -8404 8264 338343 173584 291447 48805 -27726 -20769 203262
17260 144968 195902 -4654 188695 695066 209096 210565 -130613 106180 337883 328482 -48073
$$ packed form
17336A73368c5701D01607c8154C28415f9750F9316K78266r7789B8772J06333J2372
17325A47477l3235J7300L93183m5140F9862A2450J69774J41002j42803O9017J3084
17314B62524j06755f1201E3402a47389B30640K87929A43667l7867i7748j4960
17304a12708H0153a29190B39509n942p3331a8658B37621m9983a14789B12727J72044
17293C84771A42612M55378F3942L05650A14069N5441j4932K26149A9421J26746
17283A46167M2740c01658D53411j08693j8071c03921B3171N59996j01344a27475
17272h7305F3539J70541h404H264L30079j64759J17863D8805b7726O957B03262
17260A44968N0934d654A88695N06371B09096J469a30613A06180K31703r401d8073
$$ plain form
17248 322444 9086 451025 462377 41492 263929 100746 114476 326767 141508 445619
17238 445619 417469 135374 565118 327372 562061 -16222 492565 131698 247417 219247
17228 219247 16531 66197 119202 233805 511005 160327 216680 109563 273271 113290
17217 -29503 146438 63599 329469 47631 258373 120143 57303 179520 439299 41647
17206 527078 497992 103991 366877 449555 301692 -9949 207806 110009 317325 94972 -11971
17194 444306 411213 96351 -51539 105773 430223 219618 56985 236293 150570 391743
17184 391743 306330 43849 -13870 309945 321343 -27751 260029 120515 361943 409799 118837
17172 333680 15591 481113 461353 17346 495713 437284 358532 559787 351242 513063
$$ packed form
17248C22444I086M41939J1352D1492K22437A00746J3730K12291A41508L04111
17238D45619k8150A35374M29744k37746K34689a6222D92565A31698J15719k8170
17228B19247A6531M9666N3005J14603K77200A60327N6353j07117J63708A13290
17217b9503A46438F3599K65870D7631K10742A20143E7303J22217K59779D1647
17206E27078k9086A03991K62886Q2678j47863i949B07806r7797K07316I4972a1971
17194D44306l3093I6351e1539A05773L24450k10605E6985J79308q5723K41173
17184C91743q5413D3849a3870C09945J1398b7751B60029A20515K41428M7856A18837
17172C33680A5591M65522j9760A7346M78367n8429p8752K01255k08545J61821
$$ plain form
17162 513063 43544 585219 128275 68074 21176 444094 446709 405188 403490 402904 637090
17151 637090 108766 372734 177762 525672 203112 107169 464653 335200 255105 234198
17141 234198 276218 355760 183756 629570 98341 -269106 170065 59864 313620 226986
17131 226986 140476 315556 398927 574496 434879 350753 323488 70764 553548 101388
17120 -228092 61796 449772 -53381 186639 408127 312377 -18084 282473 550571 179897
17109 303540 595388 569200 286765 343291 257273 251123 535360 337346 229901 727793
17099 727793 552457 480561 548548 718363 346142 390434 374060 133012 225409 470115
17089 470115 483984 328622 323752 522856 276026 305431 181910 253627 640903 709759 810373
$$ packed form
17162E13063D3544N41675A28275o0201B1176M22918K615m1521j698n86K34186
17151F37090A08766K63968A77762L47910B03112r5943L57484j29453q0095k0907
17141B34198M2020P9542j72004M45814I8341b69106A70065E9864K53756q6634
17131B26986q6510J75080Q3371J75569j39617q4126k7265G0764M82784A01388
17120b28092F1796L87976e3381A86639K21488r5750a8084B82473K68098A79897
17109C03540K91848k6188k82435N6526q6018o150K84237j98014j07445M97892
17099G27793j75336p1896O7987J69815C46142M4292j6374A33012R2397K44706
17089D70115J3869j55362m870J99104k46830K9405j23521P1717L87276O8856J00614
$$ plain form
17078 810373 709335 597037 174351 499876 592375 260734 756808 454129 465102 686631
17068 686631 576992 481320 591931 787786 569960 789101 728043 711937 552318 422182
17058 422182 587829 315297 420711 466029 578671 434397 648569 684954 670989 483823
17048 483823 340802 884278 818766 810656 782816 701215 315437 599528 485881 793226
17038 793226 568483 750543 396863 830568 620799 728296 494511 910502 947176 840782
17028 840782 722789 376558 670804 724038 660970 877087 550012 630140 639478 739139 560984
17017 560984 720228 773598 821620 783260 550261 843293 1094051 681269 813255 650968
17007 650968 806695 879457 565958 825306 714256 935013 1001124 727257 726729 970551
$$ packed form
17078H10373j01038j12298A74351L25525R2499B60734M96074l02679J0973K21529
17068F86631j09639r5672J10611J95855k17826K19141o1058j6106j59619j30136
17058D22182J65647k72532J05414M5318J12642j44274K14172L6385j3965j87166
17048D83823j43021N43476o5512q110k7840q1601C15437K84091j13647L07345
17038G93226k24743J82060l53680M33705k09769J07497k33785M15991L6674j06394
17028H40782j17993l46231K94246N3234o3068K16117l27075Q0128R338R9661j78155
17017E60984J59244N3370M8022l8360k32999K93032K50758m12782J31986j62287
17007F50968J55727P2762l13499K59348j11050K20757O6111k73867n28K43822
$$ plain form
16997 970551 929849 367622 662392 427400 814489 829046 606887 883178 479256 1014695
16987 1014695 797941 729054 700617 1048329 963076 817426 678716 1117625 841295 898155
16977 898155 569710 818310 925035 661725 1135518 967098 886098 1196571 980842 855670
16967 855670 1042740 1045915 918028 1073192 1015874 1158781 1473034 1114193 1142823 1081245
16957 1081245 1089876 989325 1313180 1232779 1228215 982842 1147495 1336970 1092911 915546
16947 915546 1123837 1214278 852554 1013418 1091832 1295634 1330664 1167208 1330424 1304582
16937 1304582 1528498 1170508 843254 1208982 1171630 1439452 1363959 1228560 1178597 1418349
16927 1418349 1211169 1133429 1289460 1494314 1257027 1347719 1506809 1574349 1677773 1700453
$$ packed form
16997I70551m0702C67622K94770k34992L87089J4557k22159K76291m03922N35439
16987A014695k16754o8887k8437L47712q5253j45650j38710M38909k76330N6860
16977H98155l28445K48600J06725k63310M73793j68420q1000L10473k15729j25172
16967H55670J87070L175j27887J55164n7318J42907L14253l58841K8630o1578
16957A081245Q631j00551L23855q0401m564k45373J64653J89475k44059j77365
16947I15546K08291R0441l61724J60864P8414K03802L5030j63456J63216k5842
16937A304582K23916l57990l27254L65728l7352K67822p5493j35399m9963K39752
16927A418349k07180p7740J56031K04854k37287R0692J59090O7540J03424K2680
$$ plain form
16917 1700453 1711705 1562286 1516168 1529605 1401633 1964243 1752283 1802708 1399180 1568461
16907 1568461 1764710 1161191 1675689 1802931 1704243 1725954 2112379 1810135 1544018 2040194
16897 2040194 1659141 1858501 1751591 2237751 1959487 2093142 1803905 1965785 1890585 2048938
16887 2048938 1840355 2299714 1996384 2133229 2127886 2127684 2651488 2489351 2394726 2220770
16877 2220770 2487629 2565011 2590776 2431446 2530365 2602911 2492460 2784475 2474262 2817538
16867 2817538 2659282 2566544 2671164 3054513 3114332 3027402 3015142 3145707 3352582 3270042
16857 3270042 3260935 3355535 3135957 3474535 2901558 3340667 3505601 3241495 3120617 3830521
16847 3830521 3642943 4007689 3898860 3757438 3801032 4161088 3537222 3998653 4362842 3974875
$$ packed form
16917A700453J1252j49419m6118J3437j27972N62610k11960N0425m03528J69281
16907A568461J96249o03519N14498J27242r8688K1711L86425l02244k66117M96176
16897B040194l81053J99360j06910M86160k78264J33655k89237J61880p5200J58353
16887B048938k08583M59359l03330J36845n343k02N23804j62137r4625j73956
16877B220770K66859P7382K5765j59330R8919P2546j10451K92015l10213L43276
16867B817538j58256r2738J04620L83349N9819q6930j2260J30565K06875q2540
16857C270042r107R4600k19578L38578n72977M39109J64934k64106j20878P09904
16847C830521j87578L64746j08829j41422M3594L60056o23866M61431L64189l87967
$$ plain form
16837 3974875 4082207 4262727 4214324 4497568 4677994 4994297 4662098 4643530 4868084 5172715
16827 5172715 4900758 5104780 5110892 5154672 5497314 5502026 5635064 5682791 6000417 6192399
16817 6192399 5990649 6399898 6206730 6466448 6343257 6651907 6714578 6997818 7230072 7422667
16807 7422667 7331963 7765150 8058669 8015274 8397858 8361968 8383548 8780171 8820670 9190847
16797 9190847 9436284 9663140 9687417 10142873 10105564 10475228 10818459 10889468 10835456 11588801
16787 11588801 12187939 12498305 12656625 12883239 13557587 13703526 14230261 14437995 15470206
16778 15470206 15566283 16218426 16626093 17103301 17766833 18401219 18954691 19367500 20439204
16769 20439204 20665092 21628071 22538443 23341317 24197500 25446297 26309335 27329940 28008625
$$ packed form
16837C974875J07332J80520m8403K83244J80426L16303l32199j8568K24554L04631
16827E172715k71957K04022O112M3780L42642M712J33038M7727L17626J91982
16817F192399k01750M09249j93168K59718j23191L08650O2671K83240K32254J92595
16807G422667r0704M33187K93519m3395L82584l5890K1580L96623M0499L70177
16797I190847K45437K26856K4277M55456l7309L69664L43231P1009n4012P53345
16787A1588801N99138L10366J58320K26614O74348J45939N26735K07734J032211
16778A5470206R6077O52143M07667M77208O63532O34386N53472M12809J071704
16769B0439204K25888R62979R10372Q02874Q56183J248797Q63038J020605O78685
$$ plain form
16760 28008625 29095773 30584478 31863964 33274476 34408298 36147552 37602237 39376455
16752 39376455 41450045 43422105 45381862 47382738 49525979 52290476 54793334 57672087
16744 57672087 60624037 64071654 67023292 70933407 74424745 78691846 82948691 87653432
16736 87653432 92305123 97517467 102757139 108003903 113675524 119918175 125262792 131221409
16728 131221409 137144513 142733110 148169356 153110849 157852928 162016515 165222897 167477570
16720 167477570 169344410 170600357 170461881 169507364 168018102 165409437 162165263 158419200
16712 158419200 153935622 148898286 143536256 137652778 132080756 126034540 120259110 114075046
16704 114075046 108885340 103204544 97473532 92387069 87476803 82660907 78551138 74561504
$$ packed form
16760B8008625J087148J488705J279486J410512J133822J739254J454685J774218
16752C9376455K073590J972060J959757K000876K143241K764497K502858K878753
16744E7672087K951950L447617K951638L910115L491338M267101M256845M704741
16736H7653432M651691N212344N239672N246764N671621O242651N344617N958617
16728A31221409N923104N588597N436246M941493M742079M163587L206382K254673
16720A67477570J866840J255947j38476r54517j489262k608665l244174l746063
16712A58419200m483578n037336n362030n883478n572022o046216n775430o184064
16704A14075046n189706n680796n731012n086463m910266m815896m109769l989634
$$ plain form
16696 74561504 70435672 66785306 63257290 60083989 56946829 54182168 51406516 48891439
16688 48891439 46706828 44428904 42184751 39976624 38331856 36372745 35095839 33423134
16680 33423134 31853707 30896662 29319560 28053013 27053615 25502651 24961436 24283708 23176251
16671 23176251 22436663 21487195 20925397 19726506 19164309 18457522 18180703 17121268 16807735
16662 16807735 16292564 15929391 15307124 14941244 14117044 13960232 13604479 13072385 12509486
16653 12509486 12370446 12105282 11643808 11279904 11065280 10618922 10470112 10157095 9788271
16644 9788271 9880414 9446787 9138600 8758080 8450416 8209191 8199759 8245960 7900627 7784385
16634 7784385 7741401 7615184 7141876 6935565 6665977 6973573 6383143 6499795 6336990 6164879
$$ packed form
16696G4561504m125832l650366l528016l173301l137160k764661k775652k515077
16688D8891439k184611k277924k244153k208127j644768j959111j276906j672705
16680C3423134j569427r57045j577102j266547r99398j550964n41215o77728j107457
16671B3176251p39588r49468n61798j198891n62197p06787k76819j059435l13533
16662A6807735n15171l63173o22267l65880q24200j56812l55753n32094n62899
16653A2509486j39040k65164m61474l63904k14624m46358j48810l13017l68824
16644I788271R2143m33627l08187l80520l07664k41225r432M6201l45333j16242
16634G784385m2984j26217m73308k06311k69588L07596n90430J16652j62805j72111
$$ plain form
16624 6164879 6246392 5864186 5767367 5525007 5256919 5351210 5538034 5100210 5207112 4984341
16614 4984341 4537785 5063406 4673514 4518009 4431061 4520708 4662740 4341020 4225440 3953901
16604 3953901 4435550 3998739 3941659 3763805 4010947 4178285 3730083 3628969 3493136 3611254
16594 3611254 3459160 3327823 3364487 3299904 3047668 3016985 3342368 2905122 2959449 2979303
16584 2979303 2423677 3079281 2635471 2973203 2707491 2759526 2622368 2690534 2458006 2235360
16574 2235360 2238213 2206968 2474912 2743364 2625736 2271625 2370215 2057135 2362552 1920603
16564 1920603 2233020 2036009 1974842 2269965 1963841 2112821 1859529 1957424 1797124 1862813
16554 1862813 1691698 1930783 1903692 2031947 1626220 2069255 1756318 1825177 1755461 2007933
$$ packed form
16624F164879Q1513l82206r6819k42360k68088R4291J86824m37824J06902k22771
16614D984341m46556N25621l89892j55505q6948Q9647J42032l21720j15580k71539
16604C953901M81649m36811n7080j77854K47142J67338m48202j01114j35833J18118
16594C611254j52094j31337L6664o4583k52236l0683L25383m37246N4327J9854
16584B979303n55626O55604m43810L37732k65712N2035j37158O8166k32528k22646
16574B235360K853l1245K67944K68452j17628l54111R8590l13080L05417m41949
16564A920603L12417j97011o1167K95123l06124J48980k53292R7895j60300O5689
16554A862813j71115K39085k7091J28255m05727M43035l12937O8859o9716K52472
$$ plain form
16544 2007933 1767676 1308625 1944224 1816528 1767293 1560087 1302328 1434217 1594354 1634541
16534 1634541 1844742 1487874 1515366 1236696 1490869 1147236 1326904 1731591 1416704 1521445
16524 1521445 1147691 1213802 1104774 1238812 1184001 1173544 1219333 1135545 960061 1294737
16514 1294737 1296307 1144583 1236651 1154934 995582 1036036 999606 932817 897572 1294752 1258490
16503 1258490 1292228 991118 896600 1020749 859887 909780 817753 1109715 935903 960223
16493 960223 1060966 906241 750322 1035427 856549 775920 1134011 729361 737834 742747
16483 742747 752117 904817 965809 1229551 974174 1070347 896177 960066 657169 858315
16473 858315 826661 660135 1043966 639182 583985 1119871 686089 693590 771058 1006014
$$ packed form
16544B007933k40257m59051O35599j27696m9235k07206k57759J31889J60137M0187
16534A634541K10201l56868K7492k78670K54173l43633J79668M04687l14887J04741
16524A521445l73754O6111j09028J34038n4811j0457M5789q3788j75484L34676
16514A294737J570j51724R2068q1717j59352M0454l6430o6789l5245L97180l6262
16503A258490L3738l01110r4518J24149j60862M9893r2027K91962j73812K4320
16493I60223J00743j54725j55919K85105j78878q0629L58091m04650Q473M913
16483G42747R370J52700O0992K63742k55377R6173j74170O3889l02897K01146
16473H58315l1654j66526L83831m04784n5197N35886m33782P501P7468K34956
$$ plain form
16463 1006014 608185 731555 499935 608141 709992 834048 695353 534267 502267 617126
16453 617126 313609 647171 700986 948312 198425 614671 403329 838788 594982 724422
16443 724422 200212 649170 550515 301370 651984 527566 345251 220412 383656 829148
16433 829148 504157 573589 564171 529654 463639 427534 367710 230264 382316 220451 665298
16422 665298 362224 465734 579317 320065 395004 778660 693421 423778 800822 476484
16412 476484 641090 276049 620439 -459 526397 370166 715642 634789 386774 936849
16402 936849 193627 315491 433869 348314 462786 171488 147909 601269 199293 397373
16392 397373 449521 408488 486921 216603 -125422 45433 516610 426625 254073 81252 564395
$$ packed form
16463A006014l97829J23370k31620J08206J01851J24056j38695j61086l2000J14859
16453F17126l03517L33562N3815K47326A98425M16246k11342M35459k43806J29440
16443G24422B00212M48958r8655k49145L50614j24418j82315j24839J63244M45492
16433H29148l24991O9432r418l4517o6015l6105n9824j37446J52052j61865M44847
16422F65298l03074J03510J13583k59252P4939L83656q5239k69643L77044l24338
16412D76484J64606B76049L44390d59E26397j56231L45476q0853k48015N50075
16402I36849A93627J21864J18378q5555J14472A71488k3579M53360A99293J98080
16392C97373N2148m1033P8433B16603a25422D5433M71177q9985j72552H1252M83143
$$ plain form
16381 564395 212903 315619 223726 362360 299096 468948 274389 216632 405483 365289
16371 365289 307181 70633 625368 405935 110395 62388 275028 570869 393389 80624
16360 120479 250796 132360 516053 81651 216055 305533 536955 283776 365417 570202
16350 570202 569175 589447 708534 351117 154013 160904 382988 89520 172977 35542 109603
16339 109603 522601 278165 439193 427335 284259 351505 362901 398499 272149 157215
16329 157215 67442 242154 317618 332453 86865 190771 249063 73053 345463 500623 436723
16318 436723 -32428 216148 221721 100816 375880 357707 20300 -98894 427627 158567 176313
16307 176313 606976 309000 11496 227811 -27838 70281 199864 108903 184107 135887 293206
$$ packed form
16381E64395B12903J02716r1893J38634o3264J69852j94559n7757J88851m0194
16371C65289n8108G0633N54735k19433A10395m8007K12640K95841j77480H0624
16360A20479J30317j18436L83693H1651J34404Q9478K31422k53179Q1641K04785
16350E70202j027K0272J19087C51117A54013O891K22084H9520Q3457C5542P4061
16339A09603M12998k44436J61028j1858j43076O7246J1396L5598j26350j14934
16329A57215F7442J74712P5464J4835H6865J03906N8292G3053K72410J55160o3900
16318D36723c2428B16148N573A00816K75064j8173B0300i8894D27627A58567J7746
16307A76313M30663k97976A1496K16315b7838G0281J29583r0961P5204m8220J57319
$$ plain form
16296 293206 212749 45733 303971 352373 195540 -46739 515655 744728 -114386 3435 47015
16285 47015 392812 149004 80312 250480 367036 76767 283651 411992 121852 -142914
16274 387750 -23002 88008 445720 173744 117455 100252 369990 259703 56405 27017 375804
16263 375804 86978 97034 -349467 378316 390602 35214 61882 542140 48632 396411 249217
16252 249217 35873 396350 10563 190469 110895 390523 359912 182744 49455 33478 165282
16241 165282 -92854 -169537 -53225 549408 -61443 122515 318645 350347 215089 292133 262535
16230 262535 -94245 123396 459332 -6107 234147 -224378 323571 -240076 131892 251310
16220 251310 92119 17787 -118020 12708 499513 261382 -72972 157824 68022 195632
$$ packed form
16296B93206q0457D5733K58238M8402j56833d6739E15655K29073a14386C435M3580
16285D7015L45797A49004o8692J70168J16556G6767K06884J28341A21852a42914
16274C87750b3002H8008L57712A73744n6289j7203K69738j10287E6405B7017L48787
16263C75804H6978J0056c49467C78316J2286C5214K6668M80258D8632L47779j47194
16252B49217C5873L60477A0563J79906p9574K79628l0611j77168D9455j5977J31804
16241A65282i2854p6683e3225E49408f1443A22515J96130L1702j35258P7044k9598
16230B62535i4245A23396L35936f107B34147b24378C23571b40076A31892J19418
16220B51310I2119A7787a18020A2708M86805k38131g2972A57824F8022J27610
$$ plain form
16210 195632 171782 200713 141546 99383 -132808 187768 28154 166471 -26609 304776 -172541
16198 66993 194672 -262117 87438 127281 18432 11235 -47882 134686 176256 451391 95180
16186 -76532 -63725 314157 291010 155842 201079 126785 -289506 -94113 -130622 44169 105820
16175 105820 445811 -249247 27877 -17156 115568 53244 69838 81578 117778 201660 34500
16163 -93485 -139943 143754 111585 -162134 303240 97374 208934 183617 337407 48297 13166
16151 30978 -151366 82772 -338997 -154385 -31336 227023 433243 298305 -216239 -65979
16140 46838 321968 332588 151959 282387 -107430 259453 4320 110029 187411 8499 47089
16129 47089 -53948 6980 102987 -251159 30343 217713 -368190 18626 123560 138730 -93195
$$ packed form
16210A95632k3850K8931n9167m2163a32808A87768B8154J38317b6609C04776a72541
16198F6993J27679b62117H7438L9843A8432p197d7882A34686M1570K75135I5180
16186g6532J2807C14157k3147j35168M5237p4294b89506i4113l6509D4169O1651
16175A05820L39991b49247B7877a7156A15568E3244J6594J1740L6200Q3882C4500
16163i3485m6458A43754l2169a62134C03240I7374J11560k5317J53790D8297A3166
16151C0978a51366H2772c38997a54385c1336B27023K06220j34938b16239f5979
16140D6838K75130J0620A51959J30428a07430B59453D320J05709P7382H499L8590
16129D7089e3948F980R6007b51159C0343J87370c68190A8626J04934J5170i3195
$$ plain form
16117 193126 -277264 70303 313814 -2758 199658 -58842 -100235 -186697 168662 185132 -44209
16105 -122478 307075 198123 183537 181814 56708 -43796 264264 -37061 -72140 -133292 -156321
16094 -156321 272358 -11857 264424 161434 -128886 -138160 190111 -198976 -22234 35181
16083 277309 -52577 97447 -23784 320080 22837 -85384 -11124 155357 -53500 -74892 -71082
16072 -71082 6541 144434 -369851 -79356 165117 -100505 41897 -248442 -279604 -52153 50463
16060 -133385 127643 199877 540444 62855 -13983 384822 112262 238884 -23080 -10295
16049 6814 -171774 -242819 19167 -150144 -216915 -119356 -18979 -22706 220083 -30363 -119151
16038 -119151 -68443 207245 -122091 -49024 -4353 26222 73459 182606 121 100581 -67801
$$ packed form
16117A93126b77264G0303K43511b758A99658e8842m1393q6462A68662J6470d4209
16105a22478C07075j08952j4586j723E6708d3796B64264c7061l5079o1152k3029
16094a56321B72358a1857B64424j02990a28886r274A90111a98976b2234C5181
16083B77309e2577I7447b3784C20080B2837h5384a1124A55357e3500k1392L810
16072g1082F541J37893c69851g9356A65117a00505D1897b48442l1162e2153E0463
16060a33385A27643P2234L40567F2855a3983C84822A12262J26622b3080a0295
16049F814a71774p1045A9167a50144o6771R7559a8979l727B20083c0363q8788
16038a19151N0708B07245a22091d9024d353B6222M7237J09147A21J00460f7801
$$ plain form
16026 -70283 -32817 -111653 162540 -180491 -27350 -109123 183450 -90689 -8738 4418 -152433
16014 -62247 -292755 -530 26105 340127 -39973 -70024 102276 -56397 -137486 57324 276295
16003 276295 -247129 178639 -159563 19647 -410612 -199185 -247349 -41517 149932 -270200
15992 -56297 16911 128452 -131723 -195601 -353154 -28138 -37008 62583 25596 -186165 595108
15980 225756 367544 25420 -1713 -35766 127851 -75490 32487 2360 137845 142309 -102248
15968 -276368 114555 -64078 622979 -13572 81218 -61062 -104644 23183 -169691 45403 57955
15957 57955 -124125 191855 -75452 167591 51698 439973 -43600 -145881 -396778 -335021
15947 -335021 385179 115312 44117 160171 130856 -312948 209928 -30230 -54308 269863
$$ packed form
16026g0283c2817p8836A62540a80491b7350q1773A83450i0689h738D418a52433
16014f2247k30508e30B6105L14022c9973l0051A02276e6397q1089E7324K18971
16003B76295b47129A78639a59563A9647d10612a99185m8164d1517A49932b70200
15992e6297A6911J11541a31723o3878j57553b8138q870F2583B5596a86165E95108
15980B25756J41788B5420a713l4053A27851g5490C2487B360J35485M464a02248
15968b76368A14555f4078F22979a3572H1218f1062m3582B3183a69691D5403J2552
15957E7955a24125A91855g5452A67591E1698L88275d3600j02281k50897O1757
15947c35021C85179A15312D4117J16054k9315c12948B09928c0230k4078B69863
$$ plain form
15936 78395 -85654 275665 -46591 18503 -75336 101550 115865 159286 -138989 -41620 -183666
15925 -183666 70886 -129318 102515 -155545 -53274 -73440 -58757 -109188 -73438 42717 23859
15914 23859 367285 73998 87949 -245316 -233112 -85969 58351 91533 -33421 20519 245682
15903 245682 431791 251419 336 -190247 138737 82487 272320 84536 -130023 76101 -113305
15891 13278 -194859 -120733 183774 -132229 196481 69539 161194 -2592 55199 -239344 -47130
15879 76502 -53780 -119816 -186483 -107520 -51584 85929 -82190 118419 -139564 218976 -151979
15867 -353282 195919 -46204 -196274 71769 12578 170518 380501 196490 63183 42536
15857 42536 -347418 75771 -320673 163063 122956 -53171 141976 -415711 92291 12019 -75240
$$ packed form
15936G8395h5654B75665d6591A8503g5336A01550J4315M3421a38989d1620j42046
15925a83666G0886a29318A02515a55545e3274k0166J4683n0431L5750D2717j8858
15914B3859L43426G3998J3951b45316J2204h5969E8351L3182c3421B0519K25163
15903B45682J86109j80372C36a90247A38737n6250J89833H4536a30023G6101a13305
15891A3278a94859P4126A83774a32229A96481F9539R1655b592E5199b39344d7130
15879G6502e3780o6036o6667P8963e1584H5929h2190A18419a39564B18976a51979
15867c53282A95919d6204j50070G1769A2578J57940K09983j84011F3183k0647
15857D2536c47418G5771c20673A63063m0107e3171A41976d15711I2291A2019g5240
$$ plain form
15845 -46736 158154 -366648 -55414 -150782 -50638 19430 285623 -202279 -152896 -129403 -105878
15834 -105878 26192 -66117 -149604 -24870 4579 63113 79880 34688 -296649 -158709 107055
15822 -201466 -140277 313398 32256 -234244 -336809 -41070 -73778 -79543 -234960 -143225 70244
15810 112387 -3369 -57438 -188998 -164474 92764 98715 -27340 -1094 46751 -81386 -117415 -38074
15797 -429900 35477 -149091 -190471 -4398 119921 113036 -266955 -226700 255058 -282468 -117925
15785 -197630 -137369 -171591 69456 -124016 -47650 329419 101480 -366637 103208 162440
15775 162440 119301 99150 184485 -238466 -101669 -98025 -231759 -105277 -176440 -29262 -341507
15764 -341507 50099 163385 190777 -70711 143111 -196416 316450 -23732 272307 188562
$$ packed form
15845d6736A58154c66648e5414r5368e0638A9430K66193b02279M9383K3493K3525
15834a05878B6192f6117q3487b4870D579N8534J6767C4688b96649J37940A07055
15822b01466O1189C13398C2256b34244j02565d1070l2708n765j55417R1735G0244
15810A12387c369n4069j31560K4524I2764N951b7340a094D6751h1386l6029c8074
15797d29900C5477a49091m1380d398A19921o885b66955M0255B55058b82468a17925
15785a97630O0261l4222F9456a24016d7650C29419A01480c66637A03208N9232
15775A62440m3139k0151Q5335b38466a01669L644j33734a05277p1163b9262l12245
15764c41507E0099J13286K7392g0711A43111a96416C16450b3732B72307q3745
$$ plain form
15754 188562 149352 -79146 167280 273960 -79727 -167649 -106935 -239907 89466 279857 -118565
15742 -193225 138149 184276 14198 -159971 -153303 -185618 -159701 8440 -60116 97289 134782
15731 134782 119573 -319296 -121930 110821 -17980 -278625 -178463 -136454 -345127 79960
15720 -229551 -37802 90902 2547 94089 131804 75129 -321074 149037 191409 68891 80121
15709 80121 26341 152373 -371465 -88851 -148349 -382724 82567 -163760 31281 140179 25329
15697 -160168 47151 34421 -82639 -149229 88084 116890 -40958 -280990 96010 12630 109193
15686 109193 113344 -232390 113977 -277805 -289929 43855 -2019 -105574 42103 27584 23955
15675 23955 56382 83000 -98906 -80838 -52835 -74523 -137082 -75643 -387075 -423605 97131
$$ packed form
15754A88562l9210g9146A67280J06680g9727q7922O0714j32972H9466J90391a18565
15742a93225A38149M6127A4198a59971O668l2315K5917H440f0116I7289L7493
15731A34782j5209c19296a21930A10821a7980k60645J00162M2009k08673G9960
15720b29551c7802I0902B547R1542L7715n6675c21074A49037M2372F8891J1230
15709H0121B6341J26032c71465h8851n9498k34375H2567a63760C1281J08898B5329
15697a60168D7151j2730h2639o6590H8084K8806d0958k40032I6010A2630R6563
15686A09193M151b32390A13977b77805j2124D3855b019j03555D2103j4519l629
15675B3955L2427K6618i8906J8068K8003k1688o2559O1439l11432l6530I7131
$$ plain form
15663 296662 45813 -191605 -324679 -78439 134151 22473 62234 -231792 -81260 247679
15652 139466 39714 -267240 -205288 29594 209552 145386 336945 -255884 42575 -20250 -136091
15641 -136091 -251533 -241475 326192 63084 -37485 -123107 -281577 -131314 -127941 32012 -281080
15629 -85803 -44757 121681 20980 238604 4100 152675 -125442 183616 170094 -113280 -75468
15618 -75468 -147317 -80747 62202 -132315 86662 199393 -232396 104965 -359470 -88955 230153
15606 -93120 84283 -475031 -412106 2718 -188107 149566 -369419 -274068 -155038 -435768 -373016
15595 -373016 7077 -291899 -406978 -268797 252681 160186 -104050 15605 189178 50042
15584 152821 -95617 147151 -72191 203485 -134468 -57923 104530 228090 -188211 -164751
$$ packed form
15663B96662D5813a91605j33074g8439A34151B2473L9761b31792h1260B47679
15652A39466C9714b67240O1952B9594J79958o4166J91559b55884D2575b0250j15841
15641a36091j15442J0058C26192F3084c7485q5622j58470a31314L373C2012b81080
15629h5803M1046A21681B0980K17624D100J48575a25442A83616j3522a13280L7812
15618g5468p1849O6570F2202a32315H6662J12731b32396A04965c59470h8955B30153
15606i3120H4283d75031O2925B718a88107A49566c69419R5351J19030k80730O2752
15595c73016G077b91899j15079J38181B52681r2495a04050A5605J73573E0042
15584A52821i5617A47151g2191B03485a34468e7923A04530J23560a88211K3460
$$ plain form
15574 -164751 48687 -228659 -70374 207943 24256 -177941 90536 -204683 -44417 -34268 -14464
15562 3116 110518 -39380 -275112 -6743 153753 204213 141985 124993 33113 -3034 -53976 -38064
15550 -38064 930 59817 27578 127688 77079 -319306 -275427 142038 -90209 89336 317714
15539 317714 -335155 161587 112082 49270 238186 129293 -105581 11268 -109478 76460
15528 -206362 -247761 -32408 -63511 -1609 -199964 175089 83573 115904 -88574 47456 -61768
15516 51237 -155763 -430 172044 -331143 -281181 -251087 76004 240242 237594 -81676 106939
15504 -378577 -192977 -122295 191399 209095 -109611 148975 -159813 326194 93168 -146855
15493 141462 -77831 77541 -237052 -1431 -264358 166823 -138168 -161235 -59619 128017 -149118
$$ packed form
15574a64751D8687b28659g0374B07943B4256a77941I0536b04683d4417J0149a4464
15562C116J07402c9380k35732f743A53753N0460o2228j6992C3113c034n0942J5912
15550c8064I30N8887B7578J00110n0609c19306M3879A42038i0209H9336K28378
15539C17714c35155A61587m9505D9270J88916j08893a05581A1268a09478G6460
15528b06362m1399c2408l1103a609j98355A75089H3573L2331h8574D7456f1768
15516E1237a55763d30A72044c31143M9962L0094G6004J64238k648h1676A06939
15504c78577J85600P0682A91399J7696a09611A48975a59813C26194I3168a46855
15493A41462g7831G7541b37052a431k62927A66823a38168k3067e9619A28017a49118
$$ plain form
15481 273790 43189 -9538 -9117 70156 -18069 -25118 204233 547072 -74254 -116692 -166430 11741
15468 -311292 96502 -195384 201304 -146797 -64210 -242473 102993 10504 218059 67392
15457 -287537 22840 -273094 86356 -103424 -23539 24254 -107465 408867 -497 73231 -195917
15445 1114 -316280 -58999 201442 48697 -52695 179957 209425 -273599 181009 116179 -340902
15433 -109160 64440 322414 -196378 136360 181079 161246 -197233 -78516 28501 -371957
15422 95109 206156 105832 -143219 104766 -129825 -3802 -109969 27358 -154992 -302013
15412 -302013 30651 26614 -86153 207229 140118 284670 -117470 71692 -311058 47208 200261
15401 200261 -259486 207911 15945 -28863 -42114 46077 -132901 -110435 -68503 -110614 -213418
$$ packed form
15481B73790D3189i538M21G0156a8069p049B04233L42839g4254m2438m9738A1741
15468c11292I6502a95384B01304a46797f4210j78263A02993A0504K07555F7392
15457b87537B2840b73094H6356a03424b3539B4254a07465D08867d97G3231a95917
15445A114c16280e8999B01442D8697e2695A79957K9468b73599A81009o4830c40902
15433a09160F4440K57974a96378A36360M4719j9833a97233g8516B8501c71957
15422I5109J11047j00324a43219A04766a29825c802j06167B7358a54992j47021
15412c02013C0651m037h6153B07229o7111J44552a17470G1692c11058D7208J53053
15401B00261b59486B07911A5945b8863j3251D6077a32901K2466M1932m2111j02804
$$ plain form
15390 -213418 60621 128511 31818 192790 4594 -252130 -17096 -370479 122597 268077 -204520
15378 71782 -327009 -309125 21631 20824 109026 -92740 229906 -17351 -468526 353184 408304
15367 408304 -36071 -193287 -343749 160508 -173985 125282 -136873 -159194 172217 52739
15356 293744 242576 42884 -142550 210708 -64727 37154 -37218 -149015 190405 161572 136352
15345 136352 -146559 154022 113489 -153059 -46626 30816 -48323 -115182 -130223 185470 39065
15333 -170701 359676 99907 -3867 -206137 273454 126926 -37916 358198 172439 230562
15323 230562 13928 19550 -50182 202345 46367 17012 48267 212994 232688 -133860 282594
15311 111458 -353963 -149566 107012 -57323 -163424 -196471 -66330 -193974 148065 119707
$$ packed form
15390b13418F0621O7890C1818J60972D594b52130a7096l53383A22597J45480b04520
15378G1782c27009J7884B1631q07Q8202i2740B29906a7351m51175C53184N5120
15367D08304c6071j57216j50462A60508a73985A25282a36873k2321A72217E2739
15356B93744n1168D2884a42550B10708f4727C7154c7218j11797A90405k8833k5220
15345A36352a46559A54022m0533a53059d6626C0816d8323o6859j5041A85470C9065
15333a70701C59676I9907c867k02270B73454A26926c7916C58198A72439N8123
15323B30562A3928N622e0182B02345D6367A7012L1255J64727J9694a33860B82594
15311A11458c53963a49566A07012e7323j06101l3047f6330j27644A48065k8358
$$ plain form
15301 119707 -24805 -143006 49340 132704 119096 17787 -223630 79000 7121 246139 393893
15290 393893 94269 -77919 -37218 -102351 115246 319367 -12607 98325 202250 -121426 -84241
15279 -84241 431907 -272464 40097 104256 597402 93246 -45513 22837 -247787 109458 -32207
15267 -136257 110346 -1352 234785 -132637 -231588 227027 -353645 -19367 -31526 284044
15256 224701 181767 62537 -165589 123598 240103 439670 441436 976142 1069150 1374624
15246 1374624 1503563 921179 1203496 159590 -32576 63409 -63545 50549 134805 289466
15236 289466 -55023 -287115 381046 43514 -124555 -187828 -56160 10616 -14713 170044 -102854
15224 118509 -390615 187918 117395 118952 242287 -123104 -276832 -141397 -42835 356095
$$ packed form
15301A19707b4805j18201D9340Q3364j3608A7787b23630G9000G121K39018J47754
15290C93893I4269g7919c7218o5133A15246K04121a2607I8325J03925a21426L7185
15279h4241D31907b72464D0097O4159M93146I3246d5513B2837b47787A09458c2207
15267a36257A10346a352B34785a32637r8951B27027c53645a9367j2159B84044
15256B24701m2934F2537a65589A23598J16505J99567J766N34706R3008L05474
15246A374624J28939n82384K82317A59590c2576F3409f3545E0549Q4256J54661
15236B89466e5023k32092C81046D3514a24555o3273e6160A0616a4713A70044a02854
15224A18509c90615A87918p0523J557J23335a23104j53728J35435d2835C56095
$$ plain form
15213 120873 149980 -19417 165037 29178 139103 275770 114438 -163136 -148117 -22419
15202 1265 121021 70321 270455 300857 147007 -171851 -282999 70026 198374 -34407 31828
15190 -250381 -85238 -95324 34065 -2798 -112697 -32140 218093 183529 156510 167679 -224136
15178 347168 285773 -117526 181347 3228 122127 120930 -228065 211129 95672 22591 109464
15167 109464 -8407 261321 207299 -196048 -92364 118712 50398 373738 85881 209980 127174
15156 127174 173356 26315 -380601 54542 279708 -1652 357816 -11023 95255 -162801 148137
15144 -395240 77898 217910 165646 312741 203075 -77092 203765 240056 153772 153321 522337
15133 522337 31805 104435 199472 148662 139125 195368 17939 239107 -85289 -221281 -231628
$$ packed form
15213A20873K9107a9417A65037B9178J09925J36667A14438a63136J5019b2419
15202A265J19756n0700K00134L0402A47007a71851j11148G0026J28348c4407C1828
15190b50381h5238j0086C4065b798j09899c2140B18093l4564k7019J1169b24136
15178C47168o1395a17526A81347C228J18899j197b28065B11129I5672B2591Q6873
15167A09464h407B61321n4022a96048i2364A18712E0398L23340H5881J24099q2806
15156A27174M6182B6315c80601E4542K25166a652C57816a1023I5255a62801A48137
15144c95240G7898J40012n2264J47095j09666g7092B03765L6291q6284m51L69016
15133E22337C1805P2630R5037n0810r537N6243A7939K21168h5289j35992j0347
$$ plain form
15122 -231628 198185 349451 109405 90184 159358 129343 337231 277746 363215 241967
15112 241967 -112265 317963 250714 224448 -81479 199243 164131 -4930 311830 160713 206704
15101 206704 -149457 182015 -117029 186606 220551 -182904 -70644 -149594 -48746 -6056 435757
15089 399049 557260 248980 15275 67607 244511 269800 -63043 479268 326228 163151
15079 163151 229012 61636 54188 338231 208204 332876 82062 165472 511648 44695 62210
15068 62210 66089 -38933 -216565 402759 90719 157581 42175 487768 92224 143312 229369
15057 229369 -85959 91228 263090 134017 420955 -40550 -35678 162369 -58396 5990 212864
15046 212864 119381 12809 200439 340437 283593 -184508 -35288 255486 -24195 295694
$$ packed form
15122b31628A98185J51266A09405j9221O9174l0015K07888n9485Q5469j21248
15112B41967a12265C17963o7249k6266h1479A99243l5112d930C11830j51117M5991
15101B06704a49457A82015a17029A86606L3945a82904g0644p8950d8746f056D35757
15089C99049J58211B48980A5275N2332J76904K5289f3043D79268j53040j63077
15079A63151O5861F1636p448K84043j30027J24672H2062Q3410L46176D4695J7515
15068F2210L879c8933j77632D02759I0719O6862D2175M45593I2224N1088Q6057
15057B29369h5959I1228J71862j29073K86938d0550M872A62369e8396E990K06874
15046B12864r3483A2809J87630J39998n6844a84508c5288B55486b4195B95694
$$ plain form
15035 378233 29459 89159 88815 437528 432958 162319 241106 60070 138041 443439 183497
15023 344547 47897 294030 146004 337162 218986 -109544 175506 214716 261443 245290
15013 245290 184783 284784 -76537 311526 -142378 213725 335768 218910 -12993 -185481
15003 -185481 82086 -34288 56220 144301 306225 305655 85173 111697 70109 62331 272372 366241
14991 366241 355162 452632 18476 306318 223838 572930 375997 293480 434273 -24656 318856
14979 -31865 383815 -259106 -45765 -58455 298238 208012 339634 492302 -37647 270196
14968 97910 105106 70019 282304 224491 171445 268593 152905 214583 90188 232224 339294
14957 339294 60587 -33150 237398 394010 568468 153426 215454 321977 250269 158388
$$ packed form
15035C78233B9459N9700l44L48713m570A62319P8787F0070P7971L05398A83497
15023C44547D7897K46133A46004J91158j18176a09544A75506L9210M6727j6153
15013B45290o0507J00001g6537C11526a42378B13725J22043j16858a2993j72488
15003a85481H2086c4288E6220Q8081J61924n70H5173K6524m1588p778K10041R3869
14991C66241j1079R7470A8476K87842q2480L49092j96933q2517J40793b4656C18856
14979c1865C83815b59106d5765j2690B98238r0226J31622J52668c7647B70196
14968I7910P196l5087K12285n7813n3046R7148j15688O1678I0188J42036J07070
14957C39294F0587c3150B37398J56612J74458A53426O2028J06523p1708r1881
$$ plain form
14947 158388 334493 131967 409629 360697 269385 353716 282952 240564 245676 324243 290588
14936 290588 254966 34618 329849 325477 341917 221053 343199 278227 285189 -6127 32047
14924 512119 204218 510375 204627 131053 564869 301637 210929 454378 205106 343486
14914 343486 56641 263401 283012 -92390 436246 -49508 517950 190601 412327 408368 64694
14902 249452 365026 582255 356515 382785 359392 286592 555649 599068 356119 499400
14892 499400 417466 153365 547980 786975 419464 409106 267438 440295 401844 249203
14882 249203 282296 123093 156912 193614 128506 129217 251764 341671 517256 266041 306520
14871 306520 274000 364469 434181 183039 442160 268624 297828 517597 494668 798171
$$ packed form
14947A58388J76105A31967K77662m8932r1312Q4331p0764m2388N112P8567l3655
14936B90588l5622C4618K95231m372J6440j20864J22146o4972O962f127C2047
14924E12119B04218L06157B04627p3574M33816k63232r0708K43449B05106J38380
14914C43486E6641K06760J9611i2390D36246d9508E17950A90601K21726l959F4694
14902B49452J15574K17229k25740K6270k3393p2800K69057M3419k42949J43281
14892D99400q1934A53365L94615K38995l67511j0358j41668J72857l8451j52641
14882B49203L3093A23093L3819L6702o5108P11J22547Q9907J75585k51215M0479
14871C06520l2520R0469O9712A83039K59121j73536K9204K19769k2929L03503
$$ plain form
14861 798171 -8285 306679 268312 328898 386190 419998 211944 398348 140637 453558 781969
14850 781969 134600 417202 593732 -201938 376855 435051 325116 322474 339353 584254
14840 584254 329336 191273 454229 552166 546401 411881 567193 312915 272162 221914
14830 221914 481343 57613 385301 268652 425120 481500 501234 593605 349222 320098
14820 320098 422376 611440 312432 222960 355657 618394 519739 735694 625351 338079
14810 338079 579562 489529 559167 764190 380264 384063 239199 609400 335918 518571
14800 518571 393875 352503 361100 860236 591135 471782 386602 786258 448746 678863
14790 678863 281786 703475 590294 357711 453823 518409 542852 97979 468393 834615
$$ packed form
14861G98171h285C06679l8367O0586N7292L3808k08054J86404A40637L12921L28411
14850G81969A34600K82602J76530b01938C76855N8196j09935k642J6879K44901
14840E84254k54918j38063K62956R7937n765j34520J55312k54278m0753n0248
14830B21914K59429E7613L27688j16649J56468N6380J9734R2371k44383k9124
14820C20098J02278J89064k99008q9472J32697K62737r8655K15955j10343k87272
14810C38079K41483r0033O9638K05023C80264L799j44864L70201k73482J82653
14800E18571j24696m1372Q597M99136k69101j19353q5180L99656l37512K30117
14790F78863B81786M21689j13181k32583R6112O4586K4443I7979L70414L66222
$$ plain form
14780 834615 497668 492084 442715 576407 593957 1076672 777855 430896 415755 896167
14770 896167 436777 557033 417238 587762 656989 524359 927401 527106 588590 669229
14760 669229 969431 786057 613601 715217 957047 827062 627710 688209 656651 707854
14750 707854 345967 633223 715325 755393 729896 641220 242598 445692 805153 747377
14740 747377 754121 913375 660518 504676 620579 680572 806161 1093099 735636 567525
14730 567525 1046954 635976 1036270 736261 548990 845397 963407 900111 804011 701522
14720 701522 754225 552670 748413 658741 720878 709240 793072 812855 660285 692069 805157
14709 805157 944991 615848 484521 893283 918608 972500 569420 876416 876696 679444
$$ packed form
14780H34615l36947n584m9369J33692J7550M82715k98817l46959j5141M80412
14770H96167D36777J20256j39795J70524O9227j32630M03042m00295O1484Q0639
14760F69229L00202j83374j72456J01616K41830j29985j99352O0499l1558N1203
14750G07854C45967K87256Q2102M0068k5497q8676B42598K03094L59461n7776
14740G47377O744J59254k52857j55842J15903N9993J25589K86938l57463j68111
14730E67525M79429m10978M00294l00009j87271K96407J18010o3296r6100j02489
14720G01522N2703k01555J95743q9672O2137j1638Q3832J9783j52570L1784J13088
14709H05157J39834l29143j31327M08762K5325N3892m03080L06996K80j97252
$$ plain form
14699 679444 939541 911904 475058 679474 453288 980050 838843 1046693 941572 855020
14689 855020 687302 867857 717321 937737 896489 730566 757211 1007819 897498 1225240
14679 1225240 689227 1171008 1208525 623502 1039247 732186 1059980 668519 663222 996204
14669 996204 977634 604837 637322 1072829 798068 996040 901693 885642 1085862 794054
14659 794054 1408416 1030812 883577 1494432 702619 1196326 1017304 1361025 1340587 1132015
14649 1132015 1237417 1078341 984323 1459620 1134667 1413762 1236562 1452901 1029944 1166105
14639 1166105 1309970 1139881 1054685 1216477 1370728 1395823 1377976 1466935 1068552 1141567
14629 1141567 1236748 1131594 1088143 1259649 1367665 1224773 1525683 1041914 1282219 1296966
$$ packed form
14699F79444K60097k7637m36846K04416k26186N26762j41207K07850j05121q6552
14689H55020j67718J80555j50536K20416m1248j65923K6645K50608j10321L27742
14679A225240n36013M81781L7517n85023M15745l07061L27794l91461n297L32982
14669I96204j8570l72797L2485M35507k74761J97972r4347j6051K00220k91808
14659G94054O14362l77604j47235O10855G02619M93707j79022L43721k0438k08572
14649A132015J05402j59076r4018M75297l24953K79095j77200K16339m22957J36161
14639A166105J43865j70089q5196J61792J54251K5095j7847Q8959l98383P3015
14629A141567R5181j05154m3451J71506J08016j42892L00910m83769K40305J4747
$$ plain form
14619 1296966 1879858 1250006 2008528 1353776 1235518 1422108 1419119 1472269 1288315 1361801
14609 1361801 1736914 1347214 1292394 1613655 1501841 1550274 1560257 1856507 1433540 1581388
14599 1581388 1275127 1632274 1591715 1500099 1732499 1951936 1518627 1855621 1986635 1740884
14589 1740884 1957637 1829861 1628780 1844243 1932085 1631093 1726412 1679841 1765348 1983992
14579 1983992 1816515 2145318 1696180 2074772 2102406 2216379 1996526 2073896 2204346 2491999
14569 2491999 2067010 2374683 1965061 2494203 2372998 2413815 2262572 2418876 2455858 2754837
14559 2754837 2376792 2607920 2837335 2753632 3392933 3493114 3856633 4635900 5999381
14550 5999381 8867508 13184977 17477761 22148847 28084036 35677567 20598012 9672964
$$ packed form
14619A296966N82892o29852P58522o54752j18258J86590k989N3150j83954P3486
14609A361801L75113l89700n4820L21261j11814M8433R983K96250m22967J47848
14599A581388l06261L57147m0559r1616K32400K19437m33309L36994J31014k45751
14589A740884K16753j27776k01081K15463Q7842l00992R5319m6571Q5507K18644
14579A983992j67477L28803m49138L78592K7634J13973k19853P7370J30450K87653
14569B491999m24989L07673m09622N29142j21205M0817j51243J56304L6982K98979
14559B754837l78045K31128K29415q3703O39301J00181L63519P79267J363481
14550E999381K868127M317469M292784M671086N935189P593531j5079555I672964
$$ plain form
14541 5284705 3056648 2801089 2204961 2307477 2333102 1942208 2109995 1954461 2211511
14532 2211511 2259454 2062271 2040820 1941370 2206535 2064250 2302864 2420621 2110929 2227115
14522 2227115 2481147 2348220 2577899 2659239 2435456 2706093 2750750 2271886 2753907 2897839
14512 2897839 2401669 2752197 3274330 2736196 2676243 2767989 2988984 3041344 2738339 2585619
14502 2585619 2878261 2887243 3094805 3018224 3443733 3162024 3402309 3528954 3476969 3608036
14492 3608036 3503358 3415142 3537474 3421853 3501861 3393150 3617285 3621716 3509839 3625111
14482 3625111 3925425 3945497 3470815 4231027 3718542 3718973 3839523 4151657 4375018 4272870
14472 4272870 4345128 4344665 4289251 4321282 4684287 4389825 4484765 4934892 4534719 4508774 4875378
$$ packed form
14541E284705k228057k55559n96128J02516K5625l90894J67787j55534K57050
14532B211511M7943j97183k1451r9450K65165j42285K38614J17757l09692J16186
14522B227115K54032j32927K29679Q1340k23783K70637M4657m78864M82021J43932
14512B897839m96170L50528N22133n38134n9953R1746K20995N2360l03005j52720
14502B585619K92642Q982K07562p6581M25509k81709K40285J26645n1985J31067
14492C608036j04678q8216J22332j15621Q0008j08711K24135M431j11877J15272
14482C625111L00314K0072m74682P60212n12485M31J20550L12134K23361j02148
14472D272870P2258m63n5414L2031L63005k94462R4940M50127m00173k5945L66604
$$ plain form
14461 4875378 4467150 4956219 5126153 4928418 4729055 4698409 5126550 4932416 5164049 5129216
14451 5129216 5238426 5287179 5466722 5381381 5487710 5727972 5704866 5812401 5574812 5798373
14441 5798373 5784162 5862685 5948142 6380092 6295210 6150758 6288833 6741735 6409315 6373355
14431 6373355 6658116 6979953 7162593 6646165 6937519 7312690 7018687 7387437 7320568 7499844
14421 7499844 7582355 7830704 7796977 7709248 8022398 8307476 8846405 8292310 8584559 8788377
14411 8788377 8678781 8890626 8976455 9147765 8988485 9255725 9840685 9761473 9696661 9663054
14401 9663054 10307355 10493359 10396752 10749133 10888694 10766809 11287884 11579398 11533738 11867075
14391 11867075 12012914 12054483 12720751 12417243 12648575 13105427 13123816 13232115 13758599 14194389
$$ packed form
14461D875378m08228M89069J69934j97735j99363l0646M28141j94134K31633l4833
14451E129216J09210M8753J79543q5341J06329K40262k3106J07535k37589K23561
14441E798373j4211P8523Q5457M31950q4882j44452J38075M52902l32420l5960
14431F373355K84761L21837J82640n16428K91354L75171k94003L68750o6869J79276
14421G499844Q2511K48349l3727q7729L13150K85078N38929n54095K92249K03818
14411H788377j09596K11845Q5829J71310j59280K67240N84960p9212o4812l3607
14401I663054O44301J86004r6607L52381J39561j21885N21075K91514m5660L33337
14391A1867075J45839M1569O66268l03508K31332M56852J8389J08299N26484M35790
$$ plain form
14381 14194389 14161934 14557348 14546298 14992720 15157501 15352770 15532266 16344928 16476563 16948892
14371 16948892 17170391 17786880 18015201 18063418 18654776 19076810 19509021 19785691 20175043
14362 20175043 20284491 20915749 21350398 21902153 22225880 23039413 23434493 24026321 24667295
14353 24667295 25582112 26025944 26365002 27141100 27751863 28388021 29192290 29430124 30934809
14344 30934809 31119558 32484352 33194183 33955565 34948285 35789381 36913995 37750307 39347822
14335 39347822 40082697 41591344 43257564 44174830 45681818 46729283 48646273 49843769
14327 49843769 51550305 52812180 55146526 57164325 59088935 61258631 63031545 65594739
14319 65594739 68091492 70343149 73084557 75601386 79029789 81736452 85513703 88466034
$$ packed form
14381A4194389l2455L95414j1050M46422J64781J95269J79496Q12662J31635M72329
14371A6948892K21499O16489K28321M8217N91358M22034M32211K76670L89352
14362B0175043J09448O31258M34649N51755L23727Q13533L95080N91828O40974
14353B4667295R14817M43832L39058P76098O10763O36158Q04269K37834J504685
14344C0934809J84749J364794P09831P61382R92720Q41096J124614Q36312J597515
14335C9347822P34875J508647J666220R17266J506988J047465J916990J197496
14327D9843769J706536J261875K334346K017799J924610K169696J772914K563194
14319F5594739K496753K251657K741408K516829L428403K706663L777251K952331
$$ plain form
14311 88466034 92871915 96267155 100599178 104979458 109382862 114040625 119398943 124611876
14303 124611876 130470763 137120954 143305649 150031224 157729730 165250788 173658857 182640357
14295 182640357 191874118 201225181 211704526 222689528 234273900 246288245 258904249
14288 258904249 272623928 286149167 300675170 315595054 330415545 345339512 360648149
14281 360648149 375736821 390553826 404424436 417302357 428515893 437578345 441905367
14274 441905367 439525936 434048672 429988338 430246926 432120708 439922812 438086278 433428828
14266 433428828 425256389 414934863 403121897 390313224 376635108 362709026 349101210
14259 349101210 334127453 318923082 303698745 289561974 275182538 261948315 249442620
$$ packed form
14311H8466034M405881L395240M332023M380280M403404M657763N358318N212933
14303A24611876N858887O650191O184695O725575P698506P521058Q408069Q981500
14295A82640357R233761R351063J0479345J0985002J1584372J2014345J2616004
14288B58904249J3719679J3525239J4526003J4919884J4820491J4923967J5308637
14281C60648149J5088672J4817005J3870610J2877921J1213536R062452M327022
14274D41905367k379431n477264m060334K58588J873782P802104j836534m657450
14266D33428828q172439j0321526j1812966j2808673j3678116j3926082j3607816
14259C49101210j4973757j5204371j5224337j4136771j4379436j3234223j2505695
$$ plain form
14252 249442620 236615683 224921074 213399265 202947774 193080697 183205435 174044894
14245 174044894 165890727 158530078 150662823 143350958 137029996 130583857 124701222 119363048
14237 119363048 114249839 109141692 104536956 100199772 96004437 92430891 88859002 85401832
14229 85401832 81759894 78622278 75599333 72807308 70237695 67741287 65532562 62946666
14221 62946666 61028809 59024815 56977549 55084510 53345033 51426442 50183984 48667771
14213 48667771 47206742 46015393 43865182 43058705 41491401 40806495 39901461 38881506
14205 38881506 37463307 36442420 35346818 34340315 33702997 33194649 32109179 31223220
14197 31223220 30222577 29437678 28817382 28299077 27858863 27012159 26480779 25593460 24882225
$$ packed form
14252B49442620j2826937j1694609j1521809j0451491r867077r875262r160541
14245A74044894q154167p360649p867255p311865o320962o446139n882635n338174
14237A19363048n113209n108147m604736m337184m195335l573546l571889l457170
14229H5401832l641938l137616l022945k792025k569613k496408k208725k585896
14221F2946666j917857k003994k047266j893039j739477j918591j242458j516213
14213D8667771j461029j191349k150211q06477j567304o84906r05034j019955
14205C8881506j418199j020887j095602j006503o37318n08348j085470q85959
14197C1223220j000643p84899o20296n18305m40214q46704n31380q87319p11235
$$ plain form
14188 24882225 24252140 23947565 23157477 22411273 22262729 21633920 21061548 20936436 20188128
14179 20188128 20242066 19271619 18982653 18760118 18238106 18033043 17715188 17075282 16855339
14170 16855339 16626141 16354725 15922522 15521099 15541904 14960073 15039192 14299934 14311090 14214888
14160 14214888 13628338 13528182 13389597 13111546 13214168 12585616 12437948 12582205 12109695
14151 12109695 11758989 11493505 11366611 11121854 11257840 10779207 10960839 10394757 10659899
14142 10659899 10384564 10108655 10084589 9705083 9773499 9924148 9152531 9020573 9341133 9070716
14132 9070716 8973866 8709452 8840116 8706714 8510967 8418319 7821289 8002766 7891473 7728847
14122 7728847 7695169 7777756 7199300 7451452 6843253 6860632 7061872 6698929 6741746 6866484
$$ packed form
14188B4882225o30085l04575p90088p46204j48544o28809n72372j25112p48308
14179B0188128N3938r70447k88966k22535n22012k05063l17855o39906k19943
14170A6855339k29198k71416m32203m01423K0805n81831P9119p39258J1156r6202
14160A4214888n86550j00156j38585k78051J02622o28552j47668J44257m72510
14151A2109695l50706k65484j26894k44757J35986m78633J81632n66082K65142
14142A0659899k75335k75909k4066l79506O8416J50649p71617j31958L20560k70417
14132I070716r6850k64414J30664j33402j95747r2648n97030J81477j11293j62626
14122G728847l3678Q2587n78456K52152o08199J7379K01240l62943M2817J24738
$$ plain form
14112 6866484 6626336 6455694 6390672 6173887 6386190 6323160 6071870 6032937 6073395 5990319
14102 5990319 5962715 6137044 5799226 5719852 5706524 5470209 5564779 5557360 5258160 5210273 5379784
14091 5379784 5017460 5423777 5050810 5172485 5061234 4728396 4769323 4847495 4965126 4684252
14081 4684252 4321865 4396897 4711580 4880313 4550896 4743674 4389859 4434791 4165212 4307100
14071 4307100 4140831 3775571 4169625 3962252 3892551 3805826 4117215 3736562 3946276 4009138
14061 4009138 3691695 3781610 3806057 3897729 3773206 3925250 3471704 3736985 3738206 3261598
14051 3261598 3278535 3059231 3604491 3658251 3056114 3330000 3431652 3126925 3181861 3142271
14041 3142271 2890048 3117663 3029407 3152586 3070877 3034724 2831979 2816897 2990202 3186070
$$ packed form
14112F866484k40148j70642o5022k16785K12303o3030k51290l8933M0458q3076
14102E990319k7604J74329l37818p9374j3328k36315R4570p419k99200m7887J69511
14091E379784l62324M06317l72967J21675j11251l32838M0927P8172J17631k80874
14081D684252l62387P5032L14683J68733l29417J92778l53815M4932k69579J41888
14071D307100j66269l65260L94054k07373o9701q6725L11389l80653K09714O2862
14061D009138l17443Q9915K4447R1672j24523J52044m53546K65281J221m76608
14051C261598J6937k19304N45260N3760o02137K73886J01652l04727N4936l9590
14041C142271k52223K27615q8256J23179q1709l6153k02745j5082J73305J95868
$$ plain form
14031 3186070 3142925 2900390 3046227 2955275 2946913 2602845 3091583 2480297 2751615 2786254
14021 2786254 2644766 2736934 2597981 2397703 2277198 2317868 2595110 2716816 2584990 2368153
14011 2368153 2213943 2135604 2083814 2306261 2503422 2259899 2085174 1738119 1997958 2276633
14001 2276633 2044603 2015226 2086168 2065526 2086269 2122748 2084752 1656712 1692230 2149544 2860223
13990 2860223 4820025 8724310 13163941 17785416 24133343 34380063 24701534 12610204
13982 12610204 7550759 5898145 4960991 4019059 3385804 3178472 2751387 2830778 3066520
13973 3066520 2898619 2435795 2576959 2282342 2286513 2585319 2486545 2286631 2351901 2463860
13963 2463860 1840775 2358737 1989079 2037202 2190448 2181156 1836226 2041836 2023263 1747417
$$ packed form
14031C186070m3145k42535J45837r0952q362l44068M88738o11286K71318L4639
14021B786254j41488R2168j38953k00278j20505M0670K77242J21706j31826k16837
14011B368153j54210p8339n1790K22447J97161k43523j74725l47055K59839K78675
14001B276633k32030k9377P0942k0642K0743L6479l7996m28040L5518M57314P10679
13990B860223J959802L904285M439631M621475O347927J0246720r678529j2091330
13982A2610204n059445j652614r37154r41932o33255k07332m27085P9391K35742
13973C066520j67901m62824J41164k94617M171K98806r8774j99914O5270J11959
13963B463860o23085N17962l69658M8123J53246r292l44930K05610j8573k75846
$$ plain form
13953 1747417 1930422 1948815 1863773 1806412 1879222 1827134 1478150 1619527 1763967 1763177 2156563
13942 2156563 2055253 1829822 1649419 1568149 1855411 1809845 1652499 1628779 1559246 1676986
13932 1676986 1596561 1857824 1280315 1535171 1656404 1494892 1612666 1803613 1336111 1662169
13922 1662169 1137999 1669337 1605085 1529081 1570234 1274537 1452390 1522288 1502572 1389392
13912 1389392 1111166 1660214 1544289 1532703 1354259 1539636 1607073 1145159 1301803 962686
13902 962686 1262565 1264088 1150515 1222963 1208046 1591702 1257157 1183658 1556738 1458871 1113385
13891 1113385 1442511 977676 1275529 1025314 1447404 917172 971425 1113858 1429370 1128398
13881 1128398 1228890 1125917 929853 1268687 1114200 1114324 977981 970211 1300573 969734
$$ packed form
13953A747417J83005J8393q5042n7361P2810n2088l48984J41377J44440p90L93386
13942B156563j01310k25431j80403q1270K87262m5566j57346k3720o9533J17740
13932A676986q0425K61263n77509K54856J21233j61512J17774J90947m67502L26058
13922A662169n24170N31338o4252p6004M1153k95697J77853O9898j9716j13180
13912A389392k78226N49048j15925j1586j78444J85377O7437m61914J56644l39117
13902I62686K99879J523j13573P2448j4917L83656l34545p3499L73080r7867l45486
13891A113385L29126m64835K97853k50215M22090n30232N4253J42433L15512l00972
13881A128398J00492j02973j96064L38834j54487J24j36343p770L30362l30839
$$ plain form
13871 969734 1186729 1066004 1114479 1046626 1161983 995544 1053053 820096 1027214 974430
13861 974430 1045984 1408039 1082398 875651 1233535 1033043 1254188 1227533 1082856 862057
13851 862057 941620 942680 876350 1277453 1070394 1091477 863644 932434 1010142 933399 638241
13840 638241 1143010 834963 764776 757871 626788 777663 904245 991490 1034491 1086229 1051353
13829 1051353 883639 684658 703512 1046031 939695 756833 1305248 944237 1192786 1195393
13819 1195393 835808 770334 826732 742982 546990 853900 875024 593119 537116 751174
13809 751174 741887 903440 897082 956281 619682 654882 1266243 1135742 666643 648710 903562
13798 903562 670550 774999 760472 842925 967845 674166 734534 773490 903116 757689
$$ packed form
13871I69734K16995j20725M8475o7853J15357j66439N7509k32957K07118n2784
13861I74430P1554L62055l25641k06747L57884k00492K21145k6655j44677k20799
13851H62057P9563J060o6330M01103k07059K1083k27833O8790P7708p6743k95158
13840F38241N04769l08047p0187o905j31083J50875J26582Q7245M3001N1738l4876
13829A051353j67714j98981J8854L42519j06336j82862N48415l61011K48549K607
13819A195393l59585o5474N6398q3750j95992L06910K1124k81905n6003K14058
13809G51174r287J61553o358N9199l36599L5200O11361j30501m69099j7933K54852
13798I03562k33012J04449j4527Q2453J24920k93679O0368L8956J29626j45427
$$ plain form
13788 757689 919629 794397 715321 428690 774185 905475 546237 406770 124821 505644
13778 505644 663509 607393 615165 811504 586802 833989 649555 661800 764074 614151
13768 614151 915282 708937 551789 861531 920721 387829 630921 575813 443497 710592
13758 710592 681772 747617 738425 569602 868924 594546 710028 422195 624922 875218
13748 875218 908120 655169 563381 418380 535333 727633 610440 307871 685467 309744
13737 573594 690756 340736 631966 649065 511317 616632 380805 415864 605669 360484
13727 360484 596641 507142 307571 533274 540478 651282 461889 412223 550872 360427
13717 360427 551495 576028 404048 394791 324434 624156 793200 466682 613216 383873
$$ packed form
13788G57689J61940j25232p9076k86631L45495J31290l59238j39467A24821L80823
13778E05644J57865n6116P772J96339k24702K47187j84434J2245J02274j49923
13768F14151L01131k06345j57148L09742N9190C87829K43092n5108j32316K67095
13758G10592k8820O5845r192j68823K99322k74378J15482k87833K02727K50296
13748H75218L2902k52951r1788j45001J16953J92300j17193l02569L77596C09744
13737E73594J17162C40736K91230J7099j37748J05315k35827L5059J89805k45185
13727C60484K36157q9499j99571K25703P204J10804j89393m9666J38649j90445
13717C60427J91068K4533j71980r257p0357K99722J69044l26518J46534k29343
$$ plain form
13707 383873 695250 718826 540271 246047 485200 334168 493984 430758 569664 327429
13697 327429 691211 341537 721270 562989 310441 590410 418 539539 858715 449923
13687 449923 521735 648506 371661 123823 633440 562795 145863 664335 303209 333459
13677 333459 472196 448629 318068 584512 657263 343957 397355 285549 27889 469213
13667 469213 224771 366824 900814 450033 419996 688029 308276 51960 505953 524423
13657 524423 442896 358286 330751 512545 383101 376427 486017 417355 485895 458415 931840
13646 931840 311747 238213 686292 501776 383102 796696 387760 669554 460119 397708
13636 397708 261527 532930 249988 182721 562122 279110 469928 641113 598336 272881
$$ packed form
13707C83873L11377K3576j78555B46047K39153j51032J59816o3226J38906k42235
13697C27429L63782C41537L79733j58281k52548K79969D18N39121L19176m08792
13687D49923P1812J26771k76845A23823N09617p0645A45863N18472C03209L0250
13677C33459J38737k3567j30561K66444P2751l13306N3398j11806B7889M41324
13667D69213B24771J42053N33990D50033l0037K68033C08276E1960M53993J8470
13657E24423q1527q4610k7535J81794j29444o674J09590o8662O8540k7480M73425
13646I31840C11747p3534M48079j84516j18674M13594C87760K81794k09435o2411
13636C97708j36181K71403B49988o7267L79401B79110J90818J71185m2777B72881
$$ plain form
13625 561095 152971 427901 320192 514876 418258 783568 -9647 151023 429864 -118788
13614 386781 271808 195492 558097 579813 660750 778304 450098 514859 326984 280054
13604 280054 544579 212203 357180 160142 588834 604942 527998 772441 369371 166023
13593 460919 23406 497381 349126 324574 -22563 430384 145429 253558 91619 135675
13583 135675 215000 379549 249423 250825 171055 188025 193321 298187 269354 611303 52199
13571 647292 -4694 271490 156864 359483 341569 115285 70700 -152486 176682 292104
13561 292104 393152 558259 86776 313312 286085 299413 1273 154059 59942 535631 196898
13549 532519 50468 92146 1088 484092 343747 -31951 52452 145902 235005 475924 -40361
$$ packed form
13625E61095A52971K74930j07709J94684r6618L65310i647A51023K78841a18788
13614C86781j14973p6316L62605K1716Q0937J17554l28206O4761j87875m6930
13604B80054K64525B12203J44977A60142M28692J6108p6944K44443C69371A66023
13593D60919B3406M73975j48255k4552b2563D30384A45429J08129I1619M4056
13583A35675P9325J64549j30126J402p9770J6970N296J04866k8833L41949E2199
13571F47292d694B71490j14626K02619j7914A15285m4585a52486A76682J15422
13561B92104J01048J65107H6776K26536k7227J3328A273J52786E9942M75689A96898
13549E32519E0468M1678A088M83004j40345c1951E2452R3450Q9103K40919d0361
$$ plain form
13537 259868 262725 107867 -56260 394971 201208 85890 241470 -84730 131998 150003 245970
13526 245970 199943 158705 354842 252291 26245 333461 294083 -28362 -44737 77739 172890
13515 172890 263839 69494 158520 410958 176286 297021 590375 -14180 535655 95013
13504 -233803 453106 289945 322068 424902 120205 -90118 370068 576953 94996 193504
13494 193504 477506 17584 -5003 373229 240674 304464 586902 165868 130201 185343 281400
13483 281400 542213 268861 119824 193596 101348 116695 811585 473648 610332 316993
13473 316993 239100 120639 -78911 198456 353996 140630 535627 232068 96198 -169064
13462 318889 -51403 269983 420504 308857 152230 279814 176963 65556 60667 494164
$$ packed form
13537B59868K857A07867e6260C94971j93763H5890J55580h4730A31998J8005R5967
13526B45970m6027m1238J96137j02551B6245L07216l9378b8362j6375G7739R5151
13515A72890R0949F9494Q9026K52438A76286J20735K93354a4180E35655I5013
13504b33803D53106j63161L2123J02834A20205i0118C70068K06885I4996R8508
13494A93504K84002A7584e003C73229j32555O3790K82438A65868l5667N5142R6057
13483B81400K60813B68861A19824P3772r2248J5347O94890l37937J36684k93339
13473C16993p7893j18461g8911A98456J55540A40630L94997B32068I6198a69064
13462C18889e1403B69983J50521j11647A52230J27584j02851F5556m889M33497
$$ plain form
13452 494164 167916 154497 369870 62459 411957 320018 114405 -47514 243763 411707
13442 411707 75618 53669 243932 221969 72282 220755 244722 295910 72660 609152 672093
13431 672093 71996 339528 217710 32597 27393 100174 168717 50670 514715 64338 103225
13420 103225 143276 204237 323714 -33697 202965 477382 482997 117558 -182687 -38989 28410
13408 -175414 494725 167798 144137 110731 229320 371062 140951 231139 84163 334306
13398 334306 297593 66385 269168 256541 -29025 178496 323820 214680 223475 160860 111134
13387 111134 231055 98082 108815 -66986 296913 170182 417048 331021 294867 -54640 39489
13375 344931 329488 458294 -15366 -99335 487682 190521 134618 138033 123906 419547 368420
$$ packed form
13452D94164A67916j3419K15373F2459L49498r1939A14405d7514B43763J67944
13442D11707G5618k1949J90263k1963G2282J48473K3967N1188G2660N36492O2941
13431F72093G1996K67532j21818C2597n204P2781O8543E0670M64045F4338L8887
13420A03225M0051O0961J19477c3697B02965K74417N615A17558a82687c8989B8410
13408a75414D94725A67798k3661l3406J18589J41742A40951R0188H4163K50143
13398C34306l6713F6385K02783j2627b9025A78496J45324j09140Q795o2615m9726
13387A11134J19921I8082J0733f6986B96913j26731K46866q6027l6154e4640C9489
13375C44931j5443J28806a5366q3969D87682A90521n5903L415j4127K95641n1127
$$ plain form
13364 368420 513688 269509 264295 101880 69039 251533 427213 337678 200252 62300
13353 279303 79500 220102 223797 311818 -150934 304709 9560 572826 -45892 243686 95260
13341 282690 128080 564819 213274 149237 463077 387933 46559 272180 171726 284042
13331 284042 223980 275846 130911 89958 120174 67998 230237 396881 231627 144125 115833
13320 115833 224409 361514 -51181 230524 416813 190346 406564 476375 41134 134968
13310 134968 157722 145999 65874 -2369 202844 70484 -92360 -78318 -102026 -22719 25599
13298 -4990 90362 733067 -56433 491306 14635 93806 -138114 154730 -135728 10337 315366
13287 315366 242951 9148 390932 217141 261994 239817 -120057 -66357 481649 177592 112999
$$ packed form
13364C68420J45268k44179n214A01880l2841J82494J75680q9535j37426F2300
13353B79303G9500J40602L695Q8021a50934C04709I560N63266d5892B43686I5260
13341B82690A28080M36739B13274o4037L13840p5144D6559K25621j00454J12316
13331B84042o0062N1866A30911m0953L0216n2176J62239J66644j65254q7502k8292
13320A15833J08576J37105e1181B30524J86289A90346K16218O9811D1134R3834
13310A34968K2754j1723F5874b369B02844G0484i2360J4042k3708b2719B5599
13298d990I0362O42705e6433D91306A4635P9171a38114A54730a35728A0337L05029
13287C15366p2415I148L81784j73791M4853k2177a20057N3700D81649A77592o4593
$$ plain form
13276 112999 603644 249764 127750 -207533 -221098 110215 -30396 142524 173917 307266
13266 307266 221660 255705 365533 -60775 326876 493514 -87976 249383 -91176 -176327 59954
13254 -133856 -145649 379824 355380 309477 -194465 -227123 121739 8016 189698 23045 110373
13243 110373 24001 229867 144073 184115 260964 245868 120649 202547 509240 -74609 176581
13231 440319 -232462 422287 -154442 279544 189008 -168599 194945 134027 85583 12660
13220 163562 265538 131564 133179 277523 127661 261742 75177 242757 129529 -39987
13209 -262688 73467 -130316 -6272 -234902 122204 235719 260004 75455 260980 -160698
13198 70422 -168376 46277 244632 -35492 338805 177985 319572 226384 40153 324606
$$ packed form
13276A12999M90645B49764j22014b07533j3565A10215c0396A42524L1393J33349
13266C07266q5606L4045J09828f0775C26876J66638h7976B49383i1176q5151E9954
13254a33856j1793C79824k4444m5903a94465l2658A21739H016J81682B3045Q7328
13243A10373B4001K05866q5794M0042P6849j5096A20649Q1898L06693g4609A76581
13231D40319b32462D22287a54442B79544r0536a68599A94945o0918m8444A2660
13220A63562J01976A31564J615J44344A27661J34081G5177J67580j13228c9987
13209b62688G3467a30316f272k28630A22204J13515K4285G5455J85525a60698
13198G0422a68376D6277J98355c5492C38805j60820J41587r3188D0153K84453
$$ plain form
13188 324606 285090 65567 103611 316578 278076 263208 247424 -227839 127824 132068 42197
13176 -78477 -28086 231786 7773 95634 216107 196943 -329038 -132555 -17578 82956 176290
13165 176290 -110359 133018 290062 110723 123905 489551 162289 14259 153604 54645
13154 307146 -98031 -215574 157910 -303572 205071 58400 85185 348931 -79 39197 121705
13143 121705 423110 257300 -24918 206356 355349 -48310 -137811 84689 258294 -381806
13132 -199177 272732 411524 237740 206560 -314200 -240039 147200 146971 26691 23616 162175
13121 162175 217403 287430 -109626 -128221 83652 87696 -188067 -193051 -25831 226456 -37707
13109 171425 138218 39 497365 184066 -60832 -66685 -105865 101624 122357 -227322 214343
$$ packed form
13188C24606l9516F5567L8044K12967l8502j4868j5784b27839A27824M244D2197
13176g8477b8086B31786G773Q7861J20473j9164c29038a32555a7578H2956R3334
13165A76290a10359A33018J57044A10723J3182L65646A62289A4259J39345E4645
13154C07146i8031j17543A57910c03572B05071E8400K6785K63746g9C9197Q2508
13143A21705L01405j65810b4918B06356J48993d8310q9501H4689J73605c81806
13132a99177B72732J38792j73784l1180c14200P4161A47200k29B6691l075J38559
13121A62175N5228P0027a09626j8595H3652M044a88067m984b5831B26456c7707
13109A71425l3207C9M97326A84066f0832n853l9180A01624K0733b27322B14343
$$ plain form
13097 -25797 188491 12626 -207243 245016 -249232 17403 302122 -170512 329978 87489
13086 414 210274 33811 171603 100659 63454 331331 63939 117837 61144 187949 149172
13075 149172 163433 -224610 -265328 171604 380677 85637 408463 -116880 356111 157348
13064 -3957 120495 241716 79944 -313381 -55619 277805 -52182 290837 -69728 1801 -310404
13052 264741 -4441 157866 -94162 105225 67522 -48103 82962 208486 -127665 98249 63311
13041 63311 -149349 103094 425 190857 119544 -212178 161494 -117751 274419 -135249
13030 250162 322279 -35291 -147819 -81070 33853 371355 427569 266160 249195 88640 313869
13019 313869 108757 415105 -360190 329113 -1353 -7425 32044 -205750 474529 -5602 359387
$$ packed form
13097b5797A88491A2626b07243B45016b49232A7403K84719a70512C29978H7489
13086D14K09860C3811J37792p0944l7205K67877F3939N3898n6693J26805l8777
13075A49172J4261b24610m0718A71604K09073H5637L22826a16880C56111A57348
13064c957A20495J21221G9944c13381e5619B77805e2182B90837f9728A801c10404
13052B64741d441A57866i4162A05225l7703d8103H2962J25524a27665I8249l4938
13041F3311a49349A03094D25J90432p1313b12178A61494a17751B74419a35249
13030B50162P2117c5291j12528O6749C3853L37502N6214j61409j6965H8640K25229
13019C13869A08757L06348c60190C29113a353o072C2044b05750D74529e602C59387
$$ plain form
13007 264782 295000 -27052 10678 -106826 -211847 132899 -97679 230005 405162 234828
12997 234828 166438 -35591 219735 536111 125574 152837 302223 12295 99922 33868 47835
12986 47835 -178699 130899 -293762 319744 118953 106232 -160074 93775 -335226 207028
12975 53642 73919 -60719 -119665 -141130 -128789 245041 91831 -109263 136064 118118 -198387
12963 276314 240239 43248 -113299 318341 -341854 152232 71080 -357895 63572 -13378
12952 36976 211038 -230301 75497 -96477 390273 202988 -152865 -136625 -105867 17570 -25123
12940 -29624 -68201 -53084 300334 179711 16110 202739 39759 -207859 -104502 44035 95073
12929 95073 -135292 29793 -147401 189508 76418 151708 -27891 -81857 -53659 94221 278805
$$ packed form
13007B64782L0218b7052A0678a06826j05021A32899i7679B30005J75157j70334
12997B34828o8390c5591B19735L16376A25574K7263J49386A2295Q7627C3868J3967
12986D7835a78699A30899b93762C19744A18953j2721a60074I3775c35226B07028
12975E3642K0277f0719n8946k1465J2341B45041I1831a09263A36064j7946a98387
12963B76314l6075D3248a13299C18341c41854A52232G1080c57895F3572a3378
12952C6976J74062b30301G5497i6477C90273j87285a52865J6240L0758A7570b5123
12940b9624l8577J5117C00334j20623A6110J86629C9759b07859J03357D4035N1038
12929I5073a35292B9793a47401A89508G6418P5290b7891n3966K8198I4221J84584
$$ plain form
12918 278805 126720 -252447 -95638 71677 147801 208241 -303829 -52934 -39800 -1412 -102724
12907 -102724 176200 46375 -71392 -55273 119846 -171409 42787 -113224 50888 -50198 156822
12895 -245540 176956 -55842 -980 157907 -103868 -151658 -29173 231187 234197 361241 -17216
12883 180645 -312935 -26377 -89212 26376 -171640 -81120 159899 119218 321893 50324 63851
12872 63851 165631 171422 67393 33030 -82587 -129473 228646 -69170 12136 76247 -24574
12860 -171048 -481343 239206 41097 -291928 143460 -102046 415714 197613 -289122 118638
12849 152999 -61889 34501 -35731 326612 34423 -55888 62866 342342 56970 196603 -37398
12837 -207773 -99896 57477 164123 122882 247110 -126616 88432 -510553 -83939 244129
$$ packed form
12918B78805A26720b52447i5638G1677P6124O0440c03829e2934J3134a412j01312
12907a02724A76200D6375g1392J6119A19846a71409D2787a13224E0888e0198A56822
12895b45540A76956e5842i80A57907a03868m7790b9173B31187L010J27044a7216
12883A80645c12935b6377o2835B6376a71640h1120A59899m0681K02675E0324J3527
12872F3851J01780N791F7393C3030h2587m6886B28646f9170A2136O4111b4574
12860a71048l10295B39206D1097b91928A43460a02046D15714A97613b89122A18638
12849A52999f1889C4501c5731C26612C4423e5888F2866K79476E6970J39633c7398
12837b07773i9896E7477J06646m1241J24228a26616H8432e10553h3939B44129
$$ plain form
12826 -8590 18899 -307532 150369 -101291 -195883 88218 16927 -162874 142541 450573 -278917
12814 88059 59079 62340 -100322 -353799 -200858 35440 197025 -153367 120127 134270 -44108
12802 -381054 -98483 299512 67417 378386 7992 297240 -162150 205740 -228209 -57278
12791 70892 34131 -173106 -38581 222610 -260254 237746 155357 124015 -61642 45284 309872
12780 309872 126265 137202 -73575 16138 -130838 -166372 -377562 268937 -116496 273823
12769 235094 -117064 135704 95768 -8466 338140 185182 260866 72281 27895 212095 180676
12758 180676 142649 109783 25109 -123177 115638 158694 -130390 201242 15023 -7925 -200952
12747 -200952 -25227 330260 278029 -93000 -182269 -228476 190403 330208 53200 82665 -96818
$$ packed form
12826h590A8899c07532A50369a01291r4592H8218A6927a62874A42541L08032b78917
12814H8059k8980L261a00322k53477J52941C5440J61585a53367A20127J4143d4108
12802c81054i8483B99512F7417L10969G992K89248a62150B05740b28209e7278
12791G0892C4131a73106c8581B22610b60254B37746q2389l1342f1642D5284K64588
12780C09872A26265J0937g3575A6138a30838l5534k11190B68937a16496B73823
12769B35094a17064A35704l9936h466C38140j52958P5684G2281B7895J84200l1419
12758A80676l8027l2866B5109a23177A15638M3056a30390B01242A5023g925j93027
12747b00952b5227C30260n2231i3000q9269m6207A90403J39805E3200K9465i6818
$$ plain form
12735 546221 227052 196540 361009 82717 96325 45911 87821 168929 9424 -238432 -4339
12723 14804 233813 -79204 176634 69961 164042 152137 -38892 326018 145917 356221 -100571
12711 341572 391041 319775 -45995 429490 382854 68873 138400 -60898 109438 -156254 -48316
12699 290159 85889 49066 -66712 276416 35832 -95191 263050 -56629 -5752 134548 71983
12688 71983 50608 -119917 -11512 -77469 -262670 528820 -11717 243689 -94200 205594 486628
12677 486628 110681 47983 493192 40961 377375 29357 4945 50559 136540 -130169 226585
12665 -276176 61976 -30606 -135946 39876 224582 120776 239917 93967 111574 186752 -124678
12653 67009 142796 -24471 -23508 -23495 294843 362111 45963 144816 -89204 188953 143069 108925
$$ packed form
12735E46221B27052l0512J64469H2717J3608D5911M1910Q1108I424b38432d339
12723A4804K19009g9204A76634F9961R4081j1905c8892C26018A45917K10304a00571
12711C41572M9469p1266d5995D29490m6636F8873O9527f0898A09438a56254d8316
12699B90159H5889l6823f6712B76416C5832i5191B63050e6629e752A34548o2565
12688G1983k1375a19917a1512o5957j85201E28820a1717B43689i4200B05594K81034
12677D86628A10681D7983M45209D0961L36414B9357D945M5614Q5981a30169B26585
12665b76176F1976c0606j05340C9876J84706j03806J19141I3967J7607P5178a24678
12653F7009P5787b4471R63J3B94843O7268D5963R8853h9204A88953m5884l4144
$$ plain form
12641 108925 -46198 -77638 368243 154897 16150 -239730 83327 -102217 -200245 154572
12630 227753 485519 -52272 -191199 287319 198269 -104458 14400 -38143 248894 -119575
12619 84096 -90452 323460 -1934 -253983 -16201 -309110 -201829 93664 385943 -244098 -250453
12608 -250453 91136 118091 -206233 296381 -51139 -17559 -354242 281140 56005 -31352 114436
12596 -115920 144648 -71740 35934 56090 218985 60525 119530 -121963 141366 252607
12586 252607 -329305 341149 -211083 76144 -50413 -72446 88203 76720 -161668 61315 221438
12575 221438 255990 -40497 -283304 83316 102026 21838 -142958 -168168 199676 202356 -207696
12563 -204360 -296036 310103 -196913 66279 -58272 249855 82639 53596 267206 415755
$$ packed form
12641A08925d6198l1440C68243A54897A6150b39730H3327a02217r8028A54572
12630B27753K57766e2272j38927B87319q9050a04458A4400c8143B48894a19575
12619H4096i0452C23460a934k52049a6201k92909J07281I3664K92279b44098o355
12608b50453I1136K6955b06233B96381e1139a7559l36683B81140E6005c1352A14436
12596a15920A44648g1740C5934K0156J62895F0525N9005a21963A41366J11241
12586B52607c29305C41149b11083G6144e0413k2033H8203j1483a61668F1315J60123
12575B21438L4552d0497k42807H3316J8710B1838a42958k5210A99676K680b07696
12563b04360r1676C10103a96913F6279e8272B49855H2639k9043K13610J48549
$$ plain form
12553 415755 -65231 -2015 24036 -142603 84823 -28582 -240191 197564 -54791 -72363 192171
12541 150515 98406 78093 185937 -279368 -167894 -29972 115060 233041 -120698 -124430
12531 -124430 106776 -16637 -312681 166381 139271 123847 175762 3508 121597 160139 76745
12519 18173 106812 169339 7092 -205369 125543 79139 145304 -146944 -99186 -66540 50372
12507 -53586 -142635 241303 187908 -161616 -130545 -80476 -115492 -68054 397078 -24482 461940
12495 270397 81942 -259840 203626 -221465 14613 328904 -165997 -92786 181234 -109299
12484 305546 -367192 49409 63593 -182380 -267600 -31411 -201005 76822 176736 -142569 -236881
12473 -236881 -21190 102958 339786 -190198 129827 158637 -94739 -226979 -93017 142279
$$ packed form
12553D15755f5231b015B4036a42603H4823b8582k11609A97564e4791j7572A92171
12541A50515n2109k0313J07844b79368J11474b9972A15060J17981a20698l732
12531a24430A06776a6637k96044A66381k7110j5424N1915C508J18089L8542G6745
12519A8173Q8639O2527G092b05369A25543m6404O6165a46944M7758L2646E0372
12507e3586q9049B41303n3395a61616L1071N0069l5016M7438C97078b4482D61940
12495B70397H1942b59840B03626b21465A4613L14291a65997P3211A81234a09299
12484C05546c67192D9409J4184a82380q5220c1411j69594G6822R9914a42569r4312
12473b36881b1190A02958K36828a90198A29827K8810i4739j32240i3017A42279
$$ plain form
12462 4045 -119094 -39436 384111 -328088 78039 225381 -342959 76212 -6947 157787 41938
12450 -53295 227993 145309 68540 60323 -122717 117177 -193245 -179721 -210258 24791 242868
12439 242868 -125031 -64923 286528 -80029 341372 -141530 -232470 -1868 -414240 187138
12428 163977 193059 223115 214941 125051 272931 -180862 -21330 92907 -35589 -224138 -45859
12416 117343 42707 136159 53879 395046 -137378 -139366 323056 99226 61779 -159169 -262311
12405 -262311 -57705 -150859 30064 -6175 151762 -221574 66795 56232 -87485 -148921 37780
12393 -273 93889 -306220 137777 227940 -215951 -18748 -58834 193981 90556 -359391 -34616
12381 194565 138644 -43133 295810 400352 342503 -273515 85426 -10194 17902 -51409 -189247
$$ packed form
12462D045a19094c9436C84111c28088G8039J47342c42959G6212f947A57787D1938
12450e3295B27993q2684F8540q217a22717A17177a93245J3524l0537B4791K18077
12439B42868a25031O0108B86528h0029C41372a41530r0940a868m12372A87138
12428A63977K9082L0056q174q9890J47880a80862b1330I2907c5589j88549d5859
12416A17343D2707R3452E3879L41167a37378j988C23056I9226l7447a59169j03142
12405b62311e7705r3154C0064f175A51762b21574F6795j0563h7485o1436C7780
12393b73I3889c06220A37777R0163b15951a8748m0086A93981I0556c59391c4616
12381A94565n5921d3133B95810J04542n7849b73515H5426a0194A7902e1409j37838
$$ plain form
12370 -189247 -154103 -322167 -33907 -112405 280077 167347 -12067 246640 -166305 -372822
12360 -372822 -394316 -139808 47358 -326218 384849 26457 352578 134429 -84738 424966
12349 -90301 -482037 -18047 -78324 34236 -17937 38459 49502 -125188 249170 321650 -19000
12337 -71529 35617 34070 148286 -112698 241313 -237477 -82267 39516 -291518 254221 74615
12325 173077 344142 -169650 252379 233789 -40714 197403 242808 -25 -49589 185736 -85146
12313 5617 5745 133505 -39411 6461 -21804 -37151 285125 293108 102494 -27331 -204707 207937
12300 -111754 98482 -78844 154288 229400 147118 -14015 -310701 50453 -27060 194625 -83769
12288 -240065 172601 112270 48026 317766 3731 341892 551542 286768 149487 -12578
$$ packed form
12370a89247L5144j68064c3907p8498B80077j12730a2067B46640a66305k06517
12360c72822k1494a39808D7358c26218C84849B6457L26121A34429h4738D24966
12349i0301l91736a8047o0277C4236a7937C8459J1043a25188B49170P2480a9000
12337g1529C5617j547J14216a12698B41313b37477h2267C9516b91518B54221G4615
12325A73077J71065a69650B52379j8590d0714A97403M5405b5m9564A85736h5146
12313E617J28J27760c9411F461b1804j5347B85125P983A02494b7331j77376B07937
12300a11754I8482g8844A54288P5112q2282a4015k96686E0453b7060A94625h3769
12288b40065A72601o0331D8026K69740C731L38161K09650k64774j37281a2578
$$ plain form
12277 -383189 102279 280010 33388 250838 -188017 365861 -51813 166373 122424 -191784
12266 309784 65620 -135272 -30658 74563 294900 133821 -76639 115557 210719 119433 -98090
12254 232399 59685 -34203 317410 -49310 -105783 156756 -251850 -7880 -30216 -281685 389260
12242 -391425 -39349 -262677 90912 -65223 91967 170089 61665 -52810 17215 -19683 386447
12230 -92878 440729 363787 402824 117088 249589 112395 132181 58021 467955 83692 141829
12219 141829 543557 136984 268559 331136 259596 134883 130281 206206 305587 243541 27989
12207 -183705 -347889 145186 -336 9014 -298891 343061 100641 477963 -15395 -4228 141673
12195 1286 188014 245773 252958 49612 441280 317390 74744 358954 -90773 258400 -238482
$$ packed form
12277c83189A02279J77731C3388K17450a88017C65861e1813A66373m3949a91784
12266C09784F5620a35272c0658G4563K20337A33821g6639A15557R5162r1286i8090
12254B32399E9685c4203C17410d9310n6473A56756b51850g880k2336k51469C89260
12242c91425c9349k23328I0912f5223I1967P8122F1665e2810A7215a9683C86447
12230i2878D40729p6942L9037A17088J32501A12395J9786E8021M09934H3692N8137
12219A41829M01728A36984J31575O2577p1540j24713m602P5925R9381o2046B7989
12207a83705j64184A45186c36I014b98891C43061A00641L77322a5395d228A41673
12195A286J86728N7759P185D9612L91668j23890G4744K84210i0773B58400b38482
$$ plain form
12183 290689 -406069 -31016 179668 -168294 80871 280285 35974 216614 -169213 -124167
12173 -124167 182748 522281 128794 121997 55846 78234 123848 -17675 -65666 134858 405450
12162 405450 -66623 349810 95952 -187929 -387351 213573 -47238 -87405 -16120 228317
12151 -190197 148809 448699 372129 242201 -70978 -67655 -40318 -52289 116505 167248 98503
12140 98503 299868 -106706 -207394 94190 -303982 -233928 -486432 -40266 -62041 23268 74068
12129 74068 168615 286669 198735 111512 -174820 142469 -214839 -69011 -54647 -138734 67003
12117 113255 169805 16083 252956 85253 229209 -182938 -127698 -94433 205015 344561
12107 344561 91191 -84743 -249969 -114597 27222 -189492 -122323 -88034 154218 119762 103491
$$ packed form
12183B90689d06069c1016A79668a68294H0871J99414C5974J80640a69213M5046
12173a24167A82748L39533A28794o797E5846K2388M5614a7675m7991A34858K70592
12162D05450f6623C49810I5952a87929j99422B13573d7238m0167a6120B28317
12151a90197A48809K99890p6570j29928g0978L323K7337j1971A16505N0743o8745
12140I8503K01365a06706j00688I4190c03982P0054k52504d0266k1775B3268N0800
12129G4068R4547J18054q7934q7223a74820A42469b14839f9011J4364q4087F7003
12117A13255N6550A6083K36873H5253J43956a82938N5240L3265B05015J39546
12107C44561I1191h4743j65226a14597B7222a89492O7169L4289A54218l4456j6271
$$ plain form
12096 103491 -191018 -146908 127503 -274894 -61661 -115329 -252490 185113 -174373 325644
12085 217214 170852 -65886 347225 40755 215189 249005 305522 399243 87623 -94923 76237
12073 70155 50323 407795 527510 937720 1233775 1075200 329310 122598 232084 -184793
12062 -24035 218283 -38514 43383 250641 -120550 -143272 -212679 154699 -182644 217499
12051 -61361 138378 243646 -231776 161664 -287779 -181159 -134895 249373 -22668 -17587
12041 -17587 178990 71718 -642956 -142413 -81324 279173 125397 -283607 -187706 -18008
12030 141789 -93250 -112285 23250 47666 -17749 -315383 -306691 -203166 -124216 165134 -273234
12018 -303215 209058 -194275 103747 8012 -163877 -256635 -89142 -31294 62238 -383114 -32585
$$ packed form
12096A03491a91018M4110A27503b74894f1661n3668j37161A85113a74373C25644
12085B17214m6362f5886C47225D0755J74434L3816N6517R3721H7623i4923G6237
12073G0155j9832L57472J19715M10210K96055j58575C29310A22598J09486a84793
12062b4035B18283c8514D3383K07258a20550k2722o9407A54699a82644B17499
12051f1361A38378J05268b31776A61664b87779J06620M6264B49373b2668N081
12041a7587A78990G1718f42956a42413O1089B79173A25397b83607R5901a8008
12030A41789i3250j9035B3250K4416a7749k97634Q692J03525P8950A65134b73234
12018c03215B09058a94275A03747H012a63877r2758h9142c1294F2238c83114c2585
$$ plain form
12006 -173909 86123 177430 107604 -111588 49524 -10232 3054 281397 -25033 27195 -209616
11994 41216 -298184 195193 -26942 -302900 -562453 105769 197589 -11990 113108 -103939
11983 -14163 72753 -42863 68341 -67068 -253890 -204757 -25780 306895 -225101 156492 -123561
11971 102802 -45753 -278582 89100 -98447 183693 131518 -243279 27408 -243110 211316
11960 232982 -15994 123761 68579 58898 53273 -330092 -236518 -90617 254910 165122 154402
11949 154402 89739 -467889 -76808 -38095 -21914 -44682 -76853 181573 371084 -221575 164805
11937 94174 47339 -191867 -244604 -52337 391814 -170030 119316 33178 176719 66355 20994
11925 61951 23457 -171505 -114289 -116252 64582 61126 162035 327505 123925 -2048 303046
$$ packed form
12006a73909H6123R1307o9826a11588D9524a0232C054K78343b5033B7195b09616
11994D1216b98184A95193b6942k75958k59553A05769R1820a1990A13108a03939
11983a4163G2753d2863F8341f7068j86822M9133b5780C06895b25101A56492a23561
11971A02802d5753k32829H9100i8447A83693n2175b43279B7408b43110B11316
11960B32982a5994A23761n5182r681n625c30092R3574i0617B54910q9788j0720
11949A54402o4663d67889g6808c8095J6181k2768l2171A81573J89511b21575A64805
11937I4174m6835a91867n2737e2337C91814a70030A19316C3178J43541F6355B0994
11925F1951B3457a71505N7216j963F4582l456J00909J65470A23925b048C03046
$$ plain form
11913 -207542 -211025 204689 321597 -136804 -245088 -46334 -60098 -166077 -162543 -50605 214732
11901 -150232 -77792 82088 -25882 84285 -84063 58754 -347139 17239 -112771 -36629 90446
11889 -177941 -10972 34161 288327 -127641 -304928 -448559 202879 62129 -106022 -61993
11879 -61993 -87658 20173 161284 69979 -234731 -32835 -131703 -94066 -58836 -380225 56974
11867 -375420 -352552 171045 249806 -64461 -29625 -357966 -32612 219236 -58644 -232689 -291248
11856 -291248 -9374 -80560 -4535 122991 16818 123556 -235936 -113475 334598 -107710 80193
11844 151444 273162 38547 -286703 -38425 -182869 -95265 -217090 -284691 -17387 -351388
11834 -351388 -202534 160983 40784 -358134 295923 -71723 81218 210942 -141539 -4672
$$ packed form
11913b07542l483B04689J16908a36804j08284d6334j3764j05979L534e0605B14732
11901a50232P2440H2088b5882H4285h4063E8754c47139A7239a12771c6629I0446
11889a77941a0972C4161K54166a27641j77287j43631B02879F2129a06022M4029
11879f1993k5665B0173J41111F9979b34731c2835r8868L7637L5230l21389E6974
11867c75420K2868A71045P8761f4461b9625l28341c2612B19236e8644j74045n8559
11856b91248i374p1186d535A22991A6818J06738b35936a13475C34598a07710H0193
11844A51444J21718C8547b86703c8425j44444Q7604j21825o7601a7387l34001
11834c51388J48854A60983D0784c58134B95923g1723H1218J29724a41539d672
$$ plain form
11823 -197261 -411453 -203145 171814 -33058 -237130 -206661 -223557 48097 78236 168389 48538
11811 -127036 431944 -326230 193432 -143965 194412 110773 150270 -78044 246403 30178
11800 116831 -299732 -207741 -139840 106921 -133183 -65 202090 331269 -36094 104572 -140561
11788 234649 11955 6508 -26832 17804 45879 584041 -219645 114938 -47310 174123 95344
11777 95344 -39366 55186 80463 341611 322911 298390 -197410 -28056 -49200 -322088 -92757
11765 -16803 225458 52785 150325 5936 -79227 -166464 -91768 -97653 29930 52938 -156826 8344
11752 235747 226968 -23901 122691 182825 206430 -340203 225892 195485 -49804 35093 13241
11740 53313 50171 227500 -385269 -50203 438023 -155835 283502 -179934 -34982 -68638 186277
$$ packed form
11823a97261k14192b03145A71814c3058k04072L0469j6896D8097L0139R0153D8538
11811a27036D31944c26230A93432a43965A94412q3639L9497g8044B46403C0178
11800A16831b99732R1991O7901A06921a33183f5B02090J29179c6094A04572a40561
11788B34649A1955n447b6832A7804K8075N38162b19645A14938d7310A74123p8779
11777I5344c9366E5186K5277K61148j8700k4521a97410b8056k1144k72888i2757
11765a6803B25458E2785R7540E936g9227q7237P4696n885B9930K3008a56826H344
11752B35747q779b3901A22691O0134K3605c40203B25892l0407d9804C5093A3241
11740E3313l142J77329c85269e0203D38023a55835B83502a79934c4982l3656A86277
$$ plain form
11728 -4200 -72731 117847 181499 -114005 -143127 -100003 -75527 -409244 26576 -192286 -22470
11716 118210 23119 54012 -146146 17651 -194413 53059 -10106 -157362 63262 -102498 94687
11704 75655 104535 31545 -346737 -113591 107323 28114 101619 -268427 196099 368758
11694 368758 159178 314756 -20415 155938 142641 -24799 226500 263003 -66923 524863
11683 -136997 94730 -90251 73221 -13309 80625 183796 305431 1207 -251576 -348157 84751
11671 76320 -44384 213938 196013 93917 151858 1621 -118215 101198 -32797 101558 -56886
11659 62567 134651 102357 186658 13845 263461 5019 -138935 409412 30787 -94528 -217142
11648 -217142 81250 122997 217382 48061 14276 277800 164137 109798 -105722 -181305 -277915
$$ packed form
11728d200o8531A17847O3652a14005k9122M3124K4476l33717B6576a92286b2470
11716A18210B3119L0893a46146A7651a94413E3059a0106j47256F3262a02498I4687
11704G5655K8880C1545c46737a13591A07323B8114P3505b68427A96099J72659
11694C68758A59178J55578b0415A55938j3297b4799B26500L6503f6923E24863
11683a36997I4730i0251G3221a3309H0625J03171J21635A207b51576r6581H4751
11671G6320d4384B13938j7925I3917N7941A621a18215A01198c2797A01558e6886
11659F2567P2084l2294Q4301A3845K49616E019a38935D09412C0787i4528j22614
11648b17142H1250M1747R4385D8061A4276K63524j13663n4339a05722p5583r6610
$$ plain form
11637 -277915 291999 164017 148894 65045 84995 22231 -105995 66145 300228 99949 -279646
11625 152714 135958 299828 -221138 -154390 75235 204368 -243286 -52158 125842 -146947
11614 -252200 141818 66688 403447 -247385 103929 137241 122259 -165395 168580 62751
11603 -211701 -66151 -173925 77892 154632 44976 25128 215064 -198601 -428889 -82321 -193766
11592 -193766 347403 54445 -173234 -68760 -201314 -51340 -17800 217508 261730 -54047 46099
11580 181528 238789 -18217 141816 167840 116345 -100832 187961 -345229 -338508 -40440 254070
11568 46777 -40380 -74777 355288 -42717 -156927 449623 -27639 58955 62234 -6434 356578
11556 7738 179742 -42420 -185096 -33545 141141 -252830 153302 69767 -136871 -225096 398784
$$ packed form
11637b77915B91999j27982j5123F5045J9950B2231a05995F6145K34083I9949b79646
11625A52714j6756J63870b21138O6748G5235J29133b43286e2158A25842a46947
11614b52200A41818F6688L36759b47385A03929L3312j4982a65395A68580F2751
11603b11701f6151j07774G7892P6740D4976j9848J89936a98601k30288h2321j11445
11592a93766C47403E4445a73234f8760j32554e1340a7800B17508M4222e4047D6099
11580A81528N7261a8217A41816K6024n1495a00832A87961c45229O721d0440B54070
11568D6777d0380l4397C55288d2717j14210D49623b7639E8955L279f434C56578
11556G738J72004d2420j42676c3545A41141b52830A53302F9767a36871q8225C98784
$$ plain form
11544 -3425 49199 254233 -124105 -162025 55321 12059 200136 122436 49926 116049 -160478
11532 268302 343469 -82615 -207851 -68995 233410 131718 -287256 349474 101337 399283
11522 399283 152381 -246411 18401 128845 217706 95805 99579 -46755 62382 80923 189987
11511 189987 165184 -27389 -305935 -153331 -166701 120191 -40749 162095 311501 -161276
11500 364373 352091 -76876 44877 203076 184215 258636 48912 -28741 47252 -127582 -331115
11489 -331115 395961 -85087 220479 54384 264240 158134 -105391 112338 42718 -163911
11478 39750 139463 37855 -251330 508747 279269 -178088 67466 -48654 12562 302923 197447
11467 197447 133527 165747 240705 -19533 45363 -17354 241649 28306 76827 82561 -263168
$$ packed form
11544c425D9199K05034a24105l7920E5321A2059J88077p7700D9926O6123a60478
11532B68302P5167h2615j25236f8995B33410j01692b87256C49474A01337K97946
11522C99283A52381b46411A8401J10444Q8861I5805L774d6755F2382J8541J09064
11511A89987k4803b7389k78546J52604j3370A20191d0749A62095J49406a61276
11500C64373j2282g6876D4877J58199j8861P4421D8912b8741D7252a27582k03533
11489c31115C95961h5087B20479E4384K09856j06106a05391A12338D2718a63911
11478C9750R9713C7855b51330E08747k29478a78088F7466d8654A2562K90361j05476
11467A97447o3920L2220P4958a9533D5363a7354B41649B8306M8521N734b63168
$$ plain form
11455 229143 1189 82296 246942 -63893 24187 64965 244055 272144 4527 -30252 -41236
11444 -41236 230840 446077 11966 363333 101546 -9924 158513 84141 466383 -125702
11433 97665 -32138 56772 -58855 151026 -69121 -154826 31325 -17895 -272569 -77039 -141599
11422 -141599 242969 -42358 45138 -38523 -119760 -238563 -20652 25875 -171420 65186 -195202
11410 10417 -14975 -161356 -239465 -130138 6666 130744 275170 -118461 431230 170183
11399 -20529 140841 171925 60490 377116 -132923 -50326 40423 -193828 -101917 10708 38260
11388 38260 104983 -25855 186311 -79949 100817 41435 -290650 -361017 -71309 59202 105403
11377 105403 -99385 -4006 -51601 -40336 -270404 -330549 -334543 25005 -57179 288746 17365
$$ packed form
11455B29143A189Q1107J64646f3893B4187M0778J79090K8089D527c0252j0984
11444d1236B30840K15237A1966L51367A01546i924A58513p4372L82242a25702
11433I7665c2138E6772e8855A51026f9121q5705C1325a7895k54674g7039o4560
11422a41599B42969d2358D5138c8523q1237j18803b0652B5875a71420F5186a95202
11410A0417a4975j46381p8109J09327F666J24078J44426a18461D31230A70183
11399b0529A40841L1084F0490L16626a32923e0326D0423a93828R1911A0708K7552
11388C8260O6723b5855A86311g9949A00817D1435b90650p0367g1309E9202M6201
11377A05403i9385d006m7595J1265k30068o0145l994B5005e7179B88746A7365
$$ plain form
11365 26241 -101633 -14958 282364 172043 199315 102105 90168 445043 -7657 489650 294384
11354 294384 -293922 -114933 -156745 111377 -83743 -111893 -84285 -65511 56731 -70917 207617
11342 -137958 -52514 -17525 -25795 -236651 -89472 321642 -227357 193343 -245093 87643 -270776
11330 88790 132294 -191971 -12293 -84795 -276090 118436 459854 110728 55396 -546318
11319 -258723 -333718 -249577 262256 -178647 79837 5534 -168010 67539 -121080 -46029 -145942
11308 -145942 239064 -255519 142314 -243930 -182661 299452 -23139 -183928 338202 -147759
11297 -207348 -168207 196615 -37860 -315343 -157517 168192 322588 -331433 128040 218130
11287 218130 -291300 -12518 3028 -239171 34205 292213 201419 100468 -246844 -41263 175086
$$ packed form
11365B6241a01633a4958B82364j10321K7272r7210j1937L54875g657D89650j95266
11354B94384b93922a14933m1812A11377h3743k8150K7608J8774E6731g0917B07617
11342a37958e2514a7525q270k10856h9472C21642b27357A93343b45093H7643b70776
11330H8790M3504a91971a2293p2502j91295A18436L41418A10728n5332e46318
11319b58723p4995Q4141B62256a78647G9837E534a68010F7539a21080d6029r9913
11308a45942B39064b55519A42314b43930O1269B99452b3139j60789C38202a47759
11297b07348L9141A96615c7860k77483a57517A68192J54396c31433A28040R0090
11287B18130b91300a2518C028b39171C4205K58008r0794A00468b46844d1263A75086
$$ plain form
11275 -193451 45324 -287433 -36438 -253995 27449 -201878 176484 -145482 92933 -166562
11264 -45409 34781 218805 24089 -5147 -37414 -92031 -81635 187243 163029 141923 -193290
11252 -212033 349966 28050 -289923 246496 -125482 -102945 106064 -109847 189340 104364
11242 104364 31494 111487 422317 -181289 -82638 39594 1437 6360 -196951 -121648 334382
11230 62383 -1352 -175240 -249027 -327983 70795 -27877 396683 108379 -242631 -43983 -25298
11219 -25298 -247492 285539 199726 89254 -60613 10718 46445 -259589 -86845 -168014 4262
11207 112503 -132901 -315073 37232 -206120 -92625 -339 -14374 -197121 -306858 72144 -108558
11195 -231650 197547 158865 -263849 191859 234203 332695 83777 -190457 -139839 -129872 -446199
$$ packed form
11275a93451D5324b87433c6438k17557B7449b01878A76484a45482I2933a66562
11264d5409C4781J84024B4089e147l2267n4617J0396A87243k4214k1106a93290
11252b12033C49966B8050b89923B46496a25482K2537A06064a09847A89340q4976
11242A04364C1494P9993L10830a81289h2638C9594A437M923a96951P5303C34382
11230F2383a352j73888p3787p8956G0795b7877C96683A08379b42631d3983J8685
11219b5298k22194B85539q5813H9254f0613A0718L5727b59589h6845q1169D262
11207A12503a32901j82172C7232b06120i2625c39j4035j82747j09737G2144a08558
11195b31650A97547l8682b63849A91859M2344R8492H3777a90457N0618R967l16327
$$ plain form
11184 -446199 319695 44126 384744 -97013 -176823 -96227 59185 -75336 459926 -46761 -384666
11173 -384666 38530 -240381 -593956 -193443 24300 -183807 293532 -234851 74841 -140518
11162 -117618 -118175 -191673 -449261 -136514 93358 67579 -368602 -41905 134381 317713 400735
11151 400735 9807 119621 108702 -37850 -103207 49068 -80888 -198872 79004 189140 -208242
11139 -92549 -128265 -246001 -178894 71874 -202884 90865 121077 19865 -423489 9531 33316
11128 33316 -31235 -83904 112065 442086 176498 -299006 -139981 -132137 -20155 -214795 30336
11116 82127 -82273 77467 168080 255905 -72775 118262 -286448 -189680 151542 -193260 409379
11104 267265 11755 -48392 -29677 299164 427049 267173 441336 555369 212495 52563
$$ packed form
11184d46199C19695D4126L40618i7013p9810Q0596E9185g5336D59926d6761l37905
11173c84666C8530b40381l53575a93443B4300a83807B93532b34851G4841a40518
11162a17618n57p3498k57588a36514I3358k5779c68602d1905A34381J83332Q3022
11151D00735I807J09814j0919c7850o5357D9068h0888j17984G9004J10136b08242
11139i2549l5716j17736O7107G1874b02884I0865L0212A9865d23489I531K3785
11128C3316c1235n2669A12065L30021A76498b99006a39981P844b0155j94640C0336
11116H2127h2273G7467R0613Q7825g2775A18262b86448R6768A51542a93260D09379
11104B67265A1755d8392J8715B99164J27885j59876J74163J14033B12495E2563
$$ plain form
11093 408533 139024 251669 140801 26344 333661 417520 6648 159053 328163 318337 58113
11081 -20330 -20423 417260 -37538 357403 81858 208674 312461 172662 75927 102328 483705
11070 483705 249798 188129 496321 372753 197500 359147 255925 68186 193440 207611
11060 207611 562432 475173 642827 911729 392946 647101 719331 331691 565357 710991
11050 710991 452776 804843 751045 783710 559926 645927 823044 773949 783105 501932 1057644
11039 1057644 516380 494431 619133 398041 455863 494825 914444 838976 629000 830260
11029 830260 718759 862971 835726 975982 705606 1012749 332590 593583 729178 461712
11019 461712 614895 691579 692957 550524 886365 704867 810403 603686 375612 679000
$$ packed form
11093D08533A39024J12645j10868B6344L07317Q3859F648J52405J69110r826E8113
11081b0330r3D17260c7538C57403H1858J26816J03787j39799G5927K6401L81377
11070D83705k33907o1669L08192j23568j75253J61647j03222F8186J25254J4171
11060B07611L54821q7259J67654K68902C92946K54155P2230C31691K33666J45634
11050G10991k58215L52067n3798L2665k23784Q6001J77117m9095R156k81173N55712
11039A057644E16380k1949J24702k21092N7822L8962M19619p5468k09976K01260
11029H30260j11501J44212k7245J40256k70376L07143C32590K60993J35595k67466
11019D61712J53183P6684J378j42433L35841j81498J05536k06717k28074L03388
$$ plain form
11009 679000 697716 798265 416926 838221 647010 576205 700482 568579 525051 950706
10999 950706 898973 803276 718776 845150 621274 1218281 640846 668213 599441 890345
10989 890345 749343 889826 1153058 866596 1116848 977512 986182 1497849 1394892 1510303
10979 1510303 1253000 1612464 1584891 1724739 2676740 2612917 2832684 2923222 3051074 3003566
10969 3003566 2876350 3033724 2656175 2260987 2155012 2002233 1700215 1480121 1346597
10960 1346597 1729789 1616154 1783645 1775340 1570919 1543754 1549387 1137292 857601 851012 675755
10949 675755 697569 658882 567028 458944 214167 338160 283193 159523 493504 284444
10939 284444 467828 373664 -66770 230919 -19925 121869 -144315 161242 264164 86647
$$ packed form
11009F79000J8716J00549l81339M21295j91211p0805J24277j31903m3528M25655
10999I50706n1733r5697q4500J26374k23876N97007n77435K7367o8772K90904
10989H90345j41002J40483K63232k86462K50252j39336Q670N11667j02957J15411
10979A510303k57303L59464k7573J39848R52001o3823K19767R0538J27852m7508
10969C003566j27216J57374l77549l95188j05975j52779l02018k20094j33524
10960A346597L83192j13635J67491q305k04421k7165N633m12095k79691o589j75257
10949F75755K1814l8687r1854j08084B14167J23993n4967j23670L33981k09060
10939B84444J83384r4164f6770B30919a9925A21869a44315A61242J02922H6647
$$ plain form
10928 74566 -205590 141623 175647 -65228 77211 -57218 -138675 38890 -81242 186898 54022
10916 -176227 -191000 203987 406271 -60583 -46948 291121 -301939 -312980 371478 -11575
10905 -155426 184273 97867 64957 -150057 -323896 -237004 127708 -96529 -84337 -175787 392229
10893 -21561 -201457 -156606 -30505 -6376 -137541 41601 249266 -64713 -64409 -67975 -291639 -163055
10881 -163055 27145 72348 -164375 72856 -36170 -344213 -382254 -45371 83503 -314194 167098
10869 67953 56643 69909 -20286 169999 194990 -519582 -3891 123146 -4524 19689 291057
10858 291057 50790 -36717 239399 91120 29164 101927 -531597 24572 64888 -71878 150321
10846 -108308 153731 312013 -86895 -34964 254831 -77990 -6378 12715 -68439 28250 -52162
$$ packed form
10928G4566b05590A41623L4024f5228G7211e7218q1457C8890h1242A86898E4022
10916a76227j4773B03987K02284f0583J3635B91121c01939j1041C71478a1575
10905a55426A84273q6406l2910a50057j73839Q6892A27708i6529J2192r1450C92229
10893b1561j79896M4851c0505f376j31165D1601K07665f4713L04l566k23664J28584
10881a63055B7145M5203a64375G2856c6170l08043l8041d5371H3503c14194A67098
10869F7953j1310J3266b0286A69999K4991e19582c891A23146d524A9689K71368
10858B91057E0790c6717B39399I1120B9164P2763e31597B4572M0316g1878A50321
10846a08308A53731J58282h6895c4964B54831g7990f378A2715f8439B8250e2162
$$ plain form
10834 -113630 106235 -106303 -165531 -107796 -216357 126691 -33336 -271114 1389 174440
10824 174440 -144488 118158 -214395 160734 -406037 -182776 -20896 101038 200826 -159896
10813 -123868 -69813 121337 55440 -449481 -251265 35546 -46341 256595 357668 -112172
10802 -203039 -291427 -177554 45070 -43689 -241511 -57774 104766 -3537 -173826 44669 2353
10790 262103 -108280 -96238 101531 -160682 -49991 33795 -78095 153691 167326 -253632
10779 228423 -56294 28864 -19465 -142842 -65361 242251 193265 -368391 46717 -45941 2346
10767 -210909 251473 223499 107570 51067 -457667 86390 64449 -11282 13433 72354 43299
10756 43299 -387245 -409086 344696 -53005 -5397 -128146 -331169 -94594 -109081 -132837 -13020
$$ packed form
10834a13630A06235a06303n9228N7735j08561A26691c3336k37778A389J73051
10824A74440a44488A18158b14395A60734d06037a82776b0896A01038R9788a59896
10813a23868N4055A21337E5440d49481J98216C5546d6341B56595J01073a12172
10802b03039q8388J13873D5070d3689j97822e7774A04766c537j70289D4669B353
10790B62103a08280J2042A01531a60682d9991C3795g8095A53691J3635b53632
10779B28423e6294B8864a9465j23377f5361B42251m8986c68391D6717d5941B346
10767b10909B51473k7974A07570E1067d57667H6390k1941a1282A3433N8921k9055
10756D3299c87245k1841C44696e3005e397j22749k03023i4594j4487k3756a3020
$$ plain form
10744 -62169 -70226 -274120 -38967 63809 -21099 72794 84102 -391833 304861 -30880 -32553
10733 -32553 -186789 -112986 -4362 -160476 -205349 14997 -99876 -362259 253065 247040 -201665
10721 -11205 -41859 23896 -26562 -254071 -152108 -30345 -151175 280285 170085 -316263
10710 -77270 -145462 50938 -106268 -111928 -112055 -184753 -190964 217980 -165888 368523 51546 -276001
10697 -54671 -139310 -94232 -130911 -56028 -99296 -142785 131063 219028 60700 -14100 50903
10685 361321 -144336 153955 -307760 207404 -84592 209923 -193863 -132540 -177642 -261702
10675 -261702 305610 211613 -238685 -223633 -39920 -54283 57003 -70312 -53413 333600 -196511
10663 -120677 -74798 157742 -157900 -284282 -167635 16406 58822 13174 -313040 -177676
$$ packed form
10744f2169q057k03894c8967F3809b1099G2794J1308c91833C04861c0880j673
10733c2553j54236P3803d362j56114m4873A4997i9876k62383B53065o025b01665
10721a1205l0654B3896b6562k27509J01963c0345j20830B80285j10200c16263
10710g7270o8192E0938a06268n660j27p2698o211B17980a65888C68523E1546b76001
10697e4671q4639M5078l6679e6028m3268m3489A31063Q7965F0700a4100E0903
10685C61321a44336A53955c07760B07404h4592B09923a93863O1323m5102q4060
10675b61702C05610r3997b38685J5052c9920j4363E7003g0312J6899C33600a96511
10663a20677M5879A57742a57900j26382J16647A6406M2416A3174c13040J35364
$$ plain form
10653 -177676 -438820 -9744 55579 89769 -235359 275691 -78619 -3281 212679 -6081 -33906
10642 -33906 -141312 -100486 -114598 38360 -351438 -426182 -173331 135278 -174375 45454 -176370
10630 195636 10255 -392108 100322 -142957 -267713 262877 -308 -3891 -109145 -189093 -7300
10618 -311219 -31442 -104676 -88959 36385 -344088 -160449 138681 351871 -75662 -180576
10608 -180576 -44253 -82027 89075 -63426 -274451 -290108 -30553 -203520 -234553 111598 969
10596 -145211 -2359 41323 42469 -87482 324393 -106847 340925 -17890 7496 -150955 -123577
10585 -123577 -198360 -144896 -4926 -210858 -47012 -339544 192788 100495 -70878 50867 109566
10574 109566 211165 -267909 -35378 113252 50431 -97317 72387 13868 105767 52623 219127
$$ packed form
10653a77676k61144i744E5579L4190b35359B75691g8619c281B12679f081k7825
10642c3906j07406M0826j4112C8360c51438p4744a73331A35278a74375D5454a76370
10630A95636A0255c92108A00322a42957j24756B62877c08l583j05254p9948g300
10618c11219c1442p3234J5717C6385c44088a60449A38681K13190g5662j04914
10608a80576d4253l7774H9075f3426k11025j5657c0553j72967l1033A11598I69
10596a45211b359D1323J146h7482C24393a06847C40925a7890G496a50955K7378
10585a23577p4783N3464d926k05932d7012k92532A92788r2293g0878E0867N8699
10574A09566J01599b67909c5378A13252E0431i7317G2387A3868R1899E2623J66504
$$ plain form
10563 219127 -206577 -143938 -204170 18265 -115386 17507 -347396 -100913 5548 -223214 77682
10551 -286732 26839 -264489 -49361 23237 -164856 59191 -196889 201812 -85618 104240
10540 -243897 -386860 -27667 226563 -174336 -410754 -19270 253102 -18199 40843 -146669
10529 -114703 253996 -210297 -65919 -252361 -47270 -9952 -118877 -85109 248703 -108060
10518 5746 13344 -191712 95312 143271 106373 3570 189090 -29864 -243973 179248 -8816 -323930
10506 -323930 321942 10431 -48304 -155325 3318 3130 254195 99800 -20681 -21849 123792
10494 123301 -46788 -83831 208295 383147 258122 319292 153666 197786 -147234 322516
10483 43186 540375 183876 455333 210065 361632 327968 128523 361934 155668 25637
$$ packed form
10563B19127b06577O2639o0232A8265a15386A7507c47396a00913E548b23214G7682
10551b86732B6839b64489d9361B3237a64856E9191a96889B01812h5618A04240
10540b43897j42963b7667B26563a74336k36418a9270B53102a8199D0843a46669
10529a14703B53996b10297f5919j86442d7270i952j08925L3768B48703a08060
10518E746P598a91712I5312M7959l6898C570J85520b9864k14109A79248h816l15114
10506c23930C21942A0431d8304j07021C318j88K51065I9800b0681j168A23792
10494A23301d6788l7043B08295J74852j25025O1170A53666M4120a47234C22516
10483D3186M97189A83876K71457B10065J51567l3664A28523K33411A55668B5637
$$ plain form
10472 344962 278706 -19550 304950 -83185 -68234 133902 267582 19296 -97095 102046 -114736
10460 24052 80385 -303381 25366 -34441 -100117 -176183 5117 -265539 -160657 -5767 158435
10448 -89979 110795 -186072 -243143 -154896 -94047 94262 70031 33199 -319972 -256578 420598
10436 165921 -104588 40398 10259 -272648 -152276 -137646 -335090 -60411 47094 -245560
10425 80794 -61996 -419019 -242773 121648 -32049 -125660 -43532 91373 -172278 -235930 -299942
10414 -299942 -15482 87071 -163826 -97586 73753 -136652 58304 222012 -271339 -71468 -256407
10403 -256407 -300860 427929 262770 -83582 -403424 206284 106750 -150744 489690 146838
10392 -124341 415325 130126 78463 -44916 150674 102690 242175 65493 -49914 -238956
$$ packed form
10472C44962o6256a9550C04950h3185J4951A33902J33680A9296i7095A02046a14736
10460B4052N6333c03381B5366c4441o5676p6066E117b65539J04882e767A58435
10448h9979A10795a86072n7071Q8247O0849I4262k4231C3199c19972O3394D20598
10436A65921a04588D0398A0259b72648J20372J4630j97444f0411D7094b45560
10425H0794f1996l57023J76246A21648c2049r3611d3532I1373a72278o3652o4012
10414b99942a5482H7071a63826O6240G3753a36652E8304J63708b71339g1468j84939
10403b56407m4453D27929j65159h3582l19842B06284r9534a50744D89690A46838
10392a24341D15325A30126n1663d4916A50674m7984J39485F5493d9914j89042
$$ plain form
10382 -238956 87662 211244 179187 428092 362387 286815 153164 234213 78122 305087 196877
10371 196877 377244 126136 423258 213587 232473 196601 629189 735882 604756 283
10360 232815 295433 370169 211024 246499 233924 109216 231325 767018 343916 271240
10350 271240 837767 601138 674003 203126 -46113 605276 281583 283148 234889 569027
10340 569027 -28919 102714 131896 78591 481465 406870 128358 36555 168423 8730 -1418
10328 102818 126434 -178398 265370 -108175 -103764 193277 -53160 62799 125371 569285 130644
10316 238122 459977 196901 3575 142585 -225077 287644 -84175 57275 81719 -169260
10305 216637 -99083 -81339 -163123 41112 -221397 131210 265705 133628 133840 -107666 133207
$$ packed form
10382b38956H7662J23582l2057K48905o5705p5572j33651Q1049G8122K26965j08210
10371A96877J80367A26136K97122k09671J8886l5872M32588J06693j31126B83
10360B32815O2618P4736j59145L5475j2575A09216J22109N35693C43916p2676
10350B71240N66527k36629P2865B03126d6113F05276B81583J565m8259L34138
10340E69027b8919A02714K9182n3305M02874p4595A28358C6555J31868H730a418
10328A02818K3616a78398B65370a08175M411A93277e3160F2799O2572M43914A30644
10316B38122K21855A96901C575J39010b25077B87644h4175E7275K4444a69260
10305B16637i9083J7744q1784D1112b21397A31210J34495j32077K12a07666A33207
$$ plain form
10293 217374 -288156 84378 62660 272192 118724 -290087 -72709 -23752 49369 -39000 -116167
10282 -116167 -384658 86656 -84102 -24927 228648 24361 10852 50323 94459 -125175 -186234
10271 -186234 68143 -137746 -8181 -135361 -136907 36424 217858 -72702 -117974 313107 60214
10259 195354 149911 241783 128513 247729 256529 29595 122022 -90772 178210 -65466 -95832
10248 -95832 -51673 167574 -137159 -155446 -231507 -252923 85417 -178323 -57194 -177210 -420964
10237 -420964 -130047 -260144 -577 296538 210461 -5739 -161538 -67522 -274889 -407898 -127517
10225 -122199 -208379 -320438 7186 -231694 -38261 -111571 37931 -137636 124948 241230 -88611
10213 -28924 -124312 -72439 45626 375005 -291239 -377293 205048 -176825 82996 -71785 277350
$$ packed form
10293B17374b88156H4378k1718K09532A18724b90087g2709b3752D9369c9000p7167
10282a16167k68491H6656h4102b4927B28648B4361A0852L9471M4136a25175o1059
10271a86234F8143a37746h181j27180j546C6424J81434g2702m5272C13107F0214
10259A95354m5443R1872j13270J19216Q800B9595R2427i0772A78210f5466l0366
10248i5832M4159A67574a37159j8287p6061k1416H5417a78323e7194j20016k43754
10237d20964a30047j30097e77B96538q6077e739j55799f7522k07367j33009a27517
10225a22199q6180j12059G186b31694c8261p3310C7931a37636A24948J16282h8611
10213b8924r5388N1873D5626L29379b91239q6054B05048a76825H2996g1785B77350
$$ plain form
10201 -181894 -377217 -209317 -348864 -249786 -303722 -173655 45052 -129592 -169427 -129419
10191 -129419 -94621 -174495 -179931 -164982 -195033 218734 -499501 57194 8778 -27207 116493
10179 36194 -263710 -160501 -284288 139866 -147747 61673 -179933 47292 267996 349123
10169 349123 -198518 -162760 200751 -114307 73074 -206595 66013 119421 -218240 42122
10158 21392 -171929 -144062 -125819 117979 119963 -269400 -132502 133147 -199875 -240709 -69367
10146 -139749 -95429 31634 -161696 -73333 -97153 117043 -308737 -381739 68559 155700 147166
10135 147166 -83920 -42057 -78713 30594 145599 -55739 210426 -276103 -76366 44877 -309628
10123 -74073 -64049 129480 229911 -246842 39957 -90451 -243592 -190136 3623 -174779 199778
$$ packed form
10201a81894j95323J67900j39547R9078n3936J30067D5052a29592l9835M0008
10191a29419L4798p9874n436J4949l0051B18734d99501E7194H778b7207A16493
10179C6194b63710J03209j23787A39866a47747F1673a79933D7292K20704Q1127
10169C49123a98518L5758B00751a14307G3074b06595F6013N3408b18240D2122
10158B1392a71929K7867J8243A17979J984b69400a32502A33147a99875m0834f9367
10146a39749M4320C1634a61696g3333k3820A17043c08737p3002F8559Q7141q534
10135A47166h3920M1863l6656C0594J15005e5739B10426b76103g6366D4877c09628
10123g4073J0024A29480J00431b46842C9957i0451j53141N3456C623a74779A99778
$$ plain form
10111 75706 214202 -35770 194785 156822 -119789 92161 -342813 -205237 -190900 93457 44472
10099 -304069 -82113 -13757 -284592 10851 -27020 -111326 167574 66604 29359 185959 -120412
10087 95970 35552 -51848 -397227 -127008 -141315 27524 -39822 -19469 -200678 1291 -76254
10075 -317228 83522 361363 44565 -353060 201716 -1554 109898 -128760 -51553 21539 -59908
10063 151066 -17288 -248410 114449 -239985 22671 -104438 2607 -78259 -761649 -1129 -336396
10052 -336396 -380677 5708 -334272 -57864 24360 144880 -41866 2750 64685 -429038 -324892
10041 -324892 -420754 306189 -204297 103383 -92062 -88809 151487 -100995 -284310 -127867
10030 -2461 17910 48515 -73821 -355974 -223276 -158372 -68257 -37519 -196251 31084 158044
$$ packed form
10111G5706J38496c5770A94785l7963a19789I2161c42813J37576J4337I3457D4472
10099c04069h2113a3757k70835A0851b7020q4306A67574F6604B9359J56600a20412
10087I5970C5552e1848l45379a27008j4307B7524c9822a9469j81209A291g6254
10075c17228H3522K77841D4565c53060B01716a554A09898a28760e1553B1539e9908
10063A51066a7288k31122A14449b39985B2671a04438B607g8259o83390a129l35267
10052c36396m4281E708c34272e7864B4360J20520d1866B750O1935d29038J04146
10041c24892r5862C06189b04297A03383i2062L253A51487a00995j83315a27867
10030b461A7910L0605g3821k82153J32698O4904f8257L0738j58732C1084J26960
$$ plain form
10019 158044 187354 88676 263877 -297982 124649 57668 -68287 -34910 -204416 -40228 -352008
10008 -352008 -129488 -71450 163026 5644 165646 -335218 60015 -13008 -404655 -120497
9997 -219323 61373 -228487 -96758 -17232 -301244 -253300 -21995 -155042 149971 -172143 32375
9985 -63585 -31139 -74109 -237414 203806 28845 78616 -212729 44032 -227125 -253538 -156355
9974 -156355 137057 1491 51223 98917 84183 -159607 -91879 -43495 -34039 -30287 -172720 -129944
9962 -129944 -459580 -171012 16244 -19803 -102992 -196704 260330 96854 36533 -184337 -232410
9951 -232410 117197 -174642 65491 -190175 -273921 -71973 -210769 -142990 -91882 -11107 2977
9939 -3945 -102961 -230328 -252371 -731107 -50687 -150356 -135680 39421 -13357 -128357 146326
$$ packed form
10019A58044K9310H8676J75201b97982A24649E7668f8287L3377j69506d0228l11780
10008c52008a29488N8038A63026E644J60002c35218F0015a3008l91647a20497
9997b19323F1373b28487i6758a7232k84012M7944b1995j33047A49971a72143C2375
9985f3585c1139m2970j63305B03806B8845M9771b12729D4032b27125k6413R7183
9974a56355A37057A491M9732M7694j4734a59607O7728d3495R456L752j42433M2776
9962a29944l29636a71012A6244a9803q3189r3712B60330I6854C6533a84337m8073
9951b32410A17197a74642F5491a90175q3746g1973j38796O7779N1108a1107B977
9939c945r9016j27367k2043m78736e0687r9669J4676C9421a3357j15000A46326
$$ plain form
9927 -18808 149949 -363915 -69353 -66055 -1346 -12626 -17580 -20941 -10303 -188894 -31302 267819
9914 133308 -115865 269092 119626 -126738 16366 -37937 4717 -80486 -220304 -96713 95939
9902 45585 -158556 333559 77021 -144512 375070 -316505 5755 154093 -256039 20628 -148376
9890 -219292 -161056 -107169 -42917 127197 -15534 110509 -279548 -156935 -113336 -543066 -75230
9878 -285262 -142131 -211600 -196682 65209 -192079 -172630 204251 -32641 -134584 -26363 -68841
9867 -68841 44142 -248730 8899 -117357 -162434 150280 -132198 -203301 230455 -264031 52852
9855 229365 -163619 215453 -103060 109231 -14824 80256 -14450 -526517 220813 148467
9845 148467 -111078 -79656 -219969 -122654 -111521 65891 -333640 253866 109785 -158113
$$ packed form
9927a8808A49949c63915f9353L298a346j1280m954l361a0303j78591c1302B67819
9914A33308a15865B69092A19626a26738A6366c7937D717h0486j39818i6713I5939
9902D5585a58556C33559G7021a44512C75070c16505E755J48338b56039B0628a48376
9890b19292N8236N3887d2917A27197a5534A10509b79548J22613M3599m29730g5230
9878b85262a42131o9469J4918F5209a92079J9449B04251c2641j01943b6363m2478
9867f8841D4142b48730H899a17357m5077A50280a32198p1103B30455b64031E2852
9855B29365a63619B15453a03060A09231a4824H0256a4450n12067B20813p2346
9845A48467a11078L1422j40313R7315J1133F5891c33640B53866A09785a58113
$$ plain form
9834 -26187 -207685 164782 -91668 66098 -2373 -310650 198634 -20011 115729 -345910 111612
9822 -199242 -182568 143702 165005 -60486 -349971 -216848 -157750 -345599 -39325 -54937 69324
9810 -169097 -147229 73092 18360 364308 -136751 79234 183844 -165025 -31601 77922 -539031
9798 -211393 150417 -137270 -313640 23 251507 20090 -255880 212182 -251068 69148 20839
9786 -230256 101502 -317338 -140152 -83811 -177878 83340 17666 -485790 -197729 -145085 47865
9774 -194740 -41696 -118804 -56815 -270618 94751 -168751 -265371 104444 75894 -59961 70744
9762 -28068 -96092 -65357 5698 -18686 -36913 165607 -156548 -73899 -80910 -233127 353710
9750 65509 -136511 247001 -242396 12869 -353049 113983 254381 -337393 112385 45428
$$ packed form
9834b6187j81498A64782i1668F6098b373l08277A98634b0011A15729c45910A11612
9822a99242J6674A43702K1303f0486k89485J33123N9098j87849c9325j5612F9324
9810a69097K1868G3092A8360L45948a36751G9234J04610a65025c1601G7922e39031
9798b11393A50417a37270j76370B3K51484B0090b55880B12182b51068F9148B0839
9786b30256A01502c17338a40152N6341r4067H3340A7666d85790a97729N2644D7865
9774a94740d1696p7108e6815k13803I4751a68751r6620A04444k8550e9961G0744
9762b8068o8024L0735E698a8686j8227A65607a56548g3899p011j52217C53710
9750F5509a36511B47001b42396A2869c53049A13983J40398c37393A12385D5428
$$ plain form
9739 -90885 93282 72755 -402001 63711 -53527 -152039 -125992 -93426 94558 146095 -348392
9727 150273 -409477 69145 -84536 -101705 -211002 157010 -173680 -167720 55850 -274904 -95399
9715 -21310 69619 -97152 -216919 60568 81579 -36692 177432 66034 68269 -10556 15245 -116726
9702 -256206 -18783 288490 7437 21734 -31843 -91556 25286 109139 -101791 -64237 160243
9690 10873 147026 68966 -71765 -211353 -116862 -271624 -228492 17678 -353811 -270194 119451
9678 65107 -7482 300059 -117542 -16272 -276395 -258380 156093 -38608 62467 -151915 99705
9666 -364215 -171743 142996 -17259 114493 51054 -369816 -114332 47773 -127301 170164
9655 -333510 -129796 8243 -184005 172878 20126 -24645 -4866 -236190 -131837 -18568 -178418
$$ packed form
9739i0885I3282k0527d02001F3711e3527r8512K6047L2566I4558N1537c48392
9727A50273d09477F9145h4536j7169j09297A57010a73680N960E5850b74904i5399
9715b1310F9619i7152j19767F0568K1011c6692A77432F6034K235a0556A5245a16726
9702b56206a8783B88490G437J4297c1843n9713B5286Q3853a01791L7554A60243
9690A0873J36153F8966g1765j39588R4491j54762M3132A7678c53811Q3617A19451
9678F5107g482C00059a17542a6272k60123J8015A56093c8608F2467a51915I9705
9666c64215a71743A42996a7259A14493E1054c69816a14332D7773a27301A70164
9655c33510a29796H243a84005A72878B0126b4645d866k31324J04353a8568j59850
$$ plain form
9644 -178418 -121708 -252110 61052 -42178 69193 -397782 34663 -143024 -13794 21065 -144707
9632 -169417 -4137 -64697 154103 23353 111977 -128734 303698 101429 -200129 326671 -2576
9620 -348285 -127828 27216 92724 -505090 84241 -334153 85743 119261 -184922 2466 -230459
9608 -157550 2638 -47923 -66962 272379 -13498 -302318 -134423 -33214 -272262 -98555 -544260
9597 -544260 5655 -64609 60447 -224255 -415469 -263194 13033 -120879 -158405 102328 -240340
9585 72640 -263003 -215045 295385 -637718 -193304 -79508 93792 128026 206827 -305401 -146852
9573 -230649 -30326 261615 -104439 46311 51902 21003 -425878 -166290 142797 70633 204011
9562 204011 30451 -74323 -217073 -458581 -165944 -111308 -282769 -157338 -120174 -6339 406094
$$ packed form
9644a78418N6710j30402F1052d2178F9193c97782C4663a43024a3794B1065a44707
9632a69417d137o0560A54103B3353Q8624a28734C03698A01429b00129C26671b576
9620c48285a27828B7216O5508e05090H4241c34153H5743L3518a84922B466b30459
9608a57550B638d7923j9039B72379a3498k88820a34423c3214k39048i8555m45705
9597e44260E655f4609F0447b24255j91214J52275A3033a20879l7526A02328b40340
9585G2640b63003M7958B95385f37718a93304g9508I3792L4234P8801c05401a46852
9573b30649c0326B61615a04439D6311N591B1003d25878a66290A42797G0633J33378
9562B04011C0451g4323j42750k41508a65944N4636j71461J25431L7164f339D06094
$$ plain form
9550 -189007 -203212 -263011 -288948 -80082 -186857 -93416 430330 -135836 -120050 -108546 -116106
9539 -116106 -110598 -216338 103840 -378339 -122295 -177463 -237489 -184803 -111024 -78654 -222717
9528 -222717 151667 -210785 181392 -212862 16267 -105415 138964 -8837 -98158 -4006 14190
9516 -72973 -133298 -131539 -224209 59071 -103380 128845 -307818 -12133 -72435 85715 -19816
9504 -57908 171042 181889 -80441 -42239 -116783 -34718 23331 -1122 262374 -122250 -45863
9492 168483 -170906 19777 -40184 129351 -417522 -60046 -83945 -193245 95173 -226753 -452940
9481 -452940 254568 -77042 -200058 119120 -263893 -159270 -348474 -130460 -322596 -86119
9470 -9536 9398 160877 -158586 -304262 66775 -131934 -377152 115173 -14244 -138342 -90827
$$ packed form
9550a89007j4205n9799k5937h0082j06775i3416D30330a35836J5786J1504p560
9539a16106N508j05740A03840c78339a22295n5168o0026N2686P3779L2370j44063
9528b22717A51667b10785A81392b12862A6267a05415A38964h837q9321d006A4190
9516g2973o0325J759r2670E9071a03380A28845c07818a2133o0302H5715a9816
9504e7908A71042J0847h0441L8202p4544c4718B3331a122B62374a22250d5863
9492A68483a70906A9777d0184A29351d17522f0046k3899j09300I5173b26753k26187
9481d52940B54568g7042j23016A19120b63893J04623j89204a30460j92136h6119
9470i536I398J51479a58586j45676F6775a31934k45218A15173a4244j24098M7515
$$ plain form
9459 -90827 -65738 -115290 314819 -294911 -300705 -42151 -63914 -74009 -210472 58873 19752
9447 -189669 -84751 236586 1543 -89168 56902 -178209 -36591 -137765 -108714 -35321 91779
9435 -82881 -169202 -152760 -25720 101520 204345 -257283 66641 98363 26454 -96860 -160649
9424 -160649 -241345 73311 -167032 -260887 203902 44835 -192144 65843 107854 -198758 -86391
9412 50913 101198 20440 210382 -198865 -34290 165915 -119965 221904 -80954 -55035 -58266
9401 -58266 54728 -114232 -236807 9664 -346501 -261959 -157012 -86088 -248367 -160983 -408612
9390 -408612 -99951 -257120 20788 -317199 122394 210961 -197733 -89777 -367013 -202449
9380 -202449 -119253 5909 -254019 84096 88854 -145418 -105492 -73645 3501 -14787 -393451 -22346
$$ packed form
9459i0827K5089m9552C14819b94911n794d2151k1763j0095j36463E8873A9752
9447a89669h4751B36586A543h9168E6902a78209c6591j01174K9051c5321I1779
9435h2881q6321J6442b5720A01520J02825b57283F6641L1722B6454i6860o3789
9424a60649q0696G3311a67032r3855B03902D4835a92144F5843M2011a98758h6391
9412E0913N0285B0440J89942a98865c4290A65915a19965B21904h0954K5919l231
9401e8266E4728a14232j22575I664c46501Q4542J04947P0924j62279Q7384k47629
9390d08612i9951j57169B0788c17199A22394Q8567a97733h9777k77236J64564
9380b02449Q3196E909b54019H4096M758a45418L9926L1847C501a4787l78664b2346
$$ plain form
9367 -143502 -101981 -422310 -166749 -177619 39347 -114383 -39932 -42129 219599 145354 -292525
9355 200245 -61680 -110310 140579 -260355 -219257 -273318 -303610 -101586 -78590 108964 -464177
9343 56589 160395 -348605 252712 -169895 -74079 84633 -86001 132641 -41816 -121545 204259
9331 315181 -125337 33123 -304063 29433 95437 -122882 31947 -166690 348622 -248878
9320 178241 -230067 -8113 -136151 -112885 -162225 -198906 -37433 -407260 -59998 -65937 178362
9308 -249895 21079 77836 -121277 -138359 -204683 -261497 -229021 82481 55094 -406260 24465
9296 7881 -258423 39741 -535866 -236485 -181211 -324100 -153168 305951 -315668 -77027 -151135
9285 -151135 -109523 118987 -126709 -90955 53305 -258745 -444413 -187601 19418 -42758 -13341
$$ packed form
9367a43502M1521l20329a66749j0870C9347a14383c9932k197B19599p4245b92525
9355B00245f1680m8630A40579b60355M1098n4061l0292a01586K2996A08964d64177
9343E6589J03806c48605B52712a69895g4079H4633h6001A32641d1816p9729B04259
9331C15181a25337C3123c04063B9433O6004a22882C1947a66690C48622b48878
9320A78241b30067h113j28038K3266m9340l6681c7433l69827e9998n939A78362
9308b49895B1079N6757a21277j7082o6324n6814L2476H2481k7387d06260B4465
9296G881b58423C9741e35866b36485N5274j42889a53168C05951c15668g7027p4108
9285a51135M1612A18987a26709L5754E3305b58745j85668a87601A9418d2758a3341
$$ plain form
9273 -143757 -180515 208123 8913 -40192 -114939 -386579 -288076 -163785 -88025 420122 280141
9262 280141 226598 306788 -96166 -208886 30921 -184067 -591012 -6658 -311130 25239 154883
9251 154883 -338435 5119 -28054 165032 -67625 -146069 -22 211318 49936 96794 -510391 153316
9238 36342 -236625 -127605 134505 152748 -193080 -299901 192887 24055 -26071 -205432
9228 -205432 -194804 -315552 -246903 42819 469200 391723 -318221 -207624 268726 -60461 50341
9216 82869 -415996 8790 20935 -116638 192099 116963 -73352 -243975 121450 -103364 -346066
9205 -346066 -84385 -94150 206988 -28849 358302 -206782 -361299 254732 99435 139539 77093
9194 77093 154229 -131842 -337135 160948 15901 -103344 -67437 -128209 -100408 -320819 -230005
$$ packed form
9273a43757l6758B08123H913d0192p4747k71640R8503J24291P5760D20122j39981
9262B80141n3543Q0190i6166j12720C0921a84067m06945f658l04472B5239J29644
9251A54883c38435E119b8054A65032f7625p8444b2B11318D9936M6858e10391A53316
9238C6342b36625J09020A34505J8243a93080j06821A92887B4055b6071j79361
9228b05432J0628j20748O8649D2819M26381p7477c18221J10597B68726f0461E0341
9216H2869d15996H790J2145a16638A92099p5136g3352j70623A21450a03364k42702
9205c46066h4385r765B06988b8849C58302b06782j54517B54732I9435M0104o2446
9194G7093P7136a31842k05293A60948A5901a03344L5907o0772K7801k20411R0814
$$ plain form
9183 -230005 -45364 97094 111501 2190 -403975 66015 120271 -299764 314686 13566 49463
9172 49463 34566 -111161 -126563 19477 42621 -333724 -113513 -121666 -82758 -22799 -118793
9161 -118793 -108408 101547 -169049 253908 -99759 -74095 986 108960 332182 166400 140812
9150 140812 -47237 -14561 -458802 -212321 -466300 4702 -244670 -32565 -200525 -176722 -226861
9139 -226861 138681 52224 -128465 -176336 -154973 346032 -92296 132939 161601 282374 -95023
9127 -360572 -70200 -86197 -88067 -47571 -239718 25658 -286041 -397894 83339 189714 -208511
9115 15854 39518 88141 -121911 83344 -227772 78447 -65366 -159037 104919 -60228 -68617
9104 -68617 -344441 122402 -424985 263160 -63 81800 -228009 -320828 -99023 28407 41722
$$ packed form
9183b30005d5364I7094J4407B190d03975F6015N4256b99764C14686A3566L5897
9172D9463j4897a11161j5402A9477K3144c33724a13513q153L8908b2799r5994
9161a18793J0385A01547a69049B53908i9759K5664I86J07974K23222j65782k5588
9150A40812d7237a4561m44241b12321k53979D702b44670c2565j67960K3803n0139
9139b26861A38681E2224a28465m7871K1363C46032i2296A32939K8662J20773i5023
9127c60572g0200j5997j870M0496j92147B5658b86041j11853H3339J06375b08511
9115A5854K3664M8623a21911H3344b27772G8447f5366r3671A04919f0228q389
9104f8617k75824A22402d24985B63160f3H1800b28009r2819i9023B8407J3315
$$ plain form
9093 41722 -370155 98800 -151374 40571 116583 42031 -178693 13325 -217548 -348977 -245565
9082 -245565 -45683 -61150 103561 330256 -144323 143461 -343008 287667 13309 108990
9072 108990 -247544 -501110 -67579 -233436 123546 -300726 -418743 -65138 -124096 -52856
9061 172706 100814 -204903 108986 230900 -40836 -166040 -121653 -138630 -159170 221783 -432229
9049 -125566 -130242 -147898 83425 -233960 198103 -186874 60213 -158843 -214193 -16090 -72772
9038 -72772 -9838 -343869 -328034 -302964 -82189 74080 212077 -48473 81611 217644 255195
9027 255195 -145077 -244159 -338096 94355 -85928 -81899 -212520 91897 -127147 -136607 -116530
9016 -116530 9002 72298 -27773 -221334 -18347 -288113 -214607 -127572 -218686 -62043 -193682
$$ packed form
9093D1722c70155I8800a51374D0571P6012D2031a78693A3325b17548j31429J03412
9082b45565d5683j5467A03561K26695a44323A43461c43008B87667A3309R5681
9072A08990b47544k53566f7579j65857A23546c00726j18017f5138n8958e2856
9061A72706p1892b04903A08986J21914d0836j25204M4387j6977k0540B21783d32229
9049a25566m676j7656H3425b33960A98103a86874F0213a58843n5350a6090n6682
9038g2772i838l34031J5835K5070h2189G4080J37997d8473H1611J36033L7551
9027B55195a45077r9082r3937I4355h5928M029j30621I1897a27147r460K0077
9016a16530I002O3296b7773j93561a8347k69766P3506Q7035r1114f2043j31639
$$ plain form
9005 -193682 -173979 62090 -220065 -97524 -19826 -264650 -25369 52866 -67260 241065 200271
8994 200271 119389 -223086 -98612 50096 54238 162560 54567 40049 142450 -128112 -506811
8983 -506811 406148 -209442 -200596 1768 -93094 -83694 -49289 -10375 -98748 -197404 -71500 17819
8970 234034 28434 369329 -237406 115065 -90847 -62920 -168469 -279033 69375 -226497
8959 -135323 -66918 -194698 64130 -5967 -126818 -144064 57672 131967 -191254 -35802 -250574
8948 -250574 -205942 -94302 -24348 38731 -168423 -40335 -7983 102291 337417 140747 -100830
8936 267793 214392 -194758 -22500 200541 -264527 36854 255687 151115 -39911 293165
8925 680531 1401887 3387413 4299740 6433301 10569530 6516709 2180620 1161956 728881
$$ packed form
9005a93682J9703F2090b20065i7524a9826k44824b5369E2866f7260B41065m0794
8994B00271q0882b23086i8612E0096M142J08322E4567j4518J02401a28112l78699
8983e06811D06148b09442Q846A768i3094R400L4405a0375q8373r8656g1500A7819
8970B34034B8434L40895b37406A15065i0847K7927j05549j10564F9375b26497
8959a35323f6918j27780F4130e967j20851j7246E7672P4295a91254c5802k14772
8948b50574M4632i4302b4348C8731a68423d0335g983A02291K35126A40747a00830
8936B67793n3401a94758b2500B00541b64527C6854K18833j04572c9911B93165
8925F80531P21356J985526R12327K133561M136229m052821B180620j018664m33075
$$ plain form
8916 728881 353152 180542 48924 -44547 -77062 388584 191763 59063 389996 408451 239086
8905 239086 -128437 -150306 41603 48455 320819 -178909 -376069 -184764 156539 -20489 -186791
8894 -186791 318394 152648 -243150 284259 -164922 -24128 -225921 -103878 203180 -85149
8883 -54503 -74930 -310176 9081 -97412 -29236 -216084 -135780 4384 -302005 23994 -52908 -182911
$$ packed form
8916G28881C53152j72610D8924d4547l2515C88584A91763E9063L30933J8455j69365
8905B39086a28437k1869D1603O852K72364a78909j97160a84764A56539b0489j66302
8894a86791C18394A52648b43150B84259a64922b4128k01793a03878B03180h5149
8883e4503k0427k35246I081i7412b9236j86848Q0304D384c02005B3994e2908j30003
$$ [...]
##END NTUPLES=NMR SPECTRUM
##END=
