##TITLE=AC1581_2782_8202388_tz30C9GtBx
##JCAMPDX= 6.0         $$ Bruker NMR JCAMP-DX V2.0
##DATA TYPE= NMR SPECTRUM
##DATA CLASS= NTUPLES
##ORIGIN= BRUKER
##OWNER= Administrator
$$ 1.72 TOPSPIN		Version 2.1
$$ 2013-09-27 01:17:43.299 -0700  Administrator@X
$$ Compression mode = diff/dup
##.OBSERVE FREQUENCY= 400.02188249412
##.OBSERVE NUCLEUS= ^1H
##.ACQUISITION MODE= SIMULTANEOUS (DQD)
##.ACQUISITION SCHEME= undefined
##.AVERAGES= 64
##.DIGITISER RES= 22
##SPECTROMETER/DATA SYSTEM= spect
##.PULSE SEQUENCE= noesygpps1d.comp
##.SOLVENT NAME= COFFEE_meoh
##.SHIFT REFERENCE= INTERNAL, COFFEE_meoh, 1, 14.96129
##AUDIT TRAIL= $$ (NUMBER, WHEN, WHO, WHERE, PROCESS, VERSION, WHAT)
$$ ##TITLE= Audit trail, TOPSPIN		Version 2.1
$$ ##JCAMPDX= 5.01
$$ ##ORIGIN= Bruker BioSpin GmbH
$$ ##OWNER= Administrator
$$ $$ E:\/data/COFFEE/nmr/AC1581_2782_8202388_tz30C9GtBx/22/pdata/1/auditp.txt
$$ ##AUDIT TRAIL=  $$ (NUMBER, WHEN, WHO, WHERE, PROCESS, VERSION, WHAT)
(   1,<2013-09-27 01:17:38.190 -0700>,<Administrator>,<X>,<go>,<TOPSPIN 2.1>,
      <created by zg
	started at 2013-09-27 01:06:07.996 -0700,
	POWCHK enabled, PULCHK disabled,
       configuration hash MD5:
       C8 4E 4E 5D D3 5C D8 9E 9F 52 82 E0 59 8A DE 15
       data hash MD5: 64K
       2B 5A AD 43 3D B1 88 DA 7E CB D4 35 EB 90 68 26>)
(   2,<2013-09-27 01:17:41.190 -0700>,<Administrator>,<X>,<proc1d>,<TOPSPIN 2.1>,
      <Start of raw data processing
       efp LB = 0.3 FT_mod = 6 PKNL = 1 PHC0 = 0 PHC1 = 0 SI = 128K 
       data hash MD5: 128K
       5F C3 DA A7 5F A7 62 3C D8 43 AB 1A 34 CE D6 59>)
(   3,<2013-09-27 01:17:42.330 -0700>,<Administrator>,<X>,<proc1d>,<TOPSPIN 2.1>,
      <pk PHC0 = -83.39172 PHC1 = 0 
       data hash MD5: 128K
       4F 44 79 21 4E B6 BF 2A EA 87 A2 42 8C E2 9A 22>)
(   4,<2013-09-27 01:17:42.737 -0700>,<Administrator>,<X>,<proc1d>,<TOPSPIN 2.1>,
      <abs ABSG = 1 
       data hash MD5: 128K
       BE CB 91 DA 2A 16 ED 7E F6 CD EA A3 4D 8D 2E 2E>)
(   5,<2013-09-27 01:17:42.846 -0700>,<Administrator>,<X>,<proc1d>,<TOPSPIN 2.1>,
      <abs ABSG = 2 
       data hash MD5: 128K
       1F D8 96 F0 37 60 C9 F0 1A 05 77 2D A7 03 E3 98>)
(   6,<2013-09-27 01:17:42.971 -0700>,<Administrator>,<X>,<proc1d>,<TOPSPIN 2.1>,
      <abs ABSG = 3 
       data hash MD5: 128K
       41 72 89 1F B6 B9 B7 5A 47 6F D3 85 1C 6F BB 24>)
(   7,<2013-09-27 01:17:43.049 -0700>,<Administrator>,<X>,<proc1d>,<TOPSPIN 2.1>,
      <abs ABSG = 4 
       data hash MD5: 128K
       FA 54 62 EA FE 31 7F 32 ED 8F 21 5F D6 31 26 1B>)
(   8,<2013-09-27 01:17:43.127 -0700>,<Administrator>,<X>,<proc1d>,<TOPSPIN 2.1>,
      <abs ABSG = 5 
       data hash MD5: 128K
       48 B8 A3 74 7D B9 39 B4 CB 21 08 EE 26 D8 CC 96>)
$$ ##END=
$$ 
$$ $$ hash MD5
$$ $$ 05 0B A9 9C 1A 8C 92 B8 62 5B F5 52 DB 50 E4 93
##$RELAX= 
##$RELAX= 
##$RELAX= 
##$RELAX= 
##$RELAX= 
##$RELAX= 
##$RELAX= 
##$RELAX= 
$$ Bruker specific parameters
$$ --------------------------
##$DU= <E:\>
##$EXPNO= 22
$$ [...]
##$TP07= 0
##$TPNAME0= <>
##$TPNAME1= <>
##$TPNAME2= <>
##$TPNAME3= <>
##$TPNAME4= <>
##$TPNAME5= <>
##$TPNAME6= <>
##$TPNAME7= <>
##$TPOAL= (0..7)
0.5 0.5 0.5 0.5 0.5 0.5 0.5 0.5
##$TPOFFS= (0..7)
0 0 0 0 0 0 0 0
##$TUNHIN= 0
##$TUNHOUT= 0
##$TUNXOUT= 0
##$USERA1= <user>
##$USERA2= <user>
##$USERA3= <user>
##$USERA4= <user>
##$USERA5= <user>
##$V9= 5
##$VALIST= <valist>
##$VCLIST= <CCCCCCCCCCCCCCC>
##$VD= 0
##$VDLIST= <DDDDDDDDDDDDDDD>
##$VPLIST= <PPPPPPPPPPPPPPP>
##$VTLIST= <TTTTTTTTTTTTTTT>
##$WBST= 1024
##$WBSW= 4
##$XGAIN= (0..3)
0 0 0 0
##$XL= 0
##$YL= 0
##$YMAX_a= 7409469
##$YMIN_a= -12915985
##$ZGOPTNS= <>
##$ZL1= 120
##$ZL2= 120
##$ZL3= 120
##$ZL4= 120
##$ABSF1= 14.96129
##$ABSF2= -5.596891
##$ABSG= 5
##$ABSL= 3
##$ALPHA= 0
##$AQORDER= 0
##$ASSFAC= 0
##$ASSFACI= 0
##$ASSFACX= 0
##$ASSWID= 0
##$AUNMP= <proc_prof1d_extract.lims>
##$AXLEFT= 0
##$AXNAME= <>
##$AXNUC= <1H>
##$AXRIGHT= 0
##$AXTYPE= 0
##$AXUNIT= <>
##$AZFE= 0.1
##$AZFW= 0.1
##$BCFW= 0
##$BC_mod= 0
##$BYTORDP= 0
##$COROFFS= 0
##$CY= 15
##$DATMOD= 1
##$DC= 0
##$DFILT= <>
##$DTYPP= 0
##$F1P= 0
##$F2P= 0
##$FCOR= 0.5
##$FTSIZE= 131072
##$FT_mod= 6
##$GAMMA= 0
##$GB= 0
##$INTBC= 1
##$INTSCL= 1
##$ISEN= 128
##$LB= 0.3
##$LEV0= 0
##$LPBIN= 0
##$MAXI= 10000
##$MC2= 0
##$MEAN= 0
##$ME_mod= 0
##$MI= 0
##$NCOEF= 0
##$NC_proc= -2
##$NLEV= 6
##$NOISF1= 0
##$NOISF2= 0
##$NSP= 0
##$NTH_PI= 0
##$NZP= 0
##$OFFSET= 14.96129
##$PC= 1
##$PHC0= -83.39172
##$PHC1= 0
##$PH_mod= 1
##$PKNL= yes
##$PPARMOD= 0
##$PPDIAG= 0
##$PPIPTYP= 0
##$PPMPNUM= 2147483647
##$PPRESOL= 1
##$PSCAL= 4
##$PSIGN= 0
##$PYNMP= <proc.py>
##$REVERSE= no
##$SF= 400.020009521544
##$SI= 131072
##$SIGF1= 0
##$SIGF2= 0
##$SINO= 400
##$SIOLD= 131072
##$SPECTYP= <>
##$SREGLST= <1H.CDCl3>
##$SSB= 0
##$STSI= 131072
##$STSR= 0
##$SW_p= 8223.68421052631
##$SYMM= 0
##$S_DEV= 0
##$TDeff= 65536
##$TDoff= 0
##$TI= <>
##$TILT= no
##$TM1= 0
##$TM2= 0
##$TOPLEV= 0
##$USERP1= <user>
##$USERP2= <user>
##$USERP3= <user>
##$USERP4= <user>
##$USERP5= <user>
##$WDW= 1
##$XDIM= 131072
##$YMAX_p= 340161392
##$YMIN_p= -38995802
##$CURPLOT= <Network HP LaserJet P1505>
##$CURPRIN= <$Network HP LaserJet P1505>
##$DFORMAT= <normdp>
##$LAYOUT= <+/1D_H.xwp>
##$LFORMAT= <normlp>
##$PFORMAT= <normpl>
##$SURQMSG= 1
$$ End of Bruker specific parameters
$$ ---------------------------------
##NTUPLES= NMR SPECTRUM
##VAR_NAME=  FREQUENCY,     SPECTRUM/REAL,   SPECTRUM/IMAG
##SYMBOL=    X,             R,               I
##VAR_TYPE=  INDEPENDENT,   DEPENDENT,       DEPENDENT
##VAR_FORM=  AFFN,          ASDF,            ASDF
##VAR_DIM=   131072,        131072,          131072
##UNITS=     HZ,            ARBITRARY UNITS, ARBITRARY UNITS
##FACTOR=    0.0627417313425164, 1,          1
##FIRST=     8223.62146879497, 1634,         -67764
##LAST=      0,             2945,            -68111
##MIN=       0,             -38995802,       0
##MAX=       8223.62146879497, 340161392,    0
$$ Real data points
##PAGE= N=1
##DATA TABLE= (X++(R..R)), XYDATA
$$ [...]
67699 72252 71531 70811 70353 69981 69516 69101 68831 68436 67693 66908 66560 66664 66904 67258 67999 69055 69824 69883 69585
67680 69585 69714 70650 72030 73173 73721 73896 74163 74689 75191 75402 75581 76333 77868 79650 80887 81287 81144
67663 81144 80852 80576 80389 80365 80370 80010 79126 78212 77996 78547 79142 79101 78448 77645 77025 76724 76785 76992 76823 75968 74701
67642 74701 73398 72021 70555 69703 70339 72257 74193 75272 75839 76593 77579 78446 79239 80311 81677 82891
67626 82891 83526 83528 83180 82883 82825 82778 82473 82178 82469 83322 84014 84193 84457 85405 86645 87380 87589 87920 88640 89389
67606 89389 89869 90114 90083 89557 88536 87275 85898 84388 82955 81957 81388 80863 80107 79084 77717 75960 74196
67589 74196 73085 72865 73145 73432 73486 73195 72553 71831 71391 71262 71271 71528 72238 73062 73251 72566 71484 70394 69253
67570 69253 68248 68025 68836 70058 71077 72100 73496 74818 75240 74721 74073 73936 74209 74406 74095 73097 71730
67553 71730 70815 70933 71712 72308 72559 73079 74139 75044 74972 73987 72788 71743 70682 69589 68952 69159 69841 70196
67535 70196 69948 69607 69665 69886 69728 69296 69340 70252 71532 72467 72985 73507 74162 74540 74155 72907 71109 69256
67517 69256 67745 66638 65713 64838 64205 64107 64560 65254 65774 65837 65451 64950 64673 64491 63909 62804 61747 61357
67499 61357 61567 61905 62245 62848 63714 64427 64733 64897 65266 65704 65666 64796 63406 62336 62254 63009 63760 63888 63568
67480 63568 63320 63226 63014 62697 62621 62815 62825 62424 62109 62515 63530 64370 64490 64136 63934 64156 64535 64777 65052 65832
67460 65832 67255 68799 69752 69921 69700 69463 69147 68534 67793 67485 67983 69047 70073 70694 70976 71021 70667 69750
67442 69750 68491 67302 66330 65551 65253 65903 67360 68696 69163 68978 68805 68805 68680 68387 68235 68362 68660 69206
67424 69206 70217 71500 72451 72747 72583 72152 71417 70661 70638 71674 72999 73540 73155 72581 72241 71784 70916 70093
67406 70093 69986 70547 71024 70888 70360 70010 70087 70424 70794 71106 71282 71249 71114 71138 71364 71427 70919 69855 68650 67753
67386 67753 67450 67828 68625 69213 69138 68698 68673 69364 70186 70336 69595 68387 67330 66944 67440 68480 69346 69674 69925
67367 69925 70720 71847 72329 71583 70098 68794 68048 67676 67611 68102 69224 70561 71635 72388 73053 73709 74228
67350 74228 74594 74930 75223 75301 75193 75234 75661 76320 76955 77577 78339 79200 79969 80586 81077 81333 81209 80864 80687 80846
67330 80846 81087 81018 80462 79594 78907 78984 79958 81202 81850 81709 81363 81341 81540 81619 81566 81573 81594 81418 81082 80870 80921 81135
67308 81135 81534 82413 83897 85463 86187 85638 84425 83636 83717 84141 84202 83787 83077 81925 80184 78528 78193 79604
67290 79604 81794 83537 84545 85135 85245 84552 83388 82735 83075 83810 84111 84010 84265 85354 86905 88096 88403
67273 88403 87937 87192 86546 86040 85614 85465 86014 87484 89564 91519 92642 92642 91737 90447 89280 88614 88718 89729
67255 89729 91441 93223 94299 94235 93197 91816 90741 90166 89740 89053 88266 88072 88866 90145 90974 90997 90710
67238 90710 90739 91111 91374 91309 91274 91817 93038 94455 95553 96331 97129 97932 98152 97328 95822 94547 94061 94197
67220 94197 94581 95157 96045 97126 98036 98538 98752 99001 99515 100298 101252 102296 103357 104241 104682 104573 104083 103435
67202 103435 102669 101749 100827 100220 100105 100343 100599 100505 99751 98286 96600 95613 96000 97554 99327 100444 100740
67185 100740 100624 100534 100711 101380 102763 104671 106404 107433 108116 109253 110855 111893 111597 110573 110095 110561
67169 110561 111314 111937 112932 114798 116973 118248 118013 116708 115195 114065 113495 113366 113378 113320 113333 113736 114538 115326
67151 115326 115832 116441 117873 120284 122862 124505 124896 124800 125269 126678 128597 130396 131707 132378 132392 131992 131599
67134 131599 131380 131115 130738 130808 132009 134186 136293 137444 137745 137921 138442 139298 140421 141862 143456 144729
67118 144729 145372 145700 146367 147683 149398 151147 152842 154501 155950 156987 157769 158680 159785 160748 161398 162025
67102 162025 162814 163298 162882 161799 161028 161153 161771 162228 162527 163198 164543 166417 168565 170775 172779 174369
67086 174369 175584 176537 177133 177309 177512 178496 180497 182926 185004 186521 187880 189642 192100 195034 197773
67071 197773 199781 201242 202805 204685 206432 207746 209061 210982 213467 215957 218062 219743 221055 222154
67057 222154 223397 225009 226784 228480 230287 232463 234695 236419 237692 239154 241156 243555 246434 250232
67043 250232 254826 259094 261908 263237 264005 265237 267590 271165 275236 278532 280391 281535 283286 286170
67029 286170 289733 293481 297431 301689 306002 309963 313445 316760 320448 324819 329480 333459 336058 337563
67015 337563 338961 341115 344426 348952 354387 360011 365192 370009 374994 380245 385222 389565 393733 398573
67001 398573 404449 410952 417290 422901 427845 432698 437921 443419 448849 454247 459944 465997 472142 478342
66987 478342 484850 491626 498243 504618 511297 518633 526178 533415 540710 548844 557824 566860 575476 583920
66973 583920 592326 600249 607528 615073 624049 634394 644778 654223 663330 673540 685446 698192 710530
66960 710530 722062 733270 744630 756138 767734 779786 792839 806977 821656 836181 850184
66949 850184 863712 877113 891002 906111 922879 941067 959938 978852 997674 1016583 1035670
66938 1035670 1054876 1074265 1094125 1114701 1135905 1157397 1178927 1200607 1222875 1246184 1270644
66927 1270644 1295973 1321802 1347967 1374429 1401073 1427883 1455268 1483821 1513652 1544179 1574774
66916 1574774 1605298 1635885 1666568 1697495 1729163 1761952 1795543 1829310 1863174 1897574 1932586
66905 1932586 1967643 2002334 2036978 2072132 2107896 2144023 2180370 2216820 2252947 2288183 2322354
66894 2322354 2355826 2389128 2422594 2456235 2489657 2522133 2553048 2582457 2611059 2639479 2667554
66883 2667554 2694379 2719041 2741291 2761511 2780172 2797486 2813491 2828163 2841241 2852183 2860576
66872 2860576 2866484 2870181 2871696 2870964 2868307 2864295 2859117 2852459 2844041 2833819 2821598 2807006 2790121
66859 2790121 2771712 2752489 2732446 2711163 2688394 2664019 2637802 2609669 2579985 2549143 2517126
66848 2517126 2483907 2450067 2416452 2383274 2350017 2316234 2281941 2247279 2212263 2176982 2141607
66837 2141607 2106086 2070219 2034185 1998569 1963670 1929101 1894383 1859670 1825616 1792681 1760821
66826 1760821 1729779 1699321 1669158 1638877 1608209 1577356 1546923 1517359 1488554 1460090 1431853
66815 1431853 1404153 1377219 1350929 1325146 1299964 1275395 1251196 1227409 1204713 1183655 1163633
66804 1163633 1143268 1121843 1099898 1078333 1057414 1036811 1016181 995490 975069 955577 937585
66793 937585 921015 905180 889490 873901 858668 844011 830103 816944 804087 790890 777301
66782 777301 764019 751617 739922 728500 717360 706710 696320 685665 674571 663355 652357
66771 652357 641627 631014 620378 609844 599978 591398 583939 576527 568268 559373 550621 542241 533925
66758 533925 525706 518085 511212 504621 497917 491169 484410 477294 469661 462096 455479 450060 445257 440327
66744 440327 435061 429784 424815 419995 414837 409161 403378 398003 393123 388609 384597 381250 378110 374262
66730 374262 369324 363903 358868 354441 350212 345776 341157 336717 332748 329063 325058 320413 315617 311432
66716 311432 307955 304717 301648 299255 297644 296035 293639 290503 287071 283456 279629 275883 272503 269357
66702 269357 266325 263788 262051 260623 258808 256768 255191 254025 252453 250194 247945 246240 244631 242439
66688 242439 239665 236719 233757 230772 227988 225698 223921 222540 221500 220597 219446 217992 216726 215984 215355
66673 215355 214225 212541 210532 208068 204974 201808 199506 198192 197025 195361 193459 191808 190368 188907
66659 188907 187582 186741 186381 186185 185853 185122 183778 182057 180694 180059 179444 177851 175403 173243 171884 170436
66643 170436 167934 164851 162606 161777 161499 160612 158844 156739 154941 153818 153428 153503 153606 153523 153405 153411 153412 153176
66625 153176 152618 151693 150346 148838 147780 147458 147353 146788 145905 145417 145449 145267 144317 142929 141708 140750 139810
66608 139810 138870 138101 137551 137212 137135 137071 136322 134460 132031 130016 128695 127598 126523 125959 126284 127094 127676
66591 127676 127797 127688 127466 126962 126044 124892 123907 123434 123515 123856 124078 124034 123771 123238 122259 120872 119454 118383
66573 118383 117715 117291 116932 116373 115288 113736 112475 112442 113764 115499 116514 116513 116034 115519 114699 113087 110938
66556 110938 109300 108948 109518 109980 109822 109356 108901 108153 106646 104482 102350 100982 100832 102013 104053 105811
66540 105811 106090 104641 102362 100396 99134 98191 97150 96094 95423 95290 95308 94849 93681 92323 91669 92188
66524 92188 93477 94664 95183 95137 94986 95053 95347 95698 95886 95694 95018 94052 93264 93094 93592 94366 94860 94731 94000
66505 94000 92916 91669 90295 88848 87561 86727 86474 86771 87578 88751 89820 90206 89796 89060 88467 87981 87302
66488 87302 86348 85290 84330 83731 83822 84611 85585 86219 86525 86724 86657 86111 85562 85824 86833 87487 86994 85846 85089
66469 85089 85245 86296 88168 90488 92204 92238 90622 88530 87151 86798 87019 87150 86774 86005 85395 85302 85432
66452 85432 85280 84884 84733 84997 85349 85600 85962 86489 86706 86202 85303 84805 85163 86197 87397 88231 88282 87476 86259
66433 86259 85269 84753 84484 84271 84250 84489 84568 83906 82496 80965 79920 79507 79741 80773 82444 83856 84029 83037
66415 83037 82038 81995 82739 83439 83568 83140 82376 81548 80969 80740 80570 80102 79347 78566 77884 77269 76792 76578 76621 76859
66395 76859 77346 78091 78877 79464 79825 79894 79377 78250 77182 76922 77339 77631 77464 77291 77495 77881 78244 78866 80048
66376 80048 81548 82809 83466 83423 82845 82269 82296 82845 83170 83004 83133 84262 85761 86327 85703 84901 84678 84640 84128
66357 84128 83230 82442 81796 80981 80083 79579 79558 79503 79040 78542 78617 79179 79484 79116 78596 78721 79522 80267 80460 80364
66337 80364 80378 80311 79664 78436 77199 76375 75923 75774 76177 77306 78797 80041 80851 81566 82523 83649 84585 85038
66319 85038 84996 84764 84770 85091 85210 84536 83272 82384 82510 83199 83546 83293 82850 82444 81878 81157 80746 80909 81201 80936
66299 80936 79908 78447 77052 76175 76012 76245 76288 76111 76433 77716 79330 80270 80384 80292 80329 80373 80681 81973
66281 81973 84297 86464 87130 86191 84748 83934 84009 84360 84132 82986 81393 80083 79209 78403 77666 77635 78636
66264 78636 79897 80183 79129 77594 76749 77080 78213 79455 80415 81156 81812 82232 82200 81886 81712 81783 81854 81837 81877
66245 81877 81813 81172 80005 79202 79462 80330 80732 80246 79355 78685 78458 78596 78868 78977 78860 78900 79538 80674 81735
66226 81735 82242 82117 81568 81008 80987 81874 83618 85891 88257 90053 90582 89873 88973 88922 89610 90100 89901 89331
66208 89331 88752 88132 87411 86702 86000 85226 84631 84682 85403 86347 87312 88544 90042 91213 91521 91030 90095 89022
66190 89022 88353 88874 90705 92745 93640 93197 92431 92329 92991 93876 94422 94390 93977 93718 94008 94644 95011 94773 94260
66171 94260 94141 94839 96231 97716 98567 98372 97283 95825 94477 93457 92814 92583 92820 93535 94600 95735
66155 95735 96633 97116 97193 97005 96793 96852 97325 97988 98400 98303 97820 97258 96897 97001 97803 99311 101201 102954 104056
66136 104056 104153 103291 102108 101459 101605 101891 101516 100483 99506 99036 98717 97968 96837 95993 95924 96441 97088 97760
66118 97760 98600 99435 99750 99418 99056 99349 100219 101005 101260 101003 100308 99194 97992 97397 97938 99605 101992 104406
66100 104406 105904 105841 104723 104054 104853 106615 108118 108951 109760 111158 112954 114468 115207 115135 114652 114465 115157
66083 115157 116688 118387 119509 119712 119069 117910 116730 115978 115703 115505 115044 114500 114355 114678 114886 114320 112980
66066 112980 111527 110608 110379 110644 111149 111611 111775 111727 111940 112630 113232 112971 111958 111195 111416 112392 113590 114970
66048 114970 116696 118463 119673 120154 120244 120188 119860 119136 118187 117312 116674 116308 116240 116552 117357 118648 120143 121457
66030 121457 122520 123665 125122 126679 128062 129386 130842 132192 133084 133752 134828 136423 137967 139120 140223
66015 140223 141493 142296 141869 140532 139496 139439 139867 140132 140607 142346 145745 150016 154054 157474 160637 163941
65999 163941 167478 171246 175294 179477 183290 186185 188038 189200 190138 191035 191677 191697 190986 189877 188764 187589
65983 187589 185888 183436 180589 177855 175316 172724 170034 167533 165418 163436 161053 157965 154439 151191
65969 151191 148846 147520 146891 146613 146480 146319 146068 146026 146623 147783 148793 149068 148818 148714 149182 150241 151763
65952 151763 153495 155046 156281 157588 159407 161593 163637 165433 167379 169766 172446 175145 177726 180101
65938 180101 182191 184050 185743 187173 188350 189675 191506 193452 194668 194990 195291 196520 198804 201681 204724
65923 204724 207622 210049 211922 213687 216046 219448 223884 228906 233697 237483 240167 242369 244687 247154
65909 247154 249568 251889 253930 255027 254591 252988 251446 250976 251488 251896 250964 248286 244719 241732 240020
65894 240020 238874 237067 234130 230450 226401 221983 217238 212469 207835 203146 198324 193810 190220 187688
65880 187688 185680 183470 180764 177957 175714 174172 172663 170478 167849 165795 164922 164815 164844 165153 166325
65865 166325 168265 170038 170914 171087 171030 170589 169290 167404 166071 166052 166795 167129 166683 166173 166357 167189 168113 168804
65847 168804 169294 169607 169604 169266 168909 169006 169821 171263 173136 175447 178282 181364 184015 185794 187018 188331 189941
65830 189941 191626 193386 195542 198192 201069 204053 207302 210705 213781 216389 218965 221613 223557 224106
65816 224106 223730 223464 223623 223836 224064 224591 225028 224320 222098 219274 216893 214975 212888 210355 207599 204887
65800 204887 202403 200369 198848 197622 196550 195857 195747 195976 196145 196247 196626 197574 199332 202285 206648 211997
65784 211997 217545 222969 228625 234931 241838 249023 256188 263010 269081 274231 278737 282904 286417 288401
65770 288401 288243 286223 283192 279718 275774 271262 266562 262279 258600 255269 252251 250089 249432 250495 253230
65755 253230 257772 264281 272401 281333 290583 300305 310720 321441 331754 341506 351336 361820 372547
65742 372547 382238 389714 394541 396775 396492 393766 388880 382145 373604 363239 351437 338797 325413
65729 325413 310843 295129 279428 265216 253006 242260 232348 223120 214586 206583 198992 191990 185890
65716 185890 180899 177099 174381 172270 170088 167520 164888 162645 160721 158581 155959 153357 151766 151828 153205
65701 153205 154769 155524 155391 155067 155123 155460 155671 155726 156113 157367 159554 162178 164611 166702 169007 172249 176558
65684 176558 181413 186380 191651 197784 205151 213767 223382 233518 243742 254204 265675 278686 292839
65671 292839 307365 322173 337745 354040 370178 385422 399865 413772 426782 438348 448618
65660 448618 458167 466905 473944 478788 482102 484887 487197 488171 487291 485200 483100 481606 480372 478695 476163
65645 476163 472703 468264 462686 455773 447330 437160 425200 411641 396738 380564 363220 345334
65633 345334 327933 311577 295903 280373 265297 251630 239802 229202 219030 209262 200481 192988
65621 192988 186451 180380 174656 169538 165354 162239 160042 158425 157121 156082 155321 154643 153778 152803 152219
65606 152219 152417 153129 153639 153582 153426 154028 155713 157783 159001 158624 157096 155735 155675 157072 159281 161653 164041
65589 164041 166635 169663 173435 178440 184983 192718 200845 208945 217413 226890 237450 248631 260185
65576 260185 272416 285653 299646 313693 327225 340006 351888 362644 372095 380104 386322 390164
65564 390164 391289 389977 386744 381645 374281 364508 352796 339716 325480 310333 295081 280676 267275
65551 267275 254268 241361 229193 218624 209805 202287 195736 190092 185196 180789 176920 173949 172091
65538 172091 171194 170973 171100 171062 170388 169283 168642 169085 170111 170563 169846 168382 166917 165684 164385 162750 160895
65521 160895 159100 157413 155585 153415 151063 148924 147288 146198 145539 145011 144126 142573 140707 139409 139262
65506 139262 140101 141479 143229 145254 147074 148098 148301 148213 148255 148450 148860 149836 151564 153680 155679 157585
65490 157585 159955 163197 167090 170978 174305 176943 179063 180771 181960 182575 182879 183225 183532 183247 181945
65475 181945 179828 177444 175063 172559 169831 167101 164697 162685 160809 158780 156611 154689 153420 152776
65461 152776 152233 151261 149836 148413 147461 147137 147318 147726 148003 147891 147484 147229 147529 148370 149397 150320 151140 151977
65443 151977 152818 153507 154013 154610 155688 157319 159093 160503 161493 162485 163824 165360 166692 167711 168680 169802
65427 169802 170887 171502 171363 170545 169408 168343 167508 166819 166237 165992 166292 166826 166864 165995 164549 163180 162269
65410 162269 161903 162072 162509 162623 162117 161628 162233 164221 166830 169231 171232 172847 173842 174202 174639 175957 178078
65393 178078 180160 181569 182275 182447 182245 182048 182314 182969 183314 182754 181370 179695 178241 177364 177174 177358 177395
65376 177395 177165 177089 177502 178276 179329 181055 183741 186852 189550 191886 194891 199299 204612 209654 213754
65361 213754 217162 220597 224687 229720 235545 241664 247588 253225 258876 264785 270785 276494 281713 286382
65347 286382 290048 291769 291018 288588 286034 284016 281691 278012 273098 267774 262242 256061 249314 242789
65333 242789 236833 230918 224733 218888 213873 209066 203706 198405 194608 192613 191191 189341 187457 186234
65319 186234 185291 183633 181022 178060 175145 172104 168893 165974 163808 162408 161559 161133 160953 160700 160226 159798
65303 159798 159789 160225 160837 161502 162456 164077 166512 169518 172628 175440 177789 179641 180994 181949 182746 183525 184125
65286 184125 184312 184162 183974 183906 183946 184166 184512 184372 182919 180158 177195 175087 173802 172668 171483 170620 170286
65269 170286 170313 170665 171539 172848 174053 174675 174640 174039 173001 171966 171660 172416 173777 174999 175763 176157 176217 175799
65251 175799 174845 173509 172030 170598 169293 168028 166616 164966 163159 161330 159579 158020 156792 156034 155963
65236 155963 156865 158677 160607 161606 161378 160550 159716 158771 157480 156251 155748 155968 156203 155903 155135 154246 153487
65219 153487 153026 152977 153282 153831 154716 156113 157766 158886 158738 157324 155437 154082 153831 154583 155868 157262
65203 157262 158459 159153 159220 159060 159337 160155 160855 160863 160305 159508 158452 157255 156702 157416 158776 159568 159625 159905 160865
65184 160865 161767 161937 161794 162070 162717 163246 163640 164241 165064 165879 166698 167623 168370 168479 167951 167314 167115 167587 168574
65165 168574 169530 169914 169922 170499 172223 174568 176775 179042 182125 186016 189774 192598 194497 195991 197820 200846
65149 200846 205461 211014 216488 221764 227572 234231 241355 248890 257391 266851 276210 284623 292381 299902
65135 299902 306595 311716 315797 320202 325513 331253 336915 342278 346742 349444 350285 350004 348879 346155 341278
65120 341278 335061 328993 323675 318469 312544 305756 298515 291160 283603 275484 266682 257645 249075 241256
65106 241256 233901 226764 220130 214453 209646 205082 200329 195645 191630 188533 186058 183839 181919 180615
65092 180615 180024 179877 179874 179879 179739 179264 178632 178448 178996 179709 179867 179609 179661 180132 180326 179810 178923 178032 177014 175953
65072 175953 175582 176361 177618 178401 178863 179965 181922 183821 184888 185414 186171 187474 189124 190829 192307 193275
65056 193275 193617 193413 192723 191563 190159 188913 188003 187329 186887 186744 186477 185203 182565 179323 176571 174639
65040 174639 173164 171857 170659 169344 167710 166183 165594 166124 166897 166902 165980 164680 163435 162229 160931 159586
65024 159586 158365 157415 156808 156561 156661 157146 158138 159717 161714 163694 165266 166479 167848 169838 172316 174742
65008 174742 176940 179397 182543 185975 188816 190812 192619 194882 197427 199632 201322 202901 204726 206706
64994 206706 208555 210125 211368 212162 212396 212201 211954 212010 212459 213201 214199 215572 217392 219452 221356 222825
64978 222825 223786 224120 223479 221569 218570 215147 211941 209147 206615 204245 202083 200066 197925 195520 193108
64963 193108 191061 189330 187497 185361 183254 181637 180661 180193 180011 179713 178759 177046 175268 174255 173979 173656
64947 173656 172806 171749 170987 170636 170710 171432 172854 174452 175552 176034 176322 176806 177541 178326 178790 178559 177656 176588
64929 176588 175714 174761 173374 172000 171615 172575 174244 175845 177116 177921 177844 176695 175120 174144 174144 174685 175369
64912 175369 176448 178418 181312 184693 188287 192292 196927 201847 206360 210301 214404 219532 225712 232217
64898 232217 238557 245037 252239 260246 268465 276053 282438 287612 292000 295881 299004 300961 301876 302319 302580
64883 302580 302494 302071 301656 301120 299488 295952 290956 285677 280694 275787 270862 266291 262264 258477 254715
64868 254715 251264 248473 246323 244620 243245 241956 240340 238275 236151 234313 232503 230165 227098 223524
64854 223524 219698 215751 211842 208143 204697 201498 198651 196262 194230 192275 190102 187503 184549 181828
64840 181828 180192 179938 180445 180950 181456 182480 184120 185869 187325 188563 189798 191152 192831 194974 197206
64825 197206 198901 200152 201979 205167 209270 213213 216518 219505 222559 225821 229453 233604 238051 242337
64811 242337 246383 250583 255243 260247 265319 270132 274069 276332 276640 275510 273559 270862 267350 263485
64797 263485 259968 256843 253407 249171 244553 240451 237422 235449 234220 233345 232437 231347 230378 230068 230668
64782 230668 231942 233501 235237 237335 239946 242981 246252 249700 253406 257369 261363 265163 268956 273417
64768 273417 279196 286266 293869 301210 308132 314978 321913 328623 334722 340224 345414 350441 355274 359989
64754 359989 364781 369563 373732 376458 377160 375712 372445 368124 363675 359571 355371 350093 343156 334933
64740 334933 326365 318204 310691 303796 297538 292047 287484 283954 281409 279578 278142 277106 276912 277983
64726 277983 280179 282830 285321 287492 289468 291377 293364 295667 298417 301422 304357 307097 309706 312145
64712 312145 314186 315549 315910 314931 312565 309251 305439 301008 295563 289323 283173 277639 272302 266509 260245
64697 260245 253940 247863 242173 237225 233294 230199 227740 226286 226324 227558 229119 230673 232692 235574 239160
64682 239160 243318 248288 254061 259953 265281 270097 274824 279449 283566 286967 289861 292658 295821 299610
64668 299610 303578 306559 307596 306815 305052 302816 300007 296471 292288 287568 282447 277435 273340 270641
64654 270641 269125 268249 267761 267976 269526 272702 276901 280987 284487 288194 293186 299499 306270 312990 319924
64639 319924 327288 334748 341993 349219 356648 363989 370718 376604 381692 386041 389680 392456 393746 392717
64625 392717 389240 384208 378523 372078 364183 354710 344322 333675 322959 312338 302407 293974 287442
64612 287442 282479 278212 273828 269094 264331 259969 256328 253765 252517 252271 252329 252456 253070 254263 255274
64597 255274 255638 256373 259080 263995 269822 275540 281452 288210 295680 303333 311093 319195 327541 335776 343785
64582 343785 351733 359746 367830 375836 383237 389170 393063 395051 395575 394895 393223 390859 387709 382989 376052
64567 376052 367334 357951 348536 339070 329688 320867 312710 304789 296923 289502 282768 276445 270491 265596
64553 265596 262258 259797 257022 253701 250698 248752 247834 247734 248535 250191 252139 253720 254663 254933 254536 253833
64537 253833 253641 254442 255648 256147 255543 254375 253109 251456 248921 245633 242346 239762 238103 237128 236404 235690
64521 235690 235252 235664 237088 238915 240349 241303 242453 244458 247363 250779 254339 257853 261163 264121 266791
64506 266791 269604 273139 277567 282401 286991 291271 295751 300714 305810 310633 315238 319652 323270 325365
64492 325365 326018 325816 324734 322202 318490 315110 313192 312138 310645 308634 307278 307289 308030 308384 307741 305965
64476 305965 303183 300055 297662 296497 295833 294572 292547 290508 288977 287733 286506 285677 285890 287218 288993
64461 288993 290441 291269 291699 292146 292894 293858 294521 294276 293048 291549 290695 290744 291221 291773 292835 295188 298964
64444 298964 303449 307918 312382 317391 323330 330137 337648 346028 355885 368086 383339 401761 422864
64431 422864 446149 471794 500681 533761 571513 613924 660711 711492 766086 824958 889206
64420 889206 959719 1036243 1117494 1202196 1289789 1380017 1472034 1563985 1653220 1736743 1811798
64409 1811798 1876526 1930186 1972572 2003199 2021139 2025567 2016117 1992759 1955717 1905797 1844585 1774070
64397 1774070 1695989 1611590 1521798 1427525 1329980 1231010 1133153 1039169 951349 871051 798600
64386 798600 733506 674992 622674 576780 537654 505130 478456 456636 438613 423319 409948
64375 409948 398254 388306 379883 372326 365028 357792 350605 343354 335990 328751 321989 315840 310249 305173
64361 305173 300545 296139 291747 287460 283555 280111 276983 274191 272056 270865 270623 271299 273056 275906 279241
64346 279241 282074 283799 284524 284637 284340 283756 283135 282587 281747 280095 277657 275064 272840 270929 269072 267320
64330 267320 265902 264786 263771 262967 262853 263749 265450 267466 269408 271103 272547 273896 275288 276509 277014
64315 277014 276593 275875 275766 276304 276400 274980 272153 268933 265922 262732 258789 254311 250125 246657 243453 239736
64299 239736 235207 230324 225970 222860 221032 219869 218795 217986 218113 219338 220907 222029 222883 224435 227333
64284 227333 231288 235467 239194 242295 245071 248092 251856 256487 261770 267392 273102 278710 284116 289275
64270 289275 293981 297833 300664 302863 304977 306950 308147 308213 307596 307018 306672 306139 304968 303126 300901 298492
64254 298492 295720 292218 287971 283502 279257 274971 270062 264644 259622 255592 252123 248453 244534 240982
64240 240982 238343 236841 236581 237438 238850 240191 241324 242372 243082 243036 242504 242411 243182 244192 244714 244869 245137
64223 245137 245337 244804 243398 241686 240114 238618 237168 236073 235430 234802 233886 233166 233390 234580 236082 237421
64207 237421 238531 239224 239161 238627 238696 240132 242543 245142 247950 251569 255944 260210 263939 267815 272674 278373
64191 278373 284129 289663 295475 302032 309160 316326 323184 329666 335644 340727 344447 346633 347370 346485 343295
64176 343295 337298 329098 320181 311566 303145 294602 286378 279167 272884 266897 261190 256489 253110 250401
64162 250401 247636 244890 242626 240863 239306 238030 237507 237984 239177 240568 241715 242411 242892 243916 246202
64147 246202 249645 253325 256426 258901 261066 262824 263637 263211 261960 260683 259952 259835 260041 260186 259958 259204
64131 259204 257940 256329 254670 253393 252937 253531 255082 257347 260177 263552 267428 271751 276588 282086 288173
64116 288173 294449 300485 306155 311637 317217 323209 329848 336934 343637 349025 352922 356016 359007 361831
64102 361831 364006 365550 367141 369203 371179 372042 371553 370733 370934 372568 374787 376223 375843 373307 368933
64087 368933 363462 357595 351546 345124 338292 331445 325017 319061 313467 308461 304567 302065 300628 299502
64073 299502 297965 295755 293215 290943 289138 287448 285638 284207 283949 285032 286889 288946 290951 292575
64059 292575 293377 293522 294015 295672 298071 300074 301298 302634 305231 309404 314622 320220 325872 331599 337571
64044 337571 343905 350525 357233 363838 370149 375851 380658 384690 388494 392508 396566 400107 402717 404340
64030 404340 405041 404926 404299 403573 402868 401915 400523 398942 397545 396368 395247 394204 393273 392026 389807 386546
64014 386546 382905 379408 375859 371891 367706 363831 360391 357097 353801 350630 347679 344964 342687 341115
64000 341115 340167 339458 338771 338219 337954 338148 339174 341355 344437 347793 351250 355276 360218 365875 372021 378763
63984 378763 385956 392814 398715 404073 409837 416358 423365 430877 439416 449166 459537 469828 479959
63971 479959 490376 501609 514193 528737 545672 564922 586035 608678 632989 659518 688917
63960 688917 721697 758270 799174 845092 896585 953974 1017709 1088683 1167954 1256267 1354206
63949 1354206 1462739 1583197 1716521 1862782 2021490 2191991 2373311 2563943 2762206
63940 2762206 2966662 3175756 3387026 3597116 3802832 4001948 4192620 4371993 4535655
63931 4535655 4678645 4796954 4888115 4950697 4983650 4986235 4958326 4900566 4814218 4700906 4562477
63920 4562477 4401187 4220162 4023642 3816443 3602925 3386506 3170053 2956397 2748258
63911 2748258 2547959 2357485 2178581 2012416 1859310 1719182 1592194 1478608 1378033
63902 1378033 1289246 1210910 1142198 1082620 1031508 987834 950345 917777 889109 863756 841484
63891 841484 822195 805894 792647 782163 773479 765570 758428 753088 750385 750100 751585 754723 759718
63878 759718 766253 773621 781782 791754 804664 820684 839097 859241 881162 905442 932582 962633
63866 962633 995331 1030424 1067622 1106171 1144830 1182623 1219530 1256052 1292010 1326121 1356929
63855 1356929 1383863 1407054 1426346 1440901 1449852 1453020 1450867 1443952 1432587 1416829 1396615 1371945
63843 1371945 1343104 1310624 1274919 1236123 1194526 1151027 1106735 1062101 1016891 971135 925671
63832 925671 881436 838663 797254 757651 720752 686987 655986 627231 600548 575886 553063
63821 553063 531944 512595 495066 479210 464813 451684 439601 428471 418487 409698 401433 392754
63809 392754 383619 375042 367809 361614 355765 350106 344720 339382 334036 329383 326092 323631 320677 316615
63795 316615 311969 307500 303647 300723 298741 296928 294284 290889 287837 285646 283630 281223 278972 277542
63781 277542 276575 275377 274128 273422 273012 272033 270312 268505 266946 265265 263260 261281 259543 257807 256127
63766 256127 255146 255156 255425 255041 254062 253296 253232 253736 254618 255849 257160 257916 257618 256339 254573 252905 251848
63749 251848 251704 252325 253132 253578 253703 254141 255513 257815 260457 262992 265718 269389 274225 279386 283635 286494
63733 286494 288636 291165 294647 298836 303160 307308 311372 315554 319856 324081 328090 332010 336117 340496
63719 340496 344798 348403 350925 352614 354187 356205 358625 360951 362613 363135 362195 359865 356749 353578 350654
63704 350654 347947 345675 344316 343888 343651 342939 342072 342085 343618 346353 349467 352312 354697 356811 359008 361450
63688 361450 363813 365436 365887 365471 365213 366225 368786 371952 374338 375457 376067 377014 378134 378730 378738 378730 378891
63671 378891 378818 378505 378751 380101 381913 383047 383160 382784 382325 381587 380276 378475 376451 374307 371983 369408
63655 369408 366580 363570 360468 357204 353538 349394 345187 341611 339081 337500 336511 335811 335284 335006 335165
63640 335165 335859 337023 338715 341362 345476 351099 357661 364398 370787 376758 382737 389440 397322 406226
63626 406226 415792 426131 437740 450745 464633 478883 493586 509276 526486 545645 567091 590803
63614 590803 616244 642681 669581 696592 723367 749683 775561 800966 825477 848532 869943
63603 869943 889888 908324 924537 937291 945394 948275 946255 940199 930832 918522 903851 888039
63591 888039 872325 857001 841481 825352 808930 792622 776176 758866 740277 720662 700720
63580 700720 681292 663201 647061 633053 620932 610345 601224 593909 588791 585810 584460 584484 586326
63567 586326 590467 596360 602651 608746 615698 625061 637149 650928 665468 680877 697726 716154 735855
63554 735855 756606 778388 801194 825058 850305 877439 906614 937266 968328 998840 1028331
63543 1028331 1056551 1082752 1105332 1122389 1132715 1136104 1132837 1123310 1108478 1090302 1071128 1052383
63531 1052383 1034043 1015456 996417 977284 958305 939168 919233 897939 874966 850222 823937
63520 823937 796712 769241 741892 714674 687654 661244 635972 612140 589937 569763 552073
63509 552073 536798 523192 510468 498473 487587 478123 469993 462886 456566 450975 446108 441773 437532
63496 437532 433103 428873 425713 424094 423573 423363 423104 422797 422356 421800 421726 422884 425196 427720 429778 431611
63480 431611 433735 436185 438748 441516 444756 448417 452086 455227 457297 457960 457494 456642 455689 453995 450843
63465 450843 446445 441636 436877 432165 427713 424039 421348 419438 418263 418068 418886 420485 422950 426734 431847
63450 431847 437500 442916 448259 454480 462518 472858 485523 500159 516331 533927 553178 574204
63438 574204 596803 620728 645784 671512 697256 722836 748742 775276 801761 826944 849928
63427 849928 870382 888247 903770 917689 930936 944158 957859 972733 989399 1007871 1027734
63416 1027734 1048807 1071199 1094643 1118151 1140384 1160129 1176427 1188542 1195928 1198136 1194935 1186729
63404 1186729 1174613 1159616 1142056 1122056 1100455 1078479 1056489 1033716 1009443 983827 957286
63393 957286 929670 900626 870498 840391 811424 784168 758673 734754 712366 691919 674092
63382 674092 659183 646766 636206 627385 620796 617021 616211 617942 621489 626444 633158 642300 653938
63369 653938 667417 682312 699076 718369 740065 763340 787527 812506 838492 865879 895089
63358 895089 925997 957550 988487 1018361 1047347 1075020 1100154 1121981 1140963 1157681 1171300
63347 1171300 1179853 1182073 1178458 1170488 1159184 1144724 1127208 1107415 1086625 1065778 1044895 1023359
63335 1023359 1000696 977033 952907 928772 904691 880404 855716 830957 807096 785244 765989
63324 765989 749248 734670 721958 710789 700707 691274 682214 673257 663938 653641 641745 627786
63312 627786 611743 594344 576844 560222 544576 529441 514635 500678 488465 478617 470973 464530
63300 464530 458075 451141 444312 438426 433644 429546 425909 422940 420676 418631 416269 413585 411083 409291
63286 409291 408328 407716 406557 404173 400729 397034 393674 390646 387873 385607 384005 382684 381105 379255 377561
63271 377561 376330 375678 375753 376478 377163 377015 376203 375857 376744 378372 379742 380657 381843 383952 386832 389809 392469
63254 392469 395130 398593 403330 408857 414123 418650 423047 428251 434526 441532 449091 457396 466563 476466
63240 476466 487120 498780 511475 524769 538305 552378 567688 584616 602963 622305 642365
63229 642365 663101 684680 707395 731312 755864 780006 802992 824907 846263 867178 887253
63218 887253 906278 924656 942896 960869 977843 993104 1006294 1017233 1025778 1031875 1035410 1035938
63206 1035938 1032916 1026304 1016577 1003968 988088 968642 946273 922337 898043 874195 851491 830490
63194 830490 811268 793605 777695 764306 754153 747424 743997 743726 746312 751294 758429 767805 779279
63181 779279 792135 805665 819891 835265 851740 868550 884942 900759 916218 931407 946163
63170 946163 960161 972975 984208 993738 1001686 1007967 1012024 1013174 1011105 1005857 997427 985716 970853
63157 970853 953278 933399 911438 887779 863229 838614 814181 789628 764756 739896 715705
63146 715705 692772 671506 652225 635209 620671 608571 598347 589018 579930 571423 564367 558996
63134 558996 554633 550715 547522 545452 544083 542701 541498 541441 542811 544587 545615 545890 546298 547455 549287
63119 549287 551513 554051 556823 559500 561611 562945 563767 564581 565548 566234 566153 565513 565118 565453 566233 567063 568135
63102 568135 569851 571961 573628 574396 574628 574821 574863 574371 573583 573407 574427 576174 577674 578555 579205 579908 580385
63085 580385 580506 581009 582919 586332 590220 593518 596027 598241 600750 603995 608285 613719 620205 627587 635590
63070 635590 643704 651567 659635 669111 680936 695129 711232 729038 748604 769892 792798 817309
63058 817309 843332 870630 899320 930272 964534 1002355 1043043 1085720 1129951 1175780 1223518
63047 1223518 1273451 1325481 1379103 1433893 1489762 1546380 1602613 1657101 1709436 1760360 1810707
63036 1810707 1860396 1908408 1953390 1994427 2031662 2066102 2098289 2127101 2150383 2166813 2176588
63025 2176588 2180087 2176560 2164682 2144015 2115341 2079654 2037386 1988791 1934884 1877676 1819392 1761429
63013 1761429 1704304 1648676 1596111 1548386 1506266 1469542 1438262 1413232 1395096 1383556 1377855
63002 1377855 1377517 1382172 1391147 1403863 1420322 1440611 1464101 1489726 1516915 1545639 1575566 1605768
62990 1605768 1635406 1664194 1692018 1718519 1743252 1765820 1785599 1801661 1813308 1820454 1823182 1821067
62978 1821067 1813275 1799293 1779285 1753675 1722593 1685893 1643657 1596586 1545869 1492771 1438426
62967 1438426 1383938 1330366 1278409 1228230 1179803 1133361 1089330 1047936 1009156 973010 939584
62956 939584 908706 879891 852709 827033 802853 780082 758681 738657 719758 701443 683480
62945 683480 666375 650895 637180 624615 612538 600827 589832 580021 571760 565190 560149 556224
62933 556224 552865 549431 545342 540531 535700 531779 529014 526826 524589 522246 520063 518148 516413 514652
62919 514652 512425 509197 505036 500915 497834 495682 493376 490056 485817 481366 477476 474761 473435 473027
62905 473027 472733 472220 471821 471828 472053 472232 472437 472779 473147 473635 474768 476775 478914 480062 479816 478506 476441
62888 476441 473911 471890 471724 473659 476250 477785 477964 477785 478141 479103 480433 482085 483962 485555 486236 485849
62872 485849 484827 483677 482527 481261 479955 478981 478566 478408 477881 476614 474780 472874 471299 470159 469327
62857 469327 468702 468409 468652 469356 470150 470826 471570 472516 473292 473435 473198 473468 474660 476063 476554 475852 474832 474589
62839 474589 475378 476578 477625 478747 480488 482665 484311 484878 484973 485482 486379 487080 487655 488797 490587 492135
62823 492135 492765 492866 493207 494062 495460 497709 501016 504904 508587 511821 514952 518381 522368 527155 532739
62808 532739 538667 544492 550334 556534 562885 568838 574586 581400 590507 601852 614243 626642 639157
62795 639157 652785 668346 685874 705049 725953 749044 774522 802265 832479 865860 902853
62784 902853 943292 987177 1035272 1088344 1146129 1207647 1272257 1339730 1409485 1480500 1551911
62773 1551911 1622973 1692412 1758621 1820681 1878469 1931406 1977731 2015483 2043759 2062507 2071446
62762 2071446 2069734 2056661 2032294 1997474 1953423 1901368 1842424 1777815 1709081 1637845 1565300
62751 1565300 1492171 1419203 1347440 1277926 1211438 1148641 1090250 1036743 987991 943358 902168
62740 902168 864113 829287 797831 769467 743548 719720 698318 679824 664179 651047 640491
62729 640491 632631 626685 621187 615441 610142 606271 604027 603198 603865 606068 609325 613240 618265 625197 634094
62714 634094 644344 655700 668581 683416 700345 719554 741342 765654 792086 820545 851560
62703 851560 885750 923323 964218 1008401 1055826 1106281 1159372 1214469 1270656 1327059 1383309
62692 1383309 1439429 1495148 1549532 1601282 1649037 1691311 1726647 1754204 1773938 1785821 1789088
62681 1789088 1782652 1766223 1740600 1706848 1665575 1617231 1562835 1504014 1442362 1379080 1315260
62670 1315260 1252202 1191135 1132779 1077391 1025154 976191 930315 887210 847002 810297 777429
62659 777429 747947 721128 696721 674880 655592 638543 623409 609893 597500 585656 574101
62648 574101 562984 552638 543486 535965 530115 525320 520903 517005 514378 513237 512732 511754 509859 507239
62634 507239 504287 501536 499609 498698 498196 497238 495628 493950 492808 492189 491569 490493 489080 488077 488301 489840
62618 489840 491950 493977 496244 499687 504630 510244 515357 519546 523355 527700 533359 540859 550402 561685
62604 561685 573987 586737 600117 614985 632165 651864 673701 697120 721668 747164 773849
62593 773849 802267 832655 864443 896604 928551 960354 992021 1022813 1051480 1076921 1098442
62582 1098442 1115536 1127739 1134676 1136148 1132191 1123106 1109267 1090810 1067693 1040300 1009797 977673
62570 977673 944908 911705 877949 843759 809752 776918 746124 717542 690724 665504 642645
62559 642645 623183 607173 593497 580989 569351 558823 549389 540747 532867 526134 520834 516681 512997
62546 512997 509309 505730 502729 500547 498971 497704 496802 496449 496337 495701 494247 492873 493087 495604 499644
62531 499644 503704 507057 510523 515753 523751 534111 545645 557560 569851 582846 596912 612642
62519 612642 630746 651413 674093 698258 724085 751967 781604 812159 843302 875532 909331
62508 909331 944371 979690 1014308 1047444 1078395 1106548 1131509 1153172 1171712 1187396 1200077
62497 1200077 1208930 1213095 1212749 1209227 1203979 1197775 1191043 1184479 1178925 1174959 1172931 1173088 1175316 1179081
62483 1179081 1184098 1190689 1198954 1207882 1216010 1222730 1228135 1231596 1231395 1226111 1215642 1200514 1180902
62470 1180902 1156824 1128720 1097150 1062254 1024220 984105 943574 903746 864686 826056 787960
62459 787960 751173 716827 685834 658392 634027 612258 593043 576455 562193 549762 538963
62448 538963 529849 522351 516249 511354 507351 503717 500250 497528 496258 496217 496446 496512 496942 498125 499386 499604
62432 499604 498466 496691 495157 494074 492967 491228 488676 485570 482106 478118 473518 468806 464704 461340
62418 461340 458265 455290 452727 450656 448572 446126 443778 442300 441868 441926 441697 440606 438646 436643 435775
62403 435775 436372 437550 438408 439238 440996 443898 447155 450029 452579 455424 459211 464215 469914 475088 478957
62388 478957 482183 486147 491241 496606 501680 507126 513763 521297 528825 536210 544200 553350 563485 574274
62374 574274 585760 598182 611622 626089 641713 658730 677434 698146 720974 745505 771114
62363 771114 797893 827041 859911 896708 936515 978567 1022951 1069774 1118130 1166495 1213917
62352 1213917 1260242 1305220 1348044 1387845 1423884 1454935 1479199 1495491 1504107 1505902 1500914 1488647
62340 1488647 1469478 1444896 1416267 1384130 1348877 1311322 1272234 1231872 1190500 1148904 1108025
62329 1108025 1068378 1030234 994012 960014 928032 897678 868976 842188 817206 793573 771111
62318 771111 750096 730699 712589 695204 678258 661851 646294 631913 618961 607589 597861 589679
62306 589679 582714 576491 570640 565041 559808 555331 552211 550757 550409 550064 549241 548633 549156 550804 552866
62291 552866 555069 557848 561499 565603 569549 573239 577050 581316 586013 590800 595253 599205 602944 606960
62277 606960 611499 616532 622147 628717 636657 646224 657562 670571 684763 699682 715709 734003 755293
62264 755293 779140 804918 833171 865223 901417 940499 981089 1023218 1067861 1115326 1164674
62253 1164674 1214523 1263744 1311295 1356014 1396938 1433402 1464531 1488969 1505535 1513913 1514255 1506439
62241 1506439 1490368 1466970 1438084 1405050 1367869 1326132 1280362 1232031 1182533 1132660 1082963
62230 1082963 1034204 987405 943663 903871 868331 836658 808228 782730 760207 740771 724480
62219 724480 711244 700544 691510 683693 677616 674068 672899 672983 673355 673963 675314 677954 682377 688833 696901
62204 696901 705610 714244 722696 730921 738572 745505 752147 758908 765574 771718 777343 782544 786874 789756
62190 789756 791490 793203 795691 798807 801967 804759 806990 808770 810802 814062 818868 824633 830821 837698
62176 837698 845708 854608 863870 873814 885671 900372 917744 937050 957935 980625 1005424 1032323
62164 1032323 1060999 1090996 1121922 1153575 1185764 1217917 1248811 1276722 1299825 1316676 1326647
62153 1326647 1330133 1328168 1321629 1310760 1295385 1275396 1250980 1222689 1191490 1158585 1124941 1091088
62141 1091088 1057547 1025155 994657 966126 939304 914477 892502 873874 858253 845100 834309
62130 834309 825909 819570 814914 812089 811531 813247 816701 821396 827190 834068 841936 850734 860480 871051
62116 871051 882038 892870 903034 912293 920756 928579 935492 940833 944184 945653 945352 943080 938999 934143
62102 934143 929570 925295 920845 916617 913667 912104 910850 909410 908866 910451 913944 918288 923196 929267
62088 929267 936851 945730 955773 967160 979940 993968 1009240 1025734 1043031 1060740 1079258 1099480
62076 1099480 1121654 1145065 1168955 1193212 1218083 1243728 1270188 1297272 1324261 1350253 1375054
62065 1375054 1399356 1423755 1447916 1470960 1492297 1511836 1529632 1545624 1559482 1570509 1577871
62054 1577871 1581034 1579777 1573812 1562885 1547408 1528445 1506685 1481771 1453033 1420546 1385077 1347353
62042 1347353 1307926 1267552 1227052 1186703 1146139 1105040 1063709 1023033 984070 947582 913755
62031 913755 882347 853177 826298 801543 778316 756224 735671 717309 701078 686372 673067
62020 673067 661648 652080 643212 633799 623744 613908 604913 596676 589038 582353 577194 573737 571639 570418
62006 570418 569774 569533 569535 569790 570667 572635 575642 578946 581729 583791 585395 586625 587215 586960 585890 583921
61990 583921 580729 576179 570665 564785 558818 552695 546319 539682 532770 525620 518478 511722 505583 500090
61976 500090 495296 491433 488793 487448 487051 486934 486572 486084 486193 487522 489965 492863 495758 498804 502409
61961 502409 506625 510977 514866 518205 521675 526260 532331 539262 546133 552843 560250 569127 579308 590065
61947 590065 601111 612815 625554 639328 654209 670738 689421 709971 731445 753184 775284
61936 775284 798053 821332 844579 867360 889427 910415 929891 947764 964376 979954 994067
61925 994067 1005778 1014316 1019663 1022571 1024070 1024832 1024911 1024059 1022190 1019512 1016415 1013487 1011558 1011372 1013129
61910 1013129 1016597 1021732 1028859 1038093 1048830 1060027 1070731 1080176 1087728 1093063 1096134 1096591 1093592
61897 1093592 1086705 1076762 1065036 1051584 1035131 1014888 991862 967961 944296 920846 897391 874154
61885 874154 851582 829927 809125 788911 769211 750584 733997 719836 707401 695739 684787
61874 684787 675202 667283 660672 655105 650803 647959 646420 646173 647741 651732 658285 667188 678268 691433
61860 691433 706624 723979 743774 765856 789457 813963 839742 867809 898808 932597 968622
61849 968622 1006216 1044534 1082754 1120515 1157881 1194639 1229824 1262111 1290603 1315199 1336292
61838 1336292 1354129 1368333 1378088 1382961 1383580 1381375 1377673 1373164 1368184 1363232 1359095 1356543 1355975 1357284
61824 1357284 1360071 1363979 1368611 1373079 1375956 1376114 1373388 1367966 1359230 1345796 1326803 1302596 1273964
61811 1273964 1241353 1205206 1166518 1126430 1085529 1044102 1002857 962799 924497 888096 854006
61800 854006 822974 795338 770774 748969 730003 713688 699070 685132 671819 659869 649754
61789 649754 641214 633741 627052 621013 615513 610653 606762 603975 601855 599655 596902 593651 590262 587029
61775 587029 583997 581057 578225 575777 574021 572955 572368 572275 572909 574072 574842 574404 573037 571825 571382 571336
61759 571336 571175 571047 571394 572198 573068 573842 574626 575335 575707 575806 576075 576747 577458 577551 576527 574254 571094 567938
61741 567938 565696 564524 563840 563240 563005 563405 563905 563634 562511 561470 561535 563024 565623 568877 572464 576206
61725 576206 579903 583049 584912 585288 585144 586071 588869 592945 597167 600928 604186 606930 609030 610394 610836
61710 610836 609978 607691 604515 601196 597869 594156 590037 586003 582172 577884 572628 566967 562009 558156
61696 558156 554856 551483 547954 544514 541393 538755 536554 534280 531265 527482 523765 520993 519269 518044
61682 518044 516743 515061 512851 510075 506747 502809 498253 493596 489907 487966 487520 487648 487683 487418 486673 485247
61666 485247 483354 481558 480091 478574 476617 474386 472396 470979 470098 469567 469335 469684 471106 473751 477048
61651 477048 480176 482939 485792 489034 492451 495915 499748 504114 508483 512159 515071 517582 519698 520955
61637 520955 521069 520323 519244 518106 516717 514558 511296 507373 503893 501590 500035 498190 495614 492776 490232
61622 490232 487974 485664 483187 480785 478834 477542 476679 475599 473790 471392 468931 466534 463763 460322
61608 460322 456571 452991 449344 444723 438510 431075 423455 416517 410512 405304 400662 396221 391477 386249
61594 386249 381127 377049 374281 372160 369974 367786 366048 364751 363410 361750 359956 358195 356312 354124
61580 354124 351786 349684 348036 346671 345200 343504 342050 341472 341728 342056 341975 341951 342566 343358 343158 341526 339219
61563 339219 337253 336079 335783 336358 337377 337991 337765 337266 337409 338413 339761 340974 341989 342853 343484 343881
61547 343881 344320 345199 346737 348882 351402 354024 356531 358820 360977 363228 365715 368264 370553 372524 374400
61532 374400 376225 377750 379035 380677 382934 384904 385299 383980 382059 380414 378817 376708 374150 371589
61518 371589 369212 367003 365034 363272 361462 359653 358538 358703 359703 360395 360142 359303 358538 358018 357428 356500
61502 356500 355401 354668 354683 355190 355411 354797 353558 352369 351679 351457 351489 351818 352819 354772 357269 359306 360287
61485 360287 360755 361641 362929 363765 363870 364023 364851 365978 366891 367942 369753 372053 373886 374683 374574 373962 373396
61468 373396 373573 374731 376236 377373 378255 379255 379919 379478 378311 377780 378402 379235 379474 379740 381066 383249
61452 383249 385030 385696 385871 386705 388693 391304 393658 395508 397502 400342 403881 407391 410614 413956 417611
61437 417611 421124 424109 426874 429934 433303 436626 439770 442865 445985 449117 452304 455517 458474 460840
61423 460840 462561 463894 465213 466833 468830 470920 472689 473992 474929 475482 475537 475254 474967 474570 473498 471516
61407 471516 469039 466397 463322 459640 456015 453342 451589 449852 447538 445006 443010 441932 441662 441881 442286
61392 442286 442708 443115 443502 443857 444286 444972 445842 446505 446744 446864 447347 448317 449540 450762 451791 452497 453048 453928
61374 453928 455390 457078 458536 459866 461492 463510 465750 468294 471301 474464 477284 479951 483332 487852
61360 487852 492966 497912 502515 506991 511554 516684 523336 532267 543204 554993 566532 577349 587512
61347 587512 597321 607015 616456 625100 632406 638264 642986 647061 650947 654815 658248 660475 661181 660868 660147
61332 660147 658991 657146 654953 653051 651255 648474 644107 638972 634419 630831 627513 623891 620284 617506
61318 617506 616119 616159 617256 618831 620402 621971 624000 626909 630683 635111 640250 646387 653545 661287 669113
61303 669113 676884 684680 692338 699309 704998 709147 711785 712826 711866 708495 702886 696022 689201 683214
61289 683214 677984 672932 667614 662028 656478 651298 646661 642534 638852 635818 633998 633939 635625 638409 641544
61274 641544 644776 648375 652723 657948 663978 670803 678529 687124 696185 705173 713919 722714 731831 741154
61260 741154 750490 760057 770253 780990 791675 801850 811320 819471 825136 827754 828281 828230 827925 826378
61246 826378 822777 817301 810384 802178 793268 785033 778424 772807 766894 760564 754882 750446 746738 743288
61232 743288 740523 738947 738214 737672 737350 737787 739169 741212 743672 746405 749057 751246 753092 755122 757650
61217 757650 760546 763502 766141 767972 768795 769160 769972 771552 773523 775622 778073 781047 784400 788313 793549
61202 793549 800489 808315 815919 823533 832759 844841 859471 875501 892322 910043 928609 947373
61190 947373 965642 983224 1000103 1015693 1028790 1038418 1044628 1048372 1050718 1052220 1052853 1052266 1050036
61177 1050036 1045927 1040112 1033105 1025398 1017125 1007996 997532 985418 971768 957098 941932 926458
61165 926458 910609 894393 878023 861785 845978 830967 817076 804328 792466 781305 771005
61154 771005 762015 754820 749668 746279 743845 741599 739518 738259 738277 739186 740044 740044 738787 736133 732098 726890
61138 726890 720930 714881 709627 705990 704329 704494 706230 709468 714165 720243 727887 737687 750149 765204
61124 765204 782390 801343 821800 843325 865443 888068 911515 935984 961212 986599 1011509
61113 1011509 1035542 1058721 1081410 1103811 1125584 1146100 1164910 1181625 1195493 1205658 1212042
61102 1212042 1215560 1217205 1217108 1214660 1209191 1200229 1187372 1170478 1150055 1127143 1102654 1076955 1050204
61089 1050204 1022864 995686 969209 943491 918371 893916 870491 848427 827771 808512 790940
61078 790940 775630 762957 752688 744101 736457 729310 722494 716047 710244 705560 702367 700684 700262 700951
61064 700951 702848 705981 709992 714316 718762 723841 730380 738814 748903 760140 772306 785513 799776
61051 799776 814894 830909 848454 868236 890191 913516 937623 962697 989165 1016981 1045748
61040 1045748 1075252 1105485 1136351 1167781 1199996 1233257 1267393 1302035 1337276 1373677 1411580
61029 1411580 1450891 1491694 1534630 1580473 1629562 1681904 1737662 1797464 1862412 1933766 2012516
61018 2012516 2099497 2196396 2306591 2434543 2584466 2760172 2966081 3207486 3489700 3817830
61008 3817830 4197713 4635947 5138047 5706977 6344049 7050734 7829226 8682449 9614872
60999 9614872 10632431 11739018 12931196 14196110 15514853 16868118 18238738 19607255
60991 19607255 20940596 22180592 23244818 24047759 24534035 24701762 24599745 24303205 23886875
60982 23886875 23408085 22896946 22347045 21711497 20917611 19902451 18649767 17201863 15639291
60973 15639291 14047524 12495205 11030863 9687507 8485024 7430633 6521250 5747313
60965 5747313 5095360 4549389 4092700 3709918 3387807 3115093 2882417 2682350 2508949
60956 2508949 2357380 2224057 2106534 2002581 1909525 1824888 1747324 1676457 1612054 1553758
60946 1553758 1501233 1453838 1410181 1368496 1327611 1287413 1248537 1211777 1177490 1145241 1114242
60935 1114242 1084374 1056468 1031281 1008635 987929 969027 952073 936790 922658 909521 897429
60924 897429 886134 875504 866264 859502 855381 853027 851700 851385 852200 854059 857139 861889 868229 875427
60910 875427 883210 892339 903548 916441 930046 944075 958901 974551 990437 1006112 1021663 1037245
60898 1037245 1052712 1067937 1083167 1098816 1114931 1130938 1145836 1158818 1169932 1180021 1189685
60887 1189685 1198298 1204509 1207765 1208891 1208898 1207696 1204527 1199337 1192928 1185640 1176641 1164954 1150699 1134728
60873 1134728 1117365 1098326 1077895 1057387 1038010 1019728 1001673 983386 965220 947773 931447
60862 931447 916491 902900 890110 877219 863823 850403 837645 825515 813254 800252 786647
60851 786647 773052 759930 747366 735299 723694 712494 701629 691156 681252 671904 662699 653065
60839 653065 642667 631533 620017 608807 598706 590031 582305 574850 567536 560611 554063 547779 542198
60826 542198 537975 534822 531549 527649 524073 521861 520759 519983 519738 520873 523269 525656 527083 527709 528033
60811 528033 528234 528547 529462 531078 532857 534407 535929 537452 538208 537364 535094 532372 529980 528150 526896
60796 526896 526041 525028 523304 521066 519204 518328 518086 517528 515927 513147 509413 504928 499760 494112 488597
60781 488597 483966 480352 476964 472863 468032 463390 459746 457006 454566 452167 450053 448413 447039 445633
60767 445633 444226 443108 442521 442598 443405 444700 445715 445653 444660 443985 444770 446856 449088 450700 452021 453847
60751 453847 456512 459717 462952 465831 468172 469981 471386 472542 473577 474453 474837 474274 472720 470755 468988
60736 468988 467375 465448 463107 460676 458210 455340 451982 448657 445682 442511 438355 433293 428316 424265
60722 424265 421044 417873 414094 409717 405379 401831 399385 397795 396519 394998 392816 389997 387148 384920
60708 384920 383224 381389 379265 377581 376838 376361 375118 373268 372140 372650 374283 375819 376652 377124 377841 378956
60692 378956 380146 381165 382255 383830 385858 387938 390084 392938 396784 400836 404081 406574 409255 412659
60678 412659 416556 420832 425866 431773 437967 443859 449406 454606 458995 462187 464518 466666 468853 470889
60664 470889 472664 474092 474757 474316 473298 472910 473805 475294 475988 475112 473148 471346 470590 470624 470409 469346 467946
60647 467946 467060 466720 466159 464933 463464 462306 461298 459723 457114 453654 449922 446411 443201 439974 436425
60632 436425 432713 429371 426760 424809 423341 422336 421689 420949 419690 418066 416754 416336 416858 417916 418949
60617 418949 419518 419527 419246 418945 418532 417728 416603 415679 415419 415791 416430 417040 417495 417670 417415 416746 415982 415618 415952
60598 415952 416752 417387 417475 417418 418022 419507 421171 422233 422745 423349 424328 425353 426173 427025 428146 429222 429728
60581 429728 429663 429633 430258 431747 434067 437141 440733 444365 447720 451131 455413 461016 467444 473740 479572
60566 479572 485657 492926 501381 510002 517782 524609 531023 537357 543375 548667 553074 556648 559389 561147
60552 561147 561710 560940 558932 556184 553568 551997 551984 553441 555932 559158 563216 568285 574119 580193 586575
60537 586575 594372 604747 617378 630286 641423 650183 657200 663106 667980 671819 674920 677563 679575
60524 679575 680387 679435 676540 672143 667218 662702 658837 655170 651222 647022 643033 639852 638042 637931 639362
60509 639362 641866 645251 649874 656206 664363 674237 685788 698890 713161 728363 744860 763252 783612
60496 783612 805595 829302 855488 884583 915807 947605 978728 1008568 1036520 1061467 1082052
60485 1082052 1097347 1107109 1111491 1110612 1104302 1092106 1073495 1048340 1017452 982620 945809 908208
60473 908208 870261 832645 796746 763811 733946 706509 681336 658959 639573 622427 606620
60462 606620 592087 579326 568368 558490 548985 539924 532034 525891 521253 517171 512811 508120 503592
60449 503592 499496 495628 491872 488590 486165 484394 482650 480573 478358 476421 475014 474157 473691 473319 472702
60434 472702 471668 470401 469415 469182 469585 469813 469005 467015 464414 461843 459691 458338 458196 459256 460917 462509
60418 462509 463746 464556 464867 464821 464930 465700 467336 469896 473296 476859 479364 480144 479860 479761 480412 481608 483094
60401 483094 484636 485615 485424 484417 483808 484449 486199 488535 491155 493780 495968 497537 498848 500363 502187
60386 502187 504207 506394 508787 511370 514066 516613 518529 519664 520783 523006 526445 529924 532359 533907
60372 533907 535367 536979 538425 539693 541223 543211 545327 547276 549238 551523 554050 556452 558665 561189
60358 561189 564574 568705 572846 576505 579968 583721 587638 591211 594476 598138 602729 608141 614104 620545
60344 620545 627221 633497 638758 642684 644905 644973 643012 639921 636421 632341 627302 621722 616493 611904 607487
60329 607487 602801 597819 592671 587562 582914 579099 576016 573358 571253 570188 570299 571208 572551 574177 575739
60314 575739 576777 577563 579402 583562 589976 597393 604861 612774 622305 633964 647045 660553 674307
60301 674307 688709 703589 717879 730594 741553 750808 757868 762020 763097 761390 756996 749766 739754
60288 739754 727294 712830 697123 681377 666576 652844 640028 628581 619050 610860 602659 594079
60276 594079 586168 579753 574303 568997 564071 560248 557399 554663 551655 548758 546301 544150 542092 540091
60262 540091 538131 536364 535384 535793 537256 538545 538792 538362 538169 538417 538447 537716 536529 535665 535519 535803 536010
60245 536010 535915 535574 535051 534400 533853 533773 534303 535206 536111 536806 537278 537641 538109 538917 540153 541756 543695 545985
60227 545985 548545 551296 554453 558467 563470 569056 574823 580837 587213 593433 598633 602688 606644 611834
60213 611834 618623 626180 633349 639633 645375 651115 656913 662346 667076 671220 675120 678902 682391 685350
60199 685350 687625 689166 690037 690360 690159 689359 688112 686921 686160 685516 684225 681895 678831 675440 671656 667151
60183 667151 661927 656439 651228 646618 642651 639093 635504 631574 627503 623922 621385 619961 619334 619189 619408
60168 619408 619985 620814 621631 622186 622494 622857 623533 624429 625253 625896 626522 627280 628192 629347 630911 632789 634548
60151 634548 635941 637298 639135 641565 644453 648002 652669 658455 664738 670907 676771 682228 687041 691331
60137 691331 695940 701801 709011 716786 724243 731002 737169 743030 748743 754067 758423 761320 762645 762517
60123 762517 761136 758966 756740 754850 752997 750739 748232 746011 744273 742853 741709 740851 739874 738164 735632
60108 735632 732703 729547 725963 722117 718637 715692 712654 709157 705817 703281 701055 698110 694462 691356
60094 691356 689860 689916 690943 692767 695630 699569 704142 708680 712636 715804 718284 720271 721870 723149 724239
60079 724239 725207 725884 725983 725403 724174 722130 718838 714032 708018 701527 695130 688821 682157 674787 666810
60064 666810 658666 650819 643628 637359 632077 627563 623558 620063 617146 614543 611904 609463 607919 607400
60050 607400 607113 606507 606274 607518 610230 613369 616340 619542 623304 627154 630599 633924 637537 640897 642807
60035 642807 642701 641068 638669 635807 632478 628746 624704 620299 615412 609939 603750 596760 589240 581901
60021 581901 575470 570143 565441 560525 554695 547919 541055 535335 531333 528524 525986 523433 521290 519918
60007 519918 519195 518924 519209 520140 521378 522366 522882 523134 523392 523797 524501 525731 527600 529949 532443 534759 536741
59990 536741 538537 540586 543279 546555 549914 552871 555262 557077 558178 558365 557674 556448 555039 553505 551684
59975 551684 549540 547358 545569 544507 544378 545290 547017 548826 550007 550742 552033 554442 557236 559255 560401
59960 560401 561696 563859 566444 568632 570412 572535 575488 578891 581856 583735 584472 584440 584053 583500 582823 582080
59944 582080 581363 580671 579908 578916 577449 575293 572579 569838 567448 565153 562533 559913 558314 558354 559564 560966
59928 560966 562033 562927 564150 566169 569121 572636 576117 579299 582307 585177 587804 590498 594067 598924
59914 598924 604517 610034 615268 620307 624802 628351 631467 635375 640609 646319 651170 654490 656369 657094
59900 657094 656947 656370 655954 656121 656910 658108 659561 661364 663621 666073 668202 669912 671847 674687 678235
59885 678235 681666 684635 687720 691605 696166 700600 704168 706638 708176 709077 709533 709508 708927 708032 707318 706871
59869 706871 705924 703443 699248 694362 690081 686810 683949 680815 677368 673923 670484 666796 663071 660213
59855 660213 659057 659581 661128 663253 666079 669851 674456 679437 684298 688779 693036 697636 703190 709872
59841 709872 717263 724640 731326 736846 740952 743582 744774 744650 743611 742404 741649 741143 739818 736610 731374
59826 731374 724800 717527 709582 700758 691313 681971 673270 665215 657676 650801 644756 639241 633690 627987
59812 627987 622662 618329 615187 613098 611828 611096 610631 610270 609799 608722 606612 603796 601220 599420 598003
59797 598003 596382 594525 592654 590710 588646 586828 585529 584304 582544 580462 578822 577766 576648 575151
59783 575151 573826 573265 573295 573329 573089 572620 571908 570846 569448 567935 566762 566598 567911 570390 573007 574896
59767 574896 575971 576648 577329 578392 580316 583345 587091 590848 594350 598046 602517 607746 613081 617910 622286
59752 622286 626752 631617 636667 641668 646778 652153 657467 662315 666921 671883 677206 682150 686152 689342
59738 689342 691959 693809 694661 694801 694746 694636 694195 693084 691065 688148 684869 682188 680671 679910 679078 677887
59722 677887 676676 675687 674716 673495 672034 670493 669039 667959 667707 668580 670372 672409 673995 674918 675589 676653
59706 676653 678339 680258 681893 683223 684684 686621 688955 691476 694182 697153 700086 702285 703301 703542
59692 703542 703979 705159 706680 707667 707568 706388 704491 702455 700869 699835 698726 696819 694077 691014 687893
59677 687893 684529 680844 677088 673358 669402 665043 660389 655433 649932 643974 638275 633600 630150 627749
59663 627749 626222 625265 624329 623133 622023 621412 621103 620669 620314 620738 622116 623706 624734 625273 626013 627306
59647 627306 628686 629348 628950 627828 626434 624754 622496 619736 616994 614632 612563 610604 608727 606798 604534
59632 604534 602006 599787 598227 596961 595488 593840 592218 590390 588035 585412 582984 580590 577729 574551
59618 574551 571772 569597 567573 565670 564633 564839 565543 565809 565636 565538 565543 565384 565424 566524 568905 571759 574168
59601 574168 575904 577169 578007 578348 578307 578044 577436 576224 574490 572787 571690 571353 571502 571777 571991 572124 572123 571800
59583 571800 571019 569981 569137 568664 568159 567075 565383 563518 561675 559591 557154 554811 552978 551361 549331
59568 549331 546876 544747 543630 543531 543942 544271 544202 544069 544800 546913 549546 551139 551316 551438 552979 555961 559422
59551 559422 562753 565942 569094 572577 577280 583778 591318 598578 605451 613211 622721 633368 644168 655098
59537 655098 666682 678849 690997 702950 715042 727122 737965 745949 750206 751142 750049 748283 746624
59524 746624 745247 744144 743363 742796 741965 740271 737445 733645 729165 724150 718526 712073 704571 695975 686471
59509 686471 676368 666039 655949 646539 637919 629760 621684 613782 606670 601050 597253 595061 593812
59496 593812 592734 591451 590235 589643 589828 590370 590914 591778 593610 596441 599452 601861 603853 606363 610055
59481 610055 614778 619960 625185 630294 635269 640194 645230 650520 656232 662703 670213 678468 686481 693223
59467 693223 698279 701836 704398 706755 709904 714446 720008 725612 730735 735800 741652 748735 756809 765219
59453 765219 773379 781150 788815 796565 803978 810221 814843 818208 820909 822801 822815 819901 814167 806879 799243
59438 799243 791383 782743 773247 763635 754719 746951 740820 736949 735226 734390 733250 732162 732649 735622 740680
59423 740680 747190 755317 765546 777622 790530 803470 816553 830441 845429 860948 875993 889942
59411 889942 902802 914720 925559 935035 942702 947483 947668 942156 931706 918565 904910 891944 880154
59398 880154 869713 860619 853006 847243 843052 838515 830854 818592 802552 784623 766221 748141 731105
59385 731105 715765 702536 691757 683612 677602 672693 668463 665596 664782 665605 667124 669077 671819 675446
59371 675446 679807 685100 691621 698906 705921 712207 718277 724792 732017 740111 749286 759327 769517 779395
59357 779395 789260 799649 810721 822450 835085 848985 864146 880153 896499 912700 928241 942645
59345 942645 955688 967428 978114 987939 996684 1003503 1007280 1007444 1004407 999157 992477 984478 974718 962695
59331 962695 948463 932785 916533 899968 882878 865475 848778 833878 821040 809723 799275
59320 799275 789393 780141 771866 765065 760068 756774 754679 753047 751102 748504 745927 744816 746091 749212
59306 749212 752834 756210 759511 763018 766644 770313 774209 778439 782972 788042 793964 800253 805606 809235
59292 809235 811643 813353 813427 810210 803393 794374 784580 774428 764172 754728 747028 741247 737327 735729
59278 735729 736941 740591 745779 752067 759498 767812 776393 784975 793779 802859 811853 820405 828233 834718
59264 834718 839110 841407 842406 842549 841232 837681 832024 824983 816892 807731 797917 788388 779790 772036 764801
59249 764801 758068 752074 747117 743590 741957 742358 744348 747187 750319 753511 756685 759938 763695 768517
59235 768517 774442 780566 785530 788538 789742 789590 788104 785134 781067 776686 772194 766857 759985 751985
59221 751985 744071 737119 731208 726070 721432 716887 712080 707363 703886 702512 702788 703393 703508 703328 703229 703021
59205 703021 702314 701191 699985 698574 696464 693670 691080 689637 689392 689549 689278 688286 686827 685460 684683 684545
59189 684545 684653 684772 685320 686987 689902 693525 697375 701483 705964 710524 714790 718989 723823 729566 735567
59174 735567 740978 745853 751260 758210 766723 776035 785449 794679 803548 811838 819471 826440 832375 836638
59160 836638 839024 840013 840013 838721 835568 830466 823673 815248 805249 794297 783347 772922 763016 753589
59146 753589 744498 735103 724771 713988 704207 696207 689251 682242 675147 668743 663439 659043 655477 653065
59132 653065 652070 652364 653623 655555 657959 660752 663983 667712 671965 676862 682600 689234 696703 705185 715104
59117 715104 726550 738963 751638 764275 776811 789058 800894 812552 824281 835838 846697
59106 846697 856530 865129 872076 877086 880679 883893 887136 889687 890533 889436 887008 883997 880733 877131
59092 877131 872984 868212 862927 857384 851927 846969 842745 838975 834920 829927 823839 816801 808945 800489
59078 800489 791856 783319 774710 765855 757154 749186 741763 733907 725014 715682 707187 700427 695552 692279
59064 692279 690065 688083 685414 681591 676984 672572 669295 667438 666501 665599 664014 661549 658620 656049 654531
59049 654531 654036 653784 653024 651813 650898 650916 651890 653434 655129 656681 658022 659474 661659 665030 669530 674725
59033 674725 680263 686103 692442 699535 707590 716686 726672 737176 747803 758463 769531 781584 794789
59020 794789 808455 821277 832160 840934 848233 854608 859822 863157 864364 864056 863055 861661 859776 857552
59006 857552 855547 854343 854308 855628 858200 861473 864780 867884 870919 873880 876535 878804 880696 881844 881724
58991 881724 880474 878844 877024 874215 869827 864473 859117 853770 847851 841535 835821 831283 827599 824507
58977 824507 822568 822642 825035 829424 835297 842248 850054 858639 867891 877475 886988 896246 905219 913765 921734
58962 921734 929235 936436 943095 948633 952672 955141 955776 953905 948964 941095 931082 919779 907582 894309
58948 894309 879670 863994 848387 833986 821188 809881 800146 792279 786195 781317 777107 773309 769712
58935 769712 766150 762845 760265 758452 756863 754954 752475 749116 744510 738924 733409 728749 724580 720014
58921 720014 714903 709998 706009 703055 701023 699968 699962 700843 702374 704560 707670 711959 717421 723836 731040
58906 731040 739076 748015 757738 768132 779479 792271 806480 821391 836510 852380 869985 889363
58894 889363 909307 928623 947265 965934 984822 1003196 1020194 1035689 1050301 1064801 1079558
58883 1079558 1094250 1107849 1119002 1126670 1130499 1130646 1127418 1121115 1111943 1099928 1085111 1067993 1049549
58870 1049549 1030557 1011228 991769 972936 955493 939408 924226 910056 897345 885782 874369
58859 874369 862850 852086 842594 833577 824096 814416 805377 797008 788718 780465 772749 765584 758417 751046
58845 751046 743767 736568 729019 721124 713558 706702 700032 692831 685098 677475 670516 664298 658518 652873
58831 652873 647489 642945 639705 637643 636370 635715 635524 635266 634519 633730 633792 634838 636089 636998 637926 639520
58815 639520 641969 644998 648028 650224 651043 650990 651188 651890 652063 650879 649023 647882 647828 647934 647224 645617 643687
58798 643687 641968 640679 639873 639603 639821 640145 639943 638900 637443 636334 635998 636544 638231 641308 645393 649631
58782 649631 653618 657623 661735 665445 668399 671026 673925 676994 679590 681306 682163 682245 681588 680306 678590
58767 678590 676584 674369 671947 669180 665972 662577 659480 656929 654878 653373 652590 652408 652434 652660 653660
58752 653660 655877 659010 662338 665351 667964 670533 673799 678391 684160 690346 696532 702991 709999 717431
58738 717431 725282 733893 743239 752544 761142 769255 777441 785753 794030 802488 811303 819887 827367 833658
58724 833658 839325 844466 848431 850812 852097 853142 854384 855821 857419 859227 861131 862705 863386 862886 861382
58709 861382 859152 856016 851394 844939 836812 827205 815999 803179 789291 775071 760677 745581 729271
58696 729271 711957 694621 678324 663367 649208 635423 622531 611469 602421 594770 588139 582678
58684 582678 578162 573713 568904 564445 561156 558845 556913 555639 556053 558687 563035 568201 573543 578807
58670 578807 584098 589762 596038 602809 609853 617096 624522 632149 640278 649202 658306 665931 670660 672465
58656 672465 672198 670362 666950 662093 656202 649578 642414 635129 628235 621960 616324 611451 607502 604497
58642 604497 602467 601479 601242 601103 600778 600650 600948 601160 600853 600568 601219 602904 605016 607160 609253 611035 612336
58625 612336 613688 615887 618965 622313 625692 629439 633742 638490 643828 650084 657007 663754 669786 675259
58611 675259 680430 685194 689273 692373 694127 694439 693925 693494 693391 693106 692218 690751 688716 685936 682575 679330
58595 679330 676948 675846 676218 677942 680376 682838 685514 689393 695111 702248 709975 718016 726784 736870
58581 736870 748505 761290 774346 786972 799125 810994 822344 832805 842764 853307 865108 877856
58569 877856 890970 904448 918749 934272 951245 969839 990052 1011513 1033580 1055644 1077298
58558 1077298 1098214 1117785 1134869 1148177 1157135 1162203 1164171 1163391 1159905 1154035 1146407 1137502 1127424
58545 1127424 1115933 1102565 1087060 1069935 1052237 1034429 1015991 996510 976534 956803 937316
58534 937316 917983 899647 883419 869307 856526 845010 835496 828097 821940 816463 812186 809840 809461
58521 809461 810593 812708 815130 817192 818845 820603 822660 824493 825487 825437 824278 821887 818423 814400 810183
58506 810183 805763 801186 796824 793034 789823 786945 784046 780744 776886 772725 768639 764941 762241 761515
58492 761515 763159 766216 769306 772192 775807 780930 787552 795340 803880 812546 820980 829757 839767 850953
58478 850953 862386 873552 884624 895356 904699 911830 916846 920114 921505 920478 916548 909717 900908
58465 900908 891718 883139 874900 866823 860211 856573 855352 854508 853436 853659 856330 860617 865213 869944 874978
58450 874978 879676 883269 885752 887202 887035 884820 881209 877192 873020 868617 864462 861291 859295 858259
58436 858259 858159 859093 861082 864310 869039 874891 880826 886291 891771 897822 904274 910893 918039 926000 934237
58421 934237 941937 948699 954107 957329 957923 956570 954168 950541 944794 936711 927180 917308 907658 898205
58407 898205 888707 879145 869965 861770 854816 849220 845484 844118 844658 845786 846651 847430 848546 850111 852279
58392 852279 855204 858305 860436 861127 860843 859784 857481 854011 850560 848165 846763 846041 846236 847405 848907
58377 848907 850481 853103 857873 864615 872290 880202 888203 896329 905046 915284 927532 941181 955199
58364 955199 968989 982292 994926 1007040 1018953 1030410 1040771 1050176 1059513 1068866 1077076 1083408
58352 1083408 1088549 1093295 1097416 1100648 1103697 1107296 1111215 1115189 1119933 1126235 1133811 1142087 1151372 1162235
58338 1162235 1174361 1186925 1199584 1212336 1225029 1237739 1250945 1264591 1277659 1289365 1300030
58327 1300030 1310143 1319390 1327265 1333715 1338570 1341385 1342617 1343940 1346568 1350259 1354618 1360167 1367272 1375367
58313 1375367 1384211 1394571 1406632 1419129 1431300 1444227 1458855 1474094 1488520 1502714 1518167
58302 1518167 1534923 1552005 1569234 1586884 1604363 1620996 1637447 1654765 1672705 1690449 1708275
58291 1708275 1726974 1746399 1766121 1786823 1809510 1833979 1859372 1885505 1912414 1939605 1967101
58280 1967101 1996146 2027462 2060058 2093283 2128561 2167240 2208152 2249452 2291646 2336525 2384176
58269 2384176 2433367 2483974 2536645 2590849 2645525 2701037 2758375 2817272 2877142 2938881 3003395
58258 3003395 3069294 3134506 3199355 3265662 3333761 3402962 3474075 3548773 3627063 3708043 3792459
58247 3792459 3881973 3976691 4076068 4181474 4295065 4416939 4546104 4683417 4830654 4987662
58237 4987662 5153517 5329584 5518210 5719343 5931859 6157471 6399886 6660922 6940962
58228 6940962 7242402 7568884 7921960 8302404 8714166 9163219 9653405 10187644 10772448
58219 10772448 11417019 12128931 12915453 13788610 14764597 15859703 17092651 18491101 20091647
58210 20091647 21935689 24072365 26565689 29492755 32934603 36973826 41700103 47212191
58202 47212191 53614911 61016300 69516632 79181482 90019291 101991128 115043033 129128719
58194 129128719 144219162 160312449 177418830 195482023 214275595 233384180 252315411
58187 252315411 270649959 288091222 304351397 318908577 330760397 338393807 340161392
58180 340161392 334971800 322859656 305009951 283243280 259374961 234834646 210605639
58173 210605639 187326471 165420454 145197285 126890470 110627172 96393516 84058980
58166 84058980 73441575 64351163 56596662 49990705 44363832 39568886 35472982 31956538
58158 31956538 28921417 26290683 23998666 21987750 20213438 18642857 17245834 15992855
58150 15992855 14861184 13835617 12901944 12045353 11255767 10528880 9860651 9245289 8678890
58141 8678890 8160040 7685897 7251608 6853755 6490181 6156468 5846934 5559353 5294400
58132 5294400 5050133 4821259 4604377 4399866 4207943 4026854 3855868 3696256 3548087
58123 3548087 3409213 3278364 3156217 3042524 2935159 2832960 2736824 2647133 2562646 2482594
58113 2482594 2407301 2336088 2267155 2200274 2137121 2078214 2021965 1967452 1915633 1866916 1819932
58102 1819932 1773762 1729219 1686881 1645802 1605198 1565612 1527493 1490416 1454557 1421236 1391032
58091 1391032 1362944 1336244 1311564 1289225 1267966 1246411 1224698 1203886 1184654 1167050 1150451
58080 1150451 1133393 1114582 1094499 1074847 1056202 1037412 1017540 997064 976841 957214 938536
58069 938536 921290 905244 889592 874227 859786 846345 833331 820834 809578 799448 789545 779987
58057 779987 772074 766163 760803 754549 747367 739755 731745 723337 714762 705882 696371 686837 678548 671779
58043 671779 665620 659619 654208 649275 643887 637910 632362 627552 622357 615995 609026 601879 593874 584663
58029 584663 575285 566773 558894 551162 543886 537220 530320 522595 514857 508133 502244 496557 491271 486853
58015 486853 482988 479189 475801 473334 471349 469009 466275 463641 461205 458857 456883 455515 454315 452886
58001 452886 451794 451944 453317 455062 456553 457708 458577 459213 459702 459870 459355 458349 457718 457849 458034 457567 456790
57984 456790 456269 455613 454047 451669 449167 446591 443411 439581 435601 431565 427058 422177 417886 415081 413687
57969 413687 412806 411450 409192 406483 404340 403415 403335 403110 402044 400107 397747 395637 394398 394161 394456 394722
57953 394722 394814 394969 395542 396874 399017 401458 403546 405427 408093 412269 417747 424083 431305 439473 448104
57938 448104 456691 465486 475131 485736 496819 507974 519147 530346 541438 552094 561645 569219
57926 569219 574261 576687 576457 573449 568021 561153 553573 545148 535554 525100 514388 503587 492595
57913 492595 481559 470682 459914 449432 440066 432491 426259 420367 414616 409674 405853 402625 399404
57900 399404 396203 393360 391118 389579 388638 387887 387019 386366 386579 387738 389276 390862 392894 395878 399740
57885 399740 403941 408012 411731 415021 417859 420198 421906 422835 422904 421968 419735 416099 411502 406681 402046
57870 402046 397514 392911 388240 383616 379297 375836 373792 373140 373180 373204 373041 372858 372723 372611 372685 373284 374606
57853 374606 376554 378939 381718 384871 388057 390518 391591 391353 390563 389831 388972 387338 384616 381045 376998
57838 376998 372678 368292 364205 360721 357859 355493 353654 352536 352202 352393 352685 352846 353059 353777 355341 357716
57822 357716 360536 363379 366013 368427 370728 373008 375276 377396 379034 379835 379758 379215 378636 377953 376729 374793
57806 374793 372393 369570 365800 360667 354655 348911 344254 340720 337915 335468 333158 330951 328939 327105
57792 327105 325316 323750 323009 323354 324100 324378 324390 325210 327285 329835 331961 333701 335643 338091 341062 344673
57776 344673 348956 353482 357615 361056 363906 366356 368499 370303 371530 371837 371089 369385 366742 363097 358775
57761 358775 354551 350874 347357 343375 338966 334719 330961 327521 324309 321699 320099 319304 318475 316881 314653
57746 314653 312639 311393 310493 309167 307379 305813 304758 303547 301347 298040 294092 289970 286000 282457
57732 282457 279362 276427 273486 270755 268413 266241 264035 262107 260871 260128 259209 257804 256256 254971 253891
57717 253891 252603 250777 248439 245992 244010 242902 242673 242948 243122 242599 241188 239362 237855 236802 235525
57702 235525 233395 230717 228509 227461 227355 227425 227083 226257 225160 223905 222496 221240 220863 221861 223871 225997
57686 225997 227768 229514 231946 235846 242020 250947 262327 275486 290307 307306 326716 348150 371314
57673 371314 396366 423326 451888 482183 515030 550768 588380 626247 663247 698454 730164
57662 730164 755808 772497 777259 767635 743183 706363 661286 611717 560693 511250 466046 426094
57650 426094 390856 359863 333522 312143 295016 280933 269070 259007 250312 242600 235756 229824
57638 229824 224762 220447 216726 213373 210142 206941 203867 201096 198853 197377 196662 196308 195827 195011 193839
57623 193839 192263 190327 188315 186414 184440 182165 179703 177238 174656 171898 169405 167635 166383 165142
57609 165142 164022 163604 163949 164475 164899 165595 166761 167873 168306 168084 167702 167467 167321 167065 166606 166054 165542 164760
57591 164760 162860 159371 155154 151851 150209 149402 148246 146581 145140 144364 143772 142400 139684 135977 132291
57576 132291 129435 127470 126079 125153 124596 123798 122016 119419 117170 116197 116291 116601 116592 116191 115454 114418 113113
57559 113113 111462 109379 107175 105555 105015 105425 106413 107831 109584 111258 112327 112686 112744 113039 113910 115403
57543 115403 117267 119015 120170 120580 120526 120535 120999 121857 122617 122739 121935 120162 117655 115139 113632 113573 114244 114453
57525 114453 113707 112381 110915 109361 107783 106580 106251 107092 109090 111749 114064 115236 115507 115908 117037
57510 117037 118502 119632 120226 120460 120594 121016 122147 123920 125643 126618 126688 126097 125173 124338 123936 123739 122936
57493 122936 120936 117994 114858 112072 109761 107762 105690 103160 100242 97497 95414 94036 93202 92785 92522
57478 92522 92013 91197 90460 90083 89847 89442 88873 88182 87174 85819 84569 83817 83299 82522 81590 81117 81378 82009
57460 82009 82568 83012 83510 84036 84338 84223 83727 82962 81855 80282 78567 77551 77743 78599 79147 79238 79573 80448
57442 80448 81230 81366 81220 81459 82105 82704 83039 83185 83155 82948 82665 82224 81284 79838 78523 77880 77634 77179 76467
57423 76467 75922 75731 75703 75578 75027 73679 71724 70117 69568 69593 69224 68391 67824 67805 67913 68038 68643 69828 70913
57404 70913 71321 71231 70999 70552 69795 69120 68913 68865 68280 67020 65783 65445 66299 67864 69376 70517 71701 73482
57386 73482 75723 77596 78456 78429 78094 77871 77867 78096 78615 79478 80559 81385 81277 80020 78308 77136 76687 76197
57368 76197 75017 73417 72077 71174 70301 69149 67896 67007 66797 67167 67617 67665 67357 67307 68087 69674 71563
57351 71563 73282 74612 75430 75605 75190 74582 74326 74659 75257 75537 75230 74578 73948 73395 72748 71935 71062 70268
57333 70268 69719 69630 70016 70437 70240 69156 67489 65733 64235 63205 62786 62874 63046 62749 61599 59570 57070
57316 57070 54757 53071 51890 50828 49855 49321 49342 49518 49476 49435 49884 50769 51368 51074 50104 49280 49142 49502 49840
57297 49840 49961 50046 50198 50254 50086 49796 49417 48669 47320 45679 44454 44073 44307 44551 44331 43502 42091 40019
57279 40019 37038 33065 28605 24650 21967 20541 19816 19395 19418 20390 22694 26137 29933 33368 36469 39726
57263 39726 43157 46190 48650 51245 54563 58066 60703 62222 63201 64006 64405 64190 63562 62860 62418 62599
57247 62599 63435 64265 64316 63657 63025 62749 62490 62044 61621 61218 60539 59803 59848 60968 62303 62871 62732 62715 63584
57228 63584 65947 70271 76230 82382 87271 90705 93438 95901 97941 99654 101702 104590 108120 111655
57214 111655 114634 116874 118675 120701 123455 126919 130932 135695 141563 148457 155941 163796 172083 180616
57200 180616 188861 196463 203555 210369 216797 222480 227176 231010 234459 238113 242396 247626 254381 263328
57186 263328 274320 285967 296752 306536 316410 327055 337849 347790 356643 364662 371586 376528 378791
57173 378791 378373 375727 371444 366333 361371 357236 353936 351212 349260 348777 350173 353047 356719 361069 366417
57158 366417 372697 379316 385984 393091 400853 408519 414943 419732 423324 426130 428155 429435 430199 430358 429305
57143 429305 426503 422059 416597 410812 405270 400305 395859 391521 386847 381507 375154 367497 358663 349230
57129 349230 339671 329822 318984 306435 291851 275466 257937 239983 222125 204923 189181 175462
57117 175462 163401 152089 141385 132612 127906 129407 139257 159879 193996 245018 317930 419398
57105 419398 556361 734222 955244 1215820 1502280 1788210 2035894 2199752 2228016 2063392
57095 2063392 1647194 928799 -122093 -1503592 -3173848 -5055320 -7058451 -9119994 -11236857
57086 -11236857 -13475912 -15953072 -18786024 -22030631 -25620923 -29343719 -32870829 -35839492
57078 -35839492 -37943003 -38995802 -38960633 -37940673 -36140723 -33806651 -31165384 -28389856
57070 -28389856 -25595470 -22854840 -20214952 -17710168 -15369775 -13219065 -11275526 -9545691
57062 -9545691 -8026084 -6706046 -5569402 -4595914 -3764207 -3054697 -2450287 -1935751 -1497765
57053 -1497765 -1125055 -807407 -534710 -297930 -90836 90123 247654 384585 503245 604904
57043 604904 690338 760544 816717 859956 891251 911687 922628 925863 923409 916948 907644 896719
57031 896719 885810 876265 868369 861858 856999 854508 854366 855333 855808 854855 852510 849669 847722 847653 849074
57016 849074 850307 849458 845261 837237 825793 812288 798334 784629 770834 756654 742535 729060
57004 729060 716267 703907 691989 680637 669764 659288 649393 640194 631406 622841 615047 608986 605062
56991 605062 602719 601019 599460 598293 598203 599546 601734 603530 604126 603724 602893 601567 599030 594650 588275
56976 588275 579988 569908 558351 545934 533445 521684 511311 502608 495394 489427 484823 481887 480613
56963 480613 480675 481918 484468 488247 492675 497164 501772 507038 513099 519073 523397 524789 522897 518107 510868
56948 510868 501439 490347 478816 468337 459698 452633 446593 441695 438704 438178 439893 443195 447698 453421
56934 453421 460356 468170 476338 484336 491600 497536 501745 504098 504328 501700 495402 485290 472089 456889
56920 456889 440643 424074 407628 391404 375407 360077 346316 334836 325699 318616 313406 309850
56908 309850 307368 305265 303228 301250 299105 296357 293095 290380 289620 291445 295273 299984 304902 310093
56894 310093 315805 321916 328170 334752 342223 350719 359551 367885 375620 383327 391428 399660 407217 413142
56880 413142 416647 417371 415470 411428 405855 399605 393933 390163 389075 390721 394820 401170 409775 420722
56866 420722 433978 449198 465840 483637 502797 523452 545003 566293 586310 604318 619365
56855 619365 630229 636067 636767 632510 623464 610316 594810 579284 565704 555322 549033 547581 551231
56842 551231 559511 571461 586300 603968 625053 649982 678200 708365 739473 771448 804276 836684
56830 836684 866006 889140 903287 906018 895655 872363 838893 799862 759900 722133 687961 657947
56818 657947 632823 613658 601080 594596 592962 595277 601516 612017 626717 644945 665607 687306
56806 687306 708544 728076 744945 757941 765168 764526 754770 736083 709858 678274 644067 610081
56794 610081 578523 550452 526040 505283 488441 475918 467883 464033 463719 466264 471182 478099 486575
56781 486575 496084 506085 515913 524580 530841 533508 531591 524238 510874 491751 468309 442745 417056
56768 417056 392446 369424 348220 329056 312184 297830 286063 276555 268484 260841 253076 245474
56756 245474 238783 233334 228693 224260 220055 216622 214231 212542 211118 209893 208926 207998 206818 205399 203956
56741 203956 202524 201055 199798 199174 199249 199640 199993 200230 200264 199894 199166 198560 198507 198958 199589 200195 200619 200527 199694
56722 199694 198489 197758 198114 199460 201152 202486 203114 203291 203704 204780 206148 207036 207217 207237 207612 208142 208340
56705 208340 208262 208535 209508 210714 211304 210883 209842 208928 208566 208580 208574 208535 208936 210137 211813 213165 213655 213344 212532
56686 212532 211332 209767 208040 206485 205244 204204 203268 202588 202495 203180 204425 205656 206403 206729 207073 207610
56670 207610 207995 207850 207292 206740 206447 206558 207431 209374 212092 214845 217244 219406 221283 222448 222866 223304
56654 223304 224507 226383 228461 230722 233299 235666 237025 237489 238068 239295 240588 241286 241669 242424 243606
56639 243606 244682 245326 245612 245576 245165 244605 244303 244207 243632 241991 239559 237290 235887 235176 234420 233103 231269
56622 231269 229088 226486 223488 220720 219002 218304 217563 215936 213889 212706 213014 214229 215388 216117 216683
56607 216683 217379 218144 218664 218638 217907 216468 214531 212557 211095 210423 210395 210735 211397 212476 213871 215272 216414
56590 216414 217126 217279 217007 216878 217379 218227 218679 218578 218515 218816 219049 218944 219108 220233 222055 223822 225489 227615
56572 227615 230240 232643 234356 235809 237796 240707 244393 248395 252234 255846 259799 264711 270456 276321
56558 276321 281932 287568 293494 299466 305060 310045 314278 317595 320016 321741 322838 323289 323393 323669 324133
56543 324133 324104 322946 320634 317439 313599 309627 306381 304207 302362 299852 296671 293593 290918 288114 284839
56528 284839 281679 279495 278356 277535 276393 274904 273335 271731 269932 267904 265825 263843 261962 260221
56514 260221 258734 257415 255917 254137 252574 251830 251777 251622 250868 249847 249189 249023 248876 248125 246466 244196
56498 244196 242175 241305 241823 243153 244467 245227 245326 245059 244963 245273 245453 244708 243150 241989 242300 243961 246102
56481 246102 248170 250086 251678 252536 252402 251371 249808 248355 247797 248510 250029 251495 252438 252878 252873 252459 252000
56464 252000 252060 252784 253782 254765 255927 257405 258674 258944 258162 257345 257673 259324 261340 262665 263122 263271 263459
56447 263459 263380 262562 261068 259521 258616 258640 259271 259810 259821 259618 259827 260421 260601 259871 258836 258538 259224 260184 260719
56428 260719 260854 261056 261517 261856 261493 260379 259318 259295 260346 261406 261513 260881 260520 261029 262154 263309 264116
56411 264116 264534 264866 265632 267108 268981 270668 271873 272593 272835 272713 272721 273363 274504 275529 276202 276911 277903
56394 277903 278710 278721 278101 277783 278530 280214 282105 283690 285050 286405 287547 288027 287858 287656 287946 288643 289412
56377 289412 290269 291475 293029 294554 295590 295839 295277 294312 293699 294090 295687 298296 301370 303910 304890 304218
56361 304218 302958 302173 301883 301515 300944 300419 299775 298591 297138 296466 297269 299158 301205 302925 304536 306505
56345 306505 308866 310950 311970 312007 312077 312973 314453 315991 317735 320056 322589 324607 326069 327414 328559
56330 328559 329137 329693 331443 334645 338202 341225 343980 346852 349379 351036 352203 353559 355043 356153 356913
56315 356913 357823 359042 360202 360904 360975 360463 359791 359763 360997 363370 366184 368698 370467 371545 372687 374957
56299 374957 378771 383490 388203 392592 396754 400539 403571 405842 407895 410292 413025 415433 416833 417406
56285 417406 418371 420936 425144 430143 435475 441423 448081 454800 460952 466703 472703 479418 487038 495521
56271 495521 504434 513250 522136 531995 543409 556046 569454 583829 599620 616878 635521 655788
56259 655788 677996 702296 729137 759433 793681 831310 871480 914134 959764 1008616 1060750
56248 1060750 1116350 1175144 1235837 1296942 1358013 1419337 1480606 1540654 1598344 1652899 1703302
56237 1703302 1748130 1786214 1816994 1840098 1855004 1861218 1858412 1846399 1825326 1795912 1759184 1716067
56225 1716067 1667493 1614720 1559091 1501614 1443206 1385124 1328609 1274114 1221369 1170224 1121094
56214 1121094 1074612 1031248 991228 954436 920398 888662 859155 831943 806840 783637 762463
56203 762463 743517 726543 710972 696487 683137 671089 660571 651764 644380 637633 631087 625191
56191 625191 620571 617164 614608 613001 612533 612675 612584 612050 611247 609824 607307 604355 602486 602305 602986 603784
56175 603784 605090 607453 610449 613281 616017 619496 624280 630262 637051 644226 651321 658071 664802 672308
56161 672308 681238 691636 703043 714986 727479 741103 756604 774439 794771 817833 844140 874307
56149 874307 908731 947431 990259 1037438 1089816 1148312 1213082 1283551 1359326 1440688 1528107
56138 1528107 1621757 1721615 1827437 1938262 2052383 2168048 2283557 2396443 2503328 2601255
56128 2601255 2688617 2764426 2827650 2878141 2917413 2947334 2968328 2979606 2980451 2970202 2947662 2912125
56116 2912125 2865014 2809229 2746721 2677629 2601611 2518764 2429105 2332488 2229654 2122637 2013817
56105 2013817 1905248 1799066 1697748 1603581 1518305 1443243 1379058 1325246 1280454 1243418 1213177
56094 1213177 1188610 1168524 1152119 1138794 1127784 1118702 1111996 1107928 1105526 1103694 1102935 1104512 1108119
56081 1108119 1112018 1115603 1120206 1126951 1135314 1144358 1153983 1164245 1174648 1184947 1195653 1207048 1218598
56068 1218598 1229978 1241778 1254512 1267840 1281461 1295927 1311714 1328185 1344256 1359627 1374732
56057 1374732 1389867 1404934 1419779 1434398 1448994 1463876 1479004 1493872 1508413 1523694 1540894
56046 1540894 1559875 1579720 1600310 1622135 1644885 1667857 1691691 1718001 1747007 1777169 1807553
56035 1807553 1838821 1871411 1904510 1937695 1972010 2008418 2046544 2085845 2126709 2169459 2213526
56024 2213526 2258540 2305093 2353609 2403673 2455287 2509503 2566883 2626578 2687940 2751834 2819342
56013 2819342 2890281 2964026 3040788 3121140 3205221 3293211 3385555 3482093 3582112 3685950 3795315
56002 3795315 3911445 4034290 4163991 4301548 4447380 4601024 4763065 4935471 5119141
55993 5119141 5313136 5517509 5734901 5968155 6218370 6486670 6775803 7088452 7425995
55984 7425995 7790591 8186658 8618745 9090001 9604467 10169016 10791493 11479219 12241326
55975 12241326 13090798 14042913 15114431 16326831 17709022 19296337 21130763 23265175
55967 23265175 25765167 28704521 32161081 36218840 40971498 46521953 52978111 60442185
55959 60442185 68987928 78636031 89351511 101067957 113715703 127239032 141610550
55952 141610550 156835015 172905132 189706660 206951128 224218906 241085655 257205393
55945 257205393 272248701 285707644 296684179 303839147 305655944 300995204 289647854
55938 289647854 272503195 251210180 227600729 203260355 179394005 156863676 136240625
55931 136240625 117837891 101753089 87922331 76168207 66245256 57888560 50849843
55924 50849843 44908777 39872823 35580833 31904743 28741410 26003506 23618961 21532078
55916 21532078 19698215 18078116 16638888 15355706 14207986 13175705 12241539 11393202
55908 11393202 10620439 9912186 9259223 8656939 8102617 7592067 7121074 6687681 6290364
55899 6290364 5925825 5590669 5283230 5001692 4742413 4502210 4280396 4076597 3888544
55890 3888544 3714058 3553251 3406548 3272125 3147391 3031493 2924400 2825037 2732237 2646141
55880 2646141 2566808 2492802 2422832 2357237 2295944 2236514 2176293 2115277 2054808 1994683 1933733
55869 1933733 1872328 1812056 1753465 1695980 1639556 1584753 1531745 1480773 1432900 1388776 1347266
55858 1347266 1306835 1267653 1230862 1196478 1163644 1132355 1103227 1075949 1049568 1024035 999959
55847 999959 977047 954212 931165 908653 887233 866861 847503 829088 811115 793300 776285
55836 776285 760746 746206 731810 717830 705211 693954 683164 672516 662509 653401 644965 637178
55824 637178 630055 622915 614852 606019 597518 590047 583435 577407 571932 566819 561771 556855 552274 547844
55810 547844 543400 539540 537188 536525 537017 538321 540477 543360 546737 550631 554910 558694 561002 561894 562211
55795 562211 562207 561166 558306 553349 546318 537558 528020 518800 510269 502130 494270 487072 480988 476374 473521
55780 473521 472145 470975 468678 465324 462276 460505 459602 458597 457179 455814 455079 455211 456144 457720 459707
55765 459707 461410 461337 457793 450187 439553 427516 415050 402417 389763 377288 365148 353692 343549
55752 343549 335046 327802 321268 315346 310101 305273 300480 295650 290852 286134 281839 278580 276368 274266
55738 274266 271464 268291 265696 264163 263617 263779 263986 263245 261159 258316 255202 251467 247041 243118 240856
55723 240856 239692 238094 235579 232785 230074 227475 225751 225907 227507 228891 229363 229934 231581 234009 236559
55708 236559 239172 241808 243880 244979 245443 245605 245125 243640 241472 239100 236424 233128 229366 225617 222092
55693 222092 218707 215417 212293 209487 207288 205898 205050 204214 203369 203192 204313 206648 209547 212233 214076
55678 214076 214938 215449 216524 218410 220477 222002 222740 222675 221816 220460 219218 218483 218135 217972 218098 218646 219406
55661 219406 219996 220286 220586 221496 223485 226388 229374 231635 233019 233834 234322 234652 235044 235382 234991 233404 231039
55644 231039 228424 225097 220297 214556 209420 205408 201357 196270 190785 186188 182747 179749 176627 173331
55630 173331 169951 166593 163430 160434 157295 153930 150843 148643 147510 147340 147999 149077 149768 149462 148252
55615 148252 146591 144740 142877 141355 140406 139781 139097 138326 137671 137105 136372 135308 133909 132239 130512 129110
55599 129110 128245 127749 127364 127089 127031 127117 127200 127298 127446 127448 127008 126150 125366 125288 126161 127602 129004 130290 132002 134421
55579 134421 136901 138624 139834 141599 144333 147280 149683 151761 154148 156982 160069 163435 167088 170502
55565 170502 172958 174348 175215 176046 176882 177476 177497 176623 174839 172654 170742 169227 167523 165002 161752 158514
55549 158514 155798 153303 150496 147768 146438 147220 149159 150632 151091 151054 150672 149402 147293 145565 145297 146169
55533 146169 147036 147250 146908 146307 145746 145511 145426 144621 142302 138687 134841 131676 129403 127776 126522 125544 124862
55516 124862 124315 123430 121928 120312 119375 119028 118235 116392 114135 112439 111577 111404 111884 112673 112841 111930 110872
55499 110872 111007 112468 114328 116005 117557 118769 119026 118243 117052 115862 114539 113220 112619 113086 113947 114262
55483 114262 113804 112971 112114 111372 110888 110772 110905 110975 110642 109738 108527 107765 108107 109361 110645 111377 111767 112250
55465 112250 112865 113427 113905 114254 114183 113467 112375 111426 110807 110302 109779 109458 109646 110399 111560 112958 114407 115529
55447 115529 115851 115256 114259 113584 113433 113392 113132 112896 113074 113599 114076 114316 114409 114443 114566 115159 116404 117726 118241
55428 118241 117908 117700 118337 119367 119842 119574 119233 119405 120049 120823 121533 122212 123031 124146 125436 126339 126252 125161
55410 125161 123700 122557 121938 121630 121298 120597 119272 117426 115619 114486 114263 114757 115668 116678 117296 116957
55394 116957 115438 113072 110494 108269 106742 105977 105710 105571 105471 105576 105825 105845 105623 105872 107246 109367 111156
55377 111156 111971 111914 111106 109476 107421 105979 105801 106409 106964 107370 108104 109213 110160 110596 110727 110821 110839 110726
55359 110726 110626 110566 110224 109368 108413 108167 109001 110474 111896 113040 114107 115093 115584 115287 114490 113722 113118 112428
55341 112428 111520 110593 109935 109840 110631 112240 113741 113880 112443 110638 109769 109853 109979 109724 109616 110147 110872 110846
55323 110846 109820 108664 108417 108999 109185 108022 105931 104098 103058 102564 102623 103715 105690 107339 107673 107079
55307 107079 106628 106742 107168 107834 108821 109721 109876 109324 108813 108785 108920 108810 108533 108361 108342 108430 108703 109223 109889 110532
55287 110532 111085 111625 112377 113515 114780 115538 115554 115513 116322 118008 119759 120857 121056 120229 118414 116335 115083
55270 115083 114947 115097 114777 114292 114390 115135 115913 116309 116429 116465 116433 116416 116662 117273 117965 118366 118486 118732 119348 119970
55250 119970 119950 119149 118124 117410 116942 116379 115678 114906 113801 112114 110277 109125 108875 108893 108635 108343 108599 109603
55232 109603 111090 112643 113857 114488 114628 114602 114605 114624 114613 114464 113908 112938 112215 112473 113500 114381 114788 115213 115767
55213 115767 115782 115119 114875 115877 117228 117448 116639 116334 117345 118928 120175 121146 122203 123137 123560 123570 123499 123377
55195 123377 123150 123035 123190 123272 122771 121626 120103 118275 116164 114319 113677 114602 116399 118009 118954 119393 119462
55178 119462 118952 117772 116475 116006 116790 118162 118899 118378 117132 116182 115977 116170 116360 116693 117542 118823 119968
55161 119968 120584 120835 121083 121390 121616 121873 122536 123745 125077 125905 126015 125831 126003 126821 127984 128945 129425 129590
55143 129590 129766 130099 130494 130731 130546 129725 128294 126558 124839 123279 122055 121618 122362 124036 125744 126731
55127 126731 127010 127120 127447 127912 128225 128275 128246 128415 128847 129296 129453 129203 128597 127688 126592 125655 125285 125553 126159
55108 126159 126809 127439 128020 128423 128674 129045 129649 130036 129536 128054 126383 125617 126235 127731 129052 129465 129084
55091 129084 128584 128473 128759 129223 129764 130319 130723 130893 131102 131802 133186 135052 137028 138690 139548 139282 138187
55074 138187 137103 136619 136530 136326 136066 136306 137111 137625 136977 135369 133906 133383 133539 133523 132810 131651 130797 130781
55056 130781 131343 131642 131280 130903 131417 132697 133624 133434 132449 131337 130352 129703 130003 131649 134014 135894 136611
55039 136611 136296 135340 134146 133203 132807 132757 132805 133191 134147 135085 135001 133671 131782 129955 128399 127564 128090 129785
55021 129785 131476 132360 132849 133598 134424 134832 135050 135744 137044 138537 140018 141564 143008 143986 144486 144803 144923
55004 144923 144496 143514 142577 142301 142731 143438 143969 144139 144071 144047 144277 144828 145787 147257 149063 150702 151802 152447
54986 152447 152786 152601 151611 150020 148341 146734 144961 142964 141169 140147 140237 141421 143248 144928 145878 146237
54970 146237 146572 147083 147480 147652 148005 148925 150218 151362 152110 152647 153224 153838 154238 154175 153674 153039 152508 151960
54952 151960 151155 150192 149440 149066 148942 149139 150080 151878 153815 154913 154931 154400 153729 152779 151503 150500 150472 151303
54934 151303 152202 152769 153455 154883 157179 160253 164281 169387 175070 180543 185608 190629 195578 199698 202438
54919 202438 204292 206278 208821 211511 213749 215210 215688 214884 212531 208688 203851 198782 194085 189880 185977
54904 185977 182349 179215 176663 174489 172562 170995 169751 168394 166595 164720 163538 163412 164057 165009 166089
54889 166089 167461 169440 172174 175346 178316 180790 183214 186269 190102 194326 198605 202909 207207 211284
54875 211284 214871 217751 219759 220949 221681 222206 222150 220699 217454 212857 207726 202580 197497 192433 187491
54860 187491 182859 178571 174364 169960 165553 161836 159320 157748 156434 155074 153969 153444 153348 153227 152814
54845 152814 152183 151447 150367 148479 145759 143080 141603 141595 142194 142526 142644 143066 143790 144344 144575 144803 145246 145762
54827 145762 146170 146382 146205 145480 144502 143897 143937 144257 144315 143883 143077 142238 141815 142003 142463 142736 142919 143548 144740
54808 144740 145933 146665 147170 147929 148960 149844 150268 150304 150309 150751 151920 153622 155233 156198 156422 156163 155764 155538
54790 155538 155640 155916 156043 155917 155769 155886 156438 157581 159400 161652 163889 166008 168397 171370 174700 177975
54774 177975 181240 185016 189700 195058 200304 204706 208277 211844 216227 221316 226191 230127 233183 235726
54760 235726 237799 239164 239647 239132 237414 234314 229880 224304 217807 210831 204198 198791 194924 192134 189565
54745 189565 186666 183598 180966 179159 178068 177453 177245 177262 177018 176341 175937 176674 178333 179790 180583 181620
54729 181620 183994 187747 192223 197091 202384 207861 212949 217272 220818 223705 226058 227964 229242 229431
54715 229431 228256 225923 222682 218403 213003 207046 201349 196083 190807 185473 180887 177818 175906 173828
54701 173828 170673 166972 164113 162741 162046 160907 159405 158560 158711 158941 158411 157513 157159 157447 157666 157307 156461
54684 156461 155358 154067 152561 150742 148567 146478 145378 145697 146746 147509 147837 148286 149025 149657 150066 150696
54668 150696 151828 153127 154051 154269 153671 152460 151275 150740 150902 151557 152951 155400 158201 159839 159667 158615
54652 158615 157873 157549 157163 156797 156963 157675 158417 158934 159379 159693 159384 158119 156244 154540 153595 153423 153561 153573
54634 153573 153506 153764 154529 155513 156341 156887 157076 156666 155566 154211 153305 153203 153680 154209 154324 153872 153079 152327
54616 152327 151794 151447 151361 151725 152500 153393 154292 155282 156084 156056 155157 154404 154760 155929 156871 157280 157799 158873 160132
54597 160132 161037 161493 161586 161287 160693 160162 159911 159767 159545 159354 159336 159346 159154 158765 158362 158101 158104 158421 158893 159213
54577 159213 159283 159324 159581 160155 161104 162407 163747 164786 165764 167314 169407 171017 171256 170457 169628 169136 168527
54560 168527 167514 166541 166319 167133 168607 169853 170010 168955 167429 166187 165279 164529 164334 165279 167161 169158
54544 169158 170927 172760 174563 175613 175666 175527 175971 176713 177019 176823 176643 176830 177481 178735 180455 181824 181934
54527 181934 180717 178827 176780 174784 173219 172553 172717 173179 173657 174227 174673 174393 173244 171958 171367 171547
54511 171547 172001 172383 172726 173110 173358 173083 172034 170573 169673 170109 171614 173126 173864 173864 173538 173199 173102 173438
54493 173438 174047 174537 174841 175261 175785 175884 175325 174731 174865 175639 176302 176424 176253 176239 176615 177386 178387 179371 180256
54474 180256 181294 182770 184643 186634 188537 190185 191291 191656 191552 191672 192585 194211 195721 196026 194719
54459 194719 192672 191356 191356 191843 191702 190771 189651 188756 188095 187739 187803 188052 188026 187626 187153 186757 186274 185646 185086
54440 185086 184743 184571 184568 184778 184957 184599 183541 182324 181724 182027 182833 183509 183773 183920 184454 185512 186760 187886
54422 187886 188927 189934 190646 190836 190738 190743 190851 190808 190596 190363 190034 189510 189078 189085 189308 189297 189292 190054 191666 193236
54402 193236 194015 194170 194148 194053 194083 194851 196568 198345 199026 198491 197555 196773 196034 195212 194569 194331 194359 194484 194869
54383 194869 195810 197301 198916 200074 200441 200145 199618 199204 198976 198891 198914 198946 198835 198590 198371 198226 198088 198144 198813
54364 198813 200162 201648 202745 203559 204492 205580 206517 207126 207480 207748 208273 209545 211621 213706 214803 214743
54348 214743 214175 213667 213286 212994 212859 212785 212572 212405 212823 213935 215069 215378 214558 212838 210693 208737 207486
54331 207486 206882 206295 205265 203995 202916 202085 201338 200756 200569 200737 200931 200805 200063 198551 196623 195205 194982
54314 194982 195579 195981 195635 194727 193506 192017 190551 189634 189209 188459 186956 185479 185103 185748 186320 186179 185766
54297 185766 185726 186088 186588 187202 187896 188252 187939 187353 187231 187677 188101 188239 188711 190180 192259 193747 193888 193046
54279 193046 192078 191430 191009 190694 190537 190501 190323 189816 189186 188848 188976 189344 189604 189688 189923 190750 192225 193766 194609
54260 194609 194633 194569 195212 196564 197994 199009 199500 199417 198760 197966 197725 198131 198454 198109 197428 197098 197167 197140 196799
54241 196799 196383 196048 195710 195396 195254 195194 194957 194567 194252 193917 193268 192539 192467 193266 194256 194872 195443 196439 197418
54222 197418 197444 196351 194914 193771 192796 191631 190351 189440 189423 190546 192451 194083 194361 193171 191491 190340
54206 190340 189888 189750 189786 190216 191075 191935 192302 192135 191899 192128 192939 193939 194626 194862 194865 194776 194464 193849 193197 192884
54186 192884 192963 193174 193341 193497 193665 193771 193838 194003 194174 193936 193031 191790 190798 190209 189752 189398 189587 190525 191605
54167 191605 192000 191703 191538 191964 192301 191442 189182 186499 184491 183386 182765 182503 183017 184475 186143 186952 186613
54150 186613 185819 185263 184866 184206 183349 182820 182890 183316 183811 184413 185302 186538 188021 189478 190460 190661 190350 190153
54132 190153 190263 190209 189672 189168 189508 190750 192120 192919 193136 193156 193277 193662 194441 195536 196533 196967 196775 196364
54114 196364 196259 196732 197672 198668 199261 199311 199172 199336 199820 200075 199679 198963 198640 198865 199077 198874 198587 198661 198833
54095 198833 198476 197590 196862 196756 197092 197675 198743 200443 202345 203889 204952 205509 205088 203317 200958 199655
54079 199655 200348 202357 204328 205753 207204 209362 212289 215614 219049 222535 226130 229923 233935 238039
54065 238039 242129 246465 251603 257705 264056 269632 274133 278129 282200 286359 290413 294286 297612 299500
54051 299500 299331 297542 295030 291941 287733 282431 277076 272709 269454 266872 264704 262978 261781 261259 261611
54036 261611 262860 264884 267735 271445 275444 278728 280960 282870 285269 288188 291324 294701 298238 301276
54022 301276 303261 304546 305726 306507 306125 304667 303022 301553 299737 297284 294661 292190 289431 286001 282412
54007 282412 279460 277149 274793 271981 268986 266233 263734 261156 258304 255446 253015 250998 248876 246422
53993 246422 244249 243091 242758 242428 241893 241785 242429 243218 243498 243395 243321 243172 242672 242147 242344 243612 245731 248395
53975 248395 251464 254748 257962 260860 263236 264921 266013 266953 268058 269085 269486 269004 267830 266379 265128
53960 265128 264413 264002 263106 261239 258929 257152 256177 255457 254607 253913 253737 253911 254042 254083 254350 255191 256875 259677
53942 259677 263790 269115 275202 281373 287027 292036 296930 302439 308686 314893 320077 323957 327129 330435
53928 330435 334239 338227 341769 344482 346568 348613 351069 353977 357212 360845 365130 370251 376267 383237
53914 383237 391089 399310 407141 414407 421867 430319 439437 448006 455343 461912 468278 474104 478686 481968
53900 481968 484168 484617 481935 475621 466753 456792 446289 435153 423602 412235 401507 391669 382982
53887 382982 375366 367991 359885 351031 342393 334726 327864 321356 315309 310190 306014 302219 298370 294649
53873 294649 291516 289063 286893 284558 281878 278853 275528 272072 268764 265661 262463 259003 255697 253101
53859 253101 251134 249265 247458 246303 246008 245879 245212 244208 243490 243083 242510 241662 240985 240822 241040 241282 241221
53842 241221 240620 239582 238661 238315 238260 237799 236731 235575 234928 235017 235826 237152 238505 239398 239819 240054 240160 240106
53824 240106 240323 241364 242868 243665 243240 242526 242766 244155 245987 247624 248773 249240 249099 248962 249556 251094
53808 251094 253374 256207 259347 262311 264873 267577 271217 275851 280798 285514 289956 294128 297885 301285
53794 301285 304673 308176 311460 314152 316234 317960 319645 321564 323689 325473 326254 325976 325147 323996 322124
53779 322124 319202 315592 311958 308603 305503 302709 300291 298073 295783 293379 290885 288064 284630 280757
53765 280757 277032 273847 271128 268735 266747 265182 263657 261613 258863 255770 252946 250875 249751 249482
53751 249482 249715 249973 249953 249723 249536 249468 249382 249237 249198 249253 249037 248343 247627 247556 248113 248736 249403 250940 253842 257273
53731 257273 259782 260724 260528 259809 258857 257896 257252 257091 257382 258139 259327 260528 261209 261409 261717 262477 263511
53714 263511 264735 266422 268565 270669 272667 275456 279782 284892 289123 291744 293513 295403 297529 299503
53700 299503 301184 302669 304011 305347 307049 309423 312393 315696 319106 322311 324933 327024 329224 331942
53686 331942 334563 335998 335966 335264 334712 334402 334189 334329 335133 336226 336734 336172 334817 333241 331876 331062 330983
53669 330983 331327 331397 330932 330521 330851 331773 332533 332749 332587 332097 331028 329464 327990 326967 326125 325251 324712 324809
53651 324809 325127 325173 325285 326140 327506 328360 328273 327879 327782 327749 327383 326930 326927 327397 327913 328231 328498 329078 330426 332850
53631 332850 336045 339134 341455 343105 344428 345400 345979 346748 348576 351654 355280 358563 361084 363105 365578
53616 365578 369710 375797 382459 387686 390853 393214 396262 400107 403799 406768 409428 412560 416517 421062
53602 421062 425751 430366 434974 439545 443669 446935 449570 452336 455685 459307 462686 465681 468365 470593
53588 470593 472153 473227 474300 475645 477081 478186 478516 477726 475801 473204 470556 468004 465044 461070 456061
53573 456061 450625 445377 440415 435551 430970 427312 424969 423548 422401 421460 421071 421106 420906 420273 419865 420242
53557 420242 421045 421672 422317 423664 425744 427801 429271 430252 430949 431317 431479 431991 433359 435617 438617 442326
53541 442326 446555 450765 454547 458081 461838 466017 470614 475807 481840 488636 495980 504065 513430 524243
53527 524243 535961 547842 559558 571214 583077 595524 608997 623701 639348 655376 671436
53516 671436 687608 704301 722093 741539 762828 785553 809015 832846 857179 882145 907397
53505 907397 932352 956834 981256 1006194 1031897 1058176 1084531 1110362 1135324 1159627 1183787
53494 1183787 1207902 1231391 1253712 1275187 1296762 1318952 1341383 1363388 1384741 1405656 1426393
53483 1426393 1447047 1467449 1487082 1505348 1522202 1538279 1554103 1569417 1583551 1596241 1607654
53472 1607654 1617826 1626605 1634027 1640141 1644397 1645850 1644200 1640092 1634128 1626085 1615557 1602822 1588528
53459 1588528 1572822 1555440 1536548 1516935 1497374 1478236 1459648 1441424 1422760 1402632 1380848
53448 1380848 1358376 1336332 1314968 1293835 1272677 1251807 1231801 1213142 1196015 1180219 1165365
53437 1165365 1151385 1138769 1128071 1119300 1112076 1106261 1102117 1099809 1099082 1099589 1101330 1104535 1109249 1115273
53423 1115273 1122549 1131395 1142209 1155025 1169502 1185361 1202654 1221583 1242215 1264529 1288528 1314107
53411 1314107 1340939 1368810 1398010 1429097 1462218 1497012 1533231 1571106 1610894 1652406 1695268
53400 1695268 1739506 1785511 1833552 1883572 1935466 1989271 2045036 2102626 2161699 2221792 2282455
53389 2282455 2343316 2403947 2463753 2522206 2579283 2635335 2690326 2743480 2793975 2841738 2887162
53378 2887162 2930173 2970021 3005944 3037667 3065198 3088551 3107753 3122824 3133575 3139588 3140489 3136088
53366 3136088 3126256 3110979 3090513 3065160 3034745 2998613 2956404 2908702 2856852 2802267 2745928
53355 2745928 2688232 2629190 2568994 2508520 2449048 2391265 2334782 2278816 2223117 2168073 2114188
53344 2114188 2061778 2010989 1961753 1913786 1866895 1821285 1777372 1735375 1695315 1657261 1621329
53333 1621329 1587504 1555763 1526294 1499323 1474702 1452025 1431102 1412023 1394718 1378859 1364331
53322 1364331 1351371 1339943 1329322 1318704 1308046 1297872 1288341 1279058 1269956 1261906 1256012 1252487
53310 1252487 1250612 1249760 1250076 1251969 1255354 1259767 1265132 1271956 1280606 1290761 1301898 1314144 1328218
53297 1328218 1344479 1362466 1381575 1401859 1423795 1447423 1472216 1497758 1524098 1551202 1578535
53286 1578535 1605532 1632199 1658783 1684967 1709878 1732870 1753819 1772606 1788877 1802562 1814118
53275 1814118 1823804 1831054 1835062 1835768 1833746 1829282 1822162 1812360 1800316 1786266 1769818 1750509 1728469
53262 1728469 1704152 1677705 1649032 1618440 1586811 1555040 1523434 1491690 1459330 1426202 1392662
53251 1392662 1359248 1326141 1293033 1259679 1226467 1194284 1163778 1134892 1107082 1079897 1053249
53240 1053249 1027193 1001537 975837 949874 924073 899242 875879 853926 833158 813560 795207
53229 795207 778085 762244 747849 734806 722565 710639 699174 688555 678515 668125 656798
53218 656798 644839 632797 620693 608272 595754 583778 572583 561613 550148 538135 526267
53207 526267 515350 505684 496910 488327 479441 470397 461884 454529 448303 442549 436541 429935 422798 415460
53193 415460 408404 402075 396569 391511 386361 380805 374851 368774 363108 358501 355259 353066 351367 349929
53179 349929 348719 347429 345646 343540 341773 340529 339163 337228 335268 333968 332867 330791 327557 324413
53165 324413 322512 321556 320428 318643 316651 314914 313352 311690 309904 308135 306466 304945 303628 302425
53151 302425 301108 299637 298392 297822 297890 298076 297961 297646 297482 297537 297510 297118 296406 295689 295326 295521 296209 297094 297984
53132 297984 299095 300814 303113 305458 307427 309095 310589 311542 311518 310858 310550 311112 311988 312370 312233 312153 312311
53115 312311 312151 311151 309589 308334 308015 308545 309382 310077 310573 311031 311445 311431 310487 308500 305967 303620 301889
53098 301889 300767 300108 299812 299666 299282 298432 297306 296232 295212 294065 293006 292631 293090 293638 293397 292441 291694
53081 291694 291767 292310 292643 292628 292566 292502 292151 291547 291296 291862 292820 293215 292666 291754 291233 291183 291208 291125 291041 290839 290140
53060 290140 288911 287728 287160 287118 287106 286881 286639 286668 287073 287728 288228 287983 286714 284857 283251 282339 281840 281242
53042 281242 280473 280040 280509 281722 282606 282035 280149 278441 278174 278973 279490 279205 278853 279066 279463 279432 279098 278930
53024 278930 278895 278648 278259 278078 278011 277620 276991 276851 277612 278749 279453 279590 279726 280353 281363 282246 282701 283044 283960
53005 283960 285664 287392 288039 287351 286183 285461 285271 285186 285076 285137 285342 285448 285506 285904 286786 287861 288951 290346
52987 290346 292282 294383 295989 296906 297495 298062 298542 298826 299146 299879 301108 302488 303562 304215 304860 306092
52971 306092 307990 309869 310924 311099 311071 311352 311783 312051 312318 312948 313822 314358 314232 313741 313357 313230 313249 313343 313460
52952 313460 313363 312659 311055 308572 305545 302516 300019 298341 297385 296787 296159 295292 294268 293470 293398 294336 296053
52935 296053 297838 298852 298581 297087 294897 292621 290589 288802 287168 285796 285012 285094 285947 287053 287795 287895
52919 287895 287510 286984 286581 286453 286660 287079 287367 287180 286435 285302 284006 282737 281700 281047 280741 280596 280467
52902 280467 280344 280315 280571 281382 282829 284556 285945 286656 286816 286661 286253 285697 285375 285645 286374 287065 287468 287769
52884 287769 288091 288064 287208 285645 284176 283546 283807 284554 285526 286734 288028 288935 289118 288765 288337 288149 288411 289482
52866 289482 291618 294455 297115 298966 300056 300746 301266 301758 302386 303080 303374 302830 301509 299722 297516 294759
52850 294759 291679 288848 286556 284554 282577 280742 279209 277732 275903 273738 271723 270300 269476 268914 268214
52835 268214 267191 266054 265307 265252 265615 265854 265816 265864 266350 267226 268234 269229 270144 270908 271557 272247 272960 273402 273396
52816 273396 273174 273004 272724 272068 271370 271487 272911 275251 277726 279815 281306 281992 281662 280312 278243 276000
52800 276000 274262 273485 273515 273646 273236 272189 270756 269138 267420 265716 264133 262665 261306 260202 259541 259422
52784 259422 259967 261378 263605 266023 267710 268180 267789 267421 267743 268612 269172 268706 267446 266373 266154 266532 266799
52767 266799 266520 265664 264426 263270 262769 262979 263274 263214 263226 263925 265031 265673 265624 265524 265798 266107 266065 265864 265811
52748 265811 265757 265408 264925 264871 265678 267321 269317 270978 271988 272845 274409 276885 279559 281636 282950 283708
52732 283708 284001 283894 283619 283396 283307 283593 284671 286505 288327 289375 289663 289629 289298 288256 286304 283752 281140
52715 281140 278955 277476 276572 275843 275273 275501 276983 279096 280563 280715 279901 278761 277691 277030 277132 277933
52699 277933 278871 279542 280174 281186 282534 283836 284939 286011 287082 287821 287931 287572 287219 287151 287291 287596 288266
52682 288266 289370 290484 291074 291169 291251 291476 291486 291133 290884 291117 291467 291310 290701 290319 290558 291032 290929 289600 286967
52663 286967 283748 281149 279989 280115 280850 281837 283106 284545 285825 286802 287564 288146 288570 289155 290301 291945
52647 291945 293627 295137 296659 298249 299622 300568 301241 301922 302813 304083 305706 307228 308129 308506 308965 309760
52631 309760 310561 311163 311832 312717 313517 314122 315064 316798 318886 320316 320386 318907 315955 311979 307877 304425
52615 304425 301741 299690 298485 298316 298613 298483 297864 297535 297843 298089 297538 296510 295958 296332 297288 298346 299339
52598 299339 300270 301093 301717 302006 301754 300934 300008 299732 300421 301589 302548 303274 304349 306029 307711 308616 308745
52581 308745 308812 309306 310053 310755 311517 312539 313611 314301 314514 314519 314453 314126 313310 312000 310384 308791 307679 307365
52563 307365 307709 308231 308598 308720 308404 307335 305647 304166 303654 303927 304073 303498 302413 301361 300630 300217 300036
52546 300036 299996 300076 300453 301278 302246 302759 302748 302932 303888 305160 305734 305216 304055 302818 301897 301821 303023 305005
52528 305005 306489 306846 306827 307409 308443 309136 309447 310160 311650 313407 314884 316160 317486 318707 319542 320200
52512 320200 321340 323411 326052 328197 328913 328385 327871 328387 329586 330317 330085 329346 328445 327029 324828 322353
52496 322353 320375 319040 318004 317148 316691 316624 316416 315406 313485 311449 310573 311509 313532 315169 315665 315512
52480 315512 315537 315973 316639 317485 318531 319650 320830 322365 324322 326086 326975 327161 327562 328821 330719 332502
52464 332502 333484 333527 333328 334072 336294 339110 340922 340858 339206 336678 333848 331230 329190 327513 325588 323290
52448 323290 321250 319934 318910 317437 315503 313757 312571 311674 310764 309991 309624 309527 309322 308913 308544 308279 307798
52431 307798 306951 306208 306192 306759 306996 306279 305037 304307 304731 306199 308177 310091 311622 312964 314744 317464
52415 317464 321051 325080 329195 333066 336243 338554 340596 343430 347772 353669 360724 368207 375103 380721
52401 380721 385351 389832 394334 397996 399869 399739 397818 394231 389190 383324 377301 371347 365495 360111
52387 360111 355785 352822 351150 350592 350867 351381 351440 350820 349987 349655 350169 351302 352590 353984 356203 360231
52371 360231 366153 372612 377689 380407 381338 381878 383092 385087 387159 388459 388728 388450 388225 388068 387583 386758
52355 386758 386237 386604 387647 388584 388976 389168 389840 391326 393471 396004 398802 401759 404553 406809 408542 410318
52339 410318 412878 416587 421265 426458 431826 437321 443148 449559 456682 464480 472878 481908 491687 502292
52325 502292 513687 525784 538585 552236 566873 582298 597883 612950 627335 641450 655728
52314 655728 670243 685041 700612 717536 735628 753865 771445 788621 806106 823884 841180
52303 841180 857634 873902 890727 907844 924283 939538 953856 967473 980157 991619 1001790
52292 1001790 1010415 1016874 1020893 1023079 1024275 1024548 1023360 1020670 1017287 1013990 1010754 1007087 1002865 998513
52278 998513 994550 991217 988559 986712 985998 986694 988663 991311 994071 996927 1000299 1004482 1009412 1015057 1021772
52263 1021772 1030034 1039876 1050717 1061815 1072857 1084080 1095836 1108141 1120781 1133740 1147171 1160910
52251 1160910 1174383 1187228 1199571 1211288 1221415 1228947 1234032 1237663 1240234 1241181 1240192 1237939 1235206
52238 1235206 1231942 1227732 1222730 1217490 1212179 1206506 1200262 1193457 1186117 1178399 1170754 1163483 1156268 1148637
52224 1148637 1140829 1133718 1127891 1123219 1119278 1115695 1112100 1108278 1104554 1101626 1099824 1098890 1098525 1098748 1099567
52209 1099567 1100813 1102583 1105454 1109841 1115382 1121275 1127035 1132638 1138142 1143552 1148975 1154533 1160167 1165755
52195 1165755 1171347 1176943 1182099 1186158 1189033 1191477 1194370 1197827 1201100 1203217 1203599 1202242 1199538 1195972
52181 1195972 1191815 1187062 1181697 1175944 1170106 1164222 1158112 1151849 1145905 1140627 1135776 1130935 1126287 1122544
52167 1122544 1120052 1118373 1116940 1115757 1115161 1115209 1115698 1116582 1117932 1119596 1121326 1123166 1125230 1127149 1128268
52152 1128268 1128459 1128293 1128226 1128145 1127882 1127685 1127767 1127884 1127789 1127798 1128413 1129659 1131248 1133128 1135308 1137397 1139029 1140684
52134 1140684 1143291 1146856 1150264 1152876 1155753 1160695 1168428 1178289 1189462 1201823 1215519 1230338 1245904
52121 1245904 1262269 1279917 1299153 1319655 1340700 1361671 1382253 1402226 1421458 1440274 1459523
52110 1459523 1479849 1500905 1521673 1541549 1560599 1578675 1594946 1608798 1620844 1632442 1644350
52099 1644350 1656261 1667417 1677069 1684449 1689029 1691070 1691368 1690171 1686763 1680444 1671619 1661562 1651316
52086 1651316 1641104 1630641 1619671 1608281 1596931 1586208 1576414 1567491 1559362 1552126 1545809 1540235
52074 1540235 1535390 1531695 1529605 1529112 1529918 1531929 1535268 1539905 1545653 1552478 1560471 1569533 1579339 1589637
52060 1589637 1600334 1611359 1622682 1634356 1646157 1657259 1666726 1674469 1681393 1688443 1695703 1702426
52048 1702426 1707595 1710392 1710524 1708304 1704250 1698569 1691276 1682731 1673609 1664221 1654317 1643728 1632694 1621345
52034 1621345 1609425 1596907 1584336 1571987 1559091 1544633 1528770 1512749 1497416 1482402 1466962
52023 1466962 1451090 1435494 1420744 1406760 1393019 1379140 1365229 1351709 1338865 1326719 1315325
52012 1315325 1304755 1294661 1284293 1273374 1262503 1252108 1241413 1229198 1215395 1200953 1186208
52001 1186208 1170450 1153412 1136151 1119762 1104016 1088049 1071797 1055865 1040403 1025025 1009613
51990 1009613 994279 978640 962085 944858 927998 911963 896101 879864 863678 848003 832226
51979 832226 815406 797877 781302 767073 755229 745011 735857 727566 720013 713174 707361 703080 700595
51966 700595 699774 700288 701802 703972 706414 708788 710865 712479 713437 713545 712730 711062 708666 705690 702357
51951 702357 698975 695772 692841 690336 688648 688209 689186 691590 695633 701579 709110 717194 724870 731949 738671
51936 738671 744948 750398 754974 758942 762124 763660 762820 759731 754975 748779 740983 731671 721431 710942
51922 710942 700555 690327 680267 670503 661337 653212 646555 641674 638793 638090 639618 643289 649001 656616
51908 656616 665766 675945 686990 699142 712304 725592 738090 749879 761679 773475 784098 792294
51896 792294 797484 799154 796182 787504 773273 754863 733857 711466 688802 667114 647443 630290
51884 630290 615717 603733 594554 588550 585823 585829 587664 590854 595520 601456 607489 612332 615865 618910
51870 618910 621758 623612 623643 621928 618951 614735 609049 602187 594984 588112 581785 576156 571602 568465 566652
51855 566652 565580 564481 562867 560839 558867 557123 555139 552323 548702 544846 541068 537075 532579 527940
51841 527940 523809 520201 516386 511976 507843 505478 505328 506169 506436 505884 505501 505921 506575 506586 505971 505472 505471 505572
51823 505572 505201 504199 502781 501309 500248 500026 500677 501675 502321 502271 501647 500762 499835 498902 497804 496254 494104
51806 494104 491590 489262 487493 486048 484306 482028 479792 478519 478560 479385 480186 480569 480635 480611 480590 480544 480421 480251
51788 480251 480136 480021 479490 478107 476125 474569 474290 475089 476061 476657 477029 477492 478184 479356 481411 484354 487593
51771 487593 490680 493988 498238 503496 509057 514288 519144 523711 527647 530348 531513 531267 529771 526980
51757 526980 522866 517680 511862 505790 499733 494023 489009 484773 481037 477622 474924 473711 474375 476524
51743 476524 479346 482261 485160 488260 491888 496196 500862 505132 508468 511113 513731 516448 518608 519649
51729 519649 519870 520000 520143 519608 517834 515181 512627 510939 510275 510338 510575 510334 509214 507399 505448 503705
51713 503705 502057 500367 498894 498153 498491 499884 501997 504281 506240 507849 509590 511876 514555 517160 519464
51698 519464 521434 522801 523205 522819 522333 522132 521902 521283 520502 519974 519559 518652 516880 514337 511232 507708 503973
51681 503973 500237 496481 492619 488897 485783 483404 481411 479531 477941 476944 476559 476694 477461 479035 481272
51666 481272 483718 486007 488130 490418 493327 497130 501649 506361 510836 514983 518761 521880 524053 525494
51652 525494 526897 528888 531634 534992 538776 542768 546585 549716 551638 551863 549945 545624 539036 530780
51638 530780 521737 512797 504689 497877 492444 488065 484285 480904 478011 475603 473436 471398 469786 468903
51624 468903 468481 467847 466663 465159 463660 462237 460843 459394 457644 455464 453372 452262 452311 452649 452506 452178
51608 452178 452337 452945 453561 454423 456306 459367 462930 466510 470328 474671 479473 484750 490756 497368 503979
51593 503979 510346 516907 523745 529956 534726 538505 542217 545638 547545 547511 546706 546703 548151 550905 554877 560309
51577 560309 567560 577020 589055 603766 620840 639752 659937 680765 701710 722877 745149 769373
51565 769373 795374 821940 847843 872767 897322 922374 948450 975620 1003648 1032108 1060290
51554 1060290 1087075 1110965 1130304 1143665 1150197 1149693 1142254 1127946 1106968 1080109 1048753 1014218
51542 1014218 977358 938938 900043 861662 824098 787371 752202 720000 691690 666989 645174
51531 645174 626063 609779 595880 583473 572236 562717 555301 549282 543345 536811 530021 523620 517905
51518 517905 512992 509132 506431 504441 502472 500357 498615 497709 497432 497159 496488 495495 494566 494161 494510 495284
51502 495284 495715 495329 494433 493708 493462 493559 493833 494127 494001 492931 490926 488621 486647 485217 484306 483732 482939
51485 482939 481206 478424 475312 472608 470306 467975 465427 462631 459305 455218 450788 446829 443637 440769
51471 440769 437783 434761 431928 429162 426177 422978 419888 417230 415161 413668 412589 411754 411288 411717 413564
51456 413564 416846 421048 425593 430232 435067 440313 446119 452554 459755 468011 477595 488336 499403 509738
51442 509738 518936 527657 536965 547085 556933 565002 570653 574356 576770 577941 577584 575756 572803 568704
51428 568704 562927 555096 545552 535126 524579 514399 504866 496050 487908 480644 474841 470948 468688
51415 468688 467314 466421 466154 466620 467559 468828 470787 473740 477242 480467 483211 486076 489588 493557 497495
51400 497495 501323 505484 510601 517270 525830 536019 546996 558070 569439 581991 596472 613054
51388 613054 631593 651971 674174 698328 724757 753806 785536 819725 856209 894963 935844
51377 935844 978383 1021863 1065329 1107548 1147212 1183336 1215210 1241858 1261818 1273629 1276381 1269677
51365 1269677 1253429 1228081 1194896 1155562 1111469 1063607 1013174 961879 911410 862735 816203
51354 816203 772278 731870 695797 664092 636134 611516 590492 573320 559341 547097 535479
51343 535479 524476 514683 506367 499245 492974 487466 482733 478713 475332 472551 470211 467989 465598 462982
51329 462982 460267 457572 454921 452198 449149 445561 441613 438022 435599 434576 434427 434377 434023 433464 433058 433167
51313 433167 433963 435209 436385 437287 438397 440297 442728 444721 445747 446270 446958 447856 448757 449869 451475 453226
51297 453226 454463 455110 455521 455508 454305 451710 448599 445953 443901 442040 440217 438618 437445 436892 437160 438159
51281 438159 439491 440977 442866 445264 447721 449737 451337 452789 454128 455314 456457 457375 457359 456031 454234
51266 454234 453398 454089 455706 457437 458862 459743 460013 460086 460527 461177 461186 460123 458507 456976 455484 453709 451752
51249 451752 449947 448254 446379 444406 442865 442096 441873 441740 441573 441665 442264 443154 443792 443883 443606 443279 443065 443190
51231 443190 444064 445762 447622 448847 449385 449682 449737 449080 447702 446280 445209 444112 442677 441421 441134 441921
51215 441921 443273 444712 445926 446614 446814 447226 448650 451107 453919 456624 459367 462367 465416 468127 470483
51200 470483 472978 476167 479985 483468 485380 485351 484226 483092 482201 481101 479560 477902 476482 475330 474334
51185 474334 473356 472121 470407 468521 467175 466638 466266 465222 463487 461849 460993 460893 461127 461458 461900 462399
51169 462399 462763 462980 463314 463915 464464 464477 463965 463481 463496 464000 464866 466170 467876 469431 470163 470046 469688 469530
51151 469530 469353 468664 467258 465315 463222 461479 460523 460392 460677 461002 461433 462206 463167 463757 463597 462873 462083
51134 462083 461575 461438 461645 462102 462517 462462 461676 460358 459079 458376 458348 458622 458824 459142 460348 463052 466920 470821
51116 470821 473801 475781 477279 478759 480448 482504 484967 487564 489909 491966 494140 496920 500551 504907
51102 504907 509344 512811 514589 515092 515535 516637 517933 518521 518128 517223 516367 515811 515569 515488 515229 514433 512963
51085 512963 510957 508759 506796 505378 504491 503923 503631 503712 503971 503937 503569 503557 504527 506214 507882 509428 511538
51068 511538 514754 518810 523034 527101 531299 536211 542219 549209 556717 564459 572586 581343 590696 600513
51054 600513 610850 621695 632593 642933 652583 661882 671075 680191 689398 698949 708547 717205 723991
51041 723991 728744 731934 734045 735190 734985 732655 727522 719743 710494 701290 693070 685824 678797 670948
51027 670948 661569 650804 639689 629690 622086 617541 615791 615757 616263 616868 617912 619798 622575 626226 630986
51012 630986 637146 644741 653531 663111 673027 683104 693683 705189 717396 729569 741432 753454
51000 753454 765932 778365 790193 801647 813264 824941 836158 846878 857428 867608 876761 884857
50988 884857 892716 900826 908677 915783 922748 930659 939721 949249 958895 969202 980806 993779 1008018
50975 1008018 1023806 1041542 1061246 1082776 1106423 1132799 1162180 1194403 1229472 1267803 1309630
50964 1309630 1354517 1401784 1451196 1502889 1556739 1612079 1667915 1723165 1776841 1828341 1877521
50953 1877521 1924176 1967541 2006714 2041430 2071948 2098200 2119688 2136398 2149146 2158610 2164584 2166750
50941 2166750 2165854 2163428 2160423 2156605 2151143 2143232 2132091 2117052 2098099 2076079 2052008 2026227 1998364
50928 1998364 1967985 1935038 1899641 1861670 1820882 1777492 1732434 1686737 1640641 1593667 1545627
50917 1545627 1497281 1449792 1403849 1359655 1317507 1277945 1241281 1207341 1175767 1146402 1119437
50906 1119437 1095370 1074661 1057102 1041578 1026782 1012237 998422 985990 975194 966063 958656 952940
50894 952940 948620 945318 942798 940956 939724 939022 938677 938419 938159 938258 939256 941353 944384 948274 953232 959397
50878 959397 966591 974499 982921 991871 1001728 1013143 1026382 1040789 1055394 1070161 1086156 1104411
50866 1104411 1125198 1148608 1175114 1205124 1238513 1275135 1315383 1359777 1408405 1461347 1519329
50855 1519329 1583333 1653774 1730531 1813439 1902205 1996205 2095128 2199446 2309443 2424014 2541444
50844 2541444 2661151 2783406 2907198 3029727 3148615 3263483 3374520 3480359 3578304 3666102
50834 3666102 3742550 3806885 3858622 3897843 3924823 3939540 3942394 3935300 3921136 3901950 3878408 3851107
50822 3851107 3821552 3791482 3761875 3733042 3705154 3678084 3650917 3622018 3589528 3551661 3506809
50811 3506809 3453769 3391929 3321221 3242070 3155351 3062163 2963539 2860629 2755149 2649230 2544668
50800 2544668 2442626 2344265 2251198 2164990 2086467 2015909 1953699 1900335 1855860 1819604 1790543
50789 1790543 1767663 1750038 1736852 1727477 1721424 1718211 1717316 1718169 1719969 1721543 1721603 1719364 1714905 1708816
50775 1708816 1701357 1691956 1679699 1664425 1647078 1628735 1609460 1588484 1565374 1540528 1514534 1487733
50763 1487733 1460576 1433767 1407585 1381502 1355035 1328717 1303849 1281541 1262362 1246517 1233865
50752 1233865 1224038 1217065 1213601 1213997 1217530 1223333 1231854 1244416 1261319 1281354 1303499 1328258 1356903
50739 1356903 1390096 1427787 1469852 1516181 1566477 1620520 1678364 1739833 1804130 1870342 1938075
50728 1938075 2007034 2076264 2144418 2210705 2274993 2336948 2395516 2449425 2497772 2540025 2575752
50717 2575752 2604590 2626339 2640875 2647973 2647297 2638749 2623050 2602023 2578002 2552685 2526661 2500206
50705 2500206 2474268 2450359 2429626 2412284 2397790 2385120 2372910 2359800 2344952 2328119 2309065
50694 2309065 2286966 2260476 2228496 2191032 2149311 2104889 2058677 2011078 1963069 1916607 1873599
50683 1873599 1834946 1801055 1772876 1751677 1737888 1730898 1730121 1735676 1747838 1766317 1790403 1819449
50671 1819449 1852926 1890283 1930936 1974132 2018625 2062816 2105484 2146233 2185029 2221536 2255138
50660 2255138 2285414 2312295 2335808 2355942 2372809 2386858 2398856 2409563 2419375 2428320 2436532 2444492
50648 2444492 2452600 2460815 2469273 2479151 2492173 2509024 2528861 2550739 2574989 2602688 2634138 2668429
50636 2668429 2704240 2740550 2776667 2812169 2846888 2880605 2912637 2941865 2967059 2987023 3000735
50625 3000735 3007867 3009153 3005811 2998410 2986362 2968259 2942483 2907869 2864661 2815082 2762654 2710672
50613 2710672 2661363 2616176 2576198 2542034 2513695 2490813 2472674 2457914 2444616 2431076 2416284
50602 2416284 2399502 2379680 2355552 2326089 2290654 2249046 2201728 2149811 2094381 2035969 1975066
50591 1975066 1913018 1851926 1793503 1738362 1686490 1638006 1593169 1551967 1514174 1479838 1449378
50580 1449378 1423042 1400516 1381155 1364453 1350096 1337797 1327428 1319281 1313833 1311120 1310717 1312467
50568 1312467 1316885 1324505 1335111 1348003 1362868 1379966 1399602 1421886 1446997 1475196 1506499 1540699
50556 1540699 1577704 1617399 1659177 1702190 1746281 1792131 1840202 1889973 1940490 1991149 2041577
50545 2041577 2091300 2140103 2188389 2236660 2284983 2333588 2383642 2436748 2493804 2554926 2620255
50534 2620255 2690051 2764108 2841978 2923879 3010605 3102356 3198498 3298752 3403620 3512974 3624916
50523 3624916 3736932 3847776 3957363 4065000 4168606 4265751 4354631 4433689 4500879 4553957
50513 4553957 4591394 4612605 4617302 4605049 4575675 4529997 4469833 4397266 4314133 4222392 4124646
50502 4124646 4023966 3923237 3825012 3731864 3646351 3570460 3505403 3452056 3411176 3382872 3366113
50491 3366113 3359005 3359350 3364819 3372897 3380935 3386084 3385082 3374538 3351847 3315678 3265459 3200798 3121865
50478 3121865 3030028 2927655 2817419 2702024 2584199 2466344 2350275 2237709 2130693 2030984
50468 2030984 1939132 1854777 1777747 1708237 1645984 1590043 1539587 1494333 1454025 1418145 1386475
50457 1386475 1359417 1337339 1319851 1306036 1295096 1286558 1280196 1276059 1274279 1274567 1276172 1278538 1281763
50444 1281763 1286177 1291686 1297788 1303992 1310104 1316341 1323275 1331323 1340104 1348759 1357091 1365931 1376099 1387588
50430 1387588 1400208 1414472 1431127 1450209 1471331 1494635 1520605 1549033 1579140 1610912 1645507
50419 1645507 1683883 1725618 1769546 1815106 1862593 1912375 1964433 2018582 2074709 2132702 2192345
50408 2192345 2253306 2315118 2377100 2438379 2497945 2554721 2607664 2655827 2698245 2733860 2761689
50397 2761689 2781116 2791884 2793815 2786756 2770715 2745829 2712145 2669778 2619388 2562313 2500182 2434721
50385 2434721 2368024 2302573 2240543 2183195 2131166 2085103 2045636 2012892 1986560 1966534 1953001
50374 1953001 1945601 1942777 1942364 1942731 1943072 1942623 1939949 1933193 1920805 1901899 1876116 1843577 1805027 1761731
50360 1761731 1714903 1665284 1613389 1560074 1506580 1453980 1402778 1353191 1305717 1261179 1220113
50349 1220113 1182266 1146901 1113655 1082975 1055663 1032086 1012054 995318 981899 971788 964548
50338 964548 959393 955587 952694 950650 949799 950692 953605 958285 964292 971425 979542 988089 996187 1003314 1009581
50323 1009581 1015193 1019813 1022651 1023148 1021431 1018163 1014016 1009371 1004592 1000496 998222 998344 1000301 1003079
50309 1003079 1006379 1010696 1016248 1022328 1028000 1033055 1037963 1043210 1049013 1055442 1062304 1068944 1074644 1079336
50295 1079336 1083634 1088078 1092592 1096839 1100852 1105099 1109996 1115512 1121166 1126357 1130788 1134674 1138425 1142047
50281 1142047 1144910 1146230 1145705 1143598 1140360 1136415 1132263 1128517 1125658 1123899 1123406 1124496 1127399 1131870
50267 1131870 1137275 1143121 1149397 1156283 1163587 1170532 1176118 1179783 1181799 1183093 1184633 1186975 1190281 1194532
50253 1194532 1199515 1204771 1209938 1215293 1221753 1230232 1241113 1254345 1269780 1287322 1307055 1329438
50241 1329438 1355161 1384565 1417359 1453152 1492063 1534398 1579724 1626605 1673369 1718989 1763181
50230 1763181 1805784 1846060 1882590 1914036 1940197 1962084 1980572 1995041 2003735 2005461 2000480 1989638
50218 1989638 1973086 1950180 1920313 1883510 1840382 1791900 1739308 1684082 1627821 1572103 1518288
50207 1518288 1467343 1419922 1376515 1337260 1301557 1268134 1235769 1203914 1172535 1141638 1111206
50196 1111206 1081541 1053331 1027242 1003495 981879 962106 944108 928005 913832 901396 890368
50185 890368 880466 871486 863349 856205 850305 845559 841411 837440 833916 831379 829839 828904 828655 829685 831994
50170 831994 834451 835828 836096 836326 837518 839898 843072 846476 849773 853159 857172 862023 867329 872806 878862
50155 878862 886099 894427 903241 912254 921557 930933 939874 948449 957443 967154 976518 984045 989499 994185
50141 994185 999602 1006229 1013742 1022111 1032085 1044584 1059918 1077867 1098464 1122327 1150061 1181590
50129 1181590 1216368 1254184 1295507 1341095 1391478 1446760 1506668 1570911 1639673 1713556 1792561
50118 1792561 1875238 1959438 2044061 2129520 2216073 2302132 2384751 2461591 2531967 2596065 2653723
50107 2653723 2704252 2747035 2781730 2807737 2823704 2827828 2818661 2795462 2757869 2705639 2639150 2560090
50095 2560090 2471347 2376150 2277400 2177610 2078885 1982695 1889967 1801710 1719359 1644236 1576752
50084 1576752 1516387 1462421 1414521 1372643 1336537 1305403 1278087 1253724 1232223 1213934 1198783
50073 1198783 1185990 1174783 1165125 1157432 1151694 1147183 1143015 1138729 1134325 1129954 1125560 1120706 1114743
50060 1114743 1107346 1098843 1089932 1081197 1073081 1066056 1060315 1055332 1050255 1044908 1040027 1036308 1033635 1031571
50046 1031571 1030130 1029654 1030180 1031533 1033887 1037641 1042670 1048304 1054297 1061338 1070271 1081099 1093074 1105503
50032 1105503 1118060 1130510 1142579 1154194 1165539 1176771 1187834 1198544 1208713 1218090 1226354 1233207
50020 1233207 1238530 1242588 1246107 1249919 1254243 1258536 1262376 1266354 1271673 1278980 1288103 1299004 1312357
50007 1312357 1328883 1348598 1371219 1397043 1426927 1461397 1500119 1542257 1587210 1634989 1685891
49996 1685891 1739548 1794128 1846783 1895192 1938576 1977058 2010433 2038019 2059393 2074618 2083679
49985 2083679 2086216 2081874 2070517 2051936 2025687 1991279 1948286 1896406 1836031 1769007 1698386 1626987
49973 1626987 1556355 1487219 1420540 1357725 1300033 1248150 1202256 1162186 1127536 1097842 1072694
49962 1072694 1051689 1034392 1020475 1009764 1002086 997182 994820 994756 996433 998976 1001635 1004098 1006288
49949 1006288 1008169 1009892 1011675 1013135 1013033 1010176 1004556 997223 989156 980612 971422 961346 950045 937195
49935 937195 922904 907739 892113 875927 859074 842145 826302 812404 800370 789434 779012
49924 779012 769358 761396 755880 752724 751134 750303 749882 750001 751066 753486 757308 762080 767254 772811 779310
49909 779310 787266 796603 806679 816724 826342 835855 846128 857726 870162 882233 893109 902722
49897 902722 911059 917621 921890 923925 924083 922433 918818 913228 905618 895568 882744 867705 851753
49884 851753 835863 820248 805000 790545 777163 764601 752627 741633 732175 724164 717057 710786
49872 710786 705908 702768 700931 699717 698985 699173 700791 704059 708883 714924 721793 729358 737836 747441 758063
49857 758063 769368 781125 793215 805419 817420 828947 839661 848839 855472 858979 859786 859053 857746
49844 857746 855998 853342 849429 844417 838612 831882 823710 813976 803564 793918 785982 779708 774510 769899
49830 769899 765680 761951 759215 758241 759398 762198 765801 769969 775244 782175 790688 800235 810235 820276
49816 820276 830224 840340 850949 861712 871482 879261 885133 889855 893647 895892 896080 894572 892146 889044
49802 889044 884764 878660 870645 861465 852351 844195 836850 829417 821339 813023 805301 798560 792603 787046
49788 787046 781517 775736 769886 764763 761083 758720 757067 756090 756434 758378 761309 764443 767594 770885 774194
49773 774194 777412 780897 785168 790290 795966 802037 808368 814326 818932 821678 822789 822623 821210 818509
49759 818509 814727 810111 804661 798269 790997 783064 774703 766110 757374 748363 738895 729165 719818 711479
49745 711479 704343 698354 693512 689792 686988 684977 684011 684371 685747 687292 688481 689676 691654 694704 698425
49730 698425 702365 706650 711807 718037 724850 731561 738085 745043 753023 761884 770945 779747 788377 796982
49716 796982 805226 812411 818082 822290 825231 826795 826571 824215 819726 813444 805987 798137 790524 783250
49702 783250 775897 768089 760067 752658 746659 742311 739301 737196 735870 735566 736556 738734 741622 744873 748714
49687 748714 753765 760401 768377 776991 785542 793695 801650 810034 819482 830161 841713 853610 865490
49674 865490 877181 888632 899894 910906 921049 929051 933691 934715 932932 929407 924761 919288 913338
49661 913338 907169 900576 893146 884995 876790 868817 860423 850800 840034 828832 817404 805321 792565
49648 792565 780029 768625 758486 749510 742215 737333 734717 733238 731778 729937 727888 726026 724737
49635 724737 723995 723108 721284 718516 715460 712441 709069 704989 700438 695822 691250 686834 682969 679826 676902
49620 676902 673609 670149 667338 665647 664849 664520 664437 664492 664583 664752 665120 665625 666079 666496 667099 667940 668876 670043
49602 670043 671980 674890 677972 679946 680307 679753 679336 679459 679851 680208 680476 680636 680648 680752 681523 683391 686263
49585 686263 689637 692954 695778 697980 699956 702354 705369 708549 711652 715329 720408 726690 733018 738615
49571 738615 743794 749299 755466 762182 769213 776337 783522 791076 799274 807724 815539 822307 828381 833952
49557 833952 838344 840663 840793 839364 837028 834094 830648 826681 822341 818250 815182 813157 811304 809010
49543 809010 806748 805319 804796 804846 805638 807585 810460 813610 817016 821279 826525 832182 838015 844627 852600
49528 852600 861773 871764 882696 895023 908937 924260 940584 957285 973712 989615 1005003 1019371
49516 1019371 1031531 1040638 1047100 1052048 1056146 1059319 1061426 1062664 1063252 1063136 1062086 1059828 1056027 1050388
49502 1050388 1042840 1033412 1021905 1007950 991646 974037 956737 941017 927273 915261 904573 894815
49490 894815 885656 877097 869664 863951 859884 856713 853903 851733 850772 851013 851879 852930 854249 856134 858739
49475 858739 861970 865475 868763 871549 874012 876548 879298 882118 884856 887457 889937 892504 895556 899165
49461 899165 902679 905190 906369 906457 905498 903100 899088 894005 888718 883679 878647 872966 866200 858734 851695
49446 851695 845957 841322 836990 832679 828839 825887 823933 823288 824524 827781 832578 838598 846086 855128
49432 855128 865088 875248 885612 896635 908543 921392 935412 950601 966209 981217 995365 1009223
49420 1009223 1023257 1037254 1050568 1062319 1071188 1075721 1075518 1072078 1067944 1064760 1062351 1059886 1057669
49407 1057669 1057290 1059995 1065497 1072790 1081615 1092423 1105147 1118876 1132820 1146807 1160552 1173193
49395 1173193 1184013 1193077 1200602 1206196 1209322 1210185 1209563 1207912 1205189 1201347 1196482 1190582 1183663 1176096
49381 1176096 1168270 1159885 1150156 1138892 1127064 1116082 1106753 1099029 1092560 1087301 1083664 1082109 1082566
49368 1082566 1084350 1086686 1089189 1091719 1094077 1096104 1097888 1099491 1100576 1100647 1099657 1098033 1096028 1093356 1089602
49353 1089602 1084796 1079436 1074004 1068579 1063017 1057523 1052901 1049895 1048290 1046981 1045103 1042743 1040342 1037844
49339 1037844 1034873 1031462 1028026 1024706 1021221 1017421 1013558 1009919 1006489 1003145 999974 997313 995610 995212
49325 995212 996134 998035 1000559 1003658 1007454 1011918 1016900 1022391 1028532 1035332 1042578 1050034 1057698 1065936
49311 1065936 1075327 1086113 1097700 1109072 1119894 1130905 1142982 1156124 1169697 1183343 1197187
49300 1197187 1211341 1225612 1239681 1253253 1266132 1278372 1290097 1300925 1309868 1316201 1320079 1321806
49288 1321806 1320796 1315868 1306433 1292923 1276342 1258072 1239974 1223818 1210391 1199471 1190627 1183556
49276 1183556 1177862 1173180 1169551 1167132 1165612 1164528 1163970 1164287 1165251 1166459 1168450 1172347 1178197 1184839 1191771
49261 1191771 1199938 1210027 1221049 1231541 1241415 1251643 1262750 1274602 1287203 1300513 1313575 1324792
49249 1324792 1333124 1338303 1339883 1336904 1328722 1315675 1298833 1279522 1259041 1238193 1216943 1195105
49237 1195105 1173594 1154490 1139434 1128239 1119463 1112218 1107062 1105053 1106215 1109233 1112744 1116662 1121888
49224 1121888 1128796 1136580 1144252 1151760 1159655 1168102 1176846 1185993 1196020 1206866 1217578 1227161 1235466
49211 1235466 1243009 1250248 1257379 1264668 1272597 1281642 1292052 1303922 1317346 1332354 1348728 1365964
49199 1365964 1383527 1401075 1418328 1434828 1450048 1463809 1476375 1488014 1498653 1508139 1516701 1524979
49187 1524979 1533620 1542937 1552930 1563529 1574804 1586963 1600200 1614709 1631005 1649976 1672283 1697644
49175 1697644 1725068 1753793 1783723 1815014 1847680 1881657 1916679 1951751 1985080 2014822 2039609
49164 2039609 2058304 2069885 2074135 2072174 2065975 2057548 2048796 2041466 2036466 2033322 2030878 2028493 2026296
49151 2026296 2024617 2023775 2024285 2026675 2031052 2037224 2045116 2054628 2065221 2076282 2087834 2100337 2113792
49138 2113792 2127623 2141500 2155645 2170155 2184643 2198852 2213147 2228087 2243834 2260262 2277237
49127 2277237 2294493 2311545 2328221 2345173 2363604 2384512 2408338 2435184 2465104 2498132 2534187
49116 2534187 2573114 2614992 2660458 2710478 2765471 2824756 2887194 2952311 3020505 3092248 3167503
49105 3167503 3245718 3325483 3403784 3476163 3538546 3589329 3629769 3662238 3687468 3702577 3701711 3679761
49093 3679761 3636622 3577959 3511401 3441858 3370266 3295856 3218689 3140328 3063285 2990381 2923989
49082 2923989 2865241 2813980 2769712 2732356 2701905 2677582 2657865 2641327 2627171 2614853 2603552
49071 2603552 2592291 2580560 2568679 2557503 2547773 2539627 2532573 2525901 2519181 2512378 2505583 2498861 2492484
49058 2492484 2487007 2482773 2479419 2476295 2473334 2471054 2469682 2468805 2468073 2467646 2467574 2467349 2466695 2466443 2467899 2471478
49042 2471478 2476600 2482753 2489948 2498173 2507147 2516759 2527108 2537894 2548316 2557785 2566200 2573352 2578728
49029 2578728 2582262 2584754 2587084 2589465 2591871 2594660 2598169 2602033 2605500 2608273 2610579 2612614 2614421 2616232
49015 2616232 2618441 2621287 2624953 2629882 2636523 2644778 2654030 2663675 2673334 2682733 2691876 2701289 2711563 2722573
49001 2722573 2733535 2743884 2753609 2762611 2770306 2776278 2781022 2785574 2790465 2795247 2798997 2801059 2801405 2800555
48987 2800555 2799245 2798002 2796925 2795787 2794332 2792413 2789907 2786596 2782264 2777004 2771348 2765874 2760594 2754881
48973 2754881 2748121 2740287 2731801 2723065 2714425 2706415 2699614 2694208 2689993 2686912 2685271 2685306 2686844 2689627
48959 2689627 2693755 2699511 2706828 2715243 2724431 2734590 2746147 2759179 2773312 2788183 2803914 2821033
48947 2821033 2839921 2860380 2881745 2903400 2925245 2947769 2971646 2997127 3023810 3051192 3079531
48936 3079531 3109935 3143383 3179797 3218336 3258548 3300871 3345937 3393662 3443241 3493909 3545550
48925 3545550 3598693 3654072 3712053 3772252 3833685 3895450 3957292 4019399 4081731 4143872 4205626
48914 4205626 4267420 4329649 4391772 4452506 4511100 4568005 4624041 4679251 4732910 4784437 4833788
48903 4833788 4881112 4926569 4970500 5013153 5053994 5091815 5126009 5157353 5187096 5215435 5241344
48892 5241344 5263842 5282961 5299481 5314051 5326669 5336663 5343037 5344991 5342281 5335149 5323931 5308849
48880 5308849 5290053 5267740 5242238 5214021 5183440 5150295 5113844 5073497 5029374 4982001 4931755
48869 4931755 4878980 4824430 4769018 4713098 4656445 4598984 4541073 4483023 4424933 4367311 4311326
48858 4311326 4257962 4207170 4158280 4110990 4065547 4022148 3980778 3941674 3905425 3872367 3842197
48847 3842197 3814441 3789122 3766674 3747332 3730914 3717264 3706621 3699356 3695423 3694293 3695394 3698534
48835 3698534 3703860 3711599 3721876 3734604 3749413 3765811 3783541 3802659 3823187 3844886 3867574 3891392
48823 3891392 3916416 3942194 3968119 3994254 4021333 4049849 4079489 4109577 4139737 4169996 4200628
48812 4200628 4232075 4264669 4298164 4331824 4365230 4398722 4432802 4467404 4502034 4536411 4570652
48801 4570652 4605102 4640264 4676554 4713671 4750429 4785692 4819257 4851363 4881655 4909452 4934974
48790 4934974 4959348 4983033 5004919 5023470 5038249 5049820 5058473 5063691 5064713 5061114 5052861 5040252
48778 5040252 5023884 5004379 4981978 4956532 4927930 4896400 4862391 4826216 4787836 4747023 4703869
48767 4703869 4659131 4613780 4568087 4521387 4472980 4422987 4372034 4320403 4267979 4214937 4161984
48756 4161984 4109875 4059078 4009956 3962844 3917775 3874410 3832396 3791585 3751914 3713464 3676731
48745 3676731 3642370 3610446 3580351 3551759 3525341 3502127 3482444 3465863 3451879 3440120 3429995
48734 3429995 3420710 3411803 3403360 3395686 3389030 3383607 3379477 3376356 3373833 3371881 3370937 3371412 3373347 3376455
48720 3376455 3380176 3383822 3387089 3390459 3394621 3399430 3403944 3407567 3410570 3413271 3415404 3416778 3417993 3419883
48706 3419883 3422653 3426148 3430584 3436239 3442613 3448771 3454520 3460575 3467477 3475061 3483084 3491606 3500408 3508750
$$ [...]
##END NTUPLES=NMR SPECTRUM
##END=
