##TITLE=AC1581_2782_8202388_tz30C9GtBx
##JCAMPDX= 6.0         $$ Bruker NMR JCAMP-DX V2.0
##DATA TYPE= NMR SPECTRUM
##DATA CLASS= NTUPLES
##ORIGIN= BRUKER
##OWNER= Administrator
$$ 1.72 TOPSPIN		Version 2.1
$$ 2013-09-27 01:39:07.311 -0700  Administrator@X
$$ Compression mode = diff/dup
##.OBSERVE FREQUENCY= 400.02188249412
##.OBSERVE NUCLEUS= ^1H
##.ACQUISITION MODE= SIMULTANEOUS (DQD)
##.ACQUISITION SCHEME= undefined
##.AVERAGES= 8
##.DIGITISER RES= 22
##SPECTROMETER/DATA SYSTEM= spect
##.PULSE SEQUENCE= zg30
##.SOLVENT NAME= COFFEE_meoh
##.SHIFT REFERENCE= INTERNAL, COFFEE_meoh, 1, 14.98509
##AUDIT TRAIL= $$ (NUMBER, WHEN, WHO, WHERE, PROCESS, VERSION, WHAT)
$$ ##TITLE= Audit trail, TOPSPIN		Version 2.1
$$ ##JCAMPDX= 5.01
$$ ##ORIGIN= Bruker BioSpin GmbH
$$ ##OWNER= Administrator
$$ $$ E:\/data/COFFEE/nmr/AC1581_2782_8202388_tz30C9GtBx/10/pdata/1/auditp.txt
$$ ##AUDIT TRAIL=  $$ (NUMBER, WHEN, WHO, WHERE, PROCESS, VERSION, WHAT)
(   1,<2013-09-27 01:39:00.289 -0700>,<Administrator>,<X>,<go>,<TOPSPIN 2.1>,
      <created by zg
	started at 2013-09-27 01:37:53.825 -0700,
	POWCHK enabled, PULCHK disabled,
       configuration hash MD5:
       C8 4E 4E 5D D3 5C D8 9E 9F 52 82 E0 59 8A DE 15
       data hash MD5: 64K
       21 69 A6 B0 57 72 59 F9 A3 7A 67 9C 5A 06 24 5D>)
(   2,<2013-09-27 01:39:03.170 -0700>,<Administrator>,<X>,<proc1d>,<TOPSPIN 2.1>,
      <Start of raw data processing
       efp LB = 0 FT_mod = 6 PKNL = 1 PHC0 = 0 PHC1 = 0 SI = 32K 
       data hash MD5: 32K
       39 87 96 0D 78 66 FD 63 78 C4 3B 3A 24 26 67 1A>)
(   3,<2013-09-27 01:39:03.458 -0700>,<Administrator>,<X>,<proc1d>,<TOPSPIN 2.1>,
      <pk PHC0 = 94.77905 PHC1 = 0 
       data hash MD5: 32K
       0F 40 E3 F8 57 F7 15 BD E4 62 C2 7F CA 27 23 6E>)
(   4,<2013-09-27 01:39:03.549 -0700>,<Administrator>,<X>,<proc1d>,<TOPSPIN 2.1>,
      <abs ABSG = 1 
       data hash MD5: 32K
       5B 5C 0F D4 A3 94 04 32 32 D3 51 B3 FD 4B B0 88>)
(   5,<2013-09-27 01:39:03.701 -0700>,<Administrator>,<X>,<proc1d>,<TOPSPIN 2.1>,
      <abs ABSG = 2 
       data hash MD5: 32K
       1C F6 39 CD 23 0E 3F 9B F4 1A E0 9A 1F 91 5A BA>)
(   6,<2013-09-27 01:39:03.852 -0700>,<Administrator>,<X>,<proc1d>,<TOPSPIN 2.1>,
      <abs ABSG = 3 
       data hash MD5: 32K
       E1 3E 87 E0 8B 94 11 5B FF 4E EF 42 4F 70 00 65>)
(   7,<2013-09-27 01:39:04.004 -0700>,<Administrator>,<X>,<proc1d>,<TOPSPIN 2.1>,
      <abs ABSG = 4 
       data hash MD5: 32K
       3C 49 0C B4 46 21 15 D1 0D 7F 48 4D 08 BD A9 76>)
(   8,<2013-09-27 01:39:04.049 -0700>,<Administrator>,<X>,<proc1d>,<TOPSPIN 2.1>,
      <abs ABSG = 5 
       data hash MD5: 32K
       E5 7C AD 92 52 7E B1 DD 5A 2B 6B FC 26 1C BD 97>)
$$ ##END=
$$ 
$$ $$ hash MD5
$$ $$ EE 69 D4 39 C1 FA 82 1B D8 EB 45 6D AB 3F 66 F0
##$RELAX= 
##$RELAX= 
##$RELAX= 
##$RELAX= 
##$RELAX= 
##$RELAX= 
##$RELAX= 
$$ Bruker specific parameters
$$ --------------------------
##$DU= <E:\>
##$EXPNO= 10
##$NAME= <AC1581_2782_8202388_tz30C9GtBx>
##$PROCNO= 1
$$ [...]
150 150 150 150 150 150 150 150
##$TP07= 0
##$TPNAME0= <>
##$TPNAME1= <>
##$TPNAME2= <>
##$TPNAME3= <>
##$TPNAME4= <>
##$TPNAME5= <>
##$TPNAME6= <>
##$TPNAME7= <>
##$TPOAL= (0..7)
0.5 0.5 0.5 0.5 0.5 0.5 0.5 0.5
##$TPOFFS= (0..7)
0 0 0 0 0 0 0 0
##$TUNHIN= 0
##$TUNHOUT= 0
##$TUNXOUT= 0
##$USERA1= <user>
##$USERA2= <user>
##$USERA3= <user>
##$USERA4= <user>
##$USERA5= <user>
##$V9= 5
##$VALIST= <valist>
##$VCLIST= <CCCCCCCCCCCCCCC>
##$VD= 0
##$VDLIST= <DDDDDDDDDDDDDDD>
##$VPLIST= <PPPPPPPPPPPPPPP>
##$VTLIST= <TTTTTTTTTTTTTTT>
##$WBST= 1024
##$WBSW= 4
##$XGAIN= (0..3)
0 0 0 0
##$XL= 0
##$YL= 0
##$YMAX_a= 618421
##$YMIN_a= -526284
##$ZGOPTNS= <>
##$ZL1= 120
##$ZL2= 120
##$ZL3= 120
##$ZL4= 120
##$ABSF1= 14.98509
##$ABSF2= -5.573092
##$ABSG= 5
##$ABSL= 3
##$ALPHA= 0
##$AQORDER= 0
##$ASSFAC= 0
##$ASSFACI= 0
##$ASSFACX= 0
##$ASSWID= 0
##$AUNMP= <proc_prof1d_extract_pilot.lims>
##$AXLEFT= 0
##$AXNAME= <>
##$AXNUC= <1H>
##$AXRIGHT= 0
##$AXTYPE= 0
##$AXUNIT= <>
##$AZFE= 0.1
##$AZFW= 0.1
##$BCFW= 0
##$BC_mod= 0
##$BYTORDP= 0
##$COROFFS= 0
##$CY= 15
##$DATMOD= 1
##$DC= 0
##$DFILT= <>
##$DTYPP= 0
##$F1P= 0
##$F2P= 0
##$FCOR= 0.5
##$FTSIZE= 32768
##$FT_mod= 6
##$GAMMA= 0
##$GB= 0
##$INTBC= 1
##$INTSCL= 1
##$ISEN= 128
##$LB= 0
##$LEV0= 0
##$LPBIN= 0
##$MAXI= 10000
##$MC2= 0
##$MEAN= 0
##$ME_mod= 0
##$MI= 0
##$NCOEF= 0
##$NC_proc= -8
##$NLEV= 6
##$NOISF1= 0
##$NOISF2= 0
##$NSP= 0
##$NTH_PI= 0
##$NZP= 0
##$OFFSET= 14.98509
##$PC= 1
##$PHC0= 94.77905
##$PHC1= 0
##$PH_mod= 1
##$PKNL= yes
##$PPARMOD= 0
##$PPDIAG= 0
##$PPIPTYP= 0
##$PPMPNUM= 2147483647
##$PPRESOL= 1
##$PSCAL= 4
##$PSIGN= 0
##$PYNMP= <proc.py>
##$REVERSE= no
##$SF= 400.02
##$SI= 32768
##$SIGF1= 0
##$SIGF2= 0
##$SINO= 400
##$SIOLD= 32768
##$SPECTYP= <>
##$SREGLST= <1H.CDCl3>
##$SSB= 0
##$STSI= 32768
##$STSR= 0
##$SW_p= 8223.68421052631
##$SYMM= 0
##$S_DEV= 0
##$TDeff= 65536
##$TDoff= 0
##$TI= <>
##$TILT= no
##$TM1= 0
##$TM2= 0
##$TOPLEV= 0
##$USERP1= <user>
##$USERP2= <user>
##$USERP3= <user>
##$USERP4= <user>
##$USERP5= <user>
##$WDW= 1
##$XDIM= 32768
##$YMAX_p= 485274610
##$YMIN_p= -688634
##$CURPLOT= <Network HP LaserJet P1505>
##$CURPRIN= <$Network HP LaserJet P1505>
##$DFORMAT= <normdp>
##$LAYOUT= <+/1D_H.xwp>
##$LFORMAT= <normlp>
##$PFORMAT= <normpl>
##$SURQMSG= 1
$$ End of Bruker specific parameters
$$ ---------------------------------
##NTUPLES= NMR SPECTRUM
##VAR_NAME=  FREQUENCY,     SPECTRUM/REAL,   SPECTRUM/IMAG
##SYMBOL=    X,             R,               I
##VAR_TYPE=  INDEPENDENT,   DEPENDENT,       DEPENDENT
##VAR_FORM=  AFFN,          ASDF,            ASDF
##VAR_DIM=   32768,         32768,           32768
##UNITS=     HZ,            ARBITRARY UNITS, ARBITRARY UNITS
##FACTOR=    0.250966925370066, 1,           1
##FIRST=     8223.43324360094, -34840,       -137133
##LAST=      0,             84637,           -71323
##MIN=       0,             -688634,         0
##MAX=       8223.43324360094, 485274610,    0
$$ Real data points
##PAGE= N=1
##DATA TABLE= (X++(R..R)), XYDATA
$$ [...]
23835 -44327 -6995 -5832 -76368 -170970 229878 -204237 -71199 162591 221218 -40613 196259
23823 11563 -307692 -142787 -71257 29999 -124444 -49402 50335 -111204 269884 -19930 -302693
23812 -302693 -58542 230404 -164455 71718 -91808 -124660 -96855 51224 -180617 -2588 -60199
23801 -60199 -62295 99730 242916 -104936 -191878 -46594 -183142 48164 -193093 -220172 -63487
23789 -3996 -29789 -112365 24976 -71863 -34902 49138 9061 27349 91157 -268967 -78394 309971
23776 134672 136873 51519 -144947 75295 -349473 -143431 168145 413739 -79444 -168770 -32710
23764 -104485 -87970 152998 -206265 85848 19501 -151270 330458 10005 113145 -220682
23753 -270582 -265495 -108791 -302733 -215145 -151135 13801 236607 63147 46370 181290 -70245
23741 -156529 -157498 -218990 -152537 5067 89711 45055 -229520 211536 -60783 78203 -27043 32861
23728 86814 83982 -390905 148480 54872 -345641 110032 -681 -128224 14558 -213882 220270
23716 22765 -127876 -202732 -168806 -24132 -181206 -157171 138292 117575 132925 343629 -24709
23704 -471697 422209 -16897 131457 53358 -110628 -184209 -236799 -500875 -52943 -92528 -135114
23693 -135114 191653 -62525 -24679 -50765 202753 -85996 228572 156857 -39752 -33917 114426
23681 -62909 -334236 -311665 -49321 -105841 -30477 198835 31494 -79407 28699 125814 -255757
23669 34399 -93709 -88832 50935 75386 134051 -330921 -68990 -27652 318601 495841 -160540
23657 23210 -114455 50231 213218 21667 478742 -220361 28358 87634 157321 183851 -133087
23645 -52845 -75824 -281665 -193590 45664 78682 -159289 119921 -139428 177894 330570
23635 330570 6628 -38138 -114426 209281 43063 -50768 -322829 254253 -44167 85653 158864
23624 158864 50615 -24407 -74117 225933 -269732 181001 22989 13788 39888 68433 -212261
23612 -352313 -91449 23348 204300 4920 89740 -239013 -4331 -251503 102533 -35110 -211815
23601 -211815 141420 170442 359727 134174 -27592 -22939 315907 -375869 -48789 -49495 105754
23589 -3515 69873 -302546 -15140 -205821 226069 -36705 206623 322517 -53311 283197 -62938
23577 306483 89012 -73802 81414 130675 33059 139027 50238 115541 30641 -80269 43207
23565 312799 -79949 -267344 68365 -132945 14042 74487 66292 258766 -34342 -489938 173892
23553 145183 195291 153239 -7303 -323609 -590862 357763 100039 -110460 -244459 -174918
23543 -174918 -142400 351411 89044 15639 -318920 -15240 -214795 -257721 139617 -188389
23532 -110206 -212822 -179939 186092 -81661 -60484 -62341 175790 -182967 -7969 -162107 65810
23520 66043 211611 -135942 -440826 -120152 200533 -89493 211999 -111695 -380085 -480039
23510 -480039 140053 -273347 -103534 -23909 178146 34488 -230242 -4602 -241200 74444
23499 -231100 48891 -287487 -182296 -432065 78165 -238455 -368653 -244254 345778 112399
23488 266132 184859 -274362 62168 171693 12764 -68615 -267404 226016 -241451 -50578
23477 120954 123667 -430326 -40152 137185 -214507 -57110 16720 255213 -558 -443707 -66874
23465 9446 -303939 43693 6002 -27727 238769 -317979 -235239 107523 43696 108078 -80913
23453 -161123 -36913 190442 -9135 -96420 -195757 -157916 89218 3341 -11323 95776 -32528 -330216
23441 -330216 106365 75123 -287029 -146147 -341081 168039 -158390 48167 -13916 248739
23430 103514 134599 53673 -82700 -392854 -84566 -6268 -174494 15834 167138 272033 343754
23419 343754 -272999 188479 131630 228560 -1208 -95275 -12992 -172739 268879 -13587 230194
23407 162743 -75175 224554 -29898 73971 196603 -79586 49238 7331 47154 215434 -36236
23395 -21564 -159363 -117124 127267 -123535 13464 367418 -280164 -296581 -225316 20480 -102362
23383 -274230 12270 80416 -2627 273984 -260008 -107336 -120579 -56416 -32227 -141682 11621
23371 -16493 -410025 103260 164470 192886 -31702 -19734 58578 -165672 -3665 1209 -242102
23359 -173834 -422223 -20512 352648 77287 -82974 -138379 -142889 -272245 -118522 -118639 89547
23347 -216483 -373539 -199266 -351156 4774 116495 237699 171388 -251785 100371 159221
23337 159221 -123009 -30585 -150413 269044 -217829 -273658 -258722 -113729 3708 -250266
23326 145758 60240 -134840 101042 -11825 -90670 205391 149710 13092 -242411 86531 -47844
23314 21700 -282688 -326046 39463 -327450 -167251 -466596 -185369 105679 12929 94456
23304 94456 208210 250177 -80607 -305117 29329 248400 321510 -4848 -195458 128860 113158
23293 113158 175322 -46467 -52249 33151 -225800 -105525 -226111 -192683 -75086 -103013 119996
23281 -316552 -3213 -36561 233848 -229086 73239 -215280 204353 -307609 -19022 -113181 109484
23269 131949 97007 13201 -230796 57930 -44789 -486450 -114884 -101685 58162 1004 237805
23258 237805 -141579 -45824 -201180 37780 46975 -297057 43444 -39260 -875 80290 92959
23247 92959 8687 192472 96023 -32299 85748 165087 67146 -49565 -91912 -69649 8430 -130828
23234 200236 -25853 130847 147076 298068 245444 19092 125883 39261 -52037 -51951 -169089
23223 -169089 -39008 188786 300428 -107939 -46454 32181 -104830 569179 -69510 -231622
23213 -231622 178794 124421 -149851 -96985 29347 21149 -78358 -299384 88460 316202 -78161
23201 -58722 -246772 -101825 218496 -121983 98121 -276633 -61950 98963 81215 -57015 -474958
23190 -474958 80367 -213146 -424947 -247372 -14670 -159682 22799 -16071 -55609 -208234
23180 -208234 -15320 -199987 207336 -98302 54841 158968 104448 420008 -198607 -6885 171980
23168 40667 8682 -151569 102231 -188483 131751 228 -132048 71277 105443 185627 75568
23156 -47142 31698 -138005 48955 -12444 -136996 164901 71593 -72920 77229 -96707 87122
23144 286602 -231910 -55757 257938 -76400 129426 -159062 -73512 161366 -274760 -206376
23134 -206376 298621 61223 495684 -30673 -273734 -15628 266075 -2713 -198409 157003
23123 96172 -103191 -66286 139050 35029 48843 198991 324561 -145206 216480 272812
23113 272812 -1133 227554 -193994 -531147 31785 -247442 305837 -200091 17679 2764 -262205
23101 -39196 -78499 181949 88063 195187 204602 137746 116679 -220693 105971 149196 8290
23089 -52780 56101 -126225 -83027 81216 -114360 -169759 249973 -308581 -374900 2011 -44217
23077 -78451 -27067 -12529 319933 73851 -65198 219000 -208212 -151196 -176445 -196075 21384
23065 40159 143023 241293 -187108 -86313 11782 6063 -101260 -142 -89206 -292358 -316267
23054 -316267 139156 229793 73735 -270129 -40612 -278752 43030 -89703 -131998 -261567 275112
23042 156563 238158 185395 -46586 246474 -51828 163278 60123 -338441 -57176 57615 -177858
23030 147147 -157491 113294 311726 67690 141631 150310 161846 -160860 177084 -229966
23019 -41399 -7183 123704 61314 -60358 -13836 292727 -138629 -160545 -30592 42139 18501
23007 -114666 -276881 118633 -360667 27079 -324967 -189332 -867 -153436 165 -231420 126786
22995 -38292 61607 -421491 158794 -403773 38289 192200 -339783 114256 -290318 340248
22984 -398759 -128605 -101558 178326 -75383 -70374 -76451 46038 21617 297606 -153204 257252
22972 -114610 -66673 -147060 -301803 -49546 -223732 -187370 -194430 -94578 -359039 13523 178609
22961 178609 4002 25799 -109944 92349 -29963 -158638 23648 80276 83767 -64790 -135053
22950 -135053 -58496 -39680 95852 -117244 -11883 -58853 -131792 -221015 -51725 -216266 -62415
22938 137147 114602 91058 -830 -134562 -138764 147229 85998 173611 233824 34882 -158081
22926 -16722 195782 -78365 39073 -196179 -195168 49027 -144414 64860 3491 -188217 201800
22914 -68467 15177 -143516 342476 73506 258619 -419926 18197 50536 88820 -262267 -176831
22903 -176831 -241375 66131 -130464 201237 207728 32162 139436 109265 -171801 -288379 -16750
22891 -4443 -110517 355867 105530 -154234 -79840 -538568 92236 361251 -508084 -34948
22880 -126038 -103979 -5712 48237 157277 113874 -295170 137534 214733 -212672 -97863 -153796
22869 -153796 -152358 20210 -118115 377034 5777 8284 95422 245781 -103103 91546 173153
22858 173153 -184943 53057 -95720 -81154 -303828 -101647 -25081 -41409 72298 -315760 -52454
22846 68518 -285964 219962 -133670 -58483 -425640 -82774 160244 282502 -174968 -224151
22836 -224151 136461 -64855 -14471 83072 -159592 216798 269529 -91889 240648 -275122
22825 -248019 302062 268174 161750 335549 -143309 -135895 -388965 -30517 -23977 -12251 226964
22813 -88058 -143273 -62444 140577 36936 159503 -164322 51924 -52961 -11319 -403462 52076
22801 161229 -215172 117503 -212606 -997 70641 -229815 -2497 -44108 -199162 -97761 37992
22789 -56442 -191205 132695 -215887 -58771 93207 4434 -297501 127029 -113560 299231
22778 -94047 66910 -253985 -158713 -39263 257349 102658 -10278 31168 -126176 -286977 -44843
22766 253501 -128183 -73120 -225172 -352446 -267712 50676 -117991 90855 132258 -119361
22755 -43339 -266981 -26986 77064 8628 -257232 322870 -412758 153878 -33076 66945 15582
22743 -258705 -63761 -133337 -200964 863 20045 706170 -31309 434426 -258863 56797 -39186
22731 -87452 -178440 -273233 -325064 -98983 263052 393320 -297600 -12296 71018 131162 92054
22720 92054 314212 -417065 -217496 12280 -142133 123557 -100522 -187274 -128519 -258354
22710 -258354 138677 -42533 -102682 -339865 3193 -233994 121917 -260680 182952 -1900 -33260
22699 -33260 164517 -278246 -435730 -68654 38497 -102814 160577 -283954 238135 -305165
22688 87384 138249 -137946 -32236 -283650 154629 -109898 302851 -142992 -34318 366257
22677 -242378 233033 -168576 -145965 154091 333253 -172182 52808 38522 85592 183201
22667 183201 -17874 189752 -55630 82456 -208305 109028 -190389 -15063 -56026 70547 23760
22655 15230 119328 163629 -133178 -98883 -28231 114063 -37579 -180541 64220 -108789 264114
22643 196865 -284311 220428 -243036 -132797 243932 -174855 69665 -48567 -273743 -107333
22632 -388913 -213194 76969 -187580 -33821 -4958 -156165 76554 156037 228614 -291484 -75494
22620 -154513 413439 -116313 97495 -72196 -38525 68415 -195508 -307784 140296 -83841
22609 189036 -320179 406680 -21974 -127010 -221546 59099 -102820 -34606 -36456 74176 809
22597 -7272 -241919 156602 -93744 -211651 -149394 65263 -75518 104681 -257529 197460 -68990
22585 30266 -98312 118700 100117 -230586 -27092 202646 -255895 -105523 117776 89425
22575 89425 -114569 -302592 -116964 107739 12084 -81946 211916 -125805 -168452 -43428
22564 136622 -132666 181864 228946 72434 172130 -90447 -79572 112126 -172903 -148413 -123523
22553 -123523 -127313 -140842 -248786 -139465 53085 146437 -140803 235714 -52806 9403 -58358
22541 -318357 86300 275997 98997 188901 -136431 -210977 -89392 -146467 53280 -225714 -203786
22530 -203786 -101007 96798 145318 -111801 -290348 -150313 -132763 13484 6864 214371 -144018
22518 7089 30119 -163447 156214 -197136 103933 37134 46359 137294 77693 59317 -273085
22506 -228691 -136908 -206499 -75851 30421 -456887 140732 -138715 31011 196076 -126585
22495 -60028 246959 -49454 186954 -80491 -228386 -202043 -141325 185720 115142 119293 128287
22484 128287 -52681 120394 159123 214030 -54289 280044 1206 138106 223917 283551 -403663
22472 -199384 115406 154156 147612 -42456 -101159 -152205 190794 -1829 -194728 152891 214442
22461 214442 54750 -112184 -131972 139637 42086 -364367 51334 160679 -303384 128165
22450 272302 189238 -75680 34176 -182493 -242158 -145193 16609 -72250 -64156 313765 37332
22438 369758 -112727 74327 -141207 -72236 -39239 277781 -94425 -14404 174243 -90730 135846
22426 -282865 -115542 -63244 -105763 154305 -83707 62631 -35651 -177760 -145421 -220660 168138
22414 -257744 55351 -136147 188723 -126578 -12420 267585 -88199 -150944 -111715 185495
22403 -143645 265944 86522 180888 -121954 -157429 -283349 -224850 39319 325945 122490
22392 -347605 180068 257442 97297 28874 4115 100703 -483811 343363 58499 -449224 -58235
22380 -163925 80260 -69794 -75138 370686 -371901 548447 -263261 -63853 -295329 16111 -37398
22368 -147833 -30752 -125806 123830 55898 57589 -293487 -77144 -90519 61884 -161214 50502
22356 79300 -42554 221506 365153 135968 -190136 65907 -146151 66541 -87152 -107002 -235758
22345 -235758 77350 182627 258386 -345078 4170 -286684 -87563 255048 23675 -169533 123150
22333 -289849 13433 266555 -132215 -288152 113693 -3387 -174332 -160755 -167717 -152777 -45011
22321 7473 205462 90415 -188053 -127497 -87063 160886 -47537 -74451 -340993 -11645 16423
22309 -81869 -193557 150238 -326805 -217184 67902 119168 -45479 -81697 -100359 -180899 77084
22297 -29688 125537 325922 -211275 -160433 12726 249378 125346 -297486 -394844 -39193
22286 -120237 20814 -117080 -73322 260005 274251 -78271 114947 -123995 78638 -116705
22275 55583 75972 64514 76665 -78976 198435 110496 196873 -372263 39555 6163 185820
22264 185820 124739 -79984 -278488 -283100 -76168 -292120 62282 -158435 -184248 -9497 -42663
22253 -42663 -283140 -94853 -88819 -256139 353243 -197131 -112286 -281032 -166766 -143076 -194274
22242 -194274 -197121 -306010 -65663 -136268 128628 -66336 79256 -22051 176309 -183638 -70712
22230 -166391 -87959 383366 3442 -5254 -192669 -93447 99855 270919 25163 84893 136617
22219 136617 160321 108053 255077 140167 269769 6847 -51066 -233484 215663 -107184
22208 -106261 -213954 -55427 -106532 -248677 -148800 -240591 -149658 -201406 226347 -188019 89253
22196 201439 -438586 145685 -33137 -94191 -143057 -153181 -207230 42060 -34346 65317 -252268
22184 47474 151903 47810 -51353 -106510 -374365 297131 102578 -196065 209252 -91615
22173 145994 187591 -36535 155498 154769 -327614 305967 -256609 175064 128326 113576 201417
22162 201417 34868 186279 -164157 74338 -29463 -87512 -188262 -192299 302910 180209 174587
22151 174587 -2927 -246470 36542 -184186 103728 -114404 -345257 -465239 33920 122716
22141 122716 278944 -256840 -56888 124193 87377 -190253 -26568 -222637 -166203 -103178
22131 -103178 -117296 -286364 -193674 181761 115434 -171204 106069 -69235 -259836 -165300
22121 -165300 19414 -92299 -340 -100126 -156185 -275129 -42369 138917 -223575 21280 66644
22110 66644 -117329 -74769 -191756 46292 51791 -68381 28379 50226 174106 51880 17670
22098 96178 -89924 -109068 -34132 -171405 67784 -165715 173816 224195 -9272 -20540 -93193
22087 -93193 47602 170137 -117879 201526 65338 -154030 -36241 196270 103915 -5051 -83543
22076 -83543 95967 -36881 143496 143541 -68242 158514 9981 -59477 -47459 152090 -41756 44522
22063 -238249 -25764 -10904 314229 10069 59824 -178238 -28080 45702 -59293 135029 -145566
22051 39112 -139861 -111381 -75691 -55079 -349734 41347 -76535 70775 -289584 19883 249637
22040 249637 -196298 -245144 -98325 198850 -317609 226779 -47298 26900 -306164 230274
22029 -429701 122859 -121486 84333 120907 -84559 -70670 133064 77573 -351620 -102395
22018 130178 64349 109036 -121834 2288 185863 -216910 -187980 -71632 -27576 101033 -138417
22006 -2793 -15910 -5656 14068 15681 28550 2499 265110 214655 218545 -85832 -247901 266390
21993 -108999 20245 85358 425153 33632 157459 -32217 -90320 106562 -197631 8519 -48099
21981 -220566 278041 59966 -336676 -122569 -64248 52189 -158446 -55631 30432 -46289 -130374
21970 -130374 -254669 35576 241117 37598 -10076 110537 77761 -365947 -112325 -184995
21960 -184995 -434344 47649 27384 -357138 184621 44777 -150590 5364 162526 17489 51080
21949 51080 -92081 218352 110363 59522 -61615 175150 38181 -112955 -109692 -172344 104996
21937 -306107 334938 -46102 68657 -215196 115951 -11593 305477 -149321 -2952 -91249 -108133
21926 -108133 -7051 246186 187595 108990 -159388 -91339 124772 159172 179757 -103812 -88447
21915 -88447 -65064 -436623 260240 -123339 -140577 108950 -160035 -254742 191504 -90588
21904 17189 -419174 110917 47171 5139 -114758 5345 -336105 -187516 -58704 -18448 19864
21892 48920 163632 31195 117218 -113814 27908 -223593 -186735 181605 -188827 -289605
21882 -289605 159268 -172532 443503 -115163 -141102 -138919 194179 -61956 -154750 145409
21871 31611 84042 45973 -32498 47468 -198598 -91920 152088 142942 346303 -271873 -148083
21860 -148083 -117628 -187485 187227 355507 106459 127557 312617 -38143 75686 -124422
21849 172726 -93211 -285764 -174289 -130405 -230987 -306281 -13458 90181 -324914 -115027
21838 -246491 9364 -69743 -503000 -373092 93735 -139993 -95034 -17354 -164917 -12290 -253118
21827 -253118 -106230 -207401 -213597 -156453 159128 12511 133555 18363 120075 -203901
21816 -142262 13087 -98742 -231322 -91976 -25306 -177671 185797 69431 -59839 144170 187992
21805 187992 -56160 233285 23744 241318 -251850 24033 30047 -169669 -20244 200803 241702
21794 241702 256815 -230774 -67497 58034 74483 -285769 223526 -168311 146277 341291
21784 341291 -215874 309317 -154164 -1137 -319127 -161450 -168252 81521 163787 -303170 121550
21772 198486 -65472 -33179 -107714 -454048 -97974 -526460 -122792 -483029 87079 90483 286248
21761 286248 -37372 -88947 163547 -27876 -16047 -109671 -65820 -61144 -280610 -33693 16571
21749 -48986 -132780 27205 99958 -59333 -169022 -141039 -82944 -125136 -23844 171061 271562
21738 271562 -78285 -262323 -216677 -299581 -225080 62565 -165645 -191637 127183 -412536 38265
21726 43185 -35159 -109489 558257 89652 101592 479617 -76442 -229924 37259 -201393 -195815
21715 -195815 20462 -73266 162575 -226561 -172399 192495 -158108 -8655 -159550 198769
21704 128677 31825 -335839 -54903 -78178 -73239 -165987 50843 -16875 -117015 133274 61606
21692 -35748 69209 104565 -265084 35658 -33188 82776 -274294 -117338 -164006 -172460 43047
21680 40428 27995 -126674 79133 -202620 -74 -29999 -187615 -204713 -76979 63371 125717 253853
21668 253853 -124265 99124 -324972 -151731 193235 16839 -262024 39755 -106575 -246648
21658 -246648 -222316 263757 87224 -291468 -18617 -117213 -39391 -341570 149907 27493 376326
21647 376326 -239747 49420 335652 -29462 193940 -280829 133701 -935 228579 49811 -476181
21635 -127010 374759 -141188 127855 -180353 6009 199395 190738 -94961 -2739 -318294 73410
21623 -79308 -364026 -207969 -61234 -259072 33757 -224355 2199 -217202 -153663 -2372 -98234
21612 -98234 178613 -103637 -220943 -157730 -58339 262937 -142114 -372435 348734 26223
21601 -60007 -387072 -224116 -235500 -327132 207229 63482 -3081 -214992 211614 34388 198525
21590 198525 -40355 56815 180340 -241521 126988 -99344 -23473 -36821 -56564 -77377 -326218
21579 -326218 -19585 148626 153794 -181185 41796 -62120 137153 -68788 -200014 -180247 -37728
21567 40730 -248527 -211940 203573 -106247 -25649 -228190 -178392 -201319 -13817 -182470 36163
21555 -159116 178150 219888 -114056 -72415 -307793 83053 -54477 75460 -53572 -183828 -279379
21544 -279379 -90608 -11969 193650 95984 118357 -5564 -153876 -37391 25941 -169219 99424
21532 148157 -4284 78680 -496973 11705 57527 -179266 201535 -5327 203667 -81279 -237366
21521 -237366 -76682 -179845 46864 28571 -169754 -110226 75716 37665 -85273 -259848 -279093
21510 -279093 -150817 -465270 -73497 -395968 -24752 -5020 -81327 133334 28166 -129054 -17354
21498 -114818 -52671 -154138 -9545 323725 -245327 -254328 -244777 210 -61560 72869 -218679 -389595
21486 -389595 -86880 -252016 -41704 -234967 -84680 26298 -49068 229788 22486 -103787 -12411
21474 -154107 -247289 -380841 80800 291879 16119 -85562 -139334 -129361 -12755 -67524 114146
21462 166749 182569 -70411 -41547 410855 -71243 -46585 6933 -44445 -122215 -6553 200318
21450 48599 -110407 -46755 -134130 30796 -26167 -89689 -135043 318764 120283 93032 217791
21439 217791 102307 -40746 25987 593906 787122 300178 24528 -73527 -263571 -39801
21428 -124521 -138239 -52513 -29763 -122699 -266111 54132 142712 -209744 -121106 31293 22379
21417 22379 -48088 -155613 -177111 133037 51456 -4391 68684 -67292 42904 -147545 -476444
21406 -476444 10296 -31682 -35431 127989 13947 -20591 -26877 -166431 -134218 -37245 48580
21394 -140463 154725 247554 224828 -238639 -359788 -66157 28461 -77105 307369 -251782
21383 -39844 -15443 77790 -132969 -389022 -110116 -208627 -105134 34720 141304 -244686
21372 -83932 223179 23050 -104579 245692 -72909 65564 -32062 -241137 54713 401556 -111301
21360 135170 -370971 99626 241722 -2863 -95638 156489 -231319 198616 728 -110818 -210544
21349 -210544 -52915 174631 -91925 -133649 -463453 152442 -554929 138021 -261805 171800
21338 29860 -52701 18428 -70210 145207 43027 69824 60197 256608 -5208 230598 -61831
21326 309674 -234667 43806 -19899 -362449 -178794 -320339 -348982 -45302 -27673 54210 -111635
21314 94803 -190186 260959 -25964 60882 -26294 -67073 -160655 162495 -106145 194418 372775
21303 372775 6528 -49388 49239 -73088 -195626 -276201 93875 -92559 -110490 -288750 127084
21291 -253338 -104783 62329 -44011 -174869 62544 202654 -102442 -225322 -65361 129995
21280 -45423 89936 -179768 82140 -12320 74361 -452767 -148874 -21225 -311634 405683 27103
21268 -149487 -107312 268462 -319973 -176926 -48901 29818 -369377 -304813 -75794 -532918
21258 -532918 -30627 -153520 -395116 -69518 181631 -101065 -77735 -219573 -73187 -19281
21247 51859 -208219 -23478 15165 -194764 255057 -71592 -95798 231045 71908 -81531 -218874
21236 -218874 -443580 -184332 31939 -139139 -26532 73746 198958 -163363 -14109 -32165
21226 -32165 -67136 -203922 94134 142634 -102790 111919 -78743 75891 -313465 348655 -21853
21214 -162523 -134161 75969 -112246 -187628 272968 -80281 -82167 -19420 -94597 -54036 -104851
21203 -104851 -128286 167704 -85820 -191247 -212567 95552 104524 4742 36783 222193 -67028
21191 -129450 -202223 -180833 253198 92634 -225988 10438 64210 488794 -177617 -72021 312609
21179 217478 -323629 246312 -39501 -44625 73148 -203634 99964 139572 -233462 -169897 -116138
21168 -116138 -286978 44952 220352 -64139 29543 -50105 15345 -113904 241100 -236923
21157 -79179 -331304 348758 -273430 -57698 75778 -120399 196128 -289046 -12984 19775
21146 -173850 -248006 -17581 -222209 188886 257131 -163367 187503 -153376 -120724 183442
21135 -140047 -29144 242882 -1722 -266435 -378934 110741 -32227 51001 54272 146941 -393587
21123 -280312 178361 -292091 -143562 -159874 -106880 -41232 -147220 -348488 491264 -137510
21112 -239209 111121 -120882 -54257 93864 -1223 -167950 -181880 -241048 5046 -238855 29739
21100 -22115 -69174 -344876 73986 103321 -145764 -147479 213868 -200887 -140430 134751 -139691
21088 -128488 -23414 -306605 88760 221356 153207 -252109 -36129 -90301 -130640 -109465 44864
21076 -3654 -124219 50793 11141 12147 -107998 -157362 -112035 -148543 90375 -44243 -319064
21065 -319064 -420393 55141 -64462 89744 88344 96846 -322901 -146553 75917 -48636 -159259
21054 -159259 159987 17258 -102846 242784 -229462 97701 -129989 -226854 -238260 -111150
21043 -180467 47180 82077 -310340 167428 279494 31070 -13344 -273713 352874 -184377
21032 -368323 -176573 -103192 65052 -209558 -102676 256436 -26953 -32472 -253273 36428 270689
21021 270689 -225491 -254145 -82049 -332073 -209372 -49690 20266 283213 -126775 113462
21010 -167003 -35119 -29532 -63080 -223095 -162821 -327443 -7006 187725 -304812 60610 -163112
20998 102817 276812 -313625 -342886 -61900 -75902 -135502 1541 28315 -97828 302703 -274011
20986 20959 -169400 241665 -401149 -389338 -51687 108740 -6922 -82973 146109 4314 -121851
20974 160947 -5228 -50441 -80866 -55062 39157 101908 -131424 39606 -330515 93563 -26115
20962 -240590 -89717 79650 171060 -15174 -134891 -151955 -161364 163352 106936 -223663 5152
20950 155650 -64196 90411 -260550 -219285 196201 130738 89713 -70100 -117966 -201622 139405
20938 -502282 -165020 53244 -150998 -132675 -154507 78212 -193081 87359 -136530 54791 -246098
20926 -231619 80339 189416 113922 138702 -127838 -259241 28835 -311008 -53317 -288530
20916 -288530 -246163 159793 174054 -6695 -310487 68101 32358 49080 -80395 192660 321595
20905 321595 59215 -149312 168453 70323 -281924 -358061 -21751 69568 168705 -115594 -80696
20894 -80696 -281438 -43154 -176572 -171550 127354 232989 -174886 -56139 -208166 10362 -151284
20882 -203472 -257692 134957 -181105 215770 60962 290467 -143983 168670 64098 -449630
20871 -337729 -121131 120343 -143177 -39767 -38181 -101778 -94276 -53067 -307922 -25837 -87406
20860 -87406 -79665 786 -205183 -85319 -345348 -133914 236392 -59108 -506218 79930 -169856
20848 -24294 -76651 -154711 -183222 -180112 398480 -51741 -90586 -190847 -339371 -19769 -173688
20837 -173688 -140271 -150220 -238489 -332648 -30649 -161309 -74925 -116926 -63656 -235396 -112390
20825 -58311 87538 -105429 -323832 -286955 -219071 -219154 266754 -49128 -26816 -115272 -226125
20814 -226125 88445 -136756 -26160 -116402 350029 -5037 -70020 -191123 -221019 88316 127722
20803 127722 -117102 5810 -28813 -44117 -336826 100235 -67751 207015 168677 -9963 78365
20791 12294 43917 -128124 -102503 -216123 220535 -173428 -73859 -140632 69728 382383 -51681
20779 95970 -205739 -217124 148018 -24796 -102029 92080 -80416 64088 -288340 89517 -10911
20767 -310773 173943 -103008 -412200 36247 -51564 -95384 -102330 -19512 -274416 11304 -345782
20755 205179 -59358 11972 -5182 -175902 65211 309189 1874 122471 -105873 -133260 168402
20743 -430825 -168101 -114245 104553 291846 -39111 83339 -244164 -82622 36361 -253187
20732 201170 -51582 102772 -87135 127778 342129 -163719 -1974 -315540 86020 -372616
20721 -351282 -514231 39490 -239956 -230712 68581 -19705 -71016 153599 -171363 -199533 77811
20709 -222086 -58878 319629 -42757 -211016 -92592 -142000 23029 2050 -181903 7461 90000
20698 90000 147974 2512 -427986 215904 332946 -194583 -306992 -202603 42776 -8006 -173329
20687 -173329 -332715 191367 -121500 -160319 200423 -19195 31972 -132040 -32079 -280543
20677 -280543 130009 -126107 -23687 -168637 -320659 -95280 -206309 26669 -218484 -152728
20667 -152728 -71162 -295900 -75579 -81531 -6113 -184406 214527 -144081 -5579 85878 -15324
20655 -18530 -300898 -110578 -77280 -202957 -94392 68877 -142797 -279670 -303548 -185528
20645 -185528 96786 -56406 -33029 -173166 -943 43731 93650 85834 -120365 -206739 -149216 -174765
20633 -174765 -136333 36405 19660 202266 51632 -181882 -114406 -16187 233733 -150651 -57414
20621 -80848 -215847 -141966 109133 442362 -152798 -267814 -408580 104442 -224771 -90898
20610 -70348 276309 -170499 -16259 129462 -79964 -431805 -308811 317612 -185613 -85427
20599 -22004 198574 23650 -209113 213850 -161639 -102765 -65882 -141331 241330 288640 64334
20587 -303699 13496 208091 549387 49482 -282771 40454 57485 -79283 11414 552352 282310
20576 282310 72846 31906 -169287 -62901 141201 204211 40739 168080 -130846 72827 100845
20565 100845 -222991 -196233 157027 -43911 -61621 -86068 -153853 -257490 207967 164362 -6522
20553 -136164 -45788 -89671 -29474 49685 -171192 -254584 -442031 208791 -33577 -147102 -55816
20541 -238510 137955 -442441 90781 -215053 100595 -166749 -101483 23045 112346 -178073
20530 -147278 -50289 -160532 -124590 -72342 30804 116406 -256125 -149942 39314 -309062 -94735
20518 -103912 -39046 125743 -7412 -255116 -232863 -71499 158116 261449 -281827 -120848
20507 92685 -263884 -189161 -257209 -85757 18997 239540 240356 -320483 56159 136936 -285265
20495 52965 31723 -258325 -448065 -387189 -229579 311502 75618 -302179 -64980 187165
20484 65127 -190343 174695 -315672 95807 106742 302954 34245 -142384 -277778 -52266
20473 -209033 -301429 99779 -60797 22729 -208421 -23667 208922 -1158 -86247 56075 82362
20462 82362 227587 17179 -277961 -50465 178264 310338 207760 -166417 62768 -259103
20451 237912 -69597 89351 66619 384869 857 -81337 -80559 -58801 -41051 -201569 -68215 -13157
20438 129229 -219083 -21108 -65423 -210412 -139625 -324579 125398 -46376 -233227 -106746
20427 -95815 32968 33492 168462 6900 100820 -68121 -36669 -33382 -61801 135151 124987 -33507
20414 219267 -100418 -70998 -17071 -368052 -155713 -41930 -122729 -33044 87579 226989 -183739
20402 135679 20838 210897 9288 -313001 -68689 129187 -173975 -159192 289797 135066
20391 -148949 -14227 120108 22856 -19313 -116968 -39461 211045 13764 -127585 53700 47093
20380 47093 -30302 -156526 -30423 89940 57007 -130229 198505 153071 -77057 114656 167221
20369 167221 -280165 -77270 -231982 -18876 -62189 -144377 -114032 -204541 35075 -67812 -17211
20357 -146719 -114490 -136640 73900 -189768 -50969 -342852 211683 -129172 -223935 139323
20346 -293520 29258 20780 190360 183164 377071 294379 -312475 161709 6359 -86703 239999
20334 161200 -8021 -548962 -362758 73222 -511646 -9287 -92438 -102096 -103323 -113608 98679 -71030
20321 -155396 124765 -161598 108490 58178 -102637 120606 -19354 -64327 204819 -133265
20310 122113 -74451 -386055 208246 -222 -82682 -31770 -156547 -48990 -149857 153899 -89022
20298 -93312 -39682 -15261 -27698 -45396 -101552 20304 -56548 -51296 -278175 -145371 -153275 54333
20285 155962 -259845 -273661 -224019 -112603 -46682 68240 -52584 -266852 -173372 -79340 -134642
20274 -134642 -489545 -221691 -81845 93990 6115 87955 419602 164725 -373847 -361999 -132545
20262 -145251 19598 153090 -121017 -164806 -71085 -102353 -214791 -24963 157328 143256 -43044
20250 -37388 38324 -106583 -69072 -155272 75314 -352276 -180789 218680 -268144 116257
20239 -205055 -319488 -7161 -196012 -157655 -70723 -228712 -169309 -149905 -175024 180210 62949
20227 -137355 -100418 106639 -69911 -284681 -50684 123022 -146984 -234949 243768 203522
20217 203522 58027 -30138 81498 -41181 7408 113899 86368 263679 98797 27973 -209822
20205 -97227 574078 -302573 82129 -15867 153656 -123507 79669 7860 163534 15690 -65302
20193 100007 51679 77999 -80365 14404 58881 181718 -265900 15339 -30822 95073 -22363
20181 -80502 42756 100000 94712 206370 49603 66183 -52353 -111359 -30988 -89132 -122943 -118182
20169 -118182 169977 -252958 28648 -192073 346865 -433259 -112373 -75490 79873 34844
20158 -245708 168291 -260041 31800 89725 217455 119282 95881 -16697 25760 52016 1183
20146 39588 -225319 125217 115016 -17073 179249 158440 46241 -315572 220346 126557 -441761
20134 124173 -111073 -318392 -16714 -92348 -33054 -27756 16604 -70914 35892 -30368 52236
20122 19802 146809 161518 320222 331745 32203 168232 -183887 100724 66828 -219626
20111 177065 23150 86209 63454 -370657 -132224 -111738 6888 -206428 -122006 -24045 -281789
20100 -281789 -6447 3495 7182 52994 -84963 94446 19777 -12665 -189783 -286282 128574 -243382
20087 -97474 -262746 -212147 -78317 -102154 -74486 52236 98738 194160 -97364 -15119 -76866
20076 -76866 -38912 -13470 -219735 -4535 47092 -81509 -198518 -20722 -17669 -50154 -225707
20065 -225707 -29045 34088 132562 -18106 25049 53222 -172297 -11512 76209 88561 -497902
20053 117526 120443 -12502 363665 -293498 -419704 -30799 -217092 -121603 -14726 -66936 93477
20041 -436105 -188850 -42643 -125040 -66796 -190450 -99541 -37738 103635 -226102 -128325 -143207
20030 -143207 84750 -99568 -446334 -83246 -417685 -219565 -63941 75325 4685 -177359 462166
20018 68648 -7518 176719 19039 12168 -108751 311413 16421 2598 -149083 -254713 -4430
20006 54735 19416 331106 76614 299184 150173 152233 -55391 67987 -107540 -218571 133291
19994 -200780 59519 73317 102402 -172121 -3789 143914 238347 -201227 -31919 -45532 -97670
19983 -97670 110077 -236681 -180035 114414 -234788 12605 -63580 -216661 167704 -60653
19972 -22411 -181773 74279 241707 -132940 -20172 -63151 -160839 -240963 -27366 -112951 -360227
19961 -360227 -56999 -270265 72779 287114 174105 -186994 -124776 -143155 50829 -290084
19950 57641 -440274 -401928 -260693 -419368 -8352 -150660 203989 151142 52413 -65714 27579
19938 -231712 -139758 -402348 54122 -77360 -13602 -180472 -202714 -165061 -71519 -37346 -351557
19927 -351557 -295070 38009 -170027 58426 -236113 15219 -59873 -117152 -170352 69261 -23743
19915 155266 -104599 -53964 -4933 139105 -77464 6284 -81328 -216244 52227 107755 -35402
19903 -204210 -211240 325920 -113219 59715 94598 -266760 -315321 -51024 -194796 -396188 -27155
19891 -474186 -113103 49306 -129759 10407 247187 -199113 174261 -124040 185170 -160225
19880 -59530 -243734 -237754 -84678 25551 505694 159181 94487 -343254 -131543 149890 -32765
19868 -193362 71917 -363944 50186 -216979 10764 205404 -181365 -46887 198740 35701
19857 -93113 -5542 25715 -225945 -211067 -67035 108032 -58742 -8358 112700 59422 19216
19845 -131979 -141173 -63916 28820 -54453 -8626 -10835 -185234 -32559 94896 -55797 -300154 -35931
19832 -550963 73547 70303 50493 -376883 200208 -407163 -116866 198546 131331 201855 -38665
19820 178233 -217328 -396483 135453 -93293 127968 142003 -16529 292673 -110257 -35057
19809 -385717 285883 283686 183733 -63596 81743 117431 168018 172356 -221150 -115948 -260872
19798 -260872 142630 -48163 -335102 38353 74502 -200829 270284 11345 26380 -60343 -31710
19787 -31710 -133475 -254440 405505 -113246 183283 -242921 199811 29467 120401 -100776
19776 -161077 87849 165623 -156807 -433026 -51050 -84587 -6691 -120558 138519 -204571 139751
19764 50283 -29219 -226073 -368223 -211783 244447 -277938 -302778 195369 168672 -174020
19753 170399 92071 72478 -270867 -111171 21487 13408 -41039 44842 189388 -7818 116078
19741 -22013 -38570 -288013 139570 -178008 -19146 370969 200762 -144309 -400707 -234349
19731 -234349 42548 -73799 -209585 -30151 76102 403814 -175298 104356 84540 -15632 -169517
19720 -169517 27298 -200635 -145507 -28518 -284245 -45077 -160062 -75893 225901 24214 -264084
19708 114554 -37333 -144292 -46074 143435 -251920 -146876 -61061 91167 -185996 142124
19697 -498781 30827 128799 -95043 -210465 -292336 -163224 -160055 -32071 112663 205697 -126024
19685 -136712 -47927 33943 -24015 128748 -369998 -52476 -151780 -255587 -98363 161238 -196288
19673 -152154 -128513 -123828 -19337 -27823 -154824 -203281 -350883 -455956 118499 194014 -486242
19661 -201118 -298033 -3670 -244670 -53532 -396168 42193 171835 -326999 23895 -152068 -59477
19649 -42581 18097 -27723 182159 -23127 142395 145431 -180928 -20808 327962 -212163 -6699
19637 12968 -189599 98808 -72387 48553 -12560 -48066 -53340 -194946 42307 -188791 49077
19625 -334771 -65816 -14641 60369 -53691 -293532 12831 220616 -206843 80703 127799 -238596
19613 39357 -46389 -246296 134055 413741 -323671 -386249 -145740 165811 -148408 125594
19602 -304935 -265106 -135476 -146077 -315830 80864 115351 51162 122535 -62538 21534 -208800
19590 -258105 -216646 -10057 -256492 -348322 164114 73254 143917 209507 98156 -72327 8296
19578 -219097 -182081 -138801 -202953 93715 182134 -278915 120280 -284769 -69287 240295 -123010
19566 -25673 -76749 2517 111572 -235285 218487 -166503 -137924 -242896 -318242 305875 53827
19554 -107123 84042 -51154 11602 -79613 34735 76651 -96296 -258884 89686 233314 339966
19543 339966 107106 -110670 -141873 42522 -323767 247401 64405 -325777 -71340 106513
19532 95990 -178053 -146535 40795 -40782 -109501 -33367 -3950 -144516 -170031 44408 116018
19521 116018 80961 890 -72232 -86593 -25524 79064 -194747 -143120 -373780 -285333 -70381
19509 74687 156966 99213 981 -15843 -209224 -174104 -237657 -68471 132130 -94028 -174276 130593
19496 45949 205838 -184572 -59275 -413501 -288618 7740 -63955 -171752 -73210 246095 -86674
19484 -167210 29857 21195 -160820 -146150 427179 -201802 -191151 -15941 27063 -164103 -4781
19472 -189277 148152 167160 67353 241225 67808 111711 86458 -198292 38723 80601 136473
19461 136473 -126469 171644 10291 332757 -45105 -149462 -8648 -353837 -82711 -92000 158659
19449 -235601 -120318 -576798 100379 -91571 4637 -60897 -67837 -290193 86503 -283205 42689
19437 -116833 -53846 -55408 -228107 295436 144388 36623 -494391 -110936 -263991 -123852
19426 111707 161986 -59970 -217725 -336718 19607 5744 -203333 -57340 -60987 -223488 -178524
19415 -178524 -103133 45928 169524 8100 72909 -111113 166638 206082 -370231 125869 8582
19403 -264856 -127488 -238608 -110831 -7271 -35568 -92143 52138 183520 -203102 136738
19392 -47856 85687 210365 148128 -276007 -142249 -270138 -112272 -27225 224230 -357558
19381 39414 58737 -209652 191794 -132775 -352206 345757 -130030 151646 89076 -29659
19370 353900 -46726 -243899 58308 137771 251232 -41091 -172097 -153132 -339768 -165648
19359 71860 339297 146600 255880 138611 162800 261286 99968 -234180 159349 -321007
19348 35866 -417205 -184449 12852 -221637 -343226 -222056 -169244 -247664 30836 -279312
19337 40956 -186405 -68537 -614299 30420 -79002 133893 38902 24895 -35581 -63220 20041
19325 -287610 38967 56369 -160205 -122379 -141379 -132358 137880 -173300 94654 -224597 -193191
19314 -193191 -228076 -125012 -233459 -134652 -117340 -54809 213701 84475 -160299 -17149 9413
19302 -194689 11240 181009 -226022 70898 -51432 -64250 221914 -173037 -157980 130883
19291 -101168 -311791 144039 244138 -92604 -141352 -96555 84622 77344 -197643 -223218 143992
19279 -165982 225959 -117972 94653 -61815 -27562 -209374 36820 25258 58288 -31767 185650
19267 -219859 87605 -365236 162493 71338 394626 76415 -182405 -163021 245840 655 -149205
19255 129667 173450 -305656 -82356 -205978 -309026 110922 -297809 -38485 -181282 -146651
19245 -146651 -62674 236911 -93931 -16334 -209239 -287063 -76626 -311748 -115163 36762 -87989
19233 -63094 151792 -299084 -276771 206096 248642 204537 -304630 -46895 -164312 -131128 35281
19221 47347 35689 58446 91333 -41944 51277 -345804 -212703 -202200 -36511 -157663 -43578
19209 47439 -64820 -137936 139108 112163 -156622 -116875 -69876 205822 -215305 156157 -47610
19197 -198290 -54034 -1185 -219111 376170 -185970 -520769 -259202 296617 -12580 -63174
19187 -63174 -57875 69566 263776 -140186 -141424 -14381 65974 -265941 238 23610 -28291 250282
19174 -318221 -369597 -216347 -288504 114293 -332820 -58676 97948 -182440 -232120 73009 -31152
19162 -98927 -304803 80113 -246309 -382565 -333648 -31072 -294234 48592 -150935 98890 -92124
19150 47201 -202622 -195189 31499 61557 -276454 -131526 -242281 -79462 24675 38343 228994
19139 228994 33094 -268403 28114 -98980 54075 -55449 -183154 -172334 -199864 -4453 8510
19127 -16195 -40969 -257889 -17029 77392 20708 -193858 -126164 -204907 148060 98831 35244
19115 -13445 -333859 174934 118909 -250971 116320 288625 -69518 -88315 112905 22334
19104 287870 37839 97090 -274090 -171537 -154769 80405 -6422 -40584 -140209 -128460 125222
19092 100732 -133910 280987 -202450 -1828 96778 222553 -149636 -391568 -101640 -265437
19082 -265437 95026 -140890 -229489 85870 30945 37632 -457763 -358497 -248709 -207950 153365
19070 -42623 -10329 -254511 -28044 -1617 -327984 -146933 47416 38926 78556 58831 63312 108260
19058 108260 58069 -185203 183272 -200063 -95608 19719 60859 -130886 -215076 104225
19047 -111533 159143 285736 65756 -214875 -189029 -497802 -48093 -41799 -106872 -228861 94230
19035 -107491 -112483 56972 -28637 -86915 147199 -82519 -36284 77783 52601 46769 -108089
19023 -92308 43479 -80876 71492 58294 225409 114238 75807 82826 -230755 65666 -109206
19011 -211074 295157 -211478 -40129 -127694 182745 -163640 203362 171473 -196490 162394
19000 185707 -20420 -69594 196326 -42546 -148344 206139 -136237 -147731 -91820 101373
18989 358458 -207540 31170 196634 223135 -164449 -282091 -50960 190879 53482 -1396 -41878
18978 -41878 -21230 121840 140876 -60765 146869 -400530 -288267 -186769 -128929 -135556 164429
18966 278949 39206 396323 -114311 -112444 67281 -198387 12883 -370132 282279 -126049
18955 -203700 -147003 35716 -59081 -1525 -270782 -95997 -388896 -58630 -48560 -319021 -180027
18944 -180027 34661 31142 -200339 -257486 138266 -112920 -15520 76169 30619 59208 -240148
18932 -296810 114324 -24375 129021 67019 93200 -149700 -243128 -40939 -235725 -2125 -120204
18921 -120204 60923 -244428 93383 -194527 82752 26259 -32394 170557 148070 208728 -40702
18909 -299108 82522 -220563 230999 -208236 -252974 271049 -157234 120972 -405169 -101887
18898 -1612 -301635 -117418 -2171 -148390 117311 -277678 -18248 24857 79309 11746 52457
18887 52457 -235676 62981 -230806 -257751 45367 -155927 -191935 -142428 -48388 89196 -110248
18875 -12415 5455 218542 -129280 -72357 -22411 318973 195653 -322137 140596 -12146 39668
18863 217444 -179476 -235025 -3817 181597 -5167 157932 112516 261274 -167082 11498 -205907
18851 -87568 47138 155739 -105108 67234 -384476 -88706 139210 -156469 -93278 -242035
18841 -242035 -157303 208495 -348543 154724 -137455 189068 50051 -170568 87209 310940
18831 310940 -288999 -227054 -118858 -64921 -52478 508609 -9099 80335 -126498 -260950 -161322
18820 -161322 210645 -163414 123519 -58654 -113734 4726 90847 -339936 -167919 69567 -20701
18808 130139 251445 -225111 -403650 -177442 -83335 89625 -15193 -72360 -426648 41296
18797 208660 16151 -113110 -50932 4996 -227239 -2909 22734 -339975 -76098 290299 157468
18786 157468 110565 369899 32791 -165718 -268241 -151210 -317128 -89206 62224 -23773
18775 47267 -134485 2616 -7389 -136318 46459 -49753 298475 -65746 139291 -141774 -80746
18764 -80746 -164793 -45186 -90046 -108913 204664 -279895 42172 -185129 -180161 275355 349401
18753 349401 -160749 126868 -113262 -216069 -12061 58699 -113788 271660 -107038 -16216
18742 -53928 -188501 -272778 -68539 -316555 103252 -421422 196231 107694 -82787 -302133
18732 -302133 -175297 243319 -204346 -239924 177614 -89773 -329251 -322906 -233628 64833 -153064
18720 275894 -12182 -264218 95683 146066 -35936 46627 -90234 331534 -100277 -57657 165263
18708 248949 -296501 -114299 84247 -413601 345308 -177022 184839 -110066 35715 -49694
18697 -249654 -283903 -126284 -114295 -193661 -41995 317056 -143331 -98247 -558236 120876
18686 -125582 238534 -199594 -402219 -327425 96264 -72530 115853 -82882 32481 20061 -84702
18674 -152258 227093 46900 -166725 85544 225236 23109 -200007 -49116 -107576 412721
18663 -51314 -384711 183905 324442 -554646 -148931 -25362 212595 139664 48844 -76665
18652 254578 96450 -15501 -263344 23459 197128 -289943 7675 -66353 -71690 -334699 -486193
18641 -486193 94635 -201877 -328717 -143576 -6290 -161964 -162799 -10619 -197677 -86743 96603
18629 463375 -64167 27942 -305452 -64762 -529491 17513 -364130 14943 -46210 -289450 -500595
18618 -500595 142167 -95698 -101212 -115634 -130386 -33157 -92433 225807 -79273 -127011 -72857
18607 -72857 -52538 234448 -190943 176334 -239282 -213388 -90037 -99433 -351823 -6585 -181265
18596 -181265 -290096 44735 -115095 -35994 -23911 -200248 -106218 73946 -120862 90680 179136
18585 179136 227109 93039 53827 82365 -256500 -58991 -17808 -152664 -232818 -163801 73469
18573 -27749 -211100 -345370 -7409 49652 -45608 54955 -221383 -351445 -274916 -61510 -187709
18562 -187709 41078 -102798 -19058 116374 -90785 79758 134331 -113015 -164982 -453265 259370
18550 -39826 -22714 -105175 61084 -31920 -54648 162259 70429 -290090 43744 31556 78629
18539 78629 -159034 -107302 -35395 37225 192761 -27247 -135044 -156768 44082 -206745 -457690
18528 -457690 -157980 -483714 -27670 151309 22696 -134544 -323538 -1892 95679 -150586
18517 207006 -48523 94998 155211 -123354 117526 -110073 376900 109068 28966 -13973
18506 17608 -167104 51896 -182448 -118133 18076 -125174 -78799 356240 -4154 53896 109029
18495 109029 -378475 -110614 371063 -323572 -109217 -255712 2378 -301143 191704 74876
18484 -117760 39374 -6373 -166748 217284 -239196 -213489 104797 50474 215016 -152944
18473 -61126 193801 19498 -124019 -166639 166214 6782 -140962 -100610 -97830 390582 -100367
18461 18200 3030 -171181 175241 -201745 -137305 -64883 154830 59655 -91995 10710 -168253
18449 -176796 196366 212996 -488510 78196 178151 17629 -29628 -112529 -42400 -324850 -236856
18438 -236856 -330151 248951 39823 -12703 -322889 -340078 -159390 -59586 94832 -277870 -20793
18426 -6717 -331796 103151 -81518 -129488 -196831 55785 -120524 -388110 333174 8555 -161459
18414 196329 -198735 -162508 -202893 -200703 57531 272453 -16105 2949 -241445 -144828 -309540
18403 -309540 255699 22860 157406 429426 -145509 -110220 -6986 54387 234064 129256
18393 129256 -134363 98708 -198307 118275 -173551 -145913 -30282 -112533 169658 -51239
18382 38533 -359018 -258849 -119318 -107292 31951 -302505 -207299 -112909 147306 375793
18372 375793 126689 181577 104082 -44074 -128537 -166870 -2084 191063 332814 -124257 213113
18360 -322300 -379709 104418 139149 159512 -143987 -89891 69394 -19606 -60177 -339761 -187056
18349 -187056 -241870 67165 126003 -464171 39953 -73430 345233 -172985 -92051 -185793 41947
18337 204941 -69357 -190929 97647 -90840 -12021 -61895 -495510 25346 -179181 13045 -202474
18325 -125461 -34734 179324 64180 -168114 85331 -344018 -136147 -101522 -454487 -98995
18314 172232 -145208 -67531 -37070 -21113 -12431 -175016 162005 205953 -125820 -121142 -130934
18303 -130934 203647 356403 -206987 -438554 122711 -119691 -453971 -21672 237940 81077
18292 34615 -425618 -216058 218341 141767 79662 -102773 107510 16655 -132527 -9961 -184189
18281 -184189 125287 57912 -95531 49919 179717 88629 -277606 -39516 19467 7153 -193691
18269 -21268 -268428 -54758 263679 10911 3659 -50939 -247918 81793 -338356 -277652 -206096
18258 -206096 -165556 39988 301511 -286330 -6524 -77927 -411229 37470 58923 238189 194811
18247 194811 -232717 -74816 -116292 -31788 74432 -174063 268116 -101495 70265 -17960 110603
18235 -268273 -100111 146703 -313627 -200112 -149014 247489 -283696 84004 -347047 -110281
18224 66869 266620 -201526 183324 -189611 -125976 74271 -348973 -106828 -83751 155811
18213 76997 -34746 -223706 -60766 194609 -25653 72385 -154315 -129722 -144325 -209102 177552
18201 -335940 -112818 -109995 -307093 32625 129650 -132835 -128220 85381 250451 -270570 -43805
18189 -18527 205406 -183970 31844 -75837 -370444 -24011 138146 -90446 -194542 -143880 -326973
18178 -326973 -263641 -25074 -257489 -26982 -330257 48414 74073 8985 258703 54940 -66009
18166 84394 24958 -62263 -115546 237437 68569 -27767 -55305 291460 -92306 -192638 -201956
18155 -201956 -92123 -209757 -253387 -66058 -390456 -125329 -356680 144863 -103323 -64200
18145 -64200 33986 -37722 -47252 69111 159503 117672 -130021 113580 -178218 -153556 -110901
18134 -110901 -152651 95569 -19628 -164267 -42508 209667 -14883 -354895 -197455 -221275 200406
18122 34418 -114154 -257039 -108202 -151385 60871 211238 222340 -39802 -46922 -195846 -178605
18111 -178605 -71643 -45810 27206 -163244 10274 -390380 -225078 125414 2782 80177 267484
18100 267484 495630 -43746 -46064 -10433 -227795 -6439 -17707 124596 366221 36827 -12328
18088 142603 -157493 130686 -75934 -44175 171425 373563 203626 180879 85858 -243933
18077 -51934 -240793 111638 -327648 -252871 -38057 -274784 -188500 -72543 152672 2514 -229922
18065 -102160 40196 -57119 -171495 119950 -317412 -59251 94072 225503 -297873 169825
18054 71696 24157 -156465 -220237 -11639 -111705 55858 106702 289558 -109123 -365483 -227433
18043 -227433 223181 -94513 61681 76044 -134292 -150989 -20846 -190482 -16960 -45270 146594
18031 -218575 194368 -117849 -20027 -199451 177725 -297571 -132654 -74761 -1415 -296216
18021 -296216 87272 312804 -119160 -243352 -96540 -123704 -410459 -172386 265316 -268295
18010 168663 -53213 -157744 244609 -48206 275434 -143949 7224 -131210 -74188 -117597 -114815
17999 -114815 -119672 -45400 -15750 -886 -35990 -195279 -142985 59380 1714 209298 82244 168386
17987 168386 88563 -694 160771 -89236 -319508 242827 -224583 40918 -170410 42707 -15309
17975 44174 195360 -41391 36043 -11848 -196728 93896 297846 -133442 10642 -240805 -75103
17963 -93174 105662 168588 -54706 133360 41887 310346 -87731 30103 -75108 13062 154596
17952 154596 -68389 117621 247454 -347199 -73240 291184 1196 -24114 36590 -3572 -398192
17941 -398192 64813 246710 -153964 -167276 203228 -463423 86243 -198696 11767 -416616
17930 -182632 87893 110215 -303057 121468 171860 -145678 120233 -24852 -205571 144774
17919 -89307 97345 175287 -63862 -283579 -544643 -211312 -116794 -2307 101214 -200535 345758
17907 164968 235725 -255794 -610780 -146017 -100234 -108148 239298 149544 418188 106212
17896 -19160 148145 -98569 8380 160082 24567 -149355 167298 -23950 189258 -49380 -110579
17885 -110579 86866 -254841 9992 124769 -360069 -266005 38197 -439732 -35170 89718 84043
17874 84043 75653 1921 -103338 -11808 117527 15106 -152779 -84853 -13104 -112908 -207776
17863 -207776 -3100 -123177 41541 -198304 432987 -98004 -371247 -67627 208380 -85825 111864
17851 291747 259466 -82947 -192915 55787 -114196 -167906 10167 -26004 17152 -276133 -91139
17839 -54132 -90796 256166 479886 -210862 295065 281334 -92104 -86301 67657 -18959 -75271
17828 -75271 99122 97657 -156201 102224 -168298 62356 34660 -34008 35401 -110860 -38573
17816 -210399 -302771 251860 49241 -302886 -86462 206504 45388 -221799 -411514 -72672
17805 233132 -151548 -152887 108216 46640 4372 29345 -132924 143268 -93 140828 -221042
17793 -89205 -151245 92489 185992 -134623 -394847 -225429 474104 -123731 -231487 11691
17782 -51509 173304 -23062 -18637 -169868 76248 -240093 -187665 -253503 281997 229607 53073
17770 183385 -117835 -174822 36202 295008 79882 258796 -418729 153325 14456 10958 64809
17759 64809 27976 71630 -356095 -185902 90981 -261607 -270357 -489442 192908 -111741 23352
17747 23451 -196358 39915 -214344 144188 136385 267098 -191065 84014 -30911 -105699 -352401
17736 -352401 -490198 -142874 205357 -158013 -17690 -172571 -128088 65614 113969 -298787
17725 100460 20502 -106368 62191 -112209 -129074 -105094 118442 60409 160223 -224136 45227
17713 -257834 -47815 36222 113430 -32875 -132047 244894 -111331 86907 114093 -275429 -127661
17701 -54152 -2267 -218634 431800 -21391 64346 228482 349034 58887 -275826 -44054 3650
17689 196255 123214 17840 -359969 -122209 -44540 -91575 343814 -32484 -28163 205057 65619
17677 214237 -48958 106718 -345497 74016 -355490 -144072 86554 2168 77145 78681 -11959
17665 -217986 48280 -293387 113708 387782 65173 -123651 -64076 114675 63544 -290864
17654 97227 37946 351794 293797 -155006 -91254 -126084 -196237 -205855 -200158 296551 25339
17642 -128308 99680 133162 33231 86741 329477 -153779 20588 -118120 178080 131619 9878
17630 -101834 -251088 170967 85215 -82976 -32209 147474 -175394 84775 190030 236704
17620 236704 115916 -129583 3572 51636 109974 53119 99824 -360206 242799 100937 -168389
17608 238857 222727 -9678 501241 63888 545459 -93694 -427722 263620 -344909 -117718
17597 -26973 283104 188769 -100233 220947 241339 46974 240088 -69834 -17255 45437 937
17585 -177064 -146168 -36837 79542 -63172 65583 21362 -170834 -146324 -320218 -214394 -205657
17574 -205657 -44651 -126933 -129923 -48191 71318 -378167 -9548 126946 -112171 311753 221703
17563 221703 14749 161278 156918 -61461 -223170 -232728 -40657 222111 63522 -344407 165996
17551 30170 -123722 42839 206695 -195880 32656 -88484 191357 -322281 -10075 -77575 201356
17539 297907 -23114 -73160 -6784 79193 -300811 -304087 -1649 187420 66504 37160 -183918
17527 165129 376579 426321 20738 338762 47039 -36076 378983 110820 1022 45721 54187
17516 54187 210787 530004 172777 157894 -215332 144373 -14125 193942 318049 344786
17506 344786 -191082 82948 240057 63004 169558 149279 114800 41745 -312416 -31282 -211795
17495 -211795 -136346 -200457 -31968 64259 -3749 253778 171698 -363148 149945 -272417 97946
17483 125530 156709 218959 93065 48258 43156 135607 595485 -100278 -183747 -195880 -122764
17472 -122764 -30751 -137533 459412 -168558 283856 376921 -7508 -86915 140033 -154763
17461 6343 -193845 -121153 389524 -43684 -127234 334026 391457 319932 -16597 50053 612760
17450 612760 330990 416226 -59226 231075 472460 289967 138041 261951 196043 -64471
17439 332522 65406 -157621 180871 293719 254537 146632 402076 -96212 5430 10820 140098
17428 140098 199336 -105043 321721 1579 71585 394275 152702 271068 126806 64731
17418 64731 239190 408093 589122 159408 171880 451144 408460 212497 -105841 31223
17407 158450 -51324 22901 89020 -31641 133320 275381 -152113 147310 123691 -19799 176672
17395 258395 450721 462130 -47289 125586 -7397 440474 378353 157002 -52848 64814 254009
17384 254009 -117428 114512 -64076 101596 255939 117584 -54900 111185 221047 124166
17374 124166 112026 5420 278598 86050 153292 30711 202838 26259 77221 265050 -9860
17362 -55327 45586 -100752 201799 181319 263613 -48371 -81451 54035 492308 -95393 326904
17350 -4279 63757 -13897 -37412 342898 111628 259672 -56528 -177235 325271 141209 304352
17339 304352 234293 52860 -311327 114099 236264 29560 237472 136433 178646 64376
17328 210657 94898 118042 113399 93242 146294 370467 164847 93631 -118924 118320 426180
17317 426180 11186 -123595 459713 220126 434491 411132 249336 -234288 -46554 -27284
17307 -27284 297571 113148 133589 184463 234492 306596 103571 480387 91952 -104641 8950
17295 -42464 -15283 -162587 166363 -183387 54768 347322 -175597 118948 -23126 -112298
17285 -112298 220564 260089 395864 509235 291197 171435 -177723 432721 119181 -49285
17274 9750 133702 612742 214746 -6360 257576 -77326 19324 350479 -63609 367089 -17306
17262 -68512 124924 17253 113841 -220 398741 372997 73853 -180395 406072 245939 212287
17251 212287 103371 147466 168660 -88189 355475 459286 115246 47926 417194 -328319
17240 -156372 6086 153059 24604 261925 -189576 199148 237512 217607 -167243 -55180 74864
17228 248873 13569 104767 72665 271954 510515 342446 3504 -58759 64689 512560 37581
17216 234992 -141874 293067 149810 177820 211522 221934 85238 304130 61580 -298260
17205 168686 -54629 162309 309125 26804 357960 500463 78762 265865 209919 53474
17194 -255664 188021 -138294 72906 324640 180296 173262 107222 521437 149252 38677
17183 242319 114973 -60583 285274 -220100 -30581 256503 213184 101023 109078 -127503
17172 195534 -1064 -692 317419 191832 104108 225704 193617 -61408 -29829 253079 224822
17161 224822 704040 141020 380706 232493 270605 355516 261015 511386 -63322 248768
17150 626908 331632 330658 458644 323328 426325 350567 312760 433687 -36636 751706 217751
17138 319918 304101 163944 448157 268462 357034 152523 115074 711100 432058 310187
17128 310187 295815 215110 307950 281664 567520 398061 155671 256347 450159 413569
17118 413569 485507 225784 212197 635724 476789 490445 289537 331039 187910 326461
17108 326461 504337 79866 508771 130155 663220 197223 275873 367993 231622 497831
17098 497831 7440 407527 387253 147070 136101 430467 272078 762073 198513 490015
17088 490015 459680 326348 256690 452351 682491 442682 262652 286570 581954 528865
17078 528865 339296 340992 466807 535019 191947 250419 94570 276335 612170 408978
17068 408978 462357 525349 679453 151243 160252 483487 246633 529722 74252 564421
17058 564421 87175 410362 263019 443372 396254 362470 311764 645696 536448 793388
17048 793388 222682 269412 750155 615250 290390 123817 526767 459240 485674 532995
17038 532995 697846 316643 612925 793477 106971 444680 371759 344556 534513 897191
17028 897191 596738 449786 564934 383118 555949 536840 575237 579973 854386 443254
17018 443254 177015 423773 514968 615482 694080 373455 577915 544115 660659 527355
17008 527355 591259 494691 242939 661654 1028595 727887 682482 549138 960378 669961
16998 669961 790730 708408 640563 644396 602791 576540 11216 960450 759318 784796 801876
16987 801876 264240 912918 798659 997784 746838 575205 691708 1024873 819022 1025862
16977 1025862 717613 783574 1198249 496966 846183 644464 735356 594142 1098771 896476
16967 896476 1166819 816089 643340 1190986 625536 763241 619571 635779 800429 1230388
16957 1230388 981837 1103352 634740 781439 974507 963318 856628 1267817 1037571 924162
16947 924162 637996 944299 885115 1148305 860779 942372 1167036 987326 1292700 1319842
16937 1319842 1232895 1071992 1214205 1244948 1668869 1383597 1470967 1209408 1457024 904917
16927 904917 1162112 1183245 1514467 1200128 1409260 1445003 1260519 1246476 1542816 1453682
16917 1453682 1517118 1513407 1515645 1611573 1438493 1547313 1315943 1615648 1782546 1395497
16907 1395497 1453184 1281263 1411197 1815203 1611468 1431362 1589234 1761605 1621627 1447019
16897 1447019 1711473 1745250 1617407 1183342 1723001 1807197 2055473 1813287 1974844 2046397
16887 2046397 2332428 2333760 1889314 2326899 1976888 1889031 1972555 2264493 1985114 2131363
16877 2131363 2081355 2483899 2283638 2007331 2551347 2206497 2172240 2217155 2224919 2347380
16867 2347380 2551393 2511204 2678543 2772567 2398391 2753405 2883435 2488268 2527624 2790432
16857 2790432 2805591 2778152 3035674 3077679 3365036 3371053 3081227 3227676 3125519 3171986
16847 3171986 3483076 3069627 3317470 3449643 3408416 3092331 3520279 3852172 3875451 3597076
16837 3597076 3645581 3809123 4114542 4425019 3797685 4364666 4058558 4210089 4434985 4380158
16827 4380158 4511777 4776695 4742056 4945718 4775182 4836507 5008671 5130397 5038611 5430416
16817 5430416 5230527 5503153 5447365 5851951 5846601 5743686 6097192 5979885 6262941 6387790
16807 6387790 6738524 7132422 6933795 6866498 7205295 7315033 7707376 7535457 7936863 8154041
16797 8154041 8545616 8711494 8841624 8710318 9309119 9326752 9824352 9972054 10391738 10354657
16787 10354657 10915022 11446935 11536130 11516180 11640982 12018377 12782374 13193555 13584879 13993926
16777 13993926 14417361 14711930 15472870 15467556 16315415 16683418 17308183 17658608 18478328 19101159
16767 19101159 20106485 20496854 21217540 22247931 22904750 23560973 24965556 25713319 26925143
16758 26925143 27806704 29200947 30452947 31579490 33047723 34618069 36055109 37696183
16750 37696183 39543851 41529294 43807542 45758917 47980574 50639587 53432479 56245480
16742 56245480 59758851 62610827 65786380 69259477 73295335 77643793 81848038 86495125
16734 86495125 91664664 96899017 102466358 108188397 113918254 120630429 126289079 133247901
16726 133247901 139663310 145763892 151387125 157452502 162619354 167429422 171294445 174329676
16718 174329676 176023751 176912615 177209176 175605344 173846213 170463731 166683331 161742051
16710 161742051 156583554 150778481 144748711 138226436 132160865 125749478 119321033 112967713
16702 112967713 107253411 101281757 95765896 90109791 85445043 80819256 76509598 72427631
16694 72427631 68206342 64534188 61421356 57719547 54914193 52020703 49325111 47245451
16686 47245451 44703977 42555046 40716666 38823370 36844962 35274212 33409490 32421342
16678 32421342 31046292 29293728 28203715 27141851 25962957 24766194 24107407 23276458
16670 23276458 22471744 21501169 20850363 20026413 19206225 18569252 18201033 17379171 16655897
16661 16655897 16225345 15726822 15292672 14598455 13872251 13620895 13243246 12708402 12546776
16652 12546776 12312965 12044582 11318849 11158836 11201007 10554020 10355397 10109125 9696468
16643 9696468 9383915 9165209 9232662 8822075 8545440 8638743 8256835 8037985 7914048 7549183
16633 7549183 7459819 7163868 7232022 7092789 6810580 6463597 6506543 6331068 6113858 5795016
16623 5795016 6177456 6122235 5623192 5563109 5496962 5456309 5263138 5256572 4744060 4793383 4934433
16612 4934433 4293083 4353635 4322555 4517886 4391672 4107336 4382005 4028099 3870488 4066708
16602 4066708 4050748 4047889 3735556 3604163 3658996 3738728 3580523 3296316 3666646 3485128
16592 3485128 3451697 2866867 3186943 2718129 3117095 2988799 2769070 2924701 3032964 3163728
16582 3163728 2815206 3079578 3338417 2793936 2928789 2809800 2421423 2422459 2901946 2520385
16572 2520385 2484495 2471835 2006447 2444978 2425755 2519907 2173974 2482690 2188395 2262113
16562 2262113 2181890 2001786 2095919 2145922 2150511 2099242 2295745 2116630 1821699 1899111 1576811
16551 1576811 1967140 1672174 1622558 1801725 1627857 1937678 1681185 1859917 1768346 1610544
16541 1610544 1604542 1797969 1272712 1547366 1814583 1648924 1441991 1646714 1516514 1357218
16531 1357218 1561343 1660988 1736131 1438495 1194899 1390931 1074714 1407779 944609 1155933
16521 1155933 1154747 1440746 1190148 1232093 1173855 999064 1099925 1053221 1235137 674203
16511 674203 1151027 979817 1385720 1027568 1323026 1386532 960465 1111425 1091425 908118
16501 908118 623343 1164677 1109003 940045 1204147 986702 1195159 957190 761704 830311
16491 830311 1166112 1048848 648620 543934 883454 961466 929321 949166 944302 883372 1090646
16480 1090646 852979 634569 834246 731322 1052783 851493 1021310 981815 803576 854239
16470 854239 1038898 908002 548830 830085 957061 1057967 721705 1006090 684661 588275
16460 588275 636457 808360 779052 651248 587858 767835 450513 841159 1110896 621229
16450 621229 563390 566628 531749 485834 575217 590496 513122 487284 340863 884171 872762
16439 872762 261154 624302 730675 460346 490809 763340 651532 640838 565725 557543
16429 557543 424081 509541 736717 597975 594569 334890 587612 234502 384645 397153
16419 397153 542093 675784 550919 553933 471726 451581 383354 547205 552037 570811 601300
16408 601300 687429 360138 779047 397194 426411 535193 567711 317028 487883 969907
16398 969907 521509 353484 594619 482246 576003 341114 576935 779656 153702 370317
16388 370317 487835 418474 322716 447777 456589 427786 302252 529013 327913 218589
16378 218589 -56614 16335 621158 544045 409539 269968 424426 143822 307583 181700
16368 181700 557223 496703 148076 567702 528727 360078 127630 191567 224891 191207
16358 191207 62872 251416 331393 480819 71514 168909 313486 423270 536728 604982
16348 604982 420659 267308 447909 223306 287244 183939 583634 124254 120639 85963
16338 85963 539231 45256 184900 217776 181217 16314 540757 66589 421127 182425 89179
16326 426258 333806 313675 422058 74932 326156 402282 451957 135684 251992 427417
16316 427417 602780 -27198 170231 256670 -180039 252245 342333 315050 391632 322576 281622
16305 281622 18310 399896 -14890 -343535 207810 154244 157166 70711 337906 467111 383528
16294 383528 396495 367009 459089 129104 327904 -4205 76955 342078 287981 352375 178373
16283 178373 92593 172001 261457 148593 151500 116925 139620 140451 328798 468469 522998
16272 522998 12741 305647 449945 67626 171789 -46185 148596 124075 277995 -40309
16261 -52091 107281 315806 175134 220110 219442 377826 150966 408002 200800 148745 44690
16249 106648 175552 322684 348752 -91553 147250 210091 -85610 442685 239954 336322 231509
16238 231509 308830 -23736 118915 -85860 508716 54788 251563 298344 -187266 406799
16227 -52268 -102595 185191 121061 40580 -73929 -219360 -101563 296206 83761 41840 -47771
16215 68971 334927 -39266 345878 96260 199698 496540 173220 99248 266935 -36628
16204 301533 44824 303855 87639 -14816 127458 162231 -168470 -201166 -146828 -134742 285035
16192 -80821 1071 122783 -231660 139845 29219 58309 125772 -56491 247005 97363 210263
16181 210263 279590 340589 -172688 40378 71833 -26894 -128136 -79025 -104800 149289 301193
16170 301193 -318975 160653 30450 116440 124888 37246 213660 208269 101964 8150 385082
16159 385082 -77670 339589 -48562 115630 167983 25405 -22097 -201821 77654 45786 -95654
16147 -187337 394345 296333 -316219 99977 -118281 211707 -315114 -32332 229098 -6515
16136 -155621 -316188 226584 68491 75828 4958 220635 -122177 166626 -52440 -26366 -339989
16125 -339989 -44494 205972 220634 9387 443940 -32109 300500 -94579 -57451 -99969 -203048
16114 -203048 46988 -210744 -74670 30082 464749 211867 106752 202178 -120731 289720
16103 232072 44787 118514 72489 427657 130525 8843 366055 372211 -218746 -1139 -220137
16092 -220137 223861 105878 140783 -11940 -90761 97194 41433 -263070 -228946 -104087 -159162
16081 -159162 191988 -92810 -326349 164305 133263 228749 228714 180407 135557 -349568 149365
16069 -259817 140832 174651 -86385 -218628 -172954 -126335 444040 229154 171609 345318
16059 345318 -237949 304428 145791 3920 70692 -121460 115308 94319 105951 -77187 -132948
16048 -132948 -87226 119713 -250856 -172909 104488 -17017 -14928 -46944 -123742 -118237 -204940
16037 -204940 378450 -105179 -99530 18432 64731 -55790 -51411 142144 -106869 120633 277737
16026 277737 -13107 -259677 143325 -201281 -86386 -181527 -351270 192201 -254079 49791
16015 116659 -293500 -133104 260272 4761 98069 -360228 -13615 -107391 220242 -336414
16004 229108 -107994 -108231 114390 56274 433198 -229774 -51601 273493 -165555 249783
15993 -249708 159503 5385 -116156 51614 -274427 -240863 332993 76906 -7698 76837 201317
15982 201317 566174 267128 117751 426048 161249 116034 -175290 324935 59393 -13644
15971 -258914 156766 59933 -136715 -117441 -201081 55898 -319087 112475 -3172 423372 -22247
15959 -55740 -289598 177616 -214180 -96447 -303679 -37124 182223 24631 -56151 -133830 -126719
15948 -126719 -139640 451098 95534 95676 87001 204228 -337840 -141067 240975 57951 -272367
15936 -148109 45891 -195745 -380121 -190619 -138281 -322865 -126661 -308556 493548 -222382
15925 -142557 -220183 -371268 108905 -157209 -16682 -132610 -264169 -143370 15533 -53471
15914 -175235 -2752 -157096 216064 -49255 -125522 187603 -293360 172336 -64346 173709
15903 -286334 91404 -54026 -34441 187760 163808 7528 -49241 351390 -2818 183957 142371
15892 142371 -105970 124969 -39157 144478 -6586 98026 15329 -75048 252601 -143703 43741
15880 -42416 98979 62141 -87514 134754 -84267 -1056 -281969 147899 234333 30140 56626
15869 56626 207654 -152103 47884 322634 -226646 -159431 -201235 -123045 72136 15498 35782
15858 35782 113249 -45812 125429 195367 -270037 -66780 -228505 -58634 65326 172411 -11674
15846 115661 -295196 50438 -60860 -61706 51286 -62897 208752 105803 84692 -302587 -300087
15835 -300087 156347 14259 329234 71472 269805 -109464 65829 -244757 5267 -98512 -101874
15824 -101874 53037 -350494 -249460 86738 -264189 71846 138545 -162741 -35254 195348
15813 -209388 218527 -174735 86767 -113082 -165187 -261547 210103 193917 112559 -141756
15802 75092 -1530 -193245 -191425 74945 -321095 -21584 -386461 -172354 -119913 -383554 180986
15790 -26802 51882 280133 -193753 -224599 208688 -130377 29276 -303914 40224 213188
15780 213188 -201950 39628 -136208 120828 53435 -80413 -127050 -376333 -291878 -43883 -68093
15769 -68093 -80582 -14981 -64441 -106504 29148 27299 -87747 245934 71202 69832 -278839 -6724
15756 -169923 319018 239652 267022 8557 61230 -191999 -106795 5675 389083 55512 -240462
15744 -339291 -262855 111560 221131 -397998 146938 96392 56032 -67290 70988 -155123
15733 45526 -137528 411109 -159792 -175716 -160667 256546 210363 -114359 127512 -63472
15722 -51333 65389 28425 306883 -257913 -76487 -190691 -118040 180192 -115765 205653
15711 121869 128875 -310412 -270985 85524 -410298 -283466 -132431 559 -389692 -94999 -24439
15699 -115912 840 -68621 -252029 -62404 412562 -41740 -124777 -113254 110861 412508 148354
15687 74620 -102431 8095 431499 -222738 -419242 -123297 -78504 -30815 311913 315298 270326
15676 270326 -239280 -80799 164697 11972 53538 297937 126178 -256208 30900 176510
15666 176510 -67746 -223715 -265271 -14842 -303444 129785 -232473 -40993 -135147 -295772
15656 -295772 64089 162817 126549 348632 55200 138170 99369 -127795 -125892 136955 88910
15645 88910 -14524 -275760 -343702 -180373 170305 -79955 11230 100623 359099 -108273 -227886
15634 -227886 -153606 -102784 581782 -545676 6397 -356482 47645 -191244 -85716 -24718 -266480
15623 -266480 -273847 8929 121024 19618 70780 2910 39511 49662 -81906 -41844 -146425 97158
15610 13322 -329255 78245 176846 -72191 -157297 -299335 -932 -50061 -64049 -200083 -242554
15599 -242554 -306195 -96100 68747 344764 -95901 49160 20664 15144 -105355 370171 -176906
15587 -59150 -39352 78400 11917 22934 -193728 -51850 -2953 -56059 -159529 262315 327120
15576 327120 -29322 284794 40632 -199131 120327 71654 -324277 -78804 -3104 -61634 -204471
15565 -204471 -5695 178192 -23103 -56026 -306664 -322631 -247976 -143269 184720 244315 67024
15553 -163042 43340 18298 98363 -210079 214433 -41133 -189258 -180994 296872 130254 -187021
15541 -238612 222855 -8694 134710 254898 328279 169191 -215794 -238287 -121482 -111861 108687
15529 -85624 266379 -358134 -53031 -72817 -38921 443398 201363 -196417 29353 -244346
15518 -267237 -70570 118860 -187966 11405 -114604 -377416 215779 -97112 53645 3979 125082
15507 125082 -107644 -65277 78383 -208380 22121 121116 82278 229526 -188021 -42762 -168869
15496 -168869 125281 168680 -170199 -34090 -200162 -185264 287631 96931 -185354 12396
15485 -284146 -187753 126965 183684 -165302 310746 114597 -270207 111491 85622 98770
15475 98770 221819 -66746 259429 -63736 78799 276819 -123419 301898 -114464 214240
15464 91788 88868 147065 -89482 -60652 158203 -155227 -40355 -114856 28085 297726 -103485
15452 211903 73484 -57095 147025 -159973 298585 95340 110735 -46167 108973 -302225
15441 -268922 91587 54714 -165489 2996 -136779 -46587 -138578 36284 78612 -52643 93893
15429 -144945 -207265 238161 -2147 -432827 -179158 -62581 249256 -49901 -372790 25859 95330
15418 95330 233352 184068 -50466 156190 -22358 225779 -58536 -440678 117976 -258352
15407 -175009 183369 62158 -104016 -237660 147019 -229811 -36003 -19266 -401365 253140
15396 -82476 192711 -145214 -342136 140890 -76373 -105932 -525794 -255903 -27114 -98109
15386 -98109 -286884 -181217 -133969 74122 -78198 282588 52667 261860 293085 -58684 -333645
15375 -333645 -85961 -238139 30865 -535344 -120680 -195162 -6696 -326420 -49116 -175721 -24074
15363 -531649 11595 -251501 -17999 -20069 -24762 273780 -211442 -273711 -18838 62101 -195394
15351 143907 -171854 -149157 -148424 244753 -336211 152265 -301393 -387076 154773 -58150 -206448
15340 -206448 -131427 -220033 -101022 -6162 57785 -90551 -95181 228564 -120793 -113876 165122
15328 138037 -161267 -39331 93688 236974 -51004 -198242 247254 113470 -140191 -95294
15318 -95294 334961 -120171 156974 -167495 -77522 -170435 114975 214820 -91595 -40733 101397
15306 221213 -177831 -293255 154674 -111649 -277774 104450 120535 2756 197083 354577
15296 354577 42089 -432177 20818 -32962 -40489 -159820 -50274 212244 3782 130683 56387
15284 -104487 201515 -105144 -347442 247848 55143 190228 -193028 -74479 249030 270612
15274 270612 138661 164619 -86136 195363 -95124 -18012 -48170 -237537 77619 433221 49911
15262 152880 -194314 78715 59882 -168964 272911 -273184 273351 267469 236178 141489 222818
15251 222818 178236 87875 716742 1666740 1152445 1091115 1446725 698282 389270 323716
15241 323716 -156364 37044 120495 203223 81290 46192 -181817 88987 -216289 -206964 -99895
15229 212298 -38047 -126475 51832 -19974 50304 195992 310183 3943 400459 93266 -75470
15217 -65386 -87507 207442 212513 411920 -108739 575507 -288691 48398 112741 -48817 237683
15205 28406 144332 80351 43520 1147 -22651 -214358 80527 50254 26856 88143 -38938
15193 170965 -55396 450485 -61919 -163120 103697 -117496 -73848 -139553 354445 -70193
15182 268106 132047 -138287 230934 -29811 -162996 22709 -25482 237958 230486 211168 267116
15171 267116 -171720 -68232 186292 38431 431995 95796 42804 15610 141035 -113192
15160 -215551 -220231 -72724 -70626 242086 -84144 38040 215185 -153010 15821 41034 -101923
15148 179807 199816 -6637 438887 161306 -36837 36177 -187914 76584 -53000 39349 146142
15137 146142 26701 12370 68598 153518 182284 156971 178356 94044 149251 440392 316391
15126 316391 153899 -98120 -120613 195832 335640 255431 -15254 -100933 265856 -248771
15115 358901 117338 -30778 274685 -33555 -207864 -109715 4497 -113211 173449 241943 159635
15104 159635 121301 265697 -219330 35560 -12545 236538 378788 -203790 131353 49986
15093 363510 284545 -9489 231394 258246 123436 271646 -368310 315524 207483 -101500
15082 12869 -83216 -150556 -252060 -54650 32336 -357670 134235 29997 480210 197237 277735
15071 277735 84773 194254 -227215 52069 -113131 5699 212714 -83625 -178053 34207 -59963
15059 209100 238305 241632 26457 155647 -94673 -157704 366628 442879 202394 207798 -149056
15047 -101339 39474 70490 329255 12819 451442 115414 307209 -252700 165681 -71723
15036 219934 -31130 -49433 -52775 501630 35219 411088 577411 392751 384112 89750 364010
15025 364010 -57226 166620 72948 179644 79654 -49431 265364 226435 348738 88381 191912
15014 191912 -152207 239447 -52367 61951 -43230 274580 212578 330437 325076 17586 171979
15003 171979 25107 388872 239399 218733 208656 -30933 113813 450907 48421 -9023 89460
14991 344808 43067 -362613 201976 -266622 443211 -164724 49485 -13572 122382 256903
14981 256903 93763 77696 233877 142712 124910 -23746 305948 336110 63536 138861 55743
14969 208468 -62432 302754 329855 -60266 -78849 187159 430480 166866 194627 -90315 197700
14957 -12480 271082 58182 420323 46326 40068 467517 126363 -181017 365217 260763
14947 260763 377796 124388 131597 303009 232178 279136 67213 193648 321121 -161944
14936 242896 287020 -34058 267101 501282 113388 74480 112539 75632 103978 64510 423734
14925 423734 89641 290785 372616 354381 184051 76861 160670 231917 46076 461439 -20536
14913 116862 257489 316000 106033 556873 114720 26891 28078 339124 510679 323627
14903 323627 143399 309272 472158 768584 264778 82985 420638 117811 153728 291574
14893 291574 55445 151872 257337 276148 545894 300460 248306 410195 348117 202029
14883 202029 45460 345355 541085 -5115 -23429 173822 185314 377297 34340 397534 495470
14872 495470 127475 186136 64958 379591 401942 357355 -4237 276656 671087 336813 263268
14861 263268 194785 62097 460354 164357 257611 643245 -9861 502656 486889 500789 325875
14850 325875 556574 231735 164510 431619 367610 8598 404507 131855 474048 255546
14840 255546 198685 638552 33107 702985 230517 625707 482759 267411 411904 374942
14830 374942 307226 532682 425227 -46924 219175 272460 354160 490623 317915 284962
14820 284962 434137 457092 367261 193988 458435 206467 441370 380710 185955 872802
14810 872802 397081 488937 363671 351052 494943 386967 306755 331864 481552 185286
14799 294949 521762 830424 639964 307490 295230 624045 518424 570581 262103 612735
14789 612735 658050 584111 493778 522077 573790 312806 165299 327714 392977 337692 198578
14778 198578 228049 135542 288620 395869 507252 274508 323103 481895 504537 512686 233468
14766 67984 340718 581704 439710 321250 357933 323021 393700 799542 484223 492231 878754
14755 878754 376242 646916 399980 349978 371142 620573 585401 640584 677017 570374
14745 570374 690354 482569 662024 462508 454704 874684 204700 641972 509262 356432
14735 356432 395616 466232 378787 544716 499308 409441 299022 537067 859861 760880 831891
14724 831891 607601 677085 755798 922971 626067 447745 491575 670555 734195 600741
14714 600741 945501 865598 1002714 455705 509290 475909 489409 444711 470789 744008 653953
14703 653953 813177 794313 810539 763968 623503 348367 923508 904306 711201 633307
14693 633307 814120 498416 593539 885100 593208 743448 891922 808245 505844 736758
14683 736758 705916 683928 374042 836643 779369 894189 1006312 619364 1146513 713319
14673 713319 916019 1093013 1018507 824060 922385 888650 591792 673694 1085015 708220
14663 708220 840449 1011490 1086606 1168555 995529 834532 967362 825200 1297823 949073
14653 949073 1262332 619265 1026125 822626 930456 895044 943026 789012 1124255 845841
14643 845841 992187 957952 1082457 1007906 966058 1262762 840710 893121 1221940 1001612
14633 1001612 582487 1279999 813977 1016114 1190426 1150174 1064181 1362091 925867 1403419
14623 1403419 1164955 793235 1354251 1112734 1494830 1204171 1257205 1010965 1631792 1329666
14613 1329666 1116660 1109577 1233249 1178883 1295114 1502338 1152636 980165 1072251 1386934
14603 1386934 1261067 1493158 1516952 1156683 1364857 1448942 1306949 1453310 1405097 1308528
14593 1308528 1452808 1204786 1623979 1614286 1479613 1444832 1464516 1688653 1411344 1541049
14583 1541049 1432175 1616047 1671941 1443522 1846107 1585100 1262331 1860954 2020525 1909253
14573 1909253 1830937 1912651 2002258 1791929 1677759 1809847 1978301 1976928 2475562 2217171
14563 2217171 1949554 2235432 2396848 2528982 2219322 2254961 2305683 2799763 2606278 3051881
14553 3051881 3489576 3444739 3940674 5163798 7597264 12230851 20534325 34531187 45538406
14544 45538406 20519231 8575756 4577377 3190848 2524724 1994219 1745083 1631660
14536 1631660 1906521 1841567 1842841 1799270 1763993 1517373 1634349 1745235 2092072 1888827
14526 1888827 1831069 1880424 2053021 1740383 1828401 1945056 1819577 1800670 2230570 2356019
14516 2356019 1858194 2285608 2220934 1936790 2229721 1915510 2438030 2181945 2205829 2185478
14506 2185478 2593208 2859323 2555903 2306159 2527762 2438552 2970604 2361018 2465910 2773414
14496 2773414 2764933 2723183 2450274 2964704 2679684 2947640 3264172 2811755 2960229 3101681
14486 3101681 3276499 3285926 3338631 3521422 3124276 3349434 3216586 3265727 3422275 3575410
14476 3575410 3485630 3524048 3638465 3615512 3720941 3672917 3818337 3817559 3747395 3687944 3969329
14465 3969329 3600705 3927302 4056754 4095742 3766243 3956464 4141298 4364161 4393508 4287970
14455 4287970 4510521 4499333 4662239 4414592 4576568 4953663 4701659 4658266 4889559 4851641
14445 4851641 4768805 4934473 4849163 4712572 5106130 5355119 5512611 5724012 5458930 5448259
14435 5448259 5452917 5763340 5786872 5492011 5671275 5794193 5828173 6123475 6223103 6401998
14425 6401998 6467288 6095332 6249417 6340869 6545588 6909564 6781144 7333019 7100210 7354114
14415 7354114 7498514 7395058 7483815 7531661 7476171 7753977 8046324 7996048 7711276 8240931
14405 8240931 8365122 8876356 8466874 8603251 9069999 8961299 9187102 9679432 9551379
14396 9551379 9669942 9933242 9765274 10020219 10341563 10420203 10671034 10898320 11089051 11006136
14386 11006136 11743029 11845604 11793827 11997614 12221447 12492412 12740792 13060625 12904696
14377 12904696 13513332 13642116 13669125 14119335 14539629 14701840 15139985 15605255 15876190
14368 15876190 16008104 16460884 16919598 17099181 17620702 18007753 18280742 18470570 19168753
14359 19168753 19465181 20028047 20538914 20961836 21384407 21985901 22581000 22918445 23711019
14350 23711019 24229490 24863567 25287531 25682209 26458153 27363053 27790345 28723034 29557326
14341 29557326 30186061 30907298 32013640 33118613 33741821 34839690 35939440 37201420
14333 37201420 37770789 39228963 40553641 41674041 43236367 44388881 45760768 47397619
14325 47397619 49077516 50894399 52590896 54370265 56556270 58321093 60698971 62944697
14317 62944697 65532484 67990823 70667224 73811485 76712938 79734760 83343393 86675291
14309 86675291 90565128 94424263 99165213 103323218 108500513 113702273 119199805 124751589
14301 124751589 131275730 137794913 144954094 152576622 160953406 169433096 178461222 188780122
14293 188780122 198944618 210314857 221885401 234726831 247843275 262262094 277021158
14286 277021158 292800126 308894703 326264992 343585029 361304476 379564158 397459742
14279 397459742 415108596 432242317 448081738 462256077 474810225 483158482 485274610
14272 485274610 484020102 481633719 483664428 484484089 479170551 469435559 458489669 447653084
14264 447653084 435031565 420368809 404174560 387495716 370559398 352569864 334733249
14257 334733249 317191454 300426231 284633526 269832757 254788187 240812440 227533182
14250 227533182 215373773 203720225 193037048 182670641 173032577 164313548 156144719
14243 156144719 148202606 140929831 134121189 127532937 121579550 116032319 110736623 105751382
14235 105751382 100828750 96657854 92286530 88623208 85145888 81969736 78628260 75438599
14227 75438599 72429316 69513752 66730322 64607478 62136862 59634869 57527947 55801488
14219 55801488 53744379 52007694 50421075 48301303 47313665 45920227 44897052 42996332
14211 42996332 41542004 40058790 39402143 38104485 37848619 36617524 35307875 33867675
14203 33867675 32871002 32161236 31693643 31096998 30069818 29059591 28275377 27515412 26726431
14194 26726431 25971271 25686047 24888294 23975878 23796675 23291044 22598494 22133395 21369127
14185 21369127 20914747 20688946 19932191 19506184 19123505 19327991 18251591 18337058 17710504
14176 17710504 17207856 16531718 16953920 16098974 16102110 15794782 15389679 15089157 14816756 14702386
14166 14702386 14358938 13729531 13607812 13397708 13232657 12640602 12665182 12610963 12333956 11999940
14156 11999940 12113246 11731772 11440134 11326481 11161326 10916163 10992276 10583368 10248088
14147 10248088 10203130 10217296 10099120 9981585 9642660 9518446 9404299 8890561 8999583 8795282
14137 8795282 8835369 8687077 8620848 8448670 8493176 8404706 8093737 7762014 7703910 8023103
14127 8023103 7871174 7638616 7469006 7547958 7194470 7079705 6820926 6936697 6823782 6659709
14117 6659709 6557076 6573964 6456460 6362465 6645164 6289366 5942960 6365586 6062220 6256829
14107 6256829 6285988 5786357 5827381 5814549 5368520 5468946 5763226 5567271 5271929 5298385
14097 5298385 5209761 5321007 5303632 5129161 4839954 5039304 4880677 4705598 4546154 4616059
14087 4616059 4713505 4576874 4428124 4639155 4485652 4393183 4072295 4306517 4364336 4199296
14077 4199296 3951525 4213194 3914470 4053775 3730722 4028625 3869627 3711336 3623218 3917423
14067 3917423 3772413 3707008 3724492 3741856 3262386 3215514 3467154 3373260 3718454 3500076
14057 3500076 3468993 3338842 3350696 3287740 3301662 3225945 3138104 3192256 3036515 3192487 3019928
14046 3019928 3049705 3117609 2909410 2732713 2889707 2759152 3104548 3072542 2688690 2793777
14036 2793777 2964105 2945286 2993152 2601765 2882000 2708350 2929375 2756890 2664563 2562313
14026 2562313 2558412 2437573 2653022 2472413 2461680 2224263 2682807 2454489 2168995 2214545
14016 2214545 2235102 2398611 2348512 1952870 2359819 2462864 2170270 2218564 2173571 1782535
14006 1782535 2422534 2165289 2084344 1963971 1802923 1967544 2048648 1916545 1673190 1648588
13996 1648588 1781857 1712044 1606206 2041604 1954656 1893981 2451375 4026395 7427227 14685412
13986 14685412 27705781 47244630 23560625 12112175 7665980 5875521 4459711
13979 4459711 3752334 3762685 2817980 3229048 2814435 2883113 2440861 2008040 2254336 2120262
13969 2120262 2007423 2003879 2154897 2401363 2156261 1764871 1909398 1786739 2021941 1808596
13959 1808596 1923674 1889777 2165516 1863961 1839883 1840438 1628375 2227705 1963456 1591251
13949 1591251 1872184 1858355 1804512 1798019 1847441 2034898 1444415 1635076 1722568 1324625
13939 1324625 1517341 1518233 1633507 1731101 1394399 1334614 1673056 1511110 1276515 1443930
13929 1443930 1804807 1396211 1786502 1714966 1332118 1633642 1570787 1457826 1484118 1134330
13919 1134330 1139323 1369910 1293231 1033573 1267698 1597336 1415578 1576232 1173089 1247864
13909 1247864 1240007 1102161 1107239 927851 1084948 1257885 914820 1032653 1112779 1193813
13899 1193813 1371601 1297521 1062708 1308471 1142404 1198096 1072096 1256521 1051783 1178725
13889 1178725 1301457 1480952 1034120 1120622 1179033 1558993 771713 1072737 1195007 1100315
13879 1100315 1229833 923277 914434 927198 1116804 1109044 1159632 1106654 1186622 1235357 906357
13868 906357 918687 1082119 850052 1350356 844611 981015 1108106 655584 876477 826729
13858 826729 984329 935013 1038569 974288 1036585 952896 1170743 899564 939337 803981
13848 803981 1157861 939832 1040089 742545 1154253 955158 1064696 1354355 1167393 908966
13838 908966 1041005 716842 1237738 1201764 924329 758864 1061201 903865 1249284 589908
13827 807077 747199 1071013 1024618 1038181 794734 566577 971210 1090803 947565 858336
13817 858336 1044351 936055 721572 388204 626242 1049480 986379 838936 974323 983392
13807 983392 736585 657237 643723 632314 599991 622146 670187 703289 887519 629622 958801
13796 958801 747606 823804 625196 527956 703769 915089 349200 501673 488524 827415
13786 827415 474135 350216 834031 923484 976735 551744 770201 899965 854815 473681
13776 473681 464334 564638 526162 741901 537223 692543 507216 426959 706269 344923
13765 692569 583871 359748 573883 822993 690645 786657 820482 334590 619694 594325
13755 594325 314044 674679 748160 409736 497571 651257 809441 548329 800284 624167
13745 624167 441471 417125 509794 412305 304071 539659 545229 567324 552273 625010 474806
13734 474806 403428 527799 373870 605914 550846 508768 408430 194085 523204 695173
13724 695173 568838 623000 381677 840727 368742 437529 593332 339114 970336 285758
13713 582640 468647 415898 348102 580362 449982 294063 612051 362274 665452 732970
13703 732970 301699 290429 733110 477059 644448 416507 529297 667356 372246 434618
13693 434618 267744 488666 442722 298460 594487 771688 442886 467340 545525 358122
13683 358122 661924 268502 585771 15109 592994 641159 354406 491622 444266 429713
13673 429713 441131 389584 622309 228797 267297 363177 206876 559271 263723 377941
13663 377941 269273 381411 134335 668082 380118 148503 778558 475145 452320 453117
13653 453117 378936 432513 390385 518931 573371 460135 569060 509532 898669 240354
13642 162114 718055 117514 342006 428428 308918 242486 741647 414746 433031 205236
13631 783719 555172 501975 230278 352758 287204 522741 377683 401471 704980 509417
13621 509417 310499 271146 212862 219956 229920 261538 529845 477049 269527 491126 356550
13610 356550 649718 477949 298820 260590 342620 345003 451616 288222 237224 192286 430497
13599 430497 510698 297781 275838 446769 374611 410827 450990 534881 429011 516380 105059
13587 253954 251826 196668 292937 372923 329441 359819 245844 430875 162527 419511 323268
13576 323268 72246 229929 338610 517773 568863 261371 308431 283135 308248 200060
13566 200060 137155 505505 476316 485896 353334 267791 -35933 638046 200291 328022 322720
13555 322720 127129 222981 368214 159328 308049 438535 54404 169089 201468 216550
13545 216550 518039 525726 234315 533940 326373 45721 196889 42204 66183 308939
13535 308939 430204 130554 332641 351771 294845 -14144 334141 -190996 404736 558056
13525 558056 506941 155026 222951 378661 408170 408569 126482 466812 264545 264469 303027
13514 303027 154799 317199 -58202 572349 28020 357286 84718 331978 294104 276069
13504 276069 -141074 271839 320388 194828 30162 318259 -12220 183701 250393 129829
13494 129829 365453 361282 -50315 190938 196535 155775 -127593 219021 285469 382875 235853
13483 235853 348457 485856 306936 -47768 336661 129681 261919 171266 335989 154464
13472 161681 528953 -14794 -68346 344588 498312 178263 144687 172318 475742 242852
13462 242852 225906 264897 263401 202159 -331264 -14472 -46962 83160 97365 95071 -18616 135065
13449 396137 304852 49115 200337 -58400 241793 283981 101890 377124 144104 325962
13439 325962 223934 233716 -126628 197835 350225 332842 33144 269565 77057 276085
13429 276085 77025 20432 125983 155127 14814 165558 143947 182354 31409 263297 90849
13417 246291 283728 -120461 31873 192307 -61622 317283 146669 49476 491762 388919
13407 388919 48824 251951 45182 340176 248509 -50982 158204 421665 464204 263810
13397 263810 294666 224841 206912 341507 340670 26625 276073 215164 110438 282793 -128330
13385 20878 -44552 -23093 416827 321551 18943 169129 20434 213364 322946 174061 259762
13374 259762 163379 216779 126410 -108300 518643 -5879 79225 200820 65555 317447 237447
13363 237447 -68801 272735 -59801 -22422 107583 -130076 243690 88107 182352 87275 17939
13351 134614 109600 397677 269092 47705 335677 278825 383554 290622 141436 402308
13341 402308 2019 348111 -41518 284517 325997 117029 333625 -143012 59137 173922
13331 173922 109101 441278 105843 46387 470290 303921 -112458 344678 318450 109237
13320 19063 -12404 308060 306442 460075 260482 -143989 239866 275215 233433 251502 45982
13308 186038 -74824 -103398 -36818 -34718 -56951 245404 340931 398405 209216 215540 123916
13297 123916 165636 -35295 299862 413732 1144 280560 -50365 324661 190315 -126103
13286 7187 575683 385538 123906 330771 -506747 26786 151872 104017 97336 276035 230176
13275 230176 64422 346588 373697 -147395 98418 90699 -220998 515204 -55242 13099 -112282
13263 35384 -205971 163051 93379 114037 190764 231595 163985 -20374 336690 -175439 8024
13251 90714 424809 -67263 -81718 192013 129815 -456057 325812 261413 62956 269934 84924
13239 119858 137435 435196 296699 142026 -36925 -129030 112216 356439 127290 -600 56023
13227 360836 140593 -19493 -180551 -20192 112046 -312685 -88923 20159 413647 57007
13216 353520 -115252 238390 -57151 210809 -109764 39746 -140506 157621 -137260 -1593
13205 242242 135203 104753 -54693 -43870 168538 246495 213134 -169612 112131 -91345 -124777
13194 -124777 76198 28583 -21010 61893 286439 283913 311888 287270 -2732 140294 372815
13183 372815 55476 269952 -82500 186844 -62820 3245 -55508 66584 -29542 104255 95755
13172 95755 62277 98327 -33144 -137515 449629 -85328 -36044 -163772 38171 -127710 -156832
13161 -156832 164947 76515 126233 33422 140274 233178 260404 -27153 67389 88404 114873
13150 114873 224355 338739 113222 -247406 128209 -47113 -24053 48593 -64965 174182
13139 -147973 -35381 66066 332181 96121 53845 79835 323248 140984 -75851 128591 -149393
13127 -81501 -110814 41983 -96195 -43834 217012 98438 412202 -23787 437558 -59906 133734
13115 20951 323900 -124401 462433 -119467 -1818 103390 96225 185197 -40920 -226929 133788
13103 -430556 359006 84611 -70392 -70466 250322 258023 414154 -231931 -132900 -73366 -66802 299082
13090 343216 123155 -330583 352739 7062 -3230 -55973 132932 124367 171770 -18325 -51642
13079 -51642 5686 174061 -178183 -7220 131689 96736 61048 99716 -33310 43711 115269
13068 115269 -140602 -111010 169967 166847 146568 306655 -204294 92586 275083 218836 357904
13057 357904 431743 10113 -123734 197661 -73003 -49816 -28513 -163223 84324 -78856 109760
13045 363933 -153814 -57974 124658 280257 243467 290161 234693 75060 482926 44633 355923
13034 355923 -1599 284860 402219 228746 482524 266798 59733 174837 222162 186608
13024 186608 119222 97687 114546 466297 -139520 162182 -195657 180344 49958 57958 -63025
13012 500082 -21481 144304 6672 -40260 266621 273414 273483 87413 203336 -292215 -15511 187491
12999 157146 -141066 392053 -181425 -116817 -218450 145943 163160 286308 98306 122855
12989 122855 38534 287734 -189917 -30657 -108967 -339377 477116 -37163 -103202 278672
12978 -85445 184072 189436 -90196 9708 -20574 -94419 -47587 307567 56195 153253 43145 -83981
12965 69185 135192 390659 49732 126447 -240844 33092 -255336 -26364 100368 178733 -325915
12953 -230118 -198841 300978 79682 88065 -88787 46894 44439 -260118 231866 -114749 440527
12941 224791 34284 -28903 48066 -12381 16286 -192641 328569 -196661 103165 49249 216195
12930 216195 137096 2912 66439 58433 -124591 -157498 19967 294009 -69061 -14766 70160
12918 -79706 186944 345726 1646 53821 221438 -286854 173631 -207996 225779 -1388 -276514
12907 -276514 236576 429997 256174 115736 -265804 218882 -32523 178314 -49730 -4421
12896 -94816 -140659 309407 297969 -12216 109114 49632 35871 249692 100372 300364 -240052
12884 -498537 -299135 236340 -101417 -325504 -164608 35014 170749 29196 -35543 8200
12873 27985 -29275 -185192 15321 90462 468115 190139 263605 -66126 -115058 -1996 -189976
12862 -189976 70463 45335 -158880 382218 -134088 -94867 193956 -198645 120589 142939
12852 142939 -181283 120208 29727 -218114 256620 295479 -74265 -27122 107110 359751
12842 359751 268698 -109926 71404 -248916 -82286 449923 -355281 424932 321622 -73578
12831 -176080 22483 -135160 -186673 454192 130451 -101514 67409 317214 -360541 330576
12820 56888 -95568 -292856 -219733 108815 91751 124749 101878 175789 -176228 138453 26081
12808 270661 649 125219 -149187 182094 130720 -126940 312091 -41964 16067 34952 -100132
12796 155310 -20988 175406 -64831 350103 -10695 -290270 171438 43286 13573 -100297
12785 -36970 -12157 73279 -261132 110808 48392 151740 14554 -166778 156140 130000 477749
12774 477749 52196 -204639 332451 -195250 57501 250233 395040 -88894 -174450 58685
12763 -146726 -63990 -204095 179890 -135462 -121790 32531 -142133 176983 -3345 307365
12752 42983 -100137 -88217 141270 286017 -351541 -256742 204252 -32523 70866 31379 79337
12741 79337 -279207 229781 204491 -123356 213142 92258 111759 81813 134469 139720 163829
12730 163829 177861 11274 129849 -266196 -226566 76681 -171014 148242 70189 -57695 123587
12718 75486 174334 -121211 -174516 113991 197238 126082 195313 73239 117510 -21529 290870
12706 372612 -94034 -38833 238355 -4412 289279 417322 97882 -178939 171138 268062 -54913
12694 -257755 -439 -297154 75814 -53342 -151011 298428 -150678 257315 -100469 -140160 52845
12682 103594 151441 87336 336469 64829 -60815 -56562 -71417 206232 281930 199162 11170
12670 274932 35182 50410 78182 -184984 129184 350043 -172591 202679 297018 384647
12660 384647 301465 402326 444522 144350 -63056 162220 -170279 183293 269051 7600 369290
12649 369290 344439 -93721 110876 -267160 143589 395113 101831 -143012 -207941 -71781
12638 409158 181768 -198 76904 -355864 13772 174193 355077 120428 337501 317588 258631
12627 258631 242992 -59087 263370 334220 114986 -151146 -32970 -29517 12095 377744 23323
12615 290888 274531 119999 328118 -4237 -190520 24956 -16844 -65573 251886 -139662 -63064
12603 -4316 20694 92367 149950 173998 -6369 271509 397690 -188353 175585 146575 21752
12591 132046 -315559 -29718 205162 -45923 72272 173611 161806 5205 425896 19252 162492
12580 162492 80506 -103753 27548 -209501 97445 -70355 437935 353915 147742 105203 76297
12569 76297 189578 174873 207839 131958 -209076 -99970 346193 158194 -55647 44083 -108744
12557 49726 -165502 174215 273808 2663 612901 111065 166532 -143501 119828 8020 -220153
12545 81463 304488 -265970 81964 72779 103414 -101944 -121092 -21400 67556 264713 -60308
12533 -221963 58504 -73457 64058 -203958 -153787 -4425 235411 53967 354598 -122613 42279
12521 21040 -133237 49335 226344 95056 -244810 282933 40947 173008 78134 200048
12511 200048 31844 -12229 -28977 72813 -180256 202490 80291 -55852 95994 29664 -51713
12499 192763 -23987 113495 162845 60583 328190 345528 -120523 650 231108 116067 60262
12488 60262 45882 46940 -255003 10328 160920 150063 101194 90919 -37467 -132691 114635
12476 -99338 176800 6266 68682 -453048 104841 343399 64789 62919 -207315 -62393 -239927
12465 -239927 72191 167378 -70953 -145111 -115075 -62804 -17976 250760 54171 30696 -29409
12453 315926 -315816 31766 -117375 256176 -194656 -75857 -63706 111683 66747 144161
12443 144161 -175673 -86315 50260 43692 122898 -177099 303480 4117 -61253 44204 189570
12432 189570 -161294 175441 -95647 -73763 -261063 -7028 -101138 -77299 48484 74947 159109
12421 159109 -213599 -106064 456741 -100181 -35795 -16938 -15715 36802 -71974 -73120 -151071
12410 -151071 -113057 93983 -131265 -451687 -208167 172316 -153164 32978 260946 370187
12400 370187 221520 62534 -18483 116399 -67092 -36186 151833 104221 -115530 48033 -164884
12388 -81160 -67708 128226 -186810 154707 -237986 -129704 -38126 -282696 -94807 222977
12377 26559 420945 39375 -39170 46874 -41443 -23610 -166300 -82355 355129 -34361 -274341
12366 -274341 156948 106849 -43523 131632 -420739 149385 67328 -124205 31547 795920
12356 795920 100153 140100 -23474 376478 -352454 -80204 -154317 31626 115338 241756 -127877
12344 184835 269719 -232216 -117190 241788 -249492 188294 136316 -194473 -4599 169787
12333 -18694 -58949 -194512 -318912 193699 132971 72518 188577 95345 420616 68020 -255440
12321 -253326 -31808 -95689 157119 200668 -20970 -100824 -38048 9633 -301872 -205489 59611
12309 79075 209522 259987 -49338 -251518 -279711 -82793 -128296 -196563 95161 61135 -304189
12297 -41091 4609 94644 12833 266901 -11487 -11020 -95173 34391 137001 93618 294645 -139924
12284 -51767 -84779 188433 103523 -123699 3244 130694 196046 -97329 125329 120891 269668
12273 269668 -13685 100767 135676 121558 -470146 91159 -127201 -31653 -12661 204266 9360
12261 496 2818 419708 -36271 90797 83698 118859 -293509 434581 -17175 230127 124905
12250 124905 -229158 234576 39025 36635 183946 -914 68388 60123 -55643 -99150 -257670
12239 -257670 201689 146404 30280 127237 140388 233595 62894 204990 56662 95949 -276252
12227 354100 518459 258093 182001 -259 66814 -52597 227400 256388 205316 502111 288655
12216 288655 197035 284350 352872 212042 449182 -319502 116805 -66693 389580 -154387
12205 -162860 326212 363669 153450 100134 -7758 -263836 -178411 356344 281574 -212241 358357
12193 222155 87315 190830 51155 267897 122843 365483 13555 43115 157738 119076
12183 119076 35886 442229 22438 -76580 328938 -272700 168755 600555 212104 174135
12173 174135 149864 87461 214661 -149571 3538 337871 274187 -116450 315385 -115758
12162 -16752 -222642 419138 -65198 218003 -240083 256127 217035 194450 172428 321228
12152 321228 206947 -90150 -106908 14738 330039 43497 339690 104414 75018 -59233 -226311
12141 -226311 -4147 36381 -274991 205757 391853 357720 -274430 257420 534566 74328
12130 29065 428406 42406 -219030 -220936 -115006 -210874 -104301 -22260 141238 62442 -82534
12118 55785 21593 107547 227428 -223588 -125106 -25517 -4925 -166546 62043 85635 156513
12107 156513 57041 -109584 195612 28674 -57831 -123360 126849 -119307 76131 53451 147662
12096 147662 -37195 330537 276270 -84388 -207299 113544 -212042 -75846 48543 284174
12086 284174 -83100 -55674 34137 -50673 -531148 165958 -174664 50993 -220741 259345
12075 233813 -130406 -51913 -34045 -220589 460544 1139163 2171696 518295 271079 18857
12064 229800 235839 76196 262927 26701 -56187 -216636 64520 178629 128536 -135572 101812
12052 -255990 -190298 -218240 -159949 43574 223625 17491 16125 -15778 84549 428210 36511
12040 394186 98847 32714 78525 307107 -72396 112642 -9473 -301871 -195369 79899 86465
12029 86465 -72471 -49033 357684 231162 308927 208401 -254396 334886 377281 -165061
12018 71660 -64321 -213903 294974 -115944 -138854 -156489 67611 -443297 -5678 20595 899
12006 7550 33465 20630 53515 21190 131554 -162995 149791 -314647 -138505 21223 -12897
11994 330815 70601 -413894 -108445 -273410 -32509 -244093 33765 -143877 168220 -141144
11983 -73938 -75922 -266223 102838 8731 -198386 130608 91939 70379 374932 58699 14991
11971 -144609 202190 105503 -20215 -207862 -331417 233436 319356 -99201 107374 -225937
11960 -342921 -111390 20540 -60166 36828 18937 149629 -398935 5543 274649 124576 -223032
11948 218023 -53791 -284323 136000 -260033 30126 86800 -102210 322511 -69235 193847
11937 122454 -280038 562704 -121818 17409 315433 29647 340960 -41645 -7699 -71563 113348
11925 -59799 150849 222717 -45848 157105 -98762 21407 -20976 245339 117800 -37610 -125156
11914 -125156 449456 339063 266238 -151356 -138863 41606 155389 155182 55572 -93361 35198
11902 -134664 -108316 -179014 9611 152766 -304781 142941 2113 37758 122788 -285447 104967
11890 -333215 83716 262553 -13068 116013 -187907 -199083 94724 -111526 48545 -130789
11879 -95431 131832 148538 21332 -264381 -463927 89844 -462199 -324525 -108120 -147788
11869 -147788 -7283 -70306 329778 -152961 72305 -195849 -123831 116008 206947 16812 -188140
11857 -119665 24891 337829 247679 -363780 -189996 -108498 -209945 190418 -195355 -186624
11847 -186624 -177911 -223281 257354 -283950 -71890 -8403 166028 2415 -109998 -27191 -32664
11836 -32664 -201602 -155884 -118205 -212841 -78405 8935 40373 -55039 114581 -20655 -356300
11825 -356300 75244 -35789 -257040 -291249 -13197 20454 57480 52690 117118 79919 -50303
11813 149808 22772 10999 -149994 211944 146737 -78826 -94264 92340 -818 -102374 42016
11801 -111773 -125376 -207964 -79702 -293638 -93916 261551 -87023 -167592 -17397 -121385 -77689
11790 -77689 17546 102893 -81480 131682 34684 27813 42952 -426618 117629 131465 -196644
11778 71649 -163236 -21945 374114 -97413 -412681 -319840 -242696 -247121 485735 -59794 -122793
11767 -122793 -102427 49068 50168 345852 -205666 -60260 -195990 3231 89285 81292 54907
11756 54907 -46513 -133459 -309593 -211280 -85753 -31241 206816 -133391 163921 121530 90753
11745 90753 360398 70673 69677 -119664 367532 -41379 233733 -46453 -178462 -92757 269312
11733 -77496 -65816 115976 -137187 64711 389575 75226 -15736 20947 263981 223 56544
11722 56544 49342 -18434 161877 96927 176459 -122019 -29071 334182 191912 176166 -196953
11710 41488 35844 -5972 427983 -207048 142761 -123209 171892 -224309 -136408 105768 -205000
11698 94013 64491 -6093 505481 -58188 323822 -53821 30216 141403 119885 133283 46117
11686 -59650 232659 -169256 203914 9642 -308287 -25960 205988 -177371 89775 -25673 6083
11674 -271009 148587 47313 -9279 257795 -128501 115245 -172173 45990 64198 394377
11664 394377 -106376 10817 57133 251549 132420 -65866 158700 242442 227311 155518 -49173
11652 312724 -169225 -56197 -40489 139153 8109 94120 -304291 -223098 31796 -302553 -116193
11640 582883 -136318 -143062 -76269 -98800 123405 185334 -93763 -106170 5203 -15915 -173891
11629 -173891 -98842 90420 176284 73970 170690 -91765 -97575 88257 397769 304378 -197905
11617 -135672 -86312 -29509 43333 -99898 63269 -48223 245940 196299 193665 258675 -36728
11605 -6869 120959 190286 272554 -28899 -266155 245884 -62798 252168 74812 -98548 -63911
11594 -63911 189778 101696 263307 196110 43026 388267 199246 118598 -86008 -61852 176044
11582 34090 126336 49899 -124125 222148 93380 43372 -9150 234055 63596 19094 542765
11571 542765 -38561 -301970 16054 49189 253135 -13461 -210352 -227955 69948 226351 151903
11560 151903 189770 69272 45253 -55502 113160 30751 -3818 159796 39479 362242 -155499
11548 445403 -23035 165411 -56380 66271 -197507 89921 214287 -7256 96954 149969 -26761
11536 -109841 165816 489828 56841 19826 313664 -82503 -131525 134438 -131557 85895
11525 279140 201405 65498 166887 -209576 -57689 320962 238839 -61679 -257587 -208718 82934
11513 -284716 124502 -74623 149018 -37313 -17734 121632 626064 139546 71186 60565
11503 60565 285993 352255 290658 -165767 -40261 -166920 -34667 53217 446684 87565 79513
11492 79513 377519 180547 403974 88486 207242 95320 388179 329734 -240378 -19175
11481 168725 118688 435423 152351 242875 27964 323142 27125 35181 105277 -134046 -131123
11470 -131123 308439 194103 497448 136790 177358 143906 314765 -84494 9682 -68024 148127
11458 217107 -23413 189011 -79557 178316 -306803 -159318 51042 127598 504329 217849
11447 170234 131521 -92497 -50444 -14358 7343 -155134 147483 -114488 1698 491129 -98601
11435 1798 166620 279801 411002 170764 -57304 -16242 13561 -28951 -43587 -65043 -21664
11423 157074 -184111 196724 16079 238159 121168 340206 60791 -87654 18680 153413
11413 153413 -98726 8217 207590 46858 -193374 -50465 209310 32290 -260403 325288 -226627
11401 11519 -46063 516687 141105 -271761 -8833 -154102 324615 71464 -112580 -30567 425847
11389 42600 -74559 237265 -18421 -19343 455360 -204940 13741 -89848 143386 321258 -53000
11377 7699 44034 246330 75102 -20459 39528 -86585 -22519 425741 -25019 -34983 62083 -39330
11364 92722 -22491 -209263 -168364 887 90320 254590 -101703 362331 555026 228300 16262
11352 -94440 -171702 3610 -76361 304492 -25175 -277834 132137 54918 139574 -73003 229808
11340 -201781 108751 49457 8499 -249195 -260339 -37257 -300746 -125371 -25653 78600 -119408
11328 195656 222348 -74557 263988 -100566 -268645 -197222 156278 -27962 -211670 -120103
11318 -120103 -139563 67792 140868 -188722 153079 64445 126773 31562 35237 -51530 -107997
11307 -107997 63298 -136204 87535 -92408 235582 235662 -89988 -196505 -288525 -330686 -219685
11296 -219685 -91725 189744 -190632 -71182 -96639 272997 27867 157503 119093 -9285 -10816
11285 -10816 104928 130010 313868 -191803 159486 54304 -130011 50103 139685 230172 49318
11273 119701 94688 -79851 122733 -219926 -7956 49640 -247514 198815 206336 -260217 -332537
11262 -332537 -215283 -46190 -127859 14628 -224647 -36581 -206598 -115876 -300536 -235373 -306932
11251 -306932 33468 -83869 -308171 -21056 -159262 -94076 -53400 -26327 -258517 -252551 231583
11239 -500459 -203081 193723 -8990 131105 -292436 49715 80926 48944 -61218 76329 181037
11228 181037 119630 170552 243988 -61168 71377 -25175 -67961 188066 -328955 -47451 131767
11216 49207 166194 135726 33472 -217900 -383245 -347537 122853 -219894 -85447 68248 -104311
11204 315614 151073 25719 -110632 -349443 -206197 217473 6755 182734 341278 -156084
11193 159191 196657 48967 17393 -249493 211880 -122486 -51562 -8077 -177568 -12798 -44414
11182 -44414 43438 -99471 -153580 -261492 -100436 68299 -6798 -60122 -598342 103634 221453
11171 221453 40381 -54227 193429 -162124 -164515 27919 229491 -83564 106823 -121538 -105348
11160 -105348 -225594 10883 -29936 44952 198299 58290 23453 75996 -289418 12201 -22184
11148 -33112 66122 201209 -259548 218155 -61173 -233043 331942 68278 -83556 8211 -72583
11136 -164543 147187 191577 139817 213687 113060 -70805 133803 102929 334276 8246 42871
11125 42871 211316 344507 -38231 80517 212659 -286887 -53552 139600 224719 89124 -88971
11113 -46751 -268600 237244 134811 128449 -109067 312598 297183 317128 192822 61675 256193
11102 256193 87724 40911 145485 72921 112427 373719 126915 24718 159572 207854 -25818
11090 267939 -294528 257884 304430 237263 201411 310436 203052 -84995 -82117 29129 -30505
11078 18932 167880 245681 156201 60514 227903 210126 322007 456793 22463 343466 484758
11067 484758 436896 500287 214892 228713 466688 689695 345388 435880 518840 288384
11057 288384 694248 436614 661319 491387 540055 658468 481412 734716 556290 629207
11047 629207 327078 433607 806465 629637 643097 692747 824633 917965 583419 543183
11037 543183 831093 583801 923917 440457 644922 710427 523506 748417 476903 1009977
11027 1009977 600163 764614 440432 374685 515228 490255 700277 998853 644422 433942
11017 433942 553452 791886 638426 856426 486649 508035 708239 576048 429659 286974
11007 286974 448623 660058 608185 415992 340416 814151 441369 687663 876307 424878
10996 577954 502604 925237 765255 633904 943283 735240 779443 621641 897640 676736
10986 676736 620100 769751 1212579 970911 931328 919314 1344635 1110911 1773104 1663734
10976 1663734 1836028 2210204 2496269 2634483 2795535 3159166 2834256 2961192 2584350
10967 2584350 2750066 1946822 1833302 1872964 1261490 1579886 1466840 1688921 1869894 1587077
10957 1587077 1564756 1682659 1579761 1229879 1121004 960877 791811 1126766 895010 495514
10947 495514 674417 504812 184295 224051 153140 154665 -72860 59771 21900 93037 -58215
10935 107620 546303 -27171 55364 -296269 358703 -93689 189279 -35609 64178 4142 246065
10924 246065 133427 374798 106605 73842 57303 429694 6113 -33145 -152235 -93429 58638
10912 -82093 -32284 217469 95759 -223756 436404 70193 -83045 186108 -210728 10839 86968
10901 86968 242602 -201551 -8683 -131511 -17033 -34678 149421 -61957 -107051 456018 -185852
10889 -71349 159911 -60003 -186043 -82205 -352847 -276624 -147800 83797 58334 -58440 -58333
10878 -58333 24832 205586 104558 -300411 -21528 -206041 -41952 -52235 -65713 -128756 -15735
10866 -52109 -292206 -55619 -160870 -33777 -52621 347682 -308649 -74509 25165 -62622 200182
10854 231793 203946 140109 -1196 171558 72065 -26389 114714 -200536 306573 228215 -41459
10842 508539 -60380 -177028 -44742 -193566 115669 116037 78910 -142825 139089 150367 174812
10831 174812 -139671 166771 -17706 66373 67130 -321600 -12731 20750 137020 23786 -18820
10819 -47781 139018 141424 -67738 -130054 299005 79983 14172 -137272 84635 195407 -80704
10807 -284926 44301 247664 181370 -353121 100653 178357 -17362 43006 -165552 45908 -310022
10795 -296381 83032 30448 192838 45714 283749 -308299 324528 144139 219036 118725
10785 118725 -762 -192441 -274547 -280192 30017 -224249 -23706 -277352 -223518 5008 -86966 -49923
10773 -49923 67286 -329030 121681 49845 153012 13493 -366751 -189591 -35021 -27470 -130276
10762 -130276 -28525 89223 11077 -158487 159696 -142589 10739 42870 97540 -111176 -270254
10751 -270254 -25009 27503 -74392 110167 -298496 286800 84609 -260681 -119937 -145503
10741 -145503 -19782 284888 -18534 -117879 -29468 -160044 195773 -112178 20999 1560 -62082
10729 -79807 -223000 63928 206298 -271044 -45822 189932 -149282 -177661 11642 -182973
10718 -84158 230572 -249900 -130210 -124359 -99012 184656 -41780 -66598 56090 87902 -64995
10706 -155214 49640 -153128 -198324 -238413 59913 61311 -200755 -265743 -78501 124315 31925
10694 -207262 -105975 277393 -261060 -49813 -329820 674 93417 128472 -283504 -266702 -307794
10683 -307794 -484849 142909 42678 -75896 -215822 -220027 328866 317242 146049 -6579 -1262
10671 -101455 -295855 121185 -106132 -86139 147348 326941 -218676 271689 101893 123805
10661 123805 -139232 -259787 -226055 168757 159180 -60352 -216748 -138946 -147656 -247136 -31139
10649 -157418 111374 93663 -275782 -66465 -344650 -122212 -141442 170677 -40977 -93721
10639 -93721 -350013 6964 -49711 -90836 498638 -313426 -132192 239261 -14154 -53061 -87617
10628 -87617 59475 -142894 -168548 -225513 -144042 -202365 33501 76086 -268542 -192224 -69656
10616 -180196 -126847 219126 11767 -256312 22537 -158715 -30734 75581 -8912 -145100 237977
10604 -298967 -228257 -214624 -83532 258790 -262845 -315244 42016 -44121 84068 108094 -13122
10592 137275 -404382 -174876 -268728 2707 -202786 42190 70647 -66864 76547 -87622 165041
10580 425085 -71047 -202003 -386228 54050 274316 134973 21741 29102 -133178 59581 -130085
10568 95498 -153007 -101249 134062 259683 40135 154803 -67202 766 137653 34980 -308565
10556 -249767 -1644 -138368 -18705 22807 261078 152382 243302 -292360 109106 43356 -88467
10544 -150352 67534 58671 -241436 -225882 269764 -311179 383907 970 -281625 -324651 83255
10532 239182 80253 299366 -114939 1941 374597 111846 -58005 -74988 -125476 94378 -263413
10520 142870 -63319 -134909 -478114 -230755 128404 -89465 147940 -60525 244981 337771
10510 337771 106162 273363 -163136 39128 168528 -60751 -415694 189654 160302 -111257
10499 739595 -141147 -126430 -51268 -309630 16121 -57218 -168866 -133210 100475 -131613
10488 252335 251665 -214361 58194 -333251 180165 147261 361130 -200876 358492 370798 483068
10477 483068 181680 229881 294558 65165 -10285 -72402 -57793 40413 238903 -126082 143988
10465 121685 195301 -176482 -113446 -16487 -144932 49451 59789 132543 -123071 3360 116454
10454 116454 30319 189261 -46558 89422 110219 -176489 -334058 -29856 169680 -24882 58368
10442 -86380 66350 -75630 80153 -278203 -103905 -106018 144778 107041 -20845 -336779 138870
10430 -131839 -37817 -59500 77273 -59284 6093 66300 -61410 41317 -34549 27309 -352439
10418 -229321 34382 -75311 108825 -247011 -152642 103983 -297028 -145216 2607 257525
10408 257525 -144141 339241 -92511 -97540 34937 337141 63411 -5783 -106647 -114625 113644
10396 142952 66585 167043 63546 228042 133153 179229 359676 90063 186890 -40535 231814
10384 -6801 70883 442350 86237 142504 132310 32091 202600 47711 165225 90830 543705
10373 543705 451203 528857 -237302 431642 276275 279530 486001 460551 103508 123897 379230
10362 379230 275130 156471 538941 297135 101018 337617 305583 -69449 144527 636231
10352 636231 78441 500617 960032 386994 223723 290917 209605 311349 539809 193372
10341 467810 71281 52690 156877 183390 408638 252355 -71611 82042 93952 -138608 171789
10329 98761 -152870 -47962 99590 207076 424005 -82309 844 435325 105597 420072 181065
10317 258106 203099 68199 56262 105382 110757 72920 166186 -390850 35955 -109069 140507
10305 -40238 328007 -4654 -270350 -127319 83582 12257 -48590 161636 -79644 -75134 -31039
10293 -69863 -114099 208192 -84789 295132 -10310 -193318 79620 264176 -152254 -47870 -399243
10282 -399243 -128659 -35613 210716 -342876 -213657 -255890 -124491 175118 346450 137972
10271 194315 61976 34382 -155996 -32151 305669 25364 -74024 -313917 53389 368177 109400
10259 -55821 -25104 -12508 140662 691067 96224 352119 -44628 -11387 -18325 290070 -164703
10247 -20277 -99619 -148446 157457 -102192 -173733 -143666 -80073 180059 90790 -100692 -156625
10236 -156625 -160498 288665 -266717 56743 -373310 160691 35644 30056 -107700 112698 215351
10225 215351 52421 -193062 260211 -46599 255913 -234187 -64591 -177340 57412 -306544
10214 -74959 -135840 30817 -211306 237403 -214025 -121329 47472 153068 366295 -97914 69211
10202 155428 -238209 54582 -567123 7911 22077 41219 -147371 -88596 69095 -158645 -108665
10191 -108665 -187572 -307526 150311 -132988 10162 -441 -297940 -30910 238641 -146776 228069
10179 32625 -55839 141856 503405 -148646 34255 -124316 5157 -32409 264271 54095 399747
10168 399747 -106239 162966 157604 -161676 -155110 -197339 231650 255939 226614 -95275 -177890
10157 -177890 -43957 -671686 220016 -34746 -252610 123520 -219932 -184839 -63266 53178
10146 -261045 -88495 -17401 -102672 57075 202192 255863 20040 220261 -84438 65618 114520
10135 114520 -221818 -16991 -175373 -351568 115661 131519 -85802 154128 47614 -102338
10124 -210023 141062 -270619 -302202 -210535 -99065 -56520 -342582 281072 181572 65356 -208015
10112 -7058 -104219 -153353 -17186 69848 -67791 -82420 70037 -243894 -42166 -104568 -158745 -153484
10100 -153484 11098 -64365 65553 -60228 -31708 -114322 56889 -42635 128952 -200509 96528
10088 -128883 -264247 -18951 196745 -47561 96613 -19953 -106232 92656 -37071 -135258 164126
10076 -337918 -28050 48623 -39065 -334999 -126120 -228561 -216053 -122773 -188819 278806 -292513
10064 -97986 94326 218942 258038 126290 -328591 -111979 -190339 -112523 -125493 96057 97512
10053 97512 21554 -139056 -89530 -129968 -458732 -88065 -138050 46517 -98736 119170 300955
10042 300955 -24139 -53754 -209147 -99483 175250 -81963 -16596 -97908 -147650 214495 -379285
10030 -163342 -215481 10701 176492 -43202 18556 -211871 -475233 -405795 43793 11202 -267207
10018 -344204 -135843 -231028 -111320 131393 -248593 -164621 -340046 114154 34067 -86523
10007 88123 -87400 -59864 -218800 -82384 -250718 70046 -63070 14241 42630 88206 41039
9995 -68118 121570 73016 -84874 223175 -250543 212982 58730 -180063 -192173 -333108 288001
9983 202319 -167914 -38683 -9156 -261512 -12563 -29113 2977 -37814 -23029 -62580 79529 423763
9971 423763 166187 -57382 -61852 29653 -52951 53158 -198825 -52917 -37410 -204698 -390947
9960 -390947 -229940 -10575 -71025 54936 -129562 -184176 24358 158469 57798 -68820 166638
9948 151769 -157509 -117646 -48481 -27797 247974 216266 75089 -83930 -229456 222338 -251261
9936 -353056 -121893 72143 72694 -538366 -42278 -321862 -373758 -15884 -333300 -184867 -23928
9924 -254874 -78620 12330 -122683 -111441 -69188 -283256 -299232 212825 -28227 -70019 -224
9912 -15005 -2215 81116 52799 -88574 -13236 -41766 -53404 -103655 388228 209332 -173333
9900 -180802 188984 -165198 33416 -67896 248849 143334 -103528 -26065 -153228 194335
9889 -294166 -109678 375 8933 109426 45940 230344 200812 -95386 -145874 -286419 -137106
9877 -48302 -453084 319307 -135416 110201 -75090 -111513 -289496 -61443 -104197 -366610 -26580
9865 -197041 -183804 -139753 -32029 -215149 95136 -130154 -9779 5643 -73537 188644 234477
9854 234477 -46398 -61928 84993 -209598 73274 -221560 -6505 -146798 -350215 2141 -138974
9842 171018 -208683 -174467 -36617 -32086 -229872 -257859 -391799 51544 275228 -144359 43138
9830 -86621 -121547 -303028 156615 45464 253963 -18976 -104304 164839 -190125 -31873 -68928
9819 -68928 -39189 -90657 63632 -50079 65356 223236 -64054 -84775 -19605 243405 -76646
9807 -247505 -101696 -474172 -64390 249240 73373 -145578 -357068 192063 14288 125979
9797 125979 -171037 60565 -19199 -79700 -146499 -91605 21774 29825 -38478 -28126 8302 -76321
9784 -57506 54777 -157271 -35507 -144867 -79126 -50898 -203481 -180342 -12701 317746 -32254
9772 -38200 -160099 -60255 32996 24597 -59137 85017 -126581 -411062 -10287 443162 -222852
9760 -55072 -53165 188592 -204393 170505 -280113 -292659 -149828 -395838 -11208 1003 233873
9749 233873 144401 -150897 -237121 -72104 41483 -73924 147518 -488540 101397 -338711 -219694
9738 -219694 124592 -320203 -69042 -314322 -192813 14887 191723 -403764 -70226 -283938
9728 -283938 101220 251975 -114812 -202263 -139897 161658 -232416 306298 41174 114631
9718 114631 43107 -127232 -55068 -29129 -32198 -64711 -54464 -102759 0 58084 -180539 11724
9705 -33853 -191217 78379 -134753 -193233 183638 363331 -321782 64084 -227863 339468
9694 -36726 206624 -48493 217813 -225475 96453 -337992 -400233 -251239 84257 84572 312842
9683 312842 -128614 67214 118466 -132797 -59547 -57185 -268953 57430 -174031 -394309 -107458
9671 -244864 -159939 -149756 -432161 -426340 188716 24673 56177 155111 20944 -129703 -134648
9660 -134648 155531 76338 48216 33815 53335 -135766 128498 -129906 -278365 271971
9649 -203518 28809 -79882 -258005 10530 168294 121314 -105121 816 163917 -105514 -19885
9637 -187713 -174228 -323992 -281858 -143877 18582 -83081 -308034 -290672 -135275 34556 137516
9626 137516 -156902 -224293 -51177 -301391 -49402 -318814 44405 -120195 301792 -205238
9615 -255511 -268236 163977 -10726 -107271 46142 -16110 89198 -88601 -42716 14391 106638
9604 106638 -114675 -226005 22755 -16198 264599 -75775 43535 27404 -257572 -56035 -101797
9593 -101797 138739 -160974 -40109 -74082 -294695 -44892 78827 88955 -56625 14055 -111886
9581 -294072 241733 -375705 -8000 220831 -302072 -167703 -141241 -220262 -63216 -414380 120250
9569 177533 -116101 -65748 -126425 -21754 -26779 162529 175440 -131494 -388637 -72630 58414
9557 13101 537773 -442055 -531982 -102629 227249 93276 -586600 -280663 152197 128124
9547 128124 78763 -331609 -217904 430957 -244596 -212536 96733 -136812 56355 -113118
9536 194553 41281 12701 -91140 -179971 -33885 86623 137215 -290647 130241 -202901 223345
9524 -245403 -116823 -2251 -204790 125928 79240 95820 177452 -331639 95195 -159570 -43776
9512 -167898 112218 -162327 47754 -282771 146487 -285028 62000 -160728 83828 -101542
9501 65191 102131 -351534 -50030 130815 -181096 240771 -158146 25904 -75311 -109603 156678
9489 258613 201187 -261129 -334588 69717 64001 -276160 -348585 -188184 275718 50569 185138
9478 185138 16943 -120825 -91192 50695 106001 234725 -150008 -55535 -155493 -51367 236097
9466 -28681 67854 343767 22657 -225126 -2840 -84751 -305932 -76707 -69101 25759 -70141 160397
9453 81998 183767 -324582 -6239 305945 -162934 -162666 -77456 -106831 18288 -440995 -204840
9441 -150729 -253603 -342854 -52899 -42649 -113156 -133675 -91339 -251467 -57654 -33088 -36022
9430 -36022 117747 -235595 -130459 207900 28975 -212458 100504 -168070 70189 -365000
9419 -17589 31420 -206458 -335991 13154 152412 -125926 78490 -24777 56592 11174 203732
9408 203732 49441 -8288 -256369 -41591 84618 -60993 -149234 -283451 -1618 -216911 -162378
9397 -162378 -54852 103431 -123323 76617 74377 -311713 256050 -150480 -251888 -43779 1769
9385 -308892 105937 -48790 -315205 -32926 -49217 -78367 30958 -368764 58069 174110 -153933
9373 188026 -358780 72845 3710 -79675 -231402 -144476 -405267 -122195 -77635 136335 -9758
9361 174779 163742 -203708 -220964 18861 6379 -60400 -354932 -126845 -26150 -303271 124160
9349 -325272 -105765 232549 -151246 -192204 76205 -35296 -407971 32646 89039 -211172 -212327
9338 -212327 -185837 26609 -173989 -185274 -76212 -174119 -193135 -213377 134681 16102 156423
9327 156423 80619 -25618 -284263 -86789 -246090 -9846 217860 -75732 -199949 -604050 119269
9315 143825 -93394 -50056 -345456 119046 -58228 -34190 -97245 -123652 -93744 -175196 150981
9303 195141 -218778 -110601 13356 159918 -190256 -106601 -39233 -123761 56119 64883 399117
9292 399117 -178886 137082 220503 127750 -158954 -462989 168871 -79298 308362 -164319
9281 -249603 -58583 134370 -197468 -63824 7466 351979 -280017 -113601 -143828 2731 -87219
9269 136221 -449073 -31963 71266 -317612 -254189 -112064 101876 187015 -85191 91462 -206309
9257 -378595 342736 -111403 -126263 -129227 10567 167148 -61605 -72639 172911 105221 -160398
9245 4518 344662 -116579 14088 86719 138168 -109173 220577 -9240 -167936 -187514 12598
9233 -184359 -324509 -89615 96937 -104525 -27096 -4643 60582 -402617 16332 -167063 122519
9221 -31806 -120899 -163786 -200128 -117679 164521 -160514 60857 -14267 -184809 33626 -68591
9209 47093 109494 220342 18498 -109921 -188563 64930 -134838 48489 11180 12254 -134027
9197 42432 -146742 -66507 -14473 -31823 144910 -286339 -227382 -177360 454781 294633 22127
9185 128251 -19477 -162436 21259 -512 295977 -66294 -222126 -238113 -194757 -183271 112283
9173 -123953 -206673 -101970 -221457 -65415 48333 183778 109445 246507 -350145 -131862
9162 -103821 -46941 110287 36802 -259056 -213117 -380979 94851 -13378 -141201 117461 159259
9151 159259 352998 -254602 45148 -120175 -59317 -188358 -79025 -199657 -272153 -97769 77577
9139 17670 344707 -103389 -86315 -109934 154924 -125734 129864 -284999 3790 -179526 -305858
9128 -305858 -133886 -150916 33061 105144 -200573 33529 -78844 -121397 99196 181165 -11496
9116 174458 -9661 -36929 -184485 -28005 -169059 -201601 19586 -174575 -1578 105564 -134181
9104 -173005 -154499 -20798 -154183 -77342 53546 -147159 -104762 115244 -141641 -157040 -256695
9093 -256695 -256861 -124188 -424219 -325170 -128755 79018 -262712 -93598 177643 -27980 78607
9081 -295417 18324 -226292 -29429 -83839 56639 -208244 99602 33124 -178349 -165841 235693
9069 17640 -315880 232778 -125610 131327 -59732 -161524 -123502 285530 -261643 -234481
9059 -234481 -99696 -213708 -194003 13193 -280342 -170696 -32288 -275649 -163103 -78911 49266
9047 -71022 241795 -296494 -310883 340578 -73287 202088 40972 -339320 74677 91000 -230861
9035 216845 -43072 25776 366804 -90673 121475 142169 -23610 -244534 -219976 -59239 -228161
9024 -228161 -107270 -40140 -49775 -218999 -18397 -62616 208289 -121752 215827 350394 -204432
9012 -160691 114990 133631 -285733 -41217 40396 234984 148415 307247 -51655 108691 142413
9001 142413 -172822 -265056 94486 -28458 -291290 -304947 -11519 -2171 132800 126960 -18584
8989 245667 -315833 -103253 -73546 -134857 -52468 -83526 -313658 -296874 -155945 -236986 -181163
8978 -181163 -129716 -5431 -111934 163376 -183701 -228364 -135919 43325 -2973 31463 -182422
8966 353358 -132830 -95169 475785 -105326 88074 135581 72282 -255560 -147312 176875
8955 -359021 -204493 288114 -184609 -168163 -84347 10859 -371165 -228267 -88617 -360061
8945 -360061 -194582 -80967 -172431 165575 -86958 -120513 -260785 -47032 -117897 297290 394512
8934 394512 157665 -183277 -337831 -93779 -332340 -94719 -150123 209727 374169 869664
8924 869664 2098081 4602367 9939402 17006723 4056398 1561423 1245449 830681 310930
8914 344844 8516 -171303 327149 333956 234829 428392 894741 -51893 387055 -93990 -63395
8903 -63395 67151 8306 -42476 186797 173051 96887 66946 -36049 -186161 -108773 -4885 -228624
8891 -228624 -159312 -342736 -100587 251568 -94501 197324 215384 115204 56899 273484
8881 273484 -111935 -161965 -2016 -39166 72923 -40235 153941 21408 190656 68222 -149088
8869 -525236 60194 115640 -245166 191584 -155625 196355 -239872 5984 -382852 244322
8858 -45779 447019 -227736 8071 -119228 -246344 353196 97821 180194 -182655 145690 -3777
8846 -185221 -206118 -120262 264994 -10899 162579 -208952 40655 -109256 99614 -306684 -245476
8835 -245476 157219 115700 85392 122725 -184417 -126126 -62406 210942 -63258 145075 53351
8823 -9440 111635 83077 -36598 195455 126692 100546 -24233 -123183 90350 -41446 3906 395368
8811 395368 77611 -217017 -6934 -169817 94092 -168530 -104088 -455474 -112790 -93452 -4956
8799 390942 -95624 -207405 96699 124046 -19399 2018 6964 -52239 -8052 -180610 77006 -92000
8786 119569 -154632 -151811 -273659 103741 48364 -138760 246816 -153977 -230933 45620 -57252
8774 -9606 -73593 -165447 -75631 219233 -224091 83280 154239 -22200 -147016 5128 1666 -188372
8761 -213873 355197 -64724 110698 -257730 -74181 255774 64067 -290317 190167 25164
8750 -96956 97474 -161441 231366 -208830 -187964 108927 -318937 -70696 272502 -67238 -268605
8739 -268605 263191 -63438 -169280 -13328 167925 110053 48944 -323382 -126478 -134818 -21081
8727 -119250 162012 -223256 -136350 -94793 6929 -3906 -19135 -106579 64783 115543 -76655 -371176
8715 -371176 49875 -41179 -496617 -537657 -12516 288160 97516 73692 -260235 33459 187637
8704 187637 -198266 -350951 2625 -74157 -80260 16156 -103705 -117685 184562 -340641 34676
8692 -349765 -235883 -50065 -195198 -110013 -8581 -213956 177967 90504 141213 167098 77754
8680 -223030 269009 81152 215838 -320660 -221562 -35899 -231724 -300561 -37625 -138922 86658
8668 -325392 -59457 32619 -52672 -91709 212594 -175453 -13575 106045 6333 -3499 -73477
8657 -73477 -81181 -302415 -189140 -94398 103564 247227 -310028 -469129 103904 208581
8647 208581 -230302 141479 -66745 -54671 -300331 47064 127945 255349 -70831 -76603 86652
8635 -232457 -197214 -183709 -290164 -40454 352302 -35853 -22288 -41442 -72258 62144 197971
8624 197971 1510 -190005 78477 5273 172481 -208006 -838 -169146 -48856 -186235 -207544
8613 -207544 274339 304700 -177356 456699 -263038 -150157 -82580 240363 -51315 -153299
8603 -153299 -88972 52776 110317 24664 -331351 -202456 -289297 -241132 -94861 130907 -223960
8591 156693 -120334 -129244 55574 -164424 -144656 -305697 -328668 200118 8748 101994 94799
8580 94799 -175205 -165189 -238884 15080 -322501 -104429 146248 110630 13049 -243106 39266
8568 -192115 -211671 125099 39814 275364 -80110 -350909 233280 -35664 -314815 -214085
8558 -214085 13569 41360 81693 -329286 166417 -222451 -70413 118370 -65912 142572 -144662
8546 -251718 -67696 238645 -158074 -149975 289997 70044 -67891 34074 -467918 -111824 -345918
8535 -345918 -133498 -49268 -161684 333689 12495 -56927 -197649 -139811 122389 -225924
8524 -76560 -43918 -17345 -164513 -136936 -318986 -50578 -8572 48556 -184139 182448 171151
8513 171151 -171137 -222455 115809 18958 -287746 132750 48048 -104751 195574 -139435
8502 -13891 -173461 -174622 -394489 -289650 -84697 88593 -228461 -161902 -109259 -202362 25490
8490 14937 -359984 -158284 -411526 -69059 -75998 -208063 13360 -148115 -141176 126617 159505
8479 159505 -100132 327599 -253404 -355978 -276438 186773 12765 -21087 -21158 -104201 -76327
8468 -76327 251559 329333 193288 -39408 28538 49793 94539 -107786 -59440 106533 284692
8457 284692 -32134 -307853 -50046 142231 -138583 -173193 -266598 111470 -221378 207224
8446 -109448 85108 212022 140791 379248 -4524 -203466 62759 -109712 -58492 -110144 -345893
8435 -345893 91839 206967 -95592 -181745 39313 -397626 -276096 73695 -299723 -402316 -295536
8424 -295536 -319815 -172416 77321 -277103 79403 -34634 -41196 -60604 123335 -37681 -139314
8413 -139314 -200917 -25546 -189515 102585 -179210 -146615 -283306 -393321 -120864 62883
8402 -80196 -109899 -485493 -288827 -66679 -174845 1468 -238428 -154149 -73948 -253013 247874
8390 98393 -86468 -282954 -309891 -144831 94838 -169300 -142692 -34632 -248725 -121335 280929
8378 10339 -259033 -312379 -185996 -157233 146250 -48804 59458 177072 -183342 -281904 -10540
8366 72307 -210102 56868 -40320 -135900 -230216 -486497 -153939 -52412 -209810 -80890 91990
8354 -528864 -141443 -158389 4949 189707 -30157 -251951 -51555 32543 -74514 -1385 65135
8342 -225681 317765 -17863 164993 -159131 -566052 -119477 92316 19449 -50199 267603
8331 168112 -118979 -195619 -29311 -76596 175934 120689 -203753 -293863 85366 4314 -117523
8319 -165631 71275 -254391 -215926 -78485 266697 213907 -148317 168660 -165343 102758
8308 277615 -220087 -167597 176437 -317871 -307262 263479 16269 -104682 -130436 141490
8297 52004 -208312 -267015 -331692 -223677 -32234 -346009 -264929 170520 -482627 13055 116171
8286 116171 28036 208411 21072 -229756 -41998 160164 -75539 -177442 66819 -119075 350848
8274 -187308 -243028 -80021 -2568 -94596 23122 -149509 74747 -110250 -23275 259395 -78590
8262 -226805 -303744 70965 36787 258050 -33440 -19854 -184655 -340883 -50907 328871 -57458
8250 -124730 -17044 -149349 373687 -93944 -160534 -185133 182283 45970 -97818 512991 -86805
8238 -173651 -252776 80361 -182287 128601 167057 -34647 -35692 -82575 74554 10283 -223185
8226 -146635 139711 -160108 -243950 7255 -95693 -10459 -307834 37335 445028 -168669 -6888
8214 12503 -201955 -248844 -97261 48264 126155 78193 25792 134206 -21371 -166684 -141282
8203 -141282 235277 52910 23777 262844 89254 -183238 -195903 352335 -80608 276566 -25325
8191 -174562 92169 -88809 238881 -190560 -135833 -116765 260663 -222661 181006 32940 -161985
8179 -139921 -135328 -241903 61732 70309 -180372 -389700 232129 4636 62218 268294 -105095
8167 -190235 134350 108097 -115824 198304 -32456 46463 194785 181745 -108685 33758 -443210
8155 -176031 -79541 -68266 -155523 8184 -46486 75825 -32977 -111317 -89804 64528 174476 -341130
8142 -36523 -234480 -140782 154494 -88426 60178 17419 -85889 63770 -371853 -31160 -49430
8131 -49430 -361563 20351 15701 -273941 -10134 -87648 221551 137571 -117643 -196799 -248491
8120 -248491 -106004 -10262 77607 -60876 -203899 -118213 280414 113219 242254 -211365
8109 -89914 93853 -75280 -110264 -120906 49366 -90344 -186508 106602 -219147 -117112 -34137
8097 194445 99770 50782 478241 188948 -1795 -129948 257375 15294 -142019 -94923 -101775
8086 -101775 -70174 -127312 -260360 -256483 -34686 338356 297760 169649 -196844 -286131 -16632
8074 -8675 -160655 40557 -271932 -91383 -2948 54839 -164119 -51070 -257725 252613 -69589
8062 99850 186326 42228 -63749 280193 -36731 210260 62459 -106974 -239709 -69089 81639
8050 63581 33357 11268 -367827 90740 -76350 -246874 111890 -215446 -300286 -190708 77330
8038 -327551 -34388 264320 180951 -226136 -407095 14334 -244365 -86456 -123362 160797 -32297
8026 -31200 91042 76181 -339846 162033 49566 190614 -199486 -142998 -220380 -111408 -342013
8015 -342013 -331411 -311110 -443626 -276656 34629 127877 -140979 -100734 -28636 -160280 -48437
8003 111285 -199551 -209607 -79523 251304 -41628 257801 -194781 194952 -167696 -74972
7992 176875 -102528 -182083 -156807 -104045 137972 -320919 -48889 -200921 -180269 87443 -54001
7980 323260 260100 -330367 -374268 -143704 76440 54862 256523 5525 -290206 -73889 -60375
7969 -60375 -178470 219041 83760 -52349 17515 36968 -123831 209813 -28229 -96174 -101498
7958 -101498 128860 -152345 -490801 321925 -19421 138916 -57012 -44078 -85702 137731
7947 -87299 65158 118901 -127656 -62251 -15224 39869 -158951 -345602 -63660 -119653 -98240
7936 -98240 -118321 154889 304915 -107983 -207873 -390636 22889 -272634 -16714 -206808 148079
7924 -72080 95995 -65547 -54337 203122 -82343 -151056 157601 -63511 -127000 56102 -75172
7912 60280 145596 -78637 -93292 109090 60437 -78730 -138203 155787 -91491 -105561 136314
7900 -70166 -135031 -178181 -5358 -129179 152460 92724 65510 -83975 -210436 -246137 -210190
7889 -210190 338063 -45368 148637 24187 87373 -285446 175436 184451 -33354 83692 -26574
7877 -29061 50131 -135152 -116373 240793 -62666 -233612 177175 2738 -122004 66971 -3613
7865 -388062 43814 -150116 77211 -33744 30288 45981 -120100 -152128 -117605 117826 -291357
7853 -128847 115814 -430173 86972 26122 93184 -32217 -130259 -13273 -41011 40190 -10720
7841 -262108 44941 395157 -274935 -357981 10191 -43070 -158899 117889 -5474 95135 -247364
7829 -230682 119986 17403 -87211 -38372 27878 -211236 -87592 -43457 -51568 -129467 -137087 -14855
7816 75693 -250359 -227719 -13840 -41096 -218387 13114 273555 -50504 -30711 1567 195943
7805 195943 -126252 19199 158708 160452 -146515 80104 -428365 -402494 2581 23818 80856
7794 80856 18590 4428 163030 -9956 -239471 112730 -279604 -52407 -242597 240924 -473997
7782 -101960 -192907 -371018 110436 169520 -180926 -54794 -108610 -200590 -94292 81152 70151
7771 70151 -179623 -35213 -122039 -354719 96852 -152691 34168 -98240 26753 -58947 -29101
7759 158002 183340 -2987 299648 80049 135228 -168314 93052 253418 -150545 130181 -18913
7747 65936 -55811 94454 4450 116192 -54604 281229 -244858 80958 -335825 -102649 50392
7735 -150798 152148 -55735 82649 8035 254216 -161077 140072 -18338 -114001 -2087 120006
7723 -299455 -174868 -144310 -217625 -140497 -155188 120119 -73992 -324370 344341 -19697 37312
7711 132134 -18648 -33664 -17936 -57257 508673 -217258 -89270 94427 -356142 140439 -124546
7699 53163 -124765 -59636 -235087 -223646 256747 -89498 -199524 99297 -16536 -110443 300410
7687 -28208 -177101 -87538 -119626 -85543 55923 144000 -18338 -75951 63748 -7225 -40525 -44731
7675 -44731 27120 41280 -28415 -224615 -47362 457904 -331885 222592 -574109 17770 12770
7664 12770 121529 38497 -342174 -227186 152941 -1086 113262 102463 -137251 270558 -112425
7652 82469 157064 235941 44450 -217725 -135187 -4983 -202368 -68086 -25514 74807 224609
7641 224609 -2272 -80938 -11520 91115 122074 24718 -171387 85242 -67854 358867 -335465
7629 203629 33192 124080 117666 -121034 -5723 30952 144439 -166821 -167196 147079 170594 -78175
7616 176207 91579 -208423 101307 203098 128963 -248901 -223935 -30384 305194 -9144 -79385
7605 -79385 118930 -2548 -244348 247100 -40799 -120455 122164 23020 95050 20503 2348
7593 -137747 -24925 -263916 237954 41195 -15526 36346 99370 -19826 -294091 -194929 -101504
7582 -101504 -60449 -202331 -89858 258911 -252168 -25142 -8381 -155957 -2607 -66335 102796
7570 19195 -19643 -173267 -594 -11960 -68400 -178847 135559 -247546 113010 33980 14774
7558 -152014 -245355 35400 -33744 -360822 40979 -250343 -277137 -173023 -92979 -349970 233006
7546 244640 -128513 -228902 -158565 143542 -240911 -3355 -144243 4225 -93605 -330054 354951
7534 64088 -144292 -20317 174289 117716 35581 -137157 74388 -29752 -135738 381041 83477
7522 -170145 -269296 2273 18367 86877 -65235 -250661 -158519 -314869 -285028 77200 -97508
7510 79678 159212 -237080 -4448 224460 220794 -316938 93671 14877 119778 -196989 22430
7498 -61506 -341385 -158384 113391 -268791 -288945 -220158 -181092 -86075 -244904 -124165 -78356
7487 -78356 139062 -235802 21018 165923 79133 138496 -383041 262604 85504 -252245 -24966
7475 -246894 -25992 64625 -68304 190682 -453245 138746 44941 38099 -87219 -176602 141206
7463 98690 354427 -2334 -162065 -111097 -79629 -295358 61788 216463 84181 110604 -108133
7451 149118 -152726 106566 -398745 129044 119005 -2781 -248867 -65611 -222323 349697
7440 -123707 37987 -296460 -141137 -139623 -231094 85777 -33674 71214 -114488 -368395 -75699
7428 -60147 5713 -67419 240036 72876 225693 19291 17519 -101796 -93334 384868 -107435
7416 -327653 101628 56307 -167317 104860 -184549 -147265 13759 -331945 -232331 47024 39355
7405 39355 -387418 -246385 82289 329128 99551 275885 138148 172222 176183 118699 -49482
7393 166957 28981 -180568 -27412 -144614 -203425 -21439 -70329 -120493 -80792 326006 99996
7381 18190 -75393 -132276 158210 -2754 -319177 -78958 -131926 -383822 38332 284620 92630
7369 34017 -35939 -32265 -33749 125228 74782 44755 421657 24703 -225679 -57810 94996 -339371
7356 90025 -212716 -288447 -301294 158408 -57589 -366798 49371 29313 -87747 167799 -247301
7344 -63903 -27631 212012 -141142 116757 -104557 -196029 89359 -43381 -16678 -264786 91522
7332 -53449 -271126 -55056 -314941 72125 60711 -107980 -225247 144778 51084 119278 -203434
7320 204037 -634418 81323 113957 -76965 -120932 91223 -10447 8707 -92878 -18099 -81109 -193801
7308 -193801 -35691 171518 -147060 -17907 -56325 419695 -358258 52402 100538 133230 -56637
7296 95055 -164769 -64981 315137 -140093 293921 -300214 -62318 21982 138327 98055 -119533
7284 16712 -342922 32426 -400738 10534 -8889 -17531 -377576 -159183 -173569 -75059 -120095
7273 -120095 -340924 2849 93099 205309 -71460 87543 -177427 -117224 325063 219805 -122589
7261 373839 280954 114576 -51332 210423 73469 -128042 -78738 -69981 69464 -155067 -62578
7249 43044 371148 301189 -49394 -48131 -214158 -196902 -128529 331416 103504 36406 99580
7238 99580 111262 -168810 195517 -125704 -182057 -70633 59713 61383 24574 47519 -19363
7226 -232754 100355 -187574 -161495 -119495 -217090 -242832 74487 -354935 -339729 -91440 -148817
7215 -148817 262354 -424696 -20495 -237152 61555 -31196 199114 -291168 -77466 40319 178855
7204 178855 -96042 -117035 -56352 70156 -206612 132017 155658 63007 -60213 -73847 16275
7192 24828 -88830 58420 -112856 324498 -135802 220983 92766 77273 -57548 343413 153279
7180 -27853 -82615 -71413 -197431 34070 -75341 -26867 169373 130170 -52276 145611 183990
7169 183990 -72040 -65932 -124550 112694 -82621 284557 -75123 26131 -115484 -94536 7483
7157 -64918 188665 -136032 -149054 -46006 -250716 -49464 -237418 92773 138928 -3491 17505
7145 211907 -393190 44103 -307805 92315 -153270 -134230 -166250 -153639 -267585 -390091 8978
7133 -81203 -153747 113230 25449 -117992 -973 116196 -151229 245924 -25280 -34247 -136193
7122 -136193 -106574 322392 -155833 265827 -401293 69821 -72344 185412 -426395 320345
7111 -95221 47008 -136398 -167541 26125 29305 -5294 -156027 -423265 57869 -179453 70896
7099 -16087 1734 -262604 -165464 58819 -25003 -201850 -156078 -197167 -116452 177264 70447
7087 110692 112123 -197216 128548 -271797 93952 124443 148799 -34182 112366 -71447 -170845
7076 -170845 54646 -96605 33067 -6554 380761 -107306 172543 184849 45889 57534 73441
7065 73441 223251 5689 -152719 -169688 -175605 14078 -187582 47247 -86010 -24048 312315
7053 78591 248724 -13326 -29305 34864 90275 -136320 -94130 -329275 -133435 -126662 121073
7041 -194051 216418 154975 -337557 -105246 -19915 -49453 -219856 88799 9818 -114142 23680
7029 -37823 -35658 -1111 268300 -182541 6818 -63427 -356396 -170480 56910 -187202 68117
7017 203209 -73210 104406 -23527 -176966 473688 -510499 -182977 -153808 -203786 -271690 -275642
7006 -275642 -172719 -33217 178382 187754 129576 185102 -25376 -83390 -120813 119033 -63713
6994 80513 128854 -59073 -48933 106645 -24373 -117727 -403244 -203583 287172 -105022 -46591
6982 109969 -198651 -251498 172822 -48729 -150743 -317116 -128040 54066 -294478 78839
6971 252851 6384 155559 120361 -115781 -373805 -165933 -37673 -66984 44672 98037 -480208
6959 216107 82663 34706 38904 -45656 266476 249104 -85270 160987 146252 -230066 20986
6947 218184 215688 59583 132654 63587 -95098 159979 -40024 55163 82344 115962 71821 -79932
6934 164206 18197 -126338 -489557 72877 80740 2431 -126393 350616 186446 87387 89945
6923 89945 -363953 -131505 155203 -216152 -131646 -65675 -28365 160571 -322749 75247 300756
6912 300756 -10270 -306717 -70444 -124874 51131 -113562 270961 -50289 -14077 122478 -218843
6900 -136757 -130561 386637 132782 180660 223250 12529 152679 14933 -85977 -88262 53022
6888 -249922 -132266 76578 36692 -270483 186647 -49337 130257 -314441 -185640 156358
6877 -142816 -56072 -51103 188024 87205 14886 -28239 294449 143340 -279359 78455 -51057
6865 -383805 259179 -136356 -229633 -173762 -341680 -188079 -118560 -112556 49763 -60640 -74321
6854 -74321 5511 296470 -179397 -18886 -114445 -34497 -27598 45896 -310422 123008 -328300
6842 146570 176961 1258 325540 135593 -218059 43445 -27513 283859 -6524 143494 165862
6831 165862 6893 70612 161117 67888 -160427 207776 72725 -42484 68019 89655 -179571
6819 -92944 -337321 3611 -51670 208340 82718 143340 -205366 -29537 54506 -426660 -57958
6807 72685 72542 -180552 -208147 -63584 203372 35576 -344887 -151146 -91701 51589 77377
6796 77377 -56590 -147645 -283115 114532 -112692 -76417 -10391 9860 -188590 86723 -151262
6784 -250508 -333431 91931 -40512 -171011 82525 -166929 -12076 64339 402551 73530 -87672
6772 188019 73321 238219 -304223 -160970 -177734 366245 129214 212146 -213094 426759
6761 -199598 -15087 -36632 -64004 -152549 139196 -150476 -20659 -79456 259595 136247 14394
6749 -160705 -43120 -182500 55785 -192167 -112028 -334504 -13385 -8876 255345 -124986 10325
6737 -16374 -8201 -43781 142970 36083 -353944 -138716 -172777 -114407 2783 207189 106318
6726 106318 -216467 -31834 113895 26750 223386 89434 99575 559 -19195 -71947 160016
6714 196963 198273 -74163 -321389 -151136 272919 139349 5115 -250676 -149238 -35971 46129
6702 58677 -94758 -328696 30156 -137644 137634 263957 80321 129468 111989 145631 125524
6691 125524 -343151 -8175 280314 -180 172283 -12669 125551 -38696 -61668 -259139 -145734
6680 -145734 -52547 140729 -227345 -383793 -103752 -260847 408463 68752 -158299 -43031
6669 191263 -101561 -161286 -9330 179815 -220986 176462 -161028 -60649 -224705 -13526 -92958
6658 -92958 -11329 -109651 -171569 -76844 -391750 -57931 -7460 23916 86889 -20383 64709 341780
6646 341780 158517 15738 -46990 -149530 162011 -75753 -95196 -62058 -160903 -250714 138358
6634 74037 -15667 -121997 121032 -214536 318474 -312273 -14192 240357 107303 -263190
6623 252248 39115 -193098 -67744 147174 -248080 -208417 -13506 184744 -255983 305223
6612 49112 -295461 -100823 163003 44290 42679 -96511 29296 -23388 2139 80161 482827
6601 482827 -88236 193052 178690 -129741 94788 -60656 204546 -11028 15478 9279 70952
6590 70952 -95171 -285609 40945 124538 -202654 -171530 138371 -53362 -33390 -123696 -35917
6578 228299 71444 -213370 -148474 -105124 -57581 -6955 -127731 265440 -222396 -295236 -149490
6567 -149490 -124190 139105 46832 19160 40554 -16244 84280 -287472 -334748 405600 -147477
6555 170183 138021 -162878 -38837 -211636 144250 -74907 -246158 -266762 218706 -213351
6544 -11871 -90631 -123747 -29346 30173 -2538 -10651 -38569 172985 -96526 -52987 -12551 -99950
6532 -99950 104695 91927 -209524 -22526 101942 318402 -89019 45127 28802 -109901 231072
6520 -384527 -28060 195563 -336138 72846 -136908 184795 70257 -32847 73152 -122612 -267241
6509 -267241 16295 43553 -253200 -224623 -207859 103862 79643 -151592 71925 166455 273237
6498 273237 70773 41272 3034 44554 75432 -211297 431422 17182 -111514 -386284 8223
6486 -272640 4030 -358914 -170872 176685 442298 -106685 -167201 -291201 -143945 58365
6475 -203194 -20315 -17056 -52506 197157 76339 229194 -17459 -328287 -16716 -42569 21046
6463 199692 9443 70758 158290 -46419 -140196 291861 -435642 -11427 107715 65847 92890
6452 92890 84565 191893 -31865 -89533 -17916 237498 320458 122793 -195157 -180073 -191181
6441 -191181 30198 -68105 159472 16157 -102121 69589 -314630 74897 32781 -92975 -397833
6430 -397833 224357 100633 174305 -169539 -2806 236884 5158 -286689 -69838 -279343 322862
6418 -329607 -254654 23470 -133591 373988 -115373 -20910 102102 -164624 -125164 -8774 144388
6406 47899 -33814 32594 -196960 107906 -117417 -40360 168932 26208 -201496 183261 -219714
6394 11198 64044 -206414 173320 30500 -267738 -349747 25030 -250210 92932 -13930 -65741
6383 -65741 25690 110138 -92318 309496 -197854 -72488 5695 -156685 -317194 -266591 185656
6371 158800 118755 113764 95943 250060 81645 -245354 -59256 39353 -330275 -55779 -360420
6360 -360420 -18784 -83870 72440 72450 -56310 21001 147578 -91777 -98804 45372 190144 -84285
6347 113029 66601 -145495 141742 -359279 406681 212371 -320496 -204738 26196 -51548
6336 -114745 -211993 384764 77290 -214002 -123138 -211673 170332 -259637 52217 -162774 46755
6324 140759 -156082 -274258 -211967 32733 14404 64601 88376 -329847 32425 -169118 188127
6312 -101381 -262916 74588 53794 309446 182967 4852 -107739 151491 -79294 264757 -27133
6300 167943 203508 278587 75473 -172368 -90713 -232357 59145 148253 -251558 -75888 239098
6288 34056 -164647 102648 -290399 151993 -261760 4702 -7923 -90267 215029 -62674 429610
6276 62300 -41963 -259990 -126712 96406 150865 -16996 -51845 32362 -34025 -666 167302 -44357
6263 12498 -19383 -195713 -218608 28728 -17079 -18678 -156791 110506 53599 195416 -38349
6251 -156706 -152845 -83527 -19540 113540 5601 -238154 66063 -152415 -92476 187648 39638
6239 -349172 -289600 114876 -6009 -572578 -148006 -393214 155809 -103128 91939 138093 208422
6228 208422 58073 15996 43553 193325 -103249 -96917 71162 -131047 -151366 113329 -263357
6216 81258 -258824 -372650 -47495 56250 215711 -316838 -27463 -20631 -151077 -23211 104989
6204 81010 -1644 70331 -168908 161288 -61933 -481806 102324 72792 23613 -154679 177320
6192 69642 -9532 642598 85882 -6902 -151973 -123566 99484 -11979 212428 215836 -7059 -62061
6180 -62061 -18616 91305 296445 -76323 1731 -5768 -159899 202571 202827 78242 -113354 24181
6167 199197 33486 -44898 58807 162873 -147967 -220858 17311 -60863 -242822 410 222152
6156 222152 49479 -189599 -204025 116347 -41383 -105521 34993 152836 -62965 -70073 64652
6144 275479 240734 -208916 153089 -91737 53484 176775 50857 -89196 -166958 -392162 -52757
6132 -168137 61551 123839 353176 -144914 -246127 46741 43650 177805 -281109 69858 106065
6121 106065 54947 104437 -28185 328604 202687 -58003 -77176 99053 88531 -36090 -166602
6110 -166602 -239226 -61103 111792 -63232 -134496 160595 18152 -129013 -82903 144986 -144839
6098 -83429 347385 103473 -371618 -189637 40972 -130444 55079 -200803 -2192 -217463 70714
6086 -177211 -154103 -65069 -29048 -312092 -23463 -136089 -43870 -163742 -151795 -140156 61812
6074 -128040 -83374 13871 198011 27912 -230874 163491 -260288 285806 -237527 251069
6063 6362 186397 -357477 -213984 61421 84673 25953 -15515 114089 218720 13831 203520
6052 203520 131818 204023 -161966 284407 77589 97937 107217 -203879 -115307 -215119 277201
6040 -215113 109525 30889 -246301 -339582 -193187 200107 -382054 -71596 52306 184151
6030 184151 -5200 -354814 164644 -80605 94148 -51231 6807 -119599 -225652 35377 44128
6019 44128 -84147 -153879 24476 -259032 54351 -145109 -39234 -154898 -476447 -127294 95422
6007 72858 -289580 -60234 -39653 185354 -103028 -69073 -159356 206552 -60127 132063 243224
5996 243224 -126456 62750 98774 -36855 12768 121548 -142863 27465 89079 -162164 191051
5984 46263 156791 66492 -42335 -68393 74577 -43417 -14434 252190 185202 -4604 215870
5972 -5375 -51272 -25252 177323 342148 -200872 -66264 359 191586 81854 113596 -142023
5960 27582 104983 -369025 74820 91577 -202726 -289720 -60660 179853 -236677 -135367 -8679
5948 -61650 -22840 -73133 96289 -301951 -4618 240424 37734 -117976 231497 112423 -185953
5936 2189 -120655 62990 -168947 108095 -6743 146684 -56718 68117 -97188 58771 -244470
5924 -51026 92414 130930 33370 405776 -65142 20976 14304 -108699 -114270 -181031 -149908 304133
5911 -165305 62591 -92964 -25820 17258 238672 8038 -241659 83301 -105954 21686 -94971
5899 -11875 24557 -173768 -174346 307310 -11078 56923 345237 648812 -144655 -2597 -31922
5888 -31922 356764 -152874 151995 505605 162573 53004 -85946 -132844 -104706 76991 -270192
5876 -70856 48148 211330 -128914 -68770 102941 9258 -209017 445296 -420041 -95785 -25066
5864 170357 12266 -193346 26225 84081 -28309 217005 176698 1136 -40048 -350313 -150124
5852 246753 -119089 -539931 306912 -93946 287945 112773 -39594 -78575 -14887 211317
5841 -127194 -150156 79300 152342 178095 -126635 -48448 -79186 34336 -42434 -94113 40051
5829 -22436 -296 -243271 39651 -432085 -364927 -62458 16732 -62013 -171917 199791 -300156
5817 -205453 262669 2247 -62871 136399 24297 -173867 -117828 30225 180586 -32330 -152490
5806 -152490 125225 -185705 -38440 122154 -181570 -248166 -100094 47851 161691 557636
5796 557636 -12700 -402856 -14449 87917 -95954 -239743 -73401 -78201 29366 198274 -355976
5784 174335 180791 97103 -90483 -33166 125672 -55028 -22664 92534 -6177 29398 -113112 251627
5771 235677 -134345 -268995 -146182 -72416 36754 93580 153280 -119334 166790 34038 156467
5760 156467 -79517 -271571 -2778 -60302 -79968 -26410 -25012 -187495 -276841 235869 -75076
5748 -37578 146027 -155996 177389 -27047 180626 277057 -105186 124022 200095 -109075
5737 -170800 -313409 -77622 390470 -282348 276173 11024 -80603 -202815 -85199 -12822 393724
5725 5536 138398 -161795 109775 -172487 174246 -276858 -44169 -160077 44780 -126196
5714 -190499 -171275 -5613 154755 -124712 38370 -103994 42471 21602 96689 167810 115594
5703 115594 357845 -187126 -216565 -178677 76683 160832 131492 257991 -122879 134581 87345
5692 87345 218280 57994 -129059 -127824 -20419 118210 27427 -34220 -18880 -230004 101526
5680 -34256 -20630 28135 -84068 3113 205529 -49739 83886 -161008 107191 -21467 10266
5668 -102123 13920 519290 -262412 254303 -8540 -967 -483151 242202 143060 -236021 -272106
5657 -272106 25570 -13226 -251892 312157 19901 -204290 15070 -190452 209931 -84542 -130121
5646 -130121 270723 -215896 -62701 -27179 -138122 -237231 -166866 118583 -102740 -387346
5636 -387346 -139761 232374 -134332 73832 -2233 -68063 204964 100549 45562 265858 113469
5624 69942 -323793 287627 -171657 -19207 -166539 402521 -22751 6365 48363 -99769 -78319
5613 -78319 -84337 119369 36656 -89592 9428 -225575 -161426 -160926 328558 -189605 -67636 39891
5600 110237 105347 -292072 -412465 205213 -48703 20999 14372 25272 -328289 48197 -168877
5588 23734 339871 -15930 225826 -197466 -35205 -191616 64388 -145092 43856 59975 -79614
5576 19952 48849 -350739 -18858 -156018 -200658 75798 276498 182963 -261533 -438834 -337083
5565 -337083 -42887 209162 -76057 148866 318861 119230 -173402 -189946 -214968 78626 -131021
5553 -304922 279698 -1264 165748 -128957 193599 9674 143343 226469 187760 67717 442792
5542 442792 151968 -92776 -155855 -162263 23955 -299743 -332119 -39677 -52170 151893 118322
5531 118322 -98447 23685 -25432 -317045 -152669 175335 -219416 -130989 -79532 -61579 -362565
5520 -362565 -126937 -253625 -94149 59294 -134836 222436 207109 106720 186555 -56952 123645
5508 136497 -349566 -223813 -76157 -80368 -96024 96512 -45011 -141788 -86605 -194858 -59297
5496 -97008 164862 232815 59485 -205535 129092 37348 379024 -60038 5237 -46612 -78797
5485 -78797 134193 2100 34597 -105978 190954 -207013 -11359 155587 -238416 278613 300229
5474 300229 -183092 5791 104372 -239936 -365313 106946 -136958 4809 146154 182533 -13972
5462 -196264 -273729 58434 290982 31402 4266 -159351 -225153 92283 -362040 141318 55793
5450 -373129 261463 -209109 55459 70872 2476 155728 104446 1287 446256 -65990 283464
5438 31601 181288 -18223 -174079 -414607 -124386 44136 95204 -248222 -154552 36936 -32850
5426 101724 234721 -492378 -96127 69326 110946 296078 -59245 -104990 -45327 76475 -61886
5414 9826 -191861 -191042 4642 362896 -273022 12739 -393846 -20014 197127 -583425 229366
5402 -288971 208293 -47722 -389387 64225 23639 -1619 -177235 -69928 315434 182120 -45347
5390 -103533 61737 -80824 -186257 -326737 -81033 225400 186185 42847 161670 155666 17890
5378 231134 399482 83986 28045 -118899 -103359 -28122 -123010 -240910 61294 -81606 78753
5366 63696 -347435 92503 -194136 -186249 60432 105743 107173 86280 -36677 166318 58640 84530
5354 84530 122842 51930 -156702 2319 5296 -43236 -489272 206575 -121091 73570 -181065
5342 -62321 69856 86066 24257 220055 -358709 -252608 44354 -191868 -50670 232535 227238
5331 227238 120361 -357317 -238403 -138456 -59485 -4912 29361 -234384 187054 -81193 -287959
5320 -287959 -59169 -140726 122965 -152648 262909 -134901 38628 -53976 -178692 -21282 162525
5308 435790 338993 -196721 18660 103369 26049 -57078 -334980 196009 -29444 256131 -102912
5296 -171165 -89664 -54466 -43440 -66891 -399869 -10870 -168642 -51618 16814 -82764 139384
5284 83303 -189988 169359 282633 -116681 11047 421612 186809 373622 -82089 -195786
5274 -195786 -99111 -85970 -143196 276249 -251939 55931 -114269 -214767 170074 -122202
5263 -154160 206582 -129208 -7827 256128 199873 -1589 -105816 -95417 233189 106893 -10019
5251 235512 -196145 65431 110996 -24455 -139234 -30447 104657 244545 -232316 -119785
5241 -119785 -147514 202058 -50553 -111885 -46641 116287 -41945 -146934 139385 425216 -66157
5229 90473 -125096 247097 -171763 -102634 -87711 -298514 -311683 151493 68735 -169969 -87179
5218 -87179 36847 55443 -390196 -30100 -72148 -166764 -185003 -231228 114554 -108609 85239
5206 -165352 -165296 34472 -3788 193222 279600 -100570 -22311 -262793 196676 -128931 106563
5194 253003 -103033 71606 -63803 -150211 394567 3688 -105217 95228 165734 353058 -57522
5182 -109664 71861 58029 -176972 66177 183747 263056 -140063 -16022 59690 -110071 206843
5170 49816 81410 537874 -83863 -66633 453279 36698 88381 -267514 -107284 361677 112853
5158 56448 21237 -31733 -57424 1384 -257980 -42062 -61221 45579 195200 265459 -162023
5146 -46155 192011 589402 -94349 -36096 -7100 154448 -193091 -500978 -100308 16426 42998
5135 42998 18819 -133799 -6746 -53157 300037 222050 83878 -301054 -399798 -57873 49317
5123 19759 -304870 -84505 -166483 -65029 108272 -107703 117504 -142374 -466464 174491
5112 -27308 194016 18349 225831 -48498 -1196 -125498 261458 157061 215512 -250309 -359769
5101 -359769 -227235 -87664 289013 -123898 -181756 -140667 371350 -189805 285516 158006
5091 158006 -136771 266406 -15187 189538 -78198 -163470 -84012 -20319 10408 63298 222833
5080 222833 28257 -152321 88644 61582 962 -167635 -21153 -87695 360456 402396 -56054
5068 77109 -96504 345393 -113001 -148971 -70391 -38259 -42919 40777 316808 182204 -272964
5056 -52157 -108847 -17854 -1221 -198601 -208477 -115071 30005 -104848 -46030 135631 52469 -116697
5043 27057 -27836 104173 285407 18143 187514 155522 243185 -1433 -29154 191846 -24568
5031 -335495 -266641 -56870 264288 167499 67314 17931 -380957 70674 72161 72990 77077 495459
5019 495459 -126074 178390 169690 -92994 50366 -37635 -239715 182750 -105722 -88731 258568
5007 91225 -49353 16348 33492 105886 -167656 -192747 -148933 198061 128540 42760 158026
4996 158026 -207870 -25275 215993 298284 -353910 224497 -281774 137879 4825 292953
4986 292953 -134588 -54658 -79840 146170 28306 -51199 19638 69301 -158037 62494 -144462
4974 -256685 338336 -59207 147905 50745 27087 -7871 19795 -192465 -188048 -29415 104406
4962 5003 133642 -161054 14027 131280 -40968 179461 70558 -76728 280539 -135270 -65150
4950 221333 46871 52171 51664 -275242 -76383 264044 343959 274110 117505 13384 2692 146348
4938 146348 -115816 -416627 -36973 -57822 73419 -507093 -13019 -64856 -159503 -302100 -77362
4926 227738 360306 59854 -46436 -335007 -24258 -537914 149774 -55507 -91604 192435 -107652
4914 -17538 -147693 83150 -104202 81275 17045 242471 165196 38573 72963 145062 81062
4903 81062 25561 592816 -206809 -147065 63216 -132048 -235735 47501 132604 29848 -179615
4891 198355 -99581 10735 48095 -165403 10785 -283127 58442 -151068 343500 55132 -59469
4879 -17345 -134241 -159717 -253170 -105126 381407 -220321 80451 -94282 272734 16811 78076
4868 78076 121095 -29161 145654 8111 179838 161866 -248637 -63635 118361 -126943 208126
4856 136287 -60582 -269468 34605 -175207 84077 6687 37252 197059 -208408 31619 125944
4845 125944 -116214 -46640 273522 -60319 58364 -62224 109070 -142076 -110631 -85317 -21867
4833 28000 -38538 -190155 -176122 56954 140899 327656 -130136 -250486 261885 111615 -408196
4821 6884 15775 -117492 238859 151429 -1744 -128823 119955 -45831 212242 55374 -391460
4809 -235862 78628 184432 37347 -257391 -456 -131840 420566 113570 159486 -117251 210232
4797 362521 -46601 292238 -97754 79540 5406 -283719 -83273 117528 -64994 -392251 19035
4785 -190069 -83534 227142 232555 103102 -49105 63502 -72925 10115 86362 317442 60326
4773 100590 134915 346662 60041 -2464 -99908 86334 -224851 9583 505558 53938 -77908
4761 -203682 55833 105592 -171627 6743 10546 -262255 -167765 -94378 -200345 -293798 -125506
4749 -16411 48950 -232131 -31459 -3298 49876 156212 182087 11174 -295082 137016 216129
4738 216129 -230722 -59626 20394 -134420 278425 24513 37031 -26210 -151172 -75952 -303626
4727 -303626 97726 40802 271655 -53523 132183 -294931 284316 175008 42034 63500 386098
4716 386098 -116985 -81577 -101360 -110859 -197836 102850 82284 -3203 48992 -2858 -17215 92454
4703 -60917 14668 220848 12511 -133929 51273 279826 -89435 -34369 120264 144187 23765
4691 -201755 207038 -279354 -31853 82053 -90509 191290 245721 204947 126066 95632 461526
4680 461526 -175779 -18048 -40601 290026 75255 -454861 -26300 -130499 258501 -52407 -241762
4669 -241762 -122390 -264772 86326 64462 -74031 111392 -336805 -65639 -150400 -35523 -41949
4658 -41949 -106027 -25733 298369 203836 -21191 -135495 28664 -135042 122053 38405 138281
4647 138281 -70079 -16811 -242558 13372 -11085 -38653 -283231 -112820 184528 -143316 62756
4635 -207939 -278307 19973 184222 -279859 126554 40274 -340319 -151976 -254326 32635
4624 -72424 -18871 -120213 -50235 280919 -236195 -42367 58469 -384740 -309875 -30924 -38581
4613 -38581 -209477 -13989 16307 149220 144961 27378 -65671 298847 443929 390797 102794
4601 -277167 12187 -22173 10507 252090 -309495 -276003 74279 -156306 38250 -103626 193583
4589 2401 6546 28177 351890 -124874 -328281 -93119 168884 -45870 231861 14592 110115
4578 110115 11390 -208446 60238 -180703 -189953 188096 168662 -66076 180830 -3934 388574
4566 102447 9696 -460531 -211005 492392 75047 -266552 -73744 -112902 104486 271053 26841
4554 208513 -11264 24182 -212885 316922 -103658 -212816 71511 208403 -155223 353376
4543 194754 -53449 -6020 -37596 -124119 -119714 -17594 -268743 195307 179403 -52783 -79031 161149
4530 -99621 231758 70896 -40737 -41138 350843 165734 -136644 134438 -173294 181339 14254
4518 251181 26208 112977 238267 373082 59433 39224 136577 31454 -313789 82877 -12870
4506 214292 -23332 -167583 252226 -21259 -103432 -30799 -24354 -128717 16590 72988 106785
4495 106785 -27561 183437 266691 349776 -230952 -261373 142467 232324 242637 -150387 -345498
4484 -345498 68586 82657 126159 -65283 57328 -64415 -33516 -106336 -90280 23769 -125818
$$ [...]
##END NTUPLES=NMR SPECTRUM
##END=
