##TITLE=AC1581_2782_8202388_tz30C9GtBx
##JCAMPDX= 6.0         $$ Bruker NMR JCAMP-DX V2.0
##DATA TYPE= NMR SPECTRUM
##DATA CLASS= NTUPLES
##ORIGIN= BRUKER
##OWNER= Administrator
$$ 1.72 TOPSPIN		Version 2.1
$$ 2013-09-27 01:52:06.627 -0700  Administrator@X
$$ Compression mode = diff/dup
##.OBSERVE FREQUENCY= 400.02188249412
##.OBSERVE NUCLEUS= ^1H
##.ACQUISITION MODE= SIMULTANEOUS (DQD)
##.ACQUISITION SCHEME= undefined
##.AVERAGES= 64
##.DIGITISER RES= 22
##SPECTROMETER/DATA SYSTEM= spect
##.PULSE SEQUENCE= noesygpps1d.comp
##.SOLVENT NAME= COFFEE_meoh
##.SHIFT REFERENCE= INTERNAL, COFFEE_meoh, 1, 14.96101
##AUDIT TRAIL= $$ (NUMBER, WHEN, WHO, WHERE, PROCESS, VERSION, WHAT)
$$ ##TITLE= Audit trail, TOPSPIN		Version 2.1
$$ ##JCAMPDX= 5.01
$$ ##ORIGIN= Bruker BioSpin GmbH
$$ ##OWNER= Administrator
$$ $$ E:\/data/COFFEE/nmr/AC1581_2782_8202388_tz30C9GtBx/12/pdata/1/auditp.txt
$$ ##AUDIT TRAIL=  $$ (NUMBER, WHEN, WHO, WHERE, PROCESS, VERSION, WHAT)
(   1,<2013-09-27 01:52:01.393 -0700>,<Administrator>,<X>,<go>,<TOPSPIN 2.1>,
      <created by zg
	started at 2013-09-27 01:40:31.796 -0700,
	POWCHK enabled, PULCHK disabled,
       configuration hash MD5:
       C8 4E 4E 5D D3 5C D8 9E 9F 52 82 E0 59 8A DE 15
       data hash MD5: 64K
       E6 BC AC 16 2D C0 EC E7 78 C1 47 67 6D E3 66 A7>)
(   2,<2013-09-27 01:52:04.455 -0700>,<Administrator>,<X>,<proc1d>,<TOPSPIN 2.1>,
      <Start of raw data processing
       efp LB = 0.3 FT_mod = 6 PKNL = 1 PHC0 = 0 PHC1 = 0 SI = 128K 
       data hash MD5: 128K
       72 B8 9B 4C 0A 77 65 4D 3D 77 27 11 FA 64 1C 07>)
(   3,<2013-09-27 01:52:05.471 -0700>,<Administrator>,<X>,<proc1d>,<TOPSPIN 2.1>,
      <pk PHC0 = -83.05115 PHC1 = 0 
       data hash MD5: 128K
       6D F5 D9 2E 43 1A 58 9E 35 0A D7 5E 67 B3 57 6D>)
(   4,<2013-09-27 01:52:06.002 -0700>,<Administrator>,<X>,<proc1d>,<TOPSPIN 2.1>,
      <abs ABSG = 1 
       data hash MD5: 128K
       57 4B 5F 17 E3 1F CF BC 8D 59 A5 EA EE 3A 76 3A>)
(   5,<2013-09-27 01:52:06.127 -0700>,<Administrator>,<X>,<proc1d>,<TOPSPIN 2.1>,
      <abs ABSG = 2 
       data hash MD5: 128K
       CF CA 38 7E 03 EC 64 D5 D4 42 1C 5A B7 6E 74 16>)
(   6,<2013-09-27 01:52:06.221 -0700>,<Administrator>,<X>,<proc1d>,<TOPSPIN 2.1>,
      <abs ABSG = 3 
       data hash MD5: 128K
       AA E3 FE 0C FE E0 C1 15 B0 FC F6 09 DD 40 B4 E9>)
(   7,<2013-09-27 01:52:06.299 -0700>,<Administrator>,<X>,<proc1d>,<TOPSPIN 2.1>,
      <abs ABSG = 4 
       data hash MD5: 128K
       C1 FE FB 7F 47 2C 8D 4C 3E 28 88 2C 50 34 FC 93>)
(   8,<2013-09-27 01:52:06.362 -0700>,<Administrator>,<X>,<proc1d>,<TOPSPIN 2.1>,
      <abs ABSG = 5 
       data hash MD5: 128K
       82 D2 65 68 DC A8 F3 8B 5C 90 28 B2 52 E4 C6 A1>)
$$ ##END=
$$ 
$$ $$ hash MD5
$$ $$ 03 46 C0 3E EB 2C F9 58 0A DB 4B E6 28 B9 6D 3D
##$RELAX= 
##$RELAX= 
##$RELAX= 
##$RELAX= 
##$RELAX= 
##$RELAX= 
##$RELAX= 
##$RELAX= 
$$ Bruker specific parameters
$$ --------------------------
##$DU= <E:\>
##$EXPNO= 12
$$ [...]
##$TP07= 0
##$TPNAME0= <>
##$TPNAME1= <>
##$TPNAME2= <>
##$TPNAME3= <>
##$TPNAME4= <>
##$TPNAME5= <>
##$TPNAME6= <>
##$TPNAME7= <>
##$TPOAL= (0..7)
0.5 0.5 0.5 0.5 0.5 0.5 0.5 0.5
##$TPOFFS= (0..7)
0 0 0 0 0 0 0 0
##$TUNHIN= 0
##$TUNHOUT= 0
##$TUNXOUT= 0
##$USERA1= <user>
##$USERA2= <user>
##$USERA3= <user>
##$USERA4= <user>
##$USERA5= <user>
##$V9= 5
##$VALIST= <valist>
##$VCLIST= <CCCCCCCCCCCCCCC>
##$VD= 0
##$VDLIST= <DDDDDDDDDDDDDDD>
##$VPLIST= <PPPPPPPPPPPPPPP>
##$VTLIST= <TTTTTTTTTTTTTTT>
##$WBST= 1024
##$WBSW= 4
##$XGAIN= (0..3)
0 0 0 0
##$XL= 0
##$YL= 0
##$YMAX_a= 6594209
##$YMIN_a= -12386724
##$ZGOPTNS= <>
##$ZL1= 120
##$ZL2= 120
##$ZL3= 120
##$ZL4= 120
##$ABSF1= 14.96101
##$ABSF2= -5.597172
##$ABSG= 5
##$ABSL= 3
##$ALPHA= 0
##$AQORDER= 0
##$ASSFAC= 0
##$ASSFACI= 0
##$ASSFACX= 0
##$ASSWID= 0
##$AUNMP= <proc_prof1d_extract.lims>
##$AXLEFT= 0
##$AXNAME= <>
##$AXNUC= <1H>
##$AXRIGHT= 0
##$AXTYPE= 0
##$AXUNIT= <>
##$AZFE= 0.1
##$AZFW= 0.1
##$BCFW= 0
##$BC_mod= 0
##$BYTORDP= 0
##$COROFFS= 0
##$CY= 15
##$DATMOD= 1
##$DC= 0
##$DFILT= <>
##$DTYPP= 0
##$F1P= 0
##$F2P= 0
##$FCOR= 0.5
##$FTSIZE= 131072
##$FT_mod= 6
##$GAMMA= 0
##$GB= 0
##$INTBC= 1
##$INTSCL= 1
##$ISEN= 128
##$LB= 0.3
##$LEV0= 0
##$LPBIN= 0
##$MAXI= 10000
##$MC2= 0
##$MEAN= 0
##$ME_mod= 0
##$MI= 0
##$NCOEF= 0
##$NC_proc= -2
##$NLEV= 6
##$NOISF1= 0
##$NOISF2= 0
##$NSP= 0
##$NTH_PI= 0
##$NZP= 0
##$OFFSET= 14.96101
##$PC= 1
##$PHC0= -83.05115
##$PHC1= 0
##$PH_mod= 1
##$PKNL= yes
##$PPARMOD= 0
##$PPDIAG= 0
##$PPIPTYP= 0
##$PPMPNUM= 2147483647
##$PPRESOL= 1
##$PSCAL= 4
##$PSIGN= 0
##$PYNMP= <proc.py>
##$REVERSE= no
##$SF= 400.020009632322
##$SI= 131072
##$SIGF1= 0
##$SIGF2= 0
##$SINO= 400
##$SIOLD= 131072
##$SPECTYP= <>
##$SREGLST= <1H.CDCl3>
##$SSB= 0
##$STSI= 131072
##$STSR= 0
##$SW_p= 8223.68421052631
##$SYMM= 0
##$S_DEV= 0
##$TDeff= 65536
##$TDoff= 0
##$TI= <>
##$TILT= no
##$TM1= 0
##$TM2= 0
##$TOPLEV= 0
##$USERP1= <user>
##$USERP2= <user>
##$USERP3= <user>
##$USERP4= <user>
##$USERP5= <user>
##$WDW= 1
##$XDIM= 131072
##$YMAX_p= 394843493
##$YMIN_p= -12752
##$CURPLOT= <Network HP LaserJet P1505>
##$CURPRIN= <$Network HP LaserJet P1505>
##$DFORMAT= <normdp>
##$LAYOUT= <+/1D_H.xwp>
##$LFORMAT= <normlp>
##$PFORMAT= <normpl>
##$SURQMSG= 1
$$ End of Bruker specific parameters
$$ ---------------------------------
##NTUPLES= NMR SPECTRUM
##VAR_NAME=  FREQUENCY,     SPECTRUM/REAL,   SPECTRUM/IMAG
##SYMBOL=    X,             R,               I
##VAR_TYPE=  INDEPENDENT,   DEPENDENT,       DEPENDENT
##VAR_FORM=  AFFN,          ASDF,            ASDF
##VAR_DIM=   131072,        131072,          131072
##UNITS=     HZ,            ARBITRARY UNITS, ARBITRARY UNITS
##FACTOR=    0.0627417313425164, 1,          1
##FIRST=     8223.62146879497, 5703,         -62809
##LAST=      0,             7308,            -62010
##MIN=       0,             -12752,          0
##MAX=       8223.62146879497, 394843493,    0
$$ Real data points
##PAGE= N=1
##DATA TABLE= (X++(R..R)), XYDATA
$$ [...]
63889G01682q982p063n517l999k338n44J305K886L699L757L946N122P185R501
63875G10640J1961J4882J8089K0932K3218K5443K7977L0621L3025L4983L6271
63864I88042L6764L6790L6799L6666L5866L4277L2206K9560K5887K1289J6589
63853A330735J2198P576K116l980j0071j5718k0636k4613k7849l0991l4431l7916
63841A146420m0992m3356m4662m4652m3770m2985m2693m2350m1430m0010l8094
63830F81426l5273l1698k8521k6531k4993k2766j9999j7777j6471j5489j4484
63819D27424j3680j3019j1942j0302q723p763p257o714n967n215m762m765n012
63806C22303m959m356l664l470l664l722l566l526l530l135k405k019k316k923
$$ y = [701682, 692700, 685637, 680120, 676121, 673783, 673239, 674544, 677430, 681129, 684886, 688832, 693954, 701139, 710640, 722601, 737483, 755572, 776504, 799722, 825165, 853142, 883763, 916788, 951771, 988042, 1024806, 1061596, 1098395, 1135061, 1170927, 1205204, 1237410, 1266970, 1292857, 1314146, 1330735, 1342933, 1350509, 1352625, 1348645, 1338574, 1322856, 1302220, 1277607, 1249758, 1218767, 1184336, 1146420, 1105428, 1062072, 1017410, 972758, 928988, 886003, 843310, 800960, 759530, 719520, 681426, 646153, 614455, 585934, 559403, 534410, 511644, 491645, 473868, 457397, 441908, 427424, 413744, 400725, 388783, 378481, 369758, 361995, 354738, 348024, 342057, 336842, 332080, 327315, 322303, 317344, 312988, 309324, 305854, 302190, 298468, 294902, 291376, 287846, 284711, 282306, 280287, 277971, 275048]
63792B75048l489m069m464m001k516r47k91m60p25r14j331j835j810j165o22p61
63776B45648j265j415r66l16K8j47p30j436j961k055j570n30P09J563J706J373
63760B38636J052Q80O24J41m62j112j833k398k279j298j0Q19R85Q71Q38R65J248
63743B37667J688K144K418K512K535K426K083J737J806K246K493K279K064K355
63729B68453K946L346L647M345N390O067N970N569N478N590N334M553L611K709
63715C33008J617K85p24q78o25j126k844m736n314m286k756j760j263p17m2M39
63699C08278O41P01N81K83L61J491L379M718M554L307K131J674J764J986K049
63684C37898J768J138M84K11L59O06O37L45j81o00m23M85J510J822J346Q54R51
$$ y = [275048, 271559, 267490, 263026, 259025, 256509, 255562, 255271, 254811, 254086, 253172, 251841, 250006, 248196, 247031, 246409, 245648, 244383, 242968, 242002, 241686, 241714, 241567, 240837, 239401, 237440, 235385, 233815, 233285, 233994, 235557, 237263, 238636, 239688, 240568, 241192, 241333, 240871, 239759, 237926, 235528, 233249, 231951, 231941, 232760, 233745, 234616, 235454, 236419, 237667, 239355, 241499, 243917, 246429, 248964, 251390, 253473, 255210, 257016, 259262, 261755, 264034, 266098, 268453, 271399, 274745, 278392, 282737, 288127, 294194, 300164, 305733, 311211, 316801, 322135, 326688, 330299, 333008, 334625, 334910, 334186, 333308, 332683, 331557, 328713, 323977, 318663, 314377, 311621, 309861, 308598, 307881, 307839, 308278, 308919, 309620, 310201, 310484, 310845, 312336, 315715, 320433, 324987, 328294, 330425, 332099, 333863, 335849, 337898, 339666, 340804, 341288, 341499, 341858, 342464, 343101, 343446, 343265, 342665, 342242, 342727, 344237, 346059, 347405, 348259, 349210]
63667C49210J336J345Q79L95J59n6n24j218j966k725l488m169m672m960m968m618
63651C19960l993l365k932k635k320j942j517j039n34N6R83K409L843M395L864
63636C15233L177L281M011M644N103N852O772P195P084P287Q313R703J0901J1997
63622D10553J3159J4125J4797J5715J7259J9031K0573K2132K3951K5469K6069
63611F22833K6162K6526K6958K6654K5701K4954K4402K2792J9228J4167Q580K975
63599H71932k371p022j0724j3525j5210j5266j3880j2340j1843j2436j3545j5003
63587G28767j6936j9064k0785k1793k2050k1393j9709j7412j5193j3300j1447
63576E29685r347p060m858l047j786q50K97J919L670N085O261P627R204J0546
$$ y = [349210, 350546, 351891, 352770, 353165, 353324, 353268, 352744, 351526, 349560, 346835, 343347, 339178, 334506, 329546, 324578, 319960, 315967, 312602, 309670, 307035, 304715, 302773, 301256, 300217, 299683, 299739, 300722, 303131, 306974, 311369, 315233, 318410, 321691, 325702, 330346, 335449, 341301, 348073, 355268, 362352, 369639, 377952, 387655, 398556, 410553, 423712, 437837, 452634, 468349, 485608, 504639, 525212, 547344, 571295, 596764, 622833, 648995, 675521, 702479, 729133, 754834, 779788, 804190, 826982, 846210, 860377, 868957, 871932, 869561, 862539, 851815, 838290, 823080, 807814, 793934, 781594, 769751, 757315, 743770, 728767, 711831, 692767, 671982, 650189, 628139, 606746, 587037, 569625, 554432, 541132, 529685, 520338, 513278, 508420, 505373, 503587, 502737, 503034, 504953, 508623, 513708, 519969, 527596, 536800, 547346]
63562E47346J1386J1950J2530J3095J3558J4116J5125J6700J8649K0759K2967
63551G18181K5210K7267K8973L0537L2395L4567L6314L6458L3863K7628J7487
63540A048880M745p577j6439k0899k2167k1721k0098j7594j5063j3311j2330j1866
63528H74560j2320j4320j7599k1056k3876k6028k7682k8725k9025k8658k7705
63517F17566k6169k4232k2294k0583j8967j7257j5523j3931j2439j0842r114p589
63505D18626o750o705o901o473n063l202j888j789k816m182m810m012k128k72
63491C61635O91Q95J003J302J619J859K175K595K916L068L169L160K756K009J541
63476C92393J903K818L377K997J934Q49O3o30j621l061m669n815n948n182m373
$$ y = [547346, 558732, 570682, 583212, 596307, 609865, 623981, 639106, 655806, 674455, 695214, 718181, 743391, 770658, 799631, 830168, 862563, 897130, 933444, 969902, 1003765, 1031393, 1048880, 1053625, 1046048, 1029609, 1008710, 986543, 964822, 944724, 927130, 912067, 898756, 886426, 874560, 862240, 847920, 830321, 809265, 785389, 759361, 731679, 702954, 673929, 645271, 617566, 591397, 567165, 544871, 524288, 505321, 488064, 472541, 458610, 446171, 435329, 426215, 418626, 411876, 405171, 398270, 391797, 386734, 383532, 381644, 379855, 377039, 372857, 368047, 364035, 361907, 361635, 362326, 363221, 364224, 365526, 367145, 369004, 371179, 373774, 376690, 379758, 382927, 386087, 388843, 390852, 392393, 394296, 397114, 400491, 403488, 405422, 406271, 406334, 405704, 404083, 401022, 396353, 390538, 384590, 379408, 375035]
63461C75035m270m570m166k559o17L81K20j78J01J176K706M354N863P109Q306
63446C88891R798J1538J3155J4596J6195J7915J9084J9390J9597K0833K3380K6732
63434F01104L0401L3869L5811L4389K8965K1169J3747Q476N406L889L749N205
63422H26180Q093J1744J5654J9804K4079K7731K9858L0289K9486K7561K3888J7933
63410A092300J0188K012n241j0805j4528j6688j7748j8098j7989j7708j7684j8356
63398I49655j9957k2392k5217k7820k9824l1210l1874l1336k9335k6545k4077
63387F50068k2288k0547j8306j5672j2910j0009p164m922l417j999j23J842L324
63374E37877M565O217Q306J0271J1896J3515J5300J7023J8541J9986K1458K2946
$$ y = [375035, 370765, 366195, 362029, 359470, 358853, 359234, 359454, 359276, 359377, 360553, 363259, 367613, 373476, 380585, 388891, 398689, 410227, 423382, 437978, 454173, 472088, 491172, 510562, 530159, 550992, 574372, 601104, 631505, 665374, 701185, 735574, 764539, 785708, 799455, 807931, 813337, 817226, 820975, 826180, 834273, 846017, 861671, 881475, 905554, 933285, 963143, 993432, 1022918, 1050479, 1074367, 1092300, 1102488, 1104500, 1099259, 1088454, 1073926, 1057238, 1039490, 1021392, 1003403, 985695, 968011, 949655, 929698, 907306, 882089, 854269, 824445, 793235, 761361, 730025, 700690, 674145, 650068, 627780, 607233, 588927, 573255, 560345, 550336, 543172, 538250, 534833, 532834, 532711, 534553, 537877, 542442, 548659, 556965, 567236, 579132, 592647, 607947, 624970, 643511, 663497, 684955, 707901]
63362G07901K4590K6504K8332K9478K9905L0220L0833L1393L1223K9895K7165
63351A027439K2752J6605R293J812m991j0685j5041j7799j8855j8605j7883j7436
63339I56606j7443j7719j8265j9399k1273k3485k5265k6013k5665k4748k3957
63328G13374k3368k2111j9240j5067j1160q755p501n991l342k14J436l69n953
63315E91739j3256j9178k2040k2414k1586j9972j7496j4645j2252j0514r011p499
63303D01876o088m854l841l282l244l273k956k588k644k884k691k179k075k524
63289C56753k781k290j426r42j179j928k627k611j746q33q71j771k409k086j324
63274C29929r11p68k71O85J483J516Q34O0j56L64J195J750J773J487J337J670
$$ y = [707901, 732491, 758995, 787327, 816805, 846710, 876930, 907763, 939156, 970379, 1000274, 1027439, 1050191, 1066796, 1076089, 1077901, 1072910, 1062225, 1047184, 1029385, 1010530, 991925, 974042, 956606, 939163, 921444, 903179, 883780, 862507, 839022, 813757, 787744, 762079, 737331, 713374, 690006, 667895, 648655, 633588, 622428, 613673, 606172, 600181, 596839, 596625, 598061, 597692, 591739, 578483, 559305, 537265, 514851, 493265, 473293, 455797, 441152, 428900, 418386, 409375, 401876, 395788, 390934, 387093, 383811, 380567, 377294, 374338, 371750, 369106, 366222, 363531, 361352, 359277, 356753, 353972, 351682, 350256, 349314, 348135, 346207, 343580, 340969, 339223, 338390, 337519, 335748, 333339, 331253, 329929, 329018, 328250, 327979, 328664, 330147, 331663, 332497, 332557, 332401, 332765, 333960, 335710, 337483, 338970, 340307, 341977]
63258C41977K476L290L581L377L264L533L732L452L080L295M107N025N927P006
63244C97122Q072Q663Q855R251J0143J1314J2665J4274J5810J6708J7109J7823
63232E47809J9149K0447K1140K1423K1588K1457K0964K0585K0628K0658K0198
63221G76046J9501J8985J8427J7389J6152J5414J5183J4692J3367J1341Q948O243
63209I51688L138m14m472r014j3653j7691k0714k2930k4743k6085k6390k5288
63197G63432k3133k0701j8396j5931j2908r483o282l717j597N62L032N645P986
63184F68509R807J1224J2459J3486J4229J4993J6204J7554J8043J7241J5946J5135
63172H44830J4787J4333J3718J3183J2327J0374P354M105J107j910n182q511j1740
$$ y = [341977, 344453, 347743, 351324, 354701, 357965, 361498, 365230, 368682, 371762, 375057, 379164, 384189, 390116, 397122, 405194, 413857, 422712, 431963, 442106, 453420, 466085, 480359, 496169, 512877, 529986, 547809, 566958, 587405, 608545, 629968, 651556, 673013, 693977, 714562, 735190, 755848, 776046, 795547, 814532, 832959, 850348, 866500, 881914, 897097, 911789, 925156, 936497, 945445, 951688, 954826, 954412, 949940, 940926, 927273, 909582, 888868, 865938, 841195, 815110, 788720, 763432, 740299, 719598, 701202, 685271, 672363, 662880, 656598, 652881, 651284, 651846, 654878, 660523, 668509, 678316, 689540, 701999, 715485, 729714, 744707, 760911, 778465, 796508, 813749, 829695, 844830, 859617, 873950, 887668, 900851, 913178, 923552, 930906, 935011, 936118, 934208, 929026, 920515, 908775]
63159I08775j4971j8191k1345k4582k7679k9404k8605k6033k3935k3477k3647
63148F46906k3019k1436j9361j6792j3766j1067r415q426p221n625m053k762j889
63135E02074j728k252k726k576k166k074k113j772j183p76l84L97J279J620J506
63120D87126J582J962K187K215K494L027L238K951K673K753K899K776K496K235
63106E22614J979J779J745J596Q26m66j453j643j524j746k096j768m94J046J962
63091E22357J992J586J287J205J129J090J484K485L555L938L483K675J997J616
63077E51879J680K370L608M984O178P128P779Q049Q146Q577R552J0686J1616J2619
63063F54851J4322J6776J9280K1231K2855K4821K7270K9708L1873L4278L7440
$$ y = [908775, 893804, 875613, 854268, 829686, 802007, 772603, 743998, 717965, 694030, 670553, 646906, 623887, 602451, 583090, 566298, 552532, 541465, 532050, 523624, 516403, 510778, 506725, 503963, 502074, 500346, 498094, 495368, 492792, 490626, 488552, 486439, 484667, 483484, 482708, 482324, 482721, 484000, 485620, 487126, 488708, 490670, 492857, 495072, 497566, 500593, 503831, 506782, 509455, 512208, 515107, 517883, 520379, 522614, 524593, 526372, 528117, 529713, 530539, 530073, 528620, 526977, 525453, 523707, 521611, 519843, 519349, 520395, 522357, 524349, 525935, 527222, 528427, 529556, 530646, 532130, 534615, 538170, 542108, 545591, 548266, 550263, 551879, 553559, 555929, 559537, 564521, 570699, 577827, 585606, 593655, 601801, 610378, 619930, 630616, 642232, 654851, 669173, 685949, 705229, 726460, 749315, 774136, 801406, 831114, 862987, 897265, 934705]
63052I34705M0944M3797M5707M7392M9453N1467N2588N2641N2243N1958N1713
63041A474608N1001M9499M7502M5806M4897M4307M3080M0954L8595L6532L4303
63030A951084L0943K5850J8870J0167M55r112j7929k6540l5603m4642n2376n8030
63018A793137o1668o3444o3343o1585n8559n4370m8996m2898l6804l0810k4411
63007A246249j7554j1011n413n23M254R035J3467J7168J9959K1986K3799K5953
62995A347369K8262K9854L0148K9431K8305K6988K5538K4215K3150K1831J9526
62984A634617J6119J2123P898L213k314q702j5593k2550k9160l5082m0160m4525
62972A475884m8408n1782n4202n5099n4246n1934m8759m5348m2274l9953l8309
$$ y = [934705, 975649, 1019446, 1065153, 1112545, 1161998, 1213465, 1266053, 1318694, 1370937, 1422895, 1474608, 1525609, 1575108, 1622610, 1668416, 1713313, 1757620, 1800700, 1841654, 1880249, 1916781, 1951084, 1982027, 2007877, 2026747, 2036914, 2037369, 2028257, 2010328, 1983788, 1948185, 1903543, 1851167, 1793137, 1731469, 1668025, 1604682, 1543097, 1484538, 1430168, 1381172, 1338274, 1301470, 1270660, 1246249, 1228695, 1217684, 1212271, 1211748, 1216002, 1225037, 1238504, 1255672, 1275631, 1297617, 1321416, 1347369, 1375631, 1405485, 1435633, 1465064, 1493369, 1520357, 1545895, 1570110, 1593260, 1615091, 1634617, 1650736, 1662859, 1670757, 1673970, 1671656, 1662954, 1647361, 1624811, 1595651, 1560569, 1520409, 1475884, 1427476, 1375694, 1321492, 1266393, 1212147, 1160213, 1111454, 1066106, 1023832, 983879, 945570]
62961I45570l6574l3819k9957k6120k3736k3100k3041k2145k0187j8071j6505
62950F72315j5248j3892j2781j2627j3360j4033j3863j2855j1396r788q329p270
62938E26873o459n498m540m272m779n033m178k789k111k307k369j703r33r13j559
62923D77430k115k186k063k219k679l040k994k763k818l191l340k895k179j673
62909D41275j342r07n54p22j289j578j262p18k68L55J446K560K842K036Q20R1
62893D42785Q3L63M95M50L03j04q33j360r66K42J230J267Q09P62J223J499J188
62876D49436N65m1p07j522k155k149j484o88l78p02j269j571j493j275j075q10
62860D32682m33o0L18Q77J586K053J976J466P87P4m85o07k62K61Q25J543K176
$$ y = [945570, 908996, 875177, 845220, 819100, 795364, 772264, 749223, 727078, 706891, 688820, 672315, 657067, 643175, 630394, 617767, 604407, 590374, 576511, 563656, 552260, 542472, 534143, 526873, 520414, 514916, 510376, 506104, 501325, 496292, 492114, 489325, 487214, 484907, 482538, 480835, 479902, 478989, 477430, 475315, 473129, 471066, 468847, 466168, 463128, 460134, 457371, 454553, 451362, 448022, 445127, 442948, 441275, 439933, 439026, 438472, 437750, 436461, 434883, 433621, 432903, 432635, 432990, 434436, 436996, 439838, 441874, 442694, 442785, 442868, 443231, 443726, 444176, 444479, 444375, 443542, 442182, 441216, 441458, 442688, 443955, 444764, 445526, 446749, 448248, 449436, 450001, 449960, 449253, 447731, 445576, 443427, 441943, 441255, 440877, 440175, 438906, 437335, 435842, 434567, 433492, 432682, 432249, 432189, 432507, 433384, 434970, 437023, 438999, 440465, 441252, 441326, 440841, 440234, 439972, 440233, 441058, 442601, 444777]
62843D44777K062J064L5k31oo0m84q05q97r81r16k78Q86J989K592K674K360J850
62825D55631J465J358J366J501K149L255L850L262K302K241K944L166K606K334
62811D89430L012L950M372M548M971N350N218M917N150N914O635P169P990R399
62797E68025J1021J2285J3114J4011J5488J7517J9662K1708K3948K6747L0138
62786G73664L4038L8471M3210M7577N1147N4287N7551O0776O3425O5508O7434
62775A357088O9234P0505P0985P0381O7926O2952N5864M7628L8434K7805J5944
62764A954746L850q004k0051l2321m3789n3431o1085o6940p0992p3446p4786p4975
62752A378776p3426p0229o6577o3366o0111n5963n1166m6683m2852l9206l5387
$$ y = [444777, 446839, 447903, 447938, 447707, 447701, 447641, 447157, 446352, 445455, 444474, 443558, 443280, 444166, 446155, 448747, 451421, 453781, 455631, 457096, 458454, 459820, 461321, 463470, 466725, 470575, 473837, 476139, 478380, 481324, 484490, 487096, 489430, 492442, 496392, 500764, 505312, 510283, 515633, 520851, 525768, 530918, 536832, 543467, 550636, 558626, 568025, 579046, 591331, 604445, 618456, 633944, 651461, 671123, 692831, 716779, 743526, 773664, 807702, 846173, 889383, 936960, 988107, 1042394, 1099945, 1160721, 1224146, 1289654, 1357088, 1426322, 1496827, 1567812, 1638193, 1706119, 1769071, 1824935, 1872563, 1910997, 1938802, 1954746, 1958596, 1950592, 1930541, 1898220, 1854431, 1801000, 1739915, 1672975, 1601983, 1528537, 1453751, 1378776, 1305350, 1235121, 1168544, 1105178, 1045067, 989104, 937938, 891255, 848403, 809197, 773810]
62741G73810l1603k8221k5380k2959k0643j8166j5595j3268j1417j0025q974p968
62729E59591o560m761l321k765k431j357J41R22R30J279K380L479M421O247R251
62714E67446J1998J3279J3907J5326J7554J9753K1950K4730K7848L0542L2884
62703G97217L5532L8417M0916M3126M5821M9123N2276N4763N6706N8111N8597
62692A330605N7976N6396N3784M9797M4362L7717K9903K0714J0199j186j2804
62681A677463k3898l3693m1918m8966n5149o0068o3186o4609o4746o3667o1416
62670A096147n8534n5524n2140m7990m3477l9375l5738l2140k8757k6243k4560
62659F51669k2844k0561j8083j5951j4167j2395j0447q522p234p162q007q513
$$ y = [773810, 742207, 713986, 688606, 665647, 645004, 626838, 611243, 597975, 586558, 576533, 567559, 559591, 553031, 548270, 544949, 542184, 539753, 538396, 538537, 539459, 540389, 541668, 544048, 547527, 551948, 558195, 567446, 579444, 592723, 606630, 621956, 639510, 659263, 681213, 705943, 733791, 764333, 797217, 832749, 871166, 912082, 955208, 1001029, 1050152, 1102428, 1157191, 1213897, 1272008, 1330605, 1388581, 1444977, 1498761, 1548558, 1592920, 1630637, 1660540, 1681254, 1691453, 1690267, 1677463, 1653565, 1619872, 1577954, 1528988, 1473839, 1413771, 1350585, 1285976, 1221230, 1157563, 1096147, 1037613, 982089, 929949, 881959, 838482, 799107, 763369, 731229, 702472, 676229, 651669, 628825, 608264, 590181, 574230, 560063, 547668, 537221, 528699, 521465, 514303, 506296, 497783]
62647D97783p734o075m515l326k268j499j330j350q55mM01J44k50n50j026j615
62631D65931j828j583j327j219j013p54p55q50n04K76R60J395J786J883J343Q97
62615D64638J880M212O115O306N442M821M853N434O723Q602J0272J1347J2626
62602E53271J4809J7153J8497J9072K0123K2045K4113K5915K7902L0268L2359
62591H05527L3601L4243L4665L4505L3030L0088K6176K1703J6629J0892M783j288
62579A084554p223j3195j9202k4833k9500l2788l4603l5229l5211l4966l4405
62568G83399l3147l1161k8863k6520k4059k1611j9671j8303j6766j4574j2377
62557E36347j1046j0314r237p754o765o631o620o105n374m873m407l586k517j545
$$ y = [497783, 490049, 483974, 479459, 476133, 473865, 472366, 471036, 469686, 468831, 468827, 469228, 469372, 469122, 468572, 467546, 465931, 464103, 462520, 461193, 459974, 458961, 458207, 457452, 456602, 456098, 456374, 457334, 458729, 460515, 462398, 463741, 464638, 466518, 470730, 476845, 483151, 488593, 493414, 498267, 503701, 510424, 519026, 529298, 540645, 553271, 568080, 585233, 603730, 622802, 642925, 664970, 689083, 714998, 742900, 773168, 805527, 839128, 873371, 908036, 942541, 975571, 1005659, 1031835, 1053538, 1070167, 1081059, 1085842, 1084554, 1077331, 1064136, 1044934, 1020101, 990601, 957813, 923210, 887981, 852770, 817804, 783399, 750252, 719091, 690228, 663708, 639649, 618038, 598367, 580064, 563298, 548724, 536347, 525301, 514987, 505750, 497996, 491231, 484600, 477980, 471875, 466501, 461628, 457221, 453635, 451118, 449573]
62543D49573p89k64j21l26m50j38M00O67M92K36M86J543L025M140M606N108O364
62526D74552Q096R498J0509J1789J3454J4880J5895J7220J9350K1827K4049K6046
62514F67165K7985K9611L0750L1814L3185L4517L5191L5018L4045L2082K8946
62503A020309K4829K0042J4696R063L747r00n140r176j2542j4648j5484j5223
62491A019573j3605j0440o435k750K09K947N868Q716J1025J2661J3815J4839J6059
62478A072482J7255J7303J4778R297K191m379r077j2337j5725k0381k6108l1922
62466A013377l7021m0881m2840m2515m0681l8887l7846l6744l4508l1176k7607
62455F02671k4375k1462j8683j5950j3319j1045r286p668n657l544k293k086j860
$$ y = [449573, 448784, 448520, 448399, 448073, 447623, 447485, 447885, 448552, 449044, 449280, 449766, 451309, 454334, 458474, 463080, 468188, 474552, 482648, 492146, 502655, 514444, 527898, 542778, 558673, 575893, 595243, 617070, 641119, 667165, 695150, 724761, 755511, 787325, 820510, 855027, 890218, 925236, 959281, 991363, 1020309, 1045138, 1065180, 1079876, 1088939, 1092686, 1091786, 1086646, 1077470, 1064928, 1050280, 1034796, 1019573, 1005968, 995528, 989093, 986343, 986552, 989499, 995367, 1004083, 1015108, 1027769, 1041584, 1056423, 1072482, 1089737, 1107040, 1121818, 1131115, 1133306, 1128927, 1119850, 1107513, 1091788, 1071407, 1045299, 1013377, 976356, 935475, 892635, 850120, 809439, 770552, 732706, 695962, 661454, 630278, 602671, 578296, 556834, 538151, 522201, 508882, 497837, 488551, 480883, 475226, 471682, 469389, 467303, 465443]
62442D65443q40K81M53j67o48o74n15j92L40N28j88j298j846j946k553l785m665
62425D47728m683m392m198l707k778k165k453l093l220k782k242j723j102n72
62411D08618l96m47m71n75q65r78n49R3K84rj87L8L01K97L56J052K450L980M911
62392D17903M908M235L565L480M040M772N106M863M417M361M935N830O671P505
62378D86591Q565R658J0287J0428J0699J1472J2357J2972J3725J5147J6844J7982
62366F36727J8776K0491K3626K7018K9400L1151L3622L7081M0422M2903M5138
62355I86355M7867N0527N1725N0688M7594M2708L5984K7586J8287R106Q07o181
62343A363053j1799j6447k0776k5114k9245l2865l5989l8747m0951m2074m1657
$$ y = [465443, 464603, 464884, 465337, 465170, 464522, 463848, 463333, 463141, 463481, 464009, 463821, 462523, 460677, 458731, 456178, 452393, 447728, 443045, 438653, 434455, 430748, 427970, 425805, 423352, 420259, 417039, 414257, 412015, 410292, 409190, 408618, 408222, 407775, 407304, 406729, 405864, 404886, 404337, 404430, 404714, 404705, 404518, 404556, 404857, 405154, 405510, 406562, 409012, 412992, 417903, 422811, 427046, 430611, 434091, 438131, 442903, 448009, 452872, 457289, 461650, 466585, 472415, 479086, 486591, 495156, 504814, 515101, 525529, 536228, 547700, 560057, 573029, 586754, 601901, 618745, 636727, 655503, 675994, 699620, 726638, 756038, 787189, 820811, 857892, 898314, 941217, 986355, 1034222, 1084749, 1136474, 1187162, 1234756, 1277464, 1313448, 1341034, 1359321, 1368427, 1369234, 1363053, 1351254, 1334807, 1314031, 1288917, 1259672, 1226807, 1190818, 1152071, 1111120, 1069046, 1027389]
62332A027389l9699l6770l3792l1453k9702k7938k5769k3455k1488k0044j9023
62321G18256j8395j8157j8028j7618j6937j6370j6015j5338j3818j1771j0186
62310E45623r619r513q847p268n391l986l228k790k445k250k238k149j588m43
62296D83868Q84J763J976J948K136K360K126J639J866L232M807N276M443L269
62282E21593K657K756L314M068M719N029N136N410N963O603P312Q364R925J1843
62268F04692J3911J6083J8384K0856K3567K6436K9203L1783L4455L7393M0260
62257H97023M2720M5026M7546M9946N1449N1650N0373M7037M1076L2871K3436
62246A380153J3299K739p161j5028k0951k6376l1948l6799m0400m3579m6885m9356
$$ y = [1027389, 987690, 950920, 917128, 885675, 855973, 828035, 802266, 778811, 757323, 737279, 718256, 699861, 681704, 663676, 646058, 629121, 612751, 596736, 581398, 567580, 555809, 545623, 536004, 526491, 517644, 510376, 504985, 500999, 497771, 494981, 492536, 490286, 488048, 485899, 484311, 483868, 484752, 486515, 488491, 490439, 492575, 494935, 497061, 498700, 500566, 503798, 508605, 513881, 518324, 521593, 524250, 527006, 530320, 534388, 539107, 544136, 549272, 554682, 560645, 567248, 574560, 582924, 592849, 604692, 618603, 634686, 653070, 673926, 697493, 723929, 753132, 784915, 819370, 856763, 897023, 939743, 984769, 1032315, 1082261, 1133710, 1185360, 1235733, 1282770, 1323846, 1356717, 1380153, 1393452, 1396191, 1389030, 1374002, 1353051, 1326675, 1294727, 1257928, 1217528, 1173949, 1127064, 1077708]
62234A077708n0101m9797m9312m7930m4495l9593l4942l1068k7188k3077j9497
62223F60708j6701j4059j1364r260q003o974n739m612l784k871j676n19N61K071
62209E77778M083N833O751P222P824Q487Q916R241R708J0124J0161R815R237Q485
62195F93665P710P106O503N483M273L763M185M472L637K223J562J958K546K783
62181G51869L103L937M916N389N246M874M661M887N868P799J0472J3354J6102
62168H42477J8907K2279K6374L0556L3816L5697L6592L6917L6239L3590K8601
62157A182045K1916J4441O626j229q340j3702j7055j9292k1658k4683k7996l0939
62145A060134l3124l4487l5057l4805l3623l1398k8234k4542k0847j7420j4218
$$ y = [1077708, 1027607, 977810, 928498, 880568, 836073, 796480, 761538, 730470, 703282, 680205, 660708, 644007, 629948, 618584, 609324, 601321, 594347, 588608, 583996, 580212, 577341, 575665, 575146, 575707, 577778, 581861, 587694, 594445, 601667, 609491, 617978, 626894, 636135, 645843, 655967, 666128, 675943, 685180, 693665, 701375, 708481, 714984, 720467, 724740, 728503, 732688, 737160, 740797, 743020, 744582, 746540, 749086, 751869, 754972, 758909, 763825, 769214, 774460, 779334, 783995, 788882, 794750, 802549, 813021, 826375, 842477, 861384, 883663, 910037, 940593, 974409, 1010106, 1046698, 1083615, 1119854, 1153444, 1182045, 1203961, 1218402, 1225028, 1223799, 1215459, 1201757, 1184702, 1165410, 1143752, 1119069, 1091073, 1060134, 1027010, 992523, 957466, 922661, 889038, 857640, 829406, 804864, 784017, 766597, 752379]
62134G52379j1151q326n972m239l043k087j026K65J665L030M348N653O964Q467
62120G46927J0348J2261J3370J3359J3058J3351J3697J2588R506N590K155n74
62108H65636k904m696n535n429m780m109m113n333p232q241p391n450l722k308
62094G94393l84K231M844P046R048J0794J1709J1630J1318J1629J2633J3711J4271
62081I14873J4264J4253J4982J6588J8457K0063K1644K3577K5457K6506K6638
62070A137302K6429K6156K5583K4625K3512K2369K1359K1095K1981K3061K2519
62059A395991J9596J5219J0521N581N8n756j1114j5512j8785k0949k2418k3969
62047A328463k6130k8837l1800l4676l6857l7782l7720l7580l7594l7023l5535
$$ y = [752379, 741228, 732902, 726930, 722691, 719648, 717561, 716535, 716800, 718465, 721495, 725843, 731496, 738460, 746927, 757275, 769536, 782906, 796265, 809323, 822674, 836371, 848959, 858465, 864055, 866210, 865636, 862732, 858036, 852501, 847072, 842292, 838183, 834070, 828737, 821505, 813264, 805873, 800423, 796701, 794393, 794009, 796240, 801084, 808130, 817178, 827972, 839681, 851311, 862629, 874258, 886891, 900602, 914873, 929137, 943390, 958372, 974960, 993417, 1013480, 1035124, 1058701, 1084158, 1110664, 1137302, 1163731, 1189887, 1215470, 1240095, 1263607, 1285976, 1307335, 1328430, 1350411, 1373472, 1395991, 1415587, 1430806, 1441327, 1446908, 1446966, 1441210, 1430096, 1414584, 1395799, 1374850, 1352432, 1328463, 1302333, 1273496, 1241696, 1207020, 1170163, 1132381, 1094661, 1057081, 1019487, 982464, 946929]
62036I46929l3990l3174l2450l0635k7714k4759k2453k0580j8850j7343j6052
62025F68929j4689j3201j1933j1151j0742j0489j0314j0118r703q989q132p264
62013E42204o369n387m396l576l014k559j892q71K59J252K307L766N346O210O031
61998E39311N440N007M302K546m8k313l418l700m055m987o354p679q552q888q924
61983D97688q899q699q016o829n575m692m125l408k279j064l46k04p3N37J418
61968D45434K099K570L094L469L181K393J989K422L094L348L403L801M415M720
61954D89432M754N025N672O396P171Q278R666J0883J1849J3000J4522J6022J7284
61941F19954J8769K0838K2987K4399K4984K5248K5270K4547K2911K0950J9219
$$ y = [946929, 912939, 879765, 847315, 816680, 788966, 764207, 741754, 721174, 702324, 684981, 668929, 654240, 641039, 629106, 617955, 607213, 596724, 586410, 576292, 566589, 557600, 549468, 542204, 535835, 530448, 526052, 522476, 519462, 516903, 515011, 514140, 514399, 515651, 517958, 521724, 527070, 533280, 539311, 544751, 549758, 554060, 556606, 556558, 554245, 550827, 547127, 543072, 538085, 531731, 524052, 515500, 506612, 497688, 488789, 480090, 472074, 465245, 459670, 454978, 450853, 447445, 445166, 444102, 443756, 443552, 443479, 444016, 445434, 447533, 450103, 453197, 456666, 459847, 462240, 464229, 466651, 469745, 473093, 476496, 480297, 484712, 489432, 494186, 499211, 504883, 511279, 518450, 526728, 536394, 547277, 559126, 572126, 586648, 602670, 619954, 638723, 659561, 682548, 706947, 731931, 757179, 782449, 806996, 829907, 850857, 870076]
61930H70076J7568J5609J3488J1612R864P748N230K859R04j060l415n830p627
61917I37026q475q314p043m750j997O49L189N871Q495J0671J2471J4195J5440
61904I77428J5239J3270J0270O942L150j432o335j0623j3951j6771j9522k1980
61892I35685k3570k4119k4145k4277k4433k3862k2130j9793j7696j6029j4581
61881G01050j3638j3684j4332j4435j3516j2207j1049r747q077o615n763m807
61869E73180k805n4K308L874N254O942Q685J0190J1671J3555J6018J8940K2001
61856F89759K4778K7061K9115L1311L3576L5511L6971L8109L8980L9432L9365
61845A063968L8640L6870L3798K9839K5735K1578J6741J0902M636j227o295j0283
$$ y = [870076, 887644, 903253, 916741, 928353, 938217, 945965, 951195, 954054, 954958, 953898, 950483, 944653, 937026, 928551, 920237, 913194, 908444, 906447, 907096, 910285, 916156, 924651, 935322, 947793, 961988, 977428, 992667, 1005937, 1016207, 1023149, 1026299, 1024867, 1018532, 1007909, 993958, 977187, 957665, 935685, 912115, 887996, 863851, 839574, 815141, 791279, 769149, 749356, 731660, 715631, 701050, 687412, 673728, 659396, 644961, 631445, 619238, 608189, 598442, 590365, 583750, 577987, 573180, 570375, 570321, 572629, 576503, 581757, 588699, 597384, 607574, 619245, 632800, 648818, 667758, 689759, 714537, 741598, 770713, 802024, 835600, 871111, 908082, 946191, 985171, 1024603, 1063968, 1102608, 1139478, 1173276, 1203115, 1228850, 1250428, 1267169, 1278071, 1282707, 1281480, 1275185, 1264902]
61833A264902j2530j2444j0368p418m390j190K505O395R689J1907J3104J3223
61821A273385J1671P902K341l733r341j4587k0139k6223l2282l7490m1254m3349
61809A066901m3943m3532m2613m1253l9134l6102l2572k9259k6555k4251k1911
61798F85776j9298j6472j3677j1332r928r522r384q577o972n377m498m226m137
61785E62376m159m269m106l511l070l381m015l975l141k400k293k319j848j046
61771E18843n31o07j035j271q07K54J045R03L80N77J514K116J873J417J194P37
61755E26602j07m40L24J287J353Q62P67P67l01k374l847l589k276j315j197j335
61739E15181j061l23M32Q19Q80R14J003J001R94J316J892K208K159K354L083L729
$$ y = [1264902, 1252372, 1239928, 1229560, 1222142, 1217752, 1216562, 1219067, 1225462, 1235151, 1247058, 1260162, 1273385, 1285056, 1292958, 1295299, 1291566, 1282225, 1267638, 1247499, 1221276, 1188994, 1151504, 1110250, 1066901, 1022958, 979426, 936813, 895560, 856426, 820324, 787752, 758493, 731938, 707687, 685776, 666478, 650006, 636329, 624997, 615069, 605547, 596163, 587586, 580614, 575237, 570739, 566513, 562376, 558217, 553948, 549842, 546331, 543261, 539880, 535865, 531890, 528749, 526349, 524056, 521737, 519889, 518843, 518312, 517705, 516670, 515399, 514592, 514846, 515891, 516794, 517174, 517751, 519265, 521381, 523254, 524671, 525865, 526602, 526495, 526055, 526379, 527666, 529019, 529881, 530648, 531415, 531114, 528740, 524893, 521304, 519028, 517713, 516516, 515181, 514120, 513797, 514229, 515048, 515928, 516842, 517845, 518846, 519840, 521156, 523048, 525256, 527415, 529769, 532852, 536581]
61723E36581L765L679M049M344L687K475J995K581L142K683J350j71j422k183
61709E66555k499k945m078n502o142n658m847m383l987l313k889l419m586n252
61695E07055m758l552k563k292k569k903k969k810k591k351k041j727j505j334
61681D71090j146j059j236j582j857k006k152k325k411k335k122j829j570j430
61667D46030j298j033q13r41j211j042m83l05p18p80J52J172J070K78L21J537
61651D41936K645K664K057J695J763K058K531L058L335L376L510L629L127J903
61637D79287O49j81j016k302l625m240m054l516k931k410k148k281k575k625k290
61622D43742j716j161q86r43r15k61Q46J382N49j250k870l628l836m215n026n853
$$ y = [536581, 540346, 544025, 548074, 552418, 556105, 558580, 560575, 563156, 566298, 568981, 570331, 570160, 568738, 566555, 564056, 561111, 557033, 551531, 545389, 539731, 534884, 530501, 526514, 523201, 520312, 516893, 512307, 507055, 502297, 498745, 496182, 493890, 491321, 488418, 485449, 482639, 480048, 477697, 475656, 473929, 472424, 471090, 469944, 468885, 467649, 466067, 464210, 462204, 460052, 457727, 455316, 452981, 450859, 449030, 447460, 446030, 444732, 443699, 442886, 441945, 440734, 439692, 439209, 438904, 438186, 437406, 437558, 438730, 439800, 440078, 440399, 441936, 444581, 447245, 449302, 450997, 452760, 454818, 457349, 460407, 463742, 467118, 470628, 474257, 477384, 479287, 479936, 479755, 478739, 476437, 472812, 468572, 464518, 461002, 458071, 455661, 453513, 451232, 448657, 446032, 443742, 442026, 440865, 439979, 439036, 438121, 437860, 438706, 440088, 440637, 439387, 436517, 432889, 429053, 424838, 419812, 413959]
61606D13959o145n926n763n994o271o137n662n146m477l470k608k631l428m025
61592C46276l815l192k756k591k500k359j974j120n5M81M2r98j913k299k173j871
61576C17183j849k223k480k051j124l00K85Q32J024L88n19m22P79J595R62k94
61560C11786p52k39M75J026J570K007K072J874J644J186K67o66r33n39n2L31R04
61543C21961J701K222K016J211M33L33J040K004K532K591K632K674K181J092J83
61528C46806l8q0n19r67p96l03l04r32j681k308k841k930k132p86K13N07M76L90
61510C31775J06l57o91p93q61q89p28o24r90j554j469n07N33Q71O17K39j84p41
61492C23753j173j068m16M50J221J651J480P41m4k65J70Q48J345J501J345R95
$$ y = [413959, 407814, 401888, 396125, 390131, 383860, 377723, 372061, 366915, 362438, 358968, 356360, 353729, 350301, 346276, 342461, 339269, 336513, 333922, 331422, 329063, 327089, 325969, 325914, 326395, 326437, 325439, 323526, 321227, 319054, 317183, 315334, 313111, 310631, 308580, 307456, 307156, 307441, 308273, 309297, 309685, 309166, 308744, 309523, 311118, 312080, 311786, 311034, 310795, 311270, 312296, 313866, 315873, 317945, 319819, 321463, 322649, 322916, 322250, 321317, 320778, 320726, 321057, 321961, 323662, 325884, 327900, 329111, 329544, 329877, 330917, 332921, 335453, 338044, 340676, 343350, 345531, 346623, 346806, 346768, 346688, 346169, 345202, 344406, 344103, 343799, 342867, 341186, 338878, 336037, 333107, 330975, 330189, 330402, 330909, 331385, 331775, 331881, 331524, 330833, 330040, 329179, 328290, 327562, 326938, 325948, 324394, 322925, 322418, 322951, 323822, 324439, 324678, 324494, 323753, 322580, 321512, 321096, 321546, 322767, 324418, 325898, 326639, 326595, 326330, 326500, 327348, 328693, 330194, 331539, 332534]
61476C32534O40L42j3l71k45P65K152K770K158J236J130J698J792R36n7l25o3
61459C47079P2J14N61J386J944J878J453J068Q88R69J249J409J223J019J263J777
61443C65352J965J789J865K449L023L065K732K529K762L498M482N076M745L753
61429D09085K840K250J725J368J615K249K432K008J740J909J767R37K50M37R79
61414D33591J086R67J083J028K25q63j477j894k871m079m421l726k938k590k263
61399D10858j665j216j243j390j172n92M9M74N71M69M41M38M4p17j042m09N06
61382D04404Q00P44J153J827J796J030N88R37J341J244J137J482J791J456P68
61367D22498M57O68J067J546K210K881L136K878K585K944M224N924P208P770Q115
$$ y = [332534, 333174, 333516, 333503, 333132, 332887, 333652, 335804, 338574, 340732, 341968, 343098, 344796, 346588, 347524, 347467, 347142, 347079, 347151, 347265, 347826, 349212, 351156, 353034, 354487, 355555, 356443, 357412, 358661, 360070, 361293, 362312, 363575, 365352, 367317, 369106, 370971, 373420, 376443, 379508, 382240, 384769, 387531, 391029, 395511, 400587, 405332, 409085, 411925, 414175, 415900, 417268, 418883, 421132, 423564, 425572, 427312, 429221, 430988, 431925, 432175, 432612, 433591, 434677, 435644, 436727, 437755, 437980, 437117, 435640, 433746, 430875, 426796, 422375, 418649, 415711, 413121, 410858, 409193, 407977, 406734, 405344, 404172, 403580, 403629, 404103, 404674, 405143, 405584, 406022, 406066, 405349, 404307, 403898, 404404, 405204, 405948, 407101, 408928, 410724, 411754, 412342, 413279, 414620, 415864, 417001, 418483, 420274, 421730, 422498, 422955, 423623, 424690, 426236, 428446, 431327, 434463, 437341, 439926, 442870, 447094, 453018, 460226, 467996, 476111]
61352D76111Q730R393R730J0048J0901J2044J2559J1973J0606Q850O877N053L879
61339E96754L331K901K368J959J678J124J30j085k455m045n450n912n312m411
61325E81575l870l663l615l782l975l638k559j262l30K13O67J274K203L360M178
61310E66776M223M109M953O765Q248Q557Q311Q385Q625Q481Q122P915P271N036
61296F65777J032l521p084q936r373r173q828q150o841n369m692m930n023m128
61282E80761k753j918j740j524q52J24J233K445L587M502N354O381P424Q093Q250
61267F19367Q052P664P279P126P185P143O991P258Q322R891J1484J2931J3870
61254G34563J3381J0925P298L885J217j056l116m824o323p753q444p617o001n494
$$ y = [476111, 484841, 494234, 503964, 514012, 524913, 536957, 549516, 561489, 572095, 580945, 587822, 592875, 596754, 600085, 602986, 605354, 607313, 608991, 610115, 610245, 609160, 606705, 602660, 597210, 591298, 585986, 581575, 577705, 574042, 570427, 566645, 562670, 559032, 556473, 555211, 554881, 555094, 555761, 557035, 559238, 562598, 566776, 570999, 575108, 580061, 586826, 595074, 603631, 611942, 620327, 628952, 637433, 645555, 653470, 660741, 665777, 666809, 663288, 656204, 647268, 637895, 628722, 619894, 611744, 604903, 599534, 594842, 589912, 584889, 580761, 578008, 576090, 574350, 572826, 571974, 572098, 573331, 575776, 579363, 583865, 589219, 595600, 603024, 611117, 619367, 627419, 635083, 642362, 649488, 656673, 663816, 670807, 678065, 686387, 696278, 707762, 720693, 734563, 747944, 758869, 766167, 770052, 771269, 770213, 767097, 762273, 755950, 748197, 739753, 732136, 726135, 720641]
61240G20641o748q183q117o834n686m941l854k355j308j013p01J29R12J137J358
61225F74437K300L493L823L134K406K256K203J622P55K59L50Q10J488K262K807
61210G04405K880K658K373J840Q45j15p1J349L520N518O947Q018R196J0809J2793
61195G72965J4787J6555J8185J9682K0631K0578J9486J7513J4602J0827O883L718
61183I56412J756R34J130J905K090O02k284n173p131q337r225r920j0665j1870
61169I00224j3358j4319j4352j3949j3617j3341j3168j3512j4345j4889j4655
61158G46719j4121j3745j3027j1282q753o215l980k068q65o63p43J48K204M101
61144F77710M213K019j632n292p929r389r937r465p696n057k628r02P43K881N134
$$ y = [720641, 713893, 705710, 697593, 690759, 685073, 680132, 676278, 673923, 672615, 671602, 670901, 671030, 671942, 673079, 674437, 676737, 680230, 684053, 687187, 689593, 691849, 694052, 695674, 696429, 696688, 697038, 697848, 699336, 701598, 704405, 707285, 709943, 712316, 714156, 715001, 714886, 714815, 716164, 719684, 725202, 732149, 740167, 749363, 760172, 772965, 787752, 804307, 822492, 842174, 862805, 883383, 902869, 920382, 934984, 945811, 952694, 956412, 958168, 959102, 960232, 962137, 964227, 964829, 962545, 957372, 950241, 941904, 932679, 922759, 912094, 900224, 886866, 872547, 858195, 844246, 830629, 817288, 804120, 790608, 776263, 761374, 746719, 732598, 718853, 705826, 694544, 685791, 679576, 675596, 673528, 672663, 672000, 671257, 671405, 673609, 677710, 681923, 683942, 682310, 677018, 669089, 659700, 649763, 640298, 632602, 627545, 624917, 624015, 624758, 627639, 632773]
61129F32773O968Q627J0439J1938J2628J3205J4819J7378J9670K1132K2401K3924
61117H15902K5119K5376K5075K4998K5189K5018K4154K2977K1975K1046J9556
61106A076385J7137J4250J1679R547P255M405J270j952n724j0412j5383j9555
61094A088902k2574k4854k6609k7533k7471k6830k6200k5846k5625k5134k4029
61083H06197k2382k0576j8728j6608j4354j2706j2038j1632j0520q733p106o052
61071F44762n210m112k666j125N2M64L46N22J425K588L525M513N858P101P762
61056F65805Q363R628J1217J2276J2923J3892J5098J5849J6401J7887K0524K3126
61044H42989K4746K5695K6630K7630K8554K9439L0198L0710L1277L2277L3373
$$ y = [632773, 639741, 648368, 658807, 670745, 683373, 696578, 711397, 728775, 748445, 769577, 791978, 815902, 841021, 866397, 891472, 916470, 941659, 966677, 990831, 1013808, 1035783, 1056829, 1076385, 1093522, 1107772, 1119451, 1128998, 1136253, 1140658, 1141928, 1139976, 1134252, 1123840, 1108457, 1088902, 1066328, 1041474, 1014865, 987332, 959861, 933031, 906831, 880985, 855360, 830226, 806197, 783815, 763239, 744511, 727903, 713549, 700843, 688805, 677173, 666653, 657920, 650814, 644762, 639552, 635440, 632774, 631649, 631701, 632165, 632511, 633033, 634458, 637046, 640571, 645084, 650942, 658043, 665805, 674168, 683796, 695013, 707289, 720212, 734104, 749202, 765051, 781452, 799339, 819863, 842989, 867735, 893430, 920060, 947690, 976244, 1005683, 1035881, 1066591, 1097868, 1130145, 1163518]
61033A163518L4031L4692L6202L8132L9212L9596M1094M4537M8451N1149N2814
61022A623428N4745N7874O2851P0426Q0794R3759J10228J32071J59462J89926
61012B635564K21384K54966K93463L38428L90275M49550N16071N88045O64014
61003F351760P44374Q29164R16623J007115J106840J224506J366668J538103J734510
60994A6819663J913789J972265J780815J285745N88260r2589n55969p28399o55440
60985B2328140m23594j23232J24777J65388j09929o63068j306871j820740k079942
60976A6090929k091958j939529j708688j457852j220683j013670q40072o96008
60968E122469n77242m80606m01826l36060k80790k36106k01925j76371j56682
$$ y = [1163518, 1197549, 1232241, 1268443, 1306575, 1345787, 1385383, 1426477, 1471014, 1519465, 1570614, 1623428, 1678173, 1736047, 1798898, 1869324, 1950118, 2043877, 2154105, 2286176, 2445638, 2635564, 2856948, 3111914, 3405377, 3743805, 4134080, 4583630, 5099701, 5687746, 6351760, 7096134, 7925298, 8841921, 9849036, 10955876, 12180382, 13547050, 15085153, 16819663, 18733452, 20705717, 22486532, 23772277, 24360537, 24267948, 23711979, 22983580, 22328140, 21904546, 21781314, 21906091, 22071479, 21961550, 21298482, 19991611, 18170871, 16090929, 13998971, 12059442, 10350754, 8892902, 7672219, 6658549, 5818477, 5122469, 4545227, 4064621, 3662795, 3326735, 3045945, 2809839, 2607914, 2431543, 2274861]
60959B274861j40350j25540j11595r9175q8930q0120p1346o2327n3998m6995m1136
60948A353349l6395l3374l2484l3240l4536l5201l4446l2332k9743k7448k5356
60937I98794k3221k1558k0960k0818j9837j7870j6074j5075j4097j2351j0327
60926H06606q987q445q065p335o060m223k313j239j300j606j133P8J389K691M290
60911G64348N966P160P989R184J0862J2243J2850J3239J4104J5319J6309J6937
60899I06510J7395J7606J7301J6588J5914J5464J5085J4735J4567J4406J3675
60888A079246J2148J0393R097Q187P048N425L503J226j742n185q128j0002j1423
60875A099793j3285j5463j7151j8058j8536j8665j8199j7429j7110j7282j7082
$$ y = [2274861, 2134511, 2008971, 1897376, 1798201, 1709271, 1629151, 1557805, 1495478, 1441480, 1394485, 1353349, 1316954, 1283580, 1251096, 1217856, 1183320, 1148119, 1113673, 1081341, 1051598, 1024150, 998794, 975573, 954015, 933055, 912237, 892400, 874530, 858456, 843381, 829284, 816933, 806606, 797619, 789174, 781109, 773774, 767714, 763491, 761178, 759939, 758639, 757033, 755900, 755978, 757367, 760058, 764348, 770314, 777474, 785463, 794647, 805509, 817752, 830602, 843841, 857945, 873264, 889573, 906510, 923905, 941511, 958812, 975400, 991314, 1006778, 1021863, 1036598, 1051165, 1065571, 1079246, 1091394, 1101787, 1110884, 1119071, 1126119, 1131544, 1135047, 1136273, 1134531, 1129346, 1121218, 1111216, 1099793, 1086508, 1071045, 1053894, 1035836, 1017300, 998635, 980436, 963007, 945897, 928615, 911533]
60864I11533j6067j4860j4077j3484j2835j2598j3035j3434j3185j2972j3681
60853G61305j4709j4631j3354j2201j1893j1738j1094j0328r924r709r509r657
60841F22558j0192j0456j0092r731j0008j0521j0516r991r395q730p756o724o055
60828E02391n582m879m093l686l439k681j447o17o38q74o30j31M0M5O18J847K796
60811D79040K615J629Q78P71P35K90q5K57R58R95K08l68M6Q27P91k63j381j630
60793D86313j078n93r35j955k701k463j691j417j869k268k156k100k645l356l604
60778D55482l725m433n487n842n108m070l661l998m496m470l539j916l74L71K67
60763D05001k25o21m91M50J801K467J890R88J042J899K257J660J087J340J958
$$ y = [911533, 895466, 880606, 866529, 853045, 840210, 827612, 814577, 801143, 787958, 774986, 761305, 746596, 731965, 718611, 706410, 694517, 682779, 671685, 661357, 651433, 641724, 632215, 622558, 612366, 601910, 591818, 582087, 572079, 561558, 551042, 541051, 531656, 522926, 515170, 508446, 502391, 496809, 491930, 487837, 484151, 480712, 478031, 476584, 475967, 475329, 474455, 473825, 473694, 473734, 473779, 474397, 476244, 479040, 481655, 483284, 484162, 484933, 485668, 485958, 485873, 486130, 487088, 488083, 488291, 487923, 487969, 488796, 489587, 489324, 487943, 486313, 485235, 484642, 483707, 481752, 479051, 476588, 474897, 473480, 471611, 469343, 467187, 465087, 462442, 459086, 455482, 451757, 447324, 441837, 435995, 430887, 426817, 423156, 419158, 414662, 410192, 406653, 404737, 404363, 404734, 405001, 404776, 404155, 403664, 404114, 405915, 408382, 410272, 411260, 412302, 414201, 416458, 418118, 419205, 420545, 422503]
60748D22503K165K083K273K731K999K931K756K590K312J781Q36o25k308l496l763
60733D37768l500l472l931m520m845m816m516m045l554l245l277l638m084m216
60719C82109l844l201k704k487k436k478k566k412j787j080j016j647k145j891
60705C50415j269r18p11j13O93Q76K22l91o9R29J592J413Q84P17R89J238J173
60688C57670J013J153J756K677L582M126M182M049M166M516M561L992L248K978
60674D03669L174L314L200L223L673M258M477M159L446K499J418M10k20k76J27
60659D40551N82O62K77k58n76o14n75o64r31j239j320j039p02q04j337j691j535
60642D28787j371j867k872l666l943m008m035l790l175k572k401k684l110l333
$$ y = [422503, 424668, 426751, 429024, 431755, 434754, 437685, 440441, 443031, 445343, 447124, 447960, 447335, 445027, 441531, 437768, 434268, 430796, 426865, 422345, 417500, 412684, 408168, 404123, 400569, 397324, 394047, 390409, 386325, 382109, 378265, 375064, 372360, 369873, 367437, 364959, 362393, 359981, 358194, 357114, 356098, 354451, 352306, 350415, 349146, 348228, 347517, 347404, 348097, 348973, 349195, 348804, 348735, 349664, 351256, 352669, 353553, 354270, 355259, 356497, 357670, 358683, 359836, 361592, 364269, 367851, 371977, 376159, 380208, 384374, 388890, 393451, 397443, 400691, 403669, 406843, 410157, 413357, 416580, 420253, 424511, 428988, 433147, 436593, 439092, 440510, 440920, 440700, 440424, 440551, 441133, 441795, 442072, 441814, 441238, 440624, 440049, 439385, 438454, 437215, 435895, 434856, 434154, 433350, 432013, 430322, 428787, 427416, 425549, 422677, 419011, 415068, 411060, 407025, 403235, 400060, 397488, 395087, 392403, 389293, 385960]
60628C85960l104k379j414n08K53R25J443J703J739J575J073K96k42r8M84R06
60612C88612R95R81Q72M97N3J6M02O47L22m07j059j199o75J07L43k31q09n35K55
60593C89187N83L36K65O19R29J156J817K731K809J649K61l22k09J62R60K241L176
60576D08350L032K282J935K250K881L736M822N706O065O351P069P841Q039P981
60562D78340Q348Q779Q226O658N167M235L073J075j091k472l097l517l658k965
60548E07101j467P3J138J976L048M324N473O469P559Q653R181Q900Q476Q833J0000
60533E89737J1079J1278J0470Q691N870K342r79l419n116o337o778o126m953m303
60519F01456m485m846m676l835k549j067M15J842L250M484N133N109N036N642
$$ y = [385960, 382856, 380477, 379063, 378555, 378808, 379733, 381176, 382879, 384618, 386193, 387266, 387562, 387320, 387222, 387706, 388612, 389607, 390588, 391460, 391957, 392010, 392026, 392428, 393075, 393397, 392990, 391931, 390732, 390057, 390164, 390507, 390276, 389467, 388932, 389187, 389770, 390106, 390371, 390990, 391919, 393075, 394892, 397623, 400432, 402081, 402342, 402020, 401811, 401973, 402933, 405174, 408350, 411382, 413664, 415599, 417849, 420730, 424466, 429288, 434994, 441059, 447410, 454479, 462320, 470359, 478340, 486688, 495467, 503693, 510351, 515518, 519753, 522826, 523901, 522810, 520338, 517241, 513724, 510066, 507101, 505634, 505707, 506845, 508821, 511869, 516193, 521666, 528135, 535694, 544347, 553528, 562428, 570904, 579737, 589737, 600816, 612094, 622564, 631255, 637125, 639467, 638488, 635069, 629953, 623616, 616838, 610712, 605759, 601456, 596971, 592125, 587449, 583614, 581065, 579998, 580413, 582255, 585505, 589989, 595122, 600231, 605267, 610909]
60505F10909O948Q449R971J1772J3927J6138J8244K0508K3207K6240K9121L1267
60493H26701L2366L2717L2989L3284L2624K9794K4635J8085J0987L411m846j3528
60481A059219k1931k9343l5210l9174m1151m1416m0442l8618l6073l2810k9127
60470F73924k5744k3169k1020j8459j5406j2799j1346j0617r785q761p963p411
60458E01444o801o191n869n629m960l929l160k871k623k169j854j891j907j600
60444D49990j327j575k130k279j673o84Kqo04j279j532j239o70j33K41M44M76
60427D36020L56J57n8k14k28j02j9j46l99m51l9P99J659K012J686J238J548K796
60409D46615M031M021K477K51j552k391k365j817j002q3O52Q13L74k1L47J353
$$ y = [610909, 617857, 626306, 636277, 648049, 661976, 678114, 696358, 716866, 740073, 766313, 795434, 826701, 859067, 891784, 924773, 958057, 990681, 1020475, 1045110, 1063195, 1074182, 1077593, 1072747, 1059219, 1037288, 1007945, 972735, 933561, 892410, 850994, 810552, 771934, 735861, 703051, 673924, 648180, 625011, 603991, 585532, 570126, 557327, 545981, 535364, 525579, 516818, 508855, 501444, 494643, 488452, 482583, 476954, 471994, 468065, 464905, 462034, 459411, 457242, 455388, 453497, 451590, 449990, 448663, 447088, 444958, 442679, 441006, 440322, 440324, 440316, 439712, 438433, 436901, 435662, 434992, 434859, 435100, 435544, 436020, 436376, 436533, 436475, 436261, 436033, 435931, 435912, 435766, 435367, 434916, 434877, 435676, 437335, 439347, 441033, 442271, 443819, 446615, 450646, 454667, 457144, 457395, 455843, 453452, 451087, 449270, 448268, 448185, 448837, 449650, 450024, 450003, 450350, 451703]
60393D51703K178K466K672L134L452L261K981L135L420L150K332J572J158R20
60379D87534Q66J167J599J642J239R20J074J549J978K110J828J301R82J102J251
60364E08142R44M70O02J534K601L094K886K306J939K403L762N194N793N635N543
60349E52848N947O602P303Q009Q238P316N473L821K848J681o33l746o442p975
60335E91290q370p850o619n124l982l537l650l819l498k540j492j163j717k454
60321E35475k613k095j288n10J39O32J042J528K111K671L311M453O312Q390R794
60306E69352J0108R882J0171J1563J3661J5597J6941J7767J7781J6098J2303P234
60294G28458J986l402r390j5285j9308k0495j9664j8098j6163j3681j0928q531
$$ y = [451703, 453881, 456347, 459019, 462153, 465605, 468866, 471847, 474982, 478402, 481552, 483884, 485456, 486614, 487534, 488400, 489567, 491166, 492808, 494047, 494967, 496041, 497590, 499568, 501678, 503506, 504807, 505789, 506891, 508142, 509086, 509556, 510158, 511692, 514293, 517387, 520273, 522579, 524518, 526921, 530683, 535877, 541670, 547305, 552848, 558795, 565397, 572700, 580709, 588947, 596263, 601736, 605557, 608405, 610086, 609453, 605707, 599265, 591290, 582920, 575070, 568451, 563327, 559345, 555808, 552158, 548339, 544841, 542301, 540809, 539646, 537929, 535475, 532862, 530767, 529479, 528969, 529108, 529740, 530782, 532310, 534421, 537092, 540403, 544856, 551168, 559558, 569352, 579460, 589342, 599513, 611076, 624737, 640334, 657275, 675042, 692823, 708921, 721224, 728458, 730444, 727042, 717652, 702367, 683059, 662564, 642900, 624802, 608639, 594958, 584030, 575499]
60282E75499o775n668n311n664o130n976n152m272l854l861l922l712l124k321
60268E09757j618j221j009o72o5N12M69m82j715k069j113J68M02n85j713k037
60252D97009j596r45m06O1P07J777K978L293J980j89j456j069l7L07j74p77j020
60235E00443q19j58P11J175R35N40P52J656K790L799M526M751M405L828L386L050
60219E35770K771K958L943N233N892N726N453N696O288O690O669O303N698M980
60205F10070M415M206M197L947L209K264J669J633J799J709J267O09k55j333k358
60190F37048l009l404l916m532m845m757m618m589m392l911l524l458l295k511
60176E82287j232r2L86N5q78j793j972j326n99m44n96m01K10P35J010J398K034
$$ y = [575499, 568724, 563056, 557745, 552081, 545951, 539975, 534823, 530551, 526697, 522836, 518914, 515202, 512078, 509757, 508139, 506918, 505909, 505237, 505172, 505684, 506153, 505671, 503956, 501887, 500774, 500942, 501344, 500759, 499046, 497009, 495413, 494468, 494062, 494123, 494830, 496607, 499585, 502878, 504858, 504669, 503213, 502144, 502107, 502414, 502240, 501463, 500443, 499624, 499466, 500177, 501352, 502287, 502827, 503579, 505235, 508025, 511824, 516350, 521101, 525506, 529334, 532720, 535770, 538541, 541499, 545442, 550675, 556567, 562293, 567746, 573442, 579730, 586420, 593089, 599392, 605090, 610070, 614485, 618691, 622888, 626835, 630044, 632308, 633977, 635610, 637409, 639118, 640385, 640994, 640739, 639406, 637048, 634039, 630635, 626719, 622187, 617342, 612585, 607967, 603378, 598986, 595075, 591551, 588093, 584798, 582287, 581055, 580963, 581349, 581404, 580526, 578733, 576761, 575435, 574836, 574392, 573796, 573395, 573605, 574340, 575350, 576748, 578782]
60159E78782K419K026J056L15M31J304K253K599K201J542J292J724K493L084L432
60144F06953L971M829N321M719L558L370M828O768P575P078O358O161O309O425
60130F84223O329N776M631L305K240J110o17k407l068k551k187k734l316k904
60116F87830j852j160j004q20m06j15l35j211k572l731l912l288k962l502m135
60101F56825l976l311k982l076l079k765k154j077M29J673K171K510L489M696
60087F49373M981M124L060K476K194K002K130K575K759K249J319M17m85j748l486
60072F73940n334o718p294p282p249p453p570p314o929o762o668o273n590m977
60058E80527m646m640m937n209m769l343j612m37K30J019K056K855L201L366L538
$$ y = [578782, 581201, 583227, 584283, 584598, 585029, 586333, 588586, 591185, 593386, 594928, 596220, 597944, 600437, 603521, 606953, 610924, 615753, 621074, 625793, 629351, 632721, 637549, 644317, 651892, 658970, 665328, 671489, 677798, 684223, 690552, 696328, 700959, 704264, 706504, 707614, 706997, 704590, 701522, 698971, 696784, 694050, 690734, 687830, 685978, 684818, 683814, 682994, 682588, 682473, 682138, 680927, 678355, 674624, 670712, 667424, 664462, 660960, 656825, 652849, 649538, 646556, 643480, 640401, 637636, 635482, 634405, 634834, 636507, 638678, 641188, 644677, 649373, 654354, 658478, 661538, 664014, 666208, 668210, 670340, 672915, 675674, 677923, 679242, 679659, 679174, 677426, 673940, 668606, 661888, 654594, 647312, 640063, 632610, 625040, 617726, 610797, 604035, 597367, 591094, 585504, 580527, 575881, 571241, 566304, 561095, 556326, 552983, 551371, 550934, 551164, 552183, 554239, 557094, 560295, 563661, 567199]
60043E67199L650L760L950L895L196K187J667J771J747J057J5r46k010l561n405
60028E82172o856p444p301o954o848o912o645n827n049n131o033o736o336m905
60014D93195l178j762q66m67m20m72m19k94l41p27j212j277p17m0N1l70m42L58
59996D80600J516K184K239K222K550L179L790L954L355K261J507J610K115K247
59982E15329J880J421J054O16Q1m20r14j453j812j758j533j540j693j550j009
59967E06699l86J28O41J257K005K911L821M344M370M371M655M706L878K444J271
59952E47115O34P0o81j386j906k264k144j121M06J307R93Pq77j547k208k803l120
59935E30475l130k896k444j914j538j271p69J53J206J876J853J244O74Q92J991
$$ y = [567199, 570849, 574609, 578559, 582454, 585650, 587837, 589504, 591275, 593022, 594079, 594094, 593148, 591138, 587577, 582172, 575316, 567872, 560571, 553617, 546769, 539857, 533212, 527385, 522336, 517205, 511172, 504436, 498100, 493195, 490017, 488255, 487389, 486922, 486502, 486030, 485611, 485317, 484976, 484249, 483037, 481760, 481043, 481003, 481054, 480684, 480242, 480600, 482116, 484300, 486539, 488761, 491311, 494490, 498280, 502234, 505589, 507850, 509357, 510967, 513082, 515329, 517209, 518630, 519684, 520300, 520381, 519961, 519047, 517594, 515782, 514024, 512491, 510951, 509258, 507708, 506699, 506313, 506441, 507082, 508339, 510344, 513255, 517076, 521420, 525790, 530161, 534816, 539522, 543400, 545844, 547115, 547749, 547819, 547138, 545752, 543846, 541582, 539438, 538317, 538723, 540030, 541023, 541030, 540153, 538606, 536398, 533595, 530475, 527345, 524449, 522005, 520091, 518553, 517282, 516513, 516666, 517872, 519748, 521601, 522845, 523519, 524411, 526402]
59920E26402L186L738L862M219M755M858M456M181M344M574M690N115O046O776
59906E91202O395M826K856J316M77Q8j65k15J88P91P73j53j023p15N48J588J968
59889F10745K302K908L313L311L411L736L527K427J400J498K449L297L881M614
59875F52819N165M527K496J66j348j999k378k819l351m011m688m873m211l206
59861F32289k880l494m061l466j733J27J275J630J509J281J401K205L456M599
59847F34138N517O565P761Q559Q636Q122O881M431J178j236j617n98M94J342K158
59832F92331K216L59l132o532q601r453r476q650p314o449o573p031o936o266
59818F08493n613n352n365n287m740l672k565j955j794j671j548j744k206k447
$$ y = [526402, 529588, 533326, 537188, 541407, 546162, 551020, 555476, 559657, 564001, 568575, 573265, 578380, 584426, 591202, 597597, 602423, 605279, 606595, 607072, 607160, 606995, 606780, 606968, 607759, 608532, 608379, 607356, 606641, 607189, 608777, 610745, 613047, 615955, 619268, 622579, 625990, 629726, 633253, 635680, 637080, 638578, 641027, 644324, 648205, 652819, 657984, 662511, 665007, 665173, 663825, 661826, 659448, 656629, 653278, 649267, 644579, 639706, 635495, 632289, 629409, 625915, 621854, 618388, 616655, 616782, 618057, 619687, 621196, 622477, 623878, 626083, 629539, 634138, 639655, 646220, 653981, 662540, 671176, 679298, 686179, 690610, 691788, 690552, 688935, 688337, 688831, 690173, 692331, 694547, 694906, 691774, 685242, 676641, 667188, 657712, 649062, 641748, 635299, 628726, 621695, 614759, 608493, 602880, 597528, 592163, 586876, 582136, 578464, 575899, 573944, 572150, 570479, 568931, 567187, 564981, 562534]
59804E62534k265j919j576j150p58p36j097j529j900k288k523k297j697j024k60
59789E39515P10J407J127k3j155j619j406o67L20Q60M40m12p86p96j208j828j542
59772E32937k00R56J126R89J293J596J242O63P92J764K943L777M076L869L497
59757E61320L441L775M189M670N484O378O585N924N128M764M630M418M245M141
59743F29092L872L571L686M007L615K236P50o7m40q14j112j210j291j280q87n12
59727F43216j015k126k344j121J48J45n93r12q55j047j285j053p11q60j130q27
59711F27630k02L5kK70P04P33M79N37R50J389J928K727L310L238L007L238L420
59694F53391K715J660J613K528K687R71j688l544l864l153k245j675j585j856
$$ y = [562534, 560269, 558350, 556774, 555624, 554866, 554130, 553033, 551504, 549604, 547316, 544793, 542496, 540799, 539775, 539515, 540225, 541632, 542759, 542736, 541581, 539962, 538556, 537889, 538209, 539069, 539509, 539097, 538311, 537515, 536307, 534479, 532937, 532737, 533693, 534819, 535808, 537101, 538697, 539939, 540602, 541394, 543158, 546101, 549878, 553954, 557823, 561320, 564761, 568536, 572725, 577395, 582879, 589257, 595842, 601766, 606894, 611658, 616288, 620706, 624951, 629092, 632964, 636535, 640221, 644228, 647843, 650079, 650829, 650762, 650322, 649508, 648396, 647186, 645895, 644615, 643728, 643216, 642201, 640075, 637731, 636610, 636758, 636903, 636310, 635398, 634543, 633496, 632211, 631158, 630447, 629587, 628457, 627630, 627428, 627463, 627461, 627731, 628435, 629168, 629647, 630184, 631134, 632523, 634451, 637178, 640488, 643726, 646733, 649971, 653391, 656106, 657766, 659379, 661907, 664594, 665565, 663877, 660333, 656469, 653316, 651071, 649396, 647811, 645955]
59680F45955k305k801l118l021k708k743l299l877m117m312m745n012m664l936
59666E95297l328k886k497k333k406k179j254J8J110J946K467K327J655J346J788
59651E91071K127J622Q89P42P16l7j111j541j617k443l948m818m421l482k790
59636E70959k361j961j446n99M88R95L09q41j239r81j200k219l173l524l636l738
59620E45833l501k928k548k459k219j887k129k910l162k174m85J008K060K734
59606E25233K889K533K164K249K612K659J945N59q09j332r73o00p69q61j51Q46
59590E38194J135Q74J008J508J357L81l59k90k21r93k241l031l008k437j798j677
59574E28402k363l272l388k514j454q55o06m28l12j46K65O16L12n55j114q12Q1
$$ y = [645955, 643650, 640849, 637731, 634710, 632002, 629259, 625960, 622083, 617966, 613654, 608909, 603897, 599233, 595297, 591969, 589083, 586586, 584253, 581847, 579668, 578414, 578432, 579542, 581488, 583955, 586282, 587937, 589283, 591071, 593198, 594820, 595709, 596451, 597167, 597130, 596019, 594478, 592861, 590418, 586470, 581652, 577231, 573749, 570959, 568598, 566637, 565191, 564592, 565080, 566075, 566384, 565543, 564304, 563323, 562123, 559904, 556731, 553207, 549571, 545833, 542332, 539404, 536856, 534397, 532178, 530291, 528162, 525252, 522090, 519916, 519431, 520439, 522499, 525233, 528122, 530655, 532819, 535068, 537680, 540339, 542284, 542843, 542034, 540702, 539729, 539129, 538360, 537499, 537348, 538194, 539329, 540203, 541211, 542719, 544076, 544457, 544098, 543808, 543587, 542594, 540353, 537322, 534314, 531877, 530079, 528402, 526039, 522767, 519379, 516865, 515411, 514556, 513950, 513522, 513210, 513064, 513329, 513945, 514257, 513702, 512588, 511776, 511857]
59557E11857J105K013K478K287J915K126K885L505L884M534N432N969O183O774
59543E62947P632P731O950O636P669R366J1110J3662J7380K0128J8730J2414L791
59530G06146l492p304p612n718l210j022P92K354L362L462K846J980R80l27j919
59515F91318l596n328p247r289j1069j2079j2030j1151j0146r578r280q694p668
59502E74163o506n391m267l270k634k203j620j002o92m00N80K121L135L006K333
59487E57353J889J726J696K034K809L476L693L979M871N908O266O079O301P281
59473F15361Q225Q189P171N909M835L595J720l91j578j163L31J960L416M832O049
59458F68461O839P561Q690R806J0037R465R095R313R378Q694P609O614N558M195
$$ y = [511857, 512962, 514975, 517453, 519740, 521655, 523781, 526666, 530171, 534055, 538589, 544021, 549990, 556173, 562947, 570579, 578310, 585260, 591896, 599565, 608931, 620041, 633703, 651083, 671211, 689941, 702355, 706146, 702654, 695350, 687738, 682020, 678810, 677788, 678580, 680934, 684296, 687758, 690604, 692584, 693564, 693237, 691318, 687722, 682394, 675147, 665858, 654789, 642710, 630680, 619529, 609383, 599805, 590525, 581831, 574163, 567657, 562266, 557999, 554729, 552095, 549892, 548272, 547270, 546578, 546178, 546758, 548879, 552014, 555020, 557353, 559242, 560968, 562664, 564698, 567507, 570983, 574676, 578655, 583526, 589434, 595700, 601779, 608080, 615361, 623586, 631775, 638946, 644855, 649690, 653285, 655005, 654614, 653036, 651873, 652204, 654164, 657580, 662412, 668461, 675300, 682861, 691551, 701357, 711394, 720859, 729954, 739267, 748645, 757339, 764948, 771562, 777120, 781315]
59444G81315K598O39k221n984r596j1962j2963j3025j2319j0872r041p265n721
59431F83583m565m042l971l535k121J6K232M321O457Q689J0846J2733J4144J5024
59417G39811J5774J6931J8313J8967J8437J7698J8231K0034K0782J7225P869n287
59405I24785j7589k4813k5771k2223j6806j1182n579N16O832J0948R274N17j2042
59392H16867k2752k8080k8295k5513k1568j7750j4814j2598j0412q147o218m498
59380F16222k477n16L75K73N98K119L901M730M544L970L415L209L692M617N260
59365F53932N490N877O567P099P549Q571R940J0433R758R239R894J1131J2171
59352G67651J3382J5131J6570J6779J6257J5982J5808J4992J3684J2672J2038
$$ y = [781315, 783913, 784552, 782331, 776347, 766751, 754789, 741826, 728801, 716482, 705610, 696569, 689304, 683583, 679018, 674976, 671005, 667470, 665349, 665365, 667597, 671918, 678375, 687064, 697910, 710643, 724787, 739811, 755585, 772516, 790829, 809796, 828233, 845931, 864162, 884196, 904978, 922203, 930072, 924785, 907196, 882383, 856612, 834389, 817583, 806401, 800822, 801338, 808170, 819118, 828392, 828909, 816867, 794115, 766035, 737740, 712227, 690659, 672909, 658095, 645497, 635085, 626938, 620720, 616222, 613745, 613229, 613604, 613877, 614475, 616594, 620495, 625225, 629769, 633739, 637154, 640363, 644055, 648672, 653932, 659422, 665299, 671866, 678965, 686514, 695085, 705025, 715458, 725216, 734455, 744349, 755480, 767651, 781033, 796164, 812734, 829513, 845770, 861752, 877560, 892552, 906236, 918908, 930946]
59341I30946J1105R465P209M363Q72l069p105j0881j3906j5800j6889j7902j8856
59328H59552j9022j8198j6994j5670j3832j1711j0331r849r025p137n198m330
59316G18255m139l672k892k107j042M49J684K161K420K923L130K651K287K835
59302G24943L866M744N759P120Q036Q116Q426R527R514N908j065q697j4660j8191
59288G53346j9128j7662j4866j2013r431o999n154m146l018p32K176M437N968
59275F72778P525R096J0178J1103J2415J3413J3012J1632J0567R781Q169N774
59263G95443L787K381L64k689n703p818r329j0515j0909j0297r300q571q229q180
59249G10435q135p402n706l915k881j901K25K920M337M089L766M472N557O140
$$ y = [930946, 942051, 951516, 958725, 963088, 963960, 960891, 953786, 942905, 928999, 913199, 896310, 878408, 859552, 840530, 822332, 805338, 789668, 775836, 764125, 753794, 743945, 734920, 727783, 722585, 718255, 714116, 710444, 707552, 705445, 704403, 704852, 706536, 708697, 711117, 714040, 717170, 719821, 722108, 724943, 728809, 733553, 739312, 746432, 754468, 762584, 771010, 780537, 790051, 795959, 794894, 786197, 771537, 753346, 734218, 716556, 701690, 689677, 680246, 673247, 668093, 663947, 660929, 660197, 662373, 666810, 672778, 680303, 689399, 699577, 710680, 723095, 736508, 749520, 761152, 771719, 781500, 789669, 795443, 799230, 801611, 801975, 799286, 793583, 785765, 776436, 765921, 755012, 744715, 735415, 726844, 718615, 710435, 702300, 694898, 689192, 685277, 682396, 680495, 680720, 683640, 687977, 692066, 695832, 700304, 705861, 712001]
59235G12001O285O086M999K919P86n68j276j744k086k610l845n620p000p559p773
59220F92995p823p144n621m230l778l811l413k477j550r00l15M10J166J611J457
59205F56577Q20J41m32j179k047k315j635p79n70o59k51N00Q40O80M04j07j061
59188F48927j772j343j1J323K508L817M723M585M101M464N270N077L895L232L645
59173F92441M126M207M697N863O699O755P036Q257R608J0082R750Q967P556N507
59159G91551L450J730mj823l247m391o147q617j0585j1209j1093j1019j0823j0246
59145G07527r778r791r803r446r207r385r269q175o576n354m579l723k509j016
59131F08916N00J492J464Q41P55J620K710L473M375N985Q060R999J1488J2339
$$ y = [712001, 718286, 724372, 729371, 732290, 733076, 732508, 731232, 729488, 727402, 724792, 720947, 715327, 708327, 700768, 692995, 685172, 678028, 672407, 668177, 664399, 660588, 657175, 654698, 653148, 652248, 651933, 652343, 653509, 655120, 656577, 657397, 657538, 657106, 655927, 653880, 651565, 649930, 649151, 648581, 647922, 647671, 648171, 649011, 649691, 650095, 649988, 648927, 647155, 645812, 645801, 647124, 649632, 653449, 658172, 662757, 666858, 671322, 676592, 681669, 685564, 688796, 692441, 696567, 700774, 705471, 711334, 718033, 724788, 731824, 740081, 749689, 759771, 769521, 778488, 786044, 791551, 795001, 796731, 796727, 794904, 791657, 787266, 781119, 772502, 761917, 750708, 739615, 728596, 717773, 707527, 697749, 687958, 678155, 668709, 659502, 650117, 640848, 632673, 626097, 620743, 616164, 612441, 609932, 608916, 609416, 610908, 612372, 613213, 613968, 615588, 618298, 621771, 626146, 632131, 640191, 650190, 661678, 674017]
59117F74017J2496J2426J2665J2819J2018J0555R802J0176J0487R825Q839Q364
59105H04489P998O964N423M076L131K446J915J160l80k474m034m504m532m710
59091H16968m637l901l042k741k861k999l303l958m532m597m529n084o469q191
59077G56124r447r605q881q461r105r809r020p060n902o334o901o240m863l864
59063F50632l327k942k912l223l096k211j490j725k349k441k085j803j481p67
59049F18780J11P12Q99N26n46j707j840q56P7L87Q52J974K962L192L322L893M181
59032F36919L655L339M446O564Q441R678J0558J1104J1473J2361J3856J4823J4521
59019G61738J3915J4069J4220J2799R630N800K060j353l925n290n887o126n546
$$ y = [674017, 686513, 698939, 711604, 724423, 736441, 746996, 756798, 766974, 777461, 787286, 796125, 804489, 812487, 819451, 824874, 828950, 832081, 834527, 836442, 837602, 837222, 834748, 830714, 826210, 821678, 816968, 812331, 808430, 805388, 802647, 799786, 796787, 793484, 789526, 784994, 780397, 775868, 770784, 764315, 756124, 746677, 737072, 728191, 719730, 710625, 700816, 691796, 684736, 678834, 672500, 665599, 659359, 654496, 650632, 647305, 644363, 641451, 638228, 635132, 632921, 631431, 629706, 627357, 624916, 622831, 621028, 619547, 618780, 618891, 619603, 620502, 621028, 620482, 618775, 616935, 616079, 616156, 616543, 617395, 619369, 622331, 625523, 628845, 632738, 636919, 640574, 643913, 648359, 654923, 663364, 673042, 683600, 694704, 706177, 718538, 732394, 747217, 761738, 775653, 789722, 803942, 816741, 826371, 832171, 834231, 832878, 828953, 823663, 817776, 811650, 806104]
59006H06104l877k129j290o94Q33K896M106M286M515N174N432M653L087J256l98
58991H33954j299j258j048j644l004m339n286o021o546o683o480n976m941l393
58977G76036j843m08J514M038O149P143P761Q854R829R745R067Q942R315R266
58963H65408Q679Q165P667O543M884L455K399J066r55l550o622r954j2798j4510
58949H59877j5317j5706j5504j4411j2896j1613j0427q978p588o641n605l895
58937G31296k079j118r10q14j046k212l879m954n278n513n740n383m429l551l126
58922F81264l010l133l354l141k275j459j256j002J61J793K848L300L758M120
58908F78614M028M176N562P725R295J0080J1073J2526J3568J3892J4303J5308
$$ y = [806104, 802227, 800098, 798808, 798114, 798947, 801843, 805949, 810235, 814750, 819924, 825356, 830009, 833096, 834352, 833954, 832655, 831397, 830349, 828705, 825701, 821362, 816076, 810055, 803509, 796826, 790346, 784370, 779429, 776036, 774193, 773785, 775299, 779337, 785486, 792629, 800390, 809244, 819073, 828818, 837885, 846827, 856142, 865408, 874087, 882252, 889919, 896462, 901346, 904801, 907200, 908266, 907311, 903761, 897139, 887185, 874387, 859877, 844560, 828854, 813350, 798939, 786043, 774430, 764003, 755025, 747437, 740796, 735191, 731296, 729217, 728099, 727189, 726375, 725329, 723117, 719238, 714284, 709006, 703493, 697753, 692370, 687941, 684390, 681264, 678254, 675121, 671767, 668626, 666351, 664892, 663636, 662634, 662795, 664588, 667436, 670736, 674494, 678614, 682642, 686818, 692380, 700105, 709400, 719480, 730553, 743079, 756647, 770539, 784842, 800150]
58896H00150J6387J6907J6800J6159J5129J4286J4314J5241J6617J8229J9888
58885I80107K0898K0583J8992J6398J2720Q266M183J101j910n705r359j1690j3578
58872A041006j6799k0923k3544k3465k1774j9730j7451j5045j3219j2146j1163
58861H45747j0019r319r328r448r202q789q451q207q252q684q900q191o911o061
58847G25985n880n802n603n473n331n088n337o538p945q471q238q030p730o789
58833F33730n692n319n217m254k665j706j508j091k81K37O57J839L304L520K432
58818F17986J715K141K565K043J123N35K05J83Q47J680J398j19j513k052k445
58803F26292l106l233k410j578j557j907j944j760j583j302j098j485k245k424
$$ y = [800150, 816537, 833444, 850244, 866403, 881532, 895818, 910132, 925373, 941990, 960219, 980107, 1001005, 1021588, 1040580, 1056978, 1069698, 1077964, 1082147, 1083248, 1081338, 1075633, 1066274, 1054584, 1041006, 1024207, 1003284, 979740, 956275, 934501, 914771, 897320, 882275, 869056, 856910, 845747, 835728, 826409, 817081, 807633, 798431, 789642, 781191, 772984, 764732, 756048, 747148, 738957, 732046, 725985, 720105, 714303, 708700, 703227, 697896, 692808, 687471, 680933, 672988, 664517, 656279, 648249, 640519, 633730, 628038, 622719, 617502, 613248, 610583, 608877, 607369, 606278, 605997, 606234, 606891, 608730, 612034, 615554, 617986, 619701, 621842, 624407, 626450, 627573, 628108, 628313, 628496, 629343, 631023, 632421, 632302, 630789, 628737, 626292, 623186, 619953, 617543, 615965, 614408, 612501, 610557, 608797, 607214, 605912, 604814, 603329, 601084, 598660]
58789E98660j696n76Q28K853M911N727N283M967N310N268M331L568L706L829L027
58774F49996K008J867K357K348J229q88l502n653o390n876n178m749m097l138
58760F20334k547k347j535L63K469L857M510M674M359L879L726L560K611J319
58746F49232J188K581M123M769N031N653O459P132P806Q325Q142P433P099P266
58732G32239P199O887P189Q100Q572Q356Q244Q038O364L227P14J80O31Q26J020
58717H07786J490J434P49R93K922M730M424K480M58j548m245p072q882r933j1385
58702G84401j3310j4781j5474j5848j6048j5884j5553j5402j5252j4763j3953
58691F18133j2780j0902q553o836o354o328n764m769l975l508l235l196l120k351
$$ y = [598660, 596964, 596388, 597216, 600069, 604980, 610707, 615990, 620957, 626267, 631535, 635866, 639434, 643140, 646969, 649996, 652004, 653871, 656228, 658576, 659805, 658917, 655415, 649762, 643372, 637496, 632318, 627569, 623472, 620334, 617787, 615440, 613905, 614268, 616737, 620594, 625104, 629778, 634137, 638016, 641742, 645302, 647913, 649232, 650420, 653001, 657124, 661893, 666924, 672577, 679036, 686168, 693974, 702299, 710441, 717874, 724973, 732239, 739438, 746325, 753514, 761614, 770186, 778542, 786786, 794824, 801188, 804415, 805129, 805309, 805940, 806766, 807786, 809276, 810710, 811459, 812452, 815374, 820104, 824528, 827008, 827466, 825918, 821673, 814601, 805719, 795786, 784401, 771091, 756310, 740836, 724988, 708940, 693056, 677503, 662101, 646849, 632086, 618133, 605353, 594451, 585898, 579062, 572708, 566380, 560616, 555847, 551872, 548364, 545129, 541933, 538813, 536462]
58677E36462r14K76Q66J690L288M953N994O779P680Q137P759P346P715Q512R097
58662F15640R719J0728J1385J0470P645L513r89m741o853p527p817q155q018p327
58648F17673o882o909o500n174l750k956k393j576q23l74J84R70J444J578K113
58633E86625L060L310K428J369Q13K61m60m97L65R96Q79J140K550M055M538M540
58617F15972N002N716O192O738P427P363O151M843M248L623K179N20n67j402k354
58602F71651k834k570k483l182l834l665l111k501j148J018K595K768K690L495
58588F58889M547N048N721P348R108R967J0378J1078J1594J1373J1030J1027J0579
58575G77687R237Q106Q065Q370Q384R022J0897J2778J3598J4370J6313J8739K0498
$$ y = [536462, 535548, 535824, 536690, 538380, 541668, 546621, 552615, 559394, 567074, 575211, 582970, 590316, 598031, 606543, 615640, 625359, 636087, 647472, 657942, 665587, 669100, 668111, 663370, 656517, 648990, 641173, 633018, 625000, 617673, 610791, 603882, 597382, 592208, 588458, 585502, 583109, 581533, 580710, 580336, 580520, 581490, 582934, 584512, 586625, 589685, 592995, 595423, 596792, 597605, 597866, 597406, 596909, 597274, 598270, 599149, 600289, 602839, 606894, 611432, 615972, 620974, 626690, 632882, 639620, 647047, 654410, 660561, 665404, 669652, 673275, 675454, 675974, 675407, 674005, 671651, 668817, 666247, 663764, 660582, 656748, 653083, 649972, 647471, 646323, 647341, 649936, 652704, 655394, 658889, 663436, 668484, 674205, 681553, 690661, 700628, 711006, 722084, 733678, 745051, 756081, 767108, 777687, 786924, 795030, 803095, 811465, 819849, 828871, 839768, 852546, 866144, 880514, 896827, 915566, 936064]
58562I36064K1985K3803K5038K4733K3588K2294J9823J5265R886N380J535k436
58550A126958n770p456q220r224j0176j0562j1176j2516j3386j3180j3685j6395
58538I95212j9692k1238k1377k1697k1802k0318j7733j5466j3328j0488p797o466
58526G97810n620l737j416j49M85J797L244L448K841K759K845K010Q18L91N7j285
58510H06298k735l012l169m745o488o085m123l084l284l078k294k199k584k121
58496G57297j231j481k492k390j026J14Q29K177L953M977N526O745Q177Q571Q626
58481G98372J0006J2242J3420J3423J3585J3739J2591J0470Q748P043L963O1k993
58468I14670n518q867j2044j2715j1200r990r505p829m559j507O02K794N080O142
$$ y = [936064, 958049, 981852, 1006890, 1031623, 1055211, 1077505, 1097328, 1112593, 1122479, 1127859, 1129394, 1126958, 1121188, 1113732, 1105512, 1096288, 1086112, 1075550, 1064374, 1051858, 1038472, 1025292, 1011607, 995212, 975520, 954282, 932905, 911208, 889406, 869088, 851355, 835889, 822561, 812073, 804276, 797810, 792190, 788453, 787037, 786888, 787373, 789170, 792414, 795862, 798703, 801462, 804307, 806317, 807135, 807526, 807583, 806298, 803563, 800551, 797382, 792637, 786149, 780064, 775941, 772857, 769573, 766495, 764201, 762002, 759418, 757297, 756066, 754585, 752093, 749703, 748677, 748791, 749620, 751797, 755750, 760727, 766253, 772998, 781175, 789746, 798372, 808378, 820620, 834040, 847463, 861048, 874787, 887378, 897848, 906596, 913639, 917602, 917663, 914670, 909152, 900285, 888241, 875526, 864326, 854336, 844831, 837002, 832443, 830936, 831538, 834332, 839412, 845554]
58454H45554O084O531P744Q313P753O772N158K153j373l842n680q185j0413j0287
58440H56282q289o748n890l948q98J418K662M191N974O675O564P137Q129Q167
58426H81426P880R000J0836J1226J0383J0138R928P593L615N02j645m688q014
58413I48180r097q373q875j0847j1378r750q554q831q654p247o192n718m094j434
58399H39136J4R9J098L288M408M092M470N746N647L949K977K923J337j826l525
58384H73833k943k716l676l351j034N18R7N3J632K863K875L773O451Q756R610
58369H96741J0626J2162J2135J0419R922J1580J2660J1743J1017J1825J2372J1599
58357A034801J1117J1465J0738Q501O852O138M079O25j003L56K026K517L553N671
$$ y = [845554, 851638, 858169, 865913, 874226, 881979, 888751, 893909, 896062, 894689, 890847, 885167, 876982, 866569, 856282, 847993, 841245, 835355, 831407, 830509, 831927, 834589, 838780, 844754, 851429, 857993, 865130, 873259, 881426, 889306, 898306, 909142, 920368, 930751, 940889, 950817, 958410, 962025, 962527, 960882, 956194, 948180, 939083, 930710, 921835, 910988, 899610, 889860, 881306, 872475, 863821, 856574, 850382, 844664, 840570, 839136, 839150, 839249, 840347, 843635, 848043, 852135, 856605, 862351, 867998, 871947, 874924, 877847, 879184, 877358, 873833, 870890, 868174, 864498, 861147, 860113, 860631, 860728, 860781, 862413, 865276, 868151, 871924, 878375, 887131, 896741, 907367, 919529, 931664, 942083, 952005, 963585, 976245, 987988, 999005, 1010830, 1023202, 1034801, 1045918, 1057383, 1068121, 1076622, 1083474, 1089612, 1093691, 1094316, 1093313, 1093669, 1095695, 1098212, 1101765, 1107436]
58343A107436O769O636P900J0920J2765J2785J3815J6352J7202J5671J5213J6895
58331A260359J7242J4769J2641J2357J0951P188M369M073L160J47j551k8J462
58318A347139P40N85K888M768M306M421P218J0001J0622J1349J3800J5516J5102
58305A448455J5257J7235J7983J6195J5376J7423J9092J8294J7688J8720J8509
58294A640227J6176J5499J7727J8699J6816J6514J9828K2176K0978K0659K4180
58283A849479K7402K7096K6838K9465L1419L0175K9710L2773L5476L5286L6427
58272B191546M1351M5005M4000M3257M6896N0821N1205N1912N6207N9550N8241
58261B739991N6997O0201O3871O3918O3838O6473O7002O2365N8709O1009O4439
$$ y = [1107436, 1114205, 1120841, 1128741, 1139661, 1152426, 1165211, 1179026, 1195378, 1212580, 1228251, 1243464, 1260359, 1277601, 1292370, 1305011, 1317368, 1328319, 1335507, 1339876, 1343949, 1347109, 1347256, 1345705, 1345677, 1347139, 1347879, 1348464, 1351352, 1356120, 1360426, 1364847, 1372065, 1382066, 1392688, 1404037, 1417837, 1433353, 1448455, 1463712, 1480947, 1498930, 1515125, 1530501, 1547924, 1567016, 1585310, 1602998, 1621718, 1640227, 1656403, 1671902, 1689629, 1708328, 1725144, 1741658, 1761486, 1783662, 1804640, 1825299, 1849479, 1876881, 1903977, 1930815, 1960280, 1991699, 2021874, 2051584, 2084357, 2119833, 2155119, 2191546, 2232897, 2277902, 2321902, 2365159, 2412055, 2462876, 2514081, 2565993, 2622200, 2681750, 2739991, 2796988, 2857189, 2921060, 2984978, 3048816, 3115289, 3182291, 3244656, 3303365, 3364374, 3428813]
58250C428813O4503O6108P3509Q1101Q3834Q6966R5536J04293J08285J13114J23877
58239D429939J34497J39310J44546J56588J69696J77461J85438J99926K15578
58230E952979K26994K40703K62374K84428L00360L18419L46623L77799M04860
58221H715539M36504M81255N30934N77603O31362P02731P83713Q66452R63825
58212A4689918J090255J240012J408001J614468J885275K225755K636618L132219
58204B9922521L716701M369501N087073N910714O874347P950295R085753J0264024
58196H3180929J1487713J2736056J3989376J5260288J6548368J7812743J9062798
58189A90078271K0436505K2119907K4223922K6712214K9136128L0123495K7387757
$$ y = [3428813, 3493316, 3559424, 3632933, 3714034, 3797868, 3884834, 3980370, 4084663, 4192948, 4306062, 4429939, 4564436, 4703746, 4848292, 5004880, 5174576, 5352037, 5537475, 5737401, 5952979, 6179973, 6420676, 6683050, 6967478, 7267838, 7586257, 7932880, 8310679, 8715539, 9152043, 9633298, 10164232, 10741835, 11373197, 12075928, 12859641, 13726093, 14689918, 15780173, 17020185, 18428186, 20042654, 21927929, 24153684, 26790302, 29922521, 33639222, 38008723, 43095796, 49006510, 55880857, 63831152, 72916905, 83180929, 94668642, 107404698, 121394074, 136654362, 153202730, 171015473, 190078271, 210514776, 232634683, 256858605, 283570819, 312706947, 342830442, 370218199]
58182C70218199J9053741N571553r805776k2900470l1211783l4832081l5264247
58175B60829136l3849675l1278998k7965347k4333697k0753774j7454157j4565335
58168I0628153j2145262j0158338q517403p163437o066630n176274m429668l799145
58160C3171996l282201k856485k486748k163980j897859j679917j488717j321200
58152A5994889j186276j076373r74816q82255q08219p45620o79793o14075n61252
58143H466210n17903m71160m23066l84957l54796l22362k90481k69700k57566
58134E174219k43361k27805k18704k12548j99517j82002j69960j62322j50557
58125C407443j36303j28092j24324j16265j04779r7976r5159q8764p9628p5275
$$ y = [370218199, 389271940, 394843493, 385037717, 362137247, 330925464, 296093383, 260829136, 226979461, 195700463, 167735116, 143401419, 122647645, 105193488, 90628153, 78482891, 68324553, 59807150, 52643713, 46577083, 41400809, 36971141, 33171996, 29889795, 27033310, 24546562, 22382582, 20484723, 18804806, 17316089, 15994889, 14808613, 13732240, 12757424, 11875169, 11066950, 10321330, 9641537, 9027462, 8466210, 7948307, 7477147, 7054081, 6669124, 6314328, 5991966, 5701485, 5431785, 5174219, 4930858, 4703053, 4484349, 4271801, 4072284, 3890282, 3720322, 3558000, 3407443, 3271140, 3143048, 3018724, 2902459, 2797680, 2699704, 2604545, 2515781, 2436153, 2360878]
58115B360878p5093p1757o5442o2798o3494o1092n5749n3312n3369n0482m5676
58104A702614m4669m6285m4363l9596l8011l9133l7161l2516l0942l2118l0286
58093A287534k5515k3567k4981k4599k1576k0084k0330j8414j4774j3664j4679
58082A065351j3726j1643j2962j6804j8002j6635j7508k0670k1295j8870j7735
58071H79501j8590j7822j5334j4736j5759j4557j1516j0856j2421j1847q913p807
58059G19343q883q104n156m314o485p871p331p829r719r732p607o901q231q298
58045F12882o480n886p065p060n541n560p422p994o904p179q960q874o524n461
58031E15972o622o966n653n572p447q295p165o748p940q162o509n276n171m182
$$ y = [2360878, 2285785, 2214028, 2148586, 2085788, 2022294, 1961202, 1905453, 1852141, 1798772, 1748290, 1702614, 1657945, 1611660, 1567297, 1527701, 1489690, 1450557, 1413396, 1380880, 1349938, 1317820, 1287534, 1262019, 1238452, 1213471, 1188872, 1167296, 1147212, 1126882, 1108468, 1093694, 1080030, 1065351, 1051625, 1039982, 1027020, 1010216, 992214, 975579, 958071, 937401, 916106, 897236, 879501, 860911, 843089, 827755, 813019, 797260, 782703, 771187, 760331, 747910, 736063, 727150, 719343, 710460, 702356, 697200, 692886, 686401, 678530, 671199, 663370, 653651, 643919, 636312, 629411, 621180, 612882, 606402, 600516, 593451, 586391, 580850, 575290, 567868, 559874, 552970, 545791, 536831, 527957, 521433, 515972, 509350, 502384, 496731, 491159, 483712, 475417, 468252, 461504, 453564, 445402, 438893, 433617, 428446, 424264]
58017D24264k303k157l752l818j607k32r73j346k22K18r18j489o31k35p53j43
58001D03903J790K557J629J371K273J982K01k28J390K113O84k96P17J609Q06j76
57985D22325k72q79k474l121k155j711k841l733l345l270m394n210m874m574m588
57970C74884l452j319o18k030l220k775k011j720p66R01J375L14j13R45J642J044
57954C63081O63J165J076Jk82Q02J535J389K148M320N901N998O343P915R344R891
57938D21290J0654J1724J1618J0574J0845J2555J3002J1344J0061J0300R741O845
57926E50553L416R61j742n457q378r430j0285j2016j3000j2313j1834j2789j3348
57913D44338j2061j0572j0448j0182q013n155l637l169k520j925j978k022j550
$$ y = [424264, 421961, 419804, 416052, 412234, 410627, 410395, 409422, 408076, 407854, 408072, 407154, 405665, 405034, 404799, 404046, 403903, 405693, 408250, 409879, 411250, 413523, 415505, 415706, 415478, 416868, 418981, 419665, 419369, 420086, 421695, 422501, 422325, 422053, 421174, 418700, 415579, 413424, 411713, 408872, 405139, 401794, 398524, 394130, 388920, 384046, 379472, 374884, 371432, 370113, 369495, 367465, 364245, 361470, 359459, 357739, 356973, 357874, 359249, 359563, 359450, 360395, 362037, 363081, 363744, 364909, 365985, 365986, 365704, 366506, 368041, 369430, 371578, 375898, 381799, 387797, 394140, 402055, 411399, 421290, 431944, 443668, 455286, 465860, 476705, 489260, 502262, 513606, 523667, 533967, 543708, 550553, 553969, 554930, 553188, 547731, 539353, 529923, 519638, 507622, 494622, 482309, 470475, 457686, 444338, 432277, 421705, 411257, 401075, 393062, 387907, 384270, 381101, 378581, 376656, 374678, 372656, 371106]
57900C71106j362j786j759j060j140k404l031j928l68O06J809L491M086L016K173
57885C71449K860L803L727L389L493L136J963J272J401O85j485l211l355l416
57871C85711m512n347m936m469m623l904j730j76n92j285o80N9j73N5J901L701
57855C59000L806L430M090M723L921K696K335J841P5j733k252k586l956n072m556
57840C65762l798m564n743n334l928l294l262k657j877j808j679n22P55J058J272
57825C30381K447L537L389L125M038M946M262K909K494K345J263M07J405L034
57811C69982K839Q35j253l145n471p341p477o725o597o368m558k206j542k262
57797C18711k210j165q50j584j898j295p04l64K80P93K63n94j40J587L093L852
$$ y = [371106, 369744, 367958, 366199, 365139, 363999, 361595, 358564, 356636, 356268, 356874, 358683, 362174, 366260, 369276, 371449, 374309, 378112, 381839, 385228, 388721, 391857, 393820, 395092, 396493, 397178, 395693, 392482, 389127, 385711, 381199, 375852, 370916, 366447, 361824, 357920, 356190, 356014, 355422, 354137, 353457, 353516, 353343, 353398, 355299, 359000, 362806, 366236, 370326, 375049, 378970, 381666, 384001, 385842, 385917, 384184, 381932, 379346, 375390, 370318, 365762, 361964, 357400, 351657, 346323, 342395, 339101, 335839, 333182, 331305, 329497, 327818, 327296, 328051, 329109, 330381, 332828, 336365, 339754, 342879, 346917, 351863, 356125, 359034, 361528, 363873, 365136, 365543, 366948, 369982, 372821, 373656, 372403, 369258, 363787, 356446, 348969, 342244, 335647, 329279, 324721, 322515, 320973, 318711, 316501, 315336, 314486, 312902, 311004, 309709, 309005, 308641, 308921, 309714, 309977, 309383, 309243, 310830, 313923, 317775]
57781C17775M456M832M479M086M740N885O134N625N456N310L889J410n73j535
57767C71969k211k749k724k693l668n234o031n852n520n104m189l419l755m452
57753C14368l825j868k37K12J05l6k94m59k16r6p10j493j569j397j925k760k843
57736B94957k384k384k717k532k090k398l258l468k707j742j045n53l92n20k90
57721B66477M40O11l52j202q25j83n83j238o88N40R61P57R57R68m52k443k976
57704B60769k095j578j750j288o6M62l5j48Q39K037K665K813K362J073k77o46
57688B65137n25j096j905j403L97K078L476N820R146J2007J4077J6715K0389K3695
57674C68008K5634K7015K8858L1114L3580L6615M0421M4823M9817N4668N6137
$$ y = [317775, 322231, 327063, 331542, 335628, 340368, 346253, 352387, 358012, 363468, 368778, 372667, 374077, 373504, 371969, 369758, 367009, 364285, 361592, 357924, 352690, 346659, 340807, 335287, 330183, 325994, 322575, 318820, 314368, 310543, 308675, 308438, 308650, 308755, 308719, 308425, 307966, 307750, 307654, 306944, 305451, 303882, 302485, 300560, 297800, 294957, 292573, 290189, 287472, 284940, 282850, 280452, 277194, 273726, 271019, 269277, 268232, 267679, 267287, 266767, 266477, 266917, 267528, 267176, 265974, 265149, 264966, 264383, 263145, 262457, 262997, 263958, 264715, 265672, 266640, 266188, 263745, 260769, 258674, 257096, 255346, 254058, 253992, 254454, 254419, 254271, 255110, 257147, 259812, 262625, 264987, 266060, 265783, 265137, 264612, 263516, 261611, 260208, 260605, 262683, 266159, 271979, 281125, 293132, 307209, 323924, 344313, 368008, 393642, 420657, 449515, 480629, 514209, 550824, 591245, 636068, 685885, 740553, 796690]
57663G96690M9387L1761N277k4314n0067o6400p1553o8270o1084n2845m4463l6827
57651D07292l0886k6230k1638j7086j3631j1464r766q266p272o456n328m544m924
57638B39801n512m653k653j313j100r35n33o68j145r08j77k64j134j427j011j129
57622B15239j812j679o61m26j511k404k211j931k203k063r82j16m30j229j620
57607A93961j797j994j706q18j26LJ89O91Q12J84o41j217j584j447n26K91j95
57590A84080j441j744j013q69j846k599k336j890j767j349o38p22j702k155j518
57575A60491j024j440j837j534j320j711j832j107m30n00o69m14l54q39j058n68
57559A43854j50k48r4P10J221Q46M33P50J303J587K053K889L271K802K222J938
$$ y = [796690, 846077, 877838, 883115, 858801, 808734, 742334, 670781, 602511, 541427, 488582, 444119, 407292, 376406, 350176, 328538, 311452, 297821, 286357, 276591, 268325, 261053, 254597, 249269, 244725, 239801, 234289, 229636, 226983, 225670, 224570, 223635, 223102, 222434, 221289, 220381, 220204, 219940, 218806, 217379, 216368, 215239, 213427, 211748, 211087, 210661, 209150, 206746, 204535, 202604, 200401, 198338, 197356, 197240, 196810, 195581, 193961, 192164, 190170, 188464, 187646, 187520, 187523, 187712, 188403, 189215, 189399, 188758, 187541, 185957, 184510, 183984, 184275, 184080, 182639, 180895, 179882, 179013, 177167, 174568, 172232, 170342, 168575, 167226, 166588, 165866, 164164, 162009, 160491, 159467, 158027, 156190, 154656, 153336, 151625, 149793, 148686, 148256, 147756, 147087, 146673, 146319, 145480, 144422, 143854, 143704, 143456, 143362, 144072, 145293, 146139, 146572, 147322, 148625, 150212, 152265, 155154, 158425, 161227, 163449, 165387]
57543A65387J237j09j036q79l97k68j6O61J063Q82Q41J072M76j280k767k864k293
57526A59710k051j840j247q56j005q91j18K91l69j100q21L0O45J294K310K964
57510A56946K611J884J564J398J008P91R42Q52L29J29M15J97p58j147l70K04n48
57493A66447j670j947j838k166k387j844j214j151r11J7L97p95k235k064o54K60
57477A46245K37Jm12j411k421k548k126k014j973j237j47L74L38L53L02k03o97
57460A32661n26j4K78P66J932K985K804J650O03n3o13q31m18k6l90j006q98j89
57442A38715L54O96J243J716J579J084Q07O78L86K03M21O75P14R74J586J745J032
57425A54608K86J65N3n15o49K26Q85L5j502k071j649j342j335j023m66o1M91J418
$$ y = [165387, 166624, 166515, 165479, 164600, 164203, 163935, 163919, 164580, 165643, 166525, 167366, 168438, 168914, 167634, 164867, 162003, 159710, 157659, 155819, 154572, 153716, 152711, 151820, 151702, 151993, 151624, 150524, 149703, 149733, 150378, 151672, 153982, 156946, 159557, 161441, 163005, 164403, 165411, 166202, 167144, 167996, 168325, 168454, 168869, 169066, 168308, 167161, 166791, 166995, 166447, 164777, 162830, 160992, 158826, 156439, 154595, 153381, 152230, 151319, 151336, 151733, 150938, 148703, 146639, 145985, 146245, 146482, 146483, 146071, 144660, 142239, 139691, 137565, 135551, 133578, 132341, 132194, 132568, 132906, 133259, 133561, 133358, 132661, 132135, 132121, 132399, 133165, 135097, 138082, 140886, 142536, 143139, 143086, 142473, 141642, 141224, 141198, 140808, 139802, 138904, 138715, 139069, 139765, 141008, 142724, 144303, 145387, 146194, 146872, 147258, 147461, 147882, 148557, 149271, 150245, 151831, 153576, 154608, 154894, 155059, 155112, 154597, 153948, 154174, 155059, 155094, 153592, 151521, 149872, 148530, 147195, 146172, 145706, 145645, 146136, 147554]
57407A47554J848J089R5Q7N91N14J83M99R31L84o05n95L19P88N46N03Q14P65M74
57388A56784Q81J999K815K871K582K117J332O55O82J096J171J007J034Q89R9p05
57372A77309p04l62n49q49m43P4m33j446j462m92K5m39r85j041q81n56J32P20
57354A67618O38L95P10R52J25j060r48M45J534J635J482J433J055M74L59N02J18
57337A77467m97l15N31R46Q55J089J441P72p97j711j277l86J57L90K37n18j209
57320A77175r90m72q77j689j231L87J175L82m97k99L53P38J124J448R23k75p62
57303A76613j78J78l13m50N88J717J743J150R44J103J272J732K543K803J902O21
57287A93968N1J40J67j21n48j079j777k663l821n137n967n874n484n628n955n673
$$ y = [147554, 149402, 150491, 150586, 150673, 151264, 151778, 151961, 152460, 153391, 153775, 153170, 152575, 152894, 153682, 154228, 154731, 155545, 156310, 156784, 157665, 159664, 162479, 165350, 167932, 170049, 171381, 172036, 172718, 173814, 174985, 175992, 177026, 177915, 178014, 177309, 176605, 176243, 175694, 174845, 174402, 174476, 174043, 172597, 171135, 170643, 170668, 170229, 169244, 168203, 167322, 166766, 166898, 167618, 168256, 168651, 169361, 170313, 170438, 169378, 168430, 168875, 170409, 172044, 173526, 174959, 176014, 176488, 176847, 177349, 177467, 176970, 176655, 177186, 178132, 178987, 180076, 181517, 182289, 181492, 179781, 178504, 178118, 178275, 178665, 178902, 178384, 177175, 176185, 175713, 174836, 173147, 171916, 172303, 173478, 173860, 173363, 173064, 173417, 174155, 175279, 176727, 177650, 177375, 176613, 176435, 176613, 176300, 175850, 176438, 178155, 179898, 181048, 181992, 183095, 184367, 186099, 188642, 191445, 193347, 193968, 194019, 194159, 194326, 194205, 193657, 192578, 190801, 188138, 184317, 179180, 173213, 167339, 161855, 156227, 150272, 144599]
57271A44599n305o028p303p043m416q03K330M757O353O524N555M929N450O392
57257A55991P014P507P872P412O085M910M408L910L061K517K568K539K201K288
57243B20283K931L092K424K098K854L725L674L234L378L992M483M829N096M944
57229B71037M412M235M626M863M703N019O252P421P573P096O859P031P432Q039
57215C56598Q480Q193P518P504Q149Q250P464O958P401P972Q134Q707J0109J1250
57201D72687J1302J1109J1642J2442J2842J3243J3976J4273J3778J3678J4932
57190F15904J6504J6819J5881J4679J3536J2461J2075J2759J3692J3989J3926
57179G72225J3972J3733J3027J2749J3351J3635J2606J1326J1292J2059J2232
$$ y = [144599, 139294, 133266, 125963, 118920, 114504, 113701, 116031, 120788, 127141, 133665, 139220, 144149, 149599, 155991, 163005, 170512, 178384, 185796, 191881, 196791, 201199, 205109, 208170, 210687, 213255, 215794, 217995, 220283, 223214, 226306, 228730, 230828, 233682, 237407, 241081, 244315, 247693, 251685, 256168, 260997, 266093, 271037, 275449, 279684, 284310, 289173, 293876, 298895, 305147, 312568, 320141, 327237, 334096, 341127, 348559, 356598, 365078, 373271, 380789, 388293, 396442, 404692, 412156, 419114, 426515, 434487, 442621, 451328, 461437, 472687, 483989, 495098, 506740, 519182, 532024, 545267, 559243, 573516, 587294, 600972, 615904, 632408, 649227, 665108, 679787, 693323, 705784, 717859, 730618, 744310, 758299, 772225, 786197, 799930, 812957, 825706, 839057, 852692, 865298, 876624, 887916, 899975, 912207]
57168I12207J1942J2390J3591J4404J4491J4509J4657J4464J3911J3520J3469
57157A063555J3661J4256J5207J5802J5698J5688J6414J7088J6668J5621J5204
57146A234862J5612J6102J6336J6423J6211J5776J5969J7235J8581J8885J8529
57135A420521J8493J8659J8469J8449J9483K1150K2371K3168K4292K5693K6953
57124A657701K8632L1556L5251L8747M2468M7581N3964O0606O7638P6072Q5843
57113B226059R6095J07274J20964J37685J56732J78359K04178K35476K73361L20679
57103D056862L81419M57317N46841O47757P58246Q74382R88691J092643J179546
57094A0983704J245246J289263J317047J338169J359545J381962J404461J426862
$$ y = [912207, 924149, 936539, 950130, 964534, 979025, 993534, 1008191, 1022655, 1036566, 1050086, 1063555, 1077216, 1091472, 1106679, 1122481, 1138179, 1153867, 1170281, 1187369, 1204037, 1219658, 1234862, 1250474, 1266576, 1282912, 1299335, 1315546, 1331322, 1347291, 1364526, 1383107, 1401992, 1420521, 1439014, 1457673, 1476142, 1494591, 1514074, 1535224, 1557595, 1580763, 1605055, 1630748, 1657701, 1686333, 1717889, 1753140, 1791887, 1834355, 1881936, 1935900, 1996506, 2064144, 2140216, 2226059, 2322154, 2429428, 2550392, 2688077, 2844809, 3023168, 3227346, 3462822, 3736183, 4056862, 4438281, 4895598, 5442439, 6090196, 6848442, 7722824, 8711515, 9804158, 10983704, 12228950, 13518213, 14835260, 16173429, 17532974, 18914936, 20319397, 21746259]
57086B1746259J441013J421682J337968J183504R93890Q25228P07685O16749M89102
57077C0763080K68552n6064m47084q44573j199263j488747j710948j867732j956449
57068B1460772j974629j927691j829051j694312j537554j371679j208149j054816
57060H862891r15540p92545o87437n99603n25719m62216m07172l59371l17231
57051C796057k79766k47099k18927j93860j71321j52641j38778j28232j18667
57042B146766j09548j01690r5114q8938q2552p5540o7214n7626m8286m0507l3888
57031A345863k7748k2778j9542j6482j1629n286J395R498K0323K9795K8497R933
57019A341839k2235n6382q1501r3236r3578q7110p7750o7744n8335n0474m4419
$$ y = [21746259, 23187272, 24608954, 25946922, 27130426, 28124316, 28949544, 29657229, 30273978, 30763080, 31031632, 30975568, 30528484, 29683911, 28484648, 26995901, 25284953, 23417221, 21460772, 19486143, 17558452, 15729401, 14035089, 12497535, 11125856, 9917707, 8862891, 7947351, 7154806, 6467369, 5867766, 5342047, 4879831, 4472659, 4113288, 3796057, 3516291, 3269192, 3050265, 2856405, 2685084, 2532443, 2393665, 2265433, 2146766, 2037218, 1935528, 1840414, 1751476, 1668924, 1593384, 1526170, 1468544, 1420258, 1379751, 1345863, 1318115, 1295337, 1275795, 1259313, 1247684, 1242398, 1243793, 1253291, 1273614, 1303409, 1331906, 1341839, 1319604, 1263222, 1181721, 1088485, 994907, 907797, 830047, 762303, 703968, 653494, 609075]
57008F09075l9323l4152k9017k4856k1957j9620j7189j4653j2221j0058q437p474
56996C70118o780n967n296n109m937m019k513j316p80l93K95J245K339L505M405
56981C44797M581L762J678k012o973j1821j5214j6852j6907j5241j2149r004o899
56968B41746n174k588N20K669L521M187N319O320O700P001Q025R970J2368J4153
56954C14737J3853J0656N250j051p609j3991j8811k0447j8911j5785j2401r083
56942B26407o026l651j913k62J566L536N903Q874J1880J4141J5826J7635J9474
56929C13390K0464J9891J7094J1031J573q990j7319k2085k4403k5433k5086k3219
56917B36908k0491j7589j4662j1931r743p909n938m053k956k577k181j589j216
$$ y = [609075, 569752, 535600, 506583, 481727, 459770, 440150, 422961, 408308, 396087, 386029, 377592, 370118, 363338, 357371, 352075, 346966, 342029, 338010, 335497, 334181, 333401, 333008, 333303, 334548, 336887, 340392, 344797, 349378, 353140, 354818, 352806, 345833, 334012, 318798, 301946, 285039, 269798, 257649, 248645, 241746, 236572, 233984, 234504, 237173, 240694, 244881, 250200, 256520, 263220, 270221, 278246, 288216, 300584, 314737, 328590, 339246, 344496, 343445, 335836, 321845, 303034, 282587, 263676, 247891, 235490, 226407, 220381, 216730, 214817, 214555, 216121, 219657, 225560, 234434, 246314, 260455, 276281, 293916, 313390, 333854, 353745, 370839, 381870, 383443, 374453, 357134, 335049, 310646, 285213, 260127, 236908, 216417, 198828, 184166, 172235, 162492, 154583, 148645, 144592, 141636, 139059, 136878, 135289, 134073]
56904A34073r72m10J57L2l66J53J697L120L822M302M803M956M981N698P077Q196
56888A81319Q976J0395J2630J4490J5189J5107J4205J1345O114k1n281r242j2002
56875B63224j2911j1253p529l133R08M362P467J0630J4020J7283K0052K2601K5275
56862C50996K7611K9147L0831L4199L8888M2131M0954L3926K1108M105j3379k6770
56850F13747l3519l4246l0936k5176j8239j1250m505K453R679J6629K3110K9192
56838E36939L4219L7413L9665M3104M8650N5434O2393O8113O8682N8591L5798
56827A089001M723k6870n2771o9753p6782p5050o7759n7996m7070l5556k4678
56816E59439j5392p258M36P274J2702J7505K2928K8865L4259L8826M3137M6957
$$ y = [134073, 133101, 132691, 132848, 132880, 132514, 132667, 134364, 137484, 141306, 145608, 150411, 155367, 160348, 166046, 173123, 181319, 190295, 200690, 213320, 227810, 242999, 258106, 272311, 283656, 289770, 289749, 284468, 275226, 263224, 250313, 239060, 231531, 228398, 229306, 233668, 241135, 251765, 265785, 283068, 303120, 325721, 350996, 378607, 407754, 438585, 472784, 511672, 553803, 594757, 628683, 649791, 653896, 640517, 613747, 580228, 545982, 515046, 489870, 471631, 460381, 455876, 458329, 468008, 484637, 507747, 536939, 571158, 608571, 648236, 691340, 739990, 795424, 857817, 925930, 994612, 1053203, 1089001, 1093724, 1066854, 1014083, 944330, 867548, 792498, 724739, 666743, 619673, 584117, 559439, 544047, 536789, 537225, 544499, 557201, 574706, 597634, 626499, 660758, 699584, 742721, 789678]
56804G89678M8066M2747K7799L557k4418m7974o1880o6450o4794n9154n0811m1605
56792D94761l3430k6618k0296j4030q142k912J569N177Q188J1399J5083J8453
56780D49202K0815K2368K2908K0643J3532J600j2832k6654l7093m2348m2482l9473
56768C50186l5493l1271k6648k2066j8476j6169j4545j3006j1495j0248r414q835
56756A32520q042o781n440m492l658k435j294j207j991k336j769j180j127j014
56742H9754n09l40q84j327j043o21o67o95j46N65Q33P63N58L4o15o52o1K60J12
56723H5319M97J743K616K251J470J194R93M03J63P71J182M70m01n9J089J664J371
56706A02736Q35K96j31J56J185J626M89j189j823j486j231j140o76j50j53j71
$$ y = [789678, 837744, 880491, 908290, 911847, 887429, 839455, 777575, 711125, 646331, 587177, 536366, 494761, 461331, 434713, 414417, 400387, 392245, 389333, 390902, 396079, 404267, 415666, 430749, 449202, 470017, 492385, 515293, 535936, 549468, 551068, 538236, 511582, 474489, 432141, 389659, 350186, 314693, 283422, 256774, 234708, 216232, 200063, 185518, 172512, 161017, 150769, 141355, 132520, 124478, 117697, 112257, 107765, 104107, 101672, 100378, 99171, 97180, 94844, 93075, 91895, 90768, 89754, 89245, 88905, 88021, 86694, 85651, 85030, 84363, 83668, 83522, 84087, 84920, 85683, 86241, 86275, 85660, 85008, 84947, 85207, 85319, 85816, 87559, 90175, 92426, 93896, 95090, 96083, 96486, 96649, 97420, 98602, 99072, 98671, 98612, 99701, 101365, 102736, 103571, 103867, 103736, 103892, 105077, 106703, 107192, 106003, 104180, 102694, 101463, 100323, 99647, 99497, 99344, 99173]
56690I9173O29J727J910J111J72o24j367j507n92M60L99m31o67o2M73O16Q42J136
56672A03398R26K82j15r8j7K42J068K103K474J990J251P43O24J004J671J904J382
56655A20832P91Q32J237J512J835K402K647K097J228O40K20o5L12J251J541P42
56639A40054J91Q64J635J209M29P26J503J161j94j152j416j716j881j201k96n60
56623A39356j863k714k608k388k410k141j507j025n83L32J283J301N86L24Q36
56608A26779J267J046L85n01j490k090j982j669j555j054J86J083N93m44n81l8
56592A19935Q3k5N52J333J069O7k82P0k7n76l72P24J500J464J364J560J614J494
56574A31547J588J652J314J304K422L776L890L175L203L961M103L638L971N271
$$ y = [99173, 99802, 101529, 103439, 104550, 104722, 104098, 102731, 101224, 100632, 101092, 101491, 101060, 100393, 100331, 100804, 101420, 102262, 103398, 104324, 104606, 104491, 104393, 104376, 104618, 105686, 107789, 110263, 112253, 113504, 114247, 114871, 115875, 117546, 119450, 120832, 121623, 122455, 123692, 125204, 127039, 129441, 132088, 134185, 135413, 136053, 136273, 136208, 136520, 137771, 139312, 140054, 140245, 141109, 142744, 143953, 144382, 145108, 146611, 147772, 147578, 146426, 145010, 143294, 141413, 140212, 139916, 139356, 137493, 134779, 132171, 129783, 127373, 125232, 123725, 122700, 122117, 122449, 123732, 125033, 125619, 125943, 126779, 128046, 129092, 129477, 128976, 127486, 125396, 123414, 121745, 120190, 119136, 119322, 120405, 120998, 120554, 119973, 119935, 120018, 119993, 120545, 121878, 122947, 123014, 122732, 122802, 122775, 122199, 121827, 122551, 124051, 125515, 126879, 128439, 130053, 131547, 133135, 134787, 136101, 137405, 139827, 143603, 147493, 150668, 153871, 157832, 161935, 165573, 169544, 174815]
56560A74815O181O320O760P746Q108P300N968M317J994k22q39p4K88k20k76M52
56544B28618M43j018k579l086l128l400l397k730k165k384k995l406l528l249
56530A91996k472j854k124k763k781k519k884l157j922J09O48n90j481r89m35
56515A66782p27j001q35j215k275k537j434l79k17Q0J063J426L40r12j046n72
56499A56541k66K34J009R69k47j291j275j154j609j532j50J201J063J45j29Q6
56483A53595j13n02k99K97O10O54P13N99K51J74M78N21J26n1N7l29j101q88O87
56464A55479K043J895Q78J0p54j418j148J43R79M13n13n32k7R5j4J05K28L26J093
56445A59281K508L245K651J904K080K444J873O77j76m86m11J29O65J58j335k324
$$ y = [174815, 180996, 187316, 194076, 201822, 209930, 217230, 223198, 227515, 229509, 229287, 228448, 228374, 228662, 228442, 228166, 228618, 229061, 228043, 225464, 222378, 219250, 215850, 212453, 209723, 207558, 205174, 202179, 198773, 195245, 191996, 189524, 187670, 185546, 182783, 180002, 177483, 174599, 171442, 169520, 169629, 170277, 169687, 168206, 167217, 166782, 166055, 165054, 164219, 163004, 160729, 158192, 156758, 156379, 156162, 156242, 157305, 158731, 159071, 158159, 157113, 156541, 156275, 156509, 157518, 158487, 158240, 156949, 155674, 154520, 152911, 151379, 151229, 152430, 153493, 153638, 153509, 153595, 153482, 152980, 152681, 152978, 153588, 154242, 154955, 155554, 155805, 155979, 156457, 156978, 157104, 157053, 157110, 156781, 155680, 154792, 155479, 157522, 159417, 160295, 160305, 159551, 158133, 156985, 157128, 158107, 158520, 158007, 157475, 157448, 157543, 157529, 157634, 157862, 158188, 159281, 161789, 165034, 167685, 169589, 171669, 174113, 175986, 176663, 176487, 176001, 175590, 175719, 176384, 176542, 175207, 172883]
56429A72883k028j386j158p55P7L01m67q62K6J048R76M97P28J279J301J081J137
56412A74678J039M35L9K88L62k48o29o9O06N37K89N62R94J266J852K559K108L54
56394A87022q50l34O97R12Q47J198J230N52M58J664K611J950Q71R60J565J401
56378B02754J043J513J999J327L25L84R35O64K6K95J057R61P9n05o13o42k34Q74
56360B12242J634J101Q0k51k65p19r38k0J297J791J664J645J388N72K22J061J867
56343B24371J346L69L68R26R31Q12J413J948J325M59R84K561L544L395K642J455
56327B48849J08l15N85J504J538J734K862L485K381R71Q90J055k72k105k314j121
56311B59835j94M37J649K681K278J335J553K425K401J980K713M127M614M401M748
$$ y = [172883, 170855, 169469, 168311, 167556, 167633, 167934, 167467, 166605, 166631, 167679, 168655, 169152, 169880, 171159, 172460, 173541, 174678, 175717, 176152, 176191, 176479, 176841, 176593, 175964, 175895, 176501, 177038, 177327, 177889, 178883, 180149, 182001, 184560, 186668, 187022, 186172, 185838, 186535, 187447, 188294, 189492, 190722, 191274, 191732, 193396, 196007, 197957, 198828, 199788, 201353, 202754, 203797, 205310, 207309, 208636, 208961, 209345, 210280, 210944, 210970, 211265, 212322, 213283, 213362, 212857, 212244, 211602, 211368, 212242, 213876, 214977, 215057, 214806, 214541, 213822, 212884, 212864, 214161, 215952, 217616, 219261, 220649, 221221, 221443, 222504, 224371, 225717, 226086, 226454, 227380, 228311, 229123, 230536, 232484, 233809, 234268, 235252, 237813, 241357, 244752, 247394, 248849, 248957, 248642, 249227, 250731, 252269, 254003, 256865, 260350, 262731, 263702, 264592, 265647, 265375, 263270, 260956, 259835, 259641, 260078, 261727, 264408, 266686, 268021, 269574, 271999, 274400, 276380, 279093, 283220, 287834, 292235, 296983]
56296B96983M994L550J132m1K37L54N8N75J983L152L928M818N118L954K538K727
56280C36060L978M459M298M985O230O497O103O764Q436R458R464R505R757R751
56266D35745J0268J2261J4554J5462J5881J7890K1054K3287K4655K7020L0464
56255F48541L3375L5762L9173M3573M7425N0609N4227N7830N9970O1129O3004
56244A194618O5194O5753O4588O3103O0949N6452M9845M2735L4829K4685J3248
56233A735999K906o562j7256k8620l7601m3424m8257n2987n6154n7462n8411n9060
56221A273111n7877n5234n3315n2201m9741m5768m2545m0498l7495l3117k9725
56210G75595k8296k6996k4811k2960k1699j9411j6041j3880j3711j3510j2125
$$ y = [296983, 301977, 305527, 306659, 306618, 306855, 307209, 307267, 307842, 309825, 312977, 316905, 321723, 326841, 330795, 333333, 336060, 340038, 344497, 348795, 353780, 360010, 366507, 372610, 379374, 387810, 397268, 406732, 416237, 425994, 435745, 446013, 458274, 472828, 488290, 504171, 522061, 543115, 566402, 591057, 618077, 648541, 681916, 717678, 756851, 800424, 847849, 898458, 952685, 1010515, 1070485, 1131614, 1194618, 1259812, 1325565, 1390153, 1453256, 1514205, 1570657, 1620502, 1663237, 1698066, 1722751, 1735999, 1738905, 1732343, 1715087, 1686467, 1648866, 1605442, 1557185, 1504198, 1448044, 1390582, 1332171, 1273111, 1215234, 1160000, 1106685, 1054484, 1004743, 958975, 916430, 875932, 838437, 805320, 775595, 747299, 720303, 695492, 672532, 650833, 631422, 615381, 601501, 587790, 574280, 562155]
56199E62155j0875j0410r317p059n173m421l734k848k880l456k625n02L38q75
56185D98318j797r57K13M98P81J558J678P95L18Q82J458J727K540L617L684L208
56169E18521L945N539N950N400O185Q393R634R427R853J1335J1969J1705J2937
56156F30793J6016J8440J9468K1353K4889K8046L0205L3586L9024M4378M8537
56145I54735N3172N9201O5449P1780P9666Q8662R6496J03443J12204J22466J30120
56134A937394J32780J31338J25260J11929R2330P2282N6096M3718L5226L2261
56124B770614L2770K9979J9680M160j2896l0219m5626n4902n7455n8539o3002
56113B534564p1050q2022r6773j13436j26180j31488j31194j26960j17161j02120
$$ y = [562155, 551280, 540870, 531553, 524494, 519321, 514900, 511166, 508318, 505438, 501982, 499357, 498855, 499193, 498318, 496521, 495564, 495777, 496275, 497056, 498614, 500292, 501087, 501405, 502287, 503745, 505472, 508012, 511629, 515313, 518521, 522466, 528005, 533955, 539355, 545540, 553933, 563567, 572994, 582847, 594182, 606151, 617856, 630793, 646809, 665249, 684717, 706070, 730959, 759005, 789210, 822796, 861820, 906198, 954735, 1007907, 1067108, 1132557, 1204337, 1284003, 1372665, 1469161, 1572604, 1684808, 1807274, 1937394, 2070174, 2201512, 2326772, 2438701, 2531031, 2603313, 2659409, 2703127, 2738353, 2770614, 2803384, 2833363, 2853043, 2857203, 2844307, 2814088, 2768462, 2713560, 2656105, 2597566, 2534564, 2463514, 2381492, 2284719, 2171283, 2045103, 1913615, 1782421, 1655461, 1538300, 1436180]
56103A436180q6799p4623o3618n1942m2035l5793l0693k4567j9316j6410j3494
56092I76890r104n816n192m511k024l99j244j488R53L113K575J905L493N059M548
56077I68758M286O093P357O310N954Q486J0955J0856J0743J2878J4675J4048J3744
56064A095143J5735J6842J4799J3067J4573J6283J5149J3758J4727J5265J2858
56053A258199J0679J1690J2992J1702J0766J3064J5546J5158J4815J7424J9904
56042A411939J9336J9061K2282K5601K5466K4928K7336K9594K8559K7815L0908
56031A692825L4204L3821L3207L6318L9785L9677L9381M2688M5832M4746M3438
56020B125922M6524N0226M9791M8966N2847N8018N9373N9935O4261O8921O9425
$$ y = [1436180, 1349381, 1274758, 1211140, 1159198, 1117163, 1081370, 1050677, 1026110, 1006794, 990384, 976890, 967786, 961970, 956778, 952267, 950243, 949844, 948600, 947112, 948065, 951178, 953753, 955658, 959151, 964210, 968758, 973044, 979137, 986494, 992804, 998758, 1007244, 1018199, 1029055, 1039798, 1052676, 1067351, 1081399, 1095143, 1110878, 1127720, 1142519, 1155586, 1170159, 1186442, 1201591, 1215349, 1230076, 1245341, 1258199, 1268878, 1280568, 1293560, 1305262, 1316028, 1329092, 1344638, 1359796, 1374611, 1392035, 1411939, 1431275, 1450336, 1472618, 1498219, 1523685, 1548613, 1575949, 1605543, 1634102, 1661917, 1692825, 1727029, 1760850, 1794057, 1830375, 1870160, 1909837, 1949218, 1991906, 2037738, 2082484, 2125922, 2172446, 2222672, 2272463, 2321429, 2374276, 2432294, 2491667, 2551602, 2615863, 2684784, 2754209]
56009B754209O9800P5215Q1976Q4888Q7280R3581R9652J01255J03977J13423J23929
55998C789185J28719J32680J42731J54414J61101J67422J79870J93362K01368
55989E250852K09931K26747K46033K59960K74875K99621L28255L51927L77329
55980G825530M14744M58591M99424N44255O04435O74752P46331Q28667R36181
55971A3532910J065355J209749J385478J616701J909043K262100K690475L203052
55963B8874863L781659M416180N141263N996964O968983Q008912R094441J0224411
55955H2507676J1377641J2530836J3695369J4879203J6043837J7176085J8382763
55948A86593410J9842411K1686004K3935136K6309056K7744395K6197320J9592942
$$ y = [2754209, 2824009, 2899224, 2981200, 3066088, 3153368, 3246949, 3346601, 3447856, 3551833, 3665256, 3789185, 3917904, 4050584, 4193315, 4347729, 4508830, 4676252, 4856122, 5049484, 5250852, 5460783, 5687530, 5933563, 6193523, 6468398, 6768019, 7096274, 7448201, 7825530, 8240274, 8698865, 9198289, 9742544, 10346979, 11021731, 11768062, 12596729, 13532910, 14598265, 15808014, 17193492, 18810193, 20719236, 22981336, 25671811, 28874863, 32656522, 37072702, 42213965, 48210929, 55179912, 63188824, 72283265, 82507676, 93885317, 106416153, 120111522, 134990725, 151034562, 168210647, 186593410, 206435821, 228121825, 252056961, 278366017, 306110412, 332307732, 351900674]
55941C51900674P632482p253572k1066346l0616828l4993893l5173725l2737162
55934A97691630k9017399k4935350k1053600j7616116j4662993j2185103j0165128
55927F8055941q535412p198163o093013n194922m462082l840342l308297k869636
55919B6554074k508562k193708j916766j687847j499382j329894j176823j052501
55911A3188591r52925q60683p73786p03281o46744n90693n35262m91494m57614
55902G176109m21339l82598l51775l28432l02660k74865k54194k39707k22081
55893D398458k01671j86792j76410j62122j45198j34530j29412j20843j08446
55884C033034j00106r6037q8649p7533o9941o7049o3588o0274o2785o8965p0444
$$ y = [351900674, 359533156, 352279584, 331213238, 300596410, 265602517, 230428792, 197691630, 168674231, 143738881, 122685281, 105069165, 90406172, 78221069, 68055941, 59520529, 52322366, 46229353, 41034431, 36572349, 32732007, 29423710, 26554074, 24045512, 21851804, 19935038, 18247191, 16747809, 15417915, 14241092, 13188591, 12235666, 11374983, 10601197, 9897916, 9251172, 8660479, 8125217, 7633723, 7176109, 6754770, 6372172, 6020397, 5691965, 5389305, 5114440, 4860246, 4620539, 4398458, 4196787, 4009995, 3833585, 3671463, 3526265, 3391735, 3262323, 3141480, 3033034, 2932928, 2836891, 2748242, 2670709, 2600768, 2533719, 2470131, 2409857, 2347072, 2278107, 2207663]
55873B207663o6858o5776o8751o9767o7354o6093o6014o2203n5318n1395n0790
55862A517344m7960m2378l9253l9200l7470l3764l2734l4315l3245k8895k6213
55851A121917k6273k4963k1692k0583k2197k2511k0869k0801k2469k2132j9660
55840H77767j8786j9597j8387j5219j4039j5018j4321j1737j1074j2633j2662
55829G14294j0652r910j0612r491o725n966p195o751m768n339q736j0587r550
55816F08012q848r464q693o293n336n984n005k284j324k479k212P7J127N15J609
55801E53418M670N747L878K899M324M733K068j318l718o494r638j0520q884p864
55787E33301q438p983n725m187l974k583j33m42m450p929p930o404n287l112J018
$$ y = [2207663, 2140805, 2075029, 2006278, 1936511, 1869157, 1803064, 1737050, 1674847, 1619529, 1568134, 1517344, 1469384, 1427006, 1387753, 1348553, 1311083, 1277319, 1244585, 1210270, 1177025, 1148130, 1121917, 1095644, 1070681, 1048989, 1028406, 1006209, 983698, 962829, 942028, 919559, 897427, 877767, 858981, 839384, 820997, 805778, 791739, 776721, 762400, 750663, 739589, 726956, 714294, 703642, 693732, 683120, 673629, 666904, 660938, 653743, 646992, 642224, 636885, 628149, 617562, 608012, 599164, 589700, 581007, 574714, 569378, 563394, 558389, 556105, 554781, 552302, 550090, 550167, 551294, 551809, 553418, 558088, 563835, 567713, 570612, 574936, 579669, 581737, 580419, 576701, 570207, 560569, 550049, 541165, 533301, 524863, 516880, 511155, 506968, 502994, 500411, 500278, 499836, 495386, 487457, 479527, 473123, 467836, 464724, 465742]
55772D65742M843O903Q871J1598J2706J0270N260j170q963j6357j9979j9435j7966
55759D42323j7263j5652j2541j0144r317q024n662m573n633o557o280o681q265
55746C25731q517o569n110n564n639l898k562l224l757k233l67l80j584k588l760
55731B69979n232n405l734k220k157k203j383j022j879k415j759j380k048k128
55717B35014p11N58N59N93J544K177J992K619M548N510M069J855M61q36k455k890
55701B54607j789j607l808o291o734n867n308m880m147m040m793m772l259j920
55687A95392j714j145O18J780J199O95J854L267L268K787L078L209K241J409J716
55672B19654J598l95k862l849l809l867l305j270R29J737J824K447L091K813K200
$$ y = [465742, 470585, 477488, 486359, 497957, 510663, 520933, 526193, 525023, 516060, 499703, 479724, 460289, 442323, 425060, 409408, 396867, 386723, 377406, 369382, 363720, 359147, 353514, 346957, 340677, 333996, 325731, 317214, 310645, 305535, 299971, 294332, 290434, 287872, 284648, 280891, 278658, 278291, 277911, 276327, 273739, 269979, 264747, 259342, 255608, 253388, 251231, 249028, 247645, 246623, 244744, 242329, 240570, 239190, 237142, 235014, 234303, 234861, 235420, 236013, 237557, 239734, 241726, 244345, 248893, 254403, 258472, 260327, 260788, 259952, 257497, 254607, 252818, 251211, 247403, 241112, 234378, 228511, 223203, 218323, 214176, 210136, 205343, 200571, 197312, 195392, 193678, 192533, 193151, 194931, 196130, 196825, 198679, 201946, 205214, 208001, 211079, 214288, 216529, 217938, 219654, 221252, 220857, 217995, 214146, 210337, 206470, 203165, 201895, 202824, 204561, 206385, 208832, 211923, 214736, 216936]
55657B16936J950J328k9p02J41R88N87J80R91J593K32k188l727m324m791m733
55641B04432l845l561m915o345n953m514l909m035l624k870k796l115k836k070
55627A50044j415o45L74P14j9o07k60r7r02j256J18J928K285J491P68j48j857
55610A50516l284l159k288k156k460k078j279r72r24o23o66j448j819r33M9n4
55594A26422l70J78O33j44j044n46N20M72k67k03N42J028J662L087M114L377K016
55577A41477K074L241L737L506L836M638M785M536N006N781N589M762M533M379
55563B01880K719j19k162k846l465m623n581o065o559o795o019m685m035m072
55549A47573l800l230l191l439k930j840j367j645j638j018m05J51J139K192K353
$$ y = [216936, 218886, 220214, 220185, 219483, 219624, 220612, 221199, 221379, 222370, 223963, 224195, 222007, 218280, 213956, 209165, 204432, 200587, 197026, 192111, 185766, 179813, 175299, 171390, 167355, 163731, 160861, 158065, 154950, 152114, 150044, 148629, 147984, 148358, 149072, 149053, 148446, 148186, 148089, 147187, 145931, 146049, 147977, 150262, 151753, 152521, 152373, 150516, 147232, 144073, 141785, 139629, 137169, 135091, 133812, 132840, 131916, 131293, 130627, 129179, 127360, 126427, 126476, 126422, 126052, 126230, 126863, 126719, 125675, 125129, 125649, 126121, 125854, 125651, 126193, 127221, 128883, 131970, 136084, 139461, 141477, 143551, 146792, 150529, 154035, 157871, 162509, 167294, 171830, 176836, 182617, 188206, 192968, 197501, 201880, 204599, 204480, 202318, 199472, 196007, 191384, 185803, 179738, 173179, 166384, 160365, 155680, 151645, 147573, 143773, 140543, 137352, 133913, 130983, 129143, 127776, 126131, 124493, 123475, 123070, 123221, 124360, 126552, 128905]
55534A28905J672R81L94m23j001p51m49j206k439k709k193k279l029l122k279
55519A10072j624j595j404q05n43q02q08l33r6m15p48p46o34m51m2L29L56L08
55501A00019L41k30j719k866k274n11P65J101J133Q60j20j205j377q96p01o11
55485I1709O4P38K97p07o79M56J266J254J263J561J482R95P62O00k82j506j799
55468I7474j060l65LO85J424J085l22j488j804j802j513l87J031J326M81L1N79
55451I5378J000N91J38K35K52k75p31n95k53q1J48N06O64O31O79N19j95o79J66
55432I8098J765K265J077n38j447j572q45R28K847L356K345J247Q02M13o4J82
55416A10859J188J800J592J416J531J002l22j119p90n48j313k181k131j740j951
$$ y = [128905, 130577, 131558, 131952, 131529, 130528, 129777, 129328, 128122, 125683, 122974, 120781, 118502, 115473, 112351, 110072, 108448, 106853, 105449, 104644, 104101, 103299, 102491, 102158, 102062, 101647, 100899, 100153, 99519, 99068, 99026, 99355, 99711, 100019, 100360, 100130, 98411, 95545, 93271, 92760, 93525, 94626, 95759, 96619, 96499, 95294, 93917, 93021, 92320, 91709, 91773, 92511, 92808, 92101, 91422, 91878, 93144, 94398, 95661, 97222, 98704, 99699, 100461, 101061, 100779, 99273, 97474, 96414, 96049, 96052, 96737, 98161, 99246, 98924, 97436, 95632, 93830, 92317, 91930, 92961, 94287, 94768, 94799, 95378, 96378, 96969, 97107, 97342, 97594, 97319, 96588, 95993, 95740, 95659, 95807, 96313, 96977, 97608, 98287, 98806, 98611, 97932, 98098, 99863, 102128, 103205, 102667, 101220, 99648, 98803, 99731, 102578, 105934, 108279, 109526, 110328, 110741, 110677, 110859, 112047, 113847, 115439, 116855, 118386, 119388, 119066, 117947, 117157, 116609, 115296, 113115, 110984, 109244, 107293]
55401A07293k417k341j927j768j706j327q63o65m92r6K30K84M16P74R05O05L75
55384I7280M62L89n3k85L6L38J12k49j50L34P97R99P45r1j049j393j114r35j149
55365I5024j350j330j246r01RQ30M41r95k041k024j689j536j029k2N62K50m1M67
55347H3379J161J128N92L09L52L30J55n1k61k77J78Q00Q87M65L34P75J101P97
55329I2154J58m83j084j258m60Q58J427R04K38J8k47p41o64K88J078Q05l1n02
55311I2458n23m18j94N5o2m39m10N0J14m12n50K18R95R17M17K43K87K51M24Q83
55291I4304R04P2q73j108q50o66n40m13o14j035q44J32P28J25p78o96J99Q66J061
55272H9974J285J674J963K098K000J270p1j144j239q02o25o57m23O1N92J379K429
$$ y = [107293, 104876, 102535, 100608, 98840, 97134, 95807, 94944, 94279, 93787, 93691, 93921, 94205, 94621, 95395, 96300, 96905, 97280, 97742, 98131, 98078, 97793, 97829, 98167, 98279, 98030, 97880, 98214, 99011, 100010, 100755, 100664, 99615, 98222, 97108, 96173, 95024, 93674, 92344, 91098, 90197, 90206, 91036, 91477, 90482, 88441, 86417, 84728, 83192, 82163, 82141, 82703, 82953, 82912, 83379, 84540, 85668, 86260, 86569, 86921, 87251, 87406, 87355, 87094, 86817, 86995, 87795, 88682, 89147, 89481, 90256, 91357, 92154, 92312, 91829, 90745, 89487, 89027, 89885, 91312, 92216, 92454, 92472, 92225, 91484, 90820, 91108, 92186, 92991, 92960, 92458, 91935, 91517, 91323, 91378, 91316, 90877, 90467, 90517, 90631, 90219, 89669, 89887, 90882, 91799, 92216, 92459, 92746, 92997, 93421, 94304, 95208, 95280, 94407, 93299, 92449, 91783, 91243, 90830, 90216, 89181, 88337, 88469, 89197, 89322, 88544, 87848, 88047, 88913, 89974, 91259, 92933, 94896, 96994, 98994, 100264, 100193, 99049, 97810, 97008, 96383, 95726, 95303, 95364, 95956, 97335, 99764]
55255I9764K946K177N36r52j853k312k275j594n83K03N88O50L00m95j306j482
55239I4312p29O23J700J582K83r32r89m69o62j434j452m60L11K75K87P87Q31q3
55221I3781q58n10L19O86Q21J110Q72l64j487j149K34J119Q87N8q12j357j116
55204I2234j59N34L20j12J32P23P55J69m33p99q90m25N35J191J052P34Q52R44
55186I7357L84m02o55m66l36k33RJ12K5K98R99J224N48r0K0J93j66k01P34J412
55166A00766N03j078j504q56n72p60k15J160K035J833J411J393J359R16L21j31
55150A06581l32l5O94R77J89q87j105o71n54o94l02M81Q25P79J028J310O82o61
55132A08305j492j453j293j209o33K50M17k29n63o7M92N55N10N41J11q08j269
$$ y = [99764, 102710, 104887, 105423, 104471, 102618, 100306, 98031, 96437, 95854, 96057, 96645, 97295, 97595, 97100, 95794, 94312, 93583, 94206, 95906, 97488, 97771, 96839, 95850, 95381, 94719, 93285, 91833, 91373, 91684, 91959, 92246, 93033, 93864, 93781, 92923, 92413, 92732, 93418, 94239, 95349, 96221, 95857, 94370, 93221, 93455, 94574, 95461, 95519, 94707, 93350, 92234, 92075, 92609, 92929, 92817, 92949, 93672, 94427, 94596, 94163, 93364, 92474, 92049, 92584, 93775, 94827, 95561, 96413, 97357, 97741, 97339, 96684, 96218, 95882, 95649, 95658, 95770, 95795, 96093, 97092, 98316, 98864, 98774, 98794, 98987, 98821, 98620, 99354, 100766, 101269, 100191, 98687, 97831, 97259, 96499, 96284, 97444, 99479, 101312, 102723, 104116, 105475, 106391, 106712, 106581, 106249, 106214, 106908, 107885, 108074, 107187, 106082, 105411, 104857, 104163, 103861, 104342, 105167, 105946, 106974, 108284, 108966, 108305, 106813, 105360, 104067, 102858, 102225, 102475, 102892, 102663, 102100, 102033, 102525, 103080, 103590, 104131, 104242, 103434, 102165]
55115A02165p45R7N23O85R15J065J026J055J143Q33L7o42p20l03L49J036J368
55098A09887J050M71K18J14m03j050r18O1J001J419J639J698J077j51j045r80
55082A14088l93N6J71k0m21o17k58K62K93o0l08o06j240j494n47O98M58j096j809
55063A07157p53M22J86o74o86lL51L56O44J049Q78K00l42o39j043j474j437q10
55045A03382M1P62J156J089O88L50K50J22j54k75q7L5k48p49j109j241j188r73
55027A01851q02q49p55M1J296J966J472L67m86o50m2J080J844J459M78L08J133
55010A09711J482M70p40o30N11J308J412J668K497L274L258K321P55r48k125k335
54994A21889j742q87j72K09K33J44K50M02J20m47m64K86Q14L32m55l55N02R54
$$ y = [102165, 101420, 101517, 102040, 102725, 103640, 104705, 105731, 106786, 107929, 108762, 108799, 108157, 107437, 107134, 107483, 108519, 109887, 110937, 111408, 111626, 111740, 111337, 110287, 109369, 109430, 110431, 111850, 113489, 115187, 116264, 116113, 115068, 114088, 113695, 113751, 113922, 113902, 113481, 112864, 112606, 112868, 113161, 113101, 112793, 112187, 110947, 109453, 108906, 109604, 110062, 108966, 107157, 106404, 106826, 107012, 106338, 105652, 105649, 106000, 106356, 107000, 108049, 108927, 109127, 108785, 108146, 107103, 105629, 104192, 103382, 103423, 104185, 105341, 106430, 107118, 107468, 107718, 107840, 107686, 107411, 107324, 107359, 107111, 106362, 105253, 104012, 102824, 101851, 101049, 100200, 99445, 99486, 100782, 102748, 104220, 104587, 104101, 103451, 103409, 104489, 106333, 107792, 108270, 108578, 109711, 111193, 111663, 110923, 110293, 110804, 112112, 113524, 115192, 117689, 120963, 124221, 126542, 127297, 126349, 124224, 121889, 120147, 119260, 119088, 119297, 119530, 119674, 119924, 120326, 120446, 119999, 119535, 119821, 120635, 120967, 120512, 120157, 120659, 121613]
54976A21613O28L37O23R93Q96N85N21N44K62j83l15j15l1j91j66L26Q92J004Q22
54957A29045R64J558K026J879J237L70p20j903k617k422j552m98O10J688K235
54942A31900J798O66m60j211j442q17O22J878J895J016N64J129K082K765L131
54927A45516L192K836K496K986M335N629O278O614O855O458M984K904R45p63k376
54912A98889l727m611n167n554n627n365n178n333n441m912l713k354j367r85
54898A39555j063j149q92m10n0J66M64Q36J099J357J796K157K085J895K269L203
54882A53318M052M567N051N449N262M524L997M053M210L955L234J922j90k608
54868B00796m308n062n711o701p310o841n693m621l753k925k288j981j797j650
$$ y = [121613, 122241, 122578, 123201, 124194, 125090, 125675, 126196, 126740, 127002, 126819, 126504, 126389, 126358, 126167, 126001, 126327, 127219, 128223, 129045, 130009, 131567, 133593, 135472, 136709, 137079, 136359, 134456, 131839, 129417, 127865, 127367, 127977, 129665, 131900, 133698, 134364, 133904, 132693, 131251, 130434, 131056, 132934, 134829, 135845, 136409, 137538, 139620, 142385, 145516, 148708, 151544, 154040, 157026, 161361, 166990, 173268, 179882, 186737, 193195, 198179, 201083, 202028, 201265, 198889, 195162, 190551, 185384, 179830, 174203, 168838, 163660, 158327, 152886, 147974, 144261, 141907, 140540, 139555, 138492, 137343, 136451, 136041, 135991, 136157, 136621, 137457, 138556, 139913, 141709, 143866, 145951, 147846, 150115, 153318, 157370, 161937, 166988, 172437, 177699, 182223, 186220, 190273, 194483, 198438, 201672, 203594, 203404, 200796, 196488, 191426, 185715, 179014, 171704, 164863, 159170, 154549, 150796, 147871, 145583, 143602, 141805, 140155]
54854A40155j778k068j951j309p78o82n47j49j07q47j769k105j891j452p66O8
54838A22024M47N3o19j065j371j511r95J10P67L97j81j26J11j81n92l82J55L74
54820A17415N89J312J871J291J49m3Q11J232M29p20j209j137r36n30J38O07N20
54803A21789J68n0k07m69o00k77L82R92J382J604J572J045P8o53k96J164K556
54786A30180K629J484L92J56L43L18K90Q28J867K872L580M051M244M077L743L588
54770A64642L810M492N611O798P544P774P829P672O715M714K236n1j966l474m497
54755B19849n311o402p535p877p368o926o870o361n091m144m113l715j769N26
54741A46893J080K3n27M02J519J399K86o00m51P46K338L305L158K572K470K801
$$ y = [140155, 138377, 136309, 134358, 133049, 132271, 131589, 131042, 130893, 130786, 129939, 128170, 126065, 124174, 122722, 121956, 122024, 122471, 122524, 121905, 120840, 119469, 117958, 116963, 117073, 117840, 118237, 118056, 117930, 118041, 117860, 117268, 116886, 117041, 117415, 118004, 119316, 121187, 122478, 122627, 122584, 123395, 124627, 125056, 124336, 123127, 121990, 121054, 120524, 120662, 121269, 121789, 121957, 121907, 121700, 121231, 120631, 120354, 120736, 121728, 123110, 124714, 126286, 127331, 127409, 126756, 126460, 127624, 130180, 132809, 134293, 134685, 134841, 135184, 135502, 135792, 136620, 138487, 141359, 144939, 148990, 153234, 157311, 161054, 164642, 168452, 172944, 178555, 185353, 192897, 200671, 208500, 216172, 222887, 227601, 229837, 229786, 227820, 224346, 219849, 214538, 208136, 200601, 192724, 185356, 178430, 171560, 165199, 160108, 155964, 151851, 148136, 146367, 146893, 147973, 147996, 147469, 147871, 149390, 150789, 151075, 150475, 150024, 150770, 153108, 156413, 159571, 162143, 164613, 167414]
54725A67414K960L140M019N321N844N123L932K950J932M97j156k722m200n493
54711A89561o195o111n577n056m764m662m489l897k965k274k008j551o36k63j352
54696A37761k955l206j877o17m74o77k58M33N77K34l3j28k57l31j98r9k90n34
54678A27071m80k85l43n75m43L37J323J723J229M03Q6L68M94l9p50r39o81n15
54660A27984m93l16j62n22j197j335o15K62N10J82r9P3N75R98J063Q89Q19R35
54642A29551R78Q65P63N96M0o60o86M7L94l64j253r51K30R37Q24O92Q78Q42L46
54623A34069k36p54j331j601j005J01P35P34P96J055Q46M0n73n67m11m36k92J54
54605A31324M21K58M5K5j1m0L14Q94J039O43L38L55K42q1m4M56P77O45M84L18
$$ y = [167414, 170374, 173514, 177533, 182854, 188698, 193821, 197753, 200703, 202635, 203132, 201976, 199254, 195054, 189561, 183366, 177255, 171678, 166622, 161858, 157196, 152707, 148810, 145845, 143571, 141563, 140012, 139376, 139113, 137761, 134806, 131600, 129723, 129106, 128632, 127955, 127697, 128130, 128707, 128941, 128908, 128780, 128523, 128192, 127994, 127895, 127605, 127071, 126591, 126306, 125963, 125388, 124945, 125282, 126605, 128328, 129557, 129960, 130046, 130414, 130908, 130869, 130119, 129180, 128499, 127984, 127491, 127175, 127013, 126491, 125294, 123959, 123344, 123606, 124116, 124298, 124199, 124272, 124847, 125845, 126908, 127797, 128616, 129551, 130529, 131394, 132157, 132753, 132793, 132133, 131447, 131494, 131888, 131524, 130271, 129320, 129550, 130487, 131311, 132003, 132881, 133723, 134069, 133833, 133079, 131748, 130147, 129142, 129243, 129978, 130712, 131508, 132563, 133409, 133449, 132876, 132309, 131898, 131462, 131170, 131324, 131745, 132003, 132048, 132073, 132062, 132022, 132336, 133230, 134269, 134912, 135250, 135605, 135847, 135766, 135722, 136178, 136955, 137600, 138084, 138402]
54585A38402m05j474j704o75N10Q94Q25P89L81o06j268r14l15m63r05n91L45Q64
54567A33690O05Q4l05m34j5R67J738J580R03N28L64k02r37r35j05O86R48J096
54549A40256J439J547J045L52K22Q56J777K384K481K309K155J933J340L87n12
54534A59971j045j228j056m45L11O81O70P95J008M36j182k615k539j289l20k91
54518A51862n97o27n15n84q02j007j151j140q25k66K40M38K59k03o17m90L75J498
54500A45848K026J501K62p76q44m8O89O40J21j47j88n82j186j076K5J164J491
54483A48920J256J032Q25N89P54J440J862J392O18M13O00M98K78N97J238J332
54467A63644Q41O69J128J378P05m59j198j162o45j17M2k56o29n83j42J27j33o16
$$ y = [138402, 137997, 136523, 134819, 134144, 134654, 135548, 136373, 137162, 137543, 136937, 135669, 134755, 134440, 133977, 133072, 132481, 132826, 133690, 134295, 134379, 134074, 133640, 133625, 134592, 136330, 137910, 138813, 139341, 139705, 139503, 138566, 137631, 137526, 138212, 139160, 140256, 141695, 143242, 144287, 144639, 144861, 145717, 147494, 149878, 152359, 154668, 156823, 158756, 160096, 160483, 159971, 158926, 157698, 156642, 156197, 156508, 157189, 157859, 158654, 159662, 160098, 158916, 156301, 153762, 152473, 152153, 151862, 151265, 150638, 150123, 149539, 148737, 147730, 146579, 145439, 144614, 144348, 144588, 145026, 145285, 145082, 144465, 143975, 144350, 145848, 147874, 149375, 149637, 148861, 148017, 147969, 148658, 149298, 149419, 149272, 149084, 148502, 147316, 146240, 146265, 147429, 148920, 150176, 151208, 152033, 152622, 153376, 154816, 156678, 158070, 158688, 159101, 159701, 160199, 160477, 161074, 162312, 163644, 164485, 165154, 166282, 167660, 168365, 167906, 166708, 165546, 164901, 164784, 164826, 164570, 163941, 163358, 163216, 163343, 163210, 162594]
54449A62594p53l53K21L77j75j019j322o84L83J007P88r3j151j759j386k56N02
54432A56921M3j019j253k35R29J052L71Q2Q06J870K203J572O92K71K90L36K41
54415A65172N5l16r06j279r76l08JJ1N39J723K465J833L14r28j394j282o88L63
54397A64399J358J574R40J34j69J18M94L26m43r73l74R87J698J045j08o61o75
54380A69670q17j058q81k78K35M59N81O22M75L36N02Q41R13N06k87j210j739j295
54362A67575m4J034J288J155J241J339J041P29J053J787K107J681P97k47j103
54347A81433j161k16R09J245Q65M60J63l11p64q24q25j312j910j807j164q59r58
54330A72964o92J8K57m02j278j745j970k084j637m09R17J402P63m84j364r74N45
$$ y = [162594, 161841, 161488, 161709, 162086, 161911, 160892, 159570, 158886, 159269, 160276, 161064, 160971, 159820, 158061, 156675, 156419, 156921, 156964, 155945, 154692, 154457, 155386, 156438, 156809, 156891, 157697, 159567, 161770, 163342, 164034, 164305, 164595, 164931, 165172, 165227, 164911, 164005, 162726, 161750, 161442, 161443, 161454, 161993, 163716, 166181, 168014, 168328, 167400, 166006, 164724, 164036, 164399, 165757, 167331, 168271, 168405, 168236, 168354, 168848, 169174, 168731, 167758, 167384, 168371, 170069, 171114, 171006, 170345, 169670, 168853, 167795, 166914, 166636, 166871, 167330, 167911, 168533, 169008, 169344, 169846, 170687, 171600, 172106, 171819, 170609, 168870, 167575, 167531, 168565, 169853, 171008, 172249, 173588, 174629, 175358, 176411, 178198, 180305, 181986, 182783, 182536, 181433, 180272, 180056, 180965, 182210, 183075, 183535, 183698, 183387, 182623, 181799, 180974, 179662, 177752, 175945, 174781, 173922, 172964, 172272, 172290, 172547, 172145, 170867, 169122, 167152, 165068, 163431, 163022, 163939, 165341, 166104, 165620, 164256, 163282, 163827]
54313A63827J760J440K04k94L18Q67O74L65L10k17j505k340j645k03L87j19o07
54296A63222m06K4Q3k15n33o41m51p5J28j23o19q24m54K63Q31R31O86N42P15Q62
54276A63946N25j86p47q78o86k69L02O55M79J20K06O77R05Q08R77J525J742J296
54258A71397Q91J086J277O19o22j387j209n41K5K04j41r16j572j514q64l38l20
54241A66075l72M7P17P78k23j642k358j975j143o03l93k79l80q40j177p88P9N98
54223A56121N48M69N83M38j11m24MP82J243J291J202R70M44j96n46m42k3M24N50
54204A63327J56m81p37k75N93J258J276N49n42j197q56J15P82P48M06J80M0r3
54186A65249j58k77p08j253j359r72o88q29j058j132j318j634j455m54P00J123
$$ y = [163827, 165587, 167027, 167231, 166937, 167255, 168122, 168796, 169161, 169471, 169254, 167749, 165409, 163764, 163561, 163948, 163829, 163222, 162816, 162840, 162923, 162708, 162175, 161534, 161083, 161008, 161136, 161013, 160394, 159570, 159116, 159379, 160210, 161141, 161827, 162369, 163084, 163946, 164471, 164285, 163538, 162660, 161974, 161705, 162007, 162662, 163141, 163261, 163467, 164144, 165049, 165857, 166834, 168359, 170101, 171397, 172288, 173374, 174651, 175270, 174648, 173261, 172052, 171511, 171536, 171740, 171599, 170683, 169111, 167597, 166733, 166395, 166075, 165703, 165750, 166467, 167245, 167022, 165380, 163022, 161047, 159904, 159301, 158908, 158629, 158249, 157409, 156232, 155444, 155523, 156121, 156669, 157138, 157721, 158159, 158048, 157624, 157628, 158410, 159653, 160944, 162146, 163116, 163560, 163364, 162818, 162376, 162353, 162777, 163327, 163483, 163002, 162265, 161990, 162583, 163841, 165117, 165666, 165124, 163927, 163071, 163186, 163968, 164716, 165122, 165302, 165342, 165249, 165091, 164814, 164106, 162853, 161494, 160522, 159834, 159005, 157947, 156815, 155497, 153863, 152408, 151954, 152654, 153777]
54170A53777Q15M24L28M77P57J025J015O20N9m68r68j282j051l30J94Q2k34p6
54152A55164N31J031J131J071J245J773K243J854L13j381j744n65Q17J232R22
54137A65637O23L77q9n11m33M4N21R25J274J272P68J71j53m09p53q17m65k97n83
54118A67102m28Q64K252K136P04k94m1N28N13K78L62L97j02p16o76l0N00M62J4
54099A73825m57o97o73n63m86k08N72J586K026J447L05n82q10m63K19R55J401
54082A77397J324Q01R3n40q67p00j3R94K066K953L413L347K995K813K974L166
54066B02216L025K683K685L300M113M497M501M965O587Q919J0611J0551Q563N093
54052B82309P41l742p356r193q955p188n071l746l402l075j804K1J087R50O06
$$ y = [153777, 154592, 155016, 155344, 155821, 156578, 157603, 158618, 159238, 159297, 158829, 157861, 156579, 155528, 155198, 155392, 155474, 155240, 155164, 155695, 156726, 157857, 158928, 160173, 161946, 164189, 166043, 166356, 164975, 163231, 162666, 163483, 164715, 165637, 166260, 166637, 166548, 166037, 165604, 165648, 166169, 167094, 168368, 169640, 170408, 170579, 170426, 170017, 169264, 168447, 167982, 167685, 167102, 166674, 167538, 169790, 171926, 172630, 172336, 172295, 172823, 173336, 173614, 173976, 174373, 174271, 173555, 172879, 172849, 173349, 173811, 173825, 173368, 172671, 171998, 171435, 170949, 170741, 171313, 172899, 174925, 176372, 176677, 176095, 175285, 174822, 175041, 175996, 177397, 178721, 179522, 179615, 179075, 178208, 177508, 177495, 178489, 180555, 183508, 186921, 190268, 193263, 196076, 199050, 202216, 205241, 207924, 210609, 213909, 218022, 222519, 227020, 231985, 238572, 247491, 258102, 268653, 277216, 282309, 283050, 279308, 271952, 262759, 253804, 246616, 241545, 237799, 234397, 231322, 229518, 229539, 230626, 231576, 232182]
54037B32182J018J843K231K186K344K837L203L230L100K752J901P75J72N31J358
54022B61663J806J537Q51K26r0j61j17M7L39M00m28k343m563n829n511m132k984
54005B40711l071m195m999m322k595j384j467j933j599o03k8l69j142j715j832
53990B09457j460p48j60r7l74m62j99J04K61M50Q32J264J467J299R57R42J592
53973B15125K492K758K154J487J576K249K869L306L769M018L536K348J003j76
53959B48514j209k023k462k677k885k856k215j148k26M12J013J511J550J271J303
53944B37873J863K478K789L012L379L737L916M079M361M542M372L887L260K574
53930B86122J952J602J584J751J976K262K600K971L415L867M031L750L430L649
$$ y = [232182, 233200, 235043, 237274, 239460, 241804, 244641, 247844, 251074, 254174, 256926, 258827, 259602, 259774, 260305, 261663, 263469, 265006, 265857, 266083, 265993, 265832, 265715, 265762, 266101, 266501, 266073, 263730, 259167, 253338, 247827, 243695, 240711, 237640, 233445, 228446, 224124, 221529, 220145, 218678, 216745, 215146, 214543, 214515, 214146, 213004, 211289, 209457, 207997, 207249, 207089, 206992, 206618, 206156, 205957, 206061, 206322, 206772, 207604, 208868, 210335, 211634, 212591, 213533, 215125, 217617, 220375, 222529, 224016, 225592, 227841, 230710, 234016, 237785, 241803, 245339, 247687, 248690, 248514, 247305, 245282, 242820, 240143, 237258, 234402, 232187, 231039, 230813, 231225, 232238, 233749, 235299, 236570, 237873, 239736, 242214, 245003, 248015, 251394, 255131, 259047, 263126, 267487, 272029, 276401, 280288, 283548, 286122, 288074, 289676, 291260, 293011, 294987, 297249, 299849, 302820, 306235, 310102, 314133, 317883, 321313, 324962]
53916C24962M426N242N828O501P586Q846R673R678R117Q690Q913R524R706Q866
53902D37558O951L917l66n326r489j1737j2372j2348j1889j0742r372q778r131
53889C46876r518r190q336p471o765o254o033o005n842n418m920m451l853k975
53875B59845j872q23l81j070k678m124m531m066l297k303j155n90j162k114k325
53860B27354j982k098k643k584j761j180j207j044m11k30j015j877j935j555j403
53845B04429j292q69m20k16R3N84N39l25r90n72K76M85K80N47J101R81J86l00
53827B04517m9L62N34P40J093J141O13q3l80j18M93J086J277R62N03L49O28J250
53809B14918K091K720K504J574J162K240M127N220M923M034L355K860K355K096
$$ y = [324962, 329388, 334630, 340458, 346959, 354545, 363391, 373064, 382742, 391859, 400549, 409462, 418986, 428692, 437558, 444509, 448426, 448060, 442734, 433245, 421508, 409136, 396788, 384899, 374157, 364785, 356007, 346876, 337358, 328168, 319832, 312361, 305596, 299342, 293309, 287304, 281462, 276044, 271124, 266673, 262820, 259845, 257973, 257150, 256769, 255699, 253021, 248897, 244366, 240300, 237003, 234700, 233545, 232955, 231793, 229679, 227354, 225372, 223274, 220631, 218047, 216286, 215106, 213899, 212855, 212444, 212214, 211199, 209322, 207387, 205832, 204429, 203137, 202268, 201848, 201632, 201725, 202309, 202848, 202523, 201533, 200961, 201237, 201722, 202002, 202549, 203650, 204631, 204817, 204517, 204468, 204830, 205364, 206104, 207197, 208338, 208951, 208868, 208488, 208370, 208863, 209949, 211226, 212188, 212691, 213040, 213668, 214918, 217009, 219729, 222233, 223807, 224969, 227209, 231336, 236556, 241479, 245513, 248868, 251728, 254083, 256179]
53795B56179K416L172L877M119L832L337L075L035K648J563K70m88o74q20j197
53780B84344j645k095k604k999l071l041l253l507l300k690k255k242k426k768
53766B46448l446m146m090l097j917j245r88q87j147j905k556k313j267l77l97
53751B16670j172j890j790p59M99J001M69k76k25N96J088M03r52j617q60O91J843
53734B13719K074J745J330R40O30O65J134J632J683J353J106J211J516J744J760
53719B34242J614J534J721J997J896J342R56J276J919K060J591J231J473J991
53705B56843K269K320K485K815K982K728K179J753J767K133K455K524K562K753
53691B90568K772K117R31Q7K85J253J951J542J78j079j212l08N11L80l62p57n27
$$ y = [256179, 258595, 261767, 265644, 269763, 273595, 276932, 280007, 283042, 285690, 287253, 287523, 287035, 286361, 285541, 284344, 282699, 280604, 278000, 275001, 271930, 268889, 265636, 262129, 258829, 256139, 253884, 251642, 249216, 246448, 243002, 238856, 234766, 231669, 229752, 228507, 227519, 226632, 225485, 223580, 221024, 218711, 217444, 217067, 216670, 215498, 213608, 211818, 211059, 211558, 212559, 213028, 212752, 212527, 213123, 214211, 214614, 213662, 212045, 211185, 211876, 213719, 215793, 217538, 218868, 219808, 220438, 221103, 222237, 223869, 225552, 226905, 228011, 229222, 230738, 232482, 234242, 235856, 237390, 239111, 241108, 243004, 244346, 245302, 246578, 248497, 250557, 252148, 253379, 254852, 256843, 259112, 261432, 263917, 266732, 269714, 272442, 274621, 276374, 278141, 280274, 282729, 285253, 287815, 290568, 293340, 295457, 296388, 296475, 296760, 298013, 299964, 301506, 301684, 300605, 299393, 299085, 299596, 299976, 299614, 298857, 298330]
53674B98330k43l50o48q39j038j438j847j876j350l72P57J536J424L68j021j987
53658B89406k221j879j234n31n2M7l3J26O98J341J533J107M53kl14q49j498j521
53640B84577m90Q90J506J240J077J699K585K818K273J535J042Q43R77J468K019
53625C06059K178J931J663J544J436J388J738K504L247L817M654N864O557N861
53611C50441M247K996K460J912J191J316K855M593M826L508K190K008K603L007
53597C90153K832K371K126K442L228L942M152M058M058L977L347K344J642J259
53583D31931M20j164k669l289l322l567m163m611m616m307l847l342k986k935
53569C87533l166l597m018l800k281J35J845J686L22o47n68o9K22L50N11O28O60
$$ y = [298330, 298087, 297737, 297089, 296250, 295212, 293774, 291927, 290051, 288701, 288329, 289086, 290622, 292046, 292414, 291393, 289406, 287185, 285306, 284072, 283541, 283489, 283536, 283503, 283629, 284327, 285668, 287201, 288308, 288761, 288759, 288445, 287596, 286098, 284577, 284087, 284977, 286483, 287723, 288800, 290499, 293084, 295902, 298175, 299710, 300752, 301595, 302572, 304040, 306059, 308237, 310168, 311831, 313375, 314811, 316199, 317937, 320441, 323688, 327505, 332159, 338023, 344580, 350441, 354688, 357684, 360144, 362056, 363247, 364563, 367418, 372011, 376837, 380345, 382535, 384543, 387146, 390153, 392985, 395356, 397482, 399924, 403152, 407094, 411246, 415304, 419362, 423339, 426686, 429030, 430672, 431931, 432351, 431187, 428518, 425229, 421907, 418340, 414177, 409566, 404950, 400643, 396796, 393454, 390468, 387533, 384367, 380770, 376752, 372952, 370671, 370806, 372651, 374337, 374659, 374012, 373444, 373375, 373597, 373947, 374458, 375086, 375746]
53552C75746P56R54J059J046J167J588K161K599K654K244J670J588K371L593M488
53537D05684M808M888N049N358N927O866P966Q838R372R703R833R747R856J0695
53523E14590J2109J3285J3798J4101J4710J5380J5505J5175J5369J6989J9795
53512F80806K2416K3567K3286K2763K2934K3565K3954K4019K4143K4289K3994
53501I39736K3199K2352K1738K1252K0974K1247K1952K2353K1992K1276K0834
53490A178905K0685K0465K0093J9774J9528J9163J8605J7946J7212J6316J5261
53479A383953J4244J3557J3342J3329J2881J1559R666P962O715N347L185L29k502
53466A493567m861o940r167j1669j4184j6363j7907j8535j8072j6803j5632j5513
$$ y = [375746, 376502, 377456, 378515, 379561, 380728, 382316, 384477, 387076, 389730, 391974, 393644, 395232, 397603, 401196, 405684, 410492, 415380, 420429, 425787, 431714, 438580, 446546, 455384, 464756, 474459, 484292, 494039, 503895, 514590, 526699, 539984, 553782, 567883, 582593, 597973, 613478, 628653, 644022, 661011, 680806, 703222, 726789, 750075, 772838, 795772, 819337, 843291, 867310, 891453, 915742, 939736, 962935, 985287, 1007025, 1028277, 1049251, 1070498, 1092450, 1114803, 1136795, 1158071, 1178905, 1199590, 1220055, 1240148, 1259922, 1279450, 1298613, 1317218, 1335164, 1352376, 1368692, 1383953, 1398197, 1411754, 1425096, 1438425, 1451306, 1462865, 1472531, 1480493, 1487208, 1492555, 1495740, 1496069, 1493567, 1488706, 1481766, 1472599, 1460930, 1446746, 1430383, 1412476, 1393941, 1375869, 1359066, 1343434, 1327921]
53454A327921j6586j8123j9425k0506k1623k2464k2363k1263j9999j9422j9516
53443A106631j9527j8830j7461j5909j4488j3031j1265r285p396n578l512j287
53431I69062M27J236J673K583M175O017P668Q931R752J0374J1315J2777J4315
53418A060305J5556J6848J8670K0755K2512K3999K5645K7267K8267K8790K9710
53407A318324L1323L3003L4374L5918L8007M0156M1712M2823M4153M6137M8795
53396A754725N1822N4463N5834N5794N5215N5019N5316N5680N5777N5423N4433
53385B359501N2913N1326M9826M7839M4754M0857L7183L4473L2439L0028K6385
53374B807524K1715J7138J3397R898N544L31m736r341j4477k0875k7823l4241
$$ y = [1327921, 1311335, 1293212, 1273787, 1253281, 1231658, 1209194, 1186831, 1165568, 1145569, 1126147, 1106631, 1087104, 1068274, 1050813, 1034904, 1020416, 1007385, 996120, 986835, 979439, 973861, 970349, 969062, 969489, 970725, 972398, 974981, 979156, 985173, 992841, 1001772, 1011524, 1021898, 1033213, 1045990, 1060305, 1075861, 1092709, 1111379, 1132134, 1154646, 1178645, 1204290, 1231557, 1259824, 1288614, 1318324, 1349647, 1382650, 1417024, 1452942, 1490949, 1531105, 1572817, 1615640, 1659793, 1705930, 1754725, 1806547, 1861010, 1916844, 1972638, 2027853, 2082872, 2138188, 2193868, 2249645, 2305068, 2359501, 2412414, 2463740, 2513566, 2561405, 2606159, 2647016, 2684199, 2718672, 2751111, 2781139, 2807524, 2829239, 2846377, 2859774, 2869672, 2875216, 2875547, 2870811, 2861470, 2846993, 2826118, 2798295, 2764054]
53362B764054m0135m6048n1560n5381n6937n7001n6714n6635n6753n6842n6565
53351B173483n5689n4290n2562n0474m7995m5614m4152m3924m4342m4482m3857
53340A646102m2596m1073l9435l7435l4728l1406k8144k5696k4283k3501k2650
53329A295155k1163j8858j6094j3479j1456j0201r795j0145j0715j0791j0215
53318A152243r509r002q311o935n083l471k503j964j378l06J507L907O270P903
53304A123368Q579Q662Q871R945J2132J4839J7056J8396J9408K0676K2002K2893
53292A306827K3467K4314K5554K6627K7044K6977K6848K6621K5701K3630K0728
53281A584338J7926J5846J4215J2389J0221Q005N742L091J02k655m916p108r622
$$ y = [2764054, 2723919, 2677871, 2626311, 2570930, 2513993, 2456992, 2400278, 2343643, 2286890, 2230048, 2173483, 2117794, 2063504, 2010942, 1960468, 1912473, 1866859, 1822707, 1778783, 1734441, 1689959, 1646102, 1603506, 1562433, 1522998, 1485563, 1450835, 1419429, 1391285, 1365589, 1341306, 1317805, 1295155, 1273992, 1255134, 1239040, 1225561, 1214105, 1203904, 1194109, 1183964, 1173249, 1162458, 1152243, 1142734, 1133732, 1125421, 1118486, 1113403, 1109932, 1107429, 1105465, 1104087, 1103781, 1105288, 1109195, 1115465, 1123368, 1131947, 1140609, 1149480, 1159425, 1171557, 1186396, 1203452, 1221848, 1241256, 1261932, 1283934, 1306827, 1330294, 1354608, 1380162, 1406789, 1433833, 1460810, 1487658, 1514279, 1539980, 1563610, 1584338, 1602264, 1618110, 1632325, 1644714, 1654935, 1662940, 1668682, 1671773, 1671875, 1669220, 1664304, 1657196, 1647574]
53268A647574j2294j4959j7853k0982k3652k5264k6187k7233k8561k9734l0520
53257A390335l1054l1356l1366l1293l1422l1637l1587l1162l0381k9056k7188
53246A052833k5460k4677k4770k4996k4964k4792k4375k3350k1939k1010k0888
53235G91612k0781j9868j8441j7448j7137j6722j5378j3165j0884r279q492q233
53223F15784q315q814r690j0523j0824j0536j0016r675r805j0550j1724j2727
53211D92585j2951j2250j0960r588q637q362q458q145p046n727n038n078n351
53198C84994n653o195o834o893o023m771l989l992m491m953m906m168l109k418
53184C16599k397k640k597k268k102k376k870l141k869k033r28m5J76l11j067
$$ y = [1647574, 1635280, 1620321, 1602468, 1581486, 1557834, 1532570, 1506383, 1479150, 1450589, 1420855, 1390335, 1359281, 1327925, 1296559, 1265266, 1233844, 1202207, 1170620, 1139458, 1109077, 1080021, 1052833, 1027373, 1002696, 977926, 952930, 927966, 903174, 878799, 855449, 833510, 812500, 791612, 770831, 750963, 732522, 715074, 697937, 681215, 665837, 652672, 641788, 632509, 624017, 615784, 607469, 598655, 588965, 578442, 567618, 557082, 547066, 537391, 527586, 517036, 505312, 492585, 479634, 467384, 456424, 446836, 438199, 429837, 421379, 413234, 406188, 400461, 395423, 390345, 384994, 379341, 373146, 366312, 359419, 353396, 348625, 344636, 340644, 336153, 331200, 326294, 322126, 319017, 316599, 314202, 311562, 308965, 306697, 304595, 302219, 299349, 296208, 293339, 291306, 290378, 290333, 290509, 290198, 289131]
53169B89131j511j398r85p32q82j322j702j638j024l39l64j217j927j509l58J44
53153B72367m82j147p75J74M38l40j394k057k357k418k059j215l06J83K32K01
53137B59045L76O70P85N45R3k96n08n23j95N51J334J620J417J183R83M24l40l76
53119B66788O87J877K126J661J373J286P44k35q28o95l77l11k54J4J52k69j181
53102B72558k168k839k918k364j554j054j112j481j710j416n35M30P04J69l11
53087B54399MO53O60l0n71n10k17J3M45J231J920J905J052k48j316j555r74k61
53069B56600K6M6O2k53j187k074k017j347j175j648j737r65j55j21n60p67n30
53052B42198P7J020J974K304J878J287J006Q94P57O16K25q42k254k922k367j302
$$ y = [289131, 287620, 286222, 285237, 284505, 283623, 282301, 280599, 278961, 277937, 277598, 277234, 276017, 274090, 272581, 272223, 272367, 271885, 270738, 269963, 270137, 270575, 270235, 268841, 266784, 264427, 262009, 259950, 258735, 258429, 258612, 258844, 259045, 259421, 260091, 260876, 261421, 261514, 261218, 260710, 260187, 259992, 260543, 261877, 263497, 264914, 266097, 267080, 267504, 267164, 266788, 267475, 269352, 271478, 273139, 274512, 275798, 276542, 276307, 275479, 274784, 274407, 274096, 273842, 273856, 274008, 273739, 272558, 270390, 267551, 264633, 262269, 260715, 259661, 258549, 257068, 255358, 253942, 253407, 253837, 254541, 254710, 254399, 254403, 255056, 255716, 255686, 255115, 254605, 254388, 254401, 254846, 256077, 257997, 259902, 260954, 260706, 259390, 257835, 256861, 256600, 256626, 256672, 256734, 256481, 255294, 253220, 251203, 249856, 248681, 247033, 245296, 244331, 244176, 244055, 243495, 242728, 242198, 242275, 243295, 245269, 247573, 249451, 250738, 251744, 252638, 253395, 254011, 254236, 253394, 251140, 248218, 245851, 244549]
53036B44549m91O0L73N6p23q97k7P06J17j160j602j005m58m49l25L77J202J607
53018B41910J634J513J275J031J060J331J384Q81P3m32j70P93J785K000J321M79
53002B57868J55J50j65q37j257j025m53j60m40r98j161n00O30J386J395J136J095
52985B56819J032N25j07o0Q76J986K384J834Q43J96L48J050J572J469R72N78M99
52968B72816O25P84Q40P73P57R09R41N06r7j69K79L13o45j944k591k511k326k362
52950B66898k388k106j473p95o80j470k512k586j403K3Q20J202J486J218K17m81
52934B55970M1R73Q06m63j503j665j488j233m77O34J084M26m93p79n59l56k47
52917B50671j62l10o69o69O9J015J258M78q68k009k312j593k91R20J709K101K033
$$ y = [244549, 244058, 244118, 244491, 244547, 243824, 242927, 242900, 243606, 243723, 242563, 240961, 239956, 239498, 239049, 238724, 239101, 240303, 241910, 243544, 245057, 246332, 247363, 248423, 249754, 251138, 252019, 252092, 251660, 251490, 252283, 254068, 256068, 257389, 257868, 258023, 258173, 258008, 257171, 255914, 254889, 254436, 254276, 253836, 252838, 251677, 251177, 251807, 253193, 254588, 255724, 256819, 257851, 258376, 258269, 258209, 259085, 261071, 263455, 265289, 266132, 266328, 266676, 267726, 269298, 270767, 271739, 272317, 272816, 273441, 274225, 275065, 275838, 276595, 277504, 278445, 278951, 278854, 278685, 278964, 279277, 278632, 276688, 274097, 271586, 269260, 266898, 264510, 262404, 260931, 260136, 259456, 257986, 255474, 252888, 251485, 251508, 252328, 253530, 255016, 256234, 256451, 255970, 256011, 256984, 257790, 257327, 255824, 254159, 252671, 251438, 250961, 251595, 252679, 253105, 252612, 251833, 251274, 250918, 250671, 250509, 250199, 249530, 248861, 248930, 249945, 251203, 251681, 250813, 248804, 246492, 244899, 244608, 245528, 247237, 249338, 251371]
52900B51371J449P67N72P50N85r5n61l04K14L08Q8J16M43N71K33k28l07O3L56
52881B56391q2j280k407k568j783q48l05j3K88N66Q63J445K272K729K312J302
52865B58882M59K16M52Q87J355J772J963J607N23r02j840j891j641j880k488k677
52849B54797k297k112k626l281l176k136p63K07L69k43j201k051k592k633j777
52834B28485oJ655J939R06n0L4P40J340J788K113J721K89j244j592p42J75M73
52817B38024N82J104J946K548K511J907J223J062J594K294K432J698J87j804l711
52802B53597m732m444l273j967q67r0k2r15k137k586j934q77r4M13P52P38L47
52785B31909J12M60J071J298J025O95O14O83P05N56R8o63j237r91L9R38Q98J29
$$ y = [251371, 252820, 253587, 254159, 254909, 255494, 255399, 254838, 254534, 254748, 255056, 255144, 255260, 255703, 256274, 256507, 256279, 255972, 256035, 256391, 256309, 255029, 252622, 250054, 248271, 247423, 247118, 247105, 247393, 247959, 248822, 250267, 252539, 255268, 257580, 258882, 259341, 259557, 260009, 260896, 262251, 264023, 265986, 267593, 268116, 267214, 265374, 263483, 261842, 259962, 257474, 254797, 252500, 250388, 247762, 244481, 241305, 239169, 238406, 238613, 238982, 238739, 237538, 235487, 232895, 230262, 228485, 228479, 230134, 232073, 232979, 232929, 232963, 233703, 235043, 236831, 238944, 240665, 240954, 239710, 238118, 237376, 237551, 238024, 238606, 239710, 241656, 244204, 246715, 248622, 249845, 250907, 252501, 254795, 257227, 258925, 259112, 257308, 253597, 248865, 244421, 241148, 239181, 238314, 238224, 238202, 237287, 235150, 232564, 230630, 229753, 229659, 230072, 230824, 231562, 231909, 232021, 232481, 233552, 234850, 235875, 236570, 237184, 237867, 238572, 239128, 239226, 238563, 237326, 236335, 236374, 237312, 238210, 238339]
52767B38339n25o82o66p38o45j69L58M31N6l18m33m33n28o77o40k25M33Q27N32
52748B34297j51l74J84Q19Q23M96N79R93R80L63j55o2L54O70Q95J132J260J267
52730B44370J380J617J676J472J173O55m51j821k428j858r32m97l68r1K4m65j103
52713B42353j154q31q23r14k84Q78J262L03q55q35K98J378J657J366J049R46R61
52696B46755R28Q09P28Q18J054J267J312J103O19Km22m68k96r7K27O99R08M57
52678B56403l02n33M2P78R30M16l10p92q80p24n92n27k78J85L44k32j059j149
52660B51720k79P69J323J483J437R25j25r50o96M44J439J657J331Q37J20r30j922
52643B58583k190j503l84L81M73K92M43J060J725K029J958J804J841K151K608
$$ y = [238339, 237814, 237132, 236466, 235728, 235083, 234914, 235272, 235703, 235759, 235441, 235008, 234575, 234047, 233370, 232730, 232505, 232938, 233765, 234297, 234146, 233772, 233956, 234775, 235598, 236094, 236673, 237666, 238646, 239009, 238854, 238792, 239146, 239816, 240711, 241843, 243103, 244370, 245750, 247367, 249043, 250515, 251688, 252343, 251892, 250071, 247643, 245785, 244853, 244356, 243988, 243897, 243921, 243456, 242353, 241199, 240368, 239545, 238631, 238347, 239225, 240487, 240790, 239935, 239100, 239398, 240776, 242433, 243799, 244848, 245794, 246755, 247683, 248492, 249220, 250038, 251092, 252359, 253671, 254774, 255393, 255395, 254973, 254505, 254209, 254112, 254339, 255038, 255946, 256403, 256101, 255568, 255610, 256388, 257318, 257734, 257424, 256632, 255752, 255028, 254436, 253909, 253631, 253816, 254160, 253928, 252869, 251720, 251441, 252210, 253533, 255016, 256453, 257378, 257253, 256303, 255607, 256051, 257490, 259147, 260478, 261315, 261435, 260505, 258583, 256393, 254890, 254506, 254887, 255360, 255652, 256095, 257155, 258880, 260909, 262867, 264671, 266512, 268663, 271271]
52628B71271K919K901K670K387J797M02j708l554m138l499k656k469k800k846
52614B60677k144j084m59m83n52p7P27J190J213J294J566J408L84q95j369p34
52598B60662L68J140J251Q37L40K24N54R01R77J050J387J567J017K6n18l99k89
52581B71095n45n79J46J182J630J160O6j284k402k581j510J10J183J379J184R58
52565B71192N74k5n86r64j195j142o46j47m22j326j555k46J700K583J886O03k07
52548B70077m30m70n33o82j052j615j946j598o88J18K78o0j97L22J105J268N38
52531B64435k78j83Q33J781J818J094M61N61J260J772J409M16j31M55J489J639
52515B78831O59k52M7J275K263K369J878J355J108J269J780K153J654O3j875l001
$$ y = [271271, 274190, 277091, 279761, 282148, 283945, 284347, 282639, 279085, 274947, 271448, 268792, 266323, 263523, 260677, 258533, 257449, 256990, 256507, 255955, 255878, 256605, 257795, 259008, 260302, 261868, 263276, 263660, 262765, 261396, 260662, 261030, 262170, 263421, 264258, 264598, 264822, 265376, 266277, 267254, 268304, 269691, 271258, 272275, 272301, 271783, 271384, 271095, 270550, 269971, 270117, 271299, 272929, 274089, 274155, 272871, 270469, 267888, 266378, 266488, 267671, 269050, 270234, 271192, 271766, 271741, 271155, 270191, 268996, 267854, 267208, 267061, 266639, 265313, 263758, 263512, 265212, 267795, 269681, 270284, 270077, 269647, 269177, 268644, 267962, 266910, 265295, 263349, 261751, 261063, 261181, 261459, 261399, 261202, 261524, 262629, 263897, 264435, 264157, 263974, 264807, 266588, 268406, 269500, 269961, 270522, 271782, 273554, 274963, 275379, 275248, 275703, 277192, 278831, 279490, 279238, 279285, 280560, 282823, 285192, 287070, 288425, 289533, 290802, 292582, 294735, 296389, 296452, 294577, 291576]
52499B91576k817j973j556k023k868l354l265k864k352j704q91J09J391K751L366
52484B73526K499O62n69l05P07J246J185J214J494J486R67L93J00o2j12L38J320
52467B86089K083J977J360J083J296J478J490J830K589K838J624o83k623l238
52453B99193k954k785l070l280k865j953j220j204j774k201j891j045m81o52j141
52438B70677j270r41n05j58J40K85J91K42R28J973K477K135J637J558J488Q49
52422B81706l2l06K32J005J494J609J398R96Q87J591K984M292M866M663M053L612
52406C15050M000N515P559Q954Q981P802N833L200l7l489o563q715r540q886p179
52391C22485n317l957l043k141j091j56K36j56j084j757j414j78R78J324J152
$$ y = [291576, 288759, 286786, 285230, 283207, 280339, 276985, 273720, 270856, 268504, 266800, 265909, 266018, 267409, 270160, 273526, 276025, 276687, 276118, 275813, 276520, 277766, 278951, 280165, 281659, 283145, 284112, 284505, 284605, 284543, 284431, 284769, 286089, 288172, 290149, 291509, 292592, 293888, 295366, 296856, 298686, 301275, 304113, 305737, 305054, 302431, 299193, 296239, 293454, 290384, 287104, 284239, 282286, 281066, 279862, 278088, 275887, 273996, 272951, 272470, 271818, 270677, 269407, 268466, 267961, 267803, 267943, 268228, 268419, 268661, 269589, 271562, 274039, 276174, 277811, 279369, 280857, 281706, 281674, 281368, 281600, 282605, 284099, 285708, 287106, 288102, 288989, 290580, 293564, 297856, 302722, 307385, 311438, 315050, 319050, 324565, 332124, 341078, 350059, 357861, 363694, 366894, 366857, 363368, 356805, 348090, 338550, 329664, 322485, 317168, 313211, 310168, 308027, 306936, 306780, 307016, 306860, 305776, 304019, 302605, 302427, 303405, 304729, 305881]
52376C05881J207J687K254K779L515M499N259N316M699L804K965K279J679J017
52362C48840J46q65j672j879j369l96N12Q73N83N0j41J94P35J144J450J767J924
52345C51896J725J508J947L129M195M246L384K590K701L780N293O588P282P530
52331D07794P920Q769R640R914R716R784J0454J1384J2375J3699J5249J6184J5992
52318E58874J5385J5317J5529J4972J3564J2551J2948J4381J5780J6575J6793
52307G22669J6600J6271J6281J6848J7466J7332J6214J4667J3406J2710J2313
52296H92777J1644J0166P752M863K235L47q81j852k880l982m961n599n776n514
52282H98339m987m528m382m398m019k852j209J28O97P87J027J687K556L416M480
$$ y = [305881, 307088, 308775, 311029, 313808, 317323, 321822, 327081, 332397, 337096, 340900, 343865, 346144, 347823, 348840, 348986, 348121, 346449, 344570, 343201, 342805, 343317, 344190, 344773, 344823, 344682, 344876, 345611, 346755, 348205, 349972, 351896, 353621, 355129, 357076, 360205, 364400, 368646, 372030, 374620, 377321, 381101, 386394, 392982, 400264, 407794, 415714, 424483, 434123, 444037, 453753, 463537, 473991, 485375, 497750, 511449, 526698, 542882, 558874, 574259, 589576, 605105, 620077, 633641, 646192, 659140, 673521, 689301, 705876, 722669, 739269, 755540, 771821, 788669, 806135, 823467, 839681, 854348, 867754, 880464, 892777, 904421, 914587, 922339, 927202, 929437, 929784, 928903, 927051, 924171, 920189, 915228, 909629, 903853, 898339, 893352, 888824, 884442, 880044, 876025, 873173, 871964, 872092, 872789, 873576, 874603, 876290, 878846, 882262, 886742]
52267H86742O115Q172R825J0328R865R326R261R494R804J0501J1903J3575J4588
52254A019499J4473J3578J2600J2041J1892J1479R847O765L243N80r57k036l090
52241A109914l908m385m845n400n713n716n975o871p986q710q981q990q641p897
52227A015896p233p127p291p034o212n263m423l533k606j949j566j004jJ092J785
52212I63531K023K124K451L256M478N500N498M398L200K943L512L940L822L860
52198A014536M831O436P589P633O873N963N209M578M029L543K961K051P23r45
52184A076010k784m520n820o583p081p529p689p198o261n564n428n424n016m264
52170I94849l571l041k424j581p13j06J38J71L29R31J912K736K863K283J452O89
$$ y = [886742, 892857, 901029, 910854, 921182, 931047, 940373, 949634, 959128, 968932, 979433, 991336, 1004911, 1019499, 1033972, 1047550, 1060150, 1072191, 1084083, 1095562, 1105409, 1112174, 1115417, 1115997, 1115040, 1113004, 1109914, 1106006, 1101621, 1096776, 1091376, 1085663, 1079947, 1073972, 1067101, 1059115, 1050405, 1041424, 1032434, 1023793, 1015896, 1008663, 1001536, 994245, 987211, 980999, 975736, 971313, 967780, 965174, 963225, 961659, 960655, 960654, 961746, 963531, 965554, 967678, 970129, 973385, 977863, 983363, 988861, 993259, 996459, 999402, 1002914, 1006854, 1010676, 1014536, 1019367, 1025803, 1033392, 1041025, 1047898, 1053861, 1059070, 1063648, 1067677, 1071220, 1074181, 1076232, 1076955, 1076010, 1073226, 1068706, 1062886, 1056303, 1049222, 1041693, 1034004, 1026806, 1020545, 1014981, 1009553, 1004129, 999113, 994849, 991278, 988237, 985813, 984232, 983519, 983413, 983551, 983722, 984051, 984982, 986894, 989630, 992493, 994776, 996228, 996917]
52154I96917l7p16r33k52J083K138K155J343O42P25J446K167K327J651K62j135
52138A009783j556p58L38P21O17J141K669M390N614O785Q679J1199J3588J5433
52124A078643J6896J8146J9166K0002K0720K1218K1422K1584K1947K2232K1924
52113A303900K0973J9764J8495J7084J5728J4875J4475J3863J2695J1550J1147
52102A474549J1316J1213J0344Q911P271N527L659J638p05l607o918r975j2183
52089A501040j3615j4751j5647j5777j4754j3012j1412j0314r353q112o665n307
52077A362321m080k879j782r57k61P11K153L849N473O824P812Q529R340J0615
52063A407668J2119J3072J2997J2285J1621J1198J0824J0500J0348J0004Q836
$$ y = [996917, 996880, 996164, 995231, 994979, 996062, 998200, 1000355, 1001698, 1002340, 1003065, 1004511, 1006678, 1009005, 1010656, 1010918, 1009783, 1008227, 1007469, 1007807, 1008528, 1009145, 1010286, 1012955, 1017345, 1022959, 1029744, 1038423, 1049622, 1063210, 1078643, 1095539, 1113685, 1132851, 1152853, 1173573, 1194791, 1216213, 1237797, 1259744, 1281976, 1303900, 1324873, 1344637, 1363132, 1380216, 1395944, 1410819, 1425294, 1439157, 1451852, 1463402, 1474549, 1485865, 1497078, 1507422, 1516333, 1523604, 1529131, 1532790, 1534428, 1533723, 1530116, 1523198, 1513223, 1501040, 1487425, 1472674, 1457027, 1441250, 1426496, 1413484, 1402072, 1391758, 1382405, 1374293, 1367628, 1362321, 1358241, 1355362, 1353580, 1352623, 1352362, 1353073, 1355226, 1359075, 1364548, 1371372, 1379184, 1387713, 1397053, 1407668, 1419787, 1432859, 1445856, 1458141, 1469762, 1480960, 1491784, 1502284, 1512632, 1522636, 1531472]
52052A531472O862M918L515K055k66l128n359o409o974p980r488j0905j1847j2383
52038A474083j2666j2718j2578j2446j2578j3110j3900j4498j4393j3502j2401
$$ y = [1531472, 1538334, 1543252, 1546767, 1548822, 1548556, 1545428, 1540069, 1533660, 1526686, 1518706, 1509218, 1498313, 1486466, 1474083, 1461417, 1448699, 1436121, 1423675, 1411097, 1397987, 1384087, 1369589, 1355196, 1341694, 1329293]
$$ [...]
##END NTUPLES=NMR SPECTRUM
##END=
