##TITLE=AC1581_2782_8202388_tz30C9GtBx
##JCAMPDX= 6.0         $$ Bruker NMR JCAMP-DX V2.0
##DATA TYPE= NMR SPECTRUM
##DATA CLASS= NTUPLES
##ORIGIN= BRUKER
##OWNER= Administrator
$$ 1.72 TOPSPIN		Version 2.1
$$ 2013-10-04 22:18:01.994 -0700  Administrator@X
$$ Compression mode = diff/dup
##.OBSERVE FREQUENCY= 400.02188249412
##.OBSERVE NUCLEUS= ^1H
##.ACQUISITION MODE= SIMULTANEOUS (DQD)
##.ACQUISITION SCHEME= undefined
##.AVERAGES= 8
##.DIGITISER RES= 22
##SPECTROMETER/DATA SYSTEM= spect
##.PULSE SEQUENCE= zg30
##.SOLVENT NAME= COFFEE_meoh
##.SHIFT REFERENCE= INTERNAL, COFFEE_meoh, 1, 14.98509
##AUDIT TRAIL= $$ (NUMBER, WHEN, WHO, WHERE, PROCESS, VERSION, WHAT)
$$ ##TITLE= Audit trail, TOPSPIN		Version 2.1
$$ ##JCAMPDX= 5.01
$$ ##ORIGIN= Bruker BioSpin GmbH
$$ ##OWNER= Administrator
$$ $$ E:\/data/COFFEE/nmr/AC1581_2782_8202388_tz30C9GtBx/30/pdata/1/auditp.txt
$$ ##AUDIT TRAIL=  $$ (NUMBER, WHEN, WHO, WHERE, PROCESS, VERSION, WHAT)
(   1,<2013-10-04 22:17:55.682 -0700>,<Administrator>,<X>,<go>,<TOPSPIN 2.1>,
      <created by zg
	started at 2013-10-04 22:16:49.871 -0700,
	POWCHK enabled, PULCHK disabled,
       configuration hash MD5:
       C8 4E 4E 5D D3 5C D8 9E 9F 52 82 E0 59 8A DE 15
       data hash MD5: 64K
       14 70 CC 54 C8 FF 54 FE 07 67 61 3D DF 3E 5E 0F>)
(   2,<2013-10-04 22:17:58.525 -0700>,<Administrator>,<X>,<proc1d>,<TOPSPIN 2.1>,
      <Start of raw data processing
       efp LB = 0 FT_mod = 6 PKNL = 1 PHC0 = 0 PHC1 = 0 SI = 32K 
       data hash MD5: 32K
       87 60 C3 8B 15 97 18 C2 98 5A 35 AD CA C6 72 AD>)
(   3,<2013-10-04 22:17:58.807 -0700>,<Administrator>,<X>,<proc1d>,<TOPSPIN 2.1>,
      <pk PHC0 = 95.10315 PHC1 = 0 
       data hash MD5: 32K
       B7 8E 56 02 2A 13 B5 66 8E 01 C9 CE 97 7B A6 34>)
(   4,<2013-10-04 22:17:58.916 -0700>,<Administrator>,<X>,<proc1d>,<TOPSPIN 2.1>,
      <abs ABSG = 1 
       data hash MD5: 32K
       77 6D 22 01 EE A2 52 47 86 CE FF 05 3A E1 BC E6>)
(   5,<2013-10-04 22:17:58.963 -0700>,<Administrator>,<X>,<proc1d>,<TOPSPIN 2.1>,
      <abs ABSG = 2 
       data hash MD5: 32K
       09 07 D8 AA E9 3F 4F 93 F1 F6 B1 25 33 56 93 A8>)
(   6,<2013-10-04 22:17:59.010 -0700>,<Administrator>,<X>,<proc1d>,<TOPSPIN 2.1>,
      <abs ABSG = 3 
       data hash MD5: 32K
       84 AB 3F F9 57 31 98 87 CD 3A 12 7D 1F AC D2 2D>)
(   7,<2013-10-04 22:17:59.057 -0700>,<Administrator>,<X>,<proc1d>,<TOPSPIN 2.1>,
      <abs ABSG = 4 
       data hash MD5: 32K
       13 E0 59 8F 9D 5B 4E C2 53 3D C2 DA 75 74 1C 02>)
(   8,<2013-10-04 22:17:59.119 -0700>,<Administrator>,<X>,<proc1d>,<TOPSPIN 2.1>,
      <abs ABSG = 5 
       data hash MD5: 32K
       76 BB 06 F8 99 AF DC F2 39 EE C6 98 11 5A 2C 4A>)
$$ ##END=
$$ 
$$ $$ hash MD5
$$ $$ 4C 54 9F CF 80 E3 74 34 A1 EF 2C 48 1C AA 19 6D
##$RELAX= 
##$RELAX= 
##$RELAX= 
##$RELAX= 
##$RELAX= 
##$RELAX= 
##$RELAX= 
$$ Bruker specific parameters
$$ --------------------------
##$DU= <E:\>
##$EXPNO= 30
##$NAME= <AC1581_2782_8202388_tz30C9GtBx>
##$PROCNO= 1
$$ [...]
150 150 150 150 150 150 150 150
##$TP07= 0
##$TPNAME0= <>
##$TPNAME1= <>
##$TPNAME2= <>
##$TPNAME3= <>
##$TPNAME4= <>
##$TPNAME5= <>
##$TPNAME6= <>
##$TPNAME7= <>
##$TPOAL= (0..7)
0.5 0.5 0.5 0.5 0.5 0.5 0.5 0.5
##$TPOFFS= (0..7)
0 0 0 0 0 0 0 0
##$TUNHIN= 0
##$TUNHOUT= 0
##$TUNXOUT= 0
##$USERA1= <user>
##$USERA2= <user>
##$USERA3= <user>
##$USERA4= <user>
##$USERA5= <user>
##$V9= 5
##$VALIST= <valist>
##$VCLIST= <CCCCCCCCCCCCCCC>
##$VD= 0
##$VDLIST= <DDDDDDDDDDDDDDD>
##$VPLIST= <PPPPPPPPPPPPPPP>
##$VTLIST= <TTTTTTTTTTTTTTT>
##$WBST= 2048
##$WBSW= 25
##$XGAIN= (0..3)
0 0 0 0
##$XL= 0
##$YL= 0
##$YMAX_a= 652969
##$YMIN_a= -554569
##$ZGOPTNS= <>
##$ZL1= 120
##$ZL2= 120
##$ZL3= 120
##$ZL4= 120
##$ABSF1= 14.98509
##$ABSF2= -5.573092
##$ABSG= 5
##$ABSL= 3
##$ALPHA= 0
##$AQORDER= 0
##$ASSFAC= 0
##$ASSFACI= 0
##$ASSFACX= 0
##$ASSWID= 0
##$AUNMP= <proc_prof1d_extract_pilot.lims>
##$AXLEFT= 0
##$AXNAME= <>
##$AXNUC= <1H>
##$AXRIGHT= 0
##$AXTYPE= 0
##$AXUNIT= <>
##$AZFE= 0.1
##$AZFW= 0.1
##$BCFW= 0
##$BC_mod= 0
##$BYTORDP= 0
##$COROFFS= 0
##$CY= 15
##$DATMOD= 1
##$DC= 0
##$DFILT= <>
##$DTYPP= 0
##$F1P= 0
##$F2P= 0
##$FCOR= 0.5
##$FTSIZE= 32768
##$FT_mod= 6
##$GAMMA= 0
##$GB= 0
##$INTBC= 1
##$INTSCL= 1
##$ISEN= 128
##$LB= 0
##$LEV0= 0
##$LPBIN= 0
##$MAXI= 10000
##$MC2= 0
##$MEAN= 0
##$ME_mod= 0
##$MI= 0
##$NCOEF= 0
##$NC_proc= -8
##$NLEV= 6
##$NOISF1= 0
##$NOISF2= 0
##$NSP= 0
##$NTH_PI= 0
##$NZP= 0
##$OFFSET= 14.98509
##$PC= 1
##$PHC0= 95.10315
##$PHC1= 0
##$PH_mod= 1
##$PKNL= yes
##$PPARMOD= 0
##$PPDIAG= 0
##$PPIPTYP= 0
##$PPMPNUM= 2147483647
##$PPRESOL= 1
##$PSCAL= 4
##$PSIGN= 0
##$PYNMP= <proc.py>
##$REVERSE= no
##$SF= 400.02
##$SI= 32768
##$SIGF1= 0
##$SIGF2= 0
##$SINO= 400
##$SIOLD= 32768
##$SPECTYP= <>
##$SREGLST= <1H.CDCl3>
##$SSB= 0
##$STSI= 32768
##$STSR= 0
##$SW_p= 8223.68421052631
##$SYMM= 0
##$S_DEV= 0
##$TDeff= 65536
##$TDoff= 0
##$TI= <>
##$TILT= no
##$TM1= 0
##$TM2= 0
##$TOPLEV= 0
##$USERP1= <user>
##$USERP2= <user>
##$USERP3= <user>
##$USERP4= <user>
##$USERP5= <user>
##$WDW= 1
##$XDIM= 32768
##$YMAX_p= 453866752
##$YMIN_p= -687640
##$CURPLOT= <Network HP LaserJet P1505>
##$CURPRIN= <$Network HP LaserJet P1505>
##$DFORMAT= <normdp>
##$LAYOUT= <+/1D_H.xwp>
##$LFORMAT= <normlp>
##$PFORMAT= <normpl>
##$SURQMSG= 1
$$ End of Bruker specific parameters
$$ ---------------------------------
##NTUPLES= NMR SPECTRUM
##VAR_NAME=  FREQUENCY,     SPECTRUM/REAL,   SPECTRUM/IMAG
##SYMBOL=    X,             R,               I
##VAR_TYPE=  INDEPENDENT,   DEPENDENT,       DEPENDENT
##VAR_FORM=  AFFN,          ASDF,            ASDF
##VAR_DIM=   32768,         32768,           32768
##UNITS=     HZ,            ARBITRARY UNITS, ARBITRARY UNITS
##FACTOR=    0.250966925370066, 1,           1
##FIRST=     8223.43324360094, -16755,       118459
##LAST=      0,             -19055,          -173673
##MIN=       0,             -687640,         0
##MAX=       8223.43324360094, 453866752,    0
$$ Real data points
##PAGE= N=1
##DATA TABLE= (X++(R..R)), XYDATA
$$ [...]
$$ plain form
19537 -132623 15714 -4678 -99383 -218334 385816 123952 -84785 49313 -160659 -61050 25315
19525 -159596 166472 -331569 -328006 -387560 -110672 -135584 -18553 -289518 54501 -123866 145091
19513 -69323 268307 -403978 98308 -174464 -228901 34860 -378936 5043 -51982 -42037 -107171
19502 -107171 -292827 -313430 -402430 464786 -89302 50759 -117660 -277374 -351 -215054 -108363
19491 -108363 113240 70825 -110936 -61409 -162233 142190 -215116 -127839 54883 -61174
19480 -93843 -276943 -225321 39181 -433627 -24955 -265519 21600 -153693 -86755 -89753 38185
19468 -49335 -132662 -51555 -126465 -420428 -109041 -126555 -176811 -57241 -313854 -2687 -14089
19457 -14089 120023 101013 -286838 -168423 -166802 459195 -99582 -199422 -251138 -86697 87776
$$ packed form
19537a32623A5714d678r4705j18951C85816A23952h4785D9313a60659f1050B5315
19525a59596A66472c31569L563n9554a10672k4912a8553k70965E4501a23866A45091
19513f9323B68307d03978I8308a74464n4437C4860c78936E043e1982R945o5134
19502a07171j85656k0603q9000D64786h9302E0759a17660j59714c51k14703J06691
19491a08363A13240m2415a10936M9527j00824A42190b15116Q7277E4883f1174
19480i3843j83100N1622C9181d33627b4955k40564B1600a53693O6938k998C8185
19468d9335q3327e1555p4910k93963a09041j7514n0256e7241k56613b687j1402
19457a4089A20023j9010b86838J18415J621D59195i9582r9840n1716h6697H7776
$$ plain form
19445 72421 237734 -258217 28102 -181806 -80861 47634 -99574 -20743 -240229 174443 -108425
19433 -408984 -190314 -9784 -141087 39611 -68994 -242977 -126232 11689 -199692 36069 -61597
19421 -101287 -223775 10584 114751 135383 -232603 -165163 -195330 121155 -95755 226730
19410 167267 -96569 -220675 -190568 170607 -45816 -249013 -103893 -333662 264878 55501
19399 96515 -85294 255536 -89726 -176383 153340 -164272 -164253 25975 -8102 -197049 -13413 -184765
19387 -184765 -54934 -141199 67515 21311 -21317 85207 -228899 101025 22107 -303166 -47891
19375 79057 -181338 -116029 -157060 -43821 125095 -111453 -309597 -362606 -214847 -174346 -172207
19364 -172207 -44388 109975 -75484 -265958 -62276 -345726 -45381 -350787 -49011 311425
$$ packed form
19445G2421J65313b58217B8102a81806h0861D7634i9574b0743k19486A74443a08425
19433d08984a90314i784j31303C9611f8994j73983J16745A1689a99692C6069f1597
19421a01287j22488A0584J04167K0632b32603O7440l0167A21155i5755B26730
19410A67267i6569j24106L0107A70607d5816k03197a03893k29769B64878E5501
19399I6515h5294B55536h9726q6657A53340a64272J9B5975h102j88947a3413j71352
19387a84765e4934q6265F7515B1311b1317H5207b28899A01025B2107c03166d7891
19375G9057a81338O5309m1031d3821A25095a11453j98144n3009J47759M0501K139
19364a72207d4388A09975g5484j90474f2276k83450d5381l05406d9011C11425
$$ plain form
19353 -166005 20690 29746 109539 147612 -181892 -15605 247733 163021 5807 -17977 -5420 -185232
19341 -185232 30998 170688 -174987 -139860 49920 -343881 86164 23514 -237402 -278082 -153926
19330 -153926 -180580 -175039 -104233 103677 -214489 -202673 -94072 -298084 37217 -179114 -97841
19319 -97841 191030 203134 -113294 -162341 166347 -189255 -130970 16908 132929 187610 -517770
19307 -148455 69338 54069 -54989 74748 63413 -264852 -137878 -81819 129981 124818 -204066
19295 267250 202099 -221553 115539 136871 64834 -162757 -140545 -323363 -72155 -85614 80330
19283 45016 -287477 54738 -354723 -150288 140143 -139484 271923 227869 -72351 235051
19272 -83802 106883 -160124 -82898 125648 -94076 104968 -309271 -230277 -68840 242978
$$ packed form
19353a66005B0690R056P9793L8073a81892a5605B47733q4712E807a7977e420j79812
19341a85232C0998J39690a74987L5127D9920c43881H6164B3514b37402m0680J24156
19330a53926k6654N541P0806A03677b14489J1816i4072k04012C7217a79114Q1273
19319i7841A91030J2104a13294m9047A66347a89255N8285A6908J16021N4681e17770
19307a48455F9338j5269e4989G4748j1335b64852J26974N6059A29981n163b04066
19295B67250o5151b21553A15539K1332F4834a62757K2212j82818g2155j3459H0330
19283D5016b87477E4738c54723a50288A40143a39484B71923m4054g2351B35051
19272h3802A06883a60124P7226A25648i4076A04968c09271P8994f8840B42978
$$ plain form
19261 36041 321298 -36238 -119677 -104637 -18214 -157702 -351154 -516986 102428 28790 -160227
19249 -55244 -97816 84267 -15351 80327 -65493 -687640 -118870 -208575 165085 177590 -199836
19237 -164632 -331269 -74844 605 228845 -85203 47872 -143848 94370 -202575 2673 -623341
19225 -153807 -159115 -254020 -55228 -21365 135920 -44527 99151 -68885 -235123 60876 61534 204012
19213 204012 123151 -162644 -363270 -75632 183592 -190278 -343169 -176246 -7130 40356
19202 -80982 -34921 -91353 -20523 17257 235089 -12644 -295141 51248 -155247 168550 -135765
19190 -45909 29901 71633 -95146 11209 -148014 -34050 -468845 118645 -172275 7243 -155724
19178 -103356 -22701 59520 157004 -64970 -59076 227271 -19137 -30073 254851 8498 -275 205012
$$ packed form
19261C6041K85257c6238q3439J5040a8214j39488j93452j65832A02428B8790a60227
19249e5244m2572H4267a5351H0327f5493o22147a18870q9705A65085J2505a99836
19237a64632j66637g4844F05K28240h5203D7872a43848I4370b02575B673f23341
19225a53807n308r4905e5228b1365A35920d4527I9151f8885j66238F0876O58J42478
19213B04012q0861a62644k00626g5632A83592a90278j52891J66923g130D0356
19202h0982c4921n6432b0523A7257K17832a2644k82497E1248a55247A68550a35765
19190d5909B9901M1732i5146A1209a48014c4050m34795A18645a72275G243a55724
19178a03356b2701E9520R7484f4970N894B27271a9137j0936B54851H498b75B05012
$$ plain form
19165 104721 -120647 267196 125739 118627 37129 24140 43230 -180351 -343365 55616 25095
19153 27196 -59136 -249722 -104481 -206360 321437 162606 -135848 -87784 -54686 -181280
19143 -181280 -173522 -40617 -288452 -183450 -186345 -141125 141070 -171070 -37615 -362930 24192
19131 126378 -137683 -330552 86196 -169453 -36992 -53734 34968 -9301 156512 -20103 133916
19119 -230545 20851 -292495 -308917 -175188 -118012 -236276 -34895 -360267 -417863 -131985
19108 -201773 130420 55391 230230 -15984 53869 -199031 -43276 -294975 -113059 -27182
19097 -126166 15174 161953 -354005 -45944 -77987 -236902 -271058 -128655 -171285 -88808 -5993
19085 231425 83393 245062 41116 175025 -151602 -246927 24626 193165 -271921 128775
$$ packed form
19165A04721a20647B67196A25739p112C7129j2989J9090a80351j63014E5616B5095
19153B7196e9136j90586a04481j01879C21437j58831a35848M8064L3098j26594
19143a81280P758d0617k47835J05002k895M5220A41070a71070c7615l25315B4192
19131A26378a37683j92869H6196a69453c6992j6742C4968i301A56512b0103A33916
19119b30545B0851b92495j6422J33729N7176j18264c4895l25372n7596a31985
19108b01773A30420E5391J74839a5984E3869a99031d3276k51699a13059b7182
19097a26166A5174J46779c54005d5944l2043j58915l4156a28655m2630Q2477e993
19085B31425H3393J61669D1116J33909a51602r5325B4626J68539b71921A28775
$$ plain form
19074 -326980 -63679 134949 -229013 -396115 -154270 -96998 190982 162622 -39965 42507
19063 43788 -78774 173309 -146145 79342 204507 184884 -185295 -243823 -32894 12584 -164944
19051 -207270 -63545 -286663 60547 19565 -108809 -71047 -132553 -42139 -124920 108604 -186967
19039 -218411 41051 142164 -311446 -69819 -405697 -230605 -90957 254601 -209657 126454
19028 -339662 -133162 -187821 -89507 -151232 303784 -101295 102750 -29051 59829 -97780 246682
19016 50815 -385183 -104472 -40266 178155 -114777 -145694 -180254 -44514 -258194 -120998
19005 -141781 87656 -367860 -188286 -117838 140690 -116323 -20602 231228 -63257 -216743
18995 -216743 -260850 172309 294319 -22178 -433144 150594 -27489 -142042 105056 -76668
$$ packed form
19074c26980f3679A34949b29013j67102a54270N7272A90982k8360c9965D2507
19063D3788g8774A73309a46145G9342J25165j9623a85295n8528c2894A2584a64944
19051b07270f3545k23118F0547A9565a08809L7762o1506d2139q2781A08604a86967
19039b18411D1051J01113c11446f9819l35878J75092i0957B54601b09657A26454
19028c39662a33162n4659h9507o1725C03784a01295A02750b9051E9829i7780B46682
19016E0815c85183a04472d0266A78155a14777l0917l4560d4514k13680a20998
19005a41781H7656c67860J79574P0448A40690a16323b0602B31228f3257j53486
18995b16743m4107A72309J22010b2178m10966A50594b7489j14553A05056g6668
$$ plain form
18984 297660 174870 -128348 -148431 -141323 70746 -9499 -24795 -103813 48230 -192378 271931
18972 -200864 58077 1399 -140074 135839 -254492 263882 -380728 198679 123467 -123093
18961 192388 525143 11121 22803 -75086 7144 -137980 -294085 80741 -160127 120635 84941
18950 84941 -207559 -104691 22628 -157731 -61502 185131 -198415 96781 299624 -755 137789
18938 -284317 -120438 -75520 -162032 -123641 -28330 159223 -335885 -257845 5501 251348 201162
18927 201162 41058 48927 -344409 -44317 345776 -170406 -291396 -73036 -183150 17198 -271183
18915 -16938 -227892 -138292 -64683 -187038 -40370 94566 -132136 -14848 -204887 -132364 66337
18903 29204 -196376 36167 101705 -144921 -4915 120660 133086 -399403 -36422 -291307 68565
$$ packed form
18984B97660j22790a28348k0083P108G0746i499j5296p9018D8230a92378B71931
18972b00864E8077A399a40074A35839b54492B63882c80728A98679p5212a23093
18961A92388L32755A1121J1682g5086G144a37980j56105H0741a60127A20635l5694
18950H4941b07559J02868B2628a57731f1502A85131a98415I6781K02843g55A37789
18938b84317a20438M4918q6512L8391b8330A59223c35885P8040E501K45847n0186
18927B01162D1058P869c44409d4317C45776a70406j20990g3036j10114A7198b71183
18915a6938k10954Q9600f4683j22355d0370I4566a32136a4848j90039P2523F6337
18903B9204a96376C6167O5538a44921d915A20660J2426c99403c6422k54885F8565
$$ plain form
18891 70615 327117 87424 -56632 -251589 -90729 -251635 17837 -179357 -517812 256268
18880 -93168 92036 17838 76740 58987 -142405 -59679 -198098 -163530 -207669 -191765 -122381
18869 -122381 85424 -316548 -262347 -93665 -128922 -120678 229075 -105757 68286 228356 -137124
18857 -241955 191259 168869 296031 -81106 -100963 -83073 25165 215138 201117 240432 -184229
18845 -281349 -91926 -372305 -221575 -87821 30906 55250 -66706 -34468 87062 -27636 -29500
18834 -29500 82734 86330 -164470 60062 -57175 -30066 -55023 -113511 -238337 -62551 201163
18822 -303289 -179827 -399573 207449 -113886 267688 -14602 142514 -94 -86304 28174 187419
18811 187419 249045 89875 -382485 45218 35320 8702 -162007 -281984 -43235 10786 11149 377777
$$ packed form
18891G0615K56502H7424e6632j94957i0729j60906A7837a79357l38455B56268
18880i3168I2036A7838N8902j7753a42405e9679j38419L4568m4139J5904O9384
18869a22381H5424c16548N4201i3665l5257Q244B29075a05757F8286J60070a37124
18857b41955A91259k2390J27162h1106j9857J7890B5165J89973j4021L9315a84229
18845b81349i1926k80379J50730h7821C0906K4344f6706L2238H7062b7636j864
18834b9500H2734L596a64470F0062e7175K7109k4957n8488j24826f2551B01163
18822c03289J23462k19746B07449a13886B67688a4602A42514i4q6210B8174J59245
18811A87419O1626H9875c82485D5218r898H702a62007j19977d3235A0786L63L66628
$$ plain form
18799 377777 -211618 -126355 -79017 213451 -17452 293047 -109946 -13298 52823 114057 -72373
18787 -155345 -3604 93105 252005 27025 212024 49943 -43361 52111 -319854 -191542 -254760
18776 -254760 -26969 84562 -293781 193199 351519 79771 21258 68353 -189042 119014
18765 120173 -63810 -427570 -199337 -38150 -185054 -207417 -251514 -348715 -462217 -273682
18755 -273682 74927 76430 -427042 -190136 32035 -56012 -276215 -319738 -141603 -130216 -66421
18744 -66421 15358 -244600 166494 60389 -51517 -101229 114170 136971 -103907 367546 -185439
18732 -10764 -243399 132323 61481 -424570 -369616 149728 -398865 -75319 -203514 106817
18721 -132068 -185386 227460 -3080 -319616 48049 -286235 -191568 184328 86762 88011 -379853
$$ packed form
18799C77777b11618Q5263M7338B13451a7452B93047a09946a3298E2823O1234g2373
18787a55345c604I3105J58900B7025J84999D9943d3361E2111c19854J28312o3218
18776b54760b6969H4562b93781A93199J58320G9771B1258M7095a89042A19014
18765A20173f3810l63760a99337c8150j46904k2363m4097r7201j13502J88535
18755b73682G4927J503d27042a90136C2035e6012k20203m3523a41603J1387O3795
18744f6421A5358b44600A66494F0389e1517m9712A14170K2801a03907C67546a85439
18732a0764k32635A32323F1481d24570N4954A49728c98865g5319j28195A06817
18721a32068n3318B27460c080l16536D8049b86235R4667A84328H6762J249c79853
$$ plain form
18709 29567 -209208 43224 -347960 -567962 -117674 16027 -118767 -196624 -316622 -37146
18698 268726 -200954 -56569 -52448 125113 -11455 245890 281175 248720 -21828 -19547 63061
18686 58435 2721 -138504 -132768 -78402 78920 -8276 -204836 -310246 -98969 30183 -347833
18674 112714 -88797 272711 -83053 -103435 6513 -203751 64269 39719 330808 -97289 55686
18662 155929 224077 88744 -230078 13066 181039 -77694 -40750 -195210 -267180 -331082 -109204
18650 -285766 92625 182836 111826 -160410 -456176 -80623 211275 -12884 -238382 -9874 -197051
18639 -197051 445 242812 12947 -278256 -27893 -41725 -223340 -132946 -130358 58919 -131995
18627 -197589 9988 -148158 -531440 87677 -354540 24307 -201106 -118202 -41325 -182867 297496
$$ packed form
18709B9567b09208D3224c47960k20002a17674A6027a18767p7857j19998c7146
18698B68726b00954e6569M121A25113a1455B45890L5285l2455b1828K281F3061
18686E8435B721a38504N736N4366G8920h276j96560j05410i8969C0183c47833
18674A12714h8797B72711h3053k0382F513b03751F4269k4550K91089i7289E5686
18662A55929O8148H8744b30078A3066J67973g7694L6944j54460p1970o3902a09204
18650b85766I2625R0211p1010a60410k95766h0623B11275a2884k25498i874j87177
18639a97051D45K42367A2947b78256b7893j3832j81615R0394K588E8919a31995
18627a97589I988a48158l83282H7677c54540B4307b01106Q2904d1325j41542B97496
$$ plain form
18615 -50021 -124128 -131700 117119 -50179 89041 228020 238098 -68531 229982 77872 141689
18604 141689 290379 74549 -208771 -451164 -160703 -94457 -29747 -368071 -76254 -27689
18593 -173783 -165128 -241284 228621 -17309 -200837 7089 82943 262740 -10204 29341 95640
18582 95640 79673 -74760 -209625 -64299 -195896 -234223 -140181 98682 -135706 -175511 28324
18570 52615 -238737 702 -58357 -152665 240685 -71286 -14042 -145957 82783 293555 -229643
18558 74739 167123 -115114 -104979 -208760 -528182 223844 17430 128210 -123531 244217
18547 -131504 -309724 -19403 -91239 262773 -31268 -20509 -230939 -67239 9950 24247 -242606
18535 264515 -16347 -85161 -88307 -287845 210594 109647 -158555 -95648 87636 -243777 -210575
$$ packed form
18615e0021p4107p572A17119e0179H9041J38979J0078f8531B29982G7872O3817
18604A41689J48690G4549b08771k42393a60703O6246b9747l38324g6254b7689
18593a73783Q655p6156B28621a7309j83528G089P5854J79797a0204B9341O6299
18582I5640j5967g4760j34865f4299j31597l8327R4042I8682a35706l9805B8324
18570E2615b38737G02e8357r4308B40685g1286a4042j31915H2783K10772b29643
18558G4739R2384a15114J0135j03781l19422B23844A7430J10780a23531B44217
18547a31504j78220a9403p1836B62773c1268J0759k10430f7239I950J4297b42606
18535B64515a6347o8814l146j99538B10594j00947a58555O2907H7636b43777L3202
$$ plain form
18524 -210575 1625 -15036 -315866 120699 -233237 105242 232706 -107206 -285294 -212453
18514 -212453 -12189 105647 57862 235761 -107478 -259010 125230 227191 156866 -39689
18503 69614 126444 -126287 185566 67627 -166945 34469 -247196 42950 97971 -72491 -165027
18492 -165027 -260756 238294 235896 292519 -372535 122585 -270364 -125985 -73833 -337503
18482 -337503 -175894 -101728 324197 -110666 -91194 27887 37826 246628 -71780 259755 -79624
18470 18627 267815 -63747 -247332 -194555 -89546 108883 120218 -301511 -156775 128751
18459 -137930 -234561 -94661 -349938 103478 -240798 -176811 143448 -88687 93999 -58740 -495860
18448 -495860 154563 -115801 78962 -399224 -231505 183857 -150814 -171588 311915 -17366
$$ packed form
18524b10575A625a5036l00830A20699b33237A05242J27464a07206j78088P2841
18514b12453a2189A05647m7785J77899a07478j51532A25230J01961p0325c9689
18503F9614N6830a26287A85566F7627a66945C4469b47196D2950N5021g2491r2536
18492a65027r5729B38294k398N6623c72535A22585b70364a25985N2152k63670
18482c37503J61609P4166C24197a10666J9472B7887R939K08802g1780B59755g9624
18470A8627K49188f3747j83585N2777h9546A08883J1335c01511J44736A28751
18459a37930r6631i4661k55277A03478b40798O3987A43448h8687I3999e8740m37120
18448d95860A54563a15801G8962c99224J67719A83857a50814k0774C11915a7366
$$ plain form
18437 44641 -81576 276792 63474 -121335 -99686 42418 30886 -171596 -251937 -211519 -25186
18425 50167 156747 -458438 142751 -135910 -230588 26926 138112 -222213 -86350 -39683
18414 27388 -260250 -276225 -324890 44796 -13191 -42775 -21920 -76678 153794 -301951 -407939
18403 -407939 -249355 96616 -166269 -141845 -41534 -13948 75149 193527 321400 -120661
18392 -252464 -14061 136559 33705 82703 -176826 23499 -143815 22722 130144 -398202
18381 -114011 83066 38819 -139096 169752 30982 -102267 -189021 -76857 -182406 308046
18370 38977 -314867 49678 44624 99611 230909 109848 263261 -275312 95981 74294 -15301
18358 208074 186742 -6356 -41533 -248277 92250 461435 -181153 -305062 22913 127780 -106870
$$ packed form
18437D4641h1576B76792F3474a21335K1649D2418j1532a71596q0341M0418b5186
18425E0167J06580d58438A42751a35910r4678B6926J11186b22213h6350c9683
18414B7388b60250j5975m8665D4796a3191k9584K0855n4758A53794c01951j05988
18403d07939J58584I6616a66269K4424d1534a3948G5149J18378J27873a20661
18392b52464a4061A36559C3705M8998a76826B3499a43815B2722J07422c98202
18381a14011H3066C8819a39096A69752C0982a02267q6754g6857j05549C08046
18370C8977c14867D9678n054N4987J31298A09848J53413b75312I5981k1687a5301
18358B08074k1332f356l5177k06744I2250L69185a81153j23909B2913J04867a06870
$$ plain form
18346 -144671 -43775 1045 8537 -78038 -154499 -224475 -96891 12930 87693 126009 -56355 -144833
18334 -144833 243958 -109651 -165049 -71372 -152525 84576 -236336 -47340 49707 59932 -58898
18322 -132743 114044 -36101 33101 -94222 287217 104814 -105745 -267500 -245336 28215
18311 -338130 18597 77241 -199924 277186 -542687 -67282 -122944 8885 297591 -7014 -128256
18300 -128256 -222001 -134877 -365932 -139189 -138544 1522 44032 130006 10311 86352 94 94277
18288 94277 39197 150508 -223956 78076 -167732 -116355 -164465 226711 -3605 -83025 59718
18276 -68858 113461 123325 50148 -205413 67669 109361 -308898 -11493 -139050 -131561 -11592
18264 -269075 -390510 34958 67334 -71633 -176053 112837 -18850 142611 -22976 65210 80970
$$ packed form
18346a44671d3775A045P492g8038p6461o9976i6891A2930P4763L8316e6355q8478
18334a44833B43958a09651n5398g1372q1153H4576b36336d7340D9707J0225e8898
18322a32743A14044c6101C3101i4222B87217A04814a05745j61755K2164B8215
18311c38130A8597N8644a99924B77186e42687f7282n5662H885K88706g014j21242
18300a28256r3745Q7124k31055a39189O45A522M2510Q5974A0311P6041I4R4183
18288I4277C9197J11311b23956G8076a67732N1377m8110B26711c605p9420E9718
18276f8858A13461R864E0148b05413F7669M1692c08898a1493j27557P489a1592
18264b69075j21435C4958L2376g1633j04420A12837a8850A42611b2976F5210J5760
$$ plain form
18253 80970 -3066 47600 -267207 30423 56243 -359254 -89391 -376179 297732 -140439 -11330
18241 -183803 -54862 -273842 8612 -78158 -41654 -31825 31652 73098 85670 -235068 105072
18229 67601 140389 -180388 -105460 20635 42228 165644 -67859 -118815 212816 144061 123423
18218 123423 206460 -127452 52101 -44100 -39404 85557 -70795 -7994 -177153 140628 -188079
18206 29728 -234792 -35664 223422 -106835 -251725 -94033 -35165 -139105 93250 -90638 170529
18194 -106248 94067 -128561 144826 54253 -4748 101571 -138894 97079 203881 -226915
18183 -42215 28222 -137044 60678 88046 -273096 -66506 131511 -198360 18394 -201128 -281076
18172 -281076 186925 352865 -62150 23697 -256990 295016 -13398 -81388 -198564 -163518
$$ packed form
18253H0970c066D7600b67207C0423K5820c59254h9391k86788B97732a40439a1330
18241a83803e4862k18980H612g8158L6504R829C1652M1446J2572b35068A05072
18229F7601P2788a80388P4928B0635K1593J23416f7859n0956B12816o8755k0638
18218A23423Q3037a27452E2101d4100M696H5557g0795g994j69159A40628a88079
18206B9728b34792c5664B23422a06835j44890i4033c5165j03940I3250i0638A70529
18194a06248I4067a28561A44826E4253d748A01571a38894I7079J06802b26915
18183d2215B8222a37044F0678K7368b73096f6506A31511a98360A8394b01128p9948
18172b81076A86925J65940f2150B3697b56990B95016a3398o7990j17176L5046
$$ plain form
18162 -163518 192937 -147269 -72118 -192866 124969 -120160 -234256 -464112 -76022 -74511
18152 -74511 290324 -243015 361856 48862 -9175 128652 129229 110582 -2330 -83220 189007
18140 56720 -489036 -135976 -136861 -213819 -149817 -236886 21472 -207454 62042 43139 -257689
18128 179597 -364684 -373718 -15380 -100875 -2291 -277930 102943 290073 128492 -85076 138098
18116 230904 218716 121123 -478360 342515 -166898 113986 -105549 94644 -9096 -48662 5048
18104 -119732 -27618 -117831 79036 101298 239842 18748 -185338 -68492 162360 -327466 -41350
18092 55077 132640 -51559 -136323 -295627 29274 130692 98274 100006 -188869 151156 -49069
18080 63622 -31009 133710 96889 -263786 -102973 175745 -189205 -104215 -49557 15074 -170680
$$ packed form
18162a63518A92937a47269g2118j20748A24969a20160j14096k29856g6022J511
18152g4511B90324b43015C61856D8862i175A28652N77j8647b330q0890A89007
18140E6720d89036a35976q85p6958O4002q7069B1472b07454F2042j8903b57689
18128A79597c64684r034a5380q5495b291k75639A02943J87130A28492h5076A38098
18116B30904j2188r7593d78360C42515a66898A13986a05549I4644i096l9566E048
18104a19732b7618r0213G9036K2262J38544A8748a85338f8492A62360c27466d1350
18092E5077P7563e1559q4764j59304B9274J01418l2418J732a88869A51156d9069
18080F3622c1009A33710l6821b63786a02973A75745a89205Q4990d9557A5074a70680
$$ plain form
18068 -194225 -45644 -63100 -48481 59173 108972 -157289 16849 -99531 3463 147953 -183017
18056 -258841 -45521 -89451 -25963 23917 312739 45012 19421 -58418 74760 31058 181888
18045 181888 106423 -132297 117885 -442741 -13987 -30156 234400 187468 99847 -321563
18034 -133035 371663 4469 -94202 45260 -42310 -263863 62831 -400128 53753 591224 -362824
18022 -195726 -149755 36094 -22476 104611 -192215 -19311 55598 -12356 -129285 -203040 107572
18010 -120917 -41195 7887 -299278 -222155 84225 139881 41907 -63701 -25953 -25632 200677 -387813
17997 -143798 -110151 -5120 -56224 -167145 150298 -241290 -325795 94110 -14210 111069 -38619
17985 -176136 87275 134513 224865 320352 -197644 199653 213842 -483020 -101061 117738
$$ packed form
18068a94225d5644j7456J4619E9173M9799a57289A6849i9531C463J44490a83017
18056b58841d5521m3930b5963B3917K88822D5012A9421e8418G4760C1058J50830
18045A81888p5465a32297A17885d42741a3987j6169B34400m6932q7621c21563
18034a33035C71663D469i4202D5260d2310k21553F2831d00128E3753N37471c62824
18022a95726M5971C6094b2476A04611a92215a9311E5598a2356j16929p3755A07572
18010a20917d1195G887b99278P7123H4225N5656D1907f3701b5953L21B00677c87813
17997a43798L3647e120n1104j10921A50298b41290q4505I4110a4210A11069c8619
17985a76136H7275M7238R0352R5487a97644A99653J4189d83020a01061A17738
$$ plain form
17974 -27686 -245441 121270 25357 -43179 -32816 -2960 -247700 70997 168790 168845 -111028 139972
17961 96013 -147436 -237450 154811 36178 -46924 -113779 187180 77290 -129200 24929 -79156
17949 20077 133401 -38452 -85934 74760 36450 -9510 -52495 -17133 -35947 -91232 452575
17937 -99182 -35157 -46084 -58184 -8699 -26831 16868 -78938 264964 -188903 -88373 33265
17925 200954 -149067 -27345 -4452 -138948 -110020 -126129 -168310 91472 112773 -566894 148358
17913 99769 84251 335232 -60599 -137001 185972 159448 52739 34755 -138857 228560 -141580
17901 -382865 -36289 -49215 -125358 -23462 -28056 -382529 -133743 297573 415247 98096 201381
17890 201381 -9895 -154650 -264074 341656 -100949 -77468 -66913 -157168 -37385 -53819 433839
$$ packed form
17974b7686k17755A21270B5357d3179J0363b960k44740G0997R7793N5a11028A39972
17961I6013a47436r0014A54811C6178d6924o6855A87180G7290a29200B4929g9156
17949B0077J13324c8452m7482G4760C6450i510m2985a7133j8814n5285D52575
17937i9182c5157j0927j2100h699j8132A6868g8938B64964a88903h8373C3265
17925B00954a49067b7345d452j34496K8928j6109m2181I1472K1301e66894A48358
17913I9769j5518K50981f0599p6402A85972k6524E2739j7984a38857B28560a41580
17901c82865c6289j2926p6143b3462m594l54473a33743B97573J17674I8096J03285
17890B01381i895j44755j09424C41656a00949K3481J0555r0255c7385j6434D33839
$$ plain form
17878 5917 43407 -92203 215744 -45925 158378 -44297 -234101 -365967 -257034 118787 78491
17867 78491 122380 -116458 -145609 -105540 49891 62663 29452 -69400 137630 37572 -138739
17855 187681 69492 -134133 87879 169653 -63088 -221830 -12304 -120414 -135793 -263588 -98758
17843 39153 174430 -136900 112740 -459180 250343 -144361 -241440 -120112 19167 240426
17833 240426 -84158 220256 297326 429263 -249582 -54106 62707 113298 8829 145135 21999
17821 -169514 146266 -2566 58531 -344556 383226 47020 -150532 104184 144132 -244201
17810 13879 -396762 -58325 82237 144808 -197959 -88239 -66076 -12098 11731 -71981 -40613
17799 -40613 297329 -471063 77842 -103685 223055 37259 9521 1537 -18185 7835 -85803
$$ packed form
17878E917L7490i2203B15744d5925A58378d4297j89804j31866J08933A18787m0296
17867G8491M3889a16458k9151M0069D9891J2772B9452f9400A37630C7572a38739
17855A87681F9492a34133H7879Q1774f3088j58742a2304j08110j5379j27795i8758
17843C9153J35277a36900A12740d59180B50343a44361r7079a20112A9167K21259
17833B40426h4158B20256P7070J31937b49582e4106F2707N0591H829J36306B1999
17821a69514A46266b566E8531c44556C83226D7020a50532A04184L9948b44201
17810A3879c96762e8325H2237O2571a97959h8239K2163a2098A1731g1981L1368
17799d0613B97329d71063G7842a03685B23055C7259I521A537a8185G835h5803
$$ plain form
17787 233688 -365256 82305 164351 -369357 6587 100289 -25151 313715 79808 -236944 51176
17775 -176094 -187707 -121199 18235 170856 101993 255917 29297 -15267 120801 6166 137500
17764 137500 84295 -56665 -5231 19787 -89228 174968 246947 -105149 -112451 20561 184070
17753 184070 316677 -226990 120419 110663 -76049 -258304 -143072 -80871 -34089 -225069
17743 -225069 90317 -200447 41594 -18869 209165 -239870 -138429 -138454 -190626 -30072 -79640
17732 -79640 -11198 -327931 232352 24665 -74117 14171 -17619 -363915 87407 -39185 76207
17720 81843 16898 -16655 -41495 -202533 -30078 148947 -81684 55117 57065 50237 -131218
17708 328340 255383 9387 55618 -127350 255303 -73749 265766 -58455 45199 -243438 -36886
$$ packed form
17787B33688c65256H2305Q2046c69357F587R3702b5151C13715G9808b36944E1176
17775a76094j1613O6508A8235J52621o8863J53924B9297a5267A20801F166J31334
17764A37500n3205e6665e231A9787h9228A74968P1979a05149p302B0561J63509
17753A84070J32607b26990A20419r756g6049j82255J15232O2201c4089j90980
17743b25069I0317b00447D1594a8869B09165b39870J01441k5n2172c0072m9568
17732g9640a1198l16733B32352B4665g4117A4171a7619l46296H7407c9185G6207
17720H1843A6898a6655k4840j61038c0078A48947h1684E5117J948o828a31218
17708C28340p2957I387M6231a27350B55303g3749B65766e8455D5199b43438c6886
$$ plain form
17696 49230 -20148 157351 94373 55740 63744 204017 -36068 428730 155543 55001 62239
17685 62239 221594 383664 -29201 -204666 95975 172747 236601 164735 -78544 103105 14970
17673 78686 -236500 45074 79079 -73061 20169 -3903 152446 -50476 -383455 -96233 41828
17661 -82824 103070 -262136 -2609 250312 -226936 30355 53927 28476 -152961 105974 36791
17649 -23383 77749 60793 -227325 159212 -39737 11817 -251709 -152197 29313 -68736 261771
17637 -8519 103229 -147655 156736 -48572 123006 103101 166420 -177908 -163183 -205067 184593
17625 -177339 -74725 -166099 -115450 228559 156496 -50299 -106131 136586 -312833 -5068 -222999
17614 -222999 142743 -17588 7679 -156974 152099 -33410 -84755 -80420 216895 -20290 118622
$$ packed form
17696D9230b0148A57351o2978l8633Q004J40273c6068D28730A55543E5001P238
17685F2239J59355J62070b9201j75465I5975P6772O3854p1866g8544A03105A4970
17673G8686b36500D5074L4005g3061B0169c903A52446e0476l32979i6233D1828
17661h2824A03070b62136b609B50312b26936C0355K3572k5451a52961A05974C6791
17649b3383G7749j6956b27325A59212c9737A1817b51709R9512B9313f8736B61771
17637h519A03229a47655A56736d8572A23006j9905O3319a77908J4725m1884A84593
17625a77339g4725r1374N0649B28559p2063e0299n5832A36586c12833e068k17931
17614b22999A42743a7588G679a56974A52099c3410n1345M335B16895b0290A18622
$$ plain form
17602 -270724 -21049 112170 339522 -184941 27330 38564 44989 -98714 234012 -50914 45701
17590 -52932 221504 -190393 -2148 143822 -114308 133882 -29599 -66561 -173351 -23231 -97450
17579 -97450 -208226 34768 112354 37805 -26841 -308468 320811 102683 98633 -42682 13396
17567 -208991 75234 -148995 -73041 -10998 286283 104775 229 9882 132932 1135 -63734
17555 -125672 -73761 294918 -69421 104467 140345 135329 -6252 -127010 247491 -28358 50087
17543 -34355 -88451 -11223 183470 19708 107810 414026 -30439 51367 -72554 243806 -13535
17531 -35536 171552 -117969 99308 211543 -23025 -152330 299125 -12124 353405 20944
17520 184127 -180129 332774 -26926 197603 -27842 -218609 372297 -76050 67587 225046
$$ packed form
17602b70724b1049A12170K27352a84941B7330J1234O425i8714B34012e0914D5701
17590e2932B21504a90393b148A43822a14308A33882b9599l6962j06790b3231p4219
17579i7450j10776C4768P7586C7805b6841k81627C20811A02683m050d2682A3396
17567b08991G5234a48995g3041a0998B86283A04775B29R653J23050A135f3734
17555a25672N1911B94918f9421A04467L5878n016f252j20758B47491b8358E0087
17543c4355n4096a1223A83470A9708Q8102L06216c0439E1367g2554B43806a3535
17531c5536A71552a17969I9308J12235b3025j29305B99125a2124C53405B0944
17520A84127a80129C32774b6926A97603b7842j90767C72297g6050F7587J57459
$$ plain form
17510 225046 -70060 158357 271200 -99830 240985 -17098 -78887 -228875 350394 142820
17499 478304 204104 210798 -3486 79941 -20638 229743 284813 213938 84326 253400 255368
17488 255368 -44066 187751 -80783 -343720 -13169 -79832 2180 31239 179546 67843 348727
17477 348727 -38149 296153 354512 318086 106077 -44446 324055 144949 482458 -34111
17466 280866 210406 114880 -28869 271420 191165 115952 -134454 19109 211101 196860 372542
17455 372542 244009 63972 456175 -153465 124300 52838 324608 435390 -83014 213824
17444 176806 156546 419633 652320 56314 45394 346844 484017 280773 -63017 100099
17433 33622 498314 -19603 358649 388661 442435 382481 173863 254590 525238 593190 279914
$$ packed form
17510B25046g0060A58357J12843i9830B40985a7098o1789j49988C50394A42820
17499D78304B04104O694c486G9941b0638B29743N5070p0875H4326J69074J968
17488B55368d4066A87751h0783k62937a3169o6663B180K9059J48307F7843K80884
17477C48727c8149B96153N8359l6426A06077d4446C24055A44949L37509c4111
17466B80866p0460r5526b8869B71420q0255p5213a34454A9109J91992j4241J75682
17455C72542j28533F3972L92203a53465A24300E2838K71770J10782h3014B13824
17444A76806k0260K63087K32687E6314j0920L01450J37173k03244f3017A00099
17433C3622M64692a9603C58649L0012N3774n9954A73863Q0727K70648O7952B79914
$$ plain form
17421 223383 301339 284438 191049 286245 131660 478683 404240 128651 292678 63158 154700
17410 154700 42856 169170 352564 377941 351502 -2684 271103 -149875 174928 180219 157156
17399 157156 257301 228598 41113 295210 221942 -102689 44251 -123926 78419 -170687
17388 -126875 395035 29268 119579 23685 120077 -6651 219302 188 63437 -144283 239594
17376 70705 93030 131318 161999 169226 125515 248263 335726 183108 414451 -71418 190043
17364 194879 106876 183432 41190 162480 384341 2086 46819 -263633 -69792 91496 -89259
17352 145859 518209 172514 433617 460062 229184 274608 137060 245720 105234 117850
17342 117850 145383 218975 93029 388252 -109261 48163 34086 160454 131974 236822 236812
$$ packed form
17421B23383P7956j6901r3389R5196A31660L47023p4443A28651J64027F3158R1542
17410A54700D2856J26314J83394K5377k6439b684B71103a49875A74928N291k3063
17399A57156J00145k8703D1113K54097p3268a02689D4251a23926G8419a70687
17388a26875C95035B9268R0311B3685R6392f651B19302A88O3249a44283B39594
17376G0705K2325L8288L0681P227m3711J22748Q7463j52618K31343g1418A90043
17364A94879q8003P6556D1190J21290K21861B086M4733b63633f9792I1496h9259
17352A45859L72350A72514K61103K6445B29184M5424A37060J08660A05234J2616
17342A17850K7533P3592I3029K95223a09261D8163j4077J26368k8480J04848j0
$$ plain form
17331 236812 36976 186517 112258 312336 -77651 185186 50691 -79907 257552 150325
17321 150325 28520 -49769 62597 57234 386898 -19868 280279 402225 291704 307589 154292
17310 154292 368154 22170 -825 58498 192934 391605 158964 -107691 194528 -25946 -76721
17299 -76721 11195 407183 187581 16335 148385 256454 189938 -30890 300127 -90336 174459
17287 -66666 -148639 306775 -182989 149957 258019 360483 254106 207707 13945 127227
17277 127227 36113 291489 119425 271931 280145 283452 328795 111242 94232 -44813 318335
17265 246888 275243 118063 361598 273862 61059 344997 450396 7418 141898 325247
17255 325247 307907 129203 107082 -181987 74954 246836 203284 270251 -93325 239396 -119343
$$ packed form
17331B36812C6976J49541p4259K00078g7651A85186E0691g9907B57552j07227
17321A50325B8520d9769F2597n363L29664a9868B80279J21946j10521J5885j53297
17310A54292K13862B2170h25E8498J34436J98671A58964a07691A94528b5946n0775
17299g6721A1195L95988A87581A6335J32050J08069o6516c0890C00127i0336A74459
17287f6666q1973C06775a82989A49957J08062J02464j06377m6399A3945J13282
17277A27227C6113K55376A19425J52506Q214L307M5343A11242j7010d4813C18335
17265B46888K8355A18063K43535q7736F1059K83938J05399G418J34480J83349
17255C25247j7340A29203k2121a81987G4954J71882m3552O6967i3325B39396a19343
$$ plain form
17243 91239 231136 120026 543016 139568 163716 161531 125697 110408 355664 60000 170697
17232 170697 98201 168574 216569 326013 461905 179550 303489 42749 110433 260549
17222 260549 -41060 310873 334117 567864 209049 244231 524034 309722 192805 186718
17212 186718 373753 76123 410263 305580 422260 152630 -234337 408985 391610 199082
17202 199082 38706 -42723 233001 113692 720 322269 240467 379574 60299 271769 245820
17191 245820 240882 123354 461933 308579 120867 71314 273141 117165 275924 213330
17181 213330 -129008 358727 250721 500782 348574 456859 282949 471169 400692 490229
17171 490229 609590 284674 80469 69695 380309 135044 309833 242605 360205 401696
$$ packed form
17243I1239J39897j11110M22990A39568K4148k185l5834j5289K45256F0000J10697
17232A70697p2496P0373M7995J09444J35892A79550J23939D2749O7684J50116
17222B60549d1060C10873K3244K33747B09049L5182K79803k14312j16917o087
17212A86718J87035G6123L34140j04683J16680A52630b34337D08985j7375j92528
17202A99082C8706d2723B33001A13692G20L21549q1802J39107F0299K11470k5949
17191B45820m938j17528L38579j53354A20867m9553K01827A17165J58759o2594
17181B13330a29008C58727j08006K50061j52208J08285j73910J88220p0477Q9537
17171D90229J19361B84674H0469j0774L10614A35044J74789o7228J17600M1491
$$ plain form
17161 401696 390320 329525 357174 279296 -105385 499824 346678 330447 264141 150378 484232
17150 484232 540965 122041 460380 265061 191686 277023 352284 25319 394740 458558 382166
17139 382166 296952 472279 206587 618257 353278 400158 268861 389673 244465 225864
17129 225864 471424 321853 293890 384580 378788 554596 267015 572074 147226 33767
17118 234678 740878 289699 455591 248009 597034 299529 380728 525901 438566 242320
17108 242320 492797 243325 107815 271387 778868 353076 269322 527100 384456 427896
17098 427896 244896 507542 652925 430251 95375 697750 247725 275041 497423 553246
17088 553246 355278 -8585 455924 473601 381809 357368 494057 301105 590610 351088
$$ packed form
17161D01696j1376o0795K7649p7878a05385D99824j53146j6231o6306j13763L33854
17150D84232N6733A22041L38339j95319p3375Q5337P5261B5319L69421O3818p6392
17139C82166q5214J75327B06587M11670k64979M6880j31297J20812j45208j8601
17129B25864K45560j49571k7963R0690n792J75808B67015L05059A47226C3767
17118B34678N06200B89699J65892k07582L49025k97505Q1199J45173q7335j96246
17108B42320K50477B43325A07815J63572N07481C53076q3754K57778j42644M3440
17098D27896j83000K62646J45383k22674I5375O02375B47725K7316K22382N5823
17088E53246j97968h585D55924J7677r1792k4441J36689j92952K89505k39522
$$ plain form
17078 351088 652619 373626 598856 583275 403945 400779 417732 299422 654869 460040
17068 460040 585985 771964 604136 406588 522215 433473 293546 554631 381107 533251
17058 533251 491508 489978 537334 559037 211500 431729 583203 421251 767420 587619
17048 587619 625386 728739 581907 468217 492736 286644 812172 885666 511201 660199
17038 660199 499154 480103 680037 538417 612591 523318 362377 474810 497045 827415
17028 827415 514190 900284 838560 939193 457557 427922 564498 369896 287067 665102
17018 665102 828320 573889 607888 514210 659289 609536 456161 437095 505479 723008
17008 723008 426623 626055 733219 827577 735394 784656 414955 565318 655074 736458
$$ packed form
17078C51088L01531k78993K25230j5581j79330l166J6953j18310L55447j94829
17068D60040J25945J85979j67828j97548J15627q8742j39927K61085j73524J52144
17058E33251m1743j530M7356K1703B11500K20229J51474j61952L46169j79801
17048E87619L7767J03353j46832j13690K4519k06092N25528P3494l74465J48998
17038F60199j61045j9051J99934j41620P4174q9273j60941J12433K2235L30370
17028H27415l13225L86094o1724J00633D57557k9635J36576j94602q2829L78035
17018F65102J63218k54431L3999r3678J45079m9753j53375j9066O8384K17529
17008G23008k96385J99432J07164R4358r2183M9262l69701J50363Q9756Q1384
$$ plain form
16998 736458 533107 651465 738577 997662 749939 821333 1040046 1064737 816184 687400
16988 687400 870264 852265 1107758 732103 857645 961717 530513 716358 776253 635363
16978 635363 864592 916288 739537 720112 876966 985533 723293 882742 918329 1147607
16968 1147607 1114395 1135987 741654 1116696 869171 1022118 766660 765429 775541 802908
16958 802908 717861 938551 1070898 1091602 1064216 954334 1106546 783785 1302216 964750
16948 964750 952695 1389798 1188249 1110308 1543264 1163325 1336793 923765 1193209 936954
16938 936954 1193966 1190605 1219522 1609921 1081384 1060819 1223598 1390816 1322485 1489227
16928 1489227 1250682 1591046 1475069 1449443 1348490 1332777 1651938 1346230 1387702 1344545
$$ packed form
16998G36458k03351J18358Q7112K59085k47723P1394K18713K4691k48553j28784
16988F87400J82864j7999K55493l75655J25542J04072m31204J85845N9895j40890
16978F35363K29229N1696j76751j9425J56854J08567k62240J59449L5587K29278
16968A147607l3212K1592l94333L75042k47525J52947k55458j231J0112K7367
16958H02908q5047K20690J32347K0704k7386j09882J52212l22761N18431l37466
16948I64750j2055M37103k01549p7941M32956l79939J73468m13028K69444k56255
16938I36954K57012l361K8917L90399n28537k0565J62779J67218o8331J66742
16928A489227k38545L40364j15977k5626j00953j5713L19161l05708M1472m3157
$$ plain form
16918 1344545 1593917 1798879 1548408 1668232 1255158 1481544 1432380 1735242 1616830 1648694
16908 1648694 1820084 1545074 1611979 1659929 1985352 1510542 1768975 2080337 1660632 1937387
16898 1937387 1513116 1563970 1881702 1964520 1968032 1981443 2105776 1610901 2283666 1767167
16888 1767167 2186914 2095338 1965676 2231888 1898734 2310690 2138975 2164032 2055889 2246828
16878 2246828 2230651 2393041 2483227 2642436 2499761 2692658 2404039 2748382 2522031 2553455
16868 2553455 2973777 2790451 2790754 2920786 3165936 2948971 3098193 2799540 3154895 3119267
16858 3119267 2879787 2898577 2703901 3204726 3303902 3128712 3452390 3166316 3544108 3636599
16848 3636599 3741297 3484506 3659083 3956459 3728076 3765541 3719931 3962876 4281758 4085725
$$ packed form
16918A344545K49372K04962k50471J19824m13074K26386m9164L02862j18412L1864
16908A648694J71390k75010O6905M7950L25423m74810K58433L11362m19705K76755
16898A937387m24271N0854L17732Q2818L512J3411J24333m94875O72765n16499
16888A767167M19747r1576j29662K66212l33154M11956j71715K5057j08143J90939
16878B246828j6177J62390R0186J59209j42675J92897k88619L44343k26351L1424
16868B553455M20322j83326L03J30032K45150k16965J49222k98653L55355l5628
16858C119267k39480J8790j94676N00825R9176j75190L23678k86074L77792R2491
16848C636599J04698k56791J74577K97376k28383L7465m5610K42945L18882j96033
$$ plain form
16838 4085725 4260098 4197926 4490252 4134344 4461887 4851277 4831370 5185574 4873646 5015304
16828 5015304 5038699 5335545 5289697 5208181 5484358 5973027 5697209 5643487 5953419 6266489
16818 6266489 6079136 6160064 6057294 6629213 6574500 6509246 6934312 7052178 7198895 7185342
16808 7185342 7474047 7696013 7785246 7601019 8093885 8274155 8395990 8693806 8735803 9214476
16798 9214476 9712912 9557024 9923354 10232504 10128284 11024864 11040803 11698979 11267486 11815252
16788 11815252 12241526 12481575 12688030 13389237 13474644 14275752 14622108 14918226 15358141
16779 15358141 15534998 16257469 17085245 17751787 18081229 19079143 19452576 20142949 20642627
16770 20642627 21366001 22376462 23280755 24030997 24513933 25922659 26449919 27814232 28633300
$$ packed form
16838D085725J74373o2172K92326l55908L27543L89390j9907L54204l11928J41658
16828E015304K3395K96846m5848q1516K76177M88669k75818n3722L09932L13070
16818F266489j87353Q0928j02770N71919n4713o5254M25066J17866J46717j3553
16808G185342K88705K21966Q9233j84227M92866J80270J21835K97816M1997M78673
16798I214476M98436j55888L66330L09150j04220Q96580J5939O58176m31493N47766
16788A1815252M26274K40049K06455P01207Q5407Q01108L46356K96118M39915
16779A5358141J76857P22471Q27776O66542L29442R97914L73433O90373M99678
16770B0642627P23374J010461R04293P50242M82936J408726N27260J364313Q19068
$$ plain form
16761 28633300 30256045 31533173 32780217 34159352 35411991 37409051 38610075 40494779
16753 40494779 42616348 44445866 46591282 49224085 51494092 53996755 57079647 59964697
16745 59964697 63449941 66400962 70152829 73861719 77943435 82464066 87223150 92160887
16737 92160887 97129626 103008346 108415542 114735666 120926377 127455347 134012926 140685781
16729 140685781 147366535 153894558 160000655 165947151 171440742 176033368 180040824 183193945
16721 183193945 184950090 185856211 185477412 184299503 181936196 178583132 174442507 168963056
16713 168963056 163581622 157231270 150872041 144345650 137446710 130440321 123867365 117465259
16705 117465259 111035869 104914445 99172607 93667456 88575566 83531565 78881666 74928301
$$ packed form
16761B8633300J622745J277128J247044J379135J252639J997060J201024J884704
16753D0494779K121569J829518K145416K632803K270007K502663L082892K885050
16745E9964697L485244K951021L751867L708890M081716M520631M759084M937737
16737I2160887M968739N878720N407196O320124O190711O528970O557579O672855
16729A40685781O680754O528023O106097N946496N493591M592626M007456L153121
16721A83193945J756145R06121l78799j177909k363307l353064m140625n479451
16713A68963056n381434o350352o359229o526391o898940p006389o572956o402106
16705A17465259o429390o121424n741838n505151n091890n044001m649899l953365
$$ plain form
16697 74928301 70733737 66895747 63102470 59973015 56617775 53850590 51074480 48663682
16689 48663682 46081208 43977228 41843597 40168956 38050400 36393533 34682064 33218805
16681 33218805 31841528 30478868 29021778 27858242 27211478 25780029 24667144 23801618
16673 23801618 23056040 22220069 21419608 20537796 19718154 18886623 18274916 17853967 17443006
16664 17443006 16519039 16103136 15728110 15255132 14280894 14217834 13746105 13287377 13228872 12717299
16654 12717299 12378799 12048852 11458621 11123364 10814891 10761001 10486557 9937514 10107964
16645 10107964 9653583 9262675 9320949 8915257 8786298 8461186 8050608 7944093 8218444
16636 8218444 7494594 7473584 7015155 7423139 6726556 7058237 6511801 6318787 6246795 6566380
$$ packed form
16697G4928301m194564l837990l793277l129455l355240k767185k776110k410798
16689D8663682k582474k103980k133631j674641k118556j656867j711469j463259
16681C3218805j377277j362660j457090j163536o46764j431449j112885q65526
16673B3801618p45578q35971q00461q81812q19642q31531o11707m20949m10961
16664A7443006r23967m15903l75026m72978r74238o3060m71729m58728n8505n11573
16654A2717299l38500l29947n90231l35257l08473n3890k74444n49043J70450
16645A0107964m54381l90908N8274m05692j28959l25112m10578j06515K74351
16636H218444p23850k1010m58429M07984o96583L31681n46436j93014p1992L19585
$$ plain form
16626 6566380 6243207 6279606 5578088 5717876 5585924 5401118 5248442 5158647 4909438 4735580
16616 4735580 5152468 4885204 4804966 4747773 4748727 4646924 4629749 4261131 4185175 4555283 4679133
16605 4679133 4056270 4046025 3893240 4145098 3905904 3812279 3583837 3632404 3434189 3549067
16595 3549067 3542347 3146927 3328283 3246759 3432246 3027260 3506743 2886157 2854153 2938956
16585 2938956 3008029 2981211 2762056 2815569 2831023 2831173 2823728 2775880 2569337 2463182 2586061
16574 2586061 2350232 2816182 2267570 2306679 2262770 2116361 2307358 2169075 2120348 1983193
16564 1983193 2421918 2088154 1810408 2289275 2036644 2136070 1957457 1849428 2074644 1658191
16554 1658191 1955700 1977689 1679443 1785493 2112521 1929608 1844873 1643108 1512343 1646596
$$ packed form
16626F566380l23173L6399p01518J39788j31952j84806j52676q9795k49209j73858
16616D735580M16888k67264q0238n7193R54j01803j7175l68618p5956L70108J23850
16605D679133o22863j0245j52785K51858k39194r3625k28442M8567j98215J14878
16595C549067o720l95420J81356q1524J85487m04986M79483o20586l2004Q4803
16585B938956O9073k6818k19155N3513J5454J50p445m7848k06543j06155J22879
16574B586061k35829M65950n48612L9109m3909j46409J90997j38283m8727j37155
16564A983193M38725l33764k77746M78867k52631R9426j78613j08029K25216m16453
16554A658191K97509K1989k98246J06050L27028j82913q4735k01765j30765J34253
$$ plain form
16544 1646596 1927915 1783514 1602760 1625421 1768461 1383917 1559698 1533001 1500133 1399017
16534 1399017 1252543 1200190 1617516 1411385 1753180 1487277 1651536 1521496 1327068 1281588
16524 1281588 1401177 1264563 1313888 1294603 1305997 1302012 1173105 1320250 1399872 1277431
16514 1277431 922026 1436925 1363318 1190963 1178709 1228327 1283832 1466299 1015560 839183
16504 839183 1256992 1390548 1208629 1031193 1336158 1189178 1204787 918871 945198 956278
16494 956278 1029415 971496 1199298 1031802 813595 1125590 1201068 1045366 746374 635512
16484 635512 1005054 978686 809924 1006974 592342 1000772 952202 804217 481374 504543
16474 504543 1174571 883309 528692 410509 841572 503852 1213285 539072 778280 767699
$$ packed form
16544A646596K81319j44401j80754K2661J43040l84544J75781k6697l2868j01116
16534A399017j46474n2353M17326k06131L41795k65903J64259j30040j94428m5480
16524A281588J19589j36614M9325j9285J1394l985j28907J47145P9622j22441
16514A277431l55405N14899p3607j72355j2254M9618N5505J82467m50739j76377
16504H39183M17809J33556j81919j77436L04965j46980J5609k85916K6327J1080
16494I56278P3137n7919K27802j67496k18207L11995P5478j55702k98992j10862
16484F35512L69542k6368j68762J97050m14632M08430m8570j47985l22843K3169
16474E04543O70028k91262l54617j18183M31063l37720P09433E39072K39208j0581
$$ plain form
16464 767699 653398 931239 804440 465606 891975 591751 847174 805653 887353 821322
16454 821322 729418 911365 850576 867425 788139 505839 619495 783769 744977 697784 381857
16443 381857 616655 676576 361907 703161 509854 748524 687544 636233 898080 448841
16432 518018 899452 451597 670920 573625 469980 785119 628731 641238 432870 537454
16422 537454 484483 674227 442432 457433 520053 373656 937971 318978 500961 456675
16412 456675 546082 523833 485895 548698 355348 644190 632768 442118 390237 420576 291898
16401 291898 417621 313939 223565 612819 445261 606647 157802 766830 384609 345952
16391 345952 410353 177939 204180 539985 464794 279091 -16679 246890 299284 698610
$$ packed form
16464G67699j14301K77841j26799l38834M26369l00224K55423m1521Q1700o6031
16454H21322r1904J81947o0789J6849p9286k82300J13656J64274l8792m7193l15927
16443C81857K34798N9921l14669L41254j93307K38670o0980n1311K61847D48841
16432E18018L81434m47855K19323r7295j03645L15139j56388J2507k08368J04584
16422E37454n2971J89744k31795J5001O2620j46397N64315C18978J81983m4286
16412D56675Q9407k2249l7938O2803j93350K88842j1422j90650n1881L0339j28678
16401B91898J25723j03682r0374L89254j67558J61386A57802O09028l82221l8657
16391C45952O4401A77939K6241L35805p5191j85703a6679B46890N2394L99326
$$ plain form
16381 698610 333270 272842 20207 470341 363791 42248 300462 423565 286492 135052
16370 386161 217173 550606 454191 509972 703474 375839 565203 254220 394240 392034
16360 392034 447554 527310 202381 417339 642834 452527 26756 390286 526589 3459
16349 417173 317256 499790 172998 256976 302323 323306 618800 77896 710618 64427 356497
16338 356497 182015 286743 206474 495636 275574 398696 180876 318068 249456 310315
16328 310315 376346 195226 394169 354714 190018 512292 628156 110136 170424 -8304
16317 181762 574706 434702 130734 211505 163777 226757 204323 425013 89818 426113
16307 426113 218366 246670 402303 363671 406616 344873 191139 -33920 123648 465110
$$ packed form
16381F98610C33270o0428B0207M50134j06550D2248K58214J23103j37073A35052
16370C86161j68988L33433r6415N5781J93502l27635J89364B54220J40020k206
16360C92034N5520P9756B02381K14958K25495j90307B6756L63530J36303C459
16349D17173r9917J82534A72998Q3978M5347K0983K95494G7896O32722F4427K92070
16338C56497j74482J04728q0269K89162k20062J23122A80876J37192o8612O0859
16328C10315O6031j81120J98943l9455j64696L22274J15864A10136O0288h304
16317A81762L92944j40004A30734Q0771m7728O2980k2434K20690H9818L36295
16307D26113k07747K8304J55633l8632M2945o1743j53734c3920A23648L41462
$$ plain form
16297 465110 67472 391999 136380 151469 325897 200987 154599 306770 331883 428119
16287 428119 80062 296928 349690 185814 121584 165336 -105478 -216639 92207 227371
16277 227371 204417 87691 566415 191431 -17417 379189 -98692 30697 278959 220284 390461
16266 390461 319986 259696 -67832 43201 85539 75828 60637 -81149 112885 297603 89226
16254 163665 172269 187469 39054 -131129 69251 461926 409015 54619 181182 187432 221264
16243 221264 198457 199646 137928 -99370 249913 2648 464397 282815 348203 108555 141847
16232 141847 130784 290826 -99127 101232 190141 -65514 281198 103033 8636 -94077 -95511
16221 -95511 90013 124838 -44441 272521 361704 162890 147781 -40738 272641 2772 152482
$$ packed form
16297D65110F7472L24527A36380J5089J74428j24910m6388J52171K5113R6236
16287D28119H0062K16866N2762j63876o4230M3752a05478j11161I2207J35164
16277B27371k2954H7691M78724A91431a7417C79189i8692C0697K48262n8675J70177
16266C90461p0475o0290f7832D3201M2338r711j5191h1149A12885J84718H9226
16254A63665Q604J5200C9054a31129F9251L92675n2911E4619J26563O250L3832
16243B21264k2807J189o1718i9370B49913B648M61749j81582O5388A08555L3292
16232A41847j1063J60042i9127A01232Q8909f5514B81198A03033H636i4077j434
16221i5511I0013L4825d4441B72521Q9183A62890j5109d0738B72641B772J49710
$$ plain form
16210 152482 36180 500825 6947 22491 380281 361081 371311 500453 219790 376841 245316
16199 245316 -167718 295307 515095 333667 -231608 137859 343478 242664 135181 -84881
16188 348268 165736 226526 -191926 -65130 84868 151580 23448 349461 525483 144319
16177 26141 -392797 470087 51000 -102857 135479 -314723 -25167 82508 104022 229076
16167 229076 266376 -302420 186866 -82027 176044 103811 36443 -152135 -29855 200137
16156 215134 293107 55876 -11465 -209607 319379 202898 427733 216449 14666 224700
16146 224700 146186 283605 374064 -57967 53917 98066 -52693 378971 -319310 -332196 174919
16134 -273277 335344 272913 459334 195936 156497 288402 359296 -44427 208972 -61652
$$ packed form
16210A52482C6180M64645F947J5544L57790j9200J0230J29142B19790J57051j31525
16199B45316a67718B95307K19788j81428b31608A37859K05619j00814j07483h4881
16188C48268A65736O0790a91926f5130H4868O6712B3448L26013J76022A44319
16177B6141c92797D70087E1000a02857A35479c14723b5167H2508K1514J25054
16167B29076L7300c02420A86866h2027A76044p2233C6443a52135b9855B00137
16156B15134P7973E5876a1465j98142C19379j16481K24835k11284A4666K10034
16146B24700p8514J37419R0459e7967E3917M4149e2693C78971c19310j2886A74919
16134b73277C35344o2431J86421A95936l9439J31905P0894d4427B08972f1652
$$ plain form
16123 6614 220740 68238 175544 176561 -284166 -214435 -142516 -280712 -57306 256601 -18935
16111 -86884 271729 -35805 -24039 196090 -27683 -319596 248968 4255 -429 -145454 142428
16099 -144058 -82748 76702 -74694 -199753 -100563 -61081 131510 -117198 85112 100920 -50354
16087 -114732 230451 95477 -12698 205153 -2494 19371 12546 87493 41710 57759 288188
16076 288188 -217656 -24037 184073 -123592 -83241 29752 -195995 53860 -243249 -83006
16065 263281 -77043 -91827 117027 51125 -51165 -355042 -229279 127879 -129804 209980
16054 86221 25609 -140824 -155514 -65117 220206 -81000 36556 180901 155051 278486 102156
16042 -130703 254837 260537 -13634 137747 64483 147050 146020 129777 -20141 -9722 -112683
$$ packed form
16123F614K14126F8238J07306J017b84166O9731P1919j38196e7306B56601a8935
16111h6884B71729c5805J1766A96090b7683k91913B48968D255d29j45025A42428
16099a44058O1310G6702g4694j25059R9190L9482A31510a17198H5112J5808e0354
16087a14732B30451I5477a2698B05153b494A9371o825P4947D1710J6049K30429
16076B88188b17656b4037A84073a23592M0351B9752a95995E3860b43249h3006
16065B63281g7043j4784A17027E1125e1165l03877J25763A27879a29804B09980
16054H6221B5609a40824j4690f5117B20206h1000C6556J44345k5850J23435A02156
16042a30703B54837N700a3634A37747F4483Q2567j030j6243b0141i722j02961
$$ plain form
16031 -112683 -167085 162402 -73477 -146912 319083 -160315 6431 44763 -204454 -95216 61478
16019 5037 -188250 -144898 -194056 33171 -112628 -66094 25062 289729 -103537 285396 275445
16008 275445 -153041 126120 -144426 113736 175393 -217430 95601 -45494 113757 -68764
15997 405376 330688 -185989 -65653 126352 -96940 -204753 -126783 377601 178130 -40735
15986 324543 -341122 294428 315614 -44046 48799 180328 455983 102261 -73291 19891
15975 251188 -380270 -79961 -189753 -336256 -71889 -45353 231912 66025 -186987 111900
15964 -493266 -237347 -286357 78892 -21354 220490 210755 126781 232940 8251 20620 -13977
15952 94240 -16805 -36455 -56386 -58965 -74568 218786 250603 -347408 91175 -252823 37570
$$ packed form
16031a12683n4402A62402g3477p3435C19083a60315F431L8332b04454i5216F1478
16019E037a88250M3352m9158C3171a12628M6534B5062K64667a03537B85396r951
16008B75445a53041A26120a44426A13736O1657b17430I5601d5494A13757f8764
15997D05376p4688a85989f5653A26352i6940j07813P7970C77601A78130d0735
15986C24543c41122B94428K1186d4046D8799J31529K75655A02261g3291A9891
15975B51188c80270g9961j09792j46503g1889K6536B31912F6025a86987A11900
15964d93266b37347m9010G8892b1354B20490r735q3974J06159H251J2369a3977
15952I4240a6805j9650j9931k579j5603B18786L1817c47408I1175b52823C7570
$$ plain form
15940 -163416 230288 -73523 193486 -107342 -128770 -203050 -168031 171212 29721 -36468 13305
15928 -75619 152897 452334 54916 -203598 -79981 -19223 -310214 281287 184994 -125540
15917 250360 -125730 85041 -150664 33657 -24789 -124164 210910 -221606 -241187 -101865
15906 32389 -236801 108598 -396251 -215017 -215355 -105859 -76407 223151 -91979 -180959 -338517
15895 -338517 54159 124722 -39838 82408 120147 64775 231769 133459 104756 -198613 -182060
15884 -182060 115679 -37490 85081 195806 -190951 17734 -181754 -63527 444395 -50871
15873 -237941 -201639 12898 105466 238610 -335113 270371 -155669 -192687 225211 224613 -51883
15861 45923 96190 -33174 -121918 -107902 95194 -57647 -369370 -197822 26552 -3548 -37668
$$ packed form
15940a63416B30288g3523A93486a07342k1428p4280L5019A71212B9721c6468A3305
15928g5619A52897K99437E4916b03598g9981a9223k90991B81287r6293a25540
15917B50360a25730H5041a50664C3657b4789r9375B10910b21606j9581a01865
15906C2389b36801A08598c96251J81234l38a05859K9452B23151i1979q8980j57558
15895c38517E4159P0563c9838H2408L7739n5372J66994r8310k8703a98613J6553
15884a82060A15679c7490H5081J10725a90951A7734a81754f3527D44395e0871
15873b37941L6302A2898R2568J33144c35113B70371a55669l7018B25211n98e1883
15861D5923N0267c3174q8744J4016I5194e7647l11723J71548B6552c548l4120
$$ plain form
15850 -37668 -180534 201498 174906 -70788 -239339 -46723 -132957 91530 51292 -114494 -212023
15839 -212023 -25116 35595 41092 -343536 -66716 20432 142890 -33689 113368 -90685 -178366
15828 -178366 52354 -129695 134642 -348729 220882 -253110 -255084 -44729 98562 48115 178421
15817 178421 38067 -178577 422544 -141171 -189594 -171686 -389044 -88417 -57490 212559
15806 -56797 106345 -189389 -148667 88402 270537 71201 -14657 -80081 150816 42725 449630
15795 449630 -18138 318437 -54878 -241061 -216839 29109 -13067 -87139 -283680 67710 127787
15784 127787 -147223 266006 -223303 12716 123964 214916 -64252 -91578 -74935 -65639 239519
15772 2214 45182 -365562 110276 -41855 -76586 83982 33250 -52910 -287151 -451536 6669
$$ packed form
15850c7668j42866B01498k6592g0788j68551d6723q6234I1530m0238a14494r7529
15839b12023b5116C5595N497c43536f6716B0432J22458c3689A13368i0685q7681
15828a78366E2354a29695A34642c48729B20882b53110j974d4729I8562D8115J30306
15817A78421C8067a78577D22544a41171m8423J7908k17358h8417L0927B12559
15806e6797A06345a89389M0722H8402J82135G1201a4657o5424A50816D2725M06905
15795D49630a8138C18437e4878j86183K4222B9109a3067p4072j96541F7710O0077
15784A27787a47223B66006b23303A2716J11248R0952f4252k7326J6643R296B39519
15772B214M2968c65562A10276d1855l4731H3982C3250e2910k34241j64385F669
$$ plain form
15760 -187539 240213 154181 -35524 240337 49648 159155 -203759 246622 45475 -192526
15749 -301904 201310 258176 24034 79549 -418091 -120063 88993 -64766 -84954 101012 -23779
15737 32896 515984 -83248 -301485 -235301 42977 -66953 115241 -226551 93826 -55301 -88254
15726 -88254 223830 -212893 -49358 -308018 149899 132728 -150187 -245872 -261977 -406180
15716 -406180 -114530 38368 83576 18033 -139297 -33540 -252723 211897 151800 -120569
15705 60137 -345143 -161887 79344 -245708 -397270 342731 -217586 256713 -96534 -192904
15695 -192904 23653 300186 -187033 5986 126652 -33404 -145775 26894 144328 -67009 -102640
15684 -102640 329544 119956 151181 258995 44957 -8876 -58538 -180075 170743 -251911
$$ packed form
15760a87539B40213q6032c5524B40337D9648J09507b03759B46622D5475a92526
15749c01904B01310N6866B4034N5515d18091a20063H8993f4766k0188A01012b3779
15737C2896M83088h3248k18237O6184D2977f6953A15241b26551I3826e5301l2953
15726h8254B23830b12893d9358k58660A49899j7171a50187r5685j6105j44203
15716d06180a14530C8368M5208A8033a39297c3540k19183B11897o0097a20569
15705F0137c45143a61887G9344b45708j51562C42731b17586B56713i6534r6370
15695a92904B3653K76533a87033E986J20666c3404j12371B6894J17434f7009l5631
15684a02640C29544A19956L1225J07814D4957h876m9662j21537A70743b51911
$$ plain form
15673 220863 14259 -15847 349427 53791 -2561 -27418 -47257 -194902 18102 -234229 176818
15661 -258210 -28515 -82001 -156268 -92894 71975 -335545 60798 -10853 383721 -186129 48
15649 95993 -73426 -274314 -78695 -111300 -149309 -19110 54007 -32024 -165301 113524 169241
15638 169241 187533 -212450 252191 -61098 275072 -1515 -8656 -81580 189626 -128797 38817
15626 13887 254001 -666151 -157161 128495 104186 -74601 88403 338107 68900 262118
15616 262118 -96843 -34401 236047 -192422 -311032 -114805 -105303 54029 -366321 383300
15605 -211708 -45996 -83325 230024 -95467 -180523 -185542 29699 -201888 -111583 -105135 -310907
15594 -310907 24424 -50807 -155487 101101 -46673 -46211 107727 -133843 147777 -103481 -34667
$$ packed form
15673B20863A4259a5847C49427E3791b561k4857j9839j47645A8102b34229A76818
15661b58210b8515n3486p4267O3374G1975c35545F0798a0853C83721a86129D8
15649I5993g3426k00888g8695l2605l8009a9110E4007c2024j33277A13524N5717
15638A69241J8292b12450B52191f1098B75072a515p141p2924A89626a28797C8817
15626A3887K40114f66151a57161A28495k4309g4601H8403K49704F8900J93218
15616B62118i6843c4401B36047a92422j18610a14805R502E4029c66321C83300
15605b11708d5996l7329B30024i5467q5056n019B9699b01888R0305O448k05772
15594c10907B4424e0807j04680A01101d6673M62A07727a33843A47777a03481c4667
$$ plain form
15582 189962 -142847 -137556 -177307 110669 20284 137010 -47835 17681 -46595 -112966 120080
15570 -176923 38609 -6993 399506 -59889 -135007 33371 -154427 61823 -208359 22165 -119619
15558 -240514 -36890 151032 215058 -45178 72897 49586 -110577 -140796 29143 -232584 160091
15546 217925 -138274 -152144 -139288 -198467 18994 27360 169408 -517058 -117451 98235 63401
15535 63401 -199145 17295 30978 -9209 54084 -84716 -388617 -96539 -33605 -132794 89310
15523 -209163 -43252 120838 133944 37735 283407 -53440 497265 72482 48165 -207481 -271321
15512 -271321 155255 302033 -226369 124775 219792 -109698 -285694 6523 4982 -76117 508507
15500 -164793 16274 -9343 -72447 -109733 39214 339620 219173 -228433 -310928 -38868 -221696
$$ packed form
15582A89962a42847N291l9751A10669B0284J16726d7835A7681d6595o6371A20080
15570a76923C8609f993C99506e9889p5118C3371a54427F1823b08359B2165a19619
15558b40514c6890A51032O4026d5178G2897k3311a10577l0219B9143b32584A60091
15546B17925a38274j3870J2856n9179A8994Q366J42048e17058a17451I8235l4834
15535F3401a99145A7295J3683i209E4084h4716l03901i6539c3605r9189H9310
15523b09163d3252A20838J3106C7735K45672e3440D97265G2482k4317b07481o3840
15512b71321A55255J46778b26369A24775R5017a09698j75996F523j541g6117E08507
15500a64793A6274i343o3104l7286C9214L00406j20447b28433q2495c8868j82828
$$ plain form
15489 -221696 -246891 -77953 28747 -39263 153174 -211736 -235997 -86335 8769 -143971 -139825
15478 -139825 46038 173160 -171704 125216 252376 -19929 -224851 -59441 200519 66898
15467 -63153 208273 -18023 222931 73550 54136 -11901 21365 96223 -144251 159185 -244955
15455 21278 129660 270695 -156135 -69594 -173698 -350978 -206061 189614 34948 82929
15445 82929 406006 -12098 203564 109580 338605 -20727 -105693 12636 109018 128280 -57803
15433 113407 389776 -256352 -23765 -100397 -85588 142835 -8900 165169 -104939 21424 -46006
15421 -365472 -112332 173982 -48363 114752 379487 18548 128896 -153440 -48822 132075
15410 25770 164537 -94980 -102769 -11290 -37584 -136240 7380 113983 365952 190518 26879
$$ packed form
15489b21696k5195g7953B8747c9263A53174b11736k4261h6335H769a43971M146
15478a39825D6038J27122a71704A25216J27160a9929k04922e9441B00519F6898
15467f3153B08273a8023B22931G3550j9414a1901B1365P4858a44251A59185b44955
15455B1278J08382J41035a56135f9594j04104j77280J44917A89614C4948M7981
15445H2929L23077a2098B03564r3984K29025b0727q4966A2636R6382J9262e7803
15433A13407K76369b56352b3765p6632J4809A42835h900A65169a04939B1424d6006
15421c65472a12332A73982d8363A14752K64735A8548J10348a53440d8822A32075
15410B5770J38767i4980p789a1290k6294r8656G380J06603K51969j75434B6879
$$ plain form
15398 -442687 63219 -241102 -150546 -63758 -156957 46397 -225097 175780 -55316 -141432 133088
15386 130455 -9170 294892 147164 68755 -32077 -100202 -133507 -231333 367644 223605 -48636
15374 256261 -24390 -233089 -54984 -36934 254948 13053 -237574 -131829 192652 111672
15364 111672 38999 115706 76668 100234 -338322 95031 -65552 88692 -50471 72682 1821
15352 11870 -82790 108417 220716 263337 -151499 29690 -68318 -28447 11433 25567 -341179
15340 -12512 92939 -43934 107799 321605 100682 194972 26995 -175104 -2864 83380 -191465
15328 -156505 -513 54337 -156527 -62122 275745 -65776 141780 -286363 61472 -53909 -388166
15317 -388166 311678 217393 113861 403013 -84162 83000 -51710 391335 89088 -50158 109587
$$ packed form
15398d42687F3219b41102R0556f3758r3199D6397b25097A75780e5316q6116A33088
15386A30455i170B94892A47164F8755c2077o8125l3305r7826C67644j44039d8636
15374B56261b4390k08699e4984J8050B54948A3053b37574J05745A92652q0980
15364A11672C8999P6707l9038K3566c38322I5031f5552H8692e0471G2682A821
15352A1870h2790A08417J12299M2621a51499B9690f8318b8447A1433J4134c41179
15340a2512I2939d3934A07799K13806A00682R4290B6995a75104b864H3380a91465
15328a56505e13E4337a56527f2122B75745f5776A41780b86363F1472e3909l34257
15317c88166C11678r4285j03532K89152h4162H3000e1710C91335H9088e0158A09587
$$ plain form
15305 159760 119461 359465 133804 78650 129757 -68109 -138862 91112 -247504 335666 -60847
15293 -38583 -209386 51487 -12265 263047 -18983 149385 217792 72568 -34465 -48425 -47968
15282 -47968 -138155 -11595 -13340 31271 145239 -35701 -201522 564527 -48091 124408 88399
15271 88399 15135 -3718 -49106 -37360 443223 -11699 -56595 69520 -249087 113437 319674
15260 319674 395216 -113012 -188634 209027 -220572 315154 -139239 367702 51748 236551
15250 236551 626812 985184 1660298 1164174 1351193 1196026 446671 159039 -57428 17236
15239 -47021 334723 103773 -31371 164833 -67491 -37581 140670 369271 132044 -82161
15228 152955 44702 84009 -28664 32002 113744 180502 276508 -332799 7657 110822 487622
$$ packed form
15305A59760m0299K40004A33804n5154N1107f8109p0753I1112b47504C35666f0847
15293c8583j70803E1487a2265B63047a8983A49385O8407G2568c4465j3960M57
15282d7968r0187a1595j745C1271J13968c5701j65821E64527d8091A24408l6009
15271H8399A5135c718m5388J1746D43223a1699m4896F9520b49087A13437K06237
15260C19674P5542a13012p5622B09027b20572C15154a39239C67702E1748J84803
15250B36551L90261L58372O75114m96124J87019j55167D46671A59039e7428A7236
15239d7021C34723A03773c1371A64833f7491K9910A40670K28601A32044h2161
15228A52955D4702L9307b8664C2002Q1742O6758R6006c32799G657J03165L76800
$$ plain form
15217 487622 8136 43972 -82374 260103 81476 196079 464366 -101392 -13694 297230 173051
15206 173051 11784 -200596 63004 402144 -26468 -344058 137695 -259849 129748 -168015
15195 23462 214472 -30310 -203739 -119133 -120455 152328 -123827 -188480 267721 -101478 96687
15183 50977 -170159 -62426 -49084 202439 45191 249413 53960 -115504 13621 118736 -141124
15171 151567 99280 366851 314385 31052 299562 134191 85773 209347 180939 -99577 -164750
15160 -164750 412826 72956 318824 16902 59450 136320 86517 -224100 10518 -125175 -129468
15149 -129468 -26454 147790 -343062 4003 -57118 77451 331283 -81418 72481 234335 172654
15138 172654 137724 -20549 247541 139720 343104 420642 -33272 120503 428856 -263826
$$ packed form
15217D87622H136L5836h2374B60103H1476J14603K68287a01392a3694B97230j24179
15206A73051A1784b00596F3004L39140b6468l17590A37695b59849A29748a68015
15195B3462J91010c0310j73429Q4606j322A52328a23827o4653B67721a01478I6687
15183E0977a70159f2426J3342B02439D5191K04222E3960a15504A3621J05115a41124
15171A51567n2287K67571n2466C1052K68510A34191m8418J23574k8408i9577o5173
15160a64750D12826G2956K45868A6902M2548P6870m9803b24100A0518a25175m293
15149a29468b6454A47790c43062D003e7118G7451K53832h1418G2481J61854o1681
15138A72654l4930b0549B47541j07821K03384P7538c3272A20503L08353b63826
$$ plain form
15127 92189 62481 317587 232253 -33065 172861 235530 120470 198459 -122457 66158 147117
15116 147117 99636 116369 -71659 301045 206752 116933 244252 260162 245739 113582 449002
15105 449002 196314 -15957 45572 152976 218271 -127908 429337 58348 252203 67614
15094 -163144 480722 58510 -16626 46042 44392 335125 100068 74383 19998 225307 242231
15083 242231 493963 206485 93904 117562 131342 -108087 -153405 246761 -13550 144415
15072 227358 -36630 92136 437622 110045 395200 -15130 118776 403156 120706 209832
15062 209832 44484 225382 224469 -62010 106276 444734 214252 -58799 310735 85821 204948
15051 204948 306314 -6862 312044 311220 98910 -15530 255876 -53388 -90364 167978 99605
$$ packed form
15127I2189k9708K55106q5334c3065A72861O2669j15060P7989a22457F6158Q0959
15116A47117m7481J6733g1659C01045r4293q9819J27319J5910j4423A13582L35420
15105D49002A96314a5957D5572J07404O5295a27908D29337E8348J93855F7614
15094a63144D80722E8510a6626D6042j650K90733A00068k5685A9998K05309J6924
15083B42231K51732B06485I3904K3658J3780a08087m5318B46761a3550A44415
15072B27358c6630I2136L45486A10045K85155a5130A18776K84380A20706Q9126
15062B09832D4484J80898r13f2010A06276L38458B14252e8799C10735H5821J19127
15051B04948J01366f862C12044q24I8910a5530B55876e3388l6976A67978o8373
$$ plain form
15040 99605 469684 -171047 -31183 163605 283643 318131 348491 105314 -86566 -75078 253849
15028 272272 607540 292411 87487 53304 363875 126828 582848 435080 326604 78941
15017 338515 386193 369084 335541 224000 186836 72747 -22715 277911 225203 356125 275491
15006 275491 206718 369598 233082 377172 -4054 370840 389705 283002 198103 112177 462430
14995 462430 187991 356347 184895 139351 82800 -3614 -33734 -107982 50394 364422 138765
14983 -72379 332106 -196469 288368 226498 68404 315923 242447 316782 154715 339912
14973 339912 -12206 429507 63020 322421 -114100 367297 160496 345960 116679 175314
14963 175314 237137 581182 535889 564037 411250 391456 367867 358042 155010 309257 36510
$$ packed form
15040I9605L70079a71047c1183A63605J20038L4488L0360A05314h6566J1488B53849
15028B72272L35268B92411H7487l4183L10571A26828M56020j47768j08476G8941
15017C38515M7678j7109l3543j11541l7164G2747b2715B77911n2708J30922q0634
15006B75491o8773J62880j36516J44090d054C70840J8865j06703q4899q5926L50253
14995D62430A87991J68356j71452m5544n6551c614l0120p4248E0394L14028A38765
14983g2379C32106a96469B88368o1870F8404K47519p3476P4335A54715J85197
14973C39912a2206D29507F3020K59401a14100C67297A60496J85464A16679N8635
14963A75314O1823L44045m5293K8148j52787j9794k3589r825A55010J54247C6510
$$ plain form
14951 603471 67842 300002 275321 423603 -9940 378651 69217 86308 568480 379764 -28864
14939 414961 -26123 130850 -85563 423679 441805 207135 494520 322569 39597 154867
14929 154867 209296 424152 447163 427099 159413 281079 448437 164661 -101562 397517
14918 303658 314255 205523 98013 329316 261643 495848 376291 390906 304640 516068
14908 516068 490547 472095 380144 731752 40052 110820 254812 168770 485663 7917 315175
14897 315175 394822 68047 483984 255540 474712 398545 282419 225357 348462 57159
14886 675130 323271 409926 331440 121643 123411 589822 404715 594813 620204 417398
14876 417398 572818 263440 534446 644285 35150 461072 170674 674457 661437 392090
$$ packed form
14951F03471F7842K32160k4681J48282i940C78651F9217J7091M82172j88716b8864
14939D14961b6123A30850h5563D23679J8126B07135K87385j71951C9597J15270
14929A54867N4429K14856K3011k0064A59413J21666J67358A64661a01562C97517
14918C03658J0597j08732I8013K31303o7673K34205j19557J4615q6266K11428
14908E16068k5521j8452r1951L51608D0052P0768J43992q6042L16893G917L07258
14897C15175P9647F8047M15937k28444K19172p6167j16126n7062J23105E7159
14886F75130C23271Q6655p8486A21643J768M66411j85107J90098K5391k02806
14876D17398J55420B63440K71006J09839C5150M25922A70674N03783j3020k69347
$$ plain form
14866 392090 365818 516211 289700 520883 380626 246111 210347 215636 503901 457683
14856 457683 541767 678866 331276 615679 205903 529094 397383 613367 521541 468585
14846 468585 473644 553952 288751 372198 356303 350871 604529 688764 148958 626033 389481
14835 389481 597076 518873 540050 661150 802111 299654 390265 390403 524029 388172 286961
14824 286961 794946 343913 693857 307125 538446 295737 416011 487980 696903 878053
14814 878053 221799 689915 171354 303307 593117 687731 609178 707658 800068 404740
14804 404740 152497 997928 334734 502264 484828 321924 617617 424470 346915 496802
14794 496802 634781 229960 615999 475647 415214 435423 445338 624479 573572 351600
$$ packed form
14866C92090k6272J50393k26511K31183j40257j34515l5764N289K88265m6218
14856D57683Q4084J37099C31276K84403B05903L23191j31711K15984r1826n2956
14846D68585N059Q0308k65201Q3447j5895n432K53658Q4235A48958M77075k36552
14835C89481K07595p8203K1177J21100J40961B99654R0611J38J33626j35857j01211
14824B86961N07985C43913L49944C07125K31321k42709J20274P1969K08923J81150
14814H78053B21799M68116A71354J31953K89810R4614p8553R8480R2410l95328
14804D04740A52497Q45431C34734J67530j7436j62904K95693j93147p7555J49887
14794D96802J37979B29960L86039j40352o0433K0209R915J79141n0907k21972
$$ plain form
14784 351600 394888 467091 504749 591587 313772 535209 413484 518998 454844 802003
14774 802003 452542 767342 781811 767130 762516 647647 673247 880871 874332 507467 599517
14763 599517 444135 536014 391975 970982 667626 1017995 586296 788371 941695 742320
14753 742320 683371 605698 1122328 861059 585710 835744 830341 447297 669167 842272
14743 842272 770038 361249 883542 908535 724088 526752 496025 952170 692976 762385
14733 762385 649871 612623 705481 1018378 514474 817637 1078755 387647 667695 732375
14723 732375 741239 825389 712039 896071 584404 531608 756120 943615 972924 722169
14713 722169 814987 759381 1129879 1171453 695229 838668 916185 884134 1088972 945816
$$ packed form
14784C51600M3288P2203L7658Q6838k77815K21437j21725J05514o4154L47159
14774H02003l49461L14800J4469j4681m614j14869K5600K07624o539l66865R2050
14763E99517j55382R1879j44039N79007l03356L50369m31699K02075J53324j99375
14753G42320n8949p7673N16630k61269k75349K50034n403l83044K21870J73105
14743H42272p2234C61249N22293K4993j84447j97336l0727M56145k59194O9409
14733G62385j12514l7248R2858L12897n03904L03163K61118C87647K80048O4680
14723G32375Q864Q4150j13350J84032l11667n2796K24512J87495K9309k50755
14713G22169R2818n5606L70498M1574m76224J43439P7517l2051K04838j43156
$$ plain form
14703 945816 1153021 1044032 947769 897303 747126 772928 739648 892606 1155862 831283
14693 831283 827624 1097381 798577 955268 905018 926285 1080956 1222994 797287 1085528
14683 1085528 983157 1031132 856535 1363260 1064289 1096290 1080161 1181801 1256364 947630
14673 947630 1360645 1102974 750674 1043470 884707 769207 1291305 1087133 980544 843301
14663 843301 1176230 1213781 1143218 1111568 1223162 1387095 969608 1051879 979453 1146493
14653 1146493 1220702 999336 1270357 895501 1231344 1425769 1187510 1379586 1114331 1184167
14643 1184167 1112402 1128604 1184926 1213860 1290576 1515228 1763959 1454239 1158310 1310568
14633 1310568 1308094 1119883 1504009 1634232 1238655 1667455 1131935 1512132 1634439 1131956
$$ packed form
14703I45816K07205j08989r6263n0466j50177K5802l3280J52958K63256l24579
14693H31283l659K69757k98804J56691n0250K1267J54671J42038m25707K88241
14683A085528j02371M7975j74597N06725k98971L2001j6129J01640P4563l08734
14673I47630M13015k57671l52300K92796j58763j15500N22098k04172j06589j37243
14663H43301L32929L7551p0563l1650J11594J63933m17487Q2271p2426J67040
14653A146493P4209k21366K71021l74856L35843J94425k38259J92076k65255O9836
14643A184167p1765J6202N6322K8934P6716K24652K48731l09720k95929J52258
14633A310568k474j88211L84126J30223l95577M28800n35520L80197J22307n02483
$$ plain form
14623 1131956 1357973 1469687 1097572 1615753 1312558 1300253 1633448 1415975 1797085 1521069
14613 1521069 1645745 1336299 1625279 1858871 1538669 1638243 1771690 1416342 1275617 1633868
14603 1633868 1580824 1588121 1600678 1704488 2181094 1669797 1749082 1992664 1810984 1956329
14593 1956329 1794709 1621019 1904220 1847779 1741774 1949620 1663163 2090999 2063978 2129110
14583 2129110 1619035 1978443 2118585 1887400 2040433 2159531 2063383 2114399 2383655 2382408
14573 2382408 2149123 2490570 2489079 2273003 2208446 2548391 2551253 2556851 2577564 2602740 2796822
14562 2796822 2456064 2657901 2631369 2679778 2825215 3321972 3099586 3475078 3779790 3754583
14552 3754583 4144699 4928518 5864802 8009011 13234868 23207514 39110347 45084741
$$ packed form
14623A131956K26017J11714l72115N18181l03195j2305L33195k17473L81110k76016
14613A521069J24676l09446K88980K33592l20202R9574J33447l55348j40725L58251
14603A633868n3044P297J2557J03810M76606n11297P9285K43582j81680J45345
14593A956329j61620j73690K83201n6441j06005K07846k86457M27836k7021O5132
14583B129110n10075L59408J40142k31185J53033J19098r6148N1016K69256j247
14573B382408k33285L41447j491k16076o4557L39945K862N598K0713K5176J94082
14562B796822l40758K01837k6532M8409J45437M96757k22386L75492L04712k5207
14552C754583L90116P83819R36284K144209N225857R972646J5902833N974394
$$ plain form
14544 45084741 21194443 8169516 4798389 2975356 2257529 2162322 1780000 2066654 2171590
14535 2171590 1996910 2026517 2318568 2128488 2054369 2247003 2173504 2541139 2133014 2270477
14525 2270477 2330279 2747311 2503714 2492948 2563654 2750472 2537571 2688419 2556018 2774182
14515 2774182 2481598 2810614 2778030 2578448 3147455 2836974 2955603 2769987 2994143 3251828
14505 3251828 2890243 2958624 3105869 3254916 3399119 3199075 3383849 2978832 3228674 3400407
14495 3400407 3458123 3331626 3390067 3637040 3455994 3978919 3574536 3608889 3821675 3821023
14485 3821023 4008224 4191289 3824411 3768683 4099717 4023391 4046415 4130129 4374558 4329424
14475 4329424 4500214 4206890 3884315 4380044 4436248 4554979 4499723 4150032 4910216 4871108
$$ packed form
14544D5084741B1194443H169516l371127j823033p17827r5207l82322K86654J04936
14535B171590j74680K9607K92051j90080p4119J92634p3499L67635m08125J37463
14525B270477N9802M17032k43597j0766P0706J86818k12901J50848j32401K18164
14515B774182k92584L29016l2584j99582N69007l10481J18629j85616K24156K57685
14505C251828l61585O8381J47245J49047J44203k00044J84774m05017K49842J71733
14495C400407N7716j26497N8441K46973j81046N22925m04383L4353K12786o52
14485C821023J87201J83065l66878n5728L31034p6326K3024Q3714K44429m5134
14475D329424J70790k93324l22575M95729N6204J18731n5256l49691P60184l9108
$$ plain form
14465 4871108 4797534 4880873 4702049 4897389 4920928 5339073 4944753 5086552 4869404 5477239
14455 5477239 5239652 5068021 5374199 5400363 5606705 5457607 5474027 5486232 5848942 5887730
14445 5887730 6139639 6079521 5783957 6092212 6580181 6680191 6383765 6344578 6382814 6621329
14435 6621329 6610872 7314027 6888612 7033104 7313165 7359523 7508474 7450579 7581630 7522573
14425 7522573 7824967 7761542 8014073 8246595 8099888 8380134 8454436 8590166 8685619 8542345
14415 8542345 8677055 8983989 8894069 9244923 9313138 9449182 9805908 9771018 9669728 10148008
14405 10148008 10432207 10461885 10437867 10501403 11194091 10994440 11145442 11129062 11752007 11584383
14395 11584383 11938182 12174129 12381701 12596538 12981030 12689240 13184869 13655941 13731508
$$ packed form
14465D871108p3574Q3339j78824J95340K3539M18145l94320J41799k17148O07835
14455E477239k37587j71631L06178K6164K06342j49098J6420J2205L62710L8788
14445E887730K51909o0118k95564L08255M87969J00010k96426l9187L8236K38515
14435F621329j0457P03155m25415J44492K80061M6358J48951n7895J31051n9057
14425G522573L02394o3425K52531K32522j46707K80246P4302J35730R5453j43274
14415H542345J34710L06934q9920L50854O8215J36044L56726l4890j01290M78280
14405A0148008K84199K9678k4018O3536O92688j99651J51002j6380O22945j67624
14395A1584383L53799K35947K07572K14837L84492k91790M95629M71072P5567
$$ plain form
14386 13731508 14028557 14007831 14087129 14805505 15042684 14970588 15466501 15890458 16062519 16217313
14376 16217313 16643369 17077061 17446222 17513041 18151367 18263732 18829546 19048678 19641096
14367 19641096 19769895 20033896 20754581 21090794 21682985 22100038 22138071 22824686 23562880
14358 23562880 24080176 24469185 25243167 25522120 26028774 26897078 27654097 28209254 28604101
14349 28604101 29438123 30282283 30953700 31944611 32546888 33607943 34119557 35302339 36039607
14340 36039607 37311043 38196173 39440913 40390677 41419908 42219011 43800968 45057691
14332 45057691 46435420 48079146 49714755 51105176 52846947 54428532 55863986 58254381
14324 58254381 60063979 62027612 64218182 66404077 68586822 71359770 73992836 76546214
$$ packed form
14386A3731508K97049k0726P9298P18376K37179p2096M95913M23957J72061J54794
14376A6217313M26056M33692L69161O6819O38326J12365N65814K19132N92418
14367A9641096J28799K64001P20685L36213N92191M17053L8033O86615P38194
14358B3562880N17296L89009P73982K78953N06654Q68304P57019N55157L94847
14349B8604101Q34022Q44160O71417R90911O02277J061055N11614J182782P37268
14340C6039607J271436Q85130J244740R49764J029231P99103J581957J256723
14332D5057691J377729J643726J635609J390421J741771J581585J435454K390395
14324E8254381J809598J963633K190570K185895K182745K772948K633066K553378
$$ plain form
14316 76546214 79320126 82239247 85891426 89132834 92274782 96224486 100186300 104209712
14308 104209712 108424484 112956231 118013726 123062961 128298795 134366589 140491228 146653271
14300 146653271 153470846 160563028 168201395 176321120 184759722 193780657 203083259 213112453
14292 213112453 223826652 234548223 245847050 258130862 270689916 283740339 297267354
14285 297267354 311229770 325479176 339788607 353980317 368435358 382253392 396030318
14278 396030318 408547369 420905664 431499053 440896902 448359487 453306179 453866752 452932814
14270 452932814 451212952 451588694 449845069 445102895 437951540 429297578 419681289 408320661
14262 408320661 395954743 382876638 368479743 353962060 338668500 323435709 309030122
$$ packed form
14316G6546214K773912K919121L652179L241408L141948L949704L961814M023412
14308A04209712M214772M531747N057495N049235N235834O067794O124639O162043
14300A46653271O817575P092182P638367Q119725Q438602R020935R302602J0029194
14292B13112453J0714199J0721571J1298827J2283812J2559054J3050423J3527015
14285B97267354J3962416J4249406J4309431J4191710J4455041J3818034J3776926
14278C96030318J2517051J2358295J0593389R397849P462585M946692N60573r33938
14270D52932814j719862L75742j743625m742174p151355q653962r616289j1360628
14262D08320661j2365918j3078105j4396895j4517683j5293560j5232791j4405587
$$ plain form
14255 309030122 295418944 281729482 267987926 255254518 242874705 230880520 219897366
14248 219897366 208931055 199234942 190036766 180703568 172393345 164639774 156982897 149596383
14240 149596383 142825060 136381648 131025113 125405751 120019502 114675315 109842207 105348986
14232 105348986 101502451 97440413 93789809 89718081 86643482 83278701 80296447 77041688
14224 77041688 74565007 71533002 69315291 66944225 64661475 62544774 60594288 58501239
14216 58501239 56570759 54966279 53235803 52294189 50091862 48572190 47159219 45704099
14208 45704099 44866292 44065148 42704771 41338985 39924170 38712506 37795413 36851858 36125867
14199 36125867 34873957 34141876 32909362 32238179 31559144 31121751 29994005 29429086 28354710
$$ packed form
14255C09030122j3611178j3689462j3741556j2733408j2379813j1994185j0983154
14248B19897366j0966311r696113r198176r333198q310223p753571p656877p386514
14240A49596383o771323o443412n356535n619362n386249n344187m833108m493221
14232A05348986l846535m062038l650604m071728l074599l364781k982254l254759
14224G7041688k476681l032005k217711k371066k282750k116701j950486k093049
14216E8501239j930480j604480j730476r41614k202327j519672j412971j455120
14208D5704099q37807q01144j360377j365786j414815j211664r17093r43555p25991
14199C6125867j251910p32081j232514o71183o79035m37393j127746n64919j074376
$$ plain form
14190 28354710 27842897 26980661 26713667 25805525 25396583 24964835 24378285 23747800 23580815
14181 23580815 22904663 22580722 21392059 21400565 21095833 20394494 20037698 19687081 19523212
14172 19523212 18923422 18491364 18057936 17848305 17634518 17325596 16657887 16355892 16223258
14163 16223258 16000620 15847519 15560001 15301169 14841467 14718263 14583267 14067472 14164611
14154 14164611 13522807 13237356 13270449 13091062 13088714 12623159 12240003 12218464 12135445 11976975
14144 11976975 11581032 11270883 11167172 11249947 11392206 10849180 10973691 10387091 10247486
14135 10247486 10104323 10087143 9803229 9721354 9846042 9504477 9481202 9434624 9168634 8852714
14125 8852714 8986487 8835433 8488644 8244004 8236369 8507892 8381649 8145387 7929505 7748914
$$ packed form
14190B8354710n11813q62236k66994r08142m08942m31748n86550o30485j66985
14181B3580815o76152l23941j188663Q506l04732p01339l56796l50617j63869
14172A9523212n99790m32058m33428k09631k13787l08922o67709l01995j32634
14163A6223258k22638j53101k87518k58832m59702j23204j34996n15795R7139
14154A4164611o41804k85451L3093j79387k348m65555l83156k1539q3019j58470
14144A1976975l95943l10149j03711Q2775J42259n43026J24511n86600j39605
14135A0247486j43163j7180k83914q1875J24688l41565k3275m6578k65990l15920
14125H852714J33773j51054l46789k44640p635K71523j26243k36262k15882j80591
$$ plain form
14115 7748914 7936732 7747537 7412529 7234771 7458845 7242629 7195902 7190543 7058085 6835693
14105 6835693 6818835 6787108 6738384 6625215 6562489 6143979 6298350 6212672 6299919 5852560
14095 5852560 5931322 6327397 5707195 5620816 5541949 5789133 5759419 5829859 5553606 5608259
14085 5608259 5358725 5486554 5177981 5307182 5167932 4937064 5207460 4971414 5115173
14076 5115173 4566271 4729510 4667098 4866304 4663842 4773526 5007178 4377497 4530917 4145611
14066 4145611 3979236 4255004 4029378 4304615 4237660 3983952 4366946 4304468 4300625 4107180
14056 4107180 3970849 3958665 4367591 4248028 4219115 3963049 3487590 3847822 3711551 3550330
14046 3550330 3526539 3705500 3566743 3392449 3713225 3232220 3766654 3326563 3518141 3545646
$$ packed form
14115G748914J87818j89195l35008j77758K24074k16216m6727n359j32458k22392
14105F835693j6858l1727m8724j13169o2726m18510J54371q5678Q7247m47359
14095E852560P8762L96075o20202q6379p8867K47184k9714P0440k76253N4653
14085E608259k49534J27829l08573J29201j39250k30868K70396k36046J43759
14076E115173n48902J63239o2412J99206k02462J09684K33652o29681J53420l85306
14066D145611j66375K75768k25626K75237o6955k53708L82994o2478l843j93445
14056D107180j36331j2184M08926j19563k8913k56066m75459L60232j36271j61221
14046C550330k3791J78961j38757j74294L20776m81005N34434m40091J91578K7505
$$ plain form
14036 3545646 3579889 3382434 3293998 3362994 3161727 3272538 3446681 3102377 3178432 3436739
14026 3436739 3124634 3201172 2959747 2746233 2858027 2887950 2945483 2919329 2817425 2761095
14016 2761095 2608597 2344892 2570077 2398614 2940885 2472034 2762701 2787330 2666112 2451868
14006 2451868 2432417 2238549 2403914 2673678 2560561 2445500 2033502 2471838 1981833 2421288
13996 2421288 2328929 2357190 2230275 2207363 2216966 2561876 3364255 3713012 7659332 15966822
13986 15966822 32653919 44832068 26871818 13210743 8748713 6250354 4920980
13979 4920980 4300745 3835463 3463673 3301395 3447922 2976104 3005972 3001779 2766662 2606021
13969 2606021 2626970 2268456 2428672 2693207 2094330 2302629 2155915 2259128 2164418 2412589
$$ packed form
14036C545646L4243j97455q8436O8996k01267J10811J74143l44304P6055K58307
14026C436739l12105P6538k41425k13514J11794K9923N7533k6154j01904n6330
14016B761095j52498k63705K25185j71463N42271m68851K90667K4629j21218k14244
14006B451868j9451j93868J65365K69764j13117j15061m11998M38336m90005M39455
13996B421288r2359K8261j26915k2912R603L44910Q02379L48757L946320Q307490
13986A5966822J6687097J2178149j7960250A3210743m462030k498359j329374
13979D920980o20235m65282l71790j62278J46527m71818K9868m193k35117j60641
13969B606021K0949l58514J60216K64535n98877K08299j46714J03213r4710K48171
$$ plain form
13959 2412589 2304294 2235928 2200058 2344183 2383221 1962411 2251949 2290730 2293435 2188754
13949 2188754 1922509 2056062 1688631 1816443 1755334 1944750 1909786 1809913 1766532 2060853
13939 2060853 2104862 2171116 1649608 2032445 1942749 1858153 1688332 1855084 2027580 1875728
13929 1875728 1774136 1807736 1778580 1831909 1630929 1376774 1421436 1405674 1506266 2017792
13919 2017792 1475624 1487721 1901340 1793308 1335592 1658719 1359877 1719314 1832947 1838870
13909 1838870 1410935 1570709 1577160 1469269 1683362 1312072 1337846 1634013 1202659 1101466
13899 1101466 1493769 1457480 1333890 1316996 1170012 1376837 1602535 1431070 1531534 1660842
13889 1660842 1348154 982561 1156682 1519534 1194270 1078730 1339863 1375624 1610841 1337268
$$ packed form
13959B412589j08295o8366l5870J44125L9038m20810K89538L8781K705j04681
13949B188754k66245J33553l67431J27812o1109J89416l4964r9873m3381K94321
13939B060853M4009O6254n21508L82837q9696q4596j69821J66752J72496j51852
13929A875728j01592L3600k9156N3329k00980k54155M4662j5762J00592N11526
13919B017792n42168J2097M13619j08032m57716L23127k98842L59437J13633N923
13909A838870m27935J59774O451j07891K14093l71290K5774K96167m31354j01193
13899A101466L92303l6289j23590j6894j46984K06825K25698j71465J00464J29308
13889A660842l12688l65593J74121L62852l25264j15540K61133L5761K35217k73573
$$ plain form
13879 1337268 1321980 1282255 1281769 1293809 1276428 1161843 986131 1452089 1291175 1017242 1361773
13868 1361773 1152022 1260174 1034411 1097622 1096834 1120296 1066977 1116552 1130276 1053520 1173784
13857 1173784 1074881 922534 1075229 1075055 1177107 982035 1299504 1130427 770222 1430528
13847 1430528 984811 943840 1053326 862600 1130889 808728 844865 596544 787396 783064
13837 783064 908253 931492 616895 1014195 1082532 814703 958877 882229 1141713 962062
13827 962062 961807 1047730 964356 857925 998056 952733 748526 737721 411224 1061375 1147974
13816 1147974 865166 885339 1086678 878003 1039315 554343 593216 908354 983155 691662
13806 691662 592251 809732 790934 767705 606837 787154 774099 618572 960635 814181
$$ packed form
13879A337268j5288l9725m86J2040j7381j14585j75712M65958j60914k73933L44531
13868A361773k09751J08152k25763O3211p88K3462n3319M9575J3724p6756J20264
13857A173784r8903j52347J52695j74J02052j95072L17469j69077l60205O60306
13847A430528m45717m0971J09486j90726K68289l22161L6137k48321J90852m332
13837G83064J25189K3239l14597L97300O8337k67829J44174p6648K59484j79651
13827I62062k55Q5923q3374j06431J40131m5323k04207j0805l26497O50151Q6599
13816A147974k82808K0173K01339k08675J61312m84972L8873L15138P4801k91493
13806F91662r9411K17481j8798k3229j60868J80317j3055j55527L42063j46454
$$ plain form
13796 814181 850359 705387 925291 602496 956470 766459 999510 974913 995717 734907
13786 734907 962431 988814 567500 804776 962587 1047285 760296 719968 709654 460013
13776 460013 696908 836464 723477 565014 656848 930069 914022 494734 724576 588326
13766 588326 748813 674725 827575 1113047 700935 870744 867539 915609 439327 818454
13756 818454 787209 846639 655115 416452 885050 727081 811854 918730 644250 267468
13745 580207 1021276 698149 848863 632579 563687 702870 744048 304705 468032 559672
13735 559672 435156 563414 547169 706927 746890 812885 834331 825243 1037296 581634 504021
13724 504021 551826 514811 615354 797627 473679 556601 533679 490551 520753 710390 549543
$$ packed form
13796H14181L6178j44972K19904l22795L53974j90011K33051k4597K0804k60810
13786G34907K27524K6383m21314K37276J57811Q4698k86989m0328j0314k49641
13776D60013K36895J39556j12987j58463R1834K73221j6047m19288K29842j36250
13766E88326J60487p4088J52850K85472m12112J69809l205M8070D39327L79127
13756H18454l1245N9430j91524k38663M68598j57969Q4773J06876k74480B67468
13745E80207M41069l23127J50714k16284o8892J39183M1178C04705J63327R1640
13735E59672j24516J28258j6245J59758L9963O5995K1446r088K12053m55662p7613
13724E04021M7805l7015J00543J82273l23948Q2922k2922m3128L0202J89637j60847
$$ plain form
13713 549543 376880 750586 758788 807600 536678 275124 603414 338501 614056 443820
13703 443820 582110 395522 392246 636291 546519 417846 915735 619086 624665 465418
13693 465418 562568 685178 544064 561810 767024 599006 628062 640464 356435 540573
13683 540573 725997 491537 873136 580193 473283 249143 510936 515985 654951 416488
13673 416488 603369 246223 367153 473866 565206 532128 456152 316061 229098 691361
13663 691361 373146 283225 408023 625231 563571 482053 419596 441261 598999 407699
13653 407699 405879 270683 503746 487329 367287 305072 442934 257030 267761 260499 539075
13642 539075 664405 530926 508435 506645 715878 427033 -33535 622623 527247 445853 564261
$$ packed form
13713E49543j72663L73706Q202M8812k70922k61554L28290k64913K75555j70236
13703D43820J38290j86588l276K44045q9772j28673M97889k96649N579j59247
13693D65418R7150J22610j41114J7746K05214j68018K9056J2402k84029J84138
13683E40573J85424k34460L81599k92943j06910k24140K61793N049J38966k38463
13673D16488J86881B46223J20930J06713R1340l3078p5976j40091q6963M62263
13663F91361l18215q9921J24798K17208o1660q1518o2457K1665J57738j91300
13653D07699j820j35196K33063j6417j20042o2215J37862j85904J0731p262K78576
13642E39075J25330j33479k2491j790K09233k88845c3535F22623r5376q1394J18408
$$ plain form
13631 564261 447979 448142 692961 637606 396040 324326 392822 503559 258380 806660 257247
13619 407637 419909 412393 705061 541071 455456 397336 323452 597774 462217 242334 407595
13608 407595 338483 107628 350530 204508 413890 360500 514904 234424 548654 397408
13598 397408 237890 523258 564372 239343 684389 179286 276142 157123 155693 489442
13588 489442 -10436 247191 269852 288902 237096 232795 349127 494437 45816 495426 191415
13576 365277 575322 500783 333226 175350 265345 165324 316990 102209 407208 195557
13565 421866 30714 177503 220238 357924 493261 401653 507321 217104 527794 121903
13554 490736 633477 369789 191387 309269 529242 368651 391106 110190 324352 -92471
$$ packed form
13631E64261j16282J63K44819n5355k41566p1714O8496J10737k45179N48280B57247
13619D07637J2272p516K92668j63990q5615n8120p3884K74322j35557k19883J65261
13608D07595o9112A07628K42902j46022K09382n3390J54404B34424L14230j51246
13598C97408j59518K85368M1114B39343M45046A79286R6856j19019j430L33749
13588D89442a0436B47191K2661J9050n1806m301J16332J45310D5816M49610A91415
13576C65277K10045p4539j67557j57876Q9995j00021J51666A02209L04999A95557
13565D21866C0714J46789M2735J37686J35337r1608J05668B17104L10690A21903
13554D90736J42741k63688j78402J17882K19973j60591K2455A10190K14162i2471
$$ plain form
13543 193953 284548 298842 369667 478284 257334 322641 269070 273756 58155 285461 -66547
13531 240978 270340 125856 168747 123710 347715 330594 452163 286343 593619 508047
13521 508047 299770 286314 260833 191831 167437 417254 261876 236577 277206 328292 416841
13510 416841 349078 65139 -28413 197664 367059 250663 210027 471590 32003 451847
13500 451847 497371 278339 272025 176847 90393 293584 153924 151736 147410 214325 411285
13489 411285 341418 69476 107847 191526 314769 -28559 219840 430856 388585 -51756 390686
13477 371398 212196 440039 189029 625461 -133334 168323 514314 367101 266040 320430
13467 320430 220154 53850 355866 285557 294033 439780 69481 64214 322678 240369 176657
$$ packed form
13543A93953R0595J4294P0825J08617k20950O5307n3571M686E8155K27306f6547
13531B40978K9362A25856M2891m5037K24005j7121J21569j65820L07276q5572
13521E08047k08277j3456k5481o9002k4394K49817j55378k5299M0629N1086Q8549
13510D16841o7763F5139b8413A97664J69395j16396m0636K61563C2003M19844
13500D51847M5524k19032o314r5178q6454K03191j39660k188m326O6915J96960
13489D11285o9867F9476L8371Q3679J23243b8559B19840K11016m2271e1756C90686
13477C71398j59202K27843A89029M36432a33334A68323L45991j47213j01061N4390
13467C20430j00276E3850L02016p0309Q476J45747F9481n267K58464q2309o3712
$$ plain form
13456 176657 60940 503778 216013 243654 90618 204744 -133773 104510 91990 280243
13446 280243 220133 154153 389876 186644 493186 290585 674229 149179 236350 239718
13436 239718 388549 36611 82608 252814 29844 -64341 193667 243755 261396 388816 247918
13425 247918 134673 179122 328732 508742 270217 702958 -157983 141316 265996 283731
13415 283731 142419 226331 120882 12388 286217 153422 71630 -52187 350775 530133
13405 530133 186760 54270 305958 346079 250828 443423 256161 13974 177676 261996
13395 261996 246262 333875 299274 -136880 256534 107641 344499 263183 351322 100140
13384 356692 29137 177762 89822 6169 448329 355148 188299 15387 386358 300133 -118014
$$ packed form
13456A76657F0940M42838B16013K7641I0618J14126a33773A04510j2520J88253
13446B80243o0110o5980K35723A86644L06542k02601L83644A49179Q7171L368
13436B39718J48831C6611M5997J70206B9844f4341A93667N0088J7641J27420j40898
13425B47918j13245M4449J49610J80010k38525M32741a57983A41316J24680J7735
13415B83731j41312Q3912j05449A2388K73829j32795G1630e2187C50775J79358
13405E30133A86760E4270K51688M0121r5251J92595j87262A3974J63702Q4320
13395B61996j5734Q7613l4601a36880B56534A07641K36858q1316Q8139A00140
13384C56692B9137J48625q7940F169M42160r3181j66849A5387L70971q6225a18014
$$ plain form
13372 403224 187264 69223 -29368 217884 329396 426692 309742 435751 351614 806402
13362 806402 452339 263996 307886 492511 110123 120038 -25095 338808 231526 304777
13352 304777 566963 214423 80148 -89747 46898 263202 461687 354586 13005 646625
13342 646625 95768 353159 -182445 105942 340438 68996 218059 389748 305851 -40737
13331 100480 103667 395652 -40490 47182 -112040 196156 154517 3407 466377 334848 295510
13320 295510 113042 370582 -14601 247923 456313 240187 -130641 804878 216905 95017
13309 2861 30324 -174279 228905 94143 168381 381432 23590 -812 186576 195487 60268 -171053
13296 50199 -96398 339266 -195333 361696 -124910 -115667 160621 191325 -71947 158026 342439
$$ packed form
13372D03224A87264F9223b9368B17884J11512R7296j16950J26009q4137M54788
13362H06402l54063j88343M3890J84625A10123R915b5095C38808j07282P3251
13352C04777K62186B14423H0148h9747D6898K16304J98485j07101A3005O33620
13342F46625I5768K57391a82445A05942K34496F8996J49063J71689q3897d0737
13331A00480L187K91985d0490D7182a12040A96156m1639C407M62970j31529l9338
13320B95510A13042K57540a4601B47923K08390k16126a30641H04878B16905I5017
13309B861K7463a74279B28905I4143P4238K13051B3590h12A86576Q911F0268a71053
13296E0199i6398C39266a95333C61696a24910R243A60621L0704g1947A58026J84413
$$ plain form
13285 342439 99829 263910 250953 232273 291326 131674 21409 39448 227284 -163929 -198355
13274 -198355 -180613 60 258984 81558 -73061 153135 359525 503823 40940 465217 -98708
13262 71766 -80101 123692 9830 -12383 -163811 75227 -324703 173288 206748 -174258 191377
13250 43339 93524 257238 87093 629201 28493 -30139 403015 46919 95465 51945 358310
13239 358310 232738 163485 -99115 65934 260083 44079 128550 447276 4222 206310 220957
13228 220957 -179187 254563 203481 57461 372 -151614 187977 169011 -35637 134714 388645
13217 388645 77252 -455188 -116380 80082 -8475 329060 59892 -13939 340964 49082 191856
13206 191856 235846 3203 32400 141126 -85695 35906 -73037 28778 -2299 -54811 176346
$$ packed form
13285C42439I9829J64081j2957j8680N9053A31674B1409J8039J87836a63929l4426
13274a98355J7742F0K58924H1558g3061A53135K06390J44298D0940M24277i8708
13262G1766h0101A23692I830a2383j51428G5227c24703A73288L3460a74258A91377
13250D3339N0185J63714H7093N42108B8493c0139D03015D6919M8546m3520L06365
13239C58310j25572o9253i9115F5934J94149D4079Q4471L18726D222K02088J4647
13228B20957a79187B54563n1082E7461C72a51614A87977j8966c5637A34714K53931
13217C88645G7252d55188a16380H0082h475C29060E9892a3939C40964D9082J42774
13206A91856M3990C203K9197J08726h5695C5906g3037B8778b299n2512A76346
$$ plain form
13194 -3643 -8975 -114593 92278 249562 -93928 -120787 68915 140 261417 166805 287970 125770
13181 78848 -20471 58371 352824 58927 246355 -28608 -13761 72332 43232 -127738 415418
13169 -33674 332570 328424 -212406 -68156 228388 22925 11306 122662 -46986 107307 -114564
13157 -121965 72984 -299302 -71604 58534 357596 -13436 -108147 259083 214251 293138 197787
13146 197787 -22635 -166397 10824 63167 244029 625232 388649 226226 33048 319760
13136 319760 394479 378708 55935 -145559 466150 268451 97492 214333 313122 70166 467921
13125 467921 304748 290639 171864 -66887 134316 138537 147858 107760 204710 -56218 234767
13113 191108 362438 141067 187432 -9251 -108692 56863 58412 52194 28529 -179033 56373
$$ packed form
13194c643n332j05618I2278J57284i3928k6859F8915A40K61277r4612J21165A25770
13181G8848b0471E8371K94453E8927J87428b8608a3761G2332k9100a27738D15418
13169c3674C32570m146b12406f8156B28388B2925A1306J11356d6986A07307a14564
13157a21965G2984b99302g1604E8534K99062a3436r4711B59083m4832P8887r5351
13146A97787b2635j43762A0824N2343J80862L81203k36583j62423C3048K86712
13136C19760P4719j5771E5935a45559D66150j97699I7492J16841R8789G0166L97755
13125D67921j63173j4109j18775f6887A34316M221R321m0098R6950e6218B34767
13113A91108J71330A41067M6365i251r9441E6863J549o218k3665a79033E6373
$$ plain form
13101 148076 289385 -73811 141971 -29851 -54032 155865 154109 127092 99653 65001 59603
13090 59603 35089 -29415 50661 39511 -258851 229631 -245132 38107 220485 -170035 347675
13078 295829 -180957 30798 390959 41708 96589 -142630 424294 -28159 380087 125422
13067 -203427 322713 -383052 242616 320651 60188 80532 35485 -54440 221838 -9176 408771
13055 176519 145712 127091 -304635 132604 156426 287818 405212 186230 141877 -126360
13044 79540 -111810 197587 202882 352141 -30863 -101284 69186 369172 128556 -96523 -168153
13033 -168153 -219519 210574 455090 303653 137124 -202509 -66561 223063 272449 204499
13023 204499 -59057 173399 319703 -3829 -6455 -55093 260929 -22301 276320 398033 193980
$$ packed form
13101A48076J41309g3811A41971b9851k4181A55865j756k7017k7439l4652n398
13090E9603k4514b9415E0661j1150b58851B29631b45132C8107J82378a70035C47675
13078B95829a80957C0798L60161D1708N4881a42630D24294b8159C80087A25422
13067b03427C22713c83052B42616P8035F0188K0344C5485e4440B21838i176D08771
13055A76519l0807j8621c04635A32604K3822J31392J17394A86230m4353a26360
13044G9540a11810A97587N295J49259c0863p0421F9186K99986A28556i6523p1630
13033a68153n1366B10574K44516j51437A37124b02509f6561B23063M9386o7950
13023B04499e9057A73399J46304c829k626m8638B60929b2301B76320J21713A93980
$$ plain form
13011 321937 38164 -111493 157445 400620 139315 -61895 64927 283538 -123753 263536
13000 76315 463601 41995 -14022 89125 258935 -150101 -2152 -67829 -21873 23096 110568
12989 110568 120199 186215 35833 -224896 -71326 -11588 -341115 -152589 514560 182372 128450
12978 128450 95124 616663 197829 319560 181449 73584 116151 31583 53475 -279511
12967 316052 -36702 261208 17558 109626 -45264 -17866 -202830 258588 175695 333702 -111209
12955 206179 83760 -44610 169364 15398 -75013 54071 -229957 62198 49437 -3738 55898
12943 42420 -266905 -295766 391619 220783 -66869 63361 184183 84711 288979 47075 5550
12931 42222 258667 43898 140495 -201465 -220875 -116249 22456 75288 192903 226450 -59600
$$ packed form
13011C21937C8164a11493A57445K43175A39315f1895F4927K18611a23753B63536
13000G6315L87286D1995a4022H9125J69810a50101b152o5677b1873B3096Q7472
12989A10568R631O6016C5833b24896g1326a1588l29527a52589E14560A82372n3922
12978A28450l3326N21539A97829J21731j38111G3584M2567C1583K1892b79511
12967C16052c6702B61208A7558R2068d5264a7866j84964B58588q2893J58007a11209
12955B06179H3760d4610A69364A5398g5013E4071b29957F2198j2761c738E5898
12943D2420b66905k8861C91619j70836f6869F3361J20822H4711K04268D7075E550
12931D2222K16445D3898R6597b01465j9410J04626B2456N2832J17615L3547e9600
$$ plain form
12919 375908 91727 109911 -134174 -2142 8646 -24852 53194 277499 -257804 39944 30873
12908 30873 -166567 -300582 -57044 29384 57104 84211 236897 425421 309203 306535 143520
12896 -15521 185318 -81122 69669 173295 239922 52924 13708 217211 241823 187103 411996
12885 411996 18360 -83400 64995 -195613 107603 4149 -372073 -193081 162628 42545 -25902
12873 -89174 512277 13705 170774 111622 -372127 -160722 59305 460749 86176 -82108 121196
12861 106944 -5163 -143282 -161000 -28328 48243 169535 -97747 43522 89590 -80480 20537
12849 123578 -313321 105865 -302379 -112344 -253768 47326 -102627 94118 -21263 235453
12838 26762 71389 62816 21622 336894 -343777 -129228 264736 10188 -169599 197762 182933
$$ packed form
12919C75908I1727J8184a34174b142H646b4852E3194K24305b57804C9944r071
12908C0873a66567j34015e7044B9384K7720K7107J52686J88524j16218k668A43520
12896a5521A85318h1122F9669J03626O6627E2924A3708K03503K4612n4720K24893
12885D11996A8360h3400F4995a95613A07603D149c72073J78992A62628D2545b5902
12873h9174E12277A3705J57069n9152c72127a60722E9305M01444H6176h2108A21196
12861A06944e163j38119j7718b8328D8243J21292i7747D3522M6068h0480B0537
12849A23578c13321A05865c02379a12344j41424D7326a02627I4118b1263B35453
12838B6762M4627q573B1622L15272c43777a29228B64736A0188a69599A97762j4829
$$ plain form
12827 182933 -66466 -215936 -336056 -162540 -317627 9223 20530 -32472 247653 68661 165111
12816 165111 422793 4249 93990 175857 217106 -339297 288529 -79558 4807 185960 181568
12805 181568 214352 33717 -391157 -107067 -59659 86473 42619 466287 148405 -218440
12794 186603 -110273 63405 126281 -88450 -349682 27640 -38883 119137 36456 29761 223491
12783 223491 194053 -214301 -31959 68926 -188349 48285 -3572 92127 -82098 -60275 -278616
12772 -278616 -29255 94564 -70953 -33955 -52865 98241 107761 -189097 63324 -121792 -346435
12761 -346435 281899 46410 3091 -113684 -64317 37079 -259180 -91321 153777 -3257 154798
12749 192752 -70250 -129717 80995 215859 -117282 -48805 231713 281274 208606 167788 162937
$$ packed form
12827A82933f6466j49470j20120a62540j55087I223J1307c2472B47653F8661R6450
12816A65111K57682D249Q9741Q1867M1249c39297B88529g9558D807J81153m392
12805A81568L2784C3717c91157a07067M7408H6473D2619M23668A48405b18440
12794A86603a10273F3405O2876h8450k61232B7640c8883A19137C6456o695J93730
12783B23491k9438b14301c1959F8926a88349D8285c572I2127h2098K1823k18341
12772b78616b9255I4564g0953c3955j8910I8241R520a89097F3324a21792k24643
12761c46435B81899D6410C091a13684M9367C7079b59180i1321A53777c257A54798
12749A92752g0250n9467H0995J34864a17282d8805B31713M9561p2668m0818m851
$$ plain form
12738 162937 300718 146412 -149119 27230 252563 158757 -190999 -145719 88507 265754
12728 265754 480596 -260062 -369058 232126 138535 2015 60248 -221271 -154501 -20088 -108817
12717 -108817 -94913 374946 105135 66903 -123985 203827 -23621 100151 -8992 264649
12706 204071 233535 530097 81475 226505 326513 -16356 219904 159691 357857 90974
12695 -325251 281457 -158808 414284 364325 52626 182030 -121584 115439 41718 388164
12685 388164 -173100 12866 322594 -77024 1273 234518 223818 415622 69327 10172 51464
12674 51464 -28312 178161 323947 263393 -80631 294037 -63318 67157 146209 -272972 300383
12662 324900 4082 441089 471041 46587 66889 182032 87659 145729 73247 172573 267236
$$ packed form
12738A62937J37781A46412a49119B7230K25333r3806a90999M5280H8507J77247
12728B65754K14842b60062j08996B32126r3591B015N8233b21271O6770b0088q8729
12717a08817J3904C74946A05135l8232a23985B03827b3621A00151h992B64649
12706B04071K9464K96562H1475J45030J00008a6356B19904o0213J98166I0974
12695c25251B81457a58808D14284m9959E2626J29404a21584A15439D1718L46446
12685C88164a73100A2866L09728g7024A273K33245j0700J91804F9327A0172M1292
12674E1464b8312A78161J45786o0554h0631B94037f3318F7157P9052b72972C00383
12662C24900D082M37007K9952D6587K0302J15143H7659N8070p2482R9326R4663
$$ plain form
12651 267236 162033 196097 275407 84168 171529 -177210 1144 198749 -275730 -89906 66006
12639 -50244 -11539 -105073 49293 -22208 79769 117481 479672 185569 163789 -175479 5655
12627 433143 221201 264662 18701 362093 -168241 -83803 416259 132223 -90006 -38053
12616 83249 80892 86881 90783 -163487 -11715 -19698 -174776 99809 -243432 132122 107811 186011
12604 186011 166913 112232 -166472 -64737 -45531 230883 -148665 28752 247901 384886
12594 384886 338137 -177074 -127159 259172 206226 -119546 -4176 102201 -10805 269014 -117050
12582 6032 -80119 -65817 162031 -291269 -57560 -223994 -100657 278112 -173659 89971 -90080
12570 -93735 135093 -231398 321214 -31516 109088 243662 -138128 27429 148766 121535
$$ packed form
12651B67236j05203L4064P9310H4168Q7361a77210A144J97605b75730h9906F6006
12639e0244a1539r3534D9293b2208G9769L7712L62191A85569k1780a75479E655
12627D33143k11942M3461A8701L43392a68241h3803D16259A32223i0006c8053
12616H3249k357N989L902a63487a1715p983j55078I9809b43432A32122k4311P8200
12604A86011j9098n4681a66472f4737J9206B30883a48665B8752K19149J36985
12594C84886m6749a77074M9915B59172n2946a19546d176A02201a0805B69014a17050
12582F032h0119J4302A62031b91269e7560j66434a00657B78112a73659H9971i0080
12570i3735A35093b31398C21214c1516A09088J34574a38128B7429J21337k7231
$$ plain form
12560 121535 -65538 57681 -94351 161351 -272701 37712 102920 -167648 -98985 -265533 268698
12548 -9407 38231 -95717 -81025 346832 75918 98591 -124448 -249921 140091 -71253 213158
12536 120278 -269527 -33544 -324091 159260 284340 139495 -265900 61467 -75153 36093
12525 276455 -208340 63270 -207013 176024 -117558 147099 -181029 23942 247551 -113798
12514 -70887 256023 -71062 -267252 6095 -156764 164147 -10711 364074 -134790 113561
12503 139549 172476 155949 140801 109150 129911 229454 58850 -194947 500607 -56603 -13254
12491 -202645 -133843 -92141 64045 -87130 266641 8739 -164559 203689 -65923 158912 8483
12479 325367 23607 -181937 -30979 177158 -232806 249145 324525 -174478 -433717 110466
$$ packed form
12560A21535f5538E7681i4351A61351b72701C7712O5208a67648O8663j66548B68698
12548i407C8231i5717J4692C46832G5918K2673a24448j25473A40091g1253B13158
12536A20278b69527c3544k90547A59260J25080A39495b65900F1467g5153C6093
12525B76455b08340F3270b07013A76024a17558A47099a81029B3942K23609a13798
12514g0887B56023g1062j96190F095a56764A64147a0711C64074a34790A13561
12503A39549L2927j6527j5148l1651K0761R9543E8850a94947E00607e6603a3254
12491b02645O8802M1702F4045h7130B66641H739a64559B03689f5923A58912H483
12479C25367B3607a81937c0979A77158b32806B49145P5380a74478k59239A10466
$$ plain form
12468 272957 -227398 89281 -448758 -163099 12166 -9381 -60968 273509 -233948 -195392 187268
12456 122010 151530 -228461 -116571 171990 197681 13710 56475 -273806 97253 168230 -202399
12444 42713 53842 39578 -46022 98648 231853 -54783 243309 -9799 -109830 256682 -221931
12432 209405 -164142 -92643 13054 -138583 -10938 -159586 -91954 101302 285723 -150049
12421 425708 137413 -135763 106355 -63727 52146 -136002 313326 -357391 115190 168654
12411 168654 196366 83893 96518 26206 -96380 -40872 362442 114241 -33144 -161438 -180174
12400 -180174 -223171 -160839 164813 -42063 166641 -32688 -127253 202390 70817 133361 -60620
12388 314130 -76645 -101385 268997 173452 242935 128352 58326 94083 -90117 -73715 -152210
$$ packed form
12468B72957b27398H9281d48758a63099A2166i381n1587B73509b33948L8556A87268
12456A22010K9520b28461J11890A71990K5691A3710M2765b73806I7253P0977b02399
12444D2713J1129j4264d6022I8648J33205e4783B43309i799j00031B56682b21931
12432B09405a64142P1499A3054a38583a0938j48648O7632A01302J84421a50049
12421D25708A37413a35763A06355f3727E2146a36002C13326c57391A15190N3464
12411A68654K7712H3893J2625B6206i6380d0872C62442A14241c3144j28294j8736
12400a80174m2997O2332A64813d2063A66641c2688r4565B02390G0817O2544f0620
12388C14130g6645k4740B68997r5545O9483j14583E8326L5757i0117J6402p8495
$$ plain form
12377 -152210 -38712 8062 -356216 -194165 147375 51413 -227747 64084 128462 44084 -32457
12365 -252615 157958 -222262 -126706 390376 9872 183677 173860 -357114 -135995 64487 10581
12353 32451 76444 -200241 58267 43770 2403 245907 303629 128415 -147892 45355 -126341
12341 -52983 -127578 -77120 -221279 18520 79263 -207573 -216560 340097 12196 74955 -155842
12329 -144721 52619 130093 280969 -150960 1110 -92850 66003 257775 1426 28658 255399
12318 255399 -41619 -151225 -60650 -101614 -43362 213272 31903 324430 -204655 -194832 -68962
12306 -149957 24796 156744 120179 -51357 -365963 -42122 260134 394516 139622 -132089
12295 65066 -45419 -135773 55022 -211965 -45112 224469 171899 72887 234821 143653 -95490
$$ packed form
12377a52210c8712H062c56216J62051A47375E1413b27747F4084O4378D4084c2457
12365b52615A57958b22262R5556C90376I872J73805r817c57114a35995F4487A0581
12353C2451M3993b00241E8267j4497B403K43504N7722A28415a47892D5355a26341
12341e2983p4595N0458j44159A8520O0743b07573q987C40097A2196O2759a55842
12329a44721E2619P7474J50876a50960A110i2850F6003J91772A426K7232K26741
12318B55399d1619j09606f0650m0964d3362B13272C1903K92527b04655R823f8962
12306a49957B4796J31948l6565e1357l14606d2122B60134J34382A39622a32089
12295F5066d5419r0354E5022b11965d5112B24469n2570G2887J61934r1168i5490
$$ plain form
12283 44911 182120 -14674 -65433 -68093 85616 7976 -167512 201359 137358 19780 207075
12272 207075 58855 -10631 88994 -269356 -101181 103860 422033 -25311 334211 -5898 117550
12260 -361802 -186040 159556 -125382 -20201 142449 270743 207451 342518 117673 164337
12250 164337 -177467 3917 231054 138687 60942 198194 287130 208836 105514 214636 105387
12238 -67984 324662 -26139 -319098 165616 186844 362500 281092 326766 -36286 58909 73503
12227 73503 215591 388368 409978 -103408 -113666 78242 231963 436776 257392 251332 10485
12215 125437 124676 113463 -111405 29837 343358 -29069 -222524 50573 -70100 -170455 141977
12203 192881 -140183 133737 259896 235670 56473 17193 160829 181801 112425 12463 -11569
$$ packed form
12283D4911J37209a4674n0759k660H5616G976a67512B01359o4001A9780J87295
12272B07075E8855a0631H8994b69356a01181A03860L18173b5311C34211e898A17550
12260c61802J75762A59556a25382b0201A42449J28294o3292J35067A17673M6664
12250A64337a77467C917K27137r2367F0942J37252Q8936p8294j03322J09122A05387
12238f7984C24662b6139k92959A65616K1228J75656q1408M5674c6286E8909J4594
12227G3503J42088J72777K1610a03408j0258G8242J53721K04813j79384o060A0485
12215A25437p61j1213a11405B9837L13521b9069j93455E0573g0100j00355A41977
12203A92881a40183A33737J26159k4226E6473A7193J43636K0972o9376A2463a1569
$$ plain form
12191 188864 -3905 293810 247183 242777 -8477 123228 278889 -24314 9317 38310 -167808
12179 121815 35527 248798 -21501 164793 -56356 -121444 -120163 -78375 349331 121313 594302
12168 594302 48027 -72395 502315 -128939 157020 -18348 -51519 38583 180681 149378 366832
12157 366832 514729 162961 -66299 81413 138274 -40271 75560 -79873 22118 428993 5713
12145 -7559 -97225 191911 73501 108740 92364 354198 338595 427280 -198435 176304 -436837
12133 3136 226124 -50191 -124950 -89664 -201750 27587 182551 158737 48903 165959 44714
12121 -85544 -140770 204805 -72695 -268293 -138861 119155 174477 -61635 -47372 52846 -154052
12109 -244726 -297736 -50786 -395479 -6046 4286 376173 110062 -37144 7063 104742 10927
$$ packed form
12191A88864c905B93810m6627m406h477A23228J55661b4314I317K8993a67808
12179A21815C5527K13271b1501A64793e6356o5088J281M1788C49331A21313M72989
12168E94302D8027g2395E02315a28939A57020a8348l3171C8583J42098l1303K17454
12157C66832J47897A62961f6299H1413N6861d0271G5560g9873B2118M06875E713
12145g559q9666A91911G3501L5239j6376K61834j5603Q8685a98435A76304d36837
12133C136K22988e0191p4759L5286j12086B7587J54964k3814D8903J17056D4714
12121h5544n5226B04805g2695j95598J29432A19155N5322f1635J4263E2846a54052
12109b44726n3010e0786l44693f046D286L71887A10062c7144G063R7679A0927
$$ plain form
12097 -242092 -190582 24993 211489 -61057 -17977 -70217 91436 -164082 50986 -169313 -21925
12085 157207 -123338 -152184 -4449 -84219 -3115 -13865 18175 -163526 -234158 -3556 104769
12073 241782 99772 -109784 445737 43621 1244000 1500335 551213 83271 -60764 -309196
12063 -309196 9491 -246686 -91490 79374 -190300 475498 -266300 37003 -71863 101192 107949
12052 107949 -82290 -61323 122780 -138748 -25817 -177948 350424 -175746 -160812 166470
12041 109483 10860 296676 -430699 -41673 -110261 -180835 119103 3523 -215456 -143396 122642
12029 48640 61822 -83329 -167042 -154440 30771 -57109 -109972 -166561 230175 54812 229330
12018 229330 337926 134600 -28002 331447 379473 -69505 91900 -198076 83419 -192270
$$ packed form
12097b42092N1510B4993J86496f1057a7977n2240I1436a64082E0986a69313b1925
12085A57207a23338k8846d449p9770c115j0750A8175a63526p0632c556A04769
12073B41782I9772a09784D45737D3621J200379K56335E51213H3271f0764k48432
12063c09196I491b46686i1490G9374a90300D75498b66300C7003g1863A01192O757
12052A07949h2290K0967A22780a38748b5817j52131C50424a75746J4934A66470
12041A09483A0860K85816d30699d1673o8588p0574A19103C523b15456P2060A22642
12029D8640J3182h3329q3713J2602C0771e7109n2863n6589B30175E4812J74518
12018B29330J08596A34600b8002C31447M8026f9505I1900a98076H3419a92270
$$ plain form
12007 -62399 -17737 61362 202333 -184423 -37402 -55330 151791 216342 -9111 -143020 -111868
11996 -111868 49853 156751 71624 -403480 204440 103945 57896 22636 -369844 1027 -267060
11984 41996 -347449 -129261 -398932 -15718 -379004 65937 -235266 281336 293743 71011
11973 -99206 163119 -19373 -66636 -30289 -91861 148666 -284300 -164374 29653 4427 -112509
11961 58192 -12626 130275 36704 186011 56006 18304 -125462 -19942 -90594 -155394 -124903
11950 -124903 89596 75602 280825 -71122 -48243 -18566 439357 -11774 186265 59294 -67669
11938 163290 203431 -85377 -181205 235252 -269709 113696 83736 31566 54844 -307413 -321734
11927 -321734 -60385 78558 -52715 20573 -133788 63625 30930 32574 -34044 12500 122127
$$ packed form
12007f2399a7737F1362J40971a84423c7402j7928A51791O4551i111j33909L1152
11996a11868D9853J06898G1624d03480B04440j00495m6049B2636c69844A027b67060
11984D1996c47449a29261k69671a5718l63286F5937b35266B81336J2407G1011
11973i9206A63119a9373m7263c0289o1572A48666b84300J19926B9653D427a12509
11961E8192a2626A30275C6704J49307E6006A8304a25462a9942p0652o4800L0491
11950a24903H9596j3994K05223g1122K2879a8566D39357a1774A86265E9294f7669
11938A63290M0141h5377r5828B35252b69709A13696k9960C1566K3278c07413j4321
11927c21734f0385G8558e2715B0573a33788F3625C0930J644c4044A2500J09627
$$ plain form
11916 122127 -109023 47662 -54927 24373 -176351 -16036 161701 192956 -60582 319395 -205330
11904 -245959 -165199 -41069 -206639 -73728 29554 -332760 -5208 -234937 -22708 -521192 337198
11892 -287950 -164561 38781 -155940 -130586 69860 760 230971 -91716 278242 -112945 202900
11880 75112 -128526 -346435 50027 -37049 57838 234279 119930 -290307 81024 53201 -93625
11868 -33701 -46727 -238047 -228902 -65800 -91936 181745 -200339 245902 -38115 -202592 119662
11856 173650 135647 -157206 -80680 -106609 216940 -46464 -98390 -97127 -172475 53294 -10446
11844 -29272 203109 -173546 287805 70848 -319894 70937 -79529 -215861 -56324 109131
11833 -36041 -64354 46331 120448 18600 320449 106190 -110504 101906 -48163 140683 -14298
$$ packed form
11916A22127a09023D7662e4927B4373a76351a6036A61701L1255f0582C19395b05330
11904b45959Q0760d1069j65570g3728B9554c32760e208k29729b2708m98484C37198
11892b87950J23389C8781a55940K5354F9860G60K30211i1716B78242a12945B02900
11880G5112a28526k17909E0027c7049E7838J76441j14349b90307H1024k7823i3625
11868c3701j3026j91320R145f5800k6136A81745b00339B45902c8115j64477A19662
11856A73650l8003a57206P6526k5929B16940d6464n1926J263p5348E3294a0446
11844b9272B03109a73546B87805G0848c19894G0937g9529j36332e6324A09131
11833c6041k8313D6331P4117A8600L01849A06190a10504A01906d8163A40683a4298
$$ plain form
11821 90083 -12569 103037 -131667 -115056 -73732 129079 62882 -222640 -189831 -314272 218165
11809 -18822 -42899 -386830 43009 866 -237273 -68773 -150094 -29325 236722 92771 -12990
11797 43342 -308077 -161399 -21746 225765 42808 -94250 -136721 -42182 -222363 -53779 -143446
11786 -143446 236417 -45306 -185458 4747 -25229 110545 85435 69102 -154771 94610 -374833
11774 -80209 -257055 -148004 -95748 -135487 183146 220111 -63512 120247 165301 -125206 -37782
11762 -8236 -118335 91346 -169503 250693 84025 -186762 -409732 92005 234835 -52688 -68474
11751 -68474 -199426 -96703 -123346 -41861 147989 -102627 -372153 -206649 82127 430567
11741 430567 3235 -256113 194780 -29046 118192 -10900 236327 -158649 -60431 10466 -81351
$$ packed form
11821I0083a2569A03037a31667J6611M1324A29079F2882b22640L2809j24441B18165
11809a8822k4077l43931D3009H66b37273f8773q1321b9325B36722I2771a2990
11797D3342c08077J46678b1746B25765D2808i4250m2471d2182j80181e3779q9667
11786a43446B36417d5306j40152D747b5229A10545k5110j6333a54771I4610c74833
11774h0209j76846J09051N2256l9739A83146L6965f3512A20247M5054a25206c7782
11762h236j10099I1346a69503B50693H4025a86762k22970I2005J42830e2688j5786
11751f8474j30952i6703k6643d1861A47989a02627k69526J65504H2127L48440
11741D30567C235b56113A94780b9046A18192a0900B36327a58649f0431A0466h1351
$$ plain form
11729 -69050 187451 5991 -31918 -162775 77911 -92557 195031 -204177 -125662 1069 -37902
11717 -22941 194630 -192536 -47533 -83197 -186686 -118837 40464 309666 -163597 62860 622435
11706 622435 323864 113444 -671 -168492 112198 102377 -9776 -128539 137415 -33200 146050
11694 53646 253222 134804 154420 228519 155405 81428 144818 124193 78640 -8520 254004
11682 -161835 -202147 -54001 113329 -6005 40510 179914 176879 -3293 -201881 -36428 228905
11670 -277207 152184 345491 51211 -211395 122584 305727 -72198 253824 4268 -17679
11659 277364 23533 -32869 292910 -49639 -133222 259840 -124180 -157814 64250 222932 -395014
11647 70251 42730 -127167 -129946 -40235 -44118 210485 99584 95385 258722 19173 178141
$$ packed form
11729f9050A87451E991c1918j30857G7911i2557A95031b04177P8515A069c7902
11717b2941A94630a92536d7533l5664j03489O7849D0464K69202a63597F2860N59575
11706F22435k98571A13444f71j67821A12198r821i776j18763A37415c3200A46050
11694E3646J99576j18418J9616P4099p3114p3977O3390k0625m5553h520B54004
11682a61835m0312e4001A13329f005D0510J39404l035c293j98588c6428B28905
11670b77207A52184J93307E1211b11395A22584J83143g2198B53824D268a7679
11659B77364B3533c2869B92910d9639q3583B59840a24180l3634F4250J58682c95014
11647G0251k7521a27167k779d0235l883B10485I9584m199J63337A9173J58968
$$ plain form
11636 178141 50063 133637 129708 -134961 -282048 352863 164006 175643 229603 -144774 77807
11624 192091 -64202 -12198 96089 -181869 42863 39823 96532 -12212 38426 -159056 61663
11612 80111 -49417 169046 -23261 145587 224144 -163978 -42411 -248165 109588 -71410 450129
11600 326286 647406 -128240 -43059 -151368 266050 -126473 -126016 208565 76290 196501
11590 196501 220259 -88475 -85528 -190625 240864 175619 11557 -300742 25261 401996 -279166
11578 56294 -226516 -325378 133274 29732 119721 -161204 156414 -188546 -84043 186387
11567 239432 121777 59942 40913 90461 -135245 135591 -169452 154425 127121 -332156
11556 -22543 100268 -60402 388185 156544 162025 66390 13630 52721 -164641 7803 343217
$$ packed form
11636A78141E0063Q3574l929a34961j47087C52863A64006J1637N3960a44774G7807
11624A92091f4202a2198I6089a81869D2863l040N6709a2212C8426a59056F1663
11612H0111d9417A69046b3261A45587P8557a63978d2411k05754A09588g1410D50129
11600C26286L21120a28240d3059j08309B66050a26473M57B08565G6290J20211
11590A96501K3758h8475K947j05097B40864o5245A1557c00742B5261L76735b79166
11578E6294b26516r8862A33274B9732Q9989a61204A56414a88546h4043A86387
11567B39432j17655E9942j9029M9548a35245A35591a69452A54425k7304c32156
11556b2543A00268f0402C88185A56544N481F6390A3630L9091a64641G803L35414
$$ plain form
11545 343217 14274 352444 -196044 59144 215054 -65807 -168348 -58470 467119 297068
11535 297068 304291 317163 235741 -52121 -111081 164322 189149 387785 -204364 -69445 180629
11523 214432 -87712 229795 162763 119657 65731 59296 -299492 131230 321154 227827 92750
11511 86121 69759 229169 29603 -4297 121400 -58085 -92066 162658 86674 255543 51739
11499 215713 88493 -11494 51110 23022 238034 236912 -65064 186286 438137 208962 104687
11488 104687 77047 53481 279173 142114 201460 224980 295580 377274 -24620 361246 297636
11477 297636 -109432 217962 187109 403789 57303 -83122 204164 -93818 -198099 -96031
11466 146023 93815 203988 37368 277836 176990 -3915 -201093 380459 307518 334114 -30285
$$ packed form
11545C43217A4274L38170a96044E9144J55910f5807j02541e8470D67119j70051
11535B97068P223J2872q1422e2121n8960A64322K4827J98636b04364f9445A80629
11523B14432h7712B29795o7032m3106n3926o435b99492A31230J89924r3327I2750
11511H6121j6362J59410B9603d297A21400e8085l3981A62658p5984J68869E1739
11499B15713H8493a1494E1110B3022K15012j122f5064A86286K51851B08962j04275
11488A04687k7640k3566K25692j37059N9346K3520P0600Q1694b4620C61246o3610
11477B97636a09432B17962l0853K16680E7303h3122B04164i3818j04281i6031
11466A46023n2208J10173C7368K40468j00846c915j97178C80459p2941K6596c0285
$$ plain form
11454 -325964 58289 41184 -157768 -78196 35411 -149551 97281 83689 67908 25556 26110
11443 26110 -63455 -108067 330182 -46813 33441 167429 -415446 -214077 225160 141063 173045
11432 173045 161149 260134 15158 185202 -29033 132270 -43895 -157184 -56364 136484 -248613
11420 -92253 170564 -71801 -101975 185323 232644 -323894 94723 112223 -48437 135860 -47859
11408 52409 114611 -62198 -6454 34950 206986 78156 -71991 169337 -139422 409688 159577
11396 -38756 -56996 -49966 -301148 131564 137575 -44079 -312556 128881 -79391 -75456 -84093 166515
11383 102857 -157121 331656 -38955 4748 180987 -148716 236805 112876 213575 -90028
11372 -44747 78154 -430802 -65686 213353 -50209 14734 -146124 125948 -44503 -15522 65571
$$ packed form
11454c25964E8289j7105a57768g8196C5411a49551I7281j3592j5781B5556N54
11443B6110f3455m4612C30182d6813C3441J33988d15446K01369B25160q4097L1982
11432A73045j1896R8985A5158J70044b9033A32270d3895j13289e6364A36484b48613
11420i2253A70564g1801l0174A85323M7321c23894I4723J7500d8437A35860d7859
11408E2409O2202f2198f454C4950J72036G8156g1991A69337a39422D09688A59577
11396c8756j8240P030k51182A31564O011d4079k68477A28881g9391L935q637A66515
11383A02857a57121C31656c8955D748J76239a48716B36805A12876J00699i0028
11372d4747G8154d30802f5686B13353e0209A4734a46124A25948d4503a5522F5571
$$ plain form
11360 159611 -122606 -254765 85227 34947 786 -18576 11556 -148983 339353 78297 70298
11349 70298 73659 -276235 51706 -177666 95928 423731 6233 230954 -354179 -236604 26908
11337 -83374 -152210 -147419 -128103 -82094 -379073 78187 102297 126381 -69550 187445 -85789
11325 -195740 315666 -96022 -153072 114994 10858 -354961 -105064 42489 79033 106469 111620
11314 111620 212293 -320717 -315684 -62471 202128 -99113 -97814 -48109 -354033 148543 -206297
11302 -263866 -324273 -67024 219725 201942 -87582 -70156 7231 28269 -86505 -121940 -133296
11291 -133296 -20977 -205455 -83930 -57446 -28292 -113070 -242162 -64070 -198325 -32385 96377
11279 349451 307856 -65952 49927 126602 -282852 13543 -132023 -174387 67643 -19958 -80937
$$ packed form
11360A59611a22606j32159H5227C4947G86a8576A1556a48983C39353G8297p999
11349G0298L361b76235E1706a77666I5928L27803F233K24721c54179J17575B6908
11337h3374o8836M791J9316M6009k96979G8187K4110K4084f9550A87445h5789
11325a95740C15666i6022n7050A14994A0858c54961a05064D2489L6544K7436N151
11314A11620J00673c20717N033f2471B02128i9113J299d8109l05924A48543b06297
11302b63866o0407f7024B19725j7783h7582J7426G231K1038h6505l5435j1356
11291a33296b0977j84478h3930K6484b8292q4778j29092f4070j34255c2385I6377
11279C49451m1595f5952D9927P6675b82852A3543a32023m2364F7643a9958o0979
$$ plain form
11268 -80937 -169372 -23377 178709 123862 -14966 143520 -260972 93205 197737 75736 21259
11256 -98032 25067 51222 -104611 -16153 -170744 -322113 -110875 -206801 -114746 223659 -62144
11244 232747 161215 -226073 -248189 -38823 35169 5556 -35254 69531 63624 -65657 -175144
11233 -175144 54280 77951 -92166 -147079 -59512 -127371 -55023 -118753 67469 -110015 -66848
11222 -66848 114744 -386561 -33428 -23857 -149065 108402 332905 23670 276819 -3325 34931
11210 -195456 -43623 -115817 -248313 70630 -296129 175282 -24083 315557 -189976 -26294
11199 493629 -157227 -247222 82363 14838 -218405 69225 143202 41643 -171186 92597 -314377
11187 309397 74381 -165947 147655 10866 -404572 -275773 225430 -5224 -54912 -167402
$$ packed form
11268h0937q8435b3377A78709n4847a4966A43520b60972I3205J04532G5736B1259
11256i8032B5067K6155a04611a6153j54591j51369a10875r5926R2055B23659f2144
11244B32747p1532b26073k2116c8823C5169E556c5254F9531n907f5657j09487
11233a75144E4280K3671i2166n4913e9512o7859e5023o3730F7469a10015M3167
11222f6848A14744c86561c3428R571j25208A08402K24503B3670K53149c325C4931
11210a95456d3623p2194j32496G0630b96129A75282b4083C15557a89976b6294
11199D93629a57227q9995H2363A4838b18405F9225P3977D1643a71186I2597c14377
11187C09397G4381a65947A47655A0866d04572J28799B25430e224m9688j12490
$$ plain form
11177 -167402 154996 -88483 -3383 90843 -117266 339893 113490 184239 48830 -461913 -244381
11166 -244381 80559 -221028 58924 -56277 120965 -70791 191379 118299 -334993 -145231
11155 24217 -78789 73996 76354 -106398 199274 -186206 -107198 117485 -194046 -56829 40521
11143 81429 91122 -84722 55877 176418 -42632 -269041 111284 148598 46995 335261 -69549
11131 -99093 -77507 317912 233689 -186214 154936 26142 -245109 -80246 311940 94814 -86699
11119 332439 -36843 -256122 51686 -248837 -168057 -85095 -212227 -109280 -148019 307180
11108 -163817 57617 -41265 172051 276022 -42661 126246 206792 345625 19193 117472 118398
11097 118398 323077 257271 282582 190892 -55220 123389 156865 346494 323282 49591 -110040
$$ packed form
11177a67402A54996h8483c383I0843a17266C39893A13490P0749D8830d61913K17532
11166b44381H0559b21028E8924e6277A20965g0791A91379p3080c34993a45231
11155B4217g8789G3996K358a06398A99274a86206P9008A17485a94046e6829D0521
11143H1429R693h4722E5877J20541d2632k26409A11284L7314D6995K88266f9549
11131i9093K1586C17912q4223a86214A54936B6142b45109h0246C11940I4814h6699
11119C32439c6843k19279E1686b48837Q0780Q2962j27132J02947l8739C07180
11108a63817E7617d1265A72051J03971d2661A26246Q0546J38833A9193R8279R26
11097A18398K04679o5806K5311r1690e5220A23389L3476J89629k3212D9591a10040
$$ plain form
11085 82291 26323 287189 -139262 194388 280249 85849 190761 224708 234824 244538 326611
11074 326611 476064 348093 298203 451490 263442 557492 326323 465711 361897 509198
11064 509198 250487 489060 346258 497668 387048 574491 148124 374722 809710 673138
11054 673138 566174 810760 690390 696433 862242 776721 841499 527784 845740 852220 915650
11043 915650 644465 1028194 942315 754191 656142 771569 676779 881679 939566 752378
11033 752378 613070 576782 1001024 594147 985171 808772 517329 652455 797924 461710
11023 461710 516160 527699 767442 328550 489330 519244 603446 480643 672198 289859
11012 683649 304310 581331 592409 621402 541234 923329 649094 925921 657278 746069
$$ packed form
11085H2291B6323K60866a39262A94388Q5861H5849J04912L3947J0116R714Q2073
11074C26611J49453j27971m9890J53287j88048K94050k31169J39388j03814J47301
11064E09198B50487K38573j42802J51410j10620J87443A48124K26598M34988j36572
11054F73138j06964K44586j20370O043J65809q5521O4778l13715L17956O480O3430
11043I15650k71185L83729q5879j88124r8049J15427r4790K04900N7887j87188
11033G52378j39308l6288M24242m06877L91024j76399k91443J35126J45469l36214
11023D61710N4450J1539K39743C28550J60780K9914Q4202j22803J91555B89859
11012F83649C04310K77021J1078K8993q0168L82095k74235K76827k68643Q8791
$$ plain form
11002 746069 607689 967454 939021 788534 506172 417793 755897 782528 473007 863540
10992 863540 530999 769704 264558 983554 854282 739005 863280 907699 891770 1229231
10982 1229231 1387375 1322221 960027 1091190 1710903 1600240 1764960 1999094 2460868 2619142
10972 2619142 2761993 3109667 3157574 3050892 2672179 2519986 2317225 2041274 1915348 1506107
10962 1506107 1407976 1731680 1448130 1456362 1678863 1596245 1371629 1544396 1393618 1095311
10952 1095311 989815 1296784 603674 518071 467200 176520 357063 212255 332686 273292
10942 273292 345408 191636 115109 34718 239521 121587 182343 24555 -85662 31701 5534
10930 44230 -92635 179624 -68903 -308347 -111536 108224 -303383 279922 72886 -185431
$$ packed form
11002G46069j38380L59765k8433j50487k82362q8379L38104K6631l09521L90533
10992H63540l32541K38705B64558P18996j29272j15277J24275M4419j5929L37461
10982A229231J58144o5154l62194J31163O19713j10663J64720K34134M61774J58274
10972B619142J42851L47674M7907j06682l78713j52193k02761k75951j25926m09241
10962A506107r8131L23704k83550Q232K22501q2618k24616J72767j50778k98307
10952A095311j05496L06969F03674q5603n0871A76520J80543j44808J20431n9394
10942B73292P2116j53772p6527C4718K04803j17934O0756B4555h5662C1701E534
10930D4230i2635A79624f8903k39444a11536A08224c03383B79922G2886a85431
$$ plain form
10919 55226 296309 254277 34604 -193744 -286407 55584 -131029 131715 -116009 -7206 21883
10907 -224110 204202 -118892 197131 -223788 12128 5892 -195852 127583 81525 62842
10897 62842 103219 -275397 -216212 344995 -67256 -190499 -109579 146056 126171 -146861 -122066
10886 -122066 43091 34724 183732 15224 71819 -63289 -81392 20336 -160242 27923 89489
10875 89489 170319 37765 6410 31345 108528 392598 -100714 39774 21007 11980 -92201 174283
10862 -33721 53253 -117598 -348719 -180312 -34861 -273601 -8650 421601 36345 85209 -199192
10850 975 -4224 -150334 202381 128194 -367780 479 201776 -166120 -18176 -90678 1723 2772
10838 2772 -34997 51188 -41877 12375 -170689 -219460 85756 97611 -114345 192055 -176216
$$ packed form
10919E5226K41083m2032C4604a93744r2663E5584a31029A31715a16009g206B1883
10907b24110B04202a18892A97131b23788A2128E892a95852A27583m6058j8683
10897F2842M0377b75397N9185C44995f7256j23243Q0920A46056j9885a46861K4795
10886a22066D3091q367J49008A5224N6595f3289j8103B0336a60242B7923O1566
10875H9489Q0830C7765F410K4935P7183K84070a00714C9774j8767r027i2201A74283
10862c3721E3253a17598k31121J68407c4861k38740h650D21601C6345M8864a99192
10850I75d224j46110B02381p4187c67780D79K01297a66120a8176p2502A723J049
10838B772c4997E1188d1877A2375a70689m8771H5756J1855a14345A92055a76216
$$ plain form
10826 -239557 61431 -5630 116795 -10361 139144 -114372 -290089 -67886 19688 107851 11641
10814 -190376 65230 -58023 -289862 135614 60047 -415511 -86957 188139 -148240 -276517
10804 -276517 180834 90309 59881 -114388 61409 149191 -279275 117238 -192280 -95381
10793 161690 -28983 82380 32496 -44832 -228650 32978 140368 -137090 -185092 176330 269631
10782 269631 -143589 -106843 69782 -1480 183684 -104499 -199428 -38505 76888 -109650 -232899
10771 -232899 -294592 70593 86288 173891 16332 12700 231961 -133887 -143007 -393979 102756
10759 24044 -269886 118814 53323 122736 -8838 190238 -139 -73380 43393 99432 133316 -16723
10746 -27172 -184076 162538 275055 -39515 -336936 334782 -165533 51026 -374100 -50918
$$ packed form
10826b39557F1431e630A16795a0361A39144a14372j75717f7886A9688Q8163A1641
10814a90376F5230e8023k31839A35614F0047d15511h6957A88139a48240j28277
10804b76517A80834I0309l0428a14388F1409Q7782b79275A17238a92280i5381
10793A61690b8983H2380C2496d4832j83818C2978J07390a37090m8002A76330R3301
10782B69631a43589L6746F9782a480A83684a04499r4929c8505G6888a09650j23249
10771b32899o1693G0593J5695Q7603A6332l632K19261a33887r120k50972A02756
10759B4044b69886A18814E3323O9413h838A90238a39p3241D3393N6039L3884a6723
10746b7172j56904A62538J12517c9515k97421C34782a65533E1026c74100e0918
$$ plain form
10735 -325686 284407 113190 131964 53249 -138406 -90850 256463 -280302 83840 205922
10725 205922 -17979 -71189 61796 -92321 220545 -38569 -36497 -51100 -196964 -341302 34428
10713 -86072 -346753 -32474 -128150 -127850 -420311 -75581 95511 24317 164626 74305 27893
10701 -25717 185746 286847 -259147 -287958 -135511 40065 -156975 27647 132860 157591
10691 157591 -10167 -171092 -75819 -45104 -174123 28357 -149868 -19814 -131016 -177807 28384
10679 -469124 -202431 158392 -432393 42028 -111281 -46778 -162641 20279 13698 80614 -229352
10667 130559 -342965 139387 199575 -148632 120496 -154131 214910 -140816 -157613 64761
10656 138212 -376052 63934 -112499 -93474 -203669 -93106 -201512 -258220 -34300 -81549 -71497
$$ packed form
10735c25686B84407A13190J8774E3249a38406M7556B56463b80302H3840J22082
10725B05922a7979n3210F1796i2321B20545c8569K072j4603j45864j44338C4428
10713h6072k60681c2474r5676L00k92461g5581I5511B4317J40309G4305B7893
10701b5717A85746J01101b59147k8811a35511D0065a56975B7647J05213K4731
10691A57591a0167j60925g5819L0715j29019B8357a49868a9814j11202m6791B8384
10679d69124b02431A58392d32393D2028a11281d6778j15863B0279o581O6916b29352
10667A30559c42965A39387O0188a48632A20496a54131B14910a40816j6797F4761
10656A38212c76052F3934a12499J9025j10195i3106j08406n6708c4300m7249J0052
$$ plain form
10645 -71497 -14358 -98583 12684 94837 -41881 -149141 41764 -69857 -114781 -159429 -80834
10634 -80834 16144 -146120 172726 3392 210778 -164798 -240901 9028 -33571 -73430 32976
10622 249101 -425128 -157322 -135165 109175 -184485 176438 321548 129794 -211576 294639
10611 93519 116265 183750 -12152 -15141 -87458 -148030 -206016 -187366 -90735 123834 98655 -242683
10598 92830 -80307 -292455 149416 184106 -18671 -22366 -83865 114165 -45554 -140246 185091
10586 69808 -49155 -169416 -169066 -170456 -84497 -227906 9056 51800 -268023 -78967 -71731 20224
10573 -35939 86637 63003 715 29822 -48442 -129777 -27844 -51050 -84374 -97545 -102284 182863
10560 -222030 19171 138919 -313302 240719 33280 97055 116904 -144992 54951 -55541 -2837
$$ packed form
10645g1497a4358q4225A2684Q2153d1881j07260D1764f9857m4924m4648P8595
10634h0834A6144a46120A72726C392K07386a64798p6103I028c3571l9859C2976
10622B49101d25128a57322K2157A09175a84485A76438J45110A29794b11576B94639
10611I3519K2746O7485a2152k989p2317o0572n7986J8650i0735A23834k5179b42683
10598I2830h0307k12148A49416L4690a8671l695o1499A14165d5554r4692A85091
10586F9808d9155j20261L50j390h4497j43409I056M2744b68023g8967P236B0224
10573c5939H6637k3634G15K9107d8442q1335b7844k3206l3324j3171m739A82863
10560b22030A9171J19748c13302B40719C3280O3775J9849a44992E4951e5541b837
$$ plain form
10548 259568 -135441 298223 78319 -166696 345493 -84809 271674 78214 -382216 -50965
10537 118254 -178026 25877 182113 102892 6038 -58015 -266473 123874 -398456 -66840 239846
10525 -175476 -312574 -233874 -133768 63482 -12645 172736 214585 51566 -166624 -263204 -187212
10514 -187212 43110 -174647 -55838 82802 6887 -236370 -253432 -211293 5267 -97936 -123923
10503 -123923 -217122 -98375 -18606 85975 -108643 -86220 63275 -177826 -167664 -88602 30157
10491 361202 -84239 -217327 -69673 349602 -29795 -29302 68170 195152 -70245 16640 202272
10480 202272 807753 -162343 341734 -24790 -83322 316539 230408 421940 260419 -42115
10469 22395 38785 -237422 639937 111104 -430865 -135106 -23851 -392654 65243 154516
$$ packed form
10548B59568a35441B98223G8319a66696C45493h4809B71674G8214c82216e0965
10537A18254a78026B5877J56236p9221F038e8015k08458A23874c98456f6840B39846
10525a75476j37098P8700J00106F3482a2645A72736M1849E1566a66624r6580P5992
10514a87212D3110a74647e5838H2802F887b36370j7062M2139E267i7936k5987
10503a23923r3199i8375a8606H5975a08643K2423F3275a77826J0162P9062C0157
10491C61202h4239j33088f9673C49602b9795M93F8170J26982g0245A6640J85632
10480B02272O05481a62343C41734b4790n8532C16539q6131J91532j61521d2115
10469B2395J6390b37422F39937A11104d30865a35106b3851l68803F5243Q9273
$$ plain form
10459 154516 -178495 -258952 -290066 -114225 -248120 -246914 55580 -257351 -143578 -155591 45788
10447 6195 263438 122060 31418 194664 -8594 -10478 -185196 -134520 -171055 106316 -303346
10435 -448225 -122989 334425 -138987 -73531 -44908 52588 -84237 -83596 -160002 -77296 -211749
10424 -211749 156033 -244852 -36048 221494 346004 -322962 176650 47715 146896 120779
10414 120779 58277 -274973 -33126 180734 102095 -40149 -217271 -65385 -88074 -219378 -75835
10402 -99533 437284 79648 174848 90421 148170 177057 -31120 38998 -140224 -122600 155828
10390 14817 415242 -30378 208604 -85407 -11607 -37616 226940 211557 59986 -170632 -4134
10378 -14679 373819 320659 203465 248751 142430 165934 109026 236736 49658 51496 260289
$$ packed form
10459A54516a78495q0457l1114a14225j33895J206E5580b57351J13773j2013D5788
10447F195K57243A22060C1418J63246h594j884j74718N0676l6535A06316c03346
10435d48225a22989C34425a38987O5456K8623E2588h4237O41p6406g7296j34453
10424b11749A56033b44852c6048B21494J24510c22962A76650D7715R9181k6117
10414A20779E8277b74973c3126A80734p8639d0149j77122f5385k2689j31304g5835
10402i9533D37284G9648R5200q4427N7749K8887c1120C8998a40224J7624A55828
10390A4817M00425c0378B08604h5407a1607k6009B26940j5383E9986a70632d134
10378a4679C73819n3160j17194M5286j06321K3504n6908J27710D9658J838K08793
$$ plain form
10367 260289 351737 328331 487670 534959 346380 386389 56902 465627 -1936 47163 390830
10356 390830 244930 394691 65544 388195 225914 436590 585560 555057 381446 244020
10346 244020 547933 2139 323031 102603 448571 185326 365060 157869 346406 161802
10335 194000 38756 296265 217607 -212613 -49969 -67225 119729 67658 82193 -53275 136720
10323 462343 309425 76381 158825 479634 315012 -104962 265373 -19509 276422 -410704
10312 264770 -73056 -75505 279002 321 -242466 107429 -84105 136019 60701 -9058 -252997
10301 -252997 343127 190130 -39513 -67670 88861 386437 -44356 95657 210108 -205860
10290 -263326 -31245 34419 65593 -314403 104846 -320501 -171888 33447 113863 94205 -349446
$$ packed form
10367B60289R1448k3406J59339M7289j88579M0009E6902M08725a936D7163L43667
10356C90830j45900J49761F5544L22651j62281K10676J48970l0503j73611j37426
10346B44020L03913B139L20892A02603L45968A85326J79734A57869J88537A61802
10335A94000C8756K57509p8658b12613d9969j7256A19729n2071J4535e3275A36720
10323D62343j52918G6381Q2444L20809j64622a04962B65373a9509B76422d10704
10312B64770g3056k449B79002C21b42466A07429h4105A36019F0701i058k43939
10301b52997C43127j52997c9513k8157H8861K97576d4356I5657J14451b05860
10290b63326c1245C4419L1174c14403A04846c20501J48613C3447Q0416j9658c49446
$$ plain form
10278 66054 88138 40911 -284938 -110082 267868 -129023 59327 7501 124992 740 -16432
10266 -255981 109868 -23967 -147174 120954 35275 414651 292950 197799 358170 359692
10256 359692 562666 27652 313137 -61435 -36763 256753 80228 123286 -91674 147640 -156553
10244 -196582 -278878 -213218 200540 -134062 201852 68810 -136943 -70136 -72873 48714 -148243
10232 52032 -211432 -87312 20770 387550 -48060 -220278 -282705 -261140 98724 252145 142974
10221 142974 320931 -220169 -249554 -271485 -246128 -301114 132122 -189174 45469 -179365
10210 -44415 366082 -278910 255702 -622291 -35950 -251814 355592 -10568 76961 -124321
10199 -305963 -135556 -402911 -60859 -176642 159943 -226412 -93118 -427809 -495094 -136229
$$ packed form
10278F6054K2084D0911b84938a10082B67868a29023E9327G501J17491G40a6432
10266b55981A09868b3967j23207A20954C5275L79376j21701r5151J60371J522
10256C59692K02974B7652K85485f1435K4672B56753H0228M3058i1674A47640a56553
10244a96582q2296O5660B00540a34062B01852F8810a36943O6807k737D8714a48243
10232E2032b11432h7312B0770L66780d8060j72218o2427K1565I8724J53421j09171
10221A42974J77957b20169k9385k1931K5357n4986A32122a89174D5469a79365
10210d4415C66082b78910B55702f22291c5950k15864C55592a0568G6961a24321
10199c05963a35556k67355f0859j15783A59943b26412i3118l34691o7285a36229
$$ plain form
10188 110583 -24185 68455 64331 -255543 -142822 -171112 -345793 -73908 -238702 -16807 -194396
10177 -194396 -70921 -424147 -329229 -61879 -142397 158774 -125885 -91073 -113332 409796 -283153
10165 15690 176259 72991 100059 -156308 -308523 -156804 -136196 -205564 -175818 -69270 208024
10153 67439 249500 152550 -249359 -127464 205635 -101285 -193965 -101272 -198460 -223754 -171130
10142 -171130 -222038 -47882 154307 -169319 -5726 42096 -346910 -86481 -60065 -15071 40047
10130 -70582 -187713 251808 -3402 122077 273465 -175384 -9835 -74212 -369072 -106127 -29950
10118 -179363 -213442 -160678 -50679 -96042 -50988 305106 -334660 279198 -296932 -97853 -166757
10107 -166757 4684 -81997 198983 4278 -121861 -62872 -45 -119316 -328756 -159954 -174413
$$ packed form
10188A10583b4185F8455m124b55543J12721k8290j74681g3908j64794a6807j77589
10177a94396g0921l53226R4918f1879q0518A58774a25885L4812k2259D09796b83153
10165A5690J60569G2991K7068a56308j52215J51719K0608o9368K9746f9270B08024
10153F7439J82061r6950b49359J21895B05635a01285r2680R2693r7188k5294N2624
10142a71130n0908d7882A54307a69319e726D2096c46910h6481K6416a5071D0047
10130g0582j17131B51808c402A22077J51388a75384i835o4377k94860a06127b9950
10118a79363l4079N2764e0679m5363M5054C05106c34660B79198b96932i7853o8904
10107a66757D684h1997A98983D278a21861N8989d5j19271k09440a59954j4459
$$ plain form
10096 -174413 70900 129322 142713 345214 -81362 -266451 137198 -263858 -51135 226444
10085 -132751 52730 574 -116915 -247311 96183 -263198 -171984 -348990 213260 -139777 154986
10073 -229746 66199 -153915 -266791 -197816 -65537 -138730 -153486 -108755 58305 299388 52720
10061 256564 429315 -81796 14480 -187488 -37910 -22352 -482357 -317245 -82210 150464
10050 -55827 -150896 200756 208557 12254 111450 62027 206952 -256644 -159436 -146030 -211434
10039 -211434 -116175 50852 67730 -104435 -54934 -8169 -394836 -34552 56258 -173107 -31280
10027 -3567 -28140 -128367 -245422 457207 -86931 340372 -195520 -294643 337844 -74607 -266750
10016 -266750 93371 -87431 -285851 101157 -78742 15493 134488 22886 48079 115669 -352481
$$ packed form
10096a74413G0900N8422J3391K02501h1362j85089A37198b63858e1135B26444
10085a32751E2730E74a16915j30396I6183b63198R1214j77006B13260a39777A54986
10073b29746F6199a53915j12876O8975f5537p3193j4756M4731E8305K41083E2720
10061B56564J72751h1796A4480a87488c7910J5558m60005J65112h2210A50464
10050e5827r5069B00756P801A2254R9196m9423J44925b56644R7208J3406o5404
10039b11434R5259E0852J6878a04435M9501h169l86667c4552E6258a73107c1280
10027c567k4573j00227j17055D57207h6931C40372a95520r9123C37844g4607j92143
10016b66750I3371h7431j98420A01157g8742A5493J18995B2886K5193O7590c52481
$$ plain form
10004 -61030 -398075 7952 139644 216756 -129818 -128510 -43481 -280300 -200464 -277359 -141781
9993 -141781 -2764 -251671 62204 -58274 -112583 74946 -388834 -12184 -170301 123289 60921
9981 -65108 72345 -103922 118842 11014 13096 -148203 -360488 72015 -176938 -127764 42667
9969 -90913 87521 31652 188635 225053 65800 118187 -137998 -47201 -53074 31295 -146920
9957 235704 -148470 -94660 -303612 82437 190523 -36778 -84338 -26106 -177001 3344 -260671
9945 75217 -160472 62559 -170785 -534836 -114743 -159364 -49932 65863 96186 -87672 -244785
9934 -244785 -118625 -215327 53615 -79593 -6014 12143 -44291 -281455 289802 13988 -686394
9922 -44320 -272536 131076 -302621 146556 -76111 -259888 123460 89658 -210386 20886
$$ packed form
10004f1030l37045G952J31692P7112a29818J308d3481k36819P9836p6895J35578
9993a41781b764k48907F2204e8274n4309G4946c88834a2184j58117A23289F0921
9981f5108G2345a03922A18842A1014K082a48203k12285G2015a76938M9174D2667
9969i0913H7521C1652J56983L6418F5800N2387a37998d7201n873C1295a46920
9957B35704a48470N3810k08952H2437J08086c6778m7560b6106j50895C344b60671
9945G5217a60472F2559a70785l64051a14743m4621d9932F5863L0323h7672j57113
9934b44785a18625r6702E3615g9593f014A2143d4291k37164B89802A3988f86394
9922d4320k28216A31076c02621A46556g6111j83777A23460l3802b10386B0886
$$ plain form
9911 -363096 45912 66432 -117000 203191 -165017 148458 -164184 245476 -58799 109742
9900 -178969 107044 -35136 -96066 185366 67932 -146618 -55287 -28972 -151916 62805 -148429
9888 -241629 137722 -9552 -78333 -307714 62441 96235 27328 245916 -186023 -69511 -85839
9877 -85839 164724 -5557 -74063 -273353 -179265 101695 -517943 -15463 -89713 -112786 -54263
9865 -55948 -119327 -112653 -269485 -96646 -237610 -85446 -210407 103789 -171711 -118987 190804
9853 56857 -105528 152289 -16957 -50317 -335522 -380425 -176481 158307 -274559 -215204 -83727
9841 132288 14458 -180674 -28218 -105971 -338371 -304369 -406379 -98896 -146940 69358 -2900
9829 -64554 258625 -419673 -387362 59107 109336 -81897 11504 120599 -308276 288505 -57160
$$ packed form
9911c63096D5912K0520a17000B03191a65017A48458a64184B45476e8799A09742
9900a78969A07044c5136o0930A85366F7932a46618e5287K6315j22944F2805a48429
9888b41629A37722i552o8781k29381F2441L3794B7328K18588a86023f9511j6328
9877h5839A64724e557o8506j99290R4088A01695e17943a5463p4250k3073e4263
9865e5948o3379O674j56832i6646j40964h5446j24961A03789a71711N2724A90804
9853E6857a05528A52289a6957l3360k85205m4903a76481A58307b74559N9355h3727
9841A32288A4458a80674b8218p7753k32400L4002j02010i8896m8044F9358b900
9829f4554B58625d19673L2311E9107N0229h1897A1504J09095c08276B88505e7160
$$ plain form
9817 249776 227685 206440 1391 -83260 -232467 -145515 -134506 2182 25596 -218612 237941
9805 -179481 -150790 19148 -308949 -96272 1407 -401513 181931 -168292 -213410 274064 127506
9793 171403 148215 -216331 130080 -129234 -84619 61127 -89446 -1656 38026 -126439 -6192
9781 -137002 -241375 -56167 -107612 -205744 -88689 -147358 161603 345067 -292888 158076 -352328
9769 23491 -180255 -160322 161387 138121 312729 -408040 13035 -8527 -151837 -173382 -157081
9758 -157081 -79391 25501 -503557 -50268 81777 -300348 206170 -47082 -296419 -75416 -266210
9747 -266210 -152255 52701 -352280 -220473 -126557 98183 90630 -378509 17907 -116108 -468656
9736 -468656 -171352 -153207 -30269 -69092 -217150 150739 -199767 -60316 -268122 131919
$$ packed form
9817B49776k2091k1245A391h3260j49207Q6952J1009B182K3414b18612B37941
9805a79481K8691A9148c08949i6272A407d01513A81931a68292m5118B74064A27506
9793A71403k3188b16331A30080a29234M4615F1127h9446a656C8026a26439f192
9781a37002j04373e6167n1445r8132h8689n8669A61603J83464b92888A58076c52328
9769B3491a80255J9933A61387k3266J74608d08040A3035h527j43310k1545J6301
9758a57081P7690B5501e03557e0268H1777c00348B06170d7082k49337g5416j90794
9747b66210J13955E2701c52280J31807R3916I8183p553c78509A7907a16108l52548
9736d68656a71352J8145c0269l8823j48058A50739a99767f0316k07806A31919
$$ plain form
9725 6374 -332821 25628 -223066 -199063 -64799 81707 -380657 -287707 98009 76784 -358021
9713 -214107 -143594 -214333 197907 -87731 8226 -22171 48584 -36852 121840 -46069 -428390
9702 -428390 2298 -12580 -2116 185722 9829 -17938 -138561 -316405 173847 36589 -96122
9690 -120422 124290 -121059 234811 4914 -179130 -86810 406078 109095 156329 -223024
9679 -84161 106676 -113345 -83018 -18306 74116 -6133 -55115 -70285 -248657 67664 266581
9668 266581 -143850 -93789 -207970 217532 -98073 -173955 -99034 96574 53052 -98463 -236067
9657 -236067 -24122 -51015 -296517 -13915 341895 -70047 225304 -41281 7972 -236928 -248868
9646 -248868 -135220 -19158 13885 71930 -146730 -215791 94544 -74901 -239656 -183922 -191872
$$ packed form
9725F374c32821B5628b23066K4003f4799H1707c80657R2950I8009k1225c58021
9713b14107P0513p0739A97907h7731H226b2171D8584c6852A21840d6069l82321
9702d28390B298a2580b116A85722I829a7938j20623j77844A73847C6589i6122
9690a20422A24290a21059B34811D914a79130h6810D06078A09095M7234b23024
9679h4161A06676a13345L0327a8306G4116f133m8982j5170j78372F7664J98917
9668B66581a43850N0061j14181B17532i8073p5882P4921I6574m3522i8463j37604
9657b36067b4122k6893k45502a3915C41895g0047B25304d1281G972b36928j1940
9646b48868J13648a9158A3885N8045a46730o9061I4544g4901j64755N5734p950
$$ plain form
9635 -191872 -67742 -138105 103372 -129204 -329658 -283856 204746 -337029 16380 -378205
9624 -182652 57952 -30253 105677 -218839 -197327 -35989 -121561 -69126 -3933 193793 -222403
9612 -20255 -2627 -168043 -36952 73558 -79092 -26727 -176403 -151638 -101932 -207239 -269121
9601 -269121 -143695 -48604 -55688 -30430 -402687 153753 -242676 24430 -155842 414524 -325961
9589 80134 65833 81482 -1840 -112654 -159682 214420 -291276 -26264 80418 41705 183226
9578 183226 -51580 -217842 138494 -27028 18333 1371 18649 -130960 44004 -225756 -112081
9566 -373198 -360331 -321844 17783 -50922 -119659 -43649 179813 -142438 55878 -64366 -3452
9554 3736 -114904 32131 -285846 -259555 31349 -19331 -368170 -190767 141366 -179329 -126240
$$ packed form
9635a91872f7742p0363A03372a29204k00454M5802B04746c37029A6380c78205
9624a82652E7952c0253A05677b18839K1512c5989q5572N2435c933A93793b22403
9612b0255b627j65416c6952G3558g9092b6727j49676K4765M9706j05307o1882
9601b69121J25426d8604p084K5258l72257A53753b42676B4430a55842D14524c25961
9589H0134j4301J5649a840j10814m7028B14420b91276b6264H0418l8713J41521
9578A83226e1580j66262A38494b7028A8333A371J7278a30960D4004b25756a12081
9566c73198J2867L8487A7783e0922o8737d3649A79813a42438E5878f4366c452
9554C736a14904C2131b85846K6291C1349a9331l48839J77403A41366a79329N3089
$$ plain form
9543 -126240 -56068 89758 -175327 -62144 81538 -5901 -116014 -133988 201051 -9630 38754
9531 -23734 -240387 98185 -125841 202255 47983 -364981 159213 -267692 -279060 -76638 -40349
9520 -40349 28020 40075 -118524 200640 -157339 -294084 -190483 -364462 -35428 38982 45353
9509 45353 -352588 -62226 72252 -153981 -53270 -69888 -278340 -27008 123454 -79883 217232
9497 -89123 -34231 -90264 -52605 254593 -96044 -282006 -15604 -88932 215955 29446 -211825
9485 -215463 -392187 -175732 153035 -154350 -392115 222092 -305981 -131291 191740 122160
9475 122160 214093 -130935 -91998 -211879 -46793 22264 -58121 -49843 -25773 -179310 -152763
9464 -152763 18743 -34076 -211129 86124 -270737 -34336 -193573 -243782 158849 -36634 -13186
$$ packed form
9543a26240e6068H9758a75327f2144H1538e901j10113j7974B01051i630C8754
9531b3734k16653I8185a25841B02255D7983c64981A59213b67692j1368g6638L6289
9520d0349B8020J2055a18524B00640a57339j36745J03601j73979c5428C8982O371
9509D5353c52588f2226G2252a53981e3270j6618k08452b7008A23454g9883B17232
9497h9123c4231n6033L7659B54593i6044j85962a5604p3328B15955B9446b11825
9485b15463j76724a75732A53035a54350k37765B22092c05981a31291A91740o9580
9475A22160R1933a30935L8937j19881d6793B2264e8121Q278K4070j53537K6547
9464a52763A8743c4076j77053H6124b70737c4336j59237n0209A58849c6634a3186
$$ plain form
9452 -84223 156022 254 -59136 74778 131915 -19997 -63991 -87436 27783 45670 -125569 104068
9439 11845 -137793 -284810 -148443 89626 -338861 287919 115202 -174344 -109150 14389
9428 -22799 265920 -87167 43994 -15145 122385 58518 -265399 490 -163221 -26923 -47145
9417 -47145 -121799 28544 -212262 -183663 -68689 275313 -1240 83070 260300 -59917 144801
9405 -24793 -30814 47214 -2734 -55982 74562 -273988 -209691 -118298 164608 -189347 -58318 58160
9392 -44296 5141 -77075 -269942 -16489 -319863 -86752 -80429 38366 -96584 -283802 -296104 3540
9379 -62966 -177241 -32541 -200679 -110141 51604 -172329 -95871 5089 2838 -55046 -43584 -100046
9367 -100046 -209300 -386233 -102045 237663 -66297 -133529 -329477 -99699 -192966 -264559 -36647
$$ packed form
9452h4223A56022B54e9136G4778N7137a9997m3994k3445B7783J7887a25569A04068
9439A1845a37793j47017J36367H9626c38861B87919A15202a74344O5194A4389
9428b2799B65920h7167D3994a5145A22385E8518b65399D90a63221b6923k0222
9417d7145p4654B8544b12262K8599f8689B75313a240H3070J77230e9917A44801
9405b4793o021D7214b734n3248G4562b73988O4297R1393A64608a89347e8318E8160
9392d4296E141g7075j92867a6489l03374h6752O323C8366i6584j87218j2302C540
9379f2966j14275c2541j68138R0538E1604a72329P6458E089k251e5046J1462n6462
9367a00046j09254j76933a02045B37663f6297o7232j95948i9699r3267p1593c6647
$$ plain form
9355 19428 30075 12584 -226061 -278158 231873 -261644 -67138 -90723 -58677 71795 30086
9343 -119753 -49355 27017 -144065 -159194 -221963 272016 58122 -140362 70084 -63710 54863
9331 -152036 105165 -343203 -86074 -219227 -400524 71738 -110085 -175100 -112830 -5571 160896
9319 -239898 -94738 61675 90341 -438556 -361504 -52510 124036 -299244 62151 37090 -56264
9307 -294311 240278 64691 -173659 -86342 -331314 225646 257328 -271677 100503 -282784
9296 49797 -25553 -508872 4676 90863 -65158 -162374 -65478 91646 -123949 -96533 30367 -128086
9283 23602 -213173 10640 397795 -49536 184737 -313726 127692 -443835 317204 -39033
9272 -43809 -448510 25616 118195 -135986 -28127 -171240 -283063 -25509 61608 -157359 22133
$$ packed form
9355A9428J0647A2584b26061n2097B31873b61644f7138k3585L2046G1795C0086
9343a19753d9355B7017a44065j5129o2769B72016E8122a40362G0084f3710E4863
9331a52036A05165c43203h6074j33153j81297G1738a10085o5015O2270e571A60896
9319b39898i4738F1675K8666d38556P7052e2510A24036b99244F2151k5061e6264
9307b94311B40278F4691a73659h6342k44972B25646L1682b71677A00503b82784
9296D9797b5553m83319D676Q6187f5158r7216f5478I1646a23949K7416C0367a28086
9283B3602b13173A0640L87155d9536A84737c13726A27692d43835C17204c9033
9272d3809m04701B5616R2579a35986b8127j43113j11823b5509F1608a57359B2133
$$ plain form
9260 158966 -176231 -130708 -837 177823 -24819 -95061 -90072 183359 -128637 150168 -237239
9248 -236355 -17471 -14263 -3665 -290963 -210131 7180 -71026 130896 -55231 -92975 -43184 -3377
9235 -66780 -56477 -510030 108139 160495 -230292 -48219 196744 89522 139436 -3035 47854
9223 5852 -161692 -207074 120755 120923 -62107 -201821 -32895 257364 -151190 -383181 -325124
9212 -325124 181157 -80426 128835 -219779 -88455 105599 104130 -11340 70692 81635 -343112
9200 -123740 -101435 -122134 104327 -188164 297884 -191939 -524450 186299 -93704 -141760
9190 -141760 -139609 -155534 65110 77294 285430 -219852 63546 80951 161194 362001 45163
9178 -81536 199692 -56973 -188069 -57745 -124983 224408 91296 -85113 87183 75000 -232412
$$ packed form
9260A58966a76231M5523h37A77823b4819p0242M989A83359a28637A50168b37239
9248b36355a7471L208c665k87298Q0832G180g1026A30896e5231l7744d3184c377
9235f6780J0303m53553A08139N2356b30292d8219A96744H9522M9914c035D7854
9223E852a61692m5382A20755J68f2107j39714c2895B57364a51190k31991N8057
9212c25124A81157h0426A28835b19779h8455A05599j469a1340G0692J0943c43112
9200a23740K2305k0699A04327a88164B97884a91939l32511A86299i3704m8056
9190a41760K151j5925F5110J2184K08136b19852F3546J7405Q0243K00807D5163
9178h1536A99692e6973j31096e7745o7238B24408I1296h5113H7183j2183b32412
$$ plain form
9166 27744 94192 10075 -248870 -64154 165669 102467 118662 -179638 42388 48123 128056
9155 128056 25673 -176759 -157296 324421 33653 28697 -171781 -199599 -80165 32886 -164575
9143 -310682 91672 -423658 256026 -23881 135445 -209668 -292463 126767 -160387 -25539
9132 -53363 26234 -5437 -158046 -185803 214627 -129892 -67468 143398 -228482 -211652 -70787
9120 -37170 -67336 -96915 -219220 32453 -300480 395074 -9092 -63385 -209162 53810 26142
9108 -119488 59478 28783 -66804 -5405 -164044 -260039 -377278 -57010 -63273 -91056 -136734 -141573
9096 -141573 88473 -249462 179991 102609 71388 338077 -273815 98607 224443 -150585
9085 104344 -285825 -195285 -116818 47639 -30014 405044 -99675 73975 -163140 140867 -194089
$$ packed form
9166B7744O6448A0075b48870f4154A65669o3202J6195a79638D2388N735P9933
9155A28056B5673a76759J9463C24421C3653m956a71781k7818h0165C2886a64575
9143c10682I1672d23658B56026b3881A35445b09668q2795A26767a60387b5539
9132e3363B6234e437j52609k7757B14627a29892O2424A43398b28482J6830g0787
9120c7170l0166k9579j22305C2453c00480C95074i092n4293j45777E3810B6142
9108a19488E9478B8783f6804e405j58639r5995j17239e7010o263k7783m5678m839
9096a41573H8473b49462A79991p7382l1221K66689b73815I8607J25836a50585
9085A04344b85825R0540P8467D7639c0014D05044i9675G3975a63140A40867a94089
$$ plain form
9073 -152791 174014 -25485 -216104 -18609 -143175 285733 51569 -463086 -568789 115290
9062 -354280 13888 109210 -290048 -101261 -164009 71749 -88571 -173926 -101276 117318 -27683
9050 -167068 17793 44410 222368 -70103 85265 -21881 71700 -121326 43965 -6337 -144723
9039 -144723 -435529 206247 212386 -370253 -245233 -234388 -18912 -69879 -114272 -429646 77375
9027 -303222 116050 -160121 -344973 -90867 59935 4091 43015 -232674 -427170 119066 247396
9016 247396 -140162 138249 -24278 13550 42176 -69232 -6733 -243540 -161956 234854 -29889
9004 765 60351 53919 -232376 -178633 -98811 -183375 -169451 42633 102519 -210578 -267750 -247863
8992 -247863 -160505 -53842 28588 150500 -251435 -26619 -115657 -165323 -42808 -20786 164011
$$ packed form
9073a52791A74014b5485j90619a8609j24566B85733E1569d63086j05703A15290
9062c54280A3888R5322b90048a01261o2748G1749h8571q5355P2650A17318b7683
9050a67068A7793K6617J77958g0103H5265b1881G1700a21326D3965f337j38386
9039a44723k90806B06247O139c70253J25020J0845a8912n0967m4393l15374G7375
9027c03222A16050a60121j84852i0867E9935D091L8924b32674j94496A19066J28330
9016B47396a40162A38249b4278A3550K8626f9232f733k36807Q1584B34854b9889
9004G65N9586o432b32376N3743P9822q4564J3924D2633N9886b10578n7172J9887
8992b47863Q7358e3842B8588J21912b51435b6619q9038m9666d2808b0786A64011
$$ plain form
8980 -7114 -254246 -221928 124276 101781 -405198 -101577 42479 -111811 -5552 -198148 -159136
8969 -159136 -178545 -195238 102116 -276284 -107695 186588 -79658 121363 -57062 -13 90170
8957 7967 -180180 -213666 -202431 -122271 -294241 -248033 -24729 -451621 205560 -278345 -511099
8946 -511099 -80722 -166456 -90913 -25025 140499 52105 279302 -84980 -189810 -148250 -151575
8935 -151575 -257469 697564 32527 -123676 -388259 -134014 17765 -1650 305399 234951 783746
8924 783746 1751753 3810670 10788019 16481785 3607145 1152373 593131 542499 438092
8915 438092 115776 36574 -87416 -39282 245793 41744 276968 340612 -196796 141646 -216538
8903 121599 -151181 201859 -268507 -86184 -100243 36302 -443572 -39663 -91595 -246590 -234143
$$ packed form
8980g114k47132L2318A24276k2495d05198a01577D2479a11811e552j92596L9012
8969a59136j9409j6693A02116b76284a07695A86588g9658A21363e7062a3I0170
8957G967a80180l3486J1235Q0160j71970M6208b4729m26892B05560b78345k32754
8946e11099h0722q5734P5543b5025A40499E2105K27197h4980j04830M1560l325
8935a51575j05894F97564C2527a23676k64583a34014A7765a650C05399p0448N48795
8924G83746R68007K058917O977349N693766C607145A152373n59242n0632j04407
8915D38092A15776C6574h7416c9282B45793D1744K35224O3644a96796A41646b16538
8903A21599a51181B01859b68507h6184j4059C6302d43572c9663n1932j54995J2447
$$ plain form
8892 -234143 1047 58756 -82954 -73947 204760 152623 -94803 15581 -142633 256604 -51296
8880 -113950 -223056 17815 -81734 112223 -122432 -368287 -198669 -28248 157960 11875
8869 -50786 -117134 -209885 131239 93140 83190 15837 -340537 -142599 250246 -201591 -53057
8857 -267610 -279435 -109391 -150371 105068 -38697 6940 38106 -29312 -178294 -14422 115156
8845 -307565 -283523 -180545 116257 -163806 62791 128914 451665 85541 -135749 152407
$$ packed form
8892b34143A047N7709h2954R007B04760n2137i4803A5581a42633B56604e1296
8880a13950j09106A7815h1734A12223a22432k45855J69618b8248A57960A1875
8869e0786o6348r2751A31239l8099r950A5837c40537a42599B50246b01591e3057
8857b67610j1825a09391m0980A05068c8697F940L1166b9312j48982a4422A15156
8845c07565K4042J02978A16257a63806F2791O6123L22751H5541a35749A52407
$$ [...]
##END NTUPLES=NMR SPECTRUM
##END=
