##TITLE=AC1582_13IEXT2718_8214273_05kkdScx9Q
##JCAMPDX= 6.0         $$ Bruker NMR JCAMP-DX V2.0
##DATA TYPE= NMR SPECTRUM
##DATA CLASS= NTUPLES
##ORIGIN= BRUKER
##OWNER= Administrator
$$ 1.72 TOPSPIN		Version 2.1
$$ 2013-10-04 23:26:19.966 -0700  Administrator@X
$$ Compression mode = diff/dup
##.OBSERVE FREQUENCY= 400.02188249412
##.OBSERVE NUCLEUS= ^1H
##.ACQUISITION MODE= SIMULTANEOUS (DQD)
##.ACQUISITION SCHEME= undefined
##.AVERAGES= 8
##.DIGITISER RES= 22
##SPECTROMETER/DATA SYSTEM= spect
##.PULSE SEQUENCE= zg30
##.SOLVENT NAME= COFFEE_meoh
##.SHIFT REFERENCE= INTERNAL, COFFEE_meoh, 1, 14.98509
##AUDIT TRAIL= $$ (NUMBER, WHEN, WHO, WHERE, PROCESS, VERSION, WHAT)
$$ ##TITLE= Audit trail, TOPSPIN		Version 2.1
$$ ##JCAMPDX= 5.01
$$ ##ORIGIN= Bruker BioSpin GmbH
$$ ##OWNER= Administrator
$$ $$ E:\/data/COFFEE/nmr/AC1582_13IEXT2718_8214273_05kkdScx9Q/10/pdata/1/auditp.txt
$$ ##AUDIT TRAIL=  $$ (NUMBER, WHEN, WHO, WHERE, PROCESS, VERSION, WHAT)
(   1,<2013-10-04 23:26:13.607 -0700>,<Administrator>,<X>,<go>,<TOPSPIN 2.1>,
      <created by zg
	started at 2013-10-04 23:25:07.326 -0700,
	POWCHK enabled, PULCHK disabled,
       configuration hash MD5:
       C8 4E 4E 5D D3 5C D8 9E 9F 52 82 E0 59 8A DE 15
       data hash MD5: 64K
       64 BA BF 89 D3 E2 8F C9 EC 3B 61 0B 6C 7E 1E 99>)
(   2,<2013-10-04 23:26:16.466 -0700>,<Administrator>,<X>,<proc1d>,<TOPSPIN 2.1>,
      <Start of raw data processing
       efp LB = 0 FT_mod = 6 PKNL = 1 PHC0 = 0 PHC1 = 0 SI = 32K 
       data hash MD5: 32K
       23 07 BE D1 B3 45 4F 8F EC 34 33 E3 2F 39 8B 4D>)
(   3,<2013-10-04 23:26:16.732 -0700>,<Administrator>,<X>,<proc1d>,<TOPSPIN 2.1>,
      <pk PHC0 = 93.92212 PHC1 = 0 
       data hash MD5: 32K
       EC 72 7F 28 51 15 BC 8B 26 B7 4C CC 3C 01 08 B6>)
(   4,<2013-10-04 23:26:16.826 -0700>,<Administrator>,<X>,<proc1d>,<TOPSPIN 2.1>,
      <abs ABSG = 1 
       data hash MD5: 32K
       D6 82 9A D7 4E 0A 39 23 BB C8 28 CC F4 70 E2 D6>)
(   5,<2013-10-04 23:26:16.904 -0700>,<Administrator>,<X>,<proc1d>,<TOPSPIN 2.1>,
      <abs ABSG = 2 
       data hash MD5: 32K
       54 93 66 E2 84 11 A6 37 98 71 6A BF 6D 9C 6C 51>)
(   6,<2013-10-04 23:26:16.951 -0700>,<Administrator>,<X>,<proc1d>,<TOPSPIN 2.1>,
      <abs ABSG = 3 
       data hash MD5: 32K
       86 1F 15 66 E0 78 AD EA 6B 17 8B ED 70 A5 19 1D>)
(   7,<2013-10-04 23:26:17.013 -0700>,<Administrator>,<X>,<proc1d>,<TOPSPIN 2.1>,
      <abs ABSG = 4 
       data hash MD5: 32K
       5F F7 53 43 4E 45 60 B3 86 9C B1 2F 18 D8 62 A4>)
(   8,<2013-10-04 23:26:17.060 -0700>,<Administrator>,<X>,<proc1d>,<TOPSPIN 2.1>,
      <abs ABSG = 5 
       data hash MD5: 32K
       D0 59 0F 14 A2 C4 4D 06 48 B9 1B 62 BE EA 02 E6>)
$$ ##END=
$$ 
$$ $$ hash MD5
$$ $$ EF F5 BD A0 4C 47 EF 32 E8 F9 D1 FC EF 54 49 55
##$RELAX= 
##$RELAX= 
##$RELAX= 
##$RELAX= 
##$RELAX= 
##$RELAX= 
##$RELAX= 
$$ Bruker specific parameters
$$ --------------------------
##$DU= <E:\>
##$EXPNO= 10
##$NAME= <AC1582_13IEXT2718_8214273_05kkdScx9Q>
$$ [...]
##$TP= (0..7)
150 150 150 150 150 150 150 150
##$TP07= 0
##$TPNAME0= <>
##$TPNAME1= <>
##$TPNAME2= <>
##$TPNAME3= <>
##$TPNAME4= <>
##$TPNAME5= <>
##$TPNAME6= <>
##$TPNAME7= <>
##$TPOAL= (0..7)
0.5 0.5 0.5 0.5 0.5 0.5 0.5 0.5
##$TPOFFS= (0..7)
0 0 0 0 0 0 0 0
##$TUNHIN= 0
##$TUNHOUT= 0
##$TUNXOUT= 0
##$USERA1= <user>
##$USERA2= <user>
##$USERA3= <user>
##$USERA4= <user>
##$USERA5= <user>
##$V9= 5
##$VALIST= <valist>
##$VCLIST= <CCCCCCCCCCCCCCC>
##$VD= 0
##$VDLIST= <DDDDDDDDDDDDDDD>
##$VPLIST= <PPPPPPPPPPPPPPP>
##$VTLIST= <TTTTTTTTTTTTTTT>
##$WBST= 2048
##$WBSW= 25
##$XGAIN= (0..3)
0 0 0 0
##$XL= 0
##$YL= 0
##$YMAX_a= 623701
##$YMIN_a= -529196
##$ZGOPTNS= <>
##$ZL1= 120
##$ZL2= 120
##$ZL3= 120
##$ZL4= 120
##$ABSF1= 14.98509
##$ABSF2= -5.573092
##$ABSG= 5
##$ABSL= 3
##$ALPHA= 0
##$AQORDER= 0
##$ASSFAC= 0
##$ASSFACI= 0
##$ASSFACX= 0
##$ASSWID= 0
##$AUNMP= <proc_prof1d_extract_pilot.lims>
##$AXLEFT= 0
##$AXNAME= <>
##$AXNUC= <1H>
##$AXRIGHT= 0
##$AXTYPE= 0
##$AXUNIT= <>
##$AZFE= 0.1
##$AZFW= 0.1
##$BCFW= 0
##$BC_mod= 0
##$BYTORDP= 0
##$COROFFS= 0
##$CY= 15
##$DATMOD= 1
##$DC= 0
##$DFILT= <>
##$DTYPP= 0
##$F1P= 0
##$F2P= 0
##$FCOR= 0.5
##$FTSIZE= 32768
##$FT_mod= 6
##$GAMMA= 0
##$GB= 0
##$INTBC= 1
##$INTSCL= 1
##$ISEN= 128
##$LB= 0
##$LEV0= 0
##$LPBIN= 0
##$MAXI= 10000
##$MC2= 0
##$MEAN= 0
##$ME_mod= 0
##$MI= 0
##$NCOEF= 0
##$NC_proc= -8
##$NLEV= 6
##$NOISF1= 0
##$NOISF2= 0
##$NSP= 0
##$NTH_PI= 0
##$NZP= 0
##$OFFSET= 14.98509
##$PC= 1
##$PHC0= 93.92212
##$PHC1= 0
##$PH_mod= 1
##$PKNL= yes
##$PPARMOD= 0
##$PPDIAG= 0
##$PPIPTYP= 0
##$PPMPNUM= 2147483647
##$PPRESOL= 1
##$PSCAL= 4
##$PSIGN= 0
##$PYNMP= <proc.py>
##$REVERSE= no
##$SF= 400.02
##$SI= 32768
##$SIGF1= 0
##$SIGF2= 0
##$SINO= 400
##$SIOLD= 32768
##$SPECTYP= <>
##$SREGLST= <1H.CDCl3>
##$SSB= 0
##$STSI= 32768
##$STSR= 0
##$SW_p= 8223.68421052631
##$SYMM= 0
##$S_DEV= 0
##$TDeff= 65536
##$TDoff= 0
##$TI= <>
##$TILT= no
##$TM1= 0
##$TM2= 0
##$TOPLEV= 0
##$USERP1= <user>
##$USERP2= <user>
##$USERP3= <user>
##$USERP4= <user>
##$USERP5= <user>
##$WDW= 1
##$XDIM= 32768
##$YMAX_p= 440933834
##$YMIN_p= -629398
##$CURPLOT= <Network HP LaserJet P1505>
##$CURPRIN= <$Network HP LaserJet P1505>
##$DFORMAT= <normdp>
##$LAYOUT= <+/1D_H.xwp>
##$LFORMAT= <normlp>
##$PFORMAT= <normpl>
##$SURQMSG= 1
$$ End of Bruker specific parameters
$$ ---------------------------------
##NTUPLES= NMR SPECTRUM
##VAR_NAME=  FREQUENCY,     SPECTRUM/REAL,   SPECTRUM/IMAG
##SYMBOL=    X,             R,               I
##VAR_TYPE=  INDEPENDENT,   DEPENDENT,       DEPENDENT
##VAR_FORM=  AFFN,          ASDF,            ASDF
##VAR_DIM=   32768,         32768,           32768
##UNITS=     HZ,            ARBITRARY UNITS, ARBITRARY UNITS
##FACTOR=    0.250966925370066, 1,           1
##FIRST=     8223.43324360094, -79773,       23585
##LAST=      0,             95181,           -92133
##MIN=       0,             -629398,         0
##MAX=       8223.43324360094, 440933834,    0
$$ Real data points
##PAGE= N=1
##DATA TABLE= (X++(R..R)), XYDATA
$$ [...]
19526b21525p2154c558j02015j37638A27281h3421A86039D7320m431a59138g7303
$$ -221525 -293679 -3558 -105573 -243211 127281 -83421 186039 47320 42889 -159138 -77303
19514f4041C9234K03444d1170j99586O7015M5591A94679a56592B29889H9800M5640
$$ -64041 39234 242678 -41170 -240756 -173741 -128150 194679 -156592 229889 89800 135440
19503A35440b41189k2958d1461C70381A43789l436C3595a06259D08738a0287A87699
$$ 135440 -241189 -264147 -41461 370381 143789 140353 33595 -106259 408738 -10287 187699
19491a46605K6483j39089N4152H9029a02977a84l6174j59022j15736I742J0338
$$ -146605 -120122 -259211 -205059 89029 -102977 -184 -36358 -195380 -311116 9742 20080
19480B0080p299g9240A83023a33004I9074A173a54237A41034M0059L7605q7651
$$ 20080 12781 -79240 183023 -133004 99074 1173 -154237 141034 181093 218698 131047
19469A31047f9929K5208A94102c3554j97909A97101a03181F4298J80760g4136
$$ 131047 -69929 -44721 194102 -33554 -231463 197101 -103181 64298 245058 -74136
19458A30324b37026F8645d7503l76805a9821n5817J3407H7028b78645J4001B64163
$$ 130324 -237026 68645 -47503 -424308 -19821 -75638 -62231 87028 -278645 -264644 264163
19446b10286d1987j45658A56094a67624D6873a3490j8244A26456c7845H9009C9236
$$ -210286 -41987 -187645 156094 -167624 46873 -13490 -31734 126456 -37845 89009 39236
19434c8426j07248A15858c5603j32827a4675p7081j4958A19361D7656a82772A03313
$$ -38426 -145674 115858 -35603 -168430 -14675 -91756 -106714 119361 47656 -182772 103313
19422c8924j60212i3773A19927l4069f8919E8786d8104B67K19533B921h897A50701
$$ -38924 -199136 -93773 119927 85858 -68919 58786 -48104 267 219800 2921 -8897 150701
19409c6273A02114a6434r3328d3425l8348P844C2649a90462P7698J6279D3678
$$ -36273 102114 -16434 -109762 -43425 -81773 -73929 32649 -190462 -112764 -96485 43678
19397h3348j38974A36037n2075e428k34857Q8059H413c49820J55369L1407j12679
$$ -83348 -222322 136037 83962 -5428 -240285 -152226 8413 -349820 -194451 -163044 -275723
19386b75723h1477L634A91978e2942o4634J0833N1948j86504h1929k35570A50463
$$ -275723 -81477 -77843 191978 -52942 -117576 -106743 -54795 -241299 -81929 -317499 150463
19374b85922J19367C5915J900b15542A00994K4222K42484j05380c58329h6731
$$ -285922 -166555 35915 37815 -215542 100994 125216 367700 262320 -358329 -86731
19363C45982B2706c8509A02561b60388C8781K36291b64397H1038J24381c87792
$$ 345982 22706 -38509 102561 -260388 38781 275072 -264397 81038 205419 -387792
19352a12924j93113b2372k49808o6224P1398N2011c6532C38366H7787b89435r9731
$$ -112924 -306037 -22372 -272180 -338404 -267006 -214995 -36532 338366 87787 -289435 -389166
19341c89166b5639j8017F5199k2788M5890b3309j38939A39799C4939e8628j09771
$$ -389166 -25639 -43656 65199 42411 88301 -23309 -162248 139799 34939 -58628 -168399
19330a68399a8895j0389j70297l6573B65078h8272J3449B6558a4575A02397E1012
$$ -168399 -18895 -29284 -199581 -236154 265078 -88272 -74823 26558 -14575 102397 51012
19318E9484h8826a3116j08301f0573o5645E0670a03298C6676d6984C2098a86107
$$ 59484 -88826 -13116 -121417 -60573 -126218 50670 -103298 36676 -46984 32098 -186107
19306A63027o4541J43921b1521o1803l0488j51252J23598k07779a49018p4885
$$ 163027 98486 242407 -21521 -83324 -113812 -265064 -141466 -349245 -149018 -223903
19296b23903A00489g7142j32734P7216A41237P6970a88297l56292b7174r4114
$$ -223903 100489 -77142 -209876 -132660 141237 218207 -188297 -544589 -27174 -121288
19286a21288A53925c0171A69432b07856B45046c16037C83214a25123l40563A2073
$$ -121288 153925 -30171 169432 -207856 245046 -316037 383214 -125123 -465686 12073
19275b88576a3690j6940j88519h3713A19579b56556o2197f4386K7275k71071B21246
$$ -288576 -13690 -30630 -219149 -83713 119579 -256556 -318753 -64386 -37111 -308182 221246
19263A2640b47424K8309f5694j76892A2776C448L40560j70532k3309i6537A44795
$$ 12640 -247424 -219115 -65694 -242586 12776 3448 344008 173476 150167 -96537 144795
19251D9213a06651r0094I0123c0339j53925A6382i3325A7531b8389F8903a49185
$$ 49213 -106651 -196745 90123 -30339 -184264 16382 -93325 17531 -28389 68903 -149185
19239b69275a5289l49983J77094J7148N5432c197k61452a2354A40497N3367G578
$$ -269275 -15289 -365272 -188178 -171030 -115598 -3197 -264649 -12354 140497 193864 7578
19227a92935G9267R9927R6014d07021A08437d0451C6142a65489f6094r4707b3426
$$ -192935 79267 179194 275208 -407021 108437 -40451 36142 -165489 -66094 -160801 -23426
19215g4833E4639b60392a3019B9218c76771B4550a87509j51062J38603H515P0974
$$ -74833 54639 -260392 -13019 29218 -376771 24550 -187509 -338571 -199968 8515 79489
19204G9489g4794j84635P4664F6665B9401Q5984a60572k9429b9368G5578M7460
$$ 79489 -74794 -259429 -184765 66665 29401 115385 -160572 -190001 -29368 75578 123038
19193A23038a50970d7766E6462b07411C09295i4977F5027L07723b0230j37128
$$ 123038 -150970 -47766 56462 -207411 309295 -94977 65027 372750 -20230 -157358
19183a57358j62835n2022H5189b05070M4440B6631b29432B64682o5618a2761C3658
$$ -157358 -320193 -372215 85189 -205070 -160630 26631 -229432 264682 199064 -12761 33658
19171B84514e2072j61770a5489B88805a7489H2240a11109c3006k1697N491j40086
$$ 284514 -52072 -213842 -15489 288805 -17489 82240 -111109 -33006 -54703 -49212 -189298
19160a89298A54807J22886c13282O2368D0582K2276J29894b63704O3991C869J74108
$$ -189298 154807 277693 -313282 -250914 40582 62858 192752 -263704 -199713 3869 177977
19149A77977a6359j96860f5845h599m4219p9727d7494A07369N1083Q0315a38308
$$ 177977 -16359 -213219 -65845 -8599 -52818 -132545 -47494 107369 158452 238767 -138308
19137B02554h8981L7622j9149A40712b29434L6931i2610p495K2957j06474j33884
$$ 202554 -88981 -51359 -70508 140712 -229434 -192503 -92610 -100105 -77148 -183622 -317506
19126c17506h8096r7246E2277a47159e0820B32088j06658C216a43715D5382Q8570
$$ -317506 -88096 -185342 52277 -147159 -50820 232088 125430 3216 -143715 45382 133952
19115A33952k0693g049a231p4379j78921E3287b41820R2904A92996a92033j15801
$$ 133952 113259 -7049 -1231 -75610 -254531 53287 -241820 -148916 192996 -192033 -307834
19104c07834M438A09497f312r2063b7336p3392j18353K7904B1250J10506b35324
$$ -307834 -303396 109497 -6312 -98375 -27336 -100728 -219081 -191177 21250 131756 -235324
19092a79403A69294D713J56116C0764J53661G6841O7532N8736l7293b15136K4336
$$ -179403 169294 4713 160829 30764 184425 76841 144373 203109 165816 -215136 -190800
19081a90800j96818J85081B52348A0071J0089a21186M7934J7321j53080G3215
$$ -190800 -387618 -202537 252348 10071 20160 -121186 -73252 -55931 -209011 73215
19070A66708a73642g308q9878E385b76774B38659e9664o8015p8467k24821B37251
$$ 166708 -173642 -7308 -97186 5385 -276774 238659 -59664 -127679 -206146 -430967 237251
19058b3684j4589k5363G0329a12442j2026A02190b94519A98364a7889j86005q4660
$$ -23684 -38273 -63636 70329 -112442 -124468 102190 -294519 198364 -17889 -203894 -288554
19047b88554H9419a02362L5713C74758a03876j4620I9794a78209A73167b444q0465
$$ -288554 89419 -102362 -66649 374758 -103876 -118496 99794 -178209 173167 -2444 -82909
19036h2909n6822K707B32047J59541b46816d2786k2412A51896q930k0189O9037
$$ -82909 -139731 -137024 232047 391588 -246816 -42786 -65198 151896 142966 122777 191814
19025A91814a80453g3593b4708F4628d397k72193d6861j39269g6915C8446g6039
$$ 191814 -180453 -73593 -24708 64628 -4397 -276590 -46861 -186130 -76915 38446 -76039
19013c7707k28016Q3228e4187l8240j05173K2115O7639f987j00572b5838l30246
$$ -37707 -265723 -182495 -54187 -92427 -197600 -175485 -107846 -6987 -107559 -25838 -356084
19002c56084e7060j66131e7767A46593b03627a1227k66415J00011K8968g0910
$$ -356084 -57060 -223191 -57767 146593 -203627 -11227 -277642 -177631 -148663 -70910
18991d1683p2977n7987B6150b21227i0473r1618n9592a270F6429L490k0207c1466
$$ -41683 -114660 -172647 26150 -221227 -90473 -182091 -241683 -1270 66429 69919 49712 -31466
18978a33478j53309J37505F4917j2210d3493J2722B0768a41785E6736J93168B9188
$$ -133478 -286787 -149282 64917 52707 -43493 -30771 20768 -141785 56736 249904 29188
18966I5489D7605f8494A1369c80379D7519i677j716j81250B8119K31994o2954
$$ 95489 47605 -68494 11369 -380379 47519 -9677 -11393 -192643 28119 260113 197159
18955A97159a8696k2759A72122g1546j11018G2457b13910q7492B26291j9722J00744
$$ 197159 -18696 -41455 172122 -71546 -182564 72457 -213910 -301402 226291 206569 307313
18944C07313E8866J03665a20964j3580F9447b84857J27029k66588A26080e3394
$$ 307313 58866 162531 -120964 -134544 69447 -284857 -157828 -424416 126080 -53394
18933A61236o7414a69812F8940Q7232a22178O819c0842j67910a34A83394a53535
$$ 161236 93822 -169812 68940 156172 -122178 -115359 -30842 -198752 -134 183394 -153535
18921c89221a40019j31679n5930l5296a32945c0109k14657A21287k6349g4401
$$ -389221 -140019 -271698 -327628 -362924 -132945 -30109 -244766 121287 94938 -74401
18910e5606A84180H1853h5135j56084Q2261B60026e8493k51078a22318k81527
$$ -55606 184180 81853 -85135 -241219 -158958 260026 -58493 -309571 -122318 -403845
18900d03845a62659e3674j8452L1715A419a88638L4290f6735D5133a33925M5668
$$ -403845 -162659 -53674 -72126 -40411 1419 -188638 -154348 -66735 45133 -133925 -88257
18889h8257o5536A36645E7175n509l544K7519b10278A57307L6193b09646O1441
$$ -88257 -153793 136645 57175 51666 48122 75641 -210278 157307 193500 -209646 -148205
18878a48205j01594E3337b48811h8819L480B03756a17018A65438D8428b6881j89559
$$ -148205 -249799 53337 -248811 -88819 -85339 203756 -117018 165438 48428 -26881 -216440
18867b16440A92211n925c5583j86086A71590b984m7749m2672j13625B27687I3513
$$ -216440 192211 186286 -35583 -221669 171590 -2984 -50733 -93405 -207030 227687 93513
18855F0739b81861D6717N7586a46333c1476A23634P2404c75857d3040j25605p8117
$$ 60739 -281861 46717 104303 -146333 -31476 123634 196038 -375857 -43040 -168645 -246762
18844b46762a7312l89230B41726b65360e0604n5517n1885e7609r9528p3258D8857
$$ -246762 -17312 -406542 241726 -265360 -50604 -106121 -158006 -57609 -157137 -230395 48857
18832a5198j89455b4527j43650D1573a49507e1940r1871L2702C7775a40337B3974
$$ -15198 -204653 -24527 -168177 41573 -149507 -51940 -143811 -111109 37775 -140337 23974
18820B53953J58941B3844r504a03545E1744g3993F6491J53726c1114j37807j33454
$$ 253953 412894 23844 14340 -103545 51744 -73993 66491 220217 -31114 -168921 -302375
18809c02375F041N7118K1320b13124A30104c01235C46218a07543R19M544k9181
$$ -302375 6041 63159 84479 -213124 130104 -301235 346218 -107543 -106624 -102080 -131261
18798a31261A495a99361H3856K07184f8527A96158g6388A20161J4361d6528j01440
$$ -131261 1495 -199361 83856 291040 -68527 196158 -76388 120161 134522 -46528 -147968
18787a47968B12504a63135B11156b52002R348C47984a38321m214A77265c78560
$$ -147968 212504 -163135 211156 -252002 -242654 347984 -138321 -142535 177265 -378560
18776b27490m9321i2675n6958g169B40834J46008J3284b93308N1948j71027B4516
$$ -227490 -276811 -92675 -149633 -7169 240834 386842 400126 -293308 -241360 -412387 24516
18764h1053j75223C6149R5148h8695J3390o0864p9659r0973R6793j20356j4279
$$ -81053 -256276 36149 131297 -88695 -75305 -136169 -215828 -306801 -210008 -330364 -344643
18753c44643d8525j16215B98307a11990H8801i6926j05589B38335A3881a01382
$$ -344643 -48525 -164740 298307 -111990 88801 -96926 -202515 238335 13881 -101382
18742a97355A02710a21378J5266E5070a19792H6099a90202b1360B78830i2027
$$ -197355 102710 -121378 -106112 55070 -119792 86099 -190202 -21360 278830 -92027
18731a1592o2999h561k20536C1396c24867a17174A3574g5440A52946R8043j20062
$$ -11592 -74591 -8561 -229097 31396 -324867 -117174 13574 -75440 152946 250989 130927
18720A30927a79007O6957C77172A46991d4821l5524c241o790B36319a31613A39329
$$ 130927 -179007 -112050 377172 146991 -44821 -80345 -3241 -10031 236319 -131613 139329
18708A87723a15894c0960j10905O3623l99446A05591h8732d1447j24339A86858
$$ 187723 -115894 -30960 -141865 -78242 -477688 105591 -88732 -41447 -165786 186858
18697b8231q1866j04664c1025E8438g4535j14731c5963C08304j32779a03080J127
$$ -28231 -110097 -214761 -31025 58438 -74535 -189266 -35963 308304 175525 -103080 -101953
18686a01953j38657n2988A64024f4895D1384a24939m109A4308f3229K6439j77990
$$ -101953 -240610 -293598 164024 -64895 41384 -124939 -129048 14308 -63229 -36790 -214780
18675b14780A78079F318a21508M7424A17500a20537m37734C8626b5106q2033d4766
$$ -214780 178079 6318 -121508 -74084 117500 -120537 -558271 38626 -25106 -107139 -44766
18663D496L39O791c73238B6481b54061o011a18925r3502I6979b42465I5024e6721
$$ 4496 4835 11626 -373238 26481 -254061 -260072 -118925 -212427 96979 -242465 95024 -56721
18650A47922a10450A02529J59541a38594F7861C1270a36671j97254a40585O5215
$$ 147922 -110450 102529 262070 -138594 67861 31270 -136671 -333925 -140585 -75370
18640g5370a1702k4298j03599B9619a27920A28462a75443J3132J6169j19614j62507
$$ -75370 -11702 -36000 -139599 29619 -127920 128462 -175443 -162311 -146142 -265756 -428263
18629d28263J82893N8482Q5948I492K7992Q7424a09538j5117B21175D4343j6607
$$ -428263 -245370 -186888 -100940 9492 37484 124908 -109538 -124655 221175 44343 27736
18618B7736a66859o4559f0288k37482i798l01876A5563f2954A57563b60764K0048
$$ 27736 -166859 -231418 -60288 -297770 -9798 -311674 15563 -62954 157563 -260764 -240716
18607b40716c7279j43910j52911g3176j71986M3875J6616B97334j26489c39741
$$ -240716 -37279 -181189 -334100 -73176 -245162 -201287 -184671 297334 170845 -339741
18596a3017B74118a5171B22550L8538r0169a54856E1202c39133G3413d23311D2670
$$ -13017 274118 -15171 222550 261088 170919 -154856 51202 -339133 73413 -423311 42670
18584A53192e65786d2960F1874a7022j79967l26207A29571a19499A00504j8538
$$ 153192 -565786 -42960 61874 -17022 -196989 -523196 129571 -119499 100504 81966
18574H1966G618L01240a1619j06117N3560j61722A81886g2940D8872a02019I3045
$$ 81966 7618 308858 -11619 -117736 -64176 -225898 181886 -72940 48872 -102019 93045
18562C96007b3153j54172L8940e9217A2399d04568A32575B4813J73476a30566
$$ 396007 -23153 -177325 -138385 -59217 12399 -404568 132575 24813 198289 -130566
18551A38255n701k8929k7665B7990b47740J03018l28028A73518b36086e0314q7322
$$ 138255 132554 103625 75960 27990 -247740 -144722 -472750 173518 -236086 -50314 -137636
18540a37636b9878B39310B2984a34033L319O3126D552a27834j57165B60283m8485
$$ -137636 -29878 239310 22984 -134033 -130714 -67588 4552 -127834 -284999 260283 211798
18529B11798e4260E5606K43352b98432i0835A06510l3438K05661c07449B58349
$$ 211798 -54260 55606 298958 -298432 -90835 106510 73072 278733 -307449 258349
18518A24909a43283o3160N1973M0533I7968J06575g8062o6986d4380N649C42842
$$ 124909 -143283 -206443 -154470 -113937 97968 204543 -78062 -145048 -44380 -38731 342842
18506b52285G2238J5104i4883n005I0291J10660D3281Q0006c4301l8752l6139
$$ -252285 72238 87342 -94883 -99888 90291 200951 43281 123287 -34301 -73053 -109192
18495a09192n5545j21776A27017a89097j31909J00650e6393a8476j2477I5839
$$ -109192 -164737 -286513 127017 -189097 -321006 -220356 -56393 -18476 -30953 95839
18484a72475b8369A82755d04531c9213j15860m6390C7409J79127a5271o7732m8349
$$ -172475 -28369 182755 -404531 -39213 -155073 -201463 37409 216536 -15271 -83003 -131352
18473a31352d6863p869J6759j08197l289l4558H2221D0425a45146E9036J38041
$$ -131352 -46863 -54732 -37973 -146170 -149459 -184017 82221 40425 -145146 59036 197077
18462A97077a3965q9480k11473P4183e5758o881C01658A8004b5433m3671b4465
$$ 197077 -13965 -103445 -314918 -240735 -55758 -62639 301658 18004 -25433 -69104 -24465
18450c80238J08170H9966c02965i9753B25563k0357B074i3949k15574j2959i9117
$$ -380238 -272068 89966 -302965 -99753 225563 205206 2074 -93949 -309523 -322482 -99117
18438A75434q673a35888B57425a80381b5583B71862B9956a43184K2497G1855J57518
$$ 175434 166761 -135888 257425 -180381 -25583 271862 29956 -143184 -120687 71855 229373
18427B29373l3086J26408e979r6719I2330a80143P6955k41568c7585r4470l5185
$$ 229373 196287 322695 -5979 -102698 92330 -180143 -103188 -344756 -37585 -132055 -167240
18416a67240e3864C73688b55669H549b05812k70883a01870k7543M4228A09151
$$ -167240 -53864 373688 -255669 8549 -205812 -476695 -101870 -129413 -85185 109151
18405d4100B98694i9883C5319f4318B0730h2900K5665k26100J30893B12964B7044
$$ -44100 298694 -99883 35319 -64318 20730 -82900 -57235 -283335 -152442 212964 27044
18393B52468a78936A31112b71856a840l50787I4460D7229K37147b36889B9240
$$ 252468 -178936 131112 -271856 -1840 -352627 94460 47229 284376 -236889 29240
18382I6527c7754l2918A66284d0791F8296b1157j42031r6365j0690A48458a87731
$$ 96527 -37754 -70672 166284 -40791 68296 -21157 -163188 -259553 -270243 148458 -187731
18370C68827a59754I7345J10272F3489b59036F3283e0573m7567B87769a3945j91867
$$ 368827 -159754 97345 207617 63489 -259036 63283 -50573 -98140 287769 -13945 -205812
18359b05812Q2015G6522e9624a9189n7495L5707j46883j6171A99378a6498A18611
$$ -205812 -123797 76522 -59624 -19189 -76684 -40977 -187860 -204031 199378 -16498 118611
18347a69760r03A04926e8497j06783J5319d8035A20609c30644A57999e9972a3413
$$ -169760 -170663 104926 -58497 -165280 -149961 -48035 120609 -330644 157999 -59972 -13413
18335A7597b62000J19010M0453F1898i5464k94590a54092n8837C30761h33H073
$$ 17597 -262000 -142990 -102537 61898 -95464 -390054 -154092 -212929 330761 -833 8073
18323c72026J40441i3732B26065i4542G6806e2123k10546N7455j95643a77017
$$ -372026 -231585 -93732 226065 -94542 76806 -52123 -262669 -205214 -400857 -177017
18312I5560A8885J41730Q1810a0960A00533J07414p0818a34264A00071C0279J09900
$$ 95560 18885 160615 242425 -10960 100533 207947 137129 -134264 100071 30279 140179
18301A40179a69300B33869b01411A9384i6551a5612A1915c73135A41621a23027
$$ 140179 -169300 233869 -201411 19384 -96551 -15612 11915 -373135 141621 -123027
18290h9042j09300j5745A28615B2866P9186a5380m715B10543a18946B5022J05914
$$ -89042 -198342 -214087 128615 22866 102052 -15380 -20095 210543 -118946 25022 130936
18279A30936b50549h9888j184l57223a67267Q1352A2258c003p3872D1904b5376
$$ 130936 -250549 -89888 -91072 -448295 -167267 -85915 12258 -3003 -76875 41904 -25376
18267D0063r662a20480j70495A70234J22159g6174q0109j3810a0309k0999j37913
$$ 40063 30401 -120480 -290975 170234 292393 -76174 -156283 -170093 -10309 -31308 -169221
18256a69221K5807B10402p8621N8683a78315p0010D701a60809B83333b57027i084
$$ -169221 -143414 210402 131781 190464 -178315 -248325 4701 -160809 283333 -257027 -9084
18244B4616P8871i4520B22484b99721h0326k5747A04780a23377B61176r9808N6600
$$ 24616 103487 -94520 222484 -299721 -80326 -106073 104780 -123377 261176 161368 217968
18233B17968B4624a36412e2679E5594c3113D1020J93851B8555O509a46876f1619
$$ 217968 24624 -136412 -52679 55594 -33113 41020 234871 28555 35064 -146876 -61619
18221g3367m2838l06371B3626J06572a90369m7502B62751H236c3398j60830q4334
$$ -73367 -116205 -422576 23626 130198 -190369 -237871 262751 8236 -33398 -194228 -278562
18210b78562H2510O5353a17276A46550a47776D26119a61891j13025g575F6851
$$ -278562 82510 147863 -117276 146550 -147776 426119 -161891 -274916 -7575 66851
18199A1045a11870a6587E3753f3099k22333d1616G6387d49795A20322f4613B19361
$$ 11045 -111870 -16587 53753 -63099 -285432 -41616 76387 -449795 120322 -64613 219361
18187a67962P2109Q366k4624J8878D0280h86q121A14560a76433a7789j89625i5790
$$ -167962 -95853 -87487 -112111 -93233 40280 -886 -9007 114560 -176433 -17789 -207414 -95790
18174d2963k49054A26995c1579j11602M1036A032a72453a9341h224l04931A26173
$$ -42963 -292017 126995 -31579 -143181 -102145 1032 -172453 -19341 -8224 -313155 126173
18162b26022j382o5790R4341j19621d2191B96423f46n2913j39979G3451a72701
$$ -226022 -227404 -293194 -198853 -318474 -42191 296423 -646 -53559 -193538 73451 -172701
18150A5902b01066n3929j8442R4193h2557j02874B98525c40420A79309J27798
$$ 15902 -201066 -254995 -273437 -179244 -82557 -185431 298525 -340420 179309 307107
18140C07107B0529b4523q8831B3118e0529r833H8360a43363D5667Q9570a38695
$$ 307107 20529 -24523 -113354 23118 -50529 -60362 88360 -143363 45667 135237 -138695
18128a21430A81951a55505G7426J49769a04487k04802A28054a30612H9909g6922
$$ -121430 181951 -155505 77426 227195 -104487 -309289 128054 -130612 89909 -76922
18117b71775A05772C7260e5654j17484g9810c2060B15328M6109b19365C38630
$$ -271775 105772 37260 -55654 -173138 -79810 -32060 215328 261437 -219365 338630
18106F0288b5246A39473J00953a05906c2350j11447E4992r32O0489i8569r9344
$$ 60288 -25246 139473 240426 -105906 -32350 -143797 54992 54060 114549 -98569 -197913
18095a97913A12431b0056C79680d9486k22243d1070q762D52246a00757G2569o545
$$ -197913 112431 -20056 379680 -49486 -271729 -41070 -49832 452246 -100757 72569 66024
18084F6024a01396B20364G3584a30618A71075p6315i706E9287d061k66145C08559
$$ 66024 -101396 220364 73584 -130618 171075 94760 -9706 59287 -4061 -270206 308559
18072e02944i2922K3597j16244A50138N8240A2913a17728M7294k59856A22029
$$ -502944 -92922 -69325 -185569 150138 208378 12913 -117728 -70434 -330290 122029
18061g332B49811a37054f6601l6748M6492E4137a4580b832A2372J88618M1829
$$ -7332 249811 -137054 -66601 -103349 -56857 54137 -14580 -2832 12372 200990 242819
18050B42819F3445k4825b91592C25186b71521G6055h8503A42945K90415A71713
$$ 242819 63445 38620 -291592 325186 -271521 76055 -88503 142945 433360 171713
18039a64765j85541K3613B22527c4348A71543c2468A601J21702a46219j18961
$$ -164765 -350306 -326693 222527 -34348 171543 -32468 1601 123303 -146219 -265180
18029b65180O1845c408C02988A32781j1245J21503r7105a9045j44036A74733D6984
$$ -265180 -203335 -3408 302988 132781 121536 243039 145934 -19045 -163081 174733 46984
18017E2444A7783b6807q1236p3167m6914A4822J00195f377o9987C48795a79093
$$ 52444 17783 -26807 -108043 -181210 -228124 14822 115017 -6377 -76364 348795 -179093
18005H807a11595K7574M1408k02774A66808b91662A86247i3646B31416B8060a2818
$$ 8807 -111595 -84021 -42613 -245387 166808 -291662 186247 -93646 231416 28060 -12818
17993A3907J22918j4131i1841l5317C48451b46455A80982b44949M3936C69021
$$ 13907 136825 122694 -91841 -127158 348451 -246455 180982 -244949 -201013 369021
17982B72322e59947B7116P9417G341J07675i5811H3624J08081G5701a6182C1784
$$ 272322 -559947 27116 106533 7341 115016 -95811 83624 191705 75701 -16182 31784
17970A63455c05864O899I0716a08948A37360m6875h6417j15390A36900f2668A38882
$$ 163455 -305864 -298965 90716 -108948 137360 90485 -86417 -201807 136900 -62668 138882
17958B05483h2265n6115l8213o0385D0182a00336B05282k3441E63P4227a05938
$$ 205483 -82265 -138380 -176593 -236978 40182 -100336 205282 181841 563 74790 -105938
17946f8566A92678f7l69572A77821M150D7718j3592b51969i4414a2565A5047b66631
$$ -68566 192678 -67 -369639 177821 181971 47718 34126 -251969 -94414 -12565 15047 -266631
17933A7096c8811d902k32640e2861J3595A49519c53884J40203f1376A33729a08014
$$ 17096 -38811 -4902 -237542 -52861 -39266 149519 -353884 -213681 -61376 133729 -108014
17921I9849c54596H8559b23586O7099f002j9757H5868d65149I9911O1074b7973
$$ 99849 -354596 88559 -223586 -156487 -6002 -25759 85868 -465149 99911 160985 -27973
17909g2242A5992L14261f4256j67502D6033a1851D3523M2167c9087k03782a15109
$$ -72242 15992 330253 -64256 -231758 46033 -11851 43523 85690 -39087 -242869 -115109
17897C62520a24232H0552Q4804c12414A38348r524a24008l6714A92159q0060Q1316
$$ 362520 -124232 80552 165356 -312414 138348 128824 -124008 -160722 192159 112099 193415
17886A93415M851H1925a43137L0792A75687b94668D3588J16104e6932n0558m7103
$$ 193415 198266 81925 -143137 -112345 175687 -294668 43588 159692 -56932 -107490 -154593
17875a54593n1407A35408Q9476d0302B57677j10239b10684B30950O7092G7790
$$ -154593 -206000 135408 224884 -40302 257677 147438 -210684 230950 298042 77790
17864h3492g175A32102b29016I3715a07696B3986d202l6601H4503a20469H666
$$ -83492 -7175 132102 -229016 93715 -107696 23986 -4202 -40803 84503 -120469 8666
17852H8969p689C8734j6219a87384C4902J91645a30730H3811J00039a53443I2526
$$ 88969 81280 38734 22515 -187384 34902 226547 -130730 83811 183850 -153443 92526
17840b32981m6461A34722a06770c6530o9520L6165j3528C292N0579a4734k49881
$$ -232981 -279442 134722 -106770 -36530 -106050 -69885 -83413 3292 53871 -14734 -264615
17829b64615O5537j1658c7500n3923j4939H0197e8699I2354J63083a1577F4033
$$ -264615 -199078 -210736 -37500 -91423 -106362 80197 -58699 92354 255437 -11577 64033
17817A72211l5328b13071K6288C9660O5658N0551J2145a29735Q307C4969M3376
$$ 172211 136883 -213071 -186783 39660 105318 155869 168014 -129735 -121428 34969 78345
17806G8345b39668B92805f6600j52866H0026b12171d5723I350b22460a2524j14454
$$ 78345 -239668 292805 -66600 -219466 80026 -212171 -45723 9350 -222460 -12524 -126978
17795a26978A37793d0145m8844o893H2243J0949K91775J19475k46059a01885A1548
$$ -126978 137793 -40145 -88989 -95882 82243 93192 384967 504442 258383 -101885 11548
17783a75798k9597G6284a01867D1804J22473e7128A75155L5126R2075h0943n0915
$$ -175798 -205395 76284 -101867 41804 164277 -57128 175155 210281 302356 -80943 -131858
17772a31858D23598A88875B698L7519m74K12016M6685b69686e8902k4376k83574
$$ -131858 423598 188875 2698 40217 39743 251759 298444 -269686 -58902 -83278 -366852
17761c66852B32853k8103J6316F0035K21675a08909l7634E13028B31628L1228
$$ -366852 232853 204750 221066 60035 281710 -108909 -146543 513028 231628 262856
17751B62856c05030g7275l6965A35871k5320J9457b4418A92300f2617g737B35863
$$ 262856 -305030 -77275 -114240 135871 110551 130008 -24418 192300 -62617 -7737 235863
17739C2068g6706H2769K32371a50225c9213D4650M5521b14302e7468k04766k8742
$$ 32068 -76706 82769 315140 -150225 -39213 44650 90171 -214302 -57468 -262234 -290976
17728b90976B42371k2534A08642j3876J4988d146J031m6216k6090A53761f5040
$$ -290976 242371 219837 108642 94766 109754 -4146 -3115 -49331 -75421 153761 -65040
17716b33604E3440J5437a88092c865A5475h7981n6035A74249g5454k77519a4947
$$ -233604 53440 68877 -188092 -3865 15475 -87981 -144016 174249 -75454 -352973 -14947
17704A77088j3610K16786C7971b22951n9403B60113f782k16983A9968P4189a59091
$$ 177088 163478 380264 37971 -222951 -282354 260113 -6782 -223765 19968 94157 -159091
17692e3295G8227K25017A32772d46654A35297O4951b25875G8297f517H4337L17972
$$ -53295 78227 303244 132772 -446654 135297 200248 -225875 78297 -6517 84337 402309
17681D02309j04022j42624O9232b74669a00479E1292g3577p6695k42420B40166
$$ 402309 298287 155663 224895 -274669 -100479 51292 -73577 -150272 -392692 240166
17670G0502J26040b76295i9307j56453R7137g1180n31k12307O4587A31438f9431
$$ 70502 196542 -276295 -99307 -255760 -158623 -71180 -71711 -284018 -219431 131438 -69431
17658a59083j6474D0125R4a8670m9427A67033b7510j12556B08485a68983J1352
$$ -159083 -175557 40125 40219 -18670 -68097 167033 -27510 -140066 208485 -168983 -157631
17647a57631A89830J86321D8992b34633E2826j2962a09901j60867B6715J00847
$$ -157631 189830 376151 48992 -234633 52826 39864 -109901 -270768 26715 127562
17637A27562P0213i2939c5285j6203p5019D68447a53334d2032j17795A10287C3442
$$ 127562 197775 -92939 -35285 -51488 -126507 468447 -153334 -42032 -159827 110287 33442
17625D6380b43880B28178A12143i9067C5451b7121a0694k3155B568Q3085l9877
$$ 46380 -243880 228178 112143 -99067 35451 -27121 -10694 -33849 2568 85653 45776
17614D5776b20456D89683b08669R8261M0364A58127m0565O912F485Q0722R3013
$$ 45776 -220456 489683 -208669 -110408 -70044 158127 117562 124474 6485 87207 180220
17603A80220h789p8687D1635N6624K4026a11333B26854f1512A53449a05146c8352
$$ 180220 -8789 -87476 41635 98259 122285 -111333 226854 -61512 153449 -105146 -38352
17591F156J9518a77310d7473r4679M9513K0544D04810d0142j43876D35076E0130
$$ 6156 25674 -177310 -47473 -142152 -92639 -72095 404810 -40142 -184018 435076 50130
17579e7916B68302A7073K01297L21979b29728L4257f4838B2289K78038A16951
$$ -57916 268302 17073 218370 540349 -229728 -195471 -64838 22289 300327 116951
17568B51930E3959f5417m3371L9217G408L31188A586a5861j41676A34674E6454
$$ 251930 53959 -65417 -108788 -69571 7408 338596 1586 -15861 -157537 134674 56454
17556h8893I0494P2390c41505A41086a89950B93764a7333E124h7344r3253A35407
$$ -88893 90494 162884 -341505 141086 -189950 293764 -17333 5124 -87344 -180597 135407
17544E0863K1272J44563b07106B2074J91747j01852B2491N4777N6764b09147E962
$$ 50863 72135 216698 -207106 22074 213821 111969 22491 77268 134032 -209147 5962
17532B00775r1413a04149A68321M9580c4321j8540g319l7326A83704b31609f1836
$$ 200775 109362 -104149 168321 217901 -34321 -52861 -7319 -44645 183704 -231609 -61836
17520A56087i7719A62369K27029c56658E4050J51998C0172r909L77927a21720
$$ 156087 -97719 162369 389398 -356658 54050 206048 30172 20263 398190 -121720
17509g6705k83626I4507d3976A94155d5233E06208I2490P5696l5725J81526C0187
$$ -76705 -360331 94507 -43976 194155 -45233 506208 92490 168186 132461 313987 30187
17497D22661o7766H4888K38359j0462a03592A1392K91207F8508a08585C8028K7509
$$ 422661 354895 84888 323247 312785 -103592 11392 302599 68508 -108585 38028 65537
17486F5537J37040a667A14718g5170p875A31991M53410A21595D6673K2182L6357
$$ 65537 202577 -1667 114718 -75170 -83045 131991 585401 121595 46673 68855 105212
17475A05212J71728J20809c50590A78391J81973A08732m9823a44002F944i9212
$$ 105212 276940 397749 -350590 178391 360364 108732 58909 -144002 6944 -99212
17464B75565A0811J16127e0827E46276a06720k25331B03894C209L78169j86769
$$ 275565 10811 126938 -50827 546276 -106720 -332051 203894 3209 381378 194609
17454A94609J38244q3812j1498j5197O4451k1698L47924k42337A56175P4544N5331
$$ 194609 332853 249041 237543 222346 286797 265099 613023 370686 156175 230719 286050
17443B86050j32192K91327A13061N57967B0965M56854k32020m0598l928p5955
$$ 286050 153858 445185 113061 671028 20965 477819 245799 205201 201273 125318
17433A25318K11795F7359J48592P3665a29068C1701e4243B45457N5805j40173
$$ 125318 337113 67359 215951 289616 -129068 31701 -54243 245457 301262 161089
17423A61089I293R3491K23780c5737A9615J91686n9038R0732p5368p9716K25737
$$ 161089 9293 102784 326564 -35737 19615 211301 152263 242995 167627 87911 313648
17412C13648l3584q6350P0568F2259J19985J32515J17003C5295A6562R8543K01924
$$ 313648 280064 193714 264282 62259 182244 314759 431762 35295 16562 115105 317029
17401C17029k178j09360c3299B17794p7445C7548J31911p8073a45310H6588J00752
$$ 317029 314851 205491 -33299 217794 140349 37548 169459 91386 -145310 86588 187340
17390A87340H7904K98734J0007A86920L3073b35344a02923C01135c6942p0418
$$ 187340 87904 386638 396645 186920 219993 -235344 -102923 301135 -36942 -107360
17380a07360n2596B50614H9610L08190c3379G754P3683b21438A9974J15461F7173
$$ -107360 -159956 250614 89610 397800 -33379 7754 81437 -221438 19974 135435 67173
17368d0678I8343J49222O0600N3516I2176a43785D7578o754K32467c01884B8991
$$ -40678 98343 247565 308165 361681 92176 -143785 47578 40824 273291 -301884 28991
17356A68570L484R2673J2711d7386E9401J79550i3903E0844g6649A21726j1655
$$ 168570 172054 264727 277438 -47386 59401 238951 -93903 50844 -76649 121726 110071
17345A10071a8539p7817A72839a37273B31092L4652b9654C32160q8626C6974K23388
$$ 110071 -18539 -96356 172839 -137273 231092 265744 -29654 332160 243534 36974 260362
17334B60362G5715N7575A5010f8694B68820h9218m5284A68481f3745A73172D9559
$$ 260362 75715 133290 15010 -68694 268820 -89218 -134502 168481 -63745 173172 49559
17322A46284C1003d8918B65390p6921H1266K5130b16055A79720J1215j2309F6094
$$ 146284 31003 -48918 265390 188469 81266 106396 -216055 179720 190935 178626 66094
17310D69509b26747A49013J38769J9035H9033c028I4976j1071c881B20104l4064
$$ 469509 -226747 149013 287782 306817 89033 -3028 94976 83905 -3881 220104 186040
17299A86040I2346L55506k01887D9191i1830D07345j74485E9083a5811A2552n343
$$ 186040 92346 447852 245965 49191 -91830 407345 232860 59083 -15811 12552 7209
17288G209L65407A19408N4068K19133C7249G271J82133r4028K66270A50717R6305
$$ 7209 372616 119408 173476 392609 37249 7271 189404 95376 361646 150717 247022
17277B47022j12222K78724A10691C5803b31065D10952k8111a1907H5703L13212
$$ 247022 134800 413524 110691 35803 -231065 410952 382841 -11907 85703 398915
17267C98915j62010F7256a17043A65862J6795l1635j3293J31412a01598B67293
$$ 398915 236905 67256 -117043 165862 182657 151022 137729 269141 -101598 267293
17256A15100J60700b19828f0321A36181K74397o2864n646j66118a15224A66284
$$ 115100 275800 -219828 -60321 136181 410578 347714 342068 175950 -115224 166284
17245B60202J27277L13480A30139c219C53433A31121L63805p2202j09691A06847
$$ 260202 387479 700959 130139 -3219 353433 131121 494926 422724 313033 106847
17234E0080R5317J79757A20072L31300m8652I5056a2431B18944k3260K26953C1209
$$ 50080 145397 325154 120072 451372 402720 95056 -12431 218944 195684 422637 31209
17222D26437j73192j11396n7312A4174K7493a28066D40508D5345A6521J68811
$$ 426437 253245 141849 84537 14174 41667 -128066 440508 45345 16521 185332
17212A85332a12196C57540j50551k6868J72002j70609L83576B28334G9624K48161
$$ 185332 -112196 357540 206989 180121 352123 181514 565090 228334 79624 327785
17202C27785M406J0013q633Q1944j8345A42075a41830A34171J44873A26609J58705
$$ 327785 332191 342204 333571 415515 397170 142075 -141830 134171 279044 126609 285314
17191B85314J60374J1154p8238m8648A44542D2603K87552j31166j2885K90238
$$ 285314 445688 456842 378604 329956 144542 42603 330155 198989 186104 476342
17181D76342h584D06663A67131K0638K28709j71991l6520h7317B46291n5431J55507
$$ 476342 -8584 406663 167131 187769 416478 244487 207967 -87317 246291 190860 346367
17170C46367H3528J57290r4341J06567J75105n1688A26132A6823J91381K21575
$$ 346367 83528 240818 146477 253044 428149 376461 126132 16823 208204 429779
17160D29779j36837R2549j0425A44121P9534E5875K34369J1746n52G8361J41409
$$ 429779 292942 385491 375066 144121 223655 55875 290244 301990 301438 78361 219770
17149B19770N9300A29352J72633A42454K11286a48538D48300n0896j96422K09872
$$ 219770 279070 129352 301985 142454 353740 -148538 448300 397404 200982 410854
17139D10854n6791h6963D31900j95489J30473O8669A89804J52661K24341B57570
$$ 410854 354063 -86963 431900 236411 366884 435553 189804 342465 566806 257570
17128D71784j28988F8555L69083j48726K02627k23160P3316j67776M99215C33699
$$ 471784 342796 68555 437638 288912 491539 268379 341695 173919 673134 333699
17117D48757j72359J8873o1577M97941j14178q0452j82520Q9806A88811J35842
$$ 448757 276398 295271 233694 731635 617457 537005 354485 444291 188811 324653
17107C24653J19031A92952J67918J36793l6160o3349o2801j1192o1877n7221L84727
$$ 324653 443684 192952 360870 497663 461503 398154 335353 324161 262284 205063 589790
17096E89790Q8420B31949K8895L84779k02782A64340L03250J64925k46600o0214
$$ 589790 678210 231949 260844 645623 442841 164340 467590 632515 385915 325701
17086C25701p1439p6945J45675J60675j06333j27795P5066L85279P1198j21236
$$ 325701 254262 177317 322992 483667 377334 249539 324605 709884 781082 659846
17076F59846B85522J57098j65405L6686K56271m0885o5512j79589M38533C33318
$$ 659846 285522 442620 277215 313901 570172 529287 463775 284186 722719 333318
17065C41816J25911J83374j64550Q5381J31058j20023B73585Q4309M00325j86609
$$ 341816 467727 651101 486551 571932 702990 582967 273585 357894 758219 571610
17055E71610l1013j40877J23793k55440P64342B94903J70363J59514q764k20321
$$ 571610 540597 399720 523513 268073 1032415 294903 465266 624780 616016 395695
17045C95695n1780J8534N66615l05250B92640N1411K95782o8131K52645l13878
$$ 395695 343915 362449 929064 623814 292640 344051 639833 571702 824347 510469
17035E10469J31300O0441j34848q4233J27545J77836j11541j72693M47717D22427
$$ 510469 641769 702210 567362 483129 610674 788510 676969 504276 951993 422427
17024C45157M50684n9357J61666l42097J12724k28971A94930P13390k09195L047
$$ 345157 795841 736484 898150 556053 668777 439806 194930 908320 699125 702172
17014G02172O3512j09064R045K80402m19495L27327k23863M10332k74804j65944
$$ 702172 765684 656620 665665 946067 526572 853899 630036 1040368 765564 599620
17004E99620N56K61659l5128k05519J74621P9032l23908k4158N30283k39608m3722
$$ 599620 600176 861835 826707 621188 795809 874841 550933 526775 1057058 817450 773728
16993G73728j78417L42133n9611J0172J06642l23674J28429l03463M5883N17872
$$ 773728 595311 937444 877833 888005 994647 670973 799402 495939 541822 1059694
16983A059694l35339k32974M60532l01056K44067k01879M49348m11364j9943K94379
$$ 1059694 724355 491381 951913 650857 894924 693045 1142393 731029 711086 1005465
16973A005465k8127l11072L05157n5581k34447L77504l22775q385J93955l47763
$$ 1005465 977338 666266 971423 915842 681395 1058899 736124 727739 921694 573931
16963E73931L63282j12350K72181r9268J93946j69042J24517j58020L18595j3098
$$ 573931 937213 824863 1097044 997776 1191722 1022680 1147197 989177 1307772 1294674
16953A294674j96473M9717R2828m7533J38793J6394l73897N7103o1963K85472
$$ 1294674 1098201 1147918 1240746 1193213 1332006 1348400 974503 1031606 969643 1255115
16943A255115J35863l67354K39298l26410q2824L00206L7164L3501k78448L78260
$$ 1255115 1390978 1023624 1262922 936512 853688 1153894 1191058 1224559 946111 1324371
16933A324371J66055l93340N00287k16095o8718o7828L06622o5452o0036k08787
$$ 1324371 1490426 1097086 1597373 1381278 1312560 1244732 1551354 1485902 1425866 1217079
16923A217079K03769J92413j01625p896J8955K40172o0064j36936K36689k96454
$$ 1217079 1420848 1613261 1511636 1503740 1522695 1762867 1702803 1565867 1802556 1506102
16913A506102K52483k13169J72742m4485l94492O7229M01011N2394K80460l38729
$$ 1506102 1758585 1545416 1718158 1673673 1279181 1346410 1747421 1799815 2080275 1741546
16903A741546Q2373j27753J90089j23997r4216J2867N9281K95859l9644J48362
$$ 1741546 1823919 1696166 1886255 1762258 1668042 1680909 1740190 2036049 1996405 2144767
16893B144767J5073j43897R4818j1007K36867j76825Q7602J31912j34476J64237
$$ 2144767 2159840 2015943 2110761 2099754 2336621 2159796 2247398 2379310 2244834 2409071
16883B409071l5000k28677L23509j89914J42281o7248l3294L7613J92516k6527
$$ 2409071 2374071 2145394 2468903 2278989 2421270 2354022 2320728 2358341 2550857 2524330
16873B524330N1945L4780j82432M82432k01658K1019Q9871j9855J13144R533J09419
$$ 2524330 2576275 2611055 2428623 2911055 2709397 2730416 2820287 2800432 2913576 2923109 3032528
16862C032528k52002M51432n620R5775Q736j00803K42639n25971N55969j86325
$$ 3032528 2780526 3231958 3226338 3322113 3330849 3230046 3472685 2946714 3502683 3316358
16852C316358j1881J41460P1395J11876j50309n8270N67601j49816L0883n0275
$$ 3316358 3304477 3445937 3517332 3629208 3478899 3420629 3988230 3838414 3869297 3819022
16842C819022K5797J47437J76019j21432J25137J76744J83101J96393j44472k22110
$$ 3819022 3844819 3992256 4168275 4046843 4171980 4348724 4531825 4728218 4583746 4361636
16832D361636L20585P1322K1693K42030Q2190O7993K27602L58237l60104N0236
$$ 4361636 4682221 4753543 4775236 5017266 5099456 5167449 5395051 5753288 5393184 5443420
16822E443420K4170K50779J59048j26053L81429K00551J84778N9211J18474K1098
$$ 5443420 5467590 5718369 5877417 5751364 6132793 6333344 6518122 6577333 6695807 6716905
16812F716905K66557l5406J66314J41130K83086P4588N94713J72380K99772K8959
$$ 6716905 6983462 6948056 7114370 7255500 7538586 7613174 8207887 8380267 8680039 8708998
16802H708998n1059L82073P8619M55420r6032L48178M28069K87652L63192J20719
$$ 8708998 8657939 9040012 9118631 9574051 9478019 9826197 10254266 10541918 10905110 11025829
16792A1025829M23487O2196L22658L16613P27076m3719N73558o598Q76213J68148
$$ 11025829 11449316 11511512 11834170 12150783 12877859 12834140 13407698 13401100 14277313 14445461
16782A4445461M22411M95938L26141M33370R61507K32956O74046R38089N19158
$$ 14445461 14867872 15363810 15689951 16123321 17084828 17317784 17991830 18929919 19449077
16773A9449077N33665O87829O46259Q83533O25110J105231Q68279J029433Q63602
$$ 19449077 19982742 20670571 21316830 22200363 22825473 23930704 24798983 25828416 26692018
16764B6692018J171706J237173J019599J101704J650159J429957J295223J340729
$$ 26692018 27863724 29100897 30120496 31222200 32872359 34302316 35597539 36938268
16756C6938268J640444K189035J608275K074821J910824K428279K395292K545112
$$ 36938268 38578712 40767747 42376022 44450843 46361667 48789946 51185238 53730350
16748E3730350K818907L052600K911364L539978L068365L676072M110106L668506
$$ 53730350 56549257 59601857 62513221 66053199 69121564 72797636 76907742 80576248
16740H0576248M495924M971436M572511N175112N112980N382239N706152N737562
$$ 80576248 85072172 90043608 94616119 99791231 104904211 110286450 115992602 121730164
16732A21730164N617708N770423N582881N412593M949649M833523M013340L757238
$$ 121730164 127347872 133118295 138701176 144113769 149063418 153896941 157910281 161667519
16724A61667519K793691J938201J338784M18391l96807j694156k174672k712351
$$ 161667519 164461210 166399411 167738195 168156586 167759779 166065623 163890951 161178600
16716A61178600l872695m536537m705556n061407n434547n901313n452325n630150
$$ 161178600 157305905 152769368 148063812 143002405 137567858 131666545 126214220 120584070
16708A20584070n762490n450960n441660n384692m879228m814934m860284m012927
$$ 120584070 114821580 109370620 103928960 98544268 93665040 88850106 83989822 79976895
16700G9976895m138299l987530l432417l629873l218626l137142k640459k751255
$$ 79976895 75838596 71851066 68418649 64788776 61570150 58433008 55792549 53041294
16692E3041294k446927k512378k088883k057642k335855j824717j861606j452439
$$ 53041294 50594367 48081989 45993106 43935464 41599609 39774892 37913286 36460847
16684C6460847j179328k026616j219298j106340j318375j104261j208923j158710
$$ 36460847 35281519 33254903 32035605 30929265 29610890 28506629 27297706 26138996
16676B6138996j122629r12164o98753q17783j031164m41570q24179r73558j71985
$$ 26138996 25016367 24104203 23405450 22587667 21556503 21114933 20290754 19317196 19145211
16667A9145211p43751q00440l89939l50639q20867k96663o84331n08953m19221
$$ 19145211 18401460 17601020 17211081 16860442 16039575 15742912 15058581 14549628 14130407
16658A4130407l05178q7126p38975m17686m86184k25875j32112l29367k15461
$$ 14130407 13825229 13738103 12999128 12581442 12095258 11869383 11737271 11407904 11192443
16649A1192443k65332l09277n79532M6185l81593k5820n76676k87146j18939o3033
$$ 11192443 10927111 10617834 10038302 10084487 9702894 9677074 9100398 8813252 8694313 8631280
16639H631280j48670j01m82758l84687j91402p3282o182j46165q1814p08967L48911
$$ 8631280 8482610 8482509 7999751 7615064 7423662 7350380 7344198 7198033 7116219 6407252 6756163
16628F756163k9113k63027l723p8635l13551l5524j02139k08663j57459J58666
$$ 6756163 6727050 6464023 6460300 6381665 6068114 6032590 5930451 5721788 5564329 5722995
16618E722995l13492j53162k05019j45766j90425K56632j30930p6059k32493k61043
$$ 5722995 5409503 5256341 5051322 4905556 4715131 4971763 4840833 4764774 4532281 4271238
16608D271238J59900J43356l29371k38351M77484j36612k317n99192R0763K13402
$$ 4271238 4431138 4574494 4245123 4006772 4484256 4347644 4345327 3746135 3836898 4050300
16598D050300m23265J35971J99345m07112j4902j69132J73824k90830o9796J16813
$$ 4050300 3627035 3763006 3962351 3555239 3540337 3371205 3545029 3254199 3184403 3301216
16588C301216L69430j72387l51858q9961N8053j46632Q2142L8554p4126l80228
$$ 3301216 3670646 3498259 3146401 3056440 3114493 2967861 3050003 3088557 3014431 2634203
16578B634203P9668P4488k48038Q9294K34336k5537j74555L5154k88515J4143
$$ 2634203 2713871 2788359 2540321 2629615 2863951 2838414 2663859 2699013 2410498 2424641
16568B424641J93324k75265J55203j61566K01413k26747j38004j41907J32888
$$ 2424641 2617965 2342700 2497903 2336337 2537750 2311003 2172999 2031092 2163980
16559B163980P6040k4951M2718k34000m3141K64012k14965J80801r6749j57258
$$ 2163980 2240020 2215069 2257787 2023787 1980646 2244658 2029693 2210494 2113745 1956487
16549A956487K53754k10083o9923p722k15544j33717L80460j56416l3040J3583
$$ 1956487 2210241 2000158 1930235 1922513 1706969 1573252 1953712 1797296 1764256 1777839
16539A777839j92740J98295m38928K11664J45384p2113Q1629K08418j39495j20134
$$ 1777839 1585099 1783394 1344466 1556130 1701514 1629401 1711030 1919448 1779953 1659819
16529A659819N1135o5327j71453j16215j09728N14295l48509P0599j05931K57603
$$ 1659819 1710954 1645627 1474174 1357959 1248231 1762526 1414017 1484616 1378685 1636288
16519A636288J5296K2689k55650n5296L9472L0645M49l75195j07419L32949l1095
$$ 1636288 1651584 1674273 1418623 1363327 1402799 1433444 1433893 1058698 951279 1284228 1253133
16508A253133P211j00053l671k46700L86322J57712n23868M30707l91495J87325
$$ 1253133 1260344 1160291 1156620 909920 1296242 1453954 930086 1360793 969298 1156623
16498A156623J6257j27344M0638j49438J29988L21378r3462j05532q9111q9186
$$ 1156623 1172880 1045536 1086174 936736 1066724 1388102 1294640 1189108 1099997 1010811
16488A010811K2289J68912r4475j19015M5390J58096r4158l77947K34472J93234
$$ 1010811 1033100 1202012 1107537 988522 1033912 1192008 1097850 719903 954375 1147609
16478A147609j12756l23379J88227L36601m58260J95487j35714L117Q0969K1128
$$ 1147609 1034853 711474 899701 1236302 778042 973529 837815 840932 921901 943029
16468I43029j48667J15856j56728R4187l68748N61149J78592m30318J15982j58837
$$ 943029 794362 910218 753490 847677 478929 1040078 1218670 788352 904334 745497
16458G45497j42903L35905j46443J10933K34009m65253L47652r098j2815j24147
$$ 745497 602594 938499 792056 902989 1136998 671745 1019397 1010299 997484 873337
16448H73337j23506J39693m28427N68822D61269L64629k86962L65234k22010p087
$$ 873337 749831 889524 461097 1029919 461269 825898 538936 904170 682160 675073
16438F75073o5021J75004q6139j44245m3801J96000C15713M47821j9532j21783
$$ 675073 610052 785056 698917 554672 510871 706871 315713 763534 744002 622219
16428F22219k38137j32498L04846M0670K13369p7551J29313k82617O541L75539
$$ 622219 384082 251584 556430 597100 810469 732918 862231 579614 586155 961694
16418I61694m12846J67024p8724k01541M3459J53717j00600R9819J42736J54470
$$ 961694 548848 715872 637148 435607 479066 632783 532183 632002 774738 929208
16408I29208j14181C29079L19283k76441M58705J9038B82190K51296R5064M10113
$$ 929208 815027 329079 648362 371921 830626 849664 282190 533486 628550 1038663
16398A038663m88861j0878j03405j36779K34022K46827j98872j42110N6703l3175
$$ 1038663 549802 538924 435519 298740 532762 779589 580717 438607 495310 462135
16388D62135B23340L62549j36587K35459B64217A27639M74017j62611K63317j11321
$$ 462135 223340 585889 449302 684761 264217 127639 601656 439045 702362 591041
16378E91041j19729L10599B15021j01611N58184j39583j98208K64131B69853O3776
$$ 591041 471312 781911 215021 113410 671594 532011 333803 597934 269853 333629
16368C33629o9942K91689Q2916A58508J80729R639R6941j52961L61896B68319
$$ 333629 263687 555376 638292 158508 339237 348876 445817 292856 654752 268319
16357B70971K46908j04680J48353j2599J51217k61001j36796J39165J01892k60141
$$ 270971 517879 413199 561552 548953 700170 439169 302373 441538 543430 283289
16347B83289J56610p490J34782p4608j17892j1917j2731k8176j40901O7033K17556
$$ 283289 439899 432409 567191 492583 374691 362774 350043 321867 180966 247999 465555
16336D65555r4540o0612J04849P2642j49537J53422j12351J81169o6325j79383
$$ 465555 371015 310403 415252 487894 338357 491779 379428 560597 494272 314889
16326C14889L77808A26236J89534J99568r9555p6255A30921M58870j69017j40807
$$ 314889 692697 126236 315770 515338 415783 339528 130921 589791 420774 279967
16316B79967K24276B08090K51329o882j26686A22734P9591K91149j8723A34648
$$ 279967 504243 208090 459419 452537 325851 122734 202325 493474 474751 134648
16305B51329h3297F45869B43670J26345G9672K41774L6906I5736K23418l2383
$$ 251329 -83297 645869 243670 370015 79672 321446 358352 95736 319154 286771
16295B86771l1283K30497F4756L36600a05B06262P8822A26284M31276B62681K14349
$$ 286771 255488 485985 64756 401356 -105 206262 285084 126284 557560 262681 477030
16284D77030G4224q715N05745B76273r8117L6455K55934p5214j66141l5001J98514
$$ 477030 74224 65509 571254 276273 178156 214611 470545 395331 229190 194189 392703
16273C92703F3406J75954a50959A84764O0474q4078K23257j20369A16467m5462
$$ 392703 63406 239360 -150959 184764 245238 161160 384417 264048 116467 71005
16263G1005M35195j86950A52583R0905L9980J33780h039F3676c0441B98425A21983
$$ 71005 506200 319250 152583 243488 283468 417248 -8039 63676 -30441 298425 121983
16251C43841j28557I6827J72622L5942l2641A17167J70130i179I6861L54949i7269
$$ 343841 215284 96827 269449 305391 272750 117167 287297 -9179 96861 451810 -97269
16239a4222C57428O5657F9195J59780P8120L06313A48145Q8320A08558P3420K71803
$$ -14222 357428 423085 69195 228975 307095 613408 148145 236465 108558 181978 453781
16228D53781b64491B01511J08547M3306F4963K88885I6746K31485K1727Q2992
$$ 453781 -264491 201511 310058 353364 64963 353848 96746 328231 349958 432950
16218D32950j22027j44735m444n0900L9641J31911d9428I1919l1765L9467J75500
$$ 432950 310923 166188 161744 110844 150485 282396 -49428 91919 60154 99621 275121
16207B75121G9583M0194B2395K92630j4619q6589c0031G5680R0883l3498L8251
$$ 275121 79583 119777 22395 315025 300406 213817 -30031 75680 166563 133065 171316
16196A71316F4607M84543B51627E4112N0423J7003J46087g4482A58297j8314j044
$$ 171316 64607 549150 251627 54112 104535 121538 267625 -74482 158297 139983 138939
16185A38939g9262E8170K27547C0876L8363k8605j6706J4532K14768O1041D9703
$$ 138939 -79262 58170 285717 30876 69239 40634 23928 38460 253228 314269 49703
16173A73176E4206R2755f1977B44561m822q7858c6443E16144i2424G3880K3235
$$ 173176 54206 146961 -61977 244561 239739 151881 -36443 516144 -92424 73880 97115
16162I7115b992r2147C11423f5769j36462I1708J05804d074A37304L77290k35844
$$ 97115 -2992 -95139 311423 -65769 -202231 91708 197512 -4074 137304 514594 278750
16151B78750a80092J2448A38519h3338A56220b29688G8715a23001A48184J4032
$$ 278750 -180092 -167644 138519 -83338 156220 -229688 78715 -123001 148184 162216
16141A62216f8547C99785j94709a73796B31962Q7682a41999C10691a89239B4666
$$ 162216 -68547 399785 205076 -173796 231962 319644 -141999 310691 -189239 24666
16130B47324b18688A27536J28465r0797b55285O4779E5864J958K6940k2952J13755
$$ 247324 -218688 127536 256001 165204 -255285 -190506 55864 57822 84762 61810 175565
16119A75565n9998a83830A40824G0132L2802b2325B86459k4852e9906A12387K00655
$$ 175565 115567 -183830 140824 70132 102934 -22325 286459 261607 -59906 112387 313042
16108C13042L4295E6102a99555A02397K4697L05629E0191K69663D4669i2651C02054
$$ 313042 347337 56102 -199555 102397 127094 432723 50191 319854 44669 -92651 302054
16096D9055i4009B35129n5628H6583j5665M2862K50230r4053H0765f07n1665B67046
$$ 49055 -94009 235129 179501 86583 70918 113780 364010 269957 80765 -607 -52272 267046
16083A56053c47586F9177a06941H5921O9794Q028a19224b7544p3549b7841j97666
$$ 156053 -347586 69177 -106941 85921 155715 163743 -119224 -27544 -101093 -27841 -225507
16072b25507D07375F6728o117P6611F5204a73259A7757N2430R4676k7154d697
$$ -225507 407375 66728 60611 137222 65204 -173259 17757 70187 164863 137709 -4697
16060a0474k35377h8269n9045B29033I9314M2042j5609D9272M590d4633B53699
$$ -10474 -245851 -88269 -147314 229033 99314 141356 125747 49272 53862 -44633 253699
16048A82822E9776E976a62494E692L85021a24613E851L25506F8677J12028n8H6503
$$ 182822 59776 5976 -162494 5692 390713 -124613 5851 331357 68677 180705 180647 86503
16035A76179b70506C5691b62721B27925D8371K04381a72698g7018B3626L42596
$$ 176179 -270506 35691 -262721 227925 48371 252752 -172698 -77018 23626 366222
16025C66222a69415A00252c94588A6931i411A79966e6820A86973e0471H5335P6895
$$ 366222 -169415 100252 -394588 16931 -9411 179966 -56820 186973 -50471 85335 162230
16014A62230i9133k29276a3087k05725A67027B9550c15531h2673B57393e5304
$$ 162230 -99133 -328409 -13087 -218812 167027 29550 -315531 -82673 257393 -55304
16003c50682A45693c0302A97503a82152L8110G3059g0342A4789O4095j4890d1100
$$ -350682 145693 -30302 197503 -182152 -144042 73059 -70342 14789 78884 63994 -41100
15991I0896K0561K58534a08465N1338j38723f5123A91224J97687j66422L8893
$$ 90896 111457 369991 -108465 -57127 -195850 -65123 191224 388911 222489 261382
15981B61382i9391B02991m9513N6453E950J26619c9713A44024b75905M6822B04754
$$ 261382 -99391 202991 153478 209931 5950 132569 -39713 144024 -275905 -229083 204754
15969A90334i7598B73934A138a35589G9460a28453D1537J01612e2171D76357c77781
$$ 190334 -97598 273934 1138 -135589 79460 -128453 41537 143149 -52171 476357 -377781
15957b12728E0965h4133A20546b8778E3091J57523A1417J27192F4511J5538k4095
$$ -212728 50965 -84133 120546 -28778 53091 210614 11417 138609 64511 80049 55954
15946E5954b40685L9453R2278e229A744J52500b54346A13901L4469b34087f2030
$$ 55954 -240685 -201232 -108954 -5229 1744 154244 -254346 113901 148370 -234087 -62030
15934a84319j3529O1888d230k8394k18743A57868C4629A0310b7439l0356C13773
$$ -184319 -197848 -135960 -4230 -32624 -251367 157868 34629 10310 -27439 -57795 313773
15922b61456E5862a98421M3863a1286p215j53639E3928J48925D0469a51846A57503
$$ -261456 55862 -198421 -154558 -11286 -18501 -172140 53928 202853 40469 -151846 157503
15910g0769K9630A2552f6218k69558A38268A7180f7925r2712l4925C7747J67821
$$ -70769 -41139 12552 -66218 -335776 138268 17180 -67925 -160637 -195562 37747 205568
15899B05568L2948a38241c9872F4704a22661c3883C30859I1497a94147C62698
$$ 205568 238516 -138241 -39872 64704 -122661 -33883 330859 91497 -194147 362698
15888g2925I5593A2559e5838j38460k8031O2820E2772g1634A30838b13872A79075
$$ -72925 95593 12559 -55838 -194298 -222329 -159509 52772 -71634 130838 -213872 179075
15876a40865C4084A1177i1256a5773F6313e55442a09165B03957a50103B73236
$$ -140865 34084 11177 -91256 -15773 66313 -555442 -109165 203957 -150103 273236
15865C534a88990C7044J3872P8642g2611q107m57023D0500j5499P1531b91514
$$ 3534 -188990 37044 50916 129558 -72611 -80718 -537741 40500 25001 96532 -291514
15853e3789a5149B7492a7279j99018g5991q7270L5013D46360A88799I0257D1928
$$ -53789 -15149 27492 -17279 -216297 -75991 -163261 -128248 446360 188799 90257 41928
15841B66770a02241M2272J6883A44780d2224j40631P677F3107a21119b6636A09861
$$ 266770 -102241 -59969 -43086 144780 -42224 -182855 -175178 63107 -121119 -26636 109861
15829F3277d06296J18505l9920i297G4908b09803C7873e8665D3463a90726j32093
$$ 63277 -406296 -287791 -327711 -9297 74908 -209803 37873 -58665 43463 -190726 -322819
15818c22819H9810K0174g0800B5872K4275K47550G4800C3900O2948d915j77778
$$ -322819 89810 109984 -70800 25872 50147 297697 74800 33900 96848 -4915 -182693
15807a82693B26410o1412a9925j23436a9102l7063j20704B3397K3495b04389E0125
$$ -182693 226410 164998 -19925 -143361 -19102 -56165 -176869 23397 46892 -204389 50125
15795a57459D2977a10794A87046b68110h921k90478F8916a38199n5166j28231
$$ -157459 42977 -110794 187046 -268110 -8921 -299399 68916 -138199 -193365 -321596
15785c21596E0858J12651F917a6901k37877a8119I5312B4420M18593B15333a70972
$$ -321596 50858 163509 6917 -16901 -254778 -18119 95312 24420 443013 215333 -170972
15773a21413I4960a65783p0660B78407A00522a74739Q4275A48893b32252C20343
$$ -121413 94960 -165783 -236443 278407 100522 -174739 -90464 148893 -232252 320343
15762i5589B05632P6463F8322A3195J18287h6188B00633f5063m96750b03891E4279
$$ -95589 205632 282095 68322 13195 131482 -86188 200633 -65063 -561813 -203891 54279
15750H2239a60235F975O1782O8479L9001J8173r6214E311a9968B6762d1654l01094
$$ 82239 -160235 6975 68757 137236 176237 194410 98196 5311 -19968 26762 -41654 -342748
15738c42748a31043r9520f0108j27940A44425a06371B24285a36060F3896a11486
$$ -342748 -131043 -230563 -60108 -188048 144425 -106371 224285 -136060 63896 -111486
15727B2712e48172g8480j52963G010b24858m2777a21484r9911C7744K05370b95945
$$ 22712 -548172 -78480 -231443 7010 -224858 -267635 -121484 -221395 37744 243114 -295945
15715B11542g7901b7338j21224A19240c74507J74051A18863O2768P5338h7092
$$ 211542 -77901 -27338 -148562 119240 -374507 -200456 118863 181631 256969 -87092
15704a69859e4856j83872c0186A58047p6122N7386c67312i0864A47645j8434J73656
$$ -169859 -54856 -238728 -30186 158047 81925 139311 -367312 -90864 147645 129211 302867
15693C02867f0934j49792c6451D8991B425J58216a19266k38654O7039B82933B1053
$$ 302867 -60934 -210726 -36451 48991 2425 160641 -119266 -357920 -290881 282933 21053
15681A9159f1584j5102n2298C2895K68711E3404d0741l154I0439a48735A82212
$$ 19159 -61584 -76686 -128984 32895 301606 53404 -40741 -43895 90439 -148735 182212
15669B3171M8822l666a18527b0984j86205J476E520b32925D457a9370p4624E121
$$ 23171 71993 68327 -118527 -20984 -207189 -205713 5520 -232925 4457 -19370 -93994 5121
15656A29589i9667j89024B10011C3768K09712a5359r4202O240j94278E4105l615
$$ 129589 -99667 -288691 210011 33768 243480 -15359 -109561 -103321 -297599 54105 50490
15645E0490J89006G3400c27481A1779a84127A2133J9460a04686r5426B08074p8784
$$ 50490 239496 73400 -327481 11779 -184127 12133 31593 -104686 -200112 208074 129290
15634A29290h734j43224p7251M6904A68576b51149C9239J3410J71859I1641m0856
$$ 129290 -8734 -151958 -229209 -182305 168576 -251149 39239 52649 224508 91641 50785
15623E0785d6863j56929J117h9372A3939h6162k06037B19698j03378A2029K9095
$$ 50785 -46863 -203792 -202675 -89372 13939 -86162 -292199 219698 116320 12029 41124
15612D1124a46815g1213B26063j12842a04632n3646A25103d3556A02857B6595
$$ 41124 -146815 -71213 226063 113221 -104632 -158278 125103 -43556 102857 26595
15601a38954B47495D60b39609R8467A54642a96983g8062G1849N796b0707C24317
$$ -138954 247495 460 -239609 -141142 154642 -196983 -78062 71849 77645 -20707 324317
15589A22904j8887k8440a60908A42383m6725a90417O4627L9465j33715H190a42195
$$ 122904 104017 75577 -160908 142383 95658 -190417 -125790 -86325 -220040 8190 -142195
15577d3062q1026B2328e9867m04351A68153a35621k4389j38930A06547B0769a04831
$$ -43062 -124088 22328 -59867 -464218 168153 -135621 -160010 -298940 106547 20769 -104831
15565G071b15335A15071Q2952b36901h926C8684f1434j52749B0665K8334a82644
$$ 7071 -215335 115071 198023 -236901 -8926 38684 -61434 -214183 20665 48999 -182644
15553B0271a49733b4456A21233K94699j38241A18193b71926a22554k27642C4051
$$ 20271 -149733 -24456 121233 415932 277691 118193 -271926 -122554 -350196 34051
15542A32825b27580a06524A12218c0090E3245K50759r8590a60919c2649H0756
$$ 132825 -227580 -106524 112218 -30090 53245 304004 205414 -160919 -32649 80756
15531B60634i2455B02872b8604A21296m3755l6606L5496J30530b25161M9058k2396
$$ 260634 -92455 202872 -28604 121296 77541 40935 76431 206961 -225161 -176103 -198499
15520a98499H1720J97567a81291C79624j80806K5584N0571b88421N3490A89760
$$ -198499 81720 279287 -181291 379624 198818 224402 274973 -288421 -234931 189760
15509I6950R7139a29916B99070c5578j15331N643a7497k85498g7891E81a22910
$$ 96950 194089 -129916 299070 -35578 -150909 -145266 -17497 -302995 -77891 581 -122910
15497b66816A90128b03947d2099j36156A19673f6447A65587b92273a35808A24021
$$ -266816 190128 -203947 -42099 -178255 119673 -66447 165587 -292273 -135808 124021
15486e4588k17033A02732a98491H3934C625L0696b24078j2660A19764i119k88815
$$ -54588 -271621 102732 -198491 83934 3625 34321 -224078 -236738 119764 -9119 -297934
15475b97934E5777K55811c08755J01616f6704g605A04977d0090k28382J28043
$$ -297934 55777 311588 -308755 -207139 -66704 -7605 104977 -40090 -268472 -140429
15465a40429K8452l4953j5526A26150M4965l3365e2181l8690I3176a2025E6243
$$ -140429 -111977 -146930 -162456 126150 171115 137750 -52181 -90871 93176 -12025 56243
15453A35226J09939b10938e0766k0085D02965c43931C23021A53055i0043D9571
$$ 135226 245165 -210938 -50766 -70851 402965 -343931 323021 153055 -90043 49571
15442E687O9939C261L16698F2449j6301b3541A6393J9196K46047A22040J9069
$$ 5687 75626 3261 319959 62449 46148 -23541 16393 35589 281636 122040 141109
15431A41109m0526K0M2984R1437f7998G4598a94191b7080A00095J4118a41072
$$ 141109 100583 100603 143587 235024 -67998 74598 -194191 -27080 100095 114213 -141072
15419e4149C57126a14342H6292J9879J50609A3533g2273D7486J39421a5861j1763
$$ -54149 357126 -114342 86292 106171 256780 13533 -72273 47486 186907 -15861 -27624
15408b7624A9311g2781K7232B93435j24004f0701F6205b17658c6456j33453L1368
$$ -27624 19311 -72781 -45549 293435 169431 -60701 66205 -217658 -36456 -169909 -138541
15397a38541b2736B97218I4373c72408c1602C3639b00317A38512f2213B98364
$$ -138541 -22736 297218 94373 -372408 -31602 33639 -200317 138512 -62213 298364
15386A93807b33335M560h621j7898r3836D9243J10538f9295A40554F7747M23007
$$ 193807 -233335 -228775 -8621 -26519 -120355 49243 159781 -69295 140554 67747 490754
15375D90754i4891d0801E29253c7803a7584N892n8726E076J62882H820a22711
$$ 490754 -94891 -40801 529253 -37803 -17584 -11692 -70418 5076 167958 8820 -122711
15363a83194A22087R431i8587I9769J07433j0167h139l10626a48910a6701F5415
$$ -183194 122087 131518 -98587 99769 207202 197035 -8139 -318765 -148910 -16701 65415
15351c08994e8864K7458A79196E7420L39524b34184A44489g1806A0569L78530
$$ -308994 -58864 -31406 179196 57420 396944 -234184 144489 -71806 10569 389099
15341C89099A59073b12378J8023b0283l1825I6411a75547C40367A40660A980b22414
$$ 389099 159073 -212378 -194355 -20283 -52108 96411 -175547 340367 140660 1980 -222414
15329A9826a08189c15l19144C6259J68141J63122p076r5870L5423b95828I6663
$$ 19826 -108189 -315 -319459 36259 204400 367522 360446 264576 299999 -295828 96663
15317A05955J14046b35911J6211A78632a20853A22039k8069J14353b3565j24138
$$ 105955 220001 -235911 -219700 178632 -120853 122039 93970 208323 -23565 -147703
15307a47703M4430N430D8100c5312j48828A70949J2159g4674I4761J11772F5677
$$ -147703 -103273 -97843 48100 -35312 -184140 170949 183108 -74674 94761 206533 65677
15295i558A74652a62008E3587J22358o0978Q3428l531a43410A86000a93739C83040
$$ -9558 174652 -162008 53587 175945 114967 198395 194864 -143410 186000 -193739 383040
15283A34526R7904H2505g5650k9j37460N7265A09626b78497C70637B5366K194
$$ 134526 232430 82505 -75650 -75679 -213139 -155874 109626 -278497 370637 25366 27560
15272B7560b27063h8208F5779K14285A30991J52569d1280B37571I8989b94169
$$ 27560 -227063 -88208 65779 280064 130991 283560 -41280 237571 98989 -294169
15261e5657n9358b1365e080B77201A03579a05699A81846A1556M52193C87J75275
$$ -55657 -115015 -21365 -5080 277201 103579 -105699 181846 11556 463749 387 175662
15250A75662a28968A57552K37642A21010b63260B48896I4994P6220G6089h232
$$ 175662 -128968 157552 395194 121010 -263260 248896 94994 171214 76089 -8232
15239b42325C15054c2890C94375a12118B90736j11813n8134C2528a92504l62936
$$ -242325 315054 -32890 394375 -112118 290736 178923 120789 32528 -192504 -555440
15229e55440A916b47874G29J45379M8333j6401R98J6987c1107A61019I773a26452
$$ -555440 1916 -247874 729 146108 194441 178040 179038 196025 -31107 161019 9773 -126452
15216b26901i8429b073A4807Q350g7610G5584L25633j05067F9210j1704M8925
$$ -226901 -98429 -2073 14807 23157 -77610 75584 401217 296150 69210 57506 106431
15205A06431a35695B35276A1963J82606B3364N08436j21980j34114a7683j68525
$$ 106431 -135695 235276 11963 194569 23364 531800 409820 275706 -17683 -186208
15195a86208b8141A64255J23021q7724c23566i3634C492d4962A471a3621F5569
$$ -186208 -28141 164255 287276 199552 -323566 -93634 3492 -44962 1471 -13621 65569
15183b9692C30375a38597B31461e4739M578E1139K296a83075J1020E9081K65386
$$ -29692 330375 -138597 231461 -54739 -50161 51139 53435 -183075 -172055 59081 324467
15172C24467a32811E8717J42350J57048j36030D013Q9212J36692J0027B351r83
$$ 324467 -132811 58717 201067 358115 222085 4013 93225 229917 239944 2351 1368
15161A368K2089g9266j9592K7629B74759D3478K58787b89141f2449A87585J6991
$$ 1368 23457 -79266 -98858 -71229 274759 43478 302265 -289141 -62449 187585 204576
15150B04576I4931f6036k2201I0209J20625q2205r78h8366j52305A55443r512
$$ 204576 94931 -66036 -88237 90209 210834 128629 127651 -88366 -240671 155443 145931
15139A45931k860D2773L20541A40998e9189j45973B91434H4275c8477A55747j8172
$$ 145931 143071 42773 363314 140998 -59189 -205162 291434 84275 -38477 155747 137575
15128A37575K31788I0655a5813B59051a97004A76635J13437A01668P5515a93453
$$ 137575 369363 90655 -15813 259051 -197004 176635 290072 101668 177183 -193453
15117E5023B0461b90959A14622a22610B00565C5372a05695D3408J83577l6489
$$ 55023 20461 -290959 114622 -122610 200565 35372 -105695 43408 226985 190496
15107A90496c9117A06904J82473h5882B68760F5094b05063B18858J87875C1860
$$ 190496 -39117 106904 289377 -85882 268760 65094 -205063 218858 406733 31860
15096f6260E6193K63668C6492K2145a69857I2030K608L29988j19779J52106C894
$$ -66260 56193 319861 36492 58637 -169857 92030 94638 424626 304847 456953 3894
15084B64654l0836o4843J47010j8939A16983B6760J22958b52474Q7112A81693
$$ 264654 233818 168975 315985 297046 116983 26760 149718 -252474 -165362 181693
15073A68887b01021b9706A93665O6677l3608b1312D00654q0509E3604J65657a2260
$$ 168887 -201021 -29706 193665 260342 226734 -21312 400654 320145 53604 219261 -12260
15061A23228R1548J06501j26465a69246A52277m0430J07904c9436C88629g5746
$$ 123228 214776 321277 194812 -169246 152277 111847 219751 -39436 388629 -75746
15050G9802K67068j72538L912k2777J37883j05432l8619g1528B73183a07115B03908
$$ 79802 346870 174332 178244 155467 293350 187918 149299 -71528 273183 -107115 203908
15038A24895K8608n6512K15723j51122b89337B52560q7325M61996j71353j14897
$$ 124895 153503 96991 312714 161592 -289337 252560 165235 627231 455878 340981
15028C40981a10939A25829P7646h5499C5521J94475p6901c6186B44757K94756
$$ 340981 -110939 125829 203475 -85499 35521 229996 153095 -36186 244757 539513
15018E39513b01476B82882J98818k22134P5201E0617K06258J03781a26439B82643
$$ 539513 -201476 282882 481700 259566 334767 50617 256875 360656 -126439 282643
15007B65190p6699l7153P6940n6422M9679O1763g0893B05401L9584j11972a58417
$$ 265190 188491 151338 228278 171856 221535 283298 -70893 205401 244985 133013 -158417
14995A69035k9055D4655J03194R2203K0956J01458L4745J5678d3297B56936b053
$$ 169035 139980 44655 147849 240052 261008 362466 397211 412889 -43297 256936 -2053
14983C0668J76697j5893k6644H062K69794N701L7536O1189A82998D1418j8259
$$ 30668 207365 191472 164828 8062 277856 283557 321093 382282 182998 41418 23159
14972B3159J48296i0870A81791M5035q2123K49307j84733K20070A23245K05466
$$ 23159 171455 -90870 181791 226826 144703 394010 209277 429347 123245 328711
14962C28711p4731J98091j96000K23433j05127K42252B12490Q6245J43513Q990
$$ 328711 253980 452071 256071 479504 374377 616629 212490 298735 442248 451238
14952D51238J61985d9252B58358j28484J97776j06745G0629P4626K2725J99002
$$ 451238 613223 -49252 258358 129874 327650 220905 70629 145255 167980 366982
14942C66982j13749A24590m1564J15211K69203j74782j07649a22841C35832r7839
$$ 366982 253233 124590 83026 198237 467440 292658 185009 -122841 335832 237993
14932B37993J34692P9981j09732n8799m5537J01J00569P1650A68112J79200p167
$$ 237993 372685 452666 342934 284135 238598 238699 339268 410918 168112 347312 340145
14921C40145J46450G4272L30300J37242A47526a31982B94935K55571j73078l781
$$ 340145 486595 74272 404572 541814 147526 -131982 294935 550506 377428 373647
14911C73647n3790R5970k04121L8527a47360A81284J29014A05021M15758n9566
$$ 373647 319857 415827 211706 250233 -147360 181284 310298 105021 520779 461213
14901D61213J81734j48384e1207D40374j64479M1762G0407N37241J9872B56335
$$ 461213 642947 494563 -51207 440374 275895 317657 70407 607648 627520 256335
14890A15333K03471J07342j03503J06976J14926o0055k33697L5554Q3677n9805
$$ 115333 318804 426146 322643 429619 544545 484490 250793 286347 370024 310219
14880C10219L2222L29103D8162P76919l78993P6133O3020j24836l0390M1420m4309
$$ 310219 342441 671544 48162 825081 446088 522221 585241 460405 430015 471435 427126
14869D27126A67076K41378n6173L658j74068J04466o7359K10917k06587O6120
$$ 427126 167076 408454 352281 355939 181871 286337 218978 429895 223308 289428
14859B89428R1709K29927k16937R2896r0490L1832K3405B14159K6249L89815B25407
$$ 289428 381137 611064 394127 487023 396533 428365 451770 214159 240408 630223 225407
14847B66035K07157k12465H4990N52465B30114C5700M21415k04259K61466j66199
$$ 266035 473192 260727 84990 637455 230114 35700 457115 252856 514322 348123
14837C48123J04909j38488K15571B31433e7033A44512L01999o3247c1649C45421
$$ 348123 453032 314544 530115 231433 -57033 144512 446511 383264 -31649 345421
14826G77319C51644J38287o864J49977B67895L41259k35412K5806Q7444K29013
$$ 777319 351644 489931 483067 633044 267895 609154 373742 399548 486992 716005
14816G16005C19016K18098p7764K05776j3661m8359j40503K82744j6826k93052
$$ 716005 319016 537114 459350 665126 651465 603106 462603 745347 728521 435469
14806D35469j1760N12411l08505k25430K36150L9614A66269L11814M9304k6590
$$ 435469 423709 936120 627615 402185 638335 677949 166269 478083 527387 500797
14796E00797M499j93659O542K96392p5075q9524J31373j58442o0163Q9695J28845
$$ 500797 505296 311637 318179 614571 539496 449972 581345 422903 362740 452435 581280
14785E81280j94163J81065J64669l27594L57378j0776k34000Q742r3580J88222
$$ 581280 387117 568182 732851 405257 762635 751859 517859 526601 433021 621243
14775F21243k34216K36905M0956k14428o1809J91473O0238k37203K86296L7908
$$ 621243 387027 623932 664888 450460 388651 580124 640362 403159 689455 727363
14765G27363k51264Q5611N4570j9981k08490K48412r5593J67678j89461P544K83591
$$ 727363 476099 561710 616280 596299 387809 636221 540628 708306 518845 526389 809980
14754H09980k90983L24721B47034N59468C74725M94269m5740P0931m43945K75564
$$ 809980 518997 843718 247034 806502 374725 868994 823254 894185 450240 725804
14744G25804M1421l0231O4974P7924l4411j89634q012L2987O2801o3321J64061
$$ 725804 767225 736994 801968 879892 845481 655847 647835 680822 743623 680302 844363
14733H44363q9402L062k94566K98905p8138L32845D88169M62664k71984P425k88497
$$ 844363 754961 758023 463457 762362 684224 1017069 488169 950833 678849 686274 397777
14722C97777L75179J58246j56778O4010k43246J53742K22867j44570k23813O19717
$$ 397777 772956 931202 774424 838434 595188 748930 971797 827227 603414 1223131
14712A223131k54438k51285J29387n1082j04992J06373r8927J307K0195J57953
$$ 1223131 968693 717408 846795 795713 690721 797094 698167 699474 719669 877622
14702H77622k22161J78353q5392O7260o4532P7863k84815O66626m64610L8182
$$ 877622 655461 833814 748422 815682 751150 829013 544198 1210824 746214 784396
14692G84396Q5817L19114n13901L33303j18398K88913l93370N8303Q5925q155
$$ 784396 870213 1189327 675426 1008729 890331 1179244 785874 844177 930102 921947
14682I21947p9973J46127D11954L99464j54724L48238K71431n53248J34164N86328
$$ 921947 841974 988101 411954 811418 656694 1004932 1276363 723115 857279 1443607
14672A443607n17849j83326M7514L10360j15430j19073M4827L1023Q00O8677J09000
$$ 1443607 925758 742432 789946 1100306 984876 865803 910630 941653 942453 1011130 1120130
14661A120130k656j9704l03648J96535L14188l06125M01123l08334l7325j44831
$$ 1120130 1117474 1097770 794122 990657 1304845 998720 1399843 1091509 1054184 909353
14651I09353M73783j57985j78469R0903j53726K41096k27200J80246j18895j05587
$$ 909353 1383136 1225151 1046682 1137585 983859 1224955 997755 1178001 1059106 953519
14641I53519J48618N3597J19948J96361l62787k057M2402k37598N00490k0128
$$ 953519 1102137 1155734 1275682 1472043 1109256 1107199 1149601 912003 1412493 1392365
14631A392365J39080k10580p926Q4106J37117L0551l04659J7445L50106k0794
$$ 1392365 1531445 1320865 1312939 1397045 1534162 1564713 1260054 1277499 1627605 1606811
14621A606811l47722K55289j40829m3448J97816p3740J27344k95722L32662l86233
$$ 1606811 1259089 1514378 1373549 1330101 1527917 1454177 1581521 1285799 1618461 1232228
14611A232228Q7743J12326J42423m413K94408n56119O1333L78209k240J31731
$$ 1232228 1319971 1432297 1574720 1570307 1864715 1308596 1369929 1748138 1745898 1877629
14601A877629l89396K05719m2055j07356J94773q5626l46866J63602k3078R4155
$$ 1877629 1488233 1693952 1651897 1544541 1739314 1653688 1306822 1470424 1447346 1541501
14591A541501j8242M85897j05983N8172o2684J53894j28354l7020j10568N6691
$$ 1541501 1523259 2009156 1903173 1961345 1898661 2052555 1924201 1887181 1776613 1833304
14581A833304K64291L8549K67608k16069j82724k6026p7746K89091k58855l7875
$$ 1833304 2097595 2136144 2403752 2187683 2004959 1978933 1901187 2190278 1931423 1893548
14571A893548N03105j86032K37702l13358L52879l05123L18178q0530M7736m12208
$$ 1893548 2396653 2210621 2448323 2134965 2487844 2182721 2500899 2420369 2468105 2055897
14561B055897L49910K37707K25171K04569k42669L48090k26922Q99232q5422K24323
$$ 2055897 2405807 2643514 2868685 3073254 2830585 3178675 2951753 3850985 3765563 3989886
14551C989886N33421J008394J657519L645149Q177663J5400819R171090B1491262
$$ 3989886 4523307 5531701 7189220 10834369 19012032 34412851 43583941 21491262
14542H919691l763284j722154r36675l42577J30315k39153R163j32101J6170M18606
$$ 8919691 5156407 3434253 2497578 2155001 2285316 2046163 2055326 1923225 1939395 2358001
14532B358001o80051L67524Q8877j09740o9522O18409l32308P2136Q2059j86906
$$ 2358001 1677950 2045474 2134351 2024611 1955089 2573498 2241190 2313326 2395385 2208479
14522B208479J39806K19555j02218O2676j75131Q6328M59511m72956K26602j52242
$$ 2208479 2348285 2567840 2465622 2528298 2353167 2439495 2899006 2426050 2652652 2500410
14512B500410K81723j13158K618n5070Q4806L5187K78198k14123J56338L30768
$$ 2500410 2782133 2668975 2671593 2616523 2701329 2736516 3014714 2800591 2956929 3287697
14502C287697m32922L51889o11881K49616M74895k30189J28723j1085J44247j77443
$$ 3287697 2854775 3206664 2594783 2844399 3319294 3089105 3217828 3206743 3350990 3173547
14492C173547L52085k11274M69621l31979J9304j00418L64691p3451k39583K50857
$$ 3173547 3525632 3314358 3783979 3452000 3471304 3370886 3735577 3662126 3422543 3673400
14482C673400j3951O2415p2468M71662j61205j202J1332J12491j12660N33872
$$ 3673400 3659449 3721864 3649396 4121058 3959853 3958651 3969983 4082474 3969814 4503686
14472D503686m13277L94411m07449L49508O1039J99679k17191R1239j62984J82349
$$ 4503686 4090409 4484820 4077371 4426879 4487918 4687597 4470406 4561645 4398661 4581010
14462D581010r860l5964K23059N1279k36040K87041J58305k80670K07178J46913
$$ 4581010 4571150 4535186 4758245 4809524 4573484 4860525 5018830 4738160 4945338 5092251
14452E092251K49354j9085K14235J22021j35145j36451r9193L62262k2879J09979
$$ 5092251 5341605 5322520 5536755 5658776 5523631 5387180 5287987 5650249 5627370 5737349
14442E737349R8564n1856M47798J35259l57383J09410L40212k9972L1331L29661
$$ 5737349 5835913 5784057 6231855 6367114 6009731 6119141 6459353 6429381 6460712 6790373
14432F790373k9171J43003P5594n7529J43774M2650L63904n28783M47169O81432
$$ 6790373 6761202 6904205 6979799 6922270 7066044 7108694 7472598 6943815 7390984 8072416
14422H072416n00023K99401q1753L15270L688j81901K82679M66357o6146L59855
$$ 8072416 7572393 7871794 7790041 8105311 8108999 7927098 8209777 8676134 8609988 8969843
14412H969843k02222k23073K49550K20980K37311K16086J40138J31068m3375K64475
$$ 8969843 8767621 8544548 8794098 9015078 9252389 9468475 9608613 9739681 9696306 9960781
14402I960781K53387J40486r07J94423L71578j84342K67970N27178K26407K48625
$$ 9960781 10214168 10354654 10353747 10548170 10919748 10735406 11003376 11530554 11756961 12005586
14392A2005586J07780L9139K50100J07314Q6444J76759K25098K51337M72324l70823
$$ 12005586 12113366 12152505 12402605 12509919 12596363 12773122 12998220 13249557 13721881 13351058
14382A3351058O04229N83852j35639K82043M17899K07402J60505P65084r4361
$$ 13351058 13955287 14539139 14403500 14685543 15103442 15310844 15471349 16236433 16142072
14373A6142072J19433N24339J19420O41422K33788N89946M2694R02868K55745
$$ 16142072 16261505 16785844 16905264 17546686 17780474 18370420 18413114 19315982 19571727
14364A9571727q3640Q33222K57357K18332O76563O24609L08661M89935P43783
$$ 19571727 19488087 20321309 20578666 20796998 21473561 22098170 22406831 22896766 23640549
14355B3640549L90921O91572N39993N10708N44144R02155L16308Q51352M18725
$$ 23640549 24031470 24723042 25263035 25773743 26317887 27220042 27536350 28387702 28806427
14346B8806427Q20664J030334P22462Q56863Q30479O67008J264282P61218J105679
$$ 28806427 29627091 30657425 31379887 32236750 33067229 33734237 34998519 35759737 36865416
14337C6865416R79246R18698J212349J290764R45528J437922J593792J115927
$$ 36865416 37844662 38763360 39975709 41266473 42212001 43649923 45243715 46359642
14329D6359642J485028J387993J727303J355691K257707J610062J803402K085271
$$ 46359642 47844670 49232663 50959966 52315657 54573364 56183426 57986828 60072099
14321F0072099J907277K333909K356044K191652K495014K882969K676850K953902
$$ 60072099 61979376 64313285 66669329 68860981 71355995 74238964 76915814 79869716
14313G9869716L330421L351461L302017L420163M207194L897708M641513M186566
$$ 79869716 83200137 86551598 89853615 93273778 97480972 101378680 106020193 110206759
14305A10206759M978452N257151M994780O085034O028561O428803O977223P078799
$$ 110206759 115185211 120442362 125437142 131522176 137550737 143979540 150956763 158035562
14297A58035562P568031Q439263Q361389R217736R527448R928121J0640703J1078945
$$ 158035562 165603593 174042856 182404245 191621981 201149429 211077550 221718253 232797198
14289B32797198J1379541J2120332J2759167J3013705J3344742J3792084J3868261
$$ 232797198 244176739 256297071 269056238 282069943 295414685 309206769 323075030
14282C23075030J4402435J4022253J3935193J3607953J2999677J1970178J0918961
$$ 323075030 337477465 351499718 365434911 379042864 392042541 404012719 414931680
14275D14931680R776066Q117491N562531K546066q28182j635888l32035j876795
$$ 414931680 424707746 432825237 438387768 440933834 440105652 438469764 438137729 436260934
14267D36260934m914493o689522p940780r182953j0624655j1870190j2673066
$$ 436260934 431346441 424656919 416716139 407533186 396908531 385038341 372365275
14260C72365275j3634208j4158189j4516581j4420888j4457005j4005667j3662218
$$ 372365275 358731067 344572878 330056297 315635409 301178404 287172737 273510519
14253B73510519j2937401j2282426j2050061j1746663j0694558j0142378j0125272
$$ 273510519 260573118 248290692 236240631 224493968 213799410 203657032 193531760
14246A93531760r193786q341462q422688p340192p595612p095497o738612n900450
$$ 193531760 184337974 175996512 167573824 160233632 152638020 145542523 138803911 132903461
14238A32903461n726639n568576n220538m920920m650263m521952m047015l724035
$$ 132903461 127176822 121608246 116387708 111466788 106816525 102294573 98247558 94523523
14230I4523523l951602l266829l581646l244129k999840k510548l025150k687771
$$ 94523523 90571921 87305092 83723446 80479317 77479477 74968929 71943779 69256008
14222F9256008k312568k219408j926327k491593j709733k131122j745003j827154
$$ 69256008 66943440 64724032 62797705 60306112 58596379 56465257 54720254 52893100
14214E2893100j431541j082097j594185j926361j273261j325116j502849p38993
$$ 52893100 51461559 50379462 48785277 46858916 45585655 44260539 42757690 42018697
14206D2018697j154726j237584j409849o72251j077097r14016j037061q80244
$$ 42018697 40863971 39626387 38216538 37544287 36467190 35553174 34516113 33635869
14198C3635869o98472r76011j033731q14489k66284q81815j012010o26740m17436
$$ 33635869 32937397 31961386 30927655 30113166 29846882 28965067 27953057 27326317 26908881
14189B6908881n96855p17737o20795l25605j118263l55503k12762p25288k75761
$$ 26908881 26312026 25594289 24973494 24647889 23529626 23174123 22961361 22236073 21960312
14180B1960312p78229q0303l31785n82488m02463l50718l06412p61083L0202o20804
$$ 21960312 21182083 21101780 20769995 20187507 19785044 19434326 19127914 18366831 18397033 17776229
14170A7776229k75828r2668o86507p0492l75586m91065j04719k42068j96899m71020
$$ 17776229 17500401 17407733 16721226 16650734 16275148 15784083 15679364 15437296 15240397 14769377
14160A4769377p3841l98428O4261o82247j13893l48665r3363k22060j89901m13624
$$ 14769377 14695536 14297108 14361369 13679122 13565229 13216564 13123201 12901141 12711240 12297616
14150A2297616k57951J29067m39617o4912k32820l14159k76249K4071k74472J93685
$$ 12297616 12039665 12168732 11729115 11664203 11431383 11117224 10840975 10865046 10590574 10784259
14140A0784259k55237k1468k62409k28996l09548R2603k95715l40785J04726k12359
$$ 10784259 10529022 10507554 10245145 10016149 9706601 9799204 9503489 9162704 9267430 9055071
14130I055071Q6873l56163q8420l00306l199l5173m53457k0363M9280j80331K97869
$$ 9055071 9141944 8785781 8697361 8397055 8393856 8358683 7905226 7884863 7934143 7753812 8051681
14119H051681l76374O9701p82581M33399j27020n9014P0809k40227J19011k88564
$$ 8051681 7675307 7745008 6962427 7395826 7268806 7209792 7280601 7040374 7159385 6870821
14109F870821j54426q8031k5929k96361M33686m29847j93094L76954m21406j22279
$$ 6870821 6716395 6628364 6602435 6306074 6739760 6309913 6116819 6493773 6072367 5950088
14099E950088Q058L42412l98834L54392q10864L02760N591k24800k62001L71069
$$ 5950088 5958146 6300558 5901724 6256116 5445252 5748012 5753603 5528803 5266802 5637871
14089E637871j83712k65730l5614J64326q3078k69493Q905j52937L62418m84827
$$ 5637871 5454159 5188429 5152815 5317141 5234063 4964570 4973475 4820538 5182956 4698129
14079D698129L6694J3490k30491j67675J87714n46103Q30398m15022l25113L39571
$$ 4698129 4734823 4748313 4517822 4350147 4537861 3991758 4822156 4407134 4082021 4421592
14069D421592J81559m78708Q3207J20873O2028K2632k33692n3218O2734j52544
$$ 4421592 4603151 4124443 4207650 4328523 4390551 4413183 4179491 4126273 4189007 4036463
14059D036463l4467K77971m63214j81052M66358n10031J83390l8015k51664O9336
$$ 4036463 4001996 4279967 3816753 3635701 4102059 3592028 3775418 3737403 3485739 3555075
14049C555075j22466m7289J03210L40463l99799l53263J87413K78519k76223J91383
$$ 3555075 3432609 3385320 3488530 3828993 3429194 3075931 3263344 3541863 3265640 3457023
14039C457023j11435l2057k34176L25804l22751M03704p31712K31005L42474n46843
$$ 3457023 3345588 3313531 3079355 3405159 3082408 3486112 2754400 2985405 3327879 2781036
14029B781036K57289j54157o1419J48416k61450K09187r2010k19458L75608k99765
$$ 2781036 3038325 2884168 2822749 2971165 2709715 2918902 2826892 2607434 2983042 2683277
14019B683277P5750j3719Q5455l11164r9638j31863n219L5265M9796l4462K24595
$$ 2683277 2759027 2745308 2830763 2519599 2419961 2288098 2282879 2318144 2367940 2333478 2558073
14008B558073m57718M75523k35179J96361k95719j75723j8482L84771l35294k98291
$$ 2558073 2100355 2575878 2340699 2537060 2241341 2065618 2047136 2431907 2096613 1798322
13998A798322M56533j28887L0435L67203j50649k85445q6238M12268K67223P97834
$$ 1798322 2254855 2125968 2156403 2523606 2372957 2087512 2001274 2413542 2680765 3478599
13988C478599K213365O742188J5129542J6567380j6248411j3800632n212118k660484
$$ 3478599 5691964 12434152 27563694 44131074 27882663 14082031 8869913 6209429
13980F209429r61257p67998n13906o70421k00041k23554J3822P9647k37395k54032
$$ 6209429 5248172 4480174 3966268 3295847 3095806 2872252 2886074 2965721 2728326 2474294
13970B474294J84793m71525K1705N74508n47330o3094J87199j54436L50215j88882
$$ 2474294 2659087 2187562 2209267 2783775 2236445 2173351 2360550 2206114 2556329 2367447
13960B367447j50481m5084j37104L4077Q9658n9547K19017n13151K81615k08434
$$ 2367447 2216966 2171882 2034778 2068855 2158513 2098966 2317983 1804832 2086447 1878013
13950A878013J6822j71090K18113P304L17613p60740M13674m0165k53021l3850
$$ 1878013 1894835 1723745 1941858 1949162 2266775 1506035 1919709 1879544 1626523 1592673
13940A592673K10887J61957l72040M21276r6802p6140j69917J51141J0801k68423
$$ 1592673 1803560 1965517 1593477 2014753 1917951 1841811 1671894 1823035 1833836 1565413
13930A565413J08247m27412L78281K13553j39164j15604j30462l6165J94255M45901
$$ 1565413 1673660 1246248 1624529 1838082 1698918 1583314 1452852 1416687 1610942 2056843
13920B056843o27413K96523r5718j90182J37516k27140J89072k03327l0871J83107
$$ 2056843 1429430 1725953 1630235 1440053 1577569 1350429 1539501 1336174 1305303 1488410
13910A488410k37793J92926J9388j70242J91574J00916j98506J40838m63791J86211
$$ 1488410 1250617 1443543 1462931 1292689 1484263 1585179 1386673 1527511 1063720 1249931
13900A249931J7612P1706K97439k41664K39464m81843L33750j59445j41271j9722
$$ 1249931 1267543 1339249 1636688 1395024 1634488 1152645 1486395 1326950 1185679 1165957
13890A165957J47939n8463M1953q2185k684O057j51189j25531L14014R6469k60944
$$ 1165957 1313896 1255433 1297386 1215201 1212517 1218574 1067385 941854 1255868 1352337 1091393
13879A091393J74213J14787l98317R0704R3751K7770K42553m68982N7892K49851
$$ 1091393 1265606 1380393 982076 1072780 1166531 1194301 1436854 967872 1025764 1275615
13869A275615j03756N1989j69688J71027q9331O3216k07450M0853j5455j30096
$$ 1275615 1171859 1223848 1054160 1225187 1135856 1199072 991622 1032475 1017020 886924
13859H86924J09090K85269m09978j20931M56101M6036m04115O396L49456r0741
$$ 886924 996014 1281283 871305 750374 1206475 1252511 848396 854792 1204248 1113507
13849A113507k43438L20330L52192j24298n14522O639K64539l75279J60976L3973
$$ 1113507 870069 1190399 1542591 1418293 903771 910410 1174949 799670 960646 994619
13839I94619k9939m34755N70543j73734j37246Q2309L56265k28641O524J29544
$$ 994619 964680 529925 1100468 926734 789488 871797 1228062 999421 1005945 1135489
13829A135489k63291L43262l23044k94942r402K3793L34430l5987R2645l5725
$$ 1135489 872198 1215460 892416 597474 588072 611865 946295 910308 1002953 967228
13819I67228j02081k48062K36862J92878m0912j16610k5910M17934m33554p1186
$$ 967228 865147 617085 853947 1046825 1005913 889303 863393 1281327 847773 776587
13809G76587J09810j61484j0004J39719j1997k9528J21580J3856j07035R28l1040
$$ 776587 886397 724913 714909 854628 842631 813103 934683 948539 841504 842432 811392
13798H11392Q9633l4464J3320k23421j13315Q0785K44533k04797K31862j68840
$$ 811392 901025 866561 879881 656460 543145 623930 868463 663666 895528 726688
13788G26688l3137o6020j23028J94953K159K26313j54148Q0829j10738J23223
$$ 726688 693551 627531 504503 699456 701615 927928 773780 854609 743871 867094
13778H67094l53321J42536K70195l05966J75527j71612K56575R2890l17945O514
$$ 867094 513773 656309 926504 620538 796065 624453 881028 973918 655973 662487
13768F62487l9814J06882q2593p1225L45891j43862l59668l327M80984j37988
$$ 662487 622673 729555 646962 575737 921628 777766 418098 414771 895755 757767
13758G57767k0720k87126O7140j0103j69730L39078Q914o0461J21312j35258r6272
$$ 757767 737047 449921 517061 506958 337228 676306 685220 624759 746071 610813 514541
13747E14541j84908N18772k53724k23451L31777p1910N6972l3689q8681P6187
$$ 514541 329633 848405 594681 371230 703007 631097 688069 654380 565699 641886
13737F41886L41402B31739K22113P0930M15208l90653j08857Q8464J4462j35278
$$ 641886 983288 231739 453852 524782 939990 549337 440480 528944 543406 408128
13727D08128L10928r537k43631M32956k2240C53576Q7764R3923Q4451j52000M77225
$$ 408128 719056 709519 465888 898844 876604 353576 441340 535263 619714 467714 944939
13716I44939C91387M39599L7029j89889r8802j7171A64528L95032k56760M25315
$$ 944939 391387 830986 868015 678126 579324 562153 164528 559560 302800 728115
13706G28115A48970M68352k15001j83749B0596N26340M3275R5194l09532j16342
$$ 728115 148970 617322 402321 218572 20596 546936 590211 685405 375873 259531
13696B59531M16910J49410I0823M15427p331K72920j33118k10470p8670r3189
$$ 259531 676441 825851 90823 506250 498919 771839 638721 428251 349581 256392
13686B56392N30689C70969Q2027J91578j92199j31043O5273o1568M22796k13550
$$ 256392 787081 370969 452996 644574 452375 321332 386605 325037 747833 534283
13676E34283L9586j06343K41273j36522j16895j49407K97645k16549J72446q6002
$$ 534283 573869 467526 708799 572277 455382 305975 603620 387071 559517 473515
13666D73515j05615K19447k88233N88130C00074J27067f0996F37037l16652h687
$$ 473515 367900 587347 299114 887244 300074 427141 -60996 637037 320385 -8687
13655A54724L46512J64870j59157j8956K99984j59827L3511B67689J57620r5371
$$ 154724 501236 666106 506949 487993 787977 628150 661661 267689 425309 329938
13645C29938K94418k41565K37222k07699j38106K04844L350o6478K01583C03963
$$ 329938 624356 382791 620013 412314 274208 479052 482402 415924 617507 303963
13634F8232N37004k56625l4766N514J67547k1067A55572K09776j31523M97985
$$ 68232 605236 348611 313845 319359 486906 465839 155572 365348 233825 731810
13624G31810C29082K98478m9902A98123K39481j70178K35764k08415M12746B03237
$$ 731810 329082 627560 577658 198123 437604 267426 503190 294775 707521 203237
13613G8337K22921m1759K04856r1495l1064J33822l4338J49517j73143q9871k0519
$$ 78337 301258 259499 464355 372860 341796 475618 441280 590797 417654 327783 307264
13602C07264r4465K33861A44883K17724k823Q1083j44450J63155j86057J68214
$$ 307264 212799 446660 144883 362607 359784 440867 296417 459572 273515 441729
13592D41729N3154k17310N3997j39214P3641j9143O1084J63049I8646m590L02968
$$ 441729 494883 277573 331570 192356 265997 246854 307938 470987 98646 94056 397024
13581C97024J15082K35408l70498I607J60550K40303j11521P8783A23480N29254
$$ 397024 512106 747514 377016 9607 170157 410460 298939 377722 123480 652734
13571F52734B25275Q294K65523p0823J20198q0953o8906j26285J34752A97260
$$ 652734 225275 233569 499092 428269 548467 467514 398608 272323 407075 197260
13560G50131B81886o3945R7791A40233J21485m2607l7308J89226K12624f9582
$$ 750131 281886 217941 315732 140233 261718 219111 181803 371029 583653 -69582
13549D04359m0508Q5754K31430B75992j24230J51891C0738M15501k06069K22365
$$ 404359 363851 449605 681035 275992 151762 303653 30738 446239 240170 462535
13539D62535B10986M18499k43575j54048j10936L7526M70536B34128A04650K44003
$$ 462535 210986 629485 385910 231862 120926 158452 628988 234128 104650 348653
13529C48653A07303K11479Q9344G9936b2918B62057j30714K69933A61994J80868
$$ 348653 107303 318782 408126 79936 -22918 262057 131343 401276 161994 342862
13519C42862q2153E7465K19298n7423N533J23273J30719k36727Q5283F8886N73707
$$ 342862 260709 57465 276763 219340 224873 348146 478865 242138 327421 68886 642593
13508F42593B83578l8043R7536j53055n9816D4891K64856J75298H3896K69707
$$ 642593 283578 245535 343071 190016 130200 44891 309747 485045 83896 353603
13498C53603J88433r1131A69233L60112A87606L00276o6143G3794J31332j01646
$$ 353603 542036 450905 169233 529345 187606 487882 421739 73794 205126 103480
13488A03480L8403J02214R5322O5206j97110L4530A06675R5385L8955A08080J56282
$$ 103480 141883 244097 339419 404625 207515 242045 106675 202060 241015 108080 264362
13477B64362n5893F8820M50249j74779K43609H9741J69243J61957N2424A47302
$$ 264362 208469 68820 519069 344290 587899 89741 258984 420941 473365 147302
13466D32007k2033j27657H3610K11398L54875P3070A38351J51686q0972H3669
$$ 432007 409974 282317 83610 295008 649883 722953 138351 290037 209065 83669
13455B11300E5930J51039B5462O8276O7121c2608B05466M7365K69085k33891A32307
$$ 211300 55930 206969 25462 93738 160859 -32608 205466 252831 521916 288025 132307
13443D40293K107a5123A16019L57032N0361H9385c2989C03018j12865p6672B4823
$$ 440293 442400 -15123 116019 473051 523412 89385 -32989 303018 190153 113481 24823
13431C07136A20936J52596A10716N706k4032k4139J85315A24365M75214a41979
$$ 307136 120936 273532 110716 116422 92390 68251 253566 124365 599579 -141979
13420C54864f508B66396j15620E3925k5981M22712D5583J89290J11361A38135
$$ 354864 -6508 266396 150776 53925 27944 450656 45583 234873 346234 138135
13409A70171k1422J64147E6882K90592A05769E757L85967I0792l5954O22981A40206
$$ 170171 148749 312896 56882 347474 105769 5757 391724 90792 54838 677819 140206
13397i0150B4387K8151J16175M11470c7509C11935A47979l0163a08608B2928n158
$$ -90150 24387 52538 168713 580183 -37509 311935 147979 117816 -108608 22928 17770
13386A7770L30220c82H8169b4510A63514C9137J31150J69586j09053L8642l8727
$$ 17770 347990 -382 88169 -24510 163514 39137 170287 339873 230820 269462 230735
13375B30735J22104j20991k3941J47078j20240R0017Q2078A89683P6673A14136
$$ 230735 352839 231848 207907 354985 234745 324762 406840 189683 266356 114136
13364A47342P3358m0413A4793K91542N3882K0443n9734f4351j02705G6005M8035
$$ 147342 220700 180287 14793 306335 360217 380660 320926 -64351 -167056 76005 124040
13353A24040B4873a16005C07197A38628J19977R5040K7248r5125M3271G5526O65115
$$ 124040 24873 -116005 307197 138628 258605 353645 380893 285768 329039 75526 740641
13342G40641F4984J3409J21792j481N2024A21663L9880K81481k9504d7803A36953
$$ 740641 64984 78393 200185 198704 250728 121663 161543 443024 413520 -47803 136953
13330C41907K2985h2008B39336A10773R793L36937A78674K38441q9927P2264I7456
$$ 341907 364892 -82008 239336 110773 120566 457503 178674 417115 327188 399452 97456
13318B67944N2866j28915K12239j75533A036f0493G10799k13197h5605A96568
$$ 267944 320810 191895 404134 228601 1036 -60493 710799 497602 -85605 196568
13307A82254K45124j35825A37868F1329N8997K61905A77602n0842p906a30961
$$ 182254 427378 291553 137868 61329 120326 382231 177602 126760 118854 -130961
13296F2179M39609B07003a46728D20134G8353k3479L07908E8236J45822q6364
$$ 62179 501788 207003 -146728 420134 78353 54874 362782 58236 204058 117694
13286A17694K40697h1344B36309n223b59265C95358N2328a11091b7419Q085k62952
$$ 117694 358391 -81344 236309 231086 -259265 395358 447686 -111091 -27419 -19334 -282286
13275b82286A81061M2863C7509r314L86158j23950D0900K49744C3777K52856j26334
$$ -282286 181061 223924 37509 28195 414353 290403 40900 290644 33777 286633 160299
13264A60299o4546K91296D4760m12b47089C51993A20812J53000d0890H3178K46567
$$ 160299 95753 387049 44760 44348 -247089 351993 120812 273812 -40890 83178 329745
13253C29745i0593c7740A04374j3539a27089l0476H2876K87165A1671N5515J71730
$$ 329745 -90593 -37740 104374 90835 -127089 -157565 82876 370041 11671 67186 238916
13242B38916n3834M388E6464j967N2494R4091k0886J00344A23042J23342c7852
$$ 238916 185082 189470 56464 54497 106991 201082 180196 280540 123042 246384 -37852
13230H8933c5171e868G31K27508G2797b49833c9788C9004K92847j23235K12476
$$ 88933 -35171 -5868 731 228239 72797 -249833 -39788 39004 331851 208616 421092
13219D21092K07725A07704J21290N8112G7273h8266A89477h0692A81936J23604
$$ 421092 628817 107704 228994 287106 77273 -88266 189477 -80692 181936 305540
13209C05540b45955C12501A06241c7169A36692m0886B6827b2406l1715C37644
$$ 305540 -245955 312501 106241 -37169 136692 95806 26827 -22406 -54121 337644
13198C52082B6102e0908A11814Q849g019B5117J33473d2508C46224A37231D019
$$ 352082 26102 -50908 111814 120663 -7019 25117 158590 -42508 346224 137231 4019
13186c09914H7570k5933k7282J61224r0376q630B4604L09399d4540A03512p357
$$ -309914 87570 61637 34355 195579 105203 96573 24604 334003 -44540 103512 96155
13175I6155l1692f1095H7682Q8606Q8353a54692H2764R3150o5045K80878A42106
$$ 96155 64463 -61095 87682 176288 264641 -154692 82764 175914 110869 391747 142106
13163d8797H1332J2326C2006L63730A5325L52586D7554L95406A64986m959p5221
$$ -48797 81332 93658 32006 395736 15325 367911 47554 442960 164986 160027 84806
13152H4806l3577N0481A9525K4020K3974h9026H8503J22673p8331a41148G1299
$$ 84806 51229 101710 19525 43545 67519 -89026 88503 211176 132845 -141148 71299
13140B37605j16276h8273C07831b2614j3090G9360a43317B02972l5045b0582C52065
$$ 237605 121329 -88273 307831 -22614 -35704 79360 -143317 202972 167927 -20582 352065
13128B63331b80605D9685N3664J47329e4623D2964J25987f2158q3021j6705G8214
$$ 263331 -280605 49685 103349 250678 -54623 42964 168951 -62158 -145179 -161884 78214
13116c5228C81287j47157a11260B30027a73881D3820J48228L29861A88641J64562
$$ -35228 381287 234130 -111260 230027 -173881 43820 192048 521909 188641 353203
13106C53203B428a33880C75235j73167q9390j4186l8224N4356a11166E55795a80762
$$ 353203 2428 -133880 375235 202068 112678 98492 60268 114624 -111166 555795 -180762
13094a65201A12740N9996c91532a5502C08617c2484C5865I534Q750P9371J72551
$$ -165201 112740 172736 -391532 -15502 308617 -32484 35865 9534 18284 97655 270206
13083B70206q8805c7587G6331c1438F2866j2575J38727I0673g0164J3539m8403
$$ 270206 181401 -37587 76331 -31438 62866 50291 189018 90673 -70164 -56625 -105028
13072a05028F6890K17904a04093B94019Q6470a14283n5864g7470A36578h8506
$$ -105028 66890 284794 -104093 294019 380489 -114283 -170147 -77470 136578 -88506
13061B05194b95880J30344D01276A23701a42393e0425F1553e5940C98108c4152
$$ 205194 -295880 -165536 401276 123701 -142393 -50425 61553 -55940 398108 -34152
13050c44271h2137D7246M25960G974c7977D00396A40008J95756c0609A45476c7366
$$ -344271 -82137 47246 473206 7974 -37977 400396 140008 335764 -30609 145476 -37366
13038E0393K05402B8928c11357Q5143A6226a85247m127B68364g120A31571J7474
$$ 50393 255795 28928 -311357 -226214 16226 -185247 -189374 268364 -7120 131571 149045
13027A49045K3007E6018Q3745a6553I1746E720J94810J64903I2227a1922B33393
$$ 149045 172052 56018 139763 -16553 91746 5720 200530 365433 92227 -11922 233393
13015h6659B99557I420K04343M6915k1731q4687a08433m5168F9138Q5616i4318
$$ -86659 299557 9420 213763 260678 238947 154260 -108433 -153601 69138 154754 -94318
13003C9234a6479k60734G649b6442k1726A63876i7701k02916D8839i5045A47216
$$ 39234 -16479 -277213 7649 -26442 -48168 163876 -97701 -300617 48839 -95045 147216
12991E3402a81854l8795A00256a35207q6750C12667a35655M7880D632a05476c1246
$$ 53402 -181854 -220649 100256 -135207 -221957 312667 -135655 -87775 4632 -105476 -31246
12979f3909A9574J22885p298J5056N6734a33255M2859L9734A72189C729J74434
$$ -63909 19574 142459 135161 150217 206951 -133255 -90396 -50662 172189 3729 178163
12968A78163A1671K84255P1144G2722J72158Q2690A34950K68274A59799J19230
$$ 178163 11671 295926 367070 72722 244880 327570 134950 403224 159799 279029
12958B79029A8715K39474B657f3540B46481o0822A5016a47339E55822a19075B12662
$$ 279029 18715 258189 2657 -63540 246481 185659 15016 -147339 555822 -119075 212662
12946d8557B7923K29757j1306E8529a77639B9952J67462a4107j03737B86027f4865
$$ -48557 27923 257680 246374 58529 -177639 29952 197414 -14107 -117844 286027 -64865
12934a20568L4350j86582d4062H1000M7746a18789I5568d1336E3416K4087K52796
$$ -120568 -86218 -272800 -44062 81000 128746 -118789 95568 -41336 53416 77503 330299
12923C30299F794K77066C8693O8322J29972h3977c9636E2610f5299k18979B20582
$$ 330299 6794 283860 38693 107015 236987 -83977 -39636 52610 -65299 -284278 220582
12911A97298a11824C6900K39040A01636b3195H3761h1944A52615C3306d6801j08429
$$ 197298 -111824 36900 275940 101636 -23195 83761 -81944 152615 33306 -46801 -155230
12900a55230f4648C15223e1381A15069b64778J06197B56948j04328d3877B3403
$$ -155230 -64648 315223 -51381 115069 -264778 -158581 256948 152620 -43877 23403
12889H0693f0799p3154A64386k2186a35151F6839A2853J88915f953d84F9691J26573
$$ 80693 -60799 -133953 164386 142200 -135151 66839 12853 201768 -6953 -484 69691 196264
12877A96264E1573L07713C5815a50799j23942P4630k03625C68386d01731A35344
$$ 196264 51573 359286 35815 -150799 -274741 -200111 -403736 368386 -401731 135344
12866A34185a43427B88035G5502J87820O6733f018A55098g4753B90762j11769
$$ 134185 -143427 288035 75502 263322 330055 -6018 155098 -74753 290762 178993
12856A78993e9303C5922P2623b16393K9452A50923R9992G4866g6166A69296a36768
$$ 178993 -59303 35922 108545 -216393 -186941 150923 250915 74866 -76166 169296 -136768
12844b20100A19307J49939B9615a8901l3390C00772A25385b85189b4983j80127
$$ -220100 119307 269246 29615 -18901 -52291 300772 125385 -285189 -24983 -205110
12834b05110M514B21313g4785j10590C20599a4100j71253A37721c2638o5948F5526
$$ -205110 -200596 221313 -74785 -185375 320599 -14100 -185353 137721 -32638 -98586 65526
12822B08039r2331d4598C98319e1777n0820C75595j26237j21583c8047j21414
$$ 208039 115708 -44598 398319 -51777 -102597 375595 249358 127775 -38047 -159461
12812a59461r0179H9639C2397J85135b95029C08421h121j82447C25462a39776
$$ -159461 -249640 89639 32397 217532 -295029 308421 -8121 -190568 325462 -139776
12801a93196R4382C06136a62882C14714a84789H2885d19543B58012F8642a56308
$$ -193196 -98814 306136 -162882 314714 -184789 82885 -419543 258012 68642 -156308
12790B28477c5217j5906B10873L3361r1882I547M8421O7101I786a74607c4319
$$ 228477 -35217 -51123 210873 244234 152352 9547 57968 125069 9786 -174607 -34319
12778b20783O6017N8057r9334A03515J57723E4875J48997a15525B3494K04246
$$ -220783 -154766 -96709 -196043 103515 261238 54875 203872 -115525 23494 227740
12768B27740j12587a51589C21194c5491H2338I808e9346j77780I8837a09710J1808
$$ 227740 115153 -151589 321194 -35491 82338 9808 -59346 -237126 98837 -109710 -97902
12757i7902C846N5595h3086m885p113M7147k1573B08420o3031Q5668b15961A20092
$$ -97902 3846 59441 -83086 -87971 -95084 -47937 -69510 208420 145389 231057 -215961 120092
12744D49079G1043j336M3373a30181A8231h9916k465A72841f5140I4199a9459
$$ 449079 71043 69707 113080 -130181 18231 -89916 -92381 172841 -65140 94199 -19459
12732d7757H0762K68403j67850b337C59398A44573g0533B10771a33048j89723
$$ -47757 80762 349165 181315 -2337 359398 144573 -70533 210771 -133048 -322771
12722c22771a53445j254k9031H4823K54012j37325b10463D986L10941j14412K0944
$$ -322771 -153445 -154699 -183730 84823 338835 201510 -210463 4986 315927 201515 222459
12711B22459a84869H1662O7849k0355D2579e4575B61799K8531a01672B49324j03934
$$ 222459 -184869 81662 149511 129156 42579 -54575 261799 290330 -101672 249324 145390
12700A45390M34547b1155A82059i4892C32294a42515A64119c09799A43273J7162
$$ 145390 579937 -21155 182059 -94892 332294 -142515 164119 -309799 143273 160435
12690A60435O8249C9546M1088b55278a07055m5901A05548b19583I8328J47477
$$ 160435 228684 39546 80634 -255278 -107055 -152956 105548 -219583 98328 245805
12680B45805D5081L4251b5098H5335k970K26336I5755L02229n8372A17128J99520
$$ 245805 45081 79332 -25098 85335 82365 308701 95755 397984 339612 117128 316648
12669C16648a82432H1022J58235n2663n8858B6201J15369A1930N4505K15801e629
$$ 316648 -182432 81022 239257 186594 127736 26201 141570 11930 66435 282236 -5629
12657H2N88912B34723i8061B07092H2120J22322a3995C10174G6464a77345C32491
$$ 82 588994 234723 -98061 207092 82120 204442 -13995 310174 76464 -177345 332491
12645C5748Q61M04922a26840M7426A00329f4310o717n4844F1777O7702J1784L6612
$$ 35748 36609 441531 -126840 -79414 100329 -64310 -71027 -125871 61777 129479 141263 177875
12633A77875J1701h6888B83813a95019I5151M14148j90029A13302R9014B862M6172
$$ 177875 189576 -86888 283813 -195019 95151 509299 319270 113302 212316 2862 49034
12622D9034N44158B11675p4152i6282C4955N9169J1688D10J00644k4935d4967
$$ 49034 593192 211675 137523 -96282 34955 94124 105812 410 101054 76119 -44967
12610c422j77760M9547A13691a89754d730j87375A78694A0487Q6950l1856J40987
$$ -3422 -181182 -131635 113691 -189754 -4730 -192105 178694 10487 97437 65581 206568
12599B06568O1368C7608G01Q8513b05148A97438m7109J58053i857j05737D60106
$$ 206568 267936 37608 701 89214 -205148 197438 150329 308382 -9857 -115594 460106
12587c5242B37657c3342I2564b14145A39802B575M5963i987q9958B82040a75236
$$ -35242 237657 -33342 92564 -214145 139802 2575 48538 -9987 -99945 282040 -175236
12575a16425E30100a41613d5034I0749b4859m0251b2539o614A28345m1111M8505
$$ -116425 530100 -141613 -45034 90749 -24859 -65110 -22539 -29153 128345 87234 135739
12564A35739e5883A13881L43957b3441A94138a37081A13514k4301J52834A17951
$$ 135739 -55883 113881 457838 -23441 194138 -137081 113514 89213 242047 117951
12553B87713A38411b29393A1441e0308j38576g7869n0763l0850k29514J73724
$$ 287713 138411 -229393 11441 -50308 -188884 -77869 -128632 -159482 -388996 -215272
12543b15272N3287A19505P2962J85589A77851A5701J23953L51320F547h5972q9802
$$ -215272 -161985 119505 192467 378056 177851 15701 139654 490974 6547 -85972 -175774
12532a75774A98533L2779n6389K84864D3071N9235d7382C06766b9103A20667F250
$$ -175774 198533 231312 174923 459787 43071 102306 -47382 306766 -29103 120667 6250
12520G6195J01906H2367J61910m5846o0811b7247k32392O6913d266j01189G1796
$$ 76195 178101 82367 244277 198431 137620 -27247 -259639 -192726 -4266 -105455 71796
12508b51299a03056A54661D0398N0647a69113Q1520o3395C03057E7220i6827D22221
$$ -251299 -103056 154661 40398 91045 -169113 -87593 -150988 303057 57220 -96827 422221
12496c916B12862H0150l5830J63596J20823G1819d5548j77352A6943b1179k4737
$$ -3916 212862 80150 44320 207916 328739 71819 -45548 -222900 16943 -21179 -45916
12485d5916H0131J37671a2051k75497C0495N9829Q1774d0321j8349A78827g2124
$$ -45916 80131 217802 -12051 -287548 30495 90324 172098 -40321 -58670 178827 -72124
12473a68347j45846K7519Q6514D6848a85938C44275f7700A0920J12826N5879a15358
$$ -168347 -314193 -286674 -200160 46848 -185938 344275 -67700 10920 123746 179625 -115358
12461i7494L8450A751a63587B7406J36541c21832a08938D1357c91703a64047f4244
$$ -97494 -59044 1751 -163587 27406 163947 -321832 -108938 41357 -391703 -164047 -64244
12449a33356M413C0362b61792H9408k7519K26243A08392d6863D7548a40925n4936
$$ -133356 -128943 30362 -261792 89408 61889 288132 108392 -46863 47548 -140925 -195861
12438a95861G6838b10960H5844b03361c0964k20544A67163J987j8156b23978A98705
$$ -195861 76838 -210960 85844 -203361 -30964 -251508 167163 169150 150994 -223978 198705
12426C66603B0960a80997O6660A56344c20882B40936F5635R820f6032l13271G9245
$$ 366603 20960 -180997 -114337 156344 -320882 240936 65635 75455 -66032 -379303 79245
12414f6139E9041b4099j4389A74593Q4510C1617L1612J42996c149q6735A9074
$$ -66139 59041 -24099 -38488 174593 259103 31617 63229 206225 -3149 -89884 19074
12402e7690G1136J3707b39439k5197B8863k657J25148e9164D3844a01815A02103
$$ -57690 71136 84843 -239439 -264636 28863 26206 151354 -59164 43844 -101815 102103
12390c3145B82051J8026a67635B39064a01919j3550C43415B3288N8956d375j3942
$$ -33145 282051 300077 -167635 239064 -101919 -115469 343415 23288 82244 -4375 -18317
12379a8317C65967b29709C50917I0664b0059L606A13029a09590M3689A31021c08987
$$ -18317 365967 -229709 350917 90664 -20059 -16453 113029 -109590 -65901 131021 -308987
12367C14003A25011L4900i6272C00199n3233A00295d13301J52864i4583E3548
$$ 314003 125011 159911 -96272 300199 246966 100295 -413301 -260437 -94583 53548
12356b36795c7662E5515b25181F7093e0813J7481l3859o266L0974N223B8828J11750
$$ -236795 -37662 55515 -225181 67093 -50813 -33332 -67191 -73457 -42483 -37260 28828 140578
12344A40578h1329p5429A9834J05921b97370B47148c6376o4363j12478a05128
$$ 140578 -81329 -156758 19834 125755 -297370 247148 -36376 -100739 -213217 -105128
12333A86921a71175F7875O1410A5474K40155D8616J33454f6761j70092E0815A4678
$$ 186921 -171175 67875 129285 15474 255629 48616 182070 -66761 -236853 50815 14678
12321g8254C7081e25198H4621h2179n8664C44068b14009Q7206E276J85783C5919
$$ -78254 37081 -525198 84621 -82179 -140843 344068 -214009 -126803 5276 191059 35919
12309d415C20038e0346l5496B18175b11641L5341C9335J22683a33716n7605e0477
$$ -4415 320038 -50346 -85842 218175 -211641 -176300 39335 162018 -133716 -191321 -50477
12297E974J03072P5695J99082A77064a42391A86339b93927F260L18519A33986
$$ 5974 109046 184741 383823 177064 -142391 186339 -293927 6260 324779 133986
12286A38907c3561C5813P3960C2422a42941I5287K1079J29889J16515j4819H404
$$ 138907 -33561 35813 109773 32422 -142941 95287 116366 246255 362770 347951 8404
12274A38618J7760J47770c05357d7539B3163J37547A9591K2250J12201k960n8063
$$ 138618 156378 304148 -305357 -47539 23163 160710 19591 41841 154042 151082 93019
12263I3019J29067J12939J07665A55312k8223h5262B47743a33591k9319C82438
$$ 93019 222086 335025 442690 155312 127089 -85262 247743 -133591 -162910 382438
12252b1112A6103O5135M4360d1940m2306j49467B6983a09299O743d685A07519
$$ -21112 16103 81238 125598 -41940 -84246 -233713 26983 -109299 -102556 -4685 107519
12240B69771j8328a17840k15136A48495p3929J69870B5113K11238j03628N30760
$$ 269771 251443 -117840 -332976 148495 74566 244436 25113 236351 132723 663483
12230F63483A26597J85821n1284l5119p0141L06956o1408A78911k1678K53254
$$ 663483 126597 312418 261134 226015 155874 462830 401422 178911 157233 410487
12220D10487j87780A04080N71452A03616N6566n4948l9209a04569A2163J44924
$$ 410487 222707 104080 675532 103616 160182 105234 66025 -104569 12163 157087
12210A57087d0969B79892N5176j27037J05844K2603N358G3736b17017A00986b43006
$$ 157087 -40969 279892 335068 208031 313875 336478 341836 73736 -217017 100986 -243006
12198B49492F8140J85645A20079J13842K48179B6832L9901J61477l1500p7046
$$ 249492 68140 253785 120079 233921 482100 26832 66733 228210 196710 119664
12188A19664M4723j0633l3220b56755D4794j0932c2398J1862A05195a34306E4060
$$ 119664 164387 153754 120534 -256755 44794 33862 -32398 -20536 105195 -134306 54060
12176I8949R2737i6688E6002f5272A11182c29526B72615A9510L09296N3489H9921
$$ 98949 191686 -96688 56002 -65272 111182 -329526 272615 19510 328806 382295 89921
12164A9667K096a2354A99468b0293k7681B83470b18988B46034a9806k29290B95196
$$ 19667 21763 -12354 199468 -20293 -47974 283470 -218988 246034 -19806 -249096 295196
12152c26745A47397R3450D2950P360J39184F7703b42875B69949a44727H7614a94724
$$ -326745 147397 240847 42950 50310 189494 67703 -242875 269949 -144727 87614 -194724
12140A20448C4616c1396l5755A78379F4726J00723M8848N7025O3537d2705L846
$$ 120448 34616 -31396 -67151 178379 64726 165449 214297 271322 334859 -42705 -38859
12129c8859n688n9825j80729A08300K07008G4165a72992E3551b8924l8454q2115
$$ -38859 -44547 -104372 -285101 108300 315308 74165 -172992 53551 -28924 -67378 -149493
12118a49493B01301j4844a72571A24589g8133p6577j62936A2339L38987h344k20970
$$ -149493 201301 186457 -172571 124589 -78133 -154710 -317646 12339 351326 -8344 -229314
12107b29314P7052b3763A27546a03472a4457I8827a19345N6272Q519l4752B02127
$$ -229314 -152262 -23763 127546 -103472 -14457 98827 -119345 -63073 -54554 -89306 202127
12095B03630b59343A38399D1684L3298O0490G584K74987q9138b30964B06015G7370
$$ 203630 -259343 138399 41684 74982 135472 7584 282571 193433 -230964 206015 77370
12083a13820N1142O347A8151H787Q6462J41760c02877N3751D62290a12888A57108
$$ -113820 -62678 -56331 18151 8787 95249 237009 -302877 -249126 462290 -112888 157108
12071B09542a43790G1887N69457p3972Q13098C39416p9655H4685K28592a89005
$$ 209542 -143790 71887 641344 567372 1380470 339416 259761 84685 313277 -189005
12060F1752b8170a2772A00524b16344E699Q9288b06791f4683m33045A559a31391
$$ 61752 -28170 -12772 100524 -216344 5699 94987 -206791 -64683 -497728 1559 -131391
12048A31089a63860d0225B34033C3376d5271q9178N0541I0496a14663B64763a05613
$$ 131089 -163860 -40225 234033 33376 -45271 -134449 -83908 90496 -114663 264763 -105613
12036a70471B21201b80198c0547B19573e8940G3989J04872F9786a53768B57479
$$ -170471 221201 -280198 -30547 219573 -58940 73989 178861 69786 -153768 257479
12025A75004a55586p5722B7321f2413B27087b28296r04d2583H5272a8777j03448
$$ 175004 -155586 -231308 27321 -62413 227087 -228296 -229200 -42583 85272 -18777 -122225
12014a22225c3086D37082i1201H1042d14414i3818D9577a65256b8149j23081G2014
$$ -122225 -33086 437082 -91201 81042 -414414 -93818 49577 -165256 -28149 -151230 72014
12002d6735j3521j36119a7834k9812k82068A61819a35647L3067N843A1082L9708
$$ -46735 -60256 -196375 -17834 -47646 -329714 161819 -135647 -102580 -96737 11082 50790
11991E0790M4778e6213k8905c8944l26466H0032a31704j44661j0240f2515A16764
$$ 50790 95568 -56213 -85118 -38944 -365410 80032 -131704 -276365 -286605 -62515 116764
11979h0002k4817A21213b02811C7144a96784c5068a4118j31011l7379A88867j6703
$$ -80002 -104819 121213 -202811 37144 -196784 -35068 -14118 -145129 -182508 188867 172164
11968A72164a25317m0757B2482b58977a13022F1284a7426j06695l0232I4336j0859
$$ 172164 -125317 -166074 22482 -258977 -113022 61284 -17426 -124121 -154353 94336 83477
11957H3477a04574D18344A8218a50157C9800e7097l9701J5039j37186a03202K4384
$$ 83477 -104574 418344 18218 -150157 39800 -57097 -96798 -81759 -218945 -103202 -78818
11946g8818j04822a0031m37331f6637j6805j4750A9485a13114A10515O5124Q3345
$$ -78818 -183640 -10031 -447362 -66637 -83442 -98192 19485 -113114 110515 175639 258984
11935B58984a17541B78415b28453A27933f8375j56849D2860J22521o1112c49254
$$ 258984 -117541 278415 -228453 127933 -68375 -225224 42860 165381 104269 -349254
11924G4606d2081H5786g8639K0667D41504a33294f4315l6019L6079P342j35167
$$ 74606 -42081 85786 -78639 -57972 441504 -133294 -64315 -100334 -64255 -56913 -192080
11913a92080C21887A14614a19675f978C9020a26679A25662J07477m1758c45779
$$ -192080 321887 114614 -119675 -6978 39020 -126679 125662 233139 191381 -345779
11902a19621G2523M7888j9471K8152a99569J4057L8259k6536J5500j13012I220
$$ -119621 72523 120411 100940 129092 -199569 -185512 -147253 -173789 -158289 -271301 9220
11890B9569a10567b6074B5852a02793m8652j46095A24167b66159J02408n4832
$$ 29569 -110567 -26074 25852 -102793 -151445 -297540 124167 -266159 -163751 -218583
11880b18583o653N4536e6376o8027A65485f4809k91815a5036A8714c9924k477
$$ -218583 -225236 -170700 -56376 -124403 165485 -64809 -356624 -15036 18714 -39924 -42401
11869d2401l21100E0771b9197j0440k4276a1082k77794F5401a88282P0780p7087
$$ -42401 -363501 50771 -29197 -39637 -63913 -11082 -288876 65401 -188282 -117502 -194589
11858a94589E9764K42135A00396i6620C09932B4257J16188C5751L6041k6546A5573
$$ -194589 59764 301899 100396 -96620 309932 24257 140445 35751 71792 45246 15573
11846f2240H3221a93248E5191a10315j12032P3178E974J80774a36795A4050O5215
$$ -62240 83221 -193248 55191 -110315 -222347 -149169 5974 186748 -136795 14050 79265
11835G9265L4820c9457A20307g9469A36523F765i0953B6165P8685L2086b8247
$$ 79265 114085 -39457 120307 -79469 136523 6765 -90953 26165 104850 136936 -28247
11823a60324C76629A47020c2487j9676j59081A55212a40494A81697a25690A35727
$$ -160324 376629 147020 -32487 -52163 -211244 155212 -140494 181697 -125690 135727
11812g4086q3084A6575K6779J91954e5562A93157F7092a21691A4458b11850P079
$$ -74086 -157170 16575 43354 235308 -55562 193157 67092 -121691 14458 -211850 -204771
11801b04771A34592a6550j17912q0991h2892j11882A90461b36805B80418b92968
$$ -204771 134592 -16550 -134462 -215453 -82892 -194774 190461 -236805 280418 -292968
11790A18994c2262k8536p1638k60243A44424b1421m7542j77956A10145l9039a92844
$$ 118994 -32262 -60798 -132436 -392679 144424 -21421 -68963 -246919 110145 71106 -192844
11778C75635g6958j69494I7730a08553e3796j51146e1253m80243i7461F02J42028
$$ 375635 -76958 -246452 97730 -108553 -53796 -204942 -51253 -531496 -97461 602 142630
11767A42630J3426G2248a77956B40858p9310a14566c6636r7797A8608f3209j19123
$$ 142630 156056 72248 -177956 240858 161548 -114566 -36636 -134433 18608 -63209 -182332
11756a82332H1222i3315n3346B0503N9717d3476B03683O2161E9693a59756k77220
$$ -182332 81222 -93315 -146661 20503 80220 -43476 203683 265844 59693 -159756 -436976
11745d36976c7785A9175f7987j2208j93763A70780b48820k9983a16918E3155k0319
$$ -436976 -37785 19175 -67987 -80195 -273958 170780 -248820 -278803 -116918 53155 32836
11734C2836N8210a02609B37293b26097A08644m642e0146l31540J43684A58432
$$ 32836 91046 -102609 237293 -226097 108644 104002 -50146 -381686 -238002 158432
11723A54637O7011c25487A63596o4583h8534A49495p1798j1821A927a62486E7302
$$ 154637 221648 -325487 163596 99013 -88534 149495 77697 65876 1927 -162486 57302
11711i4071F0158b3078j6331p1433B4422h9021B2903J0081J4668i5793o414j09331
$$ -94071 60158 -23078 -39409 -110842 24422 -89021 22903 32984 47652 -95793 -102207 -211538
11699b11538G0478r528L8907b29943B41007o1172b79749B72447c2135A29003f8824
$$ -211538 70478 60950 99857 -229943 241007 179835 -279749 272447 -32135 129003 -68824
11687a30083r4824P1298j11006A54096o7564a13751G3561d47160A93274a9915
$$ -130083 -224907 -153609 -264615 154096 86532 -113751 73561 -447160 193274 -19915
11676a72970K8484k6919A39543K44393K2486a25820B88038A307i0557A3712M5258
$$ -172970 -144486 -171405 139543 383936 406422 -125820 288038 1307 -90557 13712 58970
11665E8970f7505j55999i1899C17180d7922I4208d9031m4647K4808l034B18545
$$ 58970 -67505 -223504 -91899 317180 -47922 94208 -49031 -93678 -68870 -71904 218545
11653B29840L588f4506H136N3602j6662J23999a08662B1537J57313c85614h1230
$$ 229840 233428 -64506 8136 61738 45076 169075 -108662 21537 178850 -385614 -81230
11641a59588O9011M0865A83862E8230b3541A76803A4974b08179B18996a60552
$$ -159588 -90577 -49712 183862 58230 -23541 176803 14974 -208179 218996 -160552
11630a98734b2900j28090D0282a68504L7070B64764i4289A83785a09116B22549
$$ -198734 -22900 -150990 40282 -168504 -131434 264764 -94289 183785 -109116 222549
11619a70633B13933a46969k07994J03530B8184K2796a08754j42302g9321B61551
$$ -170633 213933 -146969 -354963 -251433 28184 50980 -108754 -251056 -79321 261551
11608A79980a23041k32447h6938E4595N0161l3885J00883n1510g2040B81213o9224
$$ 179980 -123041 -355488 -86938 54595 104756 70871 171754 120244 -72040 281213 211989
11597B11989J65062F8035k2027d6668A00829a91944g8437o2705B34144G3572M3058
$$ 211989 377051 68035 46008 -46668 100829 -191944 -78437 -141142 234144 73572 116630
11586A16630a47346A31947K81657a21201l3613b8269j88784A91766a89476B38513
$$ 116630 -147346 131947 413604 -121201 -154814 -28269 -217053 191766 -189476 238513
11575a59701A62228M1088k3869n5801F961J18458K07052k4298A38224D8809L19315
$$ -159701 162228 203316 179447 123646 6961 125419 332471 308173 138224 48809 368124
11564C68124E5382J34905F2533K49045a13159G8897a24438O578B19905n4896e1202
$$ 368124 55382 190287 62533 311578 -113159 78897 -124438 -117860 219905 165009 -51202
11552d2380B10025d8550q4683M4384H0840R9983a2855l8927E8639b56996F6221
$$ -42380 210025 -48550 -133233 -88849 80840 180823 -12855 -51782 58639 -256996 66221
11540i4657d0373B3125M379f9325A42433R6301a4606C47627A57513a0095p5453
$$ -94657 -40373 23125 27504 -69325 142433 238734 -14606 347627 157513 -10095 -85548
11529h5548a1091A07516K77965E5994K23423l1839H4141J04707k0530Q0510D0759
$$ -85548 -11091 107516 385481 55994 279417 247578 84141 188848 168318 248828 40759
11517A97398F4727r405a12296B6037c6857B00558e6406K230F3858M3595J96389
$$ 197398 64727 55322 -112296 26037 -36857 200558 -56406 -54176 63858 107453 303842
11506C03842J3360H3789P267N1125J4794k4357E9796P6614K04055j59270L5359
$$ 303842 317202 83789 91056 142181 156975 132618 59796 136410 340465 181195 216554
11495B16554F2604L3849a00390J8916B19907o7971k9454A359L5965a75892B18937
$$ 216554 62604 96453 -100390 -81474 219907 151936 122482 1359 37324 -175892 218937
11483C28475F820K7439J35103K06719j70374r0124i9745H3753a17186n2262l6124
$$ 328475 6820 34259 169362 376081 205707 115583 -99745 83753 -117186 -169448 -205572
11472b05572A88580C0021K27556K7876M6770m2977a46318B00754F4892j0554f7619
$$ -205572 188580 30021 257577 285453 332223 289246 -146318 200754 64892 54338 -67619
11460a05730A26049J83462d6159A75636h164B86611E0130d4140F4168b28730J5335
$$ -105730 126049 309511 -46159 175636 -8164 286611 50130 -44140 64168 -228730 -213395
11449b13395h0167F9616b5991j94344P1563M5525A06787k2253k2460K71090q9196
$$ -213395 -80167 69616 -25991 -220335 -148772 -103247 106787 84534 62074 333164 243968
11438B43968m5463a76958H5453J08465A7024K51904A2373K77984b1311l24826
$$ 243968 198505 -176958 85453 193918 17024 268928 12373 290357 -21311 -346137
11428c46137g3229B59080a32348a1355n9778A57546c7099j35364J5242F3169a9402
$$ -346137 -73229 259080 -132348 -11355 -71133 157546 -37099 -172463 -157221 63169 -19402
11416H9484l4500b2582p4959D1393P0786e9546B1600a18521H0705b07477G213
$$ 89484 54984 -22582 -97541 41393 112179 -59546 21600 -118521 80705 -207477 7213
11404b54801M3257E586b79965D7113J59782f5247A14071Q5988a29114e2887A78070
$$ -254801 -211544 5586 -279965 47113 206895 -65247 114071 200059 -129114 -52887 178070
11392e1071j63277J06487A14062d29791i1589A420a00405A69859A813a86428A77335
$$ -51071 -214348 -107861 114062 -429791 -91589 1420 -100405 169859 1813 -186428 177335
11380f255j24448B37113O8866a08530o0853k58839O4683a6819k09111A33286k9114
$$ -6255 -130703 237113 305979 -108530 -169383 -428222 -363539 -16819 -225930 133286 104172
11369A04172a34705C1900b71667R3862e2780I0322a36506i416o0027C19142o9002
$$ 104172 -134705 31900 -271667 -177805 -52780 90322 -136506 -9416 -69443 319142 250140
11358B50140A7383L2835a61358A81081G8485L945M5871c40385A97164f6021l38692
$$ 250140 17383 50218 -161358 181081 78485 82430 128301 -340385 197164 -66021 -404713
11347d04713a97643A74208b8961A1858Q9977b87647a09749E8377e3058l303B17276
$$ -404713 -197643 174208 -28961 11858 101835 -287647 -109749 58377 -53058 -56361 217276
11335a02894o2857A01217D0628b18939j53092f7208l6827E7469a24875d9501k96369
$$ -102894 -165751 101217 40628 -218939 -372031 -67208 -104035 57469 -124875 -49501 -345870
11324c45870a31636N0148q7337j7571A56a01504A86513q6417b33465L1664B85323
$$ -345870 -131636 -81488 -168825 -186396 156 -101504 186513 100096 -233465 -201801 285323
11312B8020b14227I6502K11237f3714p3791A47440B2105a00370C85199b89016
$$ 28020 -214227 96502 307739 -63714 -137505 147440 22105 -100370 385199 -289016
11301C27803C9491a83246K9222e2674C59606f0303j74319n2895A95130d056o3488
$$ 327803 39491 -183246 -154024 -52674 359606 -60303 -234622 -287517 195130 -4056 -67544
11290f7544C33791e0144E3921h5645K529A63581a01343H8677B8923d7791D1565
$$ -67544 333791 -50144 53921 -85645 -83116 163581 -101343 88677 28923 -47791 41565
11278A79143n7902K3096b01568f8995K2790K100m33180A9901a76068K5466A9458
$$ 179143 121241 144337 -201568 -68995 -46205 -44105 -477285 19901 -176068 -150602 19458
11266g1457e22n37598a78401j31604a53812C9047b75306O1376B2225g8850k59684
$$ -71457 -522 -538120 -178401 -310005 -153812 39047 -275306 -213930 22225 -78850 -338534
11255c38534J41943m219D27950F4834P0131A5842a4103j09633F3146J6119c48173
$$ -338534 -196591 -200810 427950 64834 134965 15842 -14103 -123736 63146 79265 -348173
11243B26433F6196a06550L8749k2039I1245l2399M0706J09764D9072b11286A28786
$$ 226433 66196 -106550 -67801 -89840 91245 58846 99552 209316 49072 -211286 128786
11231b86968G6029f1255j1411B00171b32092C04596i234A51201J52699a09085
$$ -286968 76029 -61255 -72666 200171 -232092 304596 -9234 151201 303900 -109085
11220E441L964a01670b8144j57813N8563d440l20467A49698c70586a18816E0311
$$ 5441 9405 -101670 -28144 -185957 -127394 -4440 -324907 149698 -370586 -118816 50311
11208b54128a08658q98l25781J42857J09594l17355B03164i2303B01799c22185
$$ -254128 -108658 -109556 -435337 -292480 -182886 -500241 203164 -92303 201799 -322185
11197G5457J48670o471g7162l7874d0189H3521c32017B1504d0297B95242a19569
$$ 75457 224127 217656 -77162 -115036 -40189 83521 -332017 21504 -40297 295242 -119569
11185h5697A08957a31375k42001d2856j70284f058B6902h3608A03627C7713K4485
$$ -85697 108957 -131375 -373376 -42856 -213140 -6058 26902 -83608 103627 37713 62198
11174F2198a67118c1186k48049O5863R8692J0419e1036m302D5433a29059F1751
$$ 62198 -167118 -31186 -279235 -213372 -114680 -104261 -51036 -55338 45433 -129059 61751
11162F2629c6502j34427A74142b26960B51841a3260j11452C9937h2601l25907
$$ 62629 -36502 -170929 174142 -226960 251841 -13260 -124712 39937 -82601 -408508
11152d08508P9209A14837a63853A4081O1467M6474O3041a82420N5147q225h196
$$ -408508 -329299 114837 -163853 14081 75548 122022 185063 -182420 -127273 -135498 -8196
11140b03157B0464J03532i6213J8738B1960a73916r489a5339j15864f2702C25262
$$ -203157 20464 123996 -96213 -77475 21960 -173916 -183405 -15339 -131203 -62702 325262
11128B57918b49295A39504A7237c13382C817L66809B2624J9674K19622j27695
$$ 257918 -249295 139504 17237 -313382 3817 370626 22624 42298 261920 134225
11118A34225g9463C8428b245H6428K8994n7510N0965h4910j01498g1379E08678
$$ 134225 -79463 38428 -2245 86428 115422 57912 108877 -84910 -186408 -71379 508678
11106D21869k8212J44358B46519m8384K67828G6954b24143C04534r6931K65481
$$ 421869 393657 538015 246519 198135 465963 76954 -224143 304534 207603 473084
11096D73084A13291D8901a85485A91753J67918e5162A13341J41003J19557A5312
$$ 473084 113291 48901 -185485 191753 359671 -55162 113341 254344 373901 15312
11085A7539K19345m1592H9456J45489J52556H3725k2244M40817j57058r0628O3331
$$ 17539 236884 195292 89456 234945 387501 83725 61481 502298 345240 254612 317943
11074C17943k986M4062M9018j24256M7771k9983M2306M2194A51658M15584j36152
$$ 317943 314957 359019 408037 283781 331552 301569 343875 386069 151658 567242 431090
11063D31090m8114p4005P5981L75031l62082L24333j45324k1459J34947j15111
$$ 431090 382976 308971 384952 759983 397901 722234 576910 555451 690398 575287
11053E75287o8401K44501Q7421m9607J60879J8943P433k49137K85783l59270L65222
$$ 575287 506886 751387 838808 789201 950080 969023 976456 727319 1013102 653832 1019054
11042A019054k9979l48851M11344D92685L96321j06728k07573K791L09804l8562
$$ 1019054 989075 640224 1051568 492685 889006 782278 574705 577496 887300 848738
11032H48738k79018L01291j82445K11651n9204k72499R9337j54314N05289k00395
$$ 848738 569720 871011 688566 900217 841013 568514 667851 513537 1018826 818431
11022H18431j34260j07623p8604J12008q4190J30721j16099L1539m4495L41317
$$ 818431 684171 576548 497944 609952 525762 656483 540384 571923 527428 868745
11012H68745k01943k21304J39709K81917j18285j54540J86429l87545M2765K23466
$$ 868745 666802 445498 585207 867124 748839 594299 780728 393183 435948 659414
11002F59414l3199j20169K36524M9755k47602P2899j44769L39350J56617k03885
$$ 659414 626215 506046 742570 792325 544723 617622 472853 812203 968820 764935
10992G64935J3808k53183M48561j66463k5707M5901J28804K18886k19621M5713
$$ 764935 778743 525560 974121 807658 781951 827852 956656 1175542 955921 1001634
10982A001634K68255j70453K86524M54070Q5619J4585J18013L07746M08439J24188
$$ 1001634 1269889 1099436 1385960 1840030 1925649 1940234 2058247 2365993 2774432 2898620
10972B898620J71959j7374L788m3396Q4897m28548m00223o01749l22429R8032
$$ 2898620 3070579 3053205 3056993 3013597 3098494 2669946 2269723 1667974 1345545 1443577
10962A443577J87930n45098L43071k48988j67837j18249L4072J50129l38110j10335
$$ 1443577 1631507 1086409 1429480 1180492 1012655 894406 928478 1078607 740497 630162
10952F30162L7714l7345k99976j12677I6395J19455J00752A45373J49587k5431
$$ 630162 667876 630531 330555 217878 96395 215850 316602 145373 294960 269529
10942B69529i4784c8372B38809b6035J1624F6718i0926C20444r3958A00848K88945
$$ 269529 -94784 -38372 238809 -26035 -14411 66718 -90926 320444 226486 100848 389793
10931C89793C7214F249d5479F7668J29509a15730B08881a48971F3118J22882C7583
$$ 389793 37214 6249 -45479 67668 197177 -115730 208881 -148971 63118 186000 37583
10919e2075A3909K20156J33051A00822D7259J10573A4720J7601c42183a16445
$$ -52075 13909 234065 367116 100822 47259 157832 14720 32321 -342183 -116445
10908b18929B8943g6538K0638B05656F504P5009E18R9272C960K3886i9534M0084
$$ -218929 28943 -76538 -55900 205656 6504 81513 518 99790 3960 27846 -99534 -59450
10896e9450p6141C45250B9288K801a89392g3346B95003a28159j45795A30381N2365
$$ -59450 -135591 345250 29288 32089 -189392 -73346 295003 -128159 -273954 130381 182746
10885A82746a27941c8678C665J14430J65830c34937h4914H0882C2542J10276a81409
$$ 182746 -127941 -38678 3665 118095 283925 -334937 -84914 80882 32542 142818 -181409
10873a27178l377K8127H1729J21000p5879J39308a09154a6686A5469R4095b9186
$$ -127178 -130555 -102428 81729 202729 126850 266158 -109154 -16686 15469 109564 -29186
10861f9670A11481a12991D9849O3416m9082M87130I9495M2808b71215a8540o1771
$$ -69670 111481 -112991 49849 113265 64183 551313 99495 142303 -271215 -18540 -80311
10850h0311A31749d4408D2379d06368a10214l81974C9395j7709b58799a16816
$$ -80311 131749 -44408 42379 -406368 -110214 -492188 39395 21686 -258799 -116816
10839a65713N4540A31385L231B5296b20457B3570a21532L3810j59889c1427G9879
$$ -165713 -111173 131385 134616 25296 -220457 23570 -121532 -87722 -247611 -31427 79879
10827a44306j57830f0816j58659a03469p1292k23789A30493J28319a80771P2762
$$ -144306 -302136 -60816 -219475 -103469 -174761 -398550 130493 258812 -180771 -108009
10817a08009H0379N878d7830k36990g0543H7757h3317K3621a8679K71r4121E3729
$$ -108009 80379 86257 -47830 -284820 -70543 87757 -83317 -59696 -18679 -18408 -112529 53729
10804a34739L5336B47092a39414E8858d55814a216C9025a46068k4368n4313A13114
$$ -134739 -99403 247092 -139414 58858 -455814 -1216 39025 -146068 -170436 -224749 113114
10792b15021A99713b28521D7539b61340E3527K78710e3833B63847a4592B9185
$$ -215021 199713 -228521 47539 -261340 53527 332237 -53833 263847 -14592 29185
10781a64598A6754f4959A38283c20089f2609F6209M5086b67411F7422j8001a80769
$$ -164598 16754 -64959 138283 -320089 -62609 66209 111295 -267411 67422 49421 -180769
10769a90994A24326c6991l5839C67722A56467A2319b9423q7338M6223B23024a06226
$$ -190994 124326 -36991 -72830 367722 156467 12319 -29423 -116761 -70538 223024 -106226
10757A04205b62051h768b569E4576J19827Q2398b6551q4980k8754f5687A63095
$$ 104205 -262051 -8768 -2569 54576 174403 256801 -26551 -111531 -140285 -65687 163095
10745b43900F1960d9964k9735c0597C2670g1632p2995d1375q2127k48275F2127
$$ -243900 61960 -49964 -79699 -30597 32670 -71632 -144627 -41375 -123502 -371777 62127
10733B98756A05246H577c29749J42708C8303e5281j60637g392H1542N966C3632
$$ 298756 105246 8577 -329749 -187041 38303 -55281 -215918 -7392 81542 87508 33632
10721b16575E44230a19865k8353j13905B9875e88398H3059a01874H7391c6948
$$ -216575 544230 -119865 -148218 -262123 29875 -588398 83059 -101874 87391 -36948
10710F6621K6273Q465C0367O7563a13980B32568h6829F3213b14533A87162f6093
$$ 66621 92894 101359 30367 97930 -113980 232568 -86829 63213 -214533 187162 -66093
10698a23021A6093f6132A40754L5478f6746B5736L8976a54879O3585C56715c819
$$ -123021 16093 -66132 140754 176232 -66746 25736 64712 -154879 -91294 356715 -3819
10686A65432n2615a5647p0117j73639A34341a59412j60761F4092b16504A80394
$$ 165432 112817 -15647 -85764 -259403 134341 -159412 -320173 64092 -216504 180394
10675F3449b55906Q6399h2193B007J21724e2654k31377J2561a24325e4149o9237
$$ 63449 -255906 -169507 -82193 2007 123731 -52654 -284031 -271470 -124325 -54149 -123386
10664a23386j70731A15945a04321J5582m1471A20014D7469J06703a64004B9413
$$ -123386 -294117 115945 -104321 -88739 -130210 120014 47469 154172 -164004 29413
10653a07302c4156k49567E5006a47086B27857n0755q4567d07958f5962K2851q6164
$$ -107302 -34156 -283723 55006 -147086 227857 177102 92535 -407958 -65962 -43111 -129275
10642a29275c0868A1190a14632B17142c33927G8391a01625a5739A7707J23397
$$ -129275 -30868 11190 -114632 217142 -333927 78391 -101625 -15739 17707 141104
10632A41104a80229A17118J08909A389c63129J61462F137c4546l3181H1447R0013
$$ 141104 -180229 117118 226027 1389 -363129 -201667 6137 -34546 -67727 81447 171460
10621A71460E6915N6786b86046B72763C9034J09000a06216B9529J961e4545A36245
$$ 171460 56915 113701 -286046 272763 39034 148034 -106216 29529 31490 -54545 136245
10609d7576l26994A14853a30632l8215A50575b62709B0311Q5674d35780h422k05140
$$ -47576 -374570 114853 -130632 -168847 150575 -262709 20311 105985 -435780 -8422 -213562
10598b13562b6026k85294a13816e3235P616A00835a22575A25364a24372m5461
$$ -213562 -26026 -311320 -113816 -53235 -45619 100835 -122575 125364 -124372 -169833
10588a69833p8845P0158M7428N0416A4883c5516E3290A831K98361a99017i2566
$$ -169833 -248678 -178520 -131092 -80676 14883 -35516 53290 1831 300192 -199017 -92566
10576B61477a55186j56789i2571j14507E16e7595j30130F5985b02006B63449I4315
$$ 261477 -155186 -311975 -92571 -207078 516 -57595 -187725 65985 -202006 263449 94315
10564d9033J009o818A24997a33335j62162d6691q1959C1065D89a11165B96047
$$ -49033 -48024 -54842 124997 -133335 -295497 -46691 -128650 31065 489 -111165 296047
10552h3636j16700A49005E0179i4286b56A86475b25486i8183n5901j08488a04304
$$ -83636 -200336 149005 50179 -94286 -256 186475 -225486 -98183 -154084 -262572 -104304
10540b94616C41916a64022E7938c62072E9321e5824j81166R6171A1805a97353
$$ -294616 341916 -164022 57938 -362072 59321 -55824 -236990 -140819 11805 -197353
10529d75947A21176d2279q2214d2516O666B9284c306j93183A94423G4452B5526
$$ -475947 121176 -42279 -124493 -42516 -35850 29284 -3306 -196489 194423 74452 25526
10517a07091B5356b2266C812h9234r3640D5302e3686C95180A92037b8779k81897
$$ -107091 25356 -22266 3812 -89234 -182874 45302 -53686 395180 192037 -28779 -310676
10506c10676a23639J2441C8274J99336a96683l2508B82840a3673B3307b22217
$$ -310676 -123639 -111198 38274 237610 -196683 -229191 282840 -13673 23307 -222217
10495e3444A6813K9963b26766p6247E3546M6606G354b61412b1748A58126m8542
$$ -53444 16813 46776 -226766 -303013 53546 100152 7354 -261412 -21748 158126 109584
10484A09584K7713J57573F8073J96750q3094L9483D3588O0987f1895j2377j0784
$$ 109584 137297 294870 68073 264823 181729 221212 43588 104575 -61895 -74272 -85056
10473h5056j80166B67178q2726D8020a2989H5793O6124A2386c24206L2616J16372
$$ -85056 -265222 267178 184452 48020 -12989 85793 151917 12386 -324206 -291590 -175218
10462a75218I4183C7836L4265N9195e130B10482d65l20988O5497A94229o9894
$$ -175218 94183 37836 72101 131296 -5130 210482 -465 -321453 -255956 194229 124335
10451A24335A3052a6904C5607J09719k8975J04044a97062B60465b17346A1484
$$ 124335 13052 -16904 35607 145326 116351 220395 -197062 260465 -217346 11484
10440A47387k4566b69709B51516A08201n2623O1305P0505J17466b74013H8513
$$ 147387 122821 -269709 251516 108201 55578 116883 187388 304854 -274013 88513
10429h7646c8897C6597i0788L567B34243C133M7887c75363B67566G5289d1105
$$ -87646 -38897 36597 -90788 -87221 234243 3133 51020 -375363 267566 75289 -41105
10417a58031B19934D8833N5568a85842c3338D61607d83995C6076K47196a12384
$$ -158031 219934 48833 104401 -185842 -33338 461607 -483995 36076 283272 -112384
10406F4482c98431A30444a67088B5818Q5352O0506a24332J1384B26948b08230
$$ 64482 -398431 130444 -167088 25818 111170 171676 -124332 -112948 226948 -208230
10395C8965R3184L8280g8j38884A18072P8374q6372K57765A36864b5323j4437
$$ 38965 132149 170429 -78 -138962 118072 196446 110074 367839 136864 -25323 -39760
10384c9760A88692a46101A20833J00340F9634J16103a46328j5782A92303a66410
$$ -39760 188692 -146101 120833 221173 69634 185737 -146328 -162110 192303 -166410
10373B44626A20476k2412L64262k02536M0047J44869j66641L81114j82373j25973
$$ 244626 120476 98064 462326 259790 299837 444706 278065 659179 476806 350833
10363C50833Q3730j33199j37322P2580H9310K22755A04068g2643A73013J21435
$$ 350833 434563 301364 164042 236622 89310 312065 104068 -72643 173013 294448
10353B94448O6038J90596K01237k83684O9752J81633A09844n3622d0133C70569
$$ 294448 360486 551082 752319 468635 538387 720020 109844 56222 -40133 370569
10342B64542E1570K53316m080E4945L34427g2033A4239Q8919M5831J80518h8341
$$ 264542 51570 304886 300806 54945 389372 -72033 14239 103158 148989 329507 -88341
10330a58846A72511L2584N4455B9578N698L67086q0212A30446l0227R2490I5292
$$ -158846 172511 205095 259550 29578 35276 402362 322150 130446 100219 192709 95292
10318A12668l7507P7161n6081d595m6468n573A19973M156g5914l02516i4973A98850
$$ 112668 75161 152322 96241 -4595 -51063 -56636 119973 124129 -75914 -378430 -94973 198850
10305G7595c37145a08045H1203K05305e7483G2891i5604m563F3404a77430m5094
$$ 77595 -337145 -108045 81203 286508 -57483 72891 -95604 -100167 63404 -177430 -222524
10294b22524A46943e7000j2377q2198C1659N0717b45258B07905c01567D133a79514
$$ -222524 146943 -57000 -69377 -151575 31659 82376 -245258 207905 -301567 4133 -179514
10282c70607A71307a21381J7291B75163b9732p4318p2127K2255O8545j995A32934
$$ -370607 171307 -121381 -104090 275163 -29732 -104050 -176177 -153922 -85377 -87372 132934
10270F9678L42072a31941j83430d7571D504K29487O805A09277K6980J16439H3006
$$ 69678 411750 -131941 -315371 -47571 4504 233991 240796 109277 136257 252696 83006
10258A71968L2523K64374E6733a7039l0362j21705j6811C07610a0278A2931P5067
$$ 171968 204491 468865 56733 -17039 -47401 -169106 -185917 307610 -10278 12931 87998
10247H7998a56048l7392G4456O7915c3671j04181I333M5234a5826m9362B4201
$$ 87998 -156048 -193440 74456 142371 -33671 -137852 9333 54567 -15826 -65188 24201
10235A73338C0056J45875A983a9606j35242D6478r341Q6145m5823o980q623q029
$$ 173338 30056 175931 1983 -19606 -154848 46478 37137 123282 77459 70479 61856 53827
10223E3827a75959l64175A32593k5340B6746g3242j06870l05330G3107f4888A02707
$$ 53827 -175959 -540134 132593 107253 26746 -73242 -180112 -485442 73107 -64888 102707
10211A00183h7597k5175A17968J73289c11489I8484J16526a45942m9451n217i4180
$$ 100183 -87597 -112772 117968 291257 -311489 98484 215010 -145942 -195393 -200610 -94180
10199e0536j20314c5311H0756J5315h7147C56810f4187A05217a38585l1994d3624
$$ -50536 -170850 -35311 80756 96071 -87147 356810 -64187 105217 -138585 -170579 -43624
10187A11077j3475a20591A00048a67514B9279K16164E9893M1733B6409a04145
$$ 111077 97602 -120591 100048 -167514 29279 245443 59893 101626 26409 -104145
10176c2551A13867a67355j7659o0526E6958i5207j38369B20285F764L80277F4653
$$ -32551 113867 -167355 -185014 -245540 56958 -95207 -233576 220285 6764 387041 64653
10164d1095A79719b19767P0815A4917L467N0397a72337f8393B94541j31365h4882
$$ -41095 179719 -219767 -148952 14917 18384 68781 -172337 -68393 294541 163176 -84882
10152h4568k05693B32284a38051O1587A8856h8127a1409j14226F6659L06603I5241
$$ -84568 -290261 232284 -138051 -76464 18856 -88127 -11409 -125635 66659 373262 95241
10140F2755c9943a1216A32583C7951J95473a4598j93579O8726j7378L5257L8210
$$ 62755 -39943 -11216 132583 37951 233424 -14598 -208177 -139451 -156829 -121572 -83362
10129h3362L1774k01608a21193H3659b63358E5790d74262A6116i8395j99863g9127
$$ -83362 -51588 -253196 -121193 83659 -263358 55790 -474262 16116 -98395 -298258 -79127
10117a68103A56691i6597B25967f4956j75710f6308j6050j88499J24256r9034
$$ -168103 156691 -96597 225967 -64956 -240666 -66308 -82358 -270857 -146601 -245635
10107b45635a20982F2330J04743b4613k04027l4358A06830b7820C1914c45951
$$ -245635 -120982 62330 167073 -24613 -228640 -262998 106830 -27820 31914 -345951
10096a09779j17959e7141j65777k28305A51511a96216k5342j06419C853a3269
$$ -109779 -227738 -57141 -222918 -451223 151511 -196216 -221558 -327977 3853 -13269
10085I3281C0895a68794A95935a10384B55313E712J89531d1050D174J6456J10799
$$ 93281 30895 -168794 195935 -110384 255313 5712 195243 -41050 4174 20630 131429
10074A31429i0692g369E3085a067n3185A88673m0199n9051f0050j17651A51286
$$ 131429 -90692 -7369 53085 -1067 -54252 188673 148474 89423 -60050 -177701 151286
10062b2153k84577A29610a63336d0708j86579K8711j19641e4757H2013k8168L8382
$$ -22153 -306730 129610 -163336 -40708 -227287 -198576 -318217 -54757 82013 53845 92227
10051I2227a19749j4845j49110d7731I189J46073a63337a5513A22535K06409C0
$$ 92227 -119749 -134594 -283704 -47731 9189 155262 -163337 -15513 122535 328944 30
10039B7454b3933j9570j02379f4535l215j38312A38515a84695j54674A1987O1449
$$ 27454 -23933 -43503 -145882 -64535 -67750 -206062 138515 -184695 -339369 11987 73436
10028G3436a08138r1255a6921B2769D178b45169i4131m0998D1319a73226J9936
$$ 73436 -108138 -199393 -16921 22769 4178 -245169 -94131 -135129 41319 -173226 -153290
10017a53290A14392a35482F4014a22607e378q766E726c56048a40006A78918a93822
$$ -153290 114392 -135482 64014 -122607 -5378 -14144 5726 -356048 -140006 178918 -193822
10005C5506c61556a13837j4756k56573P2948K7651Q3220A35835D0548c04173P8208
$$ 35506 -361556 -113837 -128593 -385166 -312218 -284567 -201347 135835 40548 -304173 -225965
9994b25965o2189A6911a06427o4100B17211e7480A26604c50640b2080A46465h2039
$$ -225965 -288154 16911 -106427 -170527 217211 -57480 126604 -350640 -22080 146465 -82039
9982a21019A46660b9726a1350n8111j90039B78232b4385k22000a8519B04004G1840
$$ -121019 146660 -29726 -11350 -69461 -259500 278232 -24385 -246385 -18519 204004 71840
9970A48588c46759a50925r1448g2371m5733B4021h0255k75286d1800p9567a4295
$$ 148588 -346759 -150925 -242373 -72371 -118104 24021 -80255 -355541 -41800 -121367 -14295
9958a27473d2779k69528J53067m2106K9657g2382D902d5153A52617f0790q7473
$$ -127473 -42779 -312307 -159240 -201346 -171689 -72382 4902 -45153 152617 -60790 -148263
9947a48263C3138O8494c7941B35590b1198p6795k99467J58000A02653J59031a71877
$$ -148263 33138 101632 -37941 235590 -21198 -97993 -397460 -239460 102653 261684 -171877
9935i225j3556K500F0046J85344b41906m288b832G3118a09683B75560b6738E5377
$$ -9225 -22781 -20281 60046 245390 -241906 -246194 -2832 73118 -109683 275560 -26738 55377
9922A65899O7256q887m9904a24309R203A62237R4995A2322K88349A8534J81522
$$ 165899 233155 224268 174364 -124309 -115106 162237 257232 12322 300671 18534 200056
9911B00056f3678E7610h2483H2357M2032C4303b94471F310O4399I107J24557B8178
$$ 200056 -63678 57610 -82483 82357 124389 34303 -294471 6310 70709 9107 133664 28178
9898a69099j77245h7834j84588d7194j9349J8642j80671a1736k22341m8419I272
$$ -169099 -346344 -87834 -272422 -47194 -66543 -47901 -228572 -11736 -234077 -282496 9272
9886c31187B41880F5868b03662k1491J08064A11239k2290E193b41896c1849o4457
$$ -331187 241880 65868 -203662 -225153 -117089 111239 88949 5193 -241896 -31849 -96306
9875i6306n832d2001J7603j95567f0285A340J6415a10504k24430n1975a42502
$$ -96306 -102138 -42001 -24398 -219965 -60285 1340 17755 -110504 -334934 -386909 -142502
9863A18600M8175a04389j68726d3125k78142b5274E8672a31299j20833M5544R9746
$$ 118600 166775 -104389 -273115 -43125 -321267 -25274 58672 -131299 -252132 -206588 -106842
9852a06842j54201j42787a41930j82813H1289i5382A53535b59218F1134N4082
$$ -106842 -261043 -403830 -141930 -324743 81289 -95382 153535 -259218 61134 115216
9842A15216a85099h2897L4780q1017B4249a90832B37192H8950a59693M034c4026
$$ 115216 -185099 -82897 -48117 -129134 24249 -190832 237192 88950 -159693 -155659 -34026
9830c14833B5622a82090B31885C6445K01773B3981O093O3027a13660D3484J78952
$$ -314833 25622 -182090 231885 36445 238218 23981 30074 93101 -113660 43484 222436
9819B22436F2289h8094j57622D11440b5821F5092a48126N5867A05566c31475A33858
$$ 222436 62289 -88094 -245716 411440 -25821 65092 -148126 -92259 105566 -331475 133858
9807h7298L4781A69365b4882j20696A31259a38793j38587E0075Q6257A434i4263
$$ -87298 -52517 169365 -24882 -145578 131259 -138793 -277380 50075 136332 1434 -94263
9795A8821J21088j9609P530d3076k14068B33895g747C77827F7918L05001c35110
$$ 18821 139909 120300 127830 -43076 -257144 233895 -7747 377827 67918 372919 -335110
9783I4982a93419R5095A77756a51992a9529j4907Q939l15729J26929Q471A2960
$$ 94982 -193419 -98324 177756 -151992 -19529 -34436 -25497 -341226 -214297 -205826 12960
9771b81149k7543H2572o520b99543R3724A49452a56150N3443n4844m52336b09248
$$ -281149 -308692 82572 76052 -299543 -205819 149452 -156150 -102707 -157551 -609887 -209248
9759e5191G8798K613a37150G7631a80006N8580A28378c28002H5661J92373D3273
$$ -55191 78798 81411 -137150 77631 -180006 -121426 128378 -328002 85661 278034 43273
9747a20427H5341g0310k5564F1045e69567a64434A80907e9181J7926J5071I5612
$$ -120427 85341 -70310 -95874 61045 -569567 -164434 180907 -59181 -41255 -26184 95612
9735b47758A46380b55937J16962n0497C4040J26785m6791n2185b14278k53006
$$ -247758 146380 -255937 -138975 -189472 34040 160825 114034 61849 -214278 -467284
9725d67284A40344a5576D8177J59526j4195a0830H922e2197j7714A9054a04757
$$ -467284 140344 -15576 48177 207703 193508 -10830 8922 -52197 -69911 19054 -104757
9713B75023a26230q887k58718I2481h9246j26745M2201L9662C74498b67922B41105
$$ 275023 -126230 -135117 -393835 92481 -89246 -215991 -173790 -134128 374498 -267922 241105
9701A26189K1963a47666B37512d3722k89563e8436C30499c18655G436e0862l1193
$$ 126189 148152 -147666 237512 -43722 -333285 -58436 330499 -318655 7436 -50862 -82055
9690h2055k39041d7535k94124a5784A24203m4985b97426J00845d7603m7793j50857
$$ -82055 -321096 -47535 -341659 -15784 124203 79218 -297426 -196581 -47603 -95396 -246253
9679b46253h5008D142c9399B59349a60247j78566C29203p1246a67623P0362j97845
$$ -246253 -85008 4142 -39399 259349 -160247 -338813 329203 257957 -167623 -97261 -295106
9668b95106A46659P8859f717B89834c2365E2667b490o1679l36162a92853L2391
$$ -295106 146659 225518 -6717 289834 -32365 52667 -2490 -64169 -400331 -192853 -160462
9657a60462j04542R0939i539k52517R522P2499f8169H6109b5603j91202L7844
$$ -160462 -265004 -174065 -9539 -262056 -252534 -180035 -68169 86109 -25603 -216805 -178961
9646a78961j05442q928A69512i8237K0478I4508M7549E3436h0552J5879G5464
$$ -178961 -284403 -293331 169512 -98237 -77759 94508 142057 53436 -80552 -64673 75464
9634b2648j45215e3935j36173R4159a4840j9072k87748M1624J25000f7424q3364
$$ -22648 -167863 -53935 -190108 -95949 -14840 -33912 -321660 -280036 -155036 -67424 -150788
9623a50788p468p886c5708r4046c891l38413a53933I4664R544i9570A51730b15390
$$ -150788 -158256 -166142 -35708 -129754 -3891 -342304 -153933 94664 104208 -99570 151730 -215390
9610a79715B3089J42945a16214e3481A21961i0516B46249B0451a76866P1301B2097
$$ -179715 23089 166034 -116214 -53481 121961 -90516 246249 20451 -176866 -105565 22097
9598a58828E14673a62617j84980J06470e153j78101Q9018E382e9225p7334C97111
$$ -158828 514673 -162617 -347597 -241127 -5153 -183254 -94236 5382 -59225 -136559 397111
9586D1175K7712f4288L350A68692a26310f1017j02370h0483A04151b19285f3277
$$ 41175 68887 -64288 -60938 168692 -126310 -61017 -163387 -80483 104151 -219285 -63277
9574A89864b96474a05750A19538g4368k21686f7101F7952J16565q899E4485a16437
$$ 189864 -296474 -105750 119538 -74368 -296054 -67101 67952 184517 175618 54485 -116437
9562c3688F9430a99274g1075k32055Q9295b7180q2457K5144p4622o7035A48796
$$ -33688 69430 -199274 -71075 -303130 -213835 -27180 -109637 -84493 -159115 -226150 148796
9550d51114E8335a79614g1713G9474g891A54668g8968C4115a15229D1808b70160
$$ -451114 58335 -179614 -71713 79474 -7891 154668 -78968 34115 -115229 41808 -270160
9538A7966b56708A73986d0483k78405J2101Q7722R196N4948r030C02898H1865
$$ 17966 -256708 173986 -40483 -318888 -306787 -219065 -209869 -154921 -163951 302898 81865
9526b74948a29750p6790P2713o1017g5988j00220C00094b79519j15704A03648
$$ -274948 -129750 -206540 -133827 -194844 -75988 -176208 300094 -279519 -395223 103648
9515A68196e7983A72280e6378p0762A54986O1662a28829k66216J92882j44156
$$ 168196 -57983 172280 -56378 -127140 154986 216648 -128829 -395045 -202163 -346319
9505c46319A46660m8197A8901e9196j70347L1131I4257b66996a29641N0810j65878
$$ -346319 146660 98463 18901 -59196 -229543 -198412 94257 -266996 -129641 -78831 -244709
9494b44709P4774p3376F9350b30098D3783a8932q0695j17322F7651h3575F6226
$$ -244709 -169935 -243311 69350 -230098 43783 -18932 -99627 -216949 67651 -83575 66226
9482D2043K18286a09194j6878A13125a54973A58841m7040k6078a09760L9152B0320
$$ 42043 260329 -109194 -126072 113125 -154973 158841 111801 85723 -109760 -70608 20320
9470A54596J78158A14272a64208C21505i2101A66612A5036K84383a03770a8807
$$ 154596 332754 114272 -164208 321505 -92101 166612 15036 299419 -103770 -18807
9459c5982o3195C35477C3957J10125b63314A66978d7472B11993c0292B00077c6833
$$ -35982 -99177 335477 33957 144082 -263314 166978 -47472 211993 -30292 200077 -36833
9447c4578J3931k29934C32833a85899k77199A43479b37823A7908a21890A8444
$$ -34578 -20647 -250581 332833 -185899 -463098 143479 -237823 17908 -121890 18444
9436b16728R0451b103A19212E6366d40521K19536p845O0383o8576d8243o6465
$$ -216728 -126277 -2103 119212 56366 -440521 -220985 -228830 -168447 -237023 -48243 -114708
9425a14708o0829d3726a0431D21942D8393e1064a7879C62518b40998e5407j26637
$$ -114708 -175537 -43726 -10431 421942 48393 -51064 -17879 362518 -240998 -55407 -182044
9414a82044g056A64063b13651A4736c44387f3965B1194f3566B03891N748b3401
$$ -182044 -7056 164063 -213651 14736 -344387 -63965 21194 -63566 203891 209639 -23401
9402g9637D502L09710a52128b1947j14878A26017b26507i4900L9485J8566P65
$$ -79637 4502 314212 -152128 -21947 -136825 126017 -226507 -94900 -55415 -36849 -36084
9391c6084j51338g7052H8628h8094E0536Q7686h9114C3473J61084A5490P5045
$$ -36084 -187422 -77052 88628 -88094 50536 138222 -89114 33473 194557 15490 90535
9380I0535d43150a6123j04065j73841A0167e9362k33298R242A53568c48869f2001
$$ 90535 -443150 -16123 -120188 -294029 10167 -59362 -292660 -283418 153568 -348869 -62001
9368a17280C9040b11299m7253A13012a07147I1275a48166k09371D5686a71854
$$ -117280 39040 -211299 -258552 113012 -107147 91275 -148166 -357537 45686 -171854
9357c76584a72850E6842h738l71726A06624i4182I2742b432l41358H0181J84337
$$ -376584 -172850 56842 -8738 -380464 106624 -94182 92742 -2432 -343790 80181 264518
9346B64518a28698j84392f3188j19095A80279i1571C38929c66436G9864b0829
$$ 264518 -128698 -313090 -63188 -182283 180279 -91571 338929 -366436 79864 -20829
9335a40068H5538h3026A39340b05579J8595g6394o6806b9821j40403j93923e0800
$$ -140068 85538 -83026 139340 -205579 -186984 -76394 -143200 -29821 -170224 -364147 -50800
9323a47125A21959h7154K9508B0116a26511l8655d6472F9137b85402I5165c2464
$$ -147125 121959 -87154 -57646 20116 -126511 -165166 -46472 69137 -285402 95165 -32464
9311H1520B7600N4936b26367E2753h990j08863d955f35l30504L3383B21120a70274
$$ 81520 27600 82536 -226367 52753 -8990 -117853 -4955 -635 -331139 -297756 221120 -170274
9298i0785A84683a97177O8629a6955B68000m7755a8359k1082I9415a27046j3208
$$ -90785 184683 -197177 -128548 -16955 268000 220245 -18359 -39441 99415 -127046 -140254
9287a40254o2010P6511K3781k8587j8325o9266P3813K7696N5747A51468c9593
$$ -140254 -202264 -125753 -101972 -130559 -148884 -218150 -144337 -116641 -60894 151468 -39593
9275f240o8386k86276C6870c5284g819r9137N2477E566g60r5493l8838m3955L5741
$$ -6240 -74626 -360902 36870 -35284 -7819 -106956 -54479 5566 -760 -96253 -135091 -179046 -143305
9262a43305B64358k1940a12460A5303n312d12505a05445l2334B20551a67766l912
$$ -143305 264358 242418 -112460 15303 9991 -412505 -105445 -137779 220551 -167766 -171678
9251a71678F8069b25590M1863j08039A81200D2467b07333B09422E5368b10959
$$ -171678 68069 -225590 -183727 -291766 181200 42467 -207333 209422 55368 -210959
9240B1736J09500A3208b21270k3295Q4760G8690C4401c09157f522C881a37260
$$ 21736 131236 13208 -221270 -244565 -159805 78690 34401 -309157 -6522 3881 -137260
9228b56689A34020B6740d8975r7811K4624c3496j39236K766k05283g3476j00753
$$ -256689 134020 26740 -48975 -146786 -122162 -33496 -172732 -169966 -375249 -73476 -174229
9217a74229j79929A09570J89465A11623J67678A32174c23345Q6623C14524E2431
$$ -174229 -354158 109570 299035 111623 279301 132174 -323345 -236722 314524 52431
9206G8122B2640c07474F3186b00186F4644J7758a01121d6949k30709A95976a03810
$$ 78122 22640 -307474 63186 -200186 64644 82402 -101121 -46949 -277658 195976 -103810
9194A82077a78422g5871b2967D341J95533c0266j80554i0381L5961m0457K1694
$$ 182077 -178422 -75871 -22967 4341 199874 -30266 -210820 -90381 -54420 -94877 -73183
9183g3183A89423H8694h0392b0863k48163Q6591d0420n7930M4922n2547a5741
$$ -73183 189423 88694 -80392 -20863 -269026 -182435 -40420 -98350 -53428 -105975 -15741
9171g5089b5203l06147A98090g2527H9031K7915a19839a747j77245f0953G8137
$$ -75089 -25203 -331350 198090 -72527 89031 116946 -119839 -1747 -178992 -60953 78137
9159f6609H494a22989e2922j81107A13731a0760E9083Q6150a08836p6289d8148
$$ -66609 8494 -122989 -52922 -234029 113731 -10760 59083 145233 -108836 -185125 -48148
9147a62220A55503b6008k0860B54803l2365a18992B3126R963b27366d8610A88453
$$ -162220 155503 -26008 -46868 254803 222438 -118992 23126 33089 -227366 -48610 188453
9135a31555l1381g8574k94357a85145k521C53876A11286b19876B10021K973A0811
$$ -131555 -162936 -78574 -372931 -185145 -187666 353876 111286 -219876 210021 212994 10811
9123i9070j41191r9866a66079r3566B187J11641Q16c48110d8941D104K8017P177
$$ -99070 -240261 -340127 -166079 -259645 2187 113828 114644 -348110 -48941 4104 32121 39298
9111C9298a97375k169C0051R5571b79029k7304e7793K6682A646i260k11778f3525
$$ 39298 -197375 -199544 30051 125622 -279029 -306333 -57793 -31111 1646 -9260 -221038 -63525
9098a61640a7162j45867C2411b20499d5375j98837J17455n977l196b7641A07638
$$ -161640 -17162 -163029 32411 -220499 -45375 -244212 -126757 -132734 -135930 -27641 107638
9086b36129J4248F3977e3809k65477F3182c54411e5630C9009c16687b5601q0890
$$ -236129 -221881 63977 -53809 -319286 63182 -354411 -55630 39009 -316687 -25601 -106491
9075a06491A75682o36n3971d0935o8169K1089q2569e3399j09507A19146d69235
$$ -106491 175682 175046 121075 -40935 -109104 -88015 -170584 -53399 -162906 119146 -469235
9063c04168B44648E1605a1154k12181R2281j66594j6434B1546b74770j7223A6376
$$ -304168 244648 51605 -11154 -223335 -131054 -297648 -314082 21546 -274770 -291993 16376
9051e8483A10707J14623a04173B4637O1106b03198e5264o1596C5653a24250A52276
$$ -58483 110707 225330 -104173 24637 85743 -203198 -55264 -116860 35653 -124250 152276
9039B01819a34325L9689A22398a50609K0355I1631j6244b22011k394i4726d3485
$$ 201819 -134325 -94636 122398 -150609 -130254 91631 75387 -222011 -224405 -94726 -43485
9027a0054B11370l9130e5029k81577A84107o7062a68714B16478b1418k12475k25546
$$ -10054 211370 172240 -55029 -336606 184107 117045 -168714 216478 -21418 -233893 -459439
9016d59439A38023K23054j59243a19844c5252r2948j12410b9299k65067a657H9514
$$ -459439 138023 361077 201834 -119844 -35252 -128200 -240610 -29299 -294366 -1657 89514
9004a35234C2825i2730E1174b76501A05905c4550B10156C1435i3608j46154f8255
$$ -135234 32825 -92730 51174 -276501 105905 -34550 210156 31435 -93608 -239762 -68255
8992c758q636I828a23945A87733b4263b234j75429D2366c53580A16616b01491
$$ -3758 -12394 9828 -123945 187733 -24263 -2234 -177663 42366 -353580 116616 -201491
8980D3783J21211c09058J52496A3914c0439j10810A57770E7702j8442J66546d15186
$$ 43783 164994 -309058 -156562 13914 -30439 -141249 157770 57702 39260 205806 -415186
8968A15489J0437J34847I5045P8225a89986C9587O4222e1740k12855N0630C2172
$$ 115489 125926 260773 95045 173270 -189986 39587 103809 -51740 -264595 -213965 32172
8956a90837M9183k25830C57903a0232j85882j2369G6196P8752D51a5779F6793
$$ -190837 -141654 -367484 357903 -10232 -196114 -208483 76196 154948 451 -15779 66793
8944c35197a35133d149j63717B07405r3757J23307N3782I9466J01894K06913j11687
$$ -335197 -135133 -4149 -167866 207405 113648 236955 290737 99466 201360 408273 296586
8933B96586L4016F0337i1490B4106i5884A34569N8381N44259j39344M89772L123713
$$ 296586 330602 60337 -91490 24106 -95884 134569 192950 737209 597865 1087637 4211350
8922D211350Q471550J441382C373404A317353n50792l15132j63260A22610m7408
$$ 4211350 12682900 14124282 3373404 1317353 766561 451429 288169 122610 75202
8913G5202a8555n0294j2987q8130D957P55141a30872e8650j40777N6745E4653
$$ 75202 -18555 -68849 -81836 -169966 4957 760098 -130872 -58650 -199427 -142682 54653
8901F8939c27512a22975O1035A24349l8683a04747A46837f080j50176e3829k4616
$$ 68939 -327512 -122975 -61940 124349 85666 -104747 146837 -6080 -156256 -53829 -78445
8890g8445l41655A62543h6473C33517j35199e5846A3037J25226b71633c7888j20042
$$ -78445 -420100 162543 -86473 333517 198318 -55846 13037 138263 -271633 -37888 -157930
8879a57930j84752A52743c65776A03552k2344a95533D4952c42014a63201A36788
$$ -157930 -342682 152743 -365776 103552 81208 -195533 44952 -342014 -163201 136788
8868A21899a63725K8501M3166I184P1491a17809B71i987A19406j9589d5742k222
$$ 121899 -163725 -135224 -92058 9184 80675 -117809 271 -9987 119406 99817 -45742 -47964
8856d7964j87310g8598m18088A02355e701k7100D7064K1205d3411o2455l9372
$$ -47964 -235274 -78598 -496686 102355 -5701 -32801 47064 68269 -43411 -105866 -145238
$$ [...]
##END NTUPLES=NMR SPECTRUM
##END=
