##TITLE=AC1582_13IEXT2718_8214273_05kkdScx9Q
##JCAMPDX= 6.0         $$ Bruker NMR JCAMP-DX V2.0
##DATA TYPE= NMR SPECTRUM
##DATA CLASS= NTUPLES
##ORIGIN= BRUKER
##OWNER= Administrator
$$ 1.72 TOPSPIN		Version 2.1
$$ 2013-10-04 23:39:18.013 -0700  Administrator@X
$$ Compression mode = diff/dup
##.OBSERVE FREQUENCY= 400.02188249412
##.OBSERVE NUCLEUS= ^1H
##.ACQUISITION MODE= SIMULTANEOUS (DQD)
##.ACQUISITION SCHEME= undefined
##.AVERAGES= 64
##.DIGITISER RES= 22
##SPECTROMETER/DATA SYSTEM= spect
##.PULSE SEQUENCE= noesygpps1d.comp
##.SOLVENT NAME= COFFEE_meoh
##.SHIFT REFERENCE= INTERNAL, COFFEE_meoh, 1, 14.96092
##AUDIT TRAIL= $$ (NUMBER, WHEN, WHO, WHERE, PROCESS, VERSION, WHAT)
$$ ##TITLE= Audit trail, TOPSPIN		Version 2.1
$$ ##JCAMPDX= 5.01
$$ ##ORIGIN= Bruker BioSpin GmbH
$$ ##OWNER= Administrator
$$ $$ E:\/data/COFFEE/nmr/AC1582_13IEXT2718_8214273_05kkdScx9Q/12/pdata/1/auditp.txt
$$ ##AUDIT TRAIL=  $$ (NUMBER, WHEN, WHO, WHERE, PROCESS, VERSION, WHAT)
(   1,<2013-10-04 23:39:13.341 -0700>,<Administrator>,<X>,<go>,<TOPSPIN 2.1>,
      <created by zg
	started at 2013-10-04 23:27:43.966 -0700,
	POWCHK enabled, PULCHK disabled,
       configuration hash MD5:
       C8 4E 4E 5D D3 5C D8 9E 9F 52 82 E0 59 8A DE 15
       data hash MD5: 64K
       1D B5 C3 66 95 6A 65 B4 94 C2 59 AB 74 CD F0 64>)
(   2,<2013-10-04 23:39:16.216 -0700>,<Administrator>,<X>,<proc1d>,<TOPSPIN 2.1>,
      <Start of raw data processing
       efp LB = 0.3 FT_mod = 6 PKNL = 1 PHC0 = 0 PHC1 = 0 SI = 128K 
       data hash MD5: 128K
       23 B0 1E 16 35 08 A8 BC E6 50 C1 4B 05 D7 F3 30>)
(   3,<2013-10-04 23:39:17.107 -0700>,<Administrator>,<X>,<proc1d>,<TOPSPIN 2.1>,
      <pk PHC0 = -82.61169 PHC1 = 0 
       data hash MD5: 128K
       C2 A6 41 A2 E0 9B E9 C2 E1 E6 3A 63 AE 79 CB 8B>)
(   4,<2013-10-04 23:39:17.513 -0700>,<Administrator>,<X>,<proc1d>,<TOPSPIN 2.1>,
      <abs ABSG = 1 
       data hash MD5: 128K
       47 DD 23 5E C5 2C 0F 0B 5F CC BD 89 5A 6E 1C 4A>)
(   5,<2013-10-04 23:39:17.591 -0700>,<Administrator>,<X>,<proc1d>,<TOPSPIN 2.1>,
      <abs ABSG = 2 
       data hash MD5: 128K
       00 5E 2F 6B BC E4 C2 40 5A 46 84 C4 6E 8A 15 30>)
(   6,<2013-10-04 23:39:17.669 -0700>,<Administrator>,<X>,<proc1d>,<TOPSPIN 2.1>,
      <abs ABSG = 3 
       data hash MD5: 128K
       C3 EC C1 FE ED 7D B5 1F 81 0F 59 33 C8 22 4C 76>)
(   7,<2013-10-04 23:39:17.748 -0700>,<Administrator>,<X>,<proc1d>,<TOPSPIN 2.1>,
      <abs ABSG = 4 
       data hash MD5: 128K
       1B B3 66 A0 22 BE 4E A2 0C 68 FC 8A 6B EC A7 A7>)
(   8,<2013-10-04 23:39:17.841 -0700>,<Administrator>,<X>,<proc1d>,<TOPSPIN 2.1>,
      <abs ABSG = 5 
       data hash MD5: 128K
       1B 0C 29 F0 CE CF AB 29 51 AC 86 26 AE F4 7C 23>)
$$ ##END=
$$ 
$$ $$ hash MD5
$$ $$ 15 11 DD 68 21 61 47 BA 2C 45 3B 83 F4 93 1D C1
##$RELAX= 
##$RELAX= 
##$RELAX= 
##$RELAX= 
##$RELAX= 
##$RELAX= 
##$RELAX= 
##$RELAX= 
$$ Bruker specific parameters
$$ --------------------------
##$DU= <E:\>
##$EXPNO= 12
$$ [...]
##$TP07= 0
##$TPNAME0= <>
##$TPNAME1= <>
##$TPNAME2= <>
##$TPNAME3= <>
##$TPNAME4= <>
##$TPNAME5= <>
##$TPNAME6= <>
##$TPNAME7= <>
##$TPOAL= (0..7)
0.5 0.5 0.5 0.5 0.5 0.5 0.5 0.5
##$TPOFFS= (0..7)
0 0 0 0 0 0 0 0
##$TUNHIN= 0
##$TUNHOUT= 0
##$TUNXOUT= 0
##$USERA1= <user>
##$USERA2= <user>
##$USERA3= <user>
##$USERA4= <user>
##$USERA5= <user>
##$V9= 5
##$VALIST= <valist>
##$VCLIST= <CCCCCCCCCCCCCCC>
##$VD= 0
##$VDLIST= <DDDDDDDDDDDDDDD>
##$VPLIST= <PPPPPPPPPPPPPPP>
##$VTLIST= <TTTTTTTTTTTTTTT>
##$WBST= 2048
##$WBSW= 25
##$XGAIN= (0..3)
0 0 0 0
##$XL= 0
##$YL= 0
##$YMAX_a= 6477785
##$YMIN_a= -11549459
##$ZGOPTNS= <>
##$ZL1= 120
##$ZL2= 120
##$ZL3= 120
##$ZL4= 120
##$ABSF1= 14.96092
##$ABSF2= -5.597261
##$ABSG= 5
##$ABSL= 3
##$ALPHA= 0
##$AQORDER= 0
##$ASSFAC= 0
##$ASSFACI= 0
##$ASSFACX= 0
##$ASSWID= 0
##$AUNMP= <proc_prof1d_extract.lims>
##$AXLEFT= 0
##$AXNAME= <>
##$AXNUC= <1H>
##$AXRIGHT= 0
##$AXTYPE= 0
##$AXUNIT= <>
##$AZFE= 0.1
##$AZFW= 0.1
##$BCFW= 0
##$BC_mod= 0
##$BYTORDP= 0
##$COROFFS= 0
##$CY= 15
##$DATMOD= 1
##$DC= 0
##$DFILT= <>
##$DTYPP= 0
##$F1P= 0
##$F2P= 0
##$FCOR= 0.5
##$FTSIZE= 131072
##$FT_mod= 6
##$GAMMA= 0
##$GB= 0
##$INTBC= 1
##$INTSCL= 1
##$ISEN= 128
##$LB= 0.3
##$LEV0= 0
##$LPBIN= 0
##$MAXI= 10000
##$MC2= 0
##$MEAN= 0
##$ME_mod= 0
##$MI= 0
##$NCOEF= 0
##$NC_proc= -2
##$NLEV= 6
##$NOISF1= 0
##$NOISF2= 0
##$NSP= 0
##$NTH_PI= 0
##$NZP= 0
##$OFFSET= 14.96092
##$PC= 1
##$PHC0= -82.61169
##$PHC1= 0
##$PH_mod= 1
##$PKNL= yes
##$PPARMOD= 0
##$PPDIAG= 0
##$PPIPTYP= 0
##$PPMPNUM= 2147483647
##$PPRESOL= 1
##$PSCAL= 4
##$PSIGN= 0
##$PYNMP= <proc.py>
##$REVERSE= no
##$SF= 400.020009670066
##$SI= 131072
##$SIGF1= 0
##$SIGF2= 0
##$SINO= 400
##$SIOLD= 131072
##$SPECTYP= <>
##$SREGLST= <1H.CDCl3>
##$SSB= 0
##$STSI= 131072
##$STSR= 0
##$SW_p= 8223.68421052631
##$SYMM= 0
##$S_DEV= 0
##$TDeff= 65536
##$TDoff= 0
##$TI= <>
##$TILT= no
##$TM1= 0
##$TM2= 0
##$TOPLEV= 0
##$USERP1= <user>
##$USERP2= <user>
##$USERP3= <user>
##$USERP4= <user>
##$USERP5= <user>
##$WDW= 1
##$XDIM= 131072
##$YMAX_p= 410073387
##$YMIN_p= -13863
##$CURPLOT= <Network HP LaserJet P1505>
##$CURPRIN= <$Network HP LaserJet P1505>
##$DFORMAT= <normdp>
##$LAYOUT= <+/1D_H.xwp>
##$LFORMAT= <normlp>
##$PFORMAT= <normpl>
##$SURQMSG= 1
$$ End of Bruker specific parameters
$$ ---------------------------------
##NTUPLES= NMR SPECTRUM
##VAR_NAME=  FREQUENCY,     SPECTRUM/REAL,   SPECTRUM/IMAG
##SYMBOL=    X,             R,               I
##VAR_TYPE=  INDEPENDENT,   DEPENDENT,       DEPENDENT
##VAR_FORM=  AFFN,          ASDF,            ASDF
##VAR_DIM=   131072,        131072,          131072
##UNITS=     HZ,            ARBITRARY UNITS, ARBITRARY UNITS
##FACTOR=    0.0627417313425164, 1,          1
##FIRST=     8223.62146879497, 2945,         -59640
##LAST=      0,             4187,            -59494
##MIN=       0,             -13863,          0
##MAX=       8223.62146879497, 410073387,    0
$$ Real data points
##PAGE= N=1
##DATA TABLE= (X++(R..R)), XYDATA
$$ [...]
$$ plain form
63953 380541 396056 414360 436114 461564 490826 524244 562477 606314 656473 713595 778333
63942 778333 851357 933080 1023188 1120437 1223117 1329858 1439919 1552713 1667158 1781437
63932 1781437 1893064 1998955 2095647 2179922 2249505 2303284 2340949 2362473 2367769 2356607 2328800
63921 2328800 2284550 2224651 2150445 2063778 1967129 1863555 1756120 1647194 1538321 1430686
63911 1430686 1325547 1224256 1128129 1038411 956164 881993 815879 757395 706093 661618 623481
63900 623481 590898 562936 538809 518021 500266 485281 472759 462275 453365 445773 439589 434909
63888 434909 431321 428077 425020 423030 423169 425504 429204 433692 439187 446097 454543 464806 477649 493644
63874 493644 512476 533482 556669 582628 611502 642674 675516 709854 745383 781168 816277
$$ packed form
63953C80541J5515J8304K1754K5450K9262L3418L8233M3837N0159N7122O4738
63942G78333P3024Q1723R0108R7249J02680J06741J10061J12794J14445J14279
63932A781437J11627J05891R6692Q4275O9583N3779L7665K1524N296j1162k7807
63921B328800m4250n9899p4206q6667r6649j03574j07435j08926j08873j07635
63911A430686j05139j01291r6127q9718q2247p4171o6114n8484n1302m4475l8137
63900F23481l2583k7962k4127k0788j7755j4985j2522j0484q910p592o184m680
63888D34909l588l244l057j990J39K335L700M488N495O910Q446J0263J2843J5995
63874D93644J8832K1006K3187K5959K8874L1172L2842L4338L5529L5785L5109
$$ plain form
63863 816277 850751 885534 921351 957883 994009 1028586 1060916 1090614 1117253 1140231 1159012
63852 1159012 1173447 1183768 1190204 1192590 1190344 1182806 1169645 1151043 1127543 1099721 1068012 1032855
63840 1032855 994912 955062 914169 872872 831562 790480 749862 710085 671640 634938 600188
63829 600188 567506 537061 509027 483480 460430 439831 421383 404431 388326 372907 358452
63818 358452 345202 333151 322246 312445 303491 294932 286589 278776 271887 265941 260704 256095 252172
63805 252172 248845 245836 242942 240156 237517 234957 232305 229356 225965 222192 218354 214880 212102 210123
63791 210123 208737 207467 205908 204155 202658 201500 200143 198138 195894 194275 193585 193348 193028 192453 191574
63776 191574 190364 189138 188408 188118 187530 186267 185004 184597 184924 185260 185535 186373 187834 188933 188800 187724
$$ packed form
63863H16277L4474L4783L5817L6532L6126L4577L2330K9698K6639K2978J8781
63852A159012J4435J0321O436K386k246p538j3161j8602k3500k7822l1709l5157
63840A032855l7943l9850m0893m1297m1310m1082m0618l9777l8445l6702l4750
63829F00188l2682l0445k8034k5547k3050k0599j8448j6952j6105j5419j4455
63818C58452j3250j2051j0905r801q954q559q343p813o889n946n237m609l923
63805B52172l327l009k894k786k639k560k652k949l391l773l838l474k778j979
63791B10123j386j270j559j753j497j158j357k005k244j619o90k37l20n75q79
63776A91574j210j226p30k90n88j263j263m07L27L36K75Q38J461J099j33j076
$$ plain form
63760 187724 186627 185948 185556 185456 185944 187056 188350 189323 189821 190003 190170 190664 191628 192714 193220 192734 191646
63743 191646 190951 191563 193768 197139 200853 204198 207005 209696 212905 216922 221473 226073 230587 235313 240437
63728 240437 245622 250492 255442 261443 268855 276866 284494 291797 299484 307511 314683 319762 322427 322964
63714 322964 321560 318334 313748 308489 302978 297222 291052 284337 277104 269712 262827 256969 252199 248416
63700 248416 245804 244624 244662 245248 245932 246821 248160 249827 251484 253064 254943 257624 261287 265595 269922
63685 269922 273879 277623 281539 285671 289656 293267 296717 300245 303584 306199 308093 310117 313318 318034
63671 318034 323726 329618 335357 341057 346876 352703 358105 362359 364532 363897 360489 355139 348726 341484
63657 341484 333244 324199 315034 306262 297792 289431 281555 274967 270136 266786 264279 262203 260569 259584
$$ packed form
63760A87724j097o79l92j00M88J112J294R73M98J82J67M94R64J086N06m86j088
63743A91646o95O12K205L371L714L345K807K691L209M017M551M600M514M726N124
63728B40437N185M870M950O001P412Q011P628P303P687Q027P172N079K665N37
63714C22964j404l226m586n259n511n756o170o715p233p392o885n858m770l783
63700B48416k612j180L8N86O84Q89J339J667J657J580J879K681L663M308M327
63685B69922L957L744L916M132L985L611L450L528L339K615J894K024L201M716
63671C18034N692N892N739N700N819N827N402M254K173o35l408n350o413p242
63657C41484q240r045r165q772q470q361p876o588m831l350k507k076j634r85
$$ plain form
63643 259584 259382 259931 261054 262503 264045 265601 267328 269473 272123 275196 278759 283146 288553 294666 301045
63628 301045 307826 315605 324490 333762 342842 352273 363290 376597 391937 408703 426465 445001 464405
63615 464405 485352 508687 534446 561696 589681 618702 649386 681274 712586 741219 765560
63604 765560 784502 797424 804423 806192 803500 797087 788128 778198 768343 758449 747894 736551 724688
63591 724688 712088 697910 681538 663169 643379 622540 600953 579296 558553 539507 522476
63580 522476 507477 494374 482879 472654 463562 455815 449783 445739 443763 443797 445641 448970 453466 459116
63566 459116 466301 475461 486558 498977 512082 525837 540735 557165 575047 594144 614511 636479
63554 636479 660311 686125 714186 745114 779680 818270 860355 904209 946991 985157 1015057
$$ packed form
63643B59584k02N49J123J449J542J556J727K145K650L073L563M387N407O113O379
63628C01045O781P779Q885R272R080R431J1017J3307J5340J6766J7762J8536J9404
63615D64405K0947K3335K5759K7250K7985K9021L0684L1888L1312K8633K4341
63604G65560J8942J2922O999J769k692o413q959r930r855r894j0555j1343j1863
63591G24688j2600j4178j6372j8369j9790k0839k1587k1657k0743j9046j7031
63580E22476j4999j3103j1495j0225r092p747o032m044j976L4J844L329M496N650
63566D59116P185R160J1097J2419J3105J3755J4898J6430J7882J9097K0367K1968
63554F36479K3832K5814K8061L0928L4566L8590M2085M3854M2782L8166K9900
$$ plain form
63543 1015057 1033664 1039429 1033079 1017688 997574 976582 956991 939721 925287 914340 907237 903218
63531 903218 900276 896120 889367 879718 867009 850425 828992 802753 773141 742079 710887 680098
63519 680098 650001 621021 593597 567947 544127 522266 502655 485496 470560 457180 444748
63508 444748 433206 422905 413925 405802 398068 390904 384936 380396 376740 373179 369451 365960 363296 361715
63494 361715 360995 360673 360406 360195 360287 360885 361948 363336 365073 367472 370958 375758 381710 388408 395603 403378
63478 403378 411785 420324 428039 434261 439098 442966 445805 447008 446032 442752 437215 429425 419602 408426
63464 408426 396776 385350 374702 365419 357862 351748 346335 341122 336219 332044 328962 327253 327087 328279
63450 328279 330308 332856 336221 340986 347425 355514 365400 377537 392385 410320 431879 457729 488188
$$ packed form
63543A015057J8607N765o350j5391k0114k0992j9591j7270j4434j0947p103m019
63531I03218k942m156o753r649j2709j6584k1433k6239k9612l1062l1192l0789
63519F80098l0097k8980k7424k5650k3820k1861j9611j7159j4936j3380j2432
63508D44748j1542j0301q980q123p734p164n968m540l656l561l728l491k664j581
63494C61715p20l22k67k11R2N98J063J388J737K399L486M800N952O698P195P775
63478D03378Q407Q539P715O222M837L868K839J203r76l280n537p790r823j1176
63464D08426j1650j1426j0648r283p557o114n413n213m903m175l082j709j66J192
63450C28279K029K548L365M765O439Q089R886J2137J4848J7935K1559K5850L0459
$$ plain form
63437 488188 522899 560914 600684 639747 674848 702968 722468 733359 736827 734872 730088 725201
63425 725201 722537 723967 731086 744836 764857 789708 818078 849465 883430 918546 952422 982512
63413 982512 1006593 1022883 1030594 1030554 1024811 1015351 1003474 990315 977257 965253 954042 942473 929458
63400 929458 914251 896024 873850 847347 817127 784525 751087 718282 687269 658617 632388
63389 632388 608584 587378 568815 552540 538097 525402 514711 506222 499937 495866 494059 494341 496216
63376 496216 499241 503411 509079 516535 525766 536579 548816 562386 577238 593442 611287 631171
63364 631171 653369 677950 704922 734271 765770 798930 833304 868699 904723 940045 972416
63353 972416 999689 1020702 1035051 1042348 1042325 1035799 1025078 1012836 1000531 988101 975138 961849
$$ packed form
63437D88188L4711L8015L9770L9063L5101K8120J9500J0891L468j955m784m887
63425G25201k664J430P119J3750K0021K4851K8370L1387L3965L5116L3876L0090
63413I82512K4081J6290P711m0n743r460j1877j3159j3058j2004j1211j1569j3015
63400I29458j5207j8227k2174k6503l0220l2602l3438l2805l1013k8652k6229
63389F32388k3804k1206j8563j6275j4443j2695j0691q489o285m071j807K82J875
63376D96216L025M170N668P456R231J0813J2237J3570J4852J6204J7845J9884
63364F31171K2198K4581K6972K9349L1499L3160L4374L5395L6024L5322L2371
63353I72416K7273K1013J4349P297k3o526j0721j2242j2305j2430j2963j3289
$$ plain form
63341 961849 948604 934887 919289 900680 879062 855104 829197 801300 771558 740760 710207
63330 710207 681379 655640 633840 616066 601999 591624 585402 583624 585721 590076 594114 594550 588372
63317 588372 574433 554298 531199 508051 486417 466920 449885 435363 422961 412100 402452 394002
63305 394002 386779 380621 375092 369599 363742 357666 351987 347215 343320 339905 336695 333748 331227 329151
63291 329151 327392 325826 324363 322804 320755 317817 313942 309548 305179 301137 297551 294674 292847 292058
63277 292058 291737 291124 289790 287787 285447 283158 281216 279720 278579 277647 276809 275954 275026 274172 273705 273780 274230
63260 274230 274842 275670 276877 278381 279868 281138 282236 283315 284596 286409 288943 291898 294740 297488 300925
63245 300925 305753 311752 318155 324626 331425 338641 345875 352931 360445 369401 380170 392335 405246
$$ packed form
63341I61849j3245j3717j5598j8609k1618k3958k5907k7897k9742l0798l0553
63330G10207k8828k5739k1800j7774j4067j0375o222j778K097M355M038M36o178
63317E88372j3939k0135k3099k3148k1634j9497j7035j4522j2402j0861r648q450
63305C94002p223o158n529n493n857o076n679m772l895l415l210k947k521k076
63291C29151j759j566j463j559k049k938l875m394m369m042l586k877j827p89
63277B92058l21o13j334k003k340k289j942j496j141r32q38q55r28q54m67P5M50
63260B74230O12Q28J207J504J487J270J098J079J281J813K534K955K842K748L437
63245C00925M828N999O403O471O799P216P234P056P514Q956J0769J2165J2911
$$ plain form
63232 405246 418410 431430 444096 456655 469645 483214 496826 509812 521995 533576 544758
63221 544758 555813 567273 579539 592264 604538 615756 625883 634706 641309 644716 644780 641982 636499
63208 636499 627985 616325 602124 586224 569082 550908 532240 514036 497273 482602 470287 460195
63196 460195 451941 445341 440720 438564 438867 441139 445137 451183 459526 469635 480489 491470 502660
63183 502660 514351 526584 539237 552227 565473 578822 592208 605735 619465 633187 646515
63172 646515 659168 671012 681806 691038 698101 702600 704415 703427 699252 691397 679709 664576 646689
63159 646689 626732 605397 583400 561226 539025 517070 496239 477597 461463 447225 434208
63148 434208 422382 412061 403289 395859 389713 384955 381533 379210 377782 377065 376678 376063 374801 372791
$$ packed form
63232D05246J3164J3020J2666J2559J2990J3569J3612J2986J2183J1581J1182
63221E44758J1055J1460J2266J2725J2274J1218J0127Q823O603L407O4k798n483
63208F36499q514j1660j4201j5900j7142j8174j8668j8204j6763j4671j2315j0092
63196D60195q254o600m621k156L03K272L998O046Q343J0109J0854J0981J1190
63183E02660J1691J2233J2653J2990J3246J3349J3386J3527J3730J3722J3328
63172F46515J2653J1844J0794R232P063M499J815r88m175p855j1688j5133j7887
63159F46689j9957k1335k1997k2174k2201k1955k0831j8642j6134j4238j3017
63148D34208j1826j0321q772p430o146m758l422k323j428p17l87o15j262k010
$$ plain form
63134 372791 370143 366942 363098 358479 353323 348466 344777 342239 339944 337236 334486 332391 330967 329813
63120 329813 329123 329617 331418 333655 335440 336754 338161 340131 342926 346731 351457 356601 361557 365968 369699
63105 369699 372838 375905 379634 384224 389100 393760 398490 403720 408949 412988 415245 416251 416856 417420 417930
63090 417930 418362 418572 418206 417146 415839 414737 413481 411061 406981 402042 397776 395166 394010 393441 392890
63075 392890 392534 392996 394795 398085 402721 408414 414818 421614 428613 435855 443575 452118 461832 472963
63061 472963 485523 499253 513862 529443 546573 565810 587078 609755 633415 658269 684760
63050 684760 712942 742401 772575 803009 833516 864390 896202 929040 962182 994983 1027894
63039 1027894 1062036 1097803 1134532 1171544 1208639 1245187 1279398 1309080 1332724 1349348 1357858
$$ packed form
63134C72791k648l201l844m619n156m857l689k538k295k708k750k095j424j154
63120C29813o90M94J801K237J785J314J407J970K795L805M726N144M956M411L731
63105C69699L139L067L729M590M876M660M730N230N229M039K257J006O05N64N10
63090D17930M32K10l66j060j307j102j256k420m080m939m266k610j156n69n51
63075C92890l56M62J799L290M636N693O404O796O999P242P720Q543R714J1131
63061D72963J2560J3730J4609J5581J7130J9237K1268K2677K3660K4854K6491
63050F84760K8182K9459L0174L0434L0507L0874L1812L2838L3142L2801L2911
63039A027894L4142L5767L6729L7012L7095L6548L4211K9682K3644J6624Q510
$$ plain form
63028 1357858 1357388 1348167 1331330 1307846 1278118 1242672 1202725 1159968 1116123 1072708 1030755 990667
63016 990667 952709 917682 886797 860870 840058 824296 813403 806609 802712 801200 802892 808980
63004 808980 819674 834162 851587 871529 893609 917174 941535 966225 990911 1015306 1039361
62993 1039361 1063386 1087730 1112332 1136587 1159652 1180862 1199834 1216151 1229054 1237536 1240756 1238195
62981 1238195 1229428 1214026 1191900 1163682 1130537 1093622 1053785 1011741 968354 924698 881801
62970 881801 840335 800545 762629 727157 694926 666245 640539 616871 594762 574316 555693
62959 555693 538818 523693 510604 499687 490322 481279 471632 461520 451916 443640 436631 430169 423679
62946 423679 417160 410858 404784 398787 392987 387896 383923 380865 378030 374916 371686 368958 367194 366425
$$ packed form
63028A357858m70r221j6837k3484k9728l5446l9947m2757m3845m3415m1953m0088
63016I90667l7958l5027l0885k5927k0812j5762j0893o794l897j512J692O088
63004H08980J0694J4488J7425J9942K2080K3565K4361K4690K4686K4395K4055
62993A039361K4025K4344K4602K4255K3065K1210J8972J6317J2903Q482L220k561
62981A238195q767j5402k2126k8218l3145l6915l9837m2044m3387m3656m2897
62970H81801m1466l9790l7916l5472l2231k8681k5706k3668k2109k0446j8623
62959E55693j6875j5125j3089j0917r365r043r647j0112r604q276p009o462o490
62946D23679o519o302o074n997n800n091l973l058k835l114l230k728j764p69
$$ plain form
62932 366425 366486 367275 368607 370038 371115 371799 372308 372482 371525 368608 363625 357292 350664 344615 339572 335479
62916 335479 332056 329275 327478 326871 327048 327292 327299 327285 327434 327571 327491 327345 327551 328496 330439 333419 337024 340493
62898 340493 343391 346084 349289 353132 356929 359893 361787 362825 363226 363059 362360 361136 359332 357001 354491
62883 354491 352265 350450 348725 346721 344450 342247 340399 338975 337913 337042 336017 334493 332561 330828
62869 330828 329749 328979 327723 325843 324193 323560 323598 323310 322423 321653 321477 321332 320447 319035 318034 317867 318094
62852 318094 318241 318376 318730 319347 320402 322357 325294 328417 330703 331948 332699 333331 333685 333662 333587 333746 333919
62835 333919 333668 332915 331939 330978 330152 329775 330400 332357 335244 337985 339543 339709 339230 339104 339741 340848 342018
62818 342018 343148 344253 345139 345574 345729 346250 347749 350232 353010 355226 356609 357751 359616 362764 367169
$$ packed form
62932C66425O1P89J332J431J077O84N09J74r57k917m983o333o628o049n043m093
62916C35479l423k781j797o07J77K44Pj4J49J37q0j46K06R45J943K980L605L469
62898C40493K898K693L205L843L797K964J894J038M01j67o99j224j804k331k510
62883C54491k226j815j725k004k271k203j848j424j062q71j025j524j932j733
62869C30828j079p70j256j880j650o33L8k88q87p70j76j45q85j412j001j67K27
62852C18094J47J35L54O17J055J955K937L123K286J245P51O32L54k3p5J59J73
62835C33919k51p53r76r61q26l77O25J957K887K741J558J66m79j26O37J107J170
62818C42018J130J105Q86M35J55N21J499K483K778K216J383J142J865L148M405
$$ plain form
62803 367169 372640 379061 386127 393277 400286 407673 416123 425597 435453 445426 456023 467873 481156
62790 481156 495951 512713 531953 553618 577255 602805 630940 662540 698091 737588 780786
62779 780786 827333 876731 928282 981065 1033949 1085676 1134864 1179874 1218856 1250139 1272625
62768 1272625 1285717 1289076 1282795 1267762 1245391 1216761 1182241 1142176 1097697 1050647 1002880 955733
62756 955733 909908 865504 822361 780688 741306 705000 671743 640848 611755 584321 558557
62745 558557 534638 513188 494903 479654 466386 454181 443009 433220 424777 417429 411235 406311
62733 406311 402281 398636 395564 393828 393693 394430 395061 395233 395216 395457 396397 398367 401288 404681 408298 412648
62717 412648 418512 425970 434285 442893 452277 463566 477390 493388 510923 530008 551292 575227
$$ packed form
62803C67169N471O421P066P150P009P387Q450R474R856R973J0597J1850J3283
62790D81156J4795J6762J9240K1665K3637K5550K8135L1600L5551L9497M3198
62779G80786M6547M9398N1551N2783N2884N1727M9188M5010L8982L1283K2486
62768A272625J3092L359o281j5033k2371k8630l4520m0065m4479m7050m7767m7147
62756I55733m5825m4404m3143m1673l9382l6306l3257l0895k9093k7434k5764
62745E58557k3919k1450j8285j5249j3268j2205j1172r789q443p348o194m924
62733D06311m030l645l072j736j35P37O31J72j7K41R40J970K921L393L617M350
62717D12648N864P458Q315Q608R384J1289J3824J5998J7535J9085K1284K3935
$$ plain form
62705 575227 601554 629714 659526 691339 725741 763365 804749 850004 898518 949183 1000899
62694 1000899 1052603 1102917 1150170 1192891 1229942 1260024 1281471 1293033 1294736 1287581 1272331 1248941
62682 1248941 1217261 1178115 1133489 1085767 1036779 987394 937812 888315 839849 793852 751383
62671 751383 712409 676113 641968 610391 582246 557835 536512 517297 499604 483363 468625
62660 468625 455345 443538 433402 425055 418088 411512 404382 396594 389018 382694 377902 374102 370656
62647 370656 367369 364353 361709 359487 357740 356371 355121 353901 353010 352824 353427 354635 356166 357564 358226
62632 358226 357934 357241 356956 357299 357903 358488 359108 359725 360096 360223 360442 360853 361041 360647 359933 359519 359836 361100
62614 361100 363542 367250 371836 376582 380975 385008 389072 393680 399186 405635 412984 421554 432031 444794
$$ packed form
62705E75227K6327K8160K9812L1813L4402L7624M1384M5255M8514N0665N1716
62694A000899N1704N0314M7253M2721L7051L0082K1447J1562J703p155j5250k3390
62682A248941l1680l9146m4626m7722m8988m9385m9582m9497m8466m5997m2469
62671G51383l8974l6296l4145l1577k8145k4411k1323j9215j7693j6241j4738
62660D68625j3280j1807j0136q347o967o576p130p788p576o324m792l800l446
62647C70656l287l016k644k222j747j369j250j220q91j86O03J208J531J398O62
62632C58226k92o93k85L43O04N85O20O17L71J27K19M11J88l94p14m14L17J264
62614C61100K442L708M586M746M393M033M064M608N506O449P349Q570J0477J2763
$$ plain form
62600 444794 459417 475138 491776 509893 530052 552176 575704 600137 625170 650366 674876
62589 674876 697646 717867 735112 748966 758707 763544 763117 757622 747487 733172 715270 694557
62577 694557 671876 648151 624446 601687 580160 559567 539660 520603 502670 485945 470499
62566 470499 456528 444069 432857 422706 413772 406212 399820 394269 389450 385264 381332 377326 373387
62553 373387 369856 366742 363831 361158 358930 357106 355539 354486 354467 355507 356907 357941 358511 359056 360074
62538 360074 361798 364045 366273 368022 369348 370674 372233 373961 375896 378334 381585 385892 391624 399147
62524 399147 408390 418906 430491 443432 457995 474100 491729 511277 533155 557289 583301 610882
62512 610882 639602 668579 696831 723876 749561 773258 793595 809166 819244 823760 822875 816810
$$ packed form
62600D44794J4623J5721J6638J8117K0159K2124K3528K4433K5033K5196K4510
62589F74876K2770K0221J7245J3854R741M837m27n495j0135j4315j7902k0713
62577F94557k2681k3725k3705k2759k1527k0593j9907j9057j7933j6725j5446
62566D70499j3971j2459j1212j0151q934p560o392n551m819m186l932m006l939
62553C73387l531l114k911k673k228j824j567j053j9J040J400J034N70N45J018
62538C60074J724K247K228J749J326J326J559J728J935K438L251M307N732P523
62524C99147R243J0516J1585J2941J4563J6105J7629J9548K1878K4134K6012K7581
62512F10882K8720K8977K8252K7045K5685K3697K0337J5571J0078M516q85o065
$$ plain form
62500 816810 806011 791254 773488 753575 732107 709514 686439 663986 643482 625860 611273
62489 611273 599298 589459 581599 575895 572720 572441 575148 580397 587323 595220 604027 614092 625362 636953
62475 636953 647552 656096 662004 665040 665262 662934 658153 650561 639730 625857 609772 592211 573401
62462 573401 553556 533447 514131 496180 479413 463391 447997 433537 420456 409051 399360 391201
62450 391201 384284 378293 372977 368269 364274 361044 358383 356022 353971 352524 351806 351530 351372 351478 352332
62435 352332 354044 355946 357113 357252 356919 356742 356614 355901 354415 352796 351718 350944 349513 346834 343367 340206
62419 340206 338184 337323 336891 335936 334040 331698 329850 328944 328556 327959 326927 325903 325477 325805 326490 327033 327317
62402 327317 327551 327720 327440 326643 326121 326824 328642 330465 331617 332661 334428 336757 338804 340372 342212 344979
$$ packed form
62500H16810j0799j4757j7766j9913k1468k2593k3075k2453k0504j7622j4587
62489F11273j1975r839p860n704l175k79K707N249O926P897Q807J0065J1270J1591
62475F36953J0599Q544N908L036K22k328m781p592j0831j3873j6085j7561j8810
62462E73401j9845k0109j9316j7951j6767j6022j5394j4460j3081j1405r691q159
62450C91201o917n991n316m708l995l230k661k361k051j447p18k76j58J06Q54
62435C52332J712J902J167J39l33j77j28p13j486j619j078p74j431k679l467l161
62419C40206k022q61m32r55j896k342j848r06l88n97j032j024m26L28O85N43K84
62402C27317K34J69k80p97n22P03J818J823J152J044J767K329K047J568J840K767
$$ plain form
62386 344979 348489 352299 356507 361498 367125 372745 378156 384050 391218 399569 408348 417212 426653 437203
62372 437203 448719 460804 473684 488150 504631 522712 541709 561496 582723 606441 633616
62361 633616 664771 699945 739002 781982 829071 880306 935430 993750 1053772 1113057 1168965
62350 1168965 1219696 1264257 1301405 1329260 1346393 1353033 1350786 1341305 1325465 1303531 1275600 1241864
62338 1241864 1202845 1159591 1113498 1065855 1017626 969724 923325 879741 839899 803949 771495
62327 771495 742208 716019 692624 671090 650396 630294 611278 593685 577231 561515 546491
62316 546491 532206 518483 505175 492499 480819 470187 460305 450774 441311 432011 423525 416659 411542
62303 411542 407440 403604 399968 396768 393909 391096 388373 386054 384244 382762 381421 380176 379236 379298 381257
$$ packed form
62386C44979L510L810M208M991N627N620N411N894P168Q351Q779Q864R441J0550
62372D37203J1516J2085J2880J4466J6481J8081J8997J9787K1227K3718K7175
62361F33616L1155L5174L9057M2980M7089N1235N5124N8320O0022N9285N5908
62350A168965N0731M4561L7148K7855J7133O640k247r481j5840k1934k7931l3736
62338A241864l9019m3254m6093m7643m8229m7902m6399m3584l9842l5950l2454
62327G71495k9287k6189k3395k1534k0694k0102j9016j7593j6454j5716j5024
62316E46491j4285j3723j3308j2676j1680j0632r882r531r463r300q486o866n117
62303D11542m102l836l636l200k859k813k723k319j810j482j341j245r40O2J959
$$ plain form
62288 381257 385217 390069 394564 398561 402721 407276 411821 416187 420731 425661 430766 435971 441553 447581
62274 447581 453736 459966 466797 474666 483406 492779 503177 515382 529918 546964 566684 589314 615108
62261 615108 644529 678291 716868 760052 807348 858701 914446 974455 1037504 1101451 1163812
62250 1163812 1222096 1273863 1316847 1349292 1370336 1380132 1379545 1369709 1351742 1326650 1295226 1258034
62238 1258034 1215644 1168928 1119026 1066990 1013592 959491 905558 853105 803798 759089 719401
62227 719401 683939 651626 622194 596133 573617 553944 536142 519790 505074 492305 481547
62216 481547 472564 464908 458129 452001 446469 441458 436849 432596 428639 424840 421305 418654 417526 417804
62202 417804 418753 419963 421626 423844 426367 429374 433892 440885 450289 461449 474155 488637 504740
$$ packed form
62288C81257L960M852M495L997M160M555M545M366M544M930N105N205N582O028
62274D47581O155O230O831P869Q740R373J0398J2205J4536J7046J9720K2630K5794
62261F15108K9421L3762L8577M3184M7296N1353N5745O0009O3049O3947O2361
62250A163812N8284N1767M2984L2445K1044R796n87r836j7967k5092l1424l7192
62238A258034m2390m6716m9902n2036n3398n4101n3933n2453m9307m4709l9688
62227G19401l5462l2313k9432k6061k2516j9673j7802j6352j4716j2769j0758
62216D81547q983p656o779o128n532n011m609m253l957l799l535k651j128K78
62202D17804R49J210J663K218K523L007M518O993R404J1160J2706J4482J6103
$$ plain form
62189 504740 521809 539463 557974 577786 599021 621539 645100 669273 693347 716427 737560
62178 737560 755932 771260 783970 794803 804276 812763 820971 829994 840839 854151 870382 889908
62166 889908 912904 939379 969322 1002487 1037827 1073444 1107296 1137870 1164046 1184618 1198351
62155 1198351 1204569 1203506 1195976 1182770 1164455 1141590 1114883 1084901 1051732 1015242 975786 934495
62143 934495 892800 851888 812728 776191 742760 712301 684561 659805 638592 621009 606611
62132 606611 595108 586563 580684 576478 573048 570455 569374 570064 572055 574782 578068 581917 586153 590443
62118 590443 594516 598210 601421 604151 606510 608561 610155 611047 611184 610765 609928 608434 605831 602004 597491
62103 597491 593134 589497 586761 585119 585011 586770 590192 594666 599748 605485 612175 620035 629193 639854
$$ packed form
62189E04740J7069J7654J8511J9812K1235K2518K3561K4173K4074K3080K1133
62178G37560J8372J5328J2710J0833R473Q487Q208R023J0845J3312J6231J9526
62166H89908K2996K6475K9943L3165L5340L5617L3852L0574K6176K0572J3733
62155A198351O218j063p530j3206j8315k2865k6707k9982l3169l6490l9456m1291
62143I34495m1695m0912l9160l6537l3431l0459k7740k4756k1213j7583j4398
62132F06611j1503q545n879m206l430k593j081O90J991K727L286L849M236M290
62118E90443M073L694L211K730K359K051J594Q92J37m19q37j494k603l827m513
62103E97491m357l637k736j642j08J759L422M474N082N737O690P860R158J0661
$$ plain form
62089 639854 652157 665823 680190 694810 709916 726117 743672 762367 782122 803403 826769
62078 826769 852281 879638 908741 939678 972108 1005092 1037736 1069736 1101004 1130968 1158609
62067 1158609 1183207 1204821 1224132 1242059 1259559 1277366 1295627 1313786 1330927 1346091 1358252
62056 1358252 1366272 1369276 1367061 1360003 1348677 1333797 1316302 1296897 1275303 1250413 1221478 1188823
62044 1188823 1153140 1114594 1073278 1030339 987883 947589 909821 874165 840280 808114 777921
62033 777921 750459 726648 706565 689183 673610 660230 649986 642717 636938 631263 625396 619561
62021 619561 613644 607296 600414 593057 585100 576397 567203 558075 549338 540864 532480 524474 517650 512927
62007 512927 510830 511337 514158 519105 526111 535002 545452 557113 569524 581877 593093 602275 608918
$$ packed form
62089F39854J2303J3666J4367J4620J5106J6201J7555J8695J9755K1281K3366
62078H26769K5512K7357K9103L0937L2430L2984L2644L2000L1268K9964K7641
62067A158609K4598K1614J9311J7927J7500J7807J8261J8159J7141J5164J2161
62056A358252Q020L004k215p058j1326j4880j7495j9405k1594k4890k8935l2655
62044A188823l5683l8546m1316m2939m2456m0294l7768l5656l3885l2166l0193
62033G77921k7462k3811k0083j7382j5573j3380j0244p269n779n675n867n835
62021F19561n917o348o882p357p957q703r194r128q737q474q384q006o824m723
62007E12927k097N07K821M947P006Q891J0450J1661J2411J2353J1216R182O643
$$ plain form
61994 608918 612597 612794 609313 602695 593969 583993 573126 561301 548183 533448 517319 500839 485281
61981 485281 471162 458080 445563 433803 423434 414864 408048 402658 398162 393857 389305 384878 381588
61968 381588 380145 380245 380956 381666 382477 383723 385425 387355 389463 392077 395688 400600 406695 413486 420513
61953 420513 427842 436133 446093 457924 471448 486715 504233 524549 547822 573970 603065 635404
61941 635404 671186 710267 752227 796559 842736 890157 938109 985855 1032713 1078059 1121281
61930 1121281 1161906 1199782 1234931 1266953 1294730 1317015 1333256 1343407 1346900 1342500 1329789 1310557
61918 1310557 1288060 1264856 1241855 1219499 1199236 1183370 1173889 1171882 1177839 1191812 1213103 1240204
61906 1240204 1271339 1304983 1339775 1374000 1405268 1430790 1448237 1456650 1456487 1448592 1433191 1410212
$$ packed form
61994F08918L679J97l481o618q726r976j0867j1825j3118j4735j6129j6480j5558
61981D85281j4119j3082j2517j1760j0369q570o816n390m496m305m552m427l290
61968C81588j443J00P11P10Q11J246J702J930K108K614L611M912O095O791P027
61953D20513P329Q291R960J1831J3524J5267J7518K0316K3273K6148K9095L2339
61941F35404L5782L9081M1960M4332M6177M7421M7952M7746M6858M5346M3222
61930A121281M0625L7876L5149L2022K7777K2285J6241J0151L493m400j2711j9232
61918A310557k2497k3204k3001k2356k0263j5866r481k007N957J3973K1291K7101
61906A240204L1135L3644L4792L4225L1268K5522J7447Q413j63p895j5401k2979
$$ plain form
61894 1410212 1380418 1345651 1307746 1267753 1226490 1185271 1145432 1107423 1071074 1036611 1004694
61883 1004694 975343 947665 921006 895781 872600 851000 829632 807579 784976 762545 741159
61872 741159 721923 705992 693851 684951 678332 673470 670456 669577 671104 675422 683033 694249 708941
61859 708941 726802 747923 773064 803248 839044 880270 926412 977241 1032962 1093842 1159743
61848 1159743 1229932 1303163 1377906 1452583 1525590 1595129 1659093 1715180 1761155 1795112 1815824
61837 1815824 1823076 1817701 1801291 1775997 1744624 1710594 1677494 1648618 1626788 1614117 1611452 1618208
61825 1618208 1633059 1654723 1681855 1712427 1743725 1772811 1796509 1811191 1813529 1801912 1776673
61814 1776673 1738768 1688878 1628229 1559553 1486378 1411521 1336803 1263846 1194281 1129124 1068678
$$ packed form
61894A410212k9794l4767l7905l9993m1263m1219l9839l8009l6349l4463l1917
61883A004694k9351k7678k6659k5225k3181k1600k1368k2053k2603k2431k1386
61872G41159j9236j5931j2141q900o619m862l014q79J527M318P611J1216J4692
61859G08941J7861K1121K5141L0184L5796M1226M6142N0829N5721O0880O5901
61848A159743P0189P3231P4743P4677P3007O9539O3964N6087M5975L3957K0712
61837A815824P252n375j6410k5294l1373l4030l3100k8876k1830j2671k665O756
61825A618208J4851K1664K7132L0572L1298K9086K3698J4682K338j1617k5239
61814A776673l7905m9890o0649o8676p3175p4857p4718p2957o9565o5157o0446
$$ plain form
61803 1068678 1013233 963321 919073 879885 845024 814095 786596 761537 738079 716339 697016
61792 697016 680279 665459 651787 638997 627122 616157 606131 597215 589465 582542 575877 569111
61780 569111 562296 555811 550096 545311 541067 536642 531661 526529 522063 518775 516623 515293 514437 513653 512527
61765 512527 510901 508989 507169 505685 504519 503390 501893 499827 497466 495366 493852 492832 492111 491642 491387
61750 491387 491212 491078 491085 491112 490695 489603 488311 487512 487249 486946 486289 485660 485596 486206 487269 488610 490101 491483
61732 491483 492394 492573 492054 491348 491433 493225 496850 501606 506747 512071 517583 522991 527972 532842 538497 545510
61716 545510 553475 561320 568166 573849 578756 583159 586660 588264 587114 583165 577079 569526 560798 551079
61702 551079 540877 530877 521400 512210 503026 494164 486424 480299 475473 471256 467344 463928 461171 458907
$$ packed form
61803A068678n5445m9912m4248l9188l4861l0929k7499k5059k3458k1740j9323
61792F97016j6737j4820j3672j2790j1875j0965j0026q916p750o923o665o766
61780E69111o815o485n715m785m244m425m981n132m466l288k152j330q56p84j126
61765E12527j626j912j820j484j166j129j497k066k361k100j514j020p21m69k55
61750D91387j75j34PK7m17j092j292p99k63l03o57o29o4O10J063J341J491J382
61732D91483R11J79n19p06Q5J792L625M756N141N324N512N408M981M870N655P013
61716E45510P965P845O846N683M907M403L501J604j150l949o086p553q728r719
61702E51079j0202j0000r477r190r184q862p740o125m826m217l912l416k757k264
$$ plain form
61688 458907 456844 454784 452625 450416 448471 447051 445871 444270 442043 439746 437929 436527 435381 434926
61674 434926 435671 437157 438113 437845 436977 436687 437560 439389 441642 443786 445322 445874 445341 443927 442070 440222
61658 440222 438533 436782 434869 433285 432762 433418 434712 436371 438888 442738 447469 452084 456243 460605 465969
61643 465969 472375 479156 485646 491686 497491 503012 507422 509448 508431 504992 500389 495329 489646 483004
61629 483004 475463 467356 459100 451391 445126 440734 437768 435563 434130 434038 435518 438180 441647 445956 451054
61614 451054 456280 460719 463879 465683 465949 464274 460420 454455 446466 436499 424962 412769 400798 389310
61600 389310 378095 367065 356514 346855 338349 331043 324797 319335 314390 309895 305945 302567 299599
61587 299599 296797 293977 291081 288213 285603 283444 281706 280114 278336 276155 273583 270869 268324 266044
$$ packed form
61688D58907k063k060k159k209j945j420j180j601k227k297j817j402j146m55
61674D34926P45J486R56k68q68k90Q73J829K253K144J536N52n33j414j857j848
61658D40222j689j751j913j584n23O56J294J659K517L850M731M615M159M362N364
61643D65969O406O781O490O040N805N521M410K026j017l439m603n060n683o642
61629D83004p541q107q256p709o265m392k966k205j433r2J480K662L467M309N098
61614D51054N226M439L160J804K66j675l854n965p989r967j1537j2193j1971j1488
61600C89310j1215j1030j0551r659q506p306o246n462m945m495l950l378k968
61587B99599k802k820k896k868k610k159j738j592j778k181k572k714k545k280
$$ plain form
61573 266044 263838 261549 259360 257592 256224 254839 253160 251447 250269 249927 250216 250672 250952 250983 250792 250264
61557 250264 249221 247800 246659 246551 247621 249237 250595 251416 252030 252950 254407 256128 257428 257671 256911 256054
61541 256054 256215 257811 260361 263149 265908 268738 271600 274241 276722 279668 283602 288097 291924 294187
61527 294187 295072 295314 295186 294295 292190 288800 284366 279359 274555 270731 268035 265859 263563 261134 258986
61512 258986 257301 255935 254863 254350 254498 254844 254616 253440 251702 250132 249040 248087 246880 245616 244882 244894
61496 244894 245278 245672 246155 246878 247601 248006 248292 248993 250234 251550 252504 253058 253193 252586 251121 249528 248985
61479 248985 249938 251598 252798 253146 253149 253439 254209 255350 256690 257934 258711 258980 259165 259609 260132 260442 260744 261375
61461 261375 261971 261734 260665 259824 260031 260898 261579 261932 262268 262427 261988 261253 261167 262163 263756 265435 267258 269329
$$ packed form
61573B66044k206k289k189j768j368j385j679j713j178l42K89M56K80L1j91n28
61557B50264j043j421j141j08J070J616J358Q21O14R20J457J721J300K43p60q57
61541B56054J61J596K550K788K759K830K862K641K481K946L934M495L827K263
61527B94187Q85K42j28q91k105l390m434n007m804l824k696k176k296k429k148
61512B58986j685j366j072n13J48L46k28j176j738j570j092r53j207j264p34J2
61496B44894L84L94M83P23P23M05K86P01J241J316R54N54J35o07j465j593n43
61479B48985R53J660J200L48LK90P70J141J340J244P77K69J85M44N23L10L02O31
61461B61375N96k37j069q41K07Q67O81L53L36J59m39p35q6R96J593J679J823K071
$$ plain form
61443 269329 271385 273348 275763 279152 283320 287809 292721 298544 305313 312558 320022 327904 336252 344556
61429 344556 352147 358746 364437 369290 373191 376004 377892 379459 381502 384407 387797 390914 393356 395334
61415 395334 397233 399140 400802 401854 402004 401150 399403 396894 393558 389219 383949 378232 372714 367838 363653
61400 363653 359840 355946 351799 347773 344502 342243 340610 338918 336714 334045 331435 329537 328518 327713
61386 327713 326204 323936 321967 321376 322157 323446 324598 325630 326728 327828 328793 329625 330300 330671 330719 330718 330981
61369 330981 331656 332899 334966 337781 340627 342714 344100 345689 348214 351569 355289 359355 364112 369606
61355 369606 375467 381500 388068 395659 404331 413799 423963 435151 447839 462253 478154 494825 511283
61342 511283 526706 540787 553646 565421 576051 585440 593602 600519 606016 609924 612272 613125 612281
$$ packed form
61443B69329K056J963K415L389M168M489M912N823O769P245P464P882Q348Q304
61429C44556P591O599N691M853L901K813J888J567K043K905L390L117K442J978
61415C95334J899J907J662J052J50q54j747k509l336m339n270n717n518m876m185
61400C63653l813l894m147m026l271k259j633j692k204k669k610j898j019q05
61386C27713j509k268j969n91P81J289J152J032J098J100R65Q32O75L71M8jK63
61369C30981O75J243K067K815K846K087J386J589K525L355L720M066M757N494
61355C69606N861O033O568P591Q672R468J0164J1188J2688J4414J5901J6671J6458
61342E11283J5423J4081J2859J1775J0630R389Q162O917N497L908K348Q53q44
$$ plain form
61329 612281 609392 604520 598388 591871 585265 578173 570117 561140 551790 542713 534370 527016 520657 515010
61315 515010 509756 504951 501012 498116 495785 493294 490398 487435 484843 482963 482289 483393 486310 490314
61301 490314 494616 499045 503694 508126 511414 512940 512671 510661 506848 501606 496091 491511 488129 485236
61287 485236 482062 478509 475115 472577 471302 471198 471801 472704 473880 475568 477947 480995 484584 488598 493071
61272 493071 498283 504513 511547 518665 525420 532221 539753 547930 555938 563358 570736 578957 588558 599918
61258 599918 613538 629539 647192 665506 684176 703429 722899 741149 756478 767924 775431 779377
61246 779377 780088 777555 771483 761786 749061 734337 718371 701533 684379 667704 651771 636019
61234 636019 620131 604981 591826 580718 570499 560497 551405 544065 538048 532207 526402 521844 519519
$$ packed form
61329F12281k889m872o132o517o606p092q056q977r350r077q343p354o359n647
61315E15010n254m805l939k896k331k491k896k963k592j880o74J104K917M004
61301D90314M302M429M649M432L288J526k69k010l813n242n515m580l382k893
61287D85236l174l553l394k538j275j04O03R03J176J688K379L048L589M014M473
61272D93071N212O230P034P118O755O801P532Q177Q008P420P378Q221R601J1360
61258E99918J3620J6001J7653J8314J8670J9253J9470J8250J5329J1446P507L946
61246G79377P11k533o072r697j2725j4724j5966j6838j7154j6675j5933j5752
61234F36019j5888j5150j3155j1108j0219j0002r092p340o017n841n805m558k325
$$ plain form
61221 519519 518805 518016 516027 513079 510172 508029 506661 505632 504600 503682 503362 503939 505102 506185 506895 507579
61205 507579 508630 509825 510583 510886 511623 513792 517544 522280 527681 534334 543177 554383 567036 579963
61191 579963 592780 605968 619949 634300 648015 660371 671293 680922 689194 696071 701914 707273
61179 707273 712300 716635 719978 722505 724538 725942 726168 724931 722664 720048 717146 713203 707466 700074
61165 700074 691993 684022 675994 666978 656171 643548 629769 615599 601471 587542 574037 561384
61153 561384 549937 539713 530552 522504 515901 511093 508272 507369 507725 507865 506117 501796 495511 488175
61139 488175 480070 471183 461971 453154 444949 437109 429740 423574 419303 417053 416557 417433 419240 421739 425255
61124 425255 430389 437179 444962 453238 462240 472398 483699 495955 509300 523911 539410 555003
$$ packed form
61221E19519p14p89j989k948k907k143j368j029j032r18l20N77J163J083P10O84
61205E07579J051J195P58L03P37K169L752M736N401O653Q843J1206J2653J2927
61191E79963J2817J3188J3981J4351J3715J2356J0922R629Q272O877N843N359
61179G07273N027M335L343K527K033J404K26j237k267k616k902l943n737p392
61165G00074q081p971q028r016j0807j2623j3779j4170j4128j3929j3505j2653
61153E61384j1447j0224r161q048o603m808k821r03L56J40j748m321o285p336
61139D88175q105q887r212q817q205p840p369o166m271k250m96Q76J807K499L516
61124D25255N134O790P783Q276R002J0158J1301J2256J3345J4611J5499J5593
$$ plain form
61112 555003 570117 584669 598876 613064 627430 641640 654893 666768 677805 688737 699331
61101 699331 708488 715421 720151 722794 722969 720135 714123 705011 692828 677752 660491 642255 624285
61088 624285 607301 591207 575325 559185 543163 528173 514742 502603 491137 479865 468510
61077 468510 457016 445713 435135 425466 416459 408100 400981 395666 391834 388446 384731 380775 377166
61064 377166 374302 372038 369867 367397 364750 362526 361332 361322 362167 363412 364884 366861 369838 373965 378791
61049 378791 383698 388599 393974 400296 407693 416172 425805 436489 447910 459961 472897 486739 500686
61036 500686 513490 524485 534121 543530 553654 564665 576074 587428 598886 610958 623699 636593
61024 636593 649427 663020 678824 698096 721827 751234 787908 833483 889506 957747 1040527
$$ packed form
61112E55003J5114J4552J4207J4188J4366J4210J3253J1875J1037J0932J0594
61101F99331R157O933M730K643J75k834o012r112j2183j5076j7261j8236j7970
61088F24285j6984j6094j5882j6140j6022j4990j3431j2139j1466j1272j1355
61077D68510j1494j1303j0578r669r007q359p119n315l832l388l715l956l609
61064C77166k864k264k171k470k647k224j194j0Q45J245J472J977K977M127M826
61049C78791M907M901N375O322P397Q479R633J0684J1421J2051J2936J3842J3947
61036E00686J2804J0995R636R409J0124J1011J1409J1354J1458J2072J2741J2894
61024F36593J2834J3593J5804J9272K3731K9407L6674M5575N6023O8241Q2780
$$ plain form
61013 1040527 1140780 1261672 1405246 1569910 1747991 1925123 2082470 2201505 2270207 2288430
61003 2288430 2269246 2234493 2206430 2199906 2218092 2252105 2283727 2290839 2254653 2166352 2030225
60992 2030225 1861715 1681253 1506929 1349844 1214001 1099155 1003379 923921 857515 801201
60982 801201 753058 711944 676724 646093 618997 594862 573309 553819 535727 518567 502417
60971 502417 487850 475324 464510 454475 444646 435393 427439 420957 415574 411121 407810 405562 403649
60958 403649 401454 399347 398327 398794 400104 401558 403381 406346 410673 415844 421395 427300 433372 438912
60944 438912 443392 447169 451018 455134 459053 462393 465096 466936 467335 465892 462821 458725 454276 450197
60930 450197 447100 445016 443332 441468 439463 437699 436254 434868 433437 432214 431474 431204 431185 431241 431331 431505
$$ packed form
61013A040527J00253J20892J43574J64664J78081J77132J57347J19035O8702J8223
61003B288430j9184l4753k8063o524J8186L4013L1622P112l6186q8301j36127
60992B030225j68510j80462j74324j57085j35843j14846r5776p9458o6406n6314
60982H01201m8143m1114l5220l0631k7096k4135k1553j9490j8092j7160j6150
60971E02417j4567j2526j0814j0035r829r253p954o482n383m453l311k248j913
60958D03649k195k107j020M67J310J454J823K965M327N171N551N905O072N540
60944D38912M480L777L849M116L919L340K703J840L99j443l071m096m449m079
60930D50197l097k084j684j864k005j764j445j386j431j223p40k70j9N6R0J74
$$ plain form
60914 431505 431829 432317 432899 433437 433822 434041 434143 434078 433586 432435 430850 429504 428847 428541 427856 426655 425692 425829
60896 425829 427168 429031 430558 431184 430752 429459 427753 426150 425014 424397 424041 423655 423301 423389 424113 425090 425845
60879 425845 426526 427792 430102 433568 438476 445270 453787 463049 472246 481572 491618 502270 512737 522535
60865 522535 531937 541422 551133 561002 571100 581660 592868 604720 616975 629234 641215 652982
60853 652982 664864 677212 690325 704531 720195 737559 756575 776811 797547 818185 838662
60842 838662 859298 880089 900320 918999 935514 949672 961354 970353 976442 979276 978372 973446 964709
60829 964709 952542 936960 917774 895279 870461 844339 817371 789635 761436 733492 706589
60818 706589 681169 657312 635064 614636 596114 579028 562600 546682 532195 520227 510759 502692
$$ packed form
60914D31505L24M88N82N38L85K19J02o5m92j151j585j346o57l06o85j201r63J37
60896D25829J339J863J527O26m32j293j706j603j136o17l56l86l54Q8P24R77P55
60879D25845O81J266K310L466M908O794Q517R262R197R326J0046J0652J0467R798
60865E22535R402R485R711R869J0098J0560J1208J1852J2255J2259J1981J1767
60853F52982J1882J2348J3113J4206J5664J7364J9016K0236K0736K0638K0477
60842H38662K0636K0791K0231J8679J6515J4158J1682Q999O089K834r04m926q737
60829I64709j2167j5582j9186k2495k4818k6122k6968k7736k8199k7944k6903
60818G06589k5420k3857k2248k0428j8522j7086j6428j5918j4487j1968r468q067
$$ plain form
60806 502692 495184 488543 483606 480569 478734 477281 475979 475160 475195 476050 477283 478434 479468 480778 482686
60791 482686 484994 487118 488707 489936 491093 491931 491711 490011 487305 484485 481934 479344 476415 473290 470183
60776 470183 467015 463748 460757 458441 456614 454768 452828 451164 449707 447529 443644 437980 431343 424570
60762 424570 418012 411677 405521 399450 393287 386976 380833 375427 371080 367519 364115 360540 357223 355095
60748 355095 354857 356396 358864 361417 363921 366832 370257 373353 374974 374884 374000 373395 373430 373958 374887 376192
60732 376192 377666 379100 380598 382432 384663 387227 390234 393836 397749 401143 403084 403093 401433 398984 396524
60717 396524 393936 390361 385384 379717 374308 369182 363780 358148 352937 348266 343451 338146 333007 328821
60703 328821 325454 322156 318493 314596 310849 307743 305731 304714 303867 302358 300129 297639 295144 292712
$$ packed form
60806E02692p508o641m937l037j835j453j302q19L5Q55J233J151J034J310J908
60791D82686K308K124J589J229J157Q38k20j700k706k820k551k590k929l125l107
60776D70183l168l267k991k316j827j846j940j664j457k178l885n664o637o773
60762D24570o558o335o156o071o163o311o143n406m347l561l404l575l317k128
60748C55095k38J539K468K553K504K911L425L096J621r0q84o05L5N28R29J305
60732C76192J474J434J498J834K231K564L007L602L913L394J941Rj660k449k460
60717C96524k588l575m977n667n409n126n402n632n211m671m815n305n139m186
60703C28821l367l298l663l897l747l106k012j017q47j509k229k490k495k432
$$ plain form
60689 292712 290740 289846 290141 291107 292269 293598 295144 296720 298187 299717 301451 303130 304394 305258 305949
60674 305949 306425 306491 306414 306957 308569 310869 313264 315772 318802 322178 324997 326669 327775 329604 333027 338021
60658 338021 344003 350276 356326 362128 368220 375135 382645 389793 395778 400710 405401 410530 415964 420759
60644 420759 423838 424778 423951 421856 418434 413205 405995 397414 388666 380959 374824 369712 364429 358318 351922
60629 351922 346244 341606 337656 334288 331817 330197 328696 326657 324147 321612 319366 317732 317250 318228 320223
60614 320223 322316 323796 324436 324345 323812 323121 322266 321032 319523 318331 317850 317694 317159 316142 315241 314951 315121
60597 315121 315243 315009 314501 314008 313719 313591 313491 313446 313596 313860 313877 313419 312730 312288 312420 313200 314526 316097 317568
60578 317568 318986 320858 323576 326954 330634 334732 339692 345659 352383 359677 367461 375266 382110 387214
$$ packed form
60689B92712j972q94K95R66J162J329J546J576J467J530J734J679J264Q64O91
60674C05949M76O6p7N43J612K300K395K508L030L376K819J672J106J829L423M994
60658C38021N982O273O050N802O092O915P510P148N985M932M691N129N434M795
60644D20759L079R40q27k095l422n229p210q581q748p707o135n112n283o111o396
60629C51922n678m638l950l368k471j620j501k039k510k535k246j634m82R78J995
60614C20223K093J480O40r1n33o91q55j234j509j192m81j56n35j017r01k90J70
60597C15121J22k34n08m93k89j28j00m5J50K64J7m58o89m42J32P80J326J571J471
60578C17568J418J872K718L378L680M098M960N967O724P294P784P805O844N104
$$ plain form
60564 387214 390672 393130 394881 395504 394452 391891 388776 386100 384235 383074 382629 383185 384987 388143 392857
60549 392857 399369 407483 416517 425966 435976 446947 458871 471279 483530 494810 504084 510472 513679
60536 513679 513903 511457 506759 500504 493441 486031 478589 471685 466048 462042 459439 457736 456515 455595 455037
60521 455037 455058 455825 457357 459658 462726 466355 470215 474288 478930 484273 489960 495785 502256 510111 519652
60506 519652 531123 545424 563647 585903 611294 639144 669570 702577 737071 771119 802804
60495 802804 830553 852897 868209 874706 870867 856280 832214 801057 765104 726144 686017 646859
60483 646859 610386 577311 547727 521752 499469 480505 464079 449460 436233 424248 413487
60472 413487 403941 395566 388341 382254 376983 371775 366034 360053 354744 350554 347088 343898 341115 339029
$$ packed form
60564C87214L458K458J751O23j052k561l115k676j865j161m45N56J802L156M714
60549C92857O512Q114R034R449J0010J0971J1924J2408J2251J1280R274O388L207
60536E13679K24k446m698o255p063p410p442o904n637m006k603j703j221r20n58
60521D55037K1P67J532K301L068L629L860M073M642N343N687N825O471P855R541
60506E19652J1471J4301J8223K2256K5391K7850L0426L3007L4494L4048L1685
60495H02804K7749K2344J5312O497l839j4587k4066l1157l5953l8960m0127l9158
60483F46859l6473l3075k9584k5975k2283j8964j6426j4619j3227j1985j0761
60472D13487r546q375p225o087n271n208n741n981n309m190l466l190k783k086
$$ plain form
60458 339029 337477 336002 334308 332202 329490 326283 323176 320697 318713 316719 314584 312690 311509 311309
60444 311309 312087 313452 314730 315561 316289 317438 318916 320082 320493 320221 319550 318765 318174 317876 317483 316552 315390
60427 315390 314959 315765 317247 318537 319408 320085 320482 320206 319306 318505 318471 319105 319728 319755 319077 317991 316979 316409
60409 316409 316163 315614 314272 312462 311101 310693 310761 310423 309348 307974 306975 306727 307145 307779 308170 308310 308742
60392 308742 309984 311941 314074 315992 317570 318715 319502 320522 322495 325310 327949 329672 330932 332705
60378 332705 335182 337579 339196 340194 341224 342603 344079 345315 346338 347327 348140 348421 348298 348580 349824 351479
60362 351479 352533 352960 353849 355890 358391 360218 361244 362359 364322 367124 370322 373498 376420 379080 381546
60347 381546 383576 384550 384083 382525 380532 378301 375659 372763 370138 368007 366106 364334 363168 363106 364000
$$ packed form
60458C39029j552j475j694k106k712l207l107k479j984j994k135j894j181k00
60444C11309P78J365J278Q31P28J149J478J166M11k72o71p85n91k98l93r31j162
60427C15390m31Q06J482J290Q71O77L97k76r00q01l4O34O23K7o78j086j012n70
60409C16409k46n49j342j810j361m08O8l38j075j374r99k48M18O34L91J40M32
60392C08742J242J957K133J918J578J145P87J020J973K815K639J723J260J773
60378C32705K477K397J617R98J030J379J476J236J023R89Q13K81j23K82J244J655
60362C51479J054M27Q89K041K501J827J026J115J963K802L198L176K922K660K466
60347C81546K030R74m67j558j993k231k642k896k625k131j901j772j166o2Q94
$$ plain form
60332 364000 365239 366495 367940 369693 371245 371689 370645 368816 367384 366852 366806 366916 367682 369774 372943 376227
60316 376227 379153 382188 385902 390251 394964 400248 406774 415188 425908 439136 454682 471731 488956
60303 488956 504870 518072 527412 532237 532477 528348 520032 507814 492526 475640 458752 443002 428965
60290 428965 416914 406944 398800 391892 385794 380704 377184 375403 374825 374673 374411 373749 372591 371284 370559
60275 370559 370753 371179 370697 368894 366348 363857 361864 360662 360508 361225 362105 362568 362679 362754 362728 362357 361872 361918
60257 361918 362765 363912 364660 364843 364859 365144 365821 366814 368027 369300 370314 370726 370463 369816 369179 368713 368288 367751
60239 367751 367255 367355 368656 371162 373952 375752 376052 375574 375543 376624 378657 381138 383646 385896 387775 389350
60223 389350 390643 391419 391505 391289 391481 392265 392950 392757 391745 390781 390688 391571 392911 394163 395226 396383 397813
$$ packed form
60332C64000J239J256J445J753J552M44j044j829j432n32m6J10P66K092L169L284
60316C76227K926L035L714M349M713N284O526Q414J0720J3228J5546J7049J7225
60303D88956J5914J3202R340M825K40m129q316j2218j5288j6886j6888j5750j4037
60290D28965j2051r970q144o908o098n090l520j781n78j52k62o62j158j307p25
60275C70559J94M26m82j803k546k491j993j202j54P17Q80M63J11P5k6l71m85M6
60257C61918Q47J147P48J83J6K85O77R93J213J273J014M12k63o47o37m66m25n37
60239C67751m96J00J301K506K790J800L00m78l1J081K033K481K508K250J879J575
60223C89350J293P76Q6k16J92P84O85j93j012r64r3Q83J340J252J063J157J430
$$ plain form
60206 397813 399284 400441 401248 401963 402773 403778 405228 407361 409914 412224 414027 415766 417850 419991 421674
60191 421674 423002 424558 426496 428300 429510 430241 430722 430654 429441 427012 424171 421956 420718 419909 418746
60176 418746 417037 415393 414695 415390 417153 419072 420275 420600 420734 421538 423211 425205 426889 428042 428662 428740
60160 428740 428460 428399 429146 430778 432885 435032 436998 438689 440121 441467 442913 444463 446097 448089 450854
60145 450854 454450 458473 462613 467116 472512 478951 486010 493123 500076 507003 513933 520409 525582 528637
60131 528637 529166 527269 523486 518639 513558 508811 504732 501599 499528 498128 496541 494116 490906 487330
60117 487330 483541 479409 475037 470911 467445 464589 461925 459034 455782 452469 449671 447750 446545 445736
60103 445736 445392 445820 446882 447934 448611 449250 450275 451512 452507 453321 454582 456823 460141 464475 469793 475872
$$ packed form
60206C97813J471J157Q07P15Q10J005J450K133K553K310J803J739K084K141J683
60191D21674J328J556J938J804J210P31M81o8j213k429k841k215j238q09j163
60176D18746j709j644o98O95J763J919J203L25J34Q04J673J994J684J153O20P8
60160D28740k80o1P47J632K107K147J966J691J432J346J446J550J634J992K765
60145D50854L596M023M140M503N396O439P059P113O953O927O930O476N173L055
60131E28637N29j897l783m847n081m747m079l133k071j400j587k425l210l576
60117D87330l789m132m372m126l466k856k664k891l252l313k798j921j205q09
60103D45736l44M28J062J052O77O39J025J237R95Q14J261K241L318M334N318O079
$$ plain form
60087 475872 482156 488043 493223 497737 501819 505712 509430 512629 514937 516464 517724 518871 519269 518160
60073 518160 515696 512975 510969 509642 508193 505881 502438 497886 492375 486251 480023 474068 468422 462934
60059 462934 457548 452369 447558 443254 439547 436351 433378 430368 427414 425001 423642 423489 424222 425282 426267
60044 426267 427135 428003 428797 429268 429455 429909 431171 433072 434774 435492 434982 433441 431338 429356 428036 427102
60028 427102 425464 422203 417464 412130 406797 401379 395593 389489 383468 378021 373379 369299 365276 361194
60014 361194 357613 355082 353356 351693 349846 348259 347246 346565 345993 345751 345991 346270 346038 345423 345063 345224
59998 345224 345522 345520 345284 345259 345750 346566 347121 347003 346530 346559 347591 349282 351045 352886 355297 358484 362074 365507
59980 365507 368420 370690 372434 373907 375142 375844 376001 376358 377698 379681 381090 381346 381187 381603 382641 383702
$$ packed form
60087D75872O284N887N180M514M082L893L718L199K308J527J260J147L98j109
60073E18160k464k721k006j327j449k312l443m552n511o124o228n955n646n488
60059D62934n386n179m811m304l707l196k973l010k954k413j359j53P33J060R85
60044D26267Q68Q68P94M71J87M54J262J901J702P18n10j541k103j982j320r34
60028D27102j638l261m739n334n333n418n786o104o021n447m642m080m023m082
60014C61194l581k531j726j663j847j587j013o81n72k42K40K79k32o15l60J61
59998C45224K98kk36k5M91Q16N55j18m73K9J032J691J763J841K411L187L590L433
59980C65507K913K270J744J473J235P02J57L57J340J983J409K56j59M16J038J061
$$ plain form
59964 383702 384428 384785 384613 383751 382514 381520 380982 380530 379768 378732 377746 377082 376864 377151 378042 379659 381865
59947 381865 383987 385077 384669 383156 381266 379402 377674 376247 375211 374282 373071 371606 370206 368877 367226
59932 367226 365053 362652 360455 358685 357450 356841 356800 357146 357867 359107 360726 362160 362946 363255 363749 365021
59916 365021 367259 370204 373267 375944 378366 381325 385401 390103 394196 396977 399033 401544 404951 408514
59902 408514 411183 412685 413568 414335 414891 414949 414611 414286 414189 414284 414624 415383 416466 417458 418091 418580 419362 420717
59884 420717 422729 425415 428724 432501 436573 440747 444718 448186 451134 453744 455973 457424 457737 456831 454674
59869 454674 451212 446758 442065 437615 433206 428679 424702 422143 420820 419676 418239 417120 416746 416343 414845
59854 414845 412342 409950 408452 407706 407303 407139 407206 407353 407485 407615 407571 407047 406143 405462 405360 405445 405128 404389 403618
$$ packed form
59964C83702P26L57j72q62j237r94n38m52p62j036r86o64k18K87Q91J617K206
59947C81865K122J090m08j513j890j864j728j427j036r29j211j465j400j329j651
59932C67226k173k401k197j770j235o09m1L46P21J240J619J434P86L09M94J272
59916C65021K238K945L063K677K422K959M076M702M093K781K056K511L407L563
59902D08514K669J502Q83P67N56N8l38l25r7R5L40P59J083R92O33M89P82J355
59884D20717K012K686L309L777M072M174L971L468K948K610K229J451L13r06k157
59869D54674l462m454m693m450m409m527l977k559j323j144j437j119l74m03j498
59854D14845k503k392j498p46m03j64O7J47J32J30m4n24r04o81j02Q5l17p39p71
$$ plain form
59835 403618 402982 402393 401943 401851 402096 402580 403619 405665 408468 411066 412772 413691 414074 413747 412540 410764 408752
59818 408752 406345 403364 400334 398124 397005 396594 396593 396979 397497 397639 397304 397031 397362 398301 399469 400395 400541
59801 400541 399498 397381 394725 391854 388707 385432 382670 380884 379767 378682 377441 376332 375627 375370 375440
59786 375440 375478 375009 374007 373081 372717 372538 371803 370521 369495 369335 370020 371439 373608 376047 377585 377454 376349
59769 376349 375861 376917 379177 381825 384360 386514 387939 388458 388435 388498 388866 389214 389189 388832 388474 388451 389051 390463
59751 390463 392532 394688 396436 397893 399629 401910 404312 406129 406983 407009 406678 406564 407092 408338 410113 412297
59735 412297 414907 417776 420376 422205 423204 423591 423411 422557 421186 419806 418815 418204 417820 417724 418075 418722 419175
59718 419175 419038 418420 417842 417812 418492 419707 421075 422077 422216 421387 420180 419625 420421 422360 424504 425899 426155
$$ packed form
59835D03618o36n89m50r2K45M84J039K046K803K598J706R19L83l27j207j776k012
59818D08752k407k981l030k210j119m11jL86N18J42l35k73L31R39J168R26J46
59801D00541j043k117k656k871l147l275k762j786j117j085j241j109p05k57P0
59786C75440L8m69j002r26l64j79p35j282j026j60O85J419K169K439J538j31j105
59769C76349m88J056K260K648K535K154J425N19k3O3L68L48k5l57l58k3O00J412
59751C90463K069K156J748J457J736K281K402J817Q54K6l31j14N28J246J775K184
59735D12297K610K869K600J829R99L87j80q54j371j380r91o11l84r6L51O47M53
59718D19175j37o18n78l0O80J215J368J002J39q29j207n55P96J939K144J395K56
$$ plain form
59701 426155 425546 424738 424431 425039 426515 428385 430006 430973 431384 431670 432037 432188 431770 431007 430555 430669 430873 430683
59683 430683 430347 430494 431189 431765 431570 430504 428691 426055 422488 418267 413960 409961 406316 402992 400125
59668 400125 397903 396325 395128 393964 392632 391153 389579 387807 385740 383673 382265 381855 381941 381656 380741
59653 380741 379773 379421 379927 381395 384010 387521 390884 393013 393772 393776 393404 392643 391804 391608 392300 393296 394076 394871
59635 394871 396042 397275 397962 398041 397943 397996 398321 398995 399756 399850 398866 397565 397136 397647 397917 396977 395001 392707
59617 392707 390520 388566 386872 385262 383476 381671 380384 379852 379874 380481 382128 384814 387644 389807 391567
59602 391567 393741 396439 398835 400018 399718 398372 396885 396091 396086 396239 396166 396370 397495 399234 400572 400981 400841
59585 400841 400690 400513 399909 398565 396470 393928 391423 389236 387113 384496 381156 377511 374330 372145 370842
$$ packed form
59701D26155o09q08l07O08J476J870J621R67M11K86L67J51m18p63m52J14K04j90
59683D30683l36J47O95N76j95j066j813k636l567m221m307l999l645l324k867
59668D00125k222j578j197j164j332j479j574j772k067k067j408m10Q6k85r15
59653C80741r68l52N06J468K615L511L363K129P59Ml72p61q39j96O92R96P80P95
59635C94871J171J233O87P9r8N3L25O74P61R4r84j301m29N11K70r40j976k294
59617C92707k187j954j694j610j786j805j287n32K2O07J647K686K830K163J760
59602C91567K174K698K396J183l00j346j487p94nJ53p3K04J125J739J338M09j40
59585D00841j51j77o04j344k095k542k505k187k123k617l340l645l181k185j303
$$ plain form
59570 370842 369717 368097 366011 364108 362848 362057 361436 361155 361592 362699 363979 364986 365611 366045 366716 368109
59554 368109 370385 373285 376523 379983 383374 386221 388630 391670 396384 402657 409673 417351 426656 438470
59540 438470 452752 468975 486893 506394 526566 544919 557742 561952 557255 546516 533668 521373
59528 521373 510821 502924 498564 497647 498858 500737 502515 503793 504094 503122 501097 498495 495575 492183 487788
59513 487788 481819 474345 466365 458986 452383 445959 439408 432994 426886 420963 415416 410777 407136 403971
59499 403971 401085 398991 397979 397426 396628 395833 395858 396912 398310 399246 399411 398968 398213 397276 396126 394961 394477
59482 394477 395349 397408 399872 402482 405842 410422 415818 421409 427138 433152 439048 444033 447606 449663
59468 449663 450299 449893 449123 448428 447812 447533 448594 451901 457162 463186 469161 475158 481591 488729 496606 504849
$$ packed form
59570C70842j125j620k086j903j260p91o21k81M37J107J280J007O25M34O71J393
59554C68109K276K900L238L460L391K847K409L040M714O273P016P678R305J1814
59540D38470J4282J6223J7918J9501K0172J8353J2823M210m697j0739j2848j2295
59528E21373j0552p897m360r17J211J879J778J278L01r72k025k602k920l392m395
59513D87788n969p474p980p379o603o424o551o414o108n923n547m639l641l165
59499D03971k886k094j012n53p98p95K5J054J398R36J65m43p55r37j150j165m84
59482C94477Q72K059K464K610L360M580N396N591N729O014N896M985L573K057
59468D49663O36m06p70o95o16k79J061L307N261O024N975N997O433P138P877Q243
$$ plain form
59452 504849 512680 519625 526194 533372 541441 549750 557483 564031 568650 570509 569309 565289 558495 548688
59438 548688 536356 523212 511093 500652 491592 483859 477890 473739 470660 467898 465503 464022 463703
59425 463703 464512 466833 471563 479159 488933 499631 510621 522233 535121 549716 566254 584837 605241
59412 605241 626821 648529 668605 684263 692376 691123 681037 664521 644776 625276 609408 599637
59400 599637 596750 600024 607730 617027 623783 623630 614004 595449 571083 544896 520138 498531 480460
59387 480460 465679 453813 444338 436522 429811 424156 419785 416726 414781 413742 413397 413446 413725 414402 415679
59372 415679 417428 419454 421964 425325 429370 433325 436519 438915 440882 442776 444873 447498 450926 455191
59358 455191 460073 465368 471228 478159 486501 495883 505476 514888 524550 535061 546406 558031 569438
$$ packed form
59452E04849P831O945O569P178Q069Q309P733O548M619J859j200m020o794r807
59438E48688j2332j3144j2119j0441r060p733n969m151l079k762k395j481l19
59425D63703Q09K321M730P596R774J0698J0990J1612J2888J4595J6538J8583K0404
59412F05241K1580K1708K0076J5658Q113j253j0086j6516j9745j9500j5868r771
59400E99637k887L274P706R297O756j53r626j8555k4366k6187k4758k1607j8071
59387D80460j4781j1866r475p816o711n655m371l059j945j039l45M9K79O77J277
59372D15679J749K026K510L361M045L955L194K396J967J894K097K625L428M265
59358D55191M882N295N860O931Q342R382R593R412R662J0511J1345J1625J1407
$$ plain form
59345 569438 580391 590770 600482 609356 616895 622384 625519 626666 626232 624099 620055 614409 607702 600116
59331 600116 591659 582624 573198 562958 551523 539613 528587 518904 509881 501167 493543 487870 483916
59318 483916 480775 477908 475281 472787 470149 467220 464134 461212 458866 457285 456069 454519 452522 450798
59304 450798 450087 450405 451292 452347 453253 453739 453970 454598 455993 457685 458984 459818 460443 460643 459949 458575 457479
59287 457479 457317 457783 458138 457999 457484 456936 456789 457426 458959 461234 464098 467517 471413 475664 480384 485953
59271 485953 492602 500080 507786 515059 521260 525903 528987 531064 532690 533813 533899 532587 530013 526520 522371
59256 522371 517809 513062 508086 502540 496311 489948 484263 479473 475036 470432 465906 462309 460354 460166
59242 460166 461409 463674 466721 470483 474824 479404 483887 488239 492615 496873 500453 502831 503886 503621
$$ packed form
59345E69438J0953J0379R712Q874P539N489L135J147m34k133m044n646o707p586
59331F00116q457r035r426j0240j1435j1910j1026r683r023q714p624n673l954
59318D83916l141k867k627k494k638k929l086k922k346j581j216j550j997j724
59304D50798p11L18Q87J055R06M86K31O28J395J692J299Q34O25K00o94j374j096
59287D57479j62M66L55j39n15n48j47O37J533K275K864L419L896M251M720N569
59271D85953O649P478P706P273O201M643L084K077J626J123Q6j312k574l493m149
59256E22371m562m747m976n546o229o363n685m790m437m604m526l597j955j88
59242D60166J243K265L047L762M341M580M483M352M376M258L580K378J055k65
$$ plain form
59228 503621 501819 498293 493369 487798 482132 476407 470464 464444 458885 454432 451366 449363 447786 446293
59214 446293 445059 444331 444036 443982 444216 444802 445423 445627 445469 445536 446234 447408 448751 450269 452078 453933 455285
59197 455285 455838 455884 455981 456340 456688 456830 457178 458399 460533 462863 464790 466478 468334 470234 471686 472611 473463
59180 473463 474655 476296 478434 481067 483928 486574 488790 490632 492180 493647 495663 498957 503648 509225
59166 509225 515212 521405 527426 532645 536793 540228 543264 545667 547069 547511 547192 545954 543422 539537 534692
59151 534692 529466 524456 520215 517000 514546 512246 509623 506682 503920 501921 500671 499309 496946 493746
59137 493746 490802 488708 486695 483584 479304 475047 471976 470169 468878 467547 466407 466132 467087 469088 471928
59122 471928 475830 481053 487287 493968 501135 509446 519252 530256 542310 555838 571031 587126 603228
$$ packed form
59228E03621j802l526m924n571n666n725n943o020n559m453l066k003j577j493
59214D46293j234p28k95n4K34N86O21K04j58O7O98J174J343J518J809J855J352
59197D55285N53M6R7L59L48J42L48J221K134K330J927J688J856J900J452R25Q52
59180D73463J192J641K138K633K861K646K216J842J548J467K016L294M691N577
59166E09225N987O193O021N219M148L435L036K403J402M42l19j238k532l885m845
59151E34692n226n010m241l215k454k300k623k941k762j999j250j362k363l200
59137D93746k944k094k013l111m280m257l071j807j291j331j140k75R55K001K840
59122D71928L902N223O234O681P167Q311R806J1004J2054J3528J5193J6095J6102
$$ plain form
59109 603228 619517 636955 655847 675336 694334 712416 729610 745818 760783 774376 786592
59098 786592 797274 806033 812488 816566 818525 818712 817357 814719 811360 808066 805420 803536 802134 800673
59084 800673 798445 794893 789917 783576 775397 764449 750410 734229 717398 700862 684945 669969
59072 669969 656274 643681 631545 619522 607985 597522 588296 580050 572577 565946 560302 555525 551207
59059 551207 547001 542928 539146 535481 531466 526928 522206 517646 513285 509294 506339 505014 505046 505531 505885
59044 505885 506190 506737 507668 509074 510954 512941 514409 515069 515296 515843 517429 520543 525257 531071 537258 543560
59028 543560 550394 558257 567177 576936 587650 599807 613732 629185 645579 662535 680102 698302
59016 698302 716442 733020 746512 756255 762540 765978 767002 765855 762742 757941 752038 746162 741694
$$ packed form
59109F03228J6289J7438J8892J9489J8998J8082J7194J6208J4965J3593J2216
59098G86592J0682Q759O455M078J959J87j355k638l359l294k646j884j402j461
59084H00673k228l552m976o341q179j0948j4039j6181j6831j6536j5917j4976
59072F69969j3695j2593j2136j2023j1537j0463r226q246p473o631n644m777m318
59059E51207m206m073l782l665m015m538m722m560m361l991k955j325L2M85L54
59044E05885L05N47R31J406J880J987J468O60K27N47J586L114M714N814O187O302
59028E43560O834P863Q920R759J0714J2157J3925J5453J6394J6956J7567J8200
59016F98302J8140J6578J3492R743O285L438J024j147l113m801n903n876m468
$$ plain form
59003 741694 739478 739388 740807 743398 747283 752534 758715 764917 770162 773832 775897 776740 776603 775161 771752
58988 771752 766033 758252 748818 737876 725549 712373 699073 685882 672538 659125 646543 635791
58976 635791 627085 620120 614999 612366 612496 614692 617800 621073 624415 628044 632131 636629 641290 645884
58962 645884 650450 655226 660326 665701 671389 677519 683872 689580 693397 694296 691943 686814 679835 671725
58948 671725 662686 652899 643043 633884 625464 617286 609438 602919 598532 595883 593785 591266 587854 583250
58934 583250 577300 570217 562435 554298 546123 538422 531789 526566 522738 520026 517947 515996 513921 511728
58920 511728 509333 506560 503607 501150 499681 499014 498737 498873 499802 501737 504618 508290 512509 517003 521837
58905 521837 527499 534337 542134 550573 559855 570438 582329 594949 607476 619006 628731 636594 643690
$$ packed form
59003G41694k216r0J419K591L885N251O181O202N245L670K065Q43j37j442l409
58988G71752n719p781r434j0942j2327j3176j3300j3191j3344j3413j2582j0752
58976F35791q706o965n121k633J30K196L108L273L342L629M087M498M661M594
58962F45884M566M776N100N375N688O130O353N708L817Q99k353n129o979q110
58948F71725r039r787r856r159q420q178p848o519m387k649k098k519l412m604
58934E83250n950p083p782q137q175p701o633n223l828k712k079j951k075k193
58920E11728k395k773k953k457j469o67k77J36R29J935K881L672M219M494M834
58905E21837N662O838P797Q439R282J0583J1891J2620J2527J1530R725P863P096
$$ plain form
58892 643690 651548 661022 672149 684827 699057 714634 731236 748873 767675 786986 805104 820244
58880 820244 831596 839380 844048 845623 843744 838272 829746 818982 806202 790919 772901 752889 732074
58867 732074 711304 691324 673382 658728 647490 638657 631236 624914 619495 614371 608912 603058 597170
58854 597170 591451 585672 579375 572297 564693 557256 550584 544795 539755 535415 531666 528034 524000 519548
58840 519548 515069 510771 506510 502185 497970 494137 490861 488141 485728 483266 480714 478411 476537 474842
58826 474842 473275 472365 472421 472684 472038 470407 468753 467821 467594 467921 468833 470069 471025 471459 471740 472270 473117 474278
58808 474278 475729 477128 478112 478993 480481 482517 484090 484528 484320 484268 484421 484280 483567 482323 480604 478612
58792 478612 476858 475818 475500 475559 475642 475524 475201 474993 475267 476037 477169 478938 481858 485954 490779 496203 502405
$$ packed form
58892F43690P858R474J1127J2678J4230J5577J6602J7637J8802J9311J8118J5140
58880H20244J1352P784M668J575j879n472q526j0764j2780j5283j8018k0012k0815
58867G32074k0770j9980j7942j4654j1238q833p421o322n419n124n459n854n888
58854E97170n719n779o297p078p604p437o672n789n040m340l749l632m034m452
58840E19548m479m298m261m325m215l833l276k720k413k462k552k303j874j695
58826D74842j567r10N6K63o46j631j654r32k27L27R12J236R56M34K81N30Q47J161
58808D74278J451J399R84Q81J488K036J573M38k08n2J53j41p13j244j719j992
58792D78612j754j040l18N9Q3j18l23k08K74P70J132J769K920M096M825N424O202
$$ plain form
58775 502405 508931 514657 519152 523234 527528 531157 532642 531650 529062 525677 521614 516842 511611 506387
58761 506387 501811 498474 496209 493860 490434 486380 483117 481398 480803 480806 481546 483319 485921 488926 492246
58746 492246 496015 500039 503693 506371 508037 509407 511576 515250 520227 525685 531000 536201 541683 547707
58732 547707 554288 561486 569597 578931 589361 600235 610800 620611 629419 636830 642377 645899 647605
58719 647605 647863 647245 646709 647295 649468 653066 657922 664132 671524 679267 686342 692254 697101 701109 704227
58704 704227 705948 705397 701793 694947 685235 673186 659354 644463 629154 613582 597707 582037 567527
58691 567527 554614 542904 531983 521992 513130 505227 498190 492312 487669 483675 479716 475853 472470
58678 472470 469655 467430 466176 466206 467228 468771 470985 474420 479217 485041 491692 499216 507478 516117 524972
$$ packed form
58775E02405O526N726M495M082M294L629J485r92k588l385m063m772n231n224
58761E06387m576l337k265k349l426m054l263j719n95LP40J773K602L005L320
58746D92246L769M024L654K678J666J370K169L674M977N458N315N201N482O024
58732E47707O581P198Q111R334J0430J0874J0565R811Q808P411N547L522J706
58719F47605K58o18n36N86K173L598M856O210P392P743P075N912M847M008L118
58704G04227J721n51l604o846r712j2049j3832j4891j5309j5572j5875j5670j4510
58691E67527j2913j1710j0921r991q862p903p037n878m643l994l959l863l383
58678D72470k815k225j254L0J022J543K214L435M797N824O651P524Q262Q639Q855
$$ plain form
58663 524972 534156 543660 553116 561878 569138 574164 576731 577229 576074 573261 568791 563354 558172 554208
58649 554208 551668 550041 548383 545913 542731 539787 537784 536406 534890 533037 531248 529878 529073 528951 529371
58634 529371 529702 529417 528820 528700 529386 530574 531841 532768 532800 531846 531075 532359 536574 542876 549795 556622 563541
58617 563541 570901 578777 587088 595829 605066 614679 624049 632187 638297 642029 643120 641291 636894 631275
58603 631275 625782 620522 614701 608082 601483 595762 590928 586439 581884 577189 572577 568582 565766 564218
58589 564218 563500 563195 563260 563879 565301 567921 572114 577833 584586 591882 599440 606916 613861 620143 626122
58574 626122 632092 637749 642491 646233 649698 653752 658546 663522 668413 674080 681981 692811 706059 720969
58560 720969 737332 754960 772957 790239 806501 821997 836493 849202 859718 868309 875164 880048
$$ packed form
58663E24972R184R504R456Q762P260N026K567M98j155k813m470n437n182l964
58649E54208k540j627j658k470l182k944k003j378j516j853j789j370q05j22M20
58634E29371L31k85n97j20O86J188J267R27L2r54p71J284M215O302O919O827O919
58617E63541P360P876Q311Q741R237R613R370Q138O110L732J091j829m397n619
58603F31275n493n260n821o619o599n721m834m489m555m695m612l995k816j548
58589E64218p18l05O5O19J422K620M193N719O753P296P558P476O945O282N979
58574F26122N970N657M742L742L465M054M794M976M891N667P901J0830J3248J4910
58560G20969J6363J7628J7997J7282J6262J5496J4496J2709J0516Q591O855M884
$$ plain form
58548 880048 882975 884559 885192 884316 881024 875166 867421 858437 848370 837271 825535 813758 802226
58535 802226 790753 779057 767272 756070 746273 738432 732712 728983 726795 725443 724341 723505 723630 725565
58521 725565 729614 735230 741464 747863 754853 763056 772323 781768 790679 798869 806025 811365 814329 815181
58507 815181 814423 811943 807292 800588 792556 783730 774162 764003 753879 744478 735968 727989 720095 712105
58493 712105 704131 696419 689285 683205 678692 675793 673861 672275 671335 671926 674200 677137 679681 681897 684723
58478 684723 689014 695035 702459 710501 718370 725753 732525 738002 741254 742322 742332 741957 740596 737591 733419
58463 733419 728969 724427 719720 715385 712023 709332 706691 704371 703274 703788 705738 709102 713824 719184
58449 719184 724266 728793 732707 735311 735937 735217 734569 734533 734731 735341 737295 740718 744384 747274 749837 753243
$$ packed form
58548H80048K927J584O33q76l292n858p745q984j0067j1099j1736j1777j1532
58535H02226j1473j1696j1785j1202r797p841n720l729k188j352j102q36J25J935
58521G25565M049N616O234O399O990Q203R267R445Q911Q190P156N340K964Q52
58507H15181p58k480m651o704q032q826r568j0159j0124r401q510p979p894p990
58493G12105p974p712p134o080m513k899j932j586r40N91K274K937K544K216K826
58478F84723M291O021P424Q042P869P383O772N477L252J068J0l75j361l005m172
58463G33419m450m542m707m335l362k691k641k320j097N14J950L364M722N360
58449G19184N082M527L914K604O26p20o48l6J98O10J954L423L666K890K563L406
$$ plain form
58433 753243 758011 763783 769908 775885 781578 787282 793407 800189 807998 817581 829442 843179 857949
58420 857949 873210 888423 902440 914147 923436 930682 935584 937504 936654 933834 929135 922136 913341
58407 913341 904154 895327 886600 878041 870521 864568 859912 856516 854985 855546 857629 860863 865513 871612
58393 871612 878581 886057 894008 901706 907704 911396 913529 914577 913716 910230 904969 899445 894152 888736
58379 888736 883349 878954 876439 875978 877087 878980 881127 883732 887311 891737 896233 900425 904776 909799
58365 909799 915515 921894 929126 937145 945512 954030 962847 971771 980169 987794 995055 1002232 1009094 1015506
58351 1015506 1021745 1028027 1034365 1040925 1047808 1054500 1060469 1066434 1074064 1084234 1096425 1109935 1124576
58338 1124576 1140095 1156110 1172971 1191518 1211578 1231770 1251181 1270077 1288469 1305162 1318916
$$ packed form
58433G53243M768N772O125N977N693N704O125O782P809R583J1861J3737J4770
58420H57949J5261J5213J4017J1707R289P246M902J920q50k820m699o999q795
58407I13341r187q827q727q559p520n953m656l396j531N61K083L234M650O099
58393H71612O969P476P951P698N998L692K133J048q61l486n261n524n293n416
58379H88736n387m395k515m61J109J893K147K605L579M426M496M192M351N023
58365I09799N716O379P232Q019Q367Q518Q817Q924Q398P625P261P177O862O412
58351A015506O239O282O338O560O883O692N969N965P630J0170J2191J3510J4641
58338A124576J5519J6015J6861J8547K0060K0192J9411J8896J8392J6693J3754
$$ plain form
58327 1318916 1329645 1337876 1343970 1348406 1351960 1355035 1357580 1359989 1363127 1367161 1371385 1375637 1380875 1387966
58313 1387966 1396889 1407428 1419581 1432998 1447177 1462561 1480179 1499899 1520331 1540791 1561918
58302 1561918 1584014 1606335 1628447 1650677 1672698 1693343 1712457 1731114 1749331 1765500 1779042
58291 1779042 1791757 1805401 1819870 1834974 1852000 1871882 1893431 1915073 1937011 1960218 1984781
58280 1984781 2010751 2039164 2070552 2103694 2137439 2172458 2209700 2248505 2287910 2328480 2371063
58269 2371063 2414977 2459281 2504794 2552997 2603886 2656576 2711158 2768411 2828587 2891890 2959104
58258 2959104 3030220 3103461 3177110 3251291 3326746 3403211 3480406 3559184 3640231 3723140 3808274
58247 3808274 3897862 3993559 4094552 4199792 4310380 4427976 4552675 4684359 4824260 4973094
$$ packed form
58327A318916J0729Q231O094M436L554L075K545K409L138M034M224M252N238P091
58313A387966Q923J0539J2153J3417J4179J5384J7618J9720K0432K0460K1127
58302A561918K2096K2321K2112K2230K2021K0645J9114J8657J8217J6169J3542
58291A779042J2715J3644J4469J5104J7026J9882K1549K1642K1938K3207K4563
58280A984781K5970K8413L1388L3142L3745L5019L7242L8805L9405M0570M2583
58269B371063M3914M4304M5513M8203N0889N2690N4582N7253O0176O3303O7214
58258B959104P1116P3241P3649P4181P5455P6465P7195P8778Q1047Q2909Q5134
58247C808274Q9588R5697J00993J05240J10588J17596J24699J31684J39901J48834
$$ plain form
58237 4973094 5129633 5293293 5466174 5650363 5845370 6050706 6268713 6502142 6751123
58228 6751123 7015445 7297558 7600226 7923531 8267620 8636316 9034442 9463712 9924917
58219 9924917 10422200 10961512 11547081 12183475 12879147 13643971 14485584 15412579 16439266
58210 16439266 17583234 18861186 20292486 21904834 23732168 25810890 28184765 30911097
58202 30911097 34055704 37684522 41867856 46694120 52280960 58788074 66437513 75522679
58194 75522679 86387664 99397721 114933199 133395243 155185153 180650454 210000495
58187 210000495 243136349 279329038 316823110 352626024 382753907 403005344 410073387
58180 410073387 402602267 381713317 350677011 313837959 275346754 238310968 204587075
$$ packed form
58237D973094J56539J63660J72881J84189J95007K05336K18007K33429K48981
58228F751123K64322K82113L02668L23305L44089L68696L98126M29270M61205
58219I924917M97283N39312N85569O36394O95672P64824Q41613R26995J026687
58210A6439266J143968J277952J431300J612348J827334K078722K373875K726332
58202C0911097L144607L628818M183334M826264N586840O507114P649439R085166
58194G5522679J0864985J3010057J5535478J8462044K1789910K5465301K9350041
58187B10000495L3135854L6192689L7494072L5802914L0127883K0251437P068043
58180D10073387p471120k0888950l1036306l6839052l8491205l7035786l3723893
$$ plain form
58173 204587075 174999273 149667987 128295660 110392759 95433685 82929657 72448211
58166 72448211 63622953 56158944 49820175 44410065 39765347 35757498 32284825 29260415
58158 29260415 26610617 24279007 22221999 20400266 18778443 17329567 16033002 14868808
58150 14868808 13818381 12868200 12007848 11225706 10510622 9855889 9257220 8708310 8202247
58141 8202247 7735572 7306830 6912408 6547435 6209423 5897348 5608326 5338710 5087402
58132 5087402 4854566 4637974 4433897 4240979 4060200 3891664 3734207 3587481 3451552
58123 3451552 3324857 3204995 3091087 2983346 2881203 2784061 2692814 2608207 2528555 2451477
58113 2451477 2377069 2307006 2241357 2178726 2118715 2061715 2006945 1953235 1901240 1852378 1805960
$$ packed form
58173B04587075k9587802k5331286k1372327j7902901j4959074j2504028j0481446
58166G2448211q825258p464009o338769n410110m644718m007849l472673l024410
58158B9260415k649798k331610k057008j821733j621823j448876j296565j164194
58150A4868808j050427r50181q60352p82142p15084o54733n98669n48910n06063
58141H202247m66675m28742l94422l64973l38012l12075k89022k69616k51308
58132E087402k32836k16592k04077j92918j80779j68536j57457j46726j35929
58123C451552j26695j19862j13908j07741j02143r7142r1247q4607p9652p7078
58113B451477p4408p0063o5649o2631o0011n7000n4770n3710n1995m8862m6418
$$ plain form
58102 1805960 1759860 1713796 1669500 1627804 1587872 1549303 1512672 1477824 1443722 1410260 1378408
58091 1378408 1348373 1319374 1291359 1265253 1241347 1218968 1197786 1177986 1159197 1140791 1123063
58080 1123063 1106390 1089287 1069291 1046112 1022231 999862 978811 957759 936234 914600 893278
58069 893278 872654 853114 834815 817974 803267 791092 780584 770297 759767 749498 739662 729988
58057 729988 720737 712446 704636 696041 686308 676404 667172 658576 650519 643291 636881 630781 624785 619129
58043 619129 613647 607669 601023 594303 587842 581177 573867 566170 558624 551515 544998 539230 534165 529522
58029 529522 524976 520055 514077 506775 498825 491213 484158 477215 470224 463478 457060 450729 444477 438662
58015 438662 433539 429109 425310 421962 418720 415503 412671 410374 408153 405701 403561 402451 402332 402814 403929
$$ packed form
58102A805960m6100m6064m4296m1696l9932l8569l6631l4848l4102l3462l1852
58091A378408l0035k8999k8015k6106k3906k2379k1182j9800j8789j8406j7728
58080A123063j6673j7103j9996k3179k3881k2369k1051k1052k1525k1634k1322
58069H93278k0624j9540j8299j6841j4707j2175j0508j0287j0530j0269r836r674
58057G29988r251q291p810q595r733r904r232q596q057p228o410o100n996n656
58043F19129n482n978o646o720o461o665p310p697p546p109o517n768n065m643
58029E29522m546m921n978p302p950p612p055o943o991o746o418o331o252n815
58015D38662n123m430l799l348l242l217k832k297k221k452k140j110j19M82J115
$$ plain form
58000 403929 405742 407653 408992 409886 410726 411241 411081 410869 411517 412755 413488 413390 413041 412609 411620 410113 408910
57983 408910 408494 408532 408638 408708 408296 406548 403058 398224 392613 386561 380434 374695 369639 365421 362170 359610
57967 359610 357001 354037 351330 349320 347362 344926 343021 343050 344677 346306 347493 349241 351808 353885 354397
57952 354397 353736 352669 351339 349954 349308 349812 350929 352221 354169 357329 361479 366212 371705 378253 385658
57937 385658 393625 402253 411606 421343 431164 441143 451181 460611 468759 475438 480638 484241 486329 487202
57923 487202 486776 484534 480427 475222 469543 463066 455114 445655 435271 424424 413210 401752 390643
57910 390643 380965 373677 368677 364766 360957 357537 355242 353823 352354 350675 349306 347961 345502 341710
57896 341710 337909 335281 333617 332316 331582 331860 332976 334760 337781 342507 348121 353090 356709 359475 362138
$$ packed form
58000D03929J813J911J339Q94Q40N15j60k12O48J238P33r8l49m32r89j507j203
57983D08910m16L8J06P0m12j748l490m834n611o052o127n739n056m218l251k560
57967C59610k609k964k707k010j958k436j905K9J627J629J187J748K567K077N12
57952C54397o61j067j330j385o46N04J117J292J948L160M150M733N493O548P405
57937C85658P967Q628R353R737R821R979J0038R430Q148O679N200L603K088Q73
57923D87202m26k242m107n205n679o477p952r459j0384j0847j1214j1458j1109
57910C90643r678p288n000l911l809l420k295j419j469j679j369j345k459l792
57896C41710l801k628j664j301p34K78J116J784L021M726N614M969L619K766K663
$$ plain form
57881 362138 364947 367657 369802 370980 371109 370305 368529 365637 361633 356319 348854 338678 327037 316516
57867 316516 308517 302022 295353 288208 281334 275176 269857 265832 263458 262282 261679 261802 263060 265004 266715
57852 266715 268149 270175 273257 276869 280272 283216 285779 288081 290239 292164 293370 293340 292035 289741 286624
57837 286624 282886 279130 275996 273511 271296 269392 268371 268528 269465 270583 271665 272814 274096 275369 276455
57822 276455 277498 279133 282034 286114 290450 294226 297480 300670 303834 306562 308558 309745 310037 309479 308514
57807 308514 307627 306691 305029 302149 298105 293175 287592 281715 276114 271292 267389 264193 261336 258445 255246
57792 255246 251649 247819 244184 241251 239245 237939 236990 236322 235971 235724 235347 235127 235717 237406 240001 243484
57776 243484 248195 254129 260607 266992 273255 279557 285750 291668 297441 303047 307987 311867 314909 317349
$$ packed form
57881C62138K809K710K145J178J29q04j776k892m004n314p465j0176j1641j0521
57867C16516p999o495o669p145o874o158n319m025k374j176o03J23J258J944J711
57852B66715J434K026L082L612L403K944K563K302K158J925J206l0j305k294l117
57837B86624l738l756l134k485k215j904j021J57R37J118J082J149J282J273J086
57822B76455J043J635K901M080M336L776L254L190L164K728J996J187K92n58r65
57807C08514q87r36j662k880m044m930n583n877n601m822l903l196k857k891l199
57792B55246l597l830l635k933k006j306r49o68l51k47l77k20N90J689K595L483
57776B43484M711N934O478O385O263O302O193N918N773N606M940L880L042K440
$$ plain form
57762 317349 318663 318028 315341 311254 306368 300967 295412 290128 285129 280040 274747 269695 265442 262129
57748 262129 259380 256559 253186 249305 245397 241776 238262 234593 230857 227196 223347 218971 214361 210400
57734 210400 207688 205924 204214 201895 199119 196685 195197 194405 193610 192682 192187 192399 192734 192551 192001 191615
57718 191615 191452 191217 190887 190588 189990 188517 186233 184011 182704 182387 182398 181893 180442 178401 176660 175846 175915
57701 175915 176649 178173 180590 183430 185964 187944 189578 190878 191505 191178 189901 187878 185542 183474 181933
57686 181933 180647 179469 178940 179616 181061 182257 183055 184541 187825 193052 199876 208402 219349 233523
57672 233523 251415 273183 298983 329443 365715 408603 457417 509504 560482 604569 635284
57661 635284 647242 638336 610470 568401 517992 465016 414289 368893 330022 297604 271028 249439
$$ packed form
57762C17349J314o35k687m087m886n401n555n284m999n089n293n052m253l313
57748B62129k749k821l373l881l908l621l514l669l736l661l849m376m610l961
57734B10400k712j764j710k319k776k434j488p92p95r28m95K12L35j83n50l86
57718A91615j63k35l30k99n98j473k284k222j307l17J1n05j451k041j741q14O9
57701A75915P34J524K417K840K534J980J634J300O27l27j277k023k336k068j541
57686A81933j286j178n29O76J445J196P98J486L284N227O824Q526J0947J4174
57672B33523J7892K1768K5800L0460L6272M2888M8814N2087N0978M4087L0715
57661F35284J1958q906k7866m2069n0409n2976n0727m5396l8871l2418k6576k1589
$$ plain form
57649 249439 231932 217805 206510 197324 189435 182493 176819 172818 170365 168850 167604 166099 163992
57636 163992 161324 158686 156927 156499 157035 157613 157537 156887 156251 155942 155670 155046 154111 153166 152248 151059 149286
57619 149286 146868 144071 141462 139630 138691 138226 137845 137594 137622 137776 137821 137730 137424 136614 135362 134470 134665 135626
57601 135626 136408 136707 137051 137833 138839 139713 140215 139973 138729 137042 136000 135926 135939 135157 133732 132301 131007
57584 131007 129681 128590 128326 129032 130208 131217 131592 131010 129460 127479 125857 124948 124501 124197 124053 124146 124238
57567 124238 123954 123243 122391 121583 120776 120039 119696 119834 120000 119792 119539 119874 120690 121254 121453 122140 123792 125508
57549 125508 126101 125758 125850 127234 129399 131219 131975 131684 131032 131041 132303 134409 136377 137587 137952 137466 136230
57532 136230 134813 133881 133361 132544 131150 129694 128643 127789 126753 125691 125168 125543 126666 127995 128971 129526
$$ packed form
57649B49439j7507j4127j1295r186p889o942n674m001k453j515j246j505k107
57636A63992k668k638j759m28N36N78p6o50o36l09k72o24r35r45r18j189j773
57619A49286k418k797k609j832r39m65l81k51K8J54M5r1l06q10j252q92J95R61
57601A35626P82K99L44P82J006Q74N02k42j244j687j042p4J3p82j425j431j294
57584A31007j326j091k64P06J176J009L75n82j550j981j622r09m47l04j44R3R2
57567A24238k84p11q52q08q07p37l43J38J66k08k53L35Q16N64J99O87J652J716
57549A25508N93l43R2J384K165J820P56k91o52RJ262K106J968J210L65m86j236
57532A36230j417r32n20q17j394j456j051q54j036j062n23L75J123J329R76N55
$$ plain form
57516 129526 130167 131300 132581 133343 133466 133350 133169 132812 132494 132695 133391 134040 134479 135135 136089 136669 136351 135509
57498 135509 134852 134584 134437 134102 133294 131895 130354 129521 129741 130528 131387 132364 133393 133750 132806 130997 129449
57481 129449 128850 129121 129943 131063 132206 133106 133650 133801 133574 133203 133043 133102 132982 132508 132063 132033 132250 132326 132205
57462 132205 132109 132198 132582 133331 134250 134988 135554 136337 137384 138168 138349 138229 138097 137763 137258 137366 138761 140988
57444 140988 143028 144544 145935 147470 149028 150477 151638 152089 151663 151005 151027 151920 153241 154710 156222 157297
57428 157297 157346 156549 155787 155645 156066 156974 158503 160456 162195 163284 163776 163741 163024 161693 160244 159133 158429
57411 158429 158029 157886 157950 158206 158777 159614 160157 159843 158947 158410 158751 159757 161248 163396 165953 167895 168427
57394 168427 167972 167621 167862 168341 168692 169122 170090 171748 173803 175834 177698 179609 181787 184088 186160 187875
$$ packed form
57516A29526O41J133J281P62J23j16j81l57l18K01O96O49M39O56R54N80l18q42
57498A35509o57k68j47l35q08j399j541q33K20P87Q59R77J029L57r44j809j548
57481A29449n99K71Q22J120J143R00N44J51k27l71j60N9j20m74m45l0K17P6j21
57462A32205r6Q9L84P49R19P38N66P83J047P84J81j20j32l34n05J08J395K227
57444A40988K040J516J391J535J558J449J161M51m26o58K2Q93J321J469J512J075
57428A57297M9p97p62j42M21R08J529J953J739J089M92l5p17j331j449j111p04
57411A58429m00j43O4K56N71Q37N43l14q96n37L41J006J491K148K557J942N32
57394A68427m55l51K41M79L51M30R68J658K055K031J864J911K178K301K072J715
$$ plain form
57378 187875 189392 190805 192060 193262 194719 196541 198435 200045 201335 202505 203754 205216 206914 208643
57364 208643 210083 211152 212133 213360 214918 216665 218366 219718 220442 220503 220153 219731 219505 219667 220362 221651
57348 221651 223515 225806 228126 229947 231049 231703 232231 232627 232861 233301 234369 235909 237373 238549 239672
57333 239672 240912 242288 244039 246423 249050 251051 252187 253230 254904 256914 258407 259070 259393 260074 261485
57318 261485 263554 265886 268127 270334 272830 275614 278243 280453 282588 285152 288158 291143 293653 295590
57304 295590 297314 299505 302667 306613 310687 314526 318287 322072 325647 328935 332253 335786 339262 342487
57290 342487 345790 349542 353649 357926 362474 367189 371355 374434 376901 379648 382794 385932 389360 394102
57276 394102 400500 407563 414096 419905 425542 431362 437296 443252 449301 455562 462140 469089 476338 483795
$$ packed form
57378A87875J517J413J255J202J457J822J894J610J290J170J249J462J698J729
57364B08643J440J069R81J227J558J747J701J352P24O1l50m22k26J62O95J289
57348B21651J864K291K320J821J102O54N28L96K34M40J068J540J464J176J123
57333B39672J240J376J751K384K627K001J136J043J674K010J493O63L23O81J411
57318B61485K069K332K241K207K496K784K629K210K135K564L006K985K510J937
57304B95590J724K191L162L946M074L839L761L785L575L288L318L533L476L225
57290C42487L303L752M107M277M548M715M166L079K467K747L146L138L428M742
57276C94102O398P063O533N809N637N820N934N956O049O261O578O949P249P457
$$ plain form
57262 483795 491588 499902 508478 516610 523837 530392 536749 542987 548931 554710 560814 567627 575134 583113
57248 583113 591343 599614 607693 615462 623042 630781 639131 648430 658637 669234 679488 688955 697816
57235 697816 706691 716089 726003 736067 746083 756317 767211 778911 791199 803798 816525 829200
57223 829200 841620 853792 865991 878497 891352 904509 918096 932393 947539 963401 979752
57212 979752 996540 1013936 1032103 1050883 1069726 1088095 1105936 1123630 1141413 1159051 1176242
57201 1176242 1193155 1210285 1227809 1245381 1262645 1279723 1297112 1315298 1334583 1355182 1377270
57190 1377270 1400954 1426195 1452629 1479532 1506262 1532896 1560158 1588454 1617255 1645800 1674218
57179 1674218 1703375 1733580 1763992 1793547 1822078 1850151 1878097 1905608 1932173 1957529 1981699
$$ packed form
57262D83795P793Q314Q576Q132P227O555O357O238N944N779O104O813P507P979
57248E83113Q230Q271Q079P769P580P739Q350R299J0207J0597J0254R467Q861
57235F97816Q875R398R914J0064J0016J0234J0894J1700J2288J2599J2727J2675
57223H29200J2420J2172J2199J2506J2855J3157J3587J4297J5146J5862J6351
57212I79752J6788J7396J8167J8780J8843J8369J7841J7694J7783J7638J7191
57201A176242J6913J7130J7524J7572J7264J7078J7389J8186J9285K0599K2088
57190A377270K3684K5241K6434K6903K6730K6634K7262K8296K8801K8545K8418
57179A674218K9157L0205L0412K9555K8531K8073K7946K7511K6565K5356K4170
$$ plain form
57168 1981699 2004868 2027330 2049427 2071418 2093374 2115082 2136096 2156086 2175228 2194054 2212849
57157 2212849 2231428 2249548 2267115 2283837 2299149 2312973 2326192 2339835 2353972 2368000 2381828
57146 2381828 2396065 2411069 2426587 2442642 2460143 2480132 2502756 2527341 2553270 2580431 2608947
57135 2608947 2638768 2669453 2700200 2730183 2758988 2786625 2813112 2838252 2861900 2884262 2905830
57124 2905830 2927257 2949349 2972895 2998405 3026270 3057261 3092591 3133347 3180151 3233408 3293534
57113 3293534 3360759 3435230 3517592 3609124 3711008 3823925 3948896 4088361 4246171 4426923
57103 4426923 4635789 4878735 5162366 5493849 5881776 6337360 6874553 7509279 8259038
57094 8259038 9142934 10180796 11391149 12789241 14385665 16184773 18182639 20365752
$$ packed form
57168A981699K3169K2462K2097K1991K1956K1708K1014J9990J9142J8826J8795
57157B212849J8579J8120J7567J6722J5312J3824J3219J3643J4137J4028J3828
57146B381828J4237J5004J5518J6055J7501J9989K2624K4585K5929K7161K8516
57135B608947K9821L0685L0747K9983K8805K7637K6487K5140K3648K2362K1568
57124B905830K1427K2092K3546K5510K7865L0991L5330M0756M6804N3257O0126
57113C293534O7225P4471Q2362R1532J01884J12917J24971J39465J57810J80752
57103D426923K08866K42946K83631L31483L87927M55584N37193O34726P49759
57094H259038Q83896J037862J210353J398092J596424J799108J997866K183113
$$ plain form
57086 20365752 22711176 25187342 27754526 30364587 32959074 35464512 37787170 39814347
57078 39814347 41428171 42528881 43055482 42992568 42362573 41212502 39604612 37613118 35322725
57069 35322725 32824755 30210646 27565197 24961500 22458034 20097856 17909573 15909390
57061 15909390 14103424 12489943 11061391 9806003 8708944 7753503 6922713 6200819
57053 6200819 5573779 5028935 4554717 4140791 3778225 3459381 3177751 2927857 2705041
57044 2705041 2505120 2324221 2158918 2006385 1864423 1731438 1606484 1489219 1379688
57035 1379688 1278064 1184454 1098773 1020718 949763 885188 826138 771872 722040 676614 635520
57024 635520 598471 565134 535113 507601 481455 455993 431565 409023 388784 370706 354610
$$ packed form
57086B0365752K345424K476166K567184K610061K594487K505438K322658K027177
57078C9814347J613824J100710N26601o2914o29995j150071j607890j991494k290393
57069C5322725k497970k614109k645449k603697k503466k360178k188283k000183
57061A5909390j805966j613481j428552j255388j097059r55441q30790p21894
57053F200819o27040n44844m74218m13926l62566l18844k81630k49894k22816
57044B705041j99921j80899j65303j52533j41962j32985j24954j17265j09531
57035A379688j01624r3610q5681p8055p0955o4575n9050n4266m9832m5426m1094
57024F35520l7049l3337l0021k7512k6146k5462k4428k2542k0239j8078j6096
$$ plain form
57013 354610 340320 327224 314396 301376 288486 276179 264425 252952 241826 231477 222283 214278
57001 214278 207194 200689 194591 188969 183887 179247 175111 172041 170694 171000 172151 173609 175782 179532
56987 179532 185288 192924 202249 213242 225816 239501 253256 265521 274665 279660 280284 276688 269082
56974 269082 258065 245002 231683 219555 209347 201257 195210 190992 188366 187137 187229 188856 192553
56961 192553 198676 206745 215765 225474 236855 250797 266420 281178 292503 298922 299785 294806 284269
56948 284269 269302 251585 232899 215045 199726 188063 180252 175790 173963 174122 175906 179450 185216
56935 185216 193460 204141 217556 234606 255896 280619 306652 331530 352763 367394 372337 365989
56923 365989 349485 326044 299161 271544 245187 221514 201102 183665 168714 156121 145916
$$ packed form
57013C54610j4290j3096j2828j3020j2890j2307j1754j1473j1126j0349r194q005
57001B14278p084o505o098n622n082m640m136l070j347L06J151J458K173L750
56987A79532N756P636R325J0993J2574J3685J3755J2265R144M995O24l596p606
56974B69082j1017j3063j3319j2128j0208q090o047m218k626j229R2J627L697
56961A92553O123Q069R020R709J1381J3942J5623J4758J1325O419Q63m979j0537
56948B84269j4967j7717j8686j7854j5319j1663p811m462j827J59J784L544N766
56935A85216Q244J0681J3415J7050K1290K4723K6033K4878K1233J4631M943o348
56923C65989j6504k3441k6883k7617k6357k3673k0412j7437j4951j2593j0205
$$ plain form
56912 145916 137808 131188 125563 120757 116744 113526 111167 109684 108818 108158 107650 107788 109063 111310 113932
56897 113932 116782 120499 125707 132087 138666 145018 151871 160320 170791 183060 197052 213081 231153
56884 231153 250353 269049 285418 297645 304070 303686 296698 284531 269400 253818 240014 229223
56872 229223 221440 216171 213431 213809 217686 224822 234831 247778 264218 284945 310786 342263 379114
56859 379114 420197 463819 507669 548167 580441 599825 603859 592994 569803 537989 501850 465712
56847 465712 433039 405889 385164 371145 363716 362482 367198 378246 396543 422952 457790 500885
56835 500885 552003 611046 677566 749652 822981 890890 945627 980072 989296 971784 930155 870734
56823 870734 801717 730838 663892 604456 554189 513255 481016 456899 440769 432605 432147 439077
$$ packed form
56912A45916q108o620n625m806m013l218k359j483q66o60n08J38J275K247K622
56897A13932K850L717N208O380O579O352O853Q449J0471J2269J3992J6029J8072
56884B31153J9200J8696J6369J2227O425l84o988j2167j5131j5582j3804j0791
56872B29223p783n269k740L78L877P136J0009J2947J6440K0727K5841L1477L6851
56859C79114M1083M3622M3850M0498L2274J9384M034j0865k3191l1814l6139l6138
56847D65712l2673k7150k0725j4019p429j234M716J1048J8297K6409L4838M3095
56835E00885N1118N9043O6520P2086P3329O7909N4737L4445R224j7512m1629n9421
56823H70734o9017p0879o6946n9436n0267m0934l2239k4117j6130q164m58O930
$$ plain form
56811 439077 453378 475269 504875 542151 586831 637715 691631 743090 785209 811389 817043 800924
56799 800924 765545 716242 659314 600386 543693 491932 446363 407310 374905 349319 330330
56788 330330 317144 309065 306083 308450 315935 328014 344650 366195 392152 420264 447029 468958
56776 468958 483294 488002 481718 464165 436748 402643 365874 329829 296398 266356 240178 218104
56764 218104 199643 183714 169607 157489 147705 139858 132989 126582 120955 116526 112975 109436 105453
56751 105453 101414 97888 94793 91598 88234 85334 83385 82057 80714 79291 78284 78008 78260 78623 78721
56736 78721 78311 77549 77134 77687 78895 79690 79370 78264 77212 76714 76666 76566 75901 74684 73714 73938 75490 77646
56718 77646 79739 81651 83340 84502 84942 84817 84276 83360 82511 82555 83703 85030 85500 85144 84770 84966 85877
$$ packed form
56811D39077J4301K1891K9606L7276M4680N0884N3916N1459M2119K6180N654j6119
56799H00924l5379m9303n6928n8928n6693n1761m5569l9053l2405k5586j8989
56788C30330j3186q079k982K367P485J2079J6636K1545K5957K8112K6765K1929
56776D68958J4336M708o284j7553k7417l4105l6769l6045l3431l0042k6178k2074
56764B18104j8461j5929j4107j2118r784p847o869o407n627m429l551l539l983
56751A05453m039l526l095l195l364k900j949j328j343j423j007k76K52L63R8
56736G8721m10p62m15N53J208P95l20j106j052m98m8j00o65j217r70K24J552K156
56718G7646K093J912J689J162M40j25n41r16q49M4J148J327M70l56l74J96R11
$$ plain form
56701 85877 87536 89657 91354 91844 91427 91175 91693 92647 93387 93463 92640 91124 89809 89608 90364 90968 90696 89908
56683 89908 89330 89242 89622 90420 91319 91691 91268 90545 90153 90129 90152 90193 90517 91183 91944 92561 92940 93072 93089 93259 93706
56662 93706 94231 94659 95147 95876 96594 96864 96783 97022 98088 99844 101893 104103 106472 108689 110255 111100 111798
56645 111798 112962 114556 115967 116717 116933 117176 118001 119608 121623 123174 123594 123232 123328 124740 127031 129066
56629 129066 130291 130948 131267 131024 130045 128634 127279 126213 125481 125060 124710 124013 122837 121608 120852 120619 120549
56612 120549 120331 119840 118984 117773 116513 115608 115061 114352 113053 111466 110508 110829 112070 113132 113219 112511 111721
56595 111721 111246 110959 110668 110346 109971 109571 109542 110458 112292 114206 115462 116245 117150 118118 118460 117917 117125 116826
56577 116826 117027 117206 117072 116794 116693 117125 118596 121485 125467 129480 132561 134573 135960 137058 138084 139641
$$ packed form
56701H5877J659K121J697M90m17k52N18R54P40P6q23j516j315k01P56O04k72p88
56683H9908n78q8L80P98Q99L72m23p23l92k4K3M1L24O66P61O17L79J32J7J70M47
56662I3706N25M28M88P29P18K70q1K39J066J756K049K210K369K217J566Q45O98
56645A11798J164J594J411P50K16K43Q25J607K015J551M20l62R6J412K291K035
56629A29066J225O57L19k43r79j411j355j066p32m21l50o97j176j229p56k33p0
56612A20549k18m91q56j211j260r05n47p09j299j587r58L21J241J062Q7p08p90
56595A11721m75k87k91l22l75m00k9R16J834J914J256P83R05R68L42n43p92k99
56577A16826K01J79j34k78j01M32J471K889L982M013L081K012J387J098J026J557
$$ plain form
56561 139641 142644 147423 153262 159064 164270 168851 172746 175799 178177 180460 183192 186508 190079 193213
56547 193213 195155 195702 195499 195420 195689 195942 196010 196132 196339 196239 195621 194775 193921 192803 191274 189849 189125 188868
56529 188868 188244 186915 185356 184031 182695 180763 178083 175099 172342 169966 167779 165572 163328 161132
56515 161132 158996 156948 155290 154555 155028 156344 157679 158339 158179 157510 156725 156052 155644 155721 156366 157071 156867
56498 156867 155326 153322 152344 152961 154284 155036 154754 153827 152753 151747 150831 149941 149040 148366 148402 149305 150508
56481 150508 151179 151071 150645 150438 150610 151108 151919 152919 153632 153523 152679 152017 152482 153955 155264 155510 155132 155330
56463 155330 156634 158518 160317 161866 163097 163689 163526 163103 163052 163527 164367 165504 166797 167786 168109 167979 167831
56446 167831 167714 167446 167176 167252 167687 168313 169337 171097 173165 174336 173844 172210 170614 169772 169654 169951 170424
$$ packed form
56561A39641L003M779N839N802N206M581L895L053K378K283K732L316L571L134
56547A93213J942N47k03p9K69K53O8J22K07j00o18q46q54j118j529j425p24k57
56529A88868o24j329j559j325j336j932k680k984k757k376k187k207k244k196
56515A61132k136k048j658p35M73J316J335O60j60o69p85o73m08P7O45P05k04
56498A56867j541k004r78O17J323P52k82r27j074j006r16q90r01o74L6R03J203
56481A50508O71j08m26k07J72M98Q11J000P13j09q44o62M65J473J309K46l78J98
56463A55330J304J884J799J549J231N92j63m23n1M75Q40J137J293R89L23j30j48
56446A67831j17k68k70P6M35O26J024J760K068J171m92j634j596q42j18K97M73
$$ plain form
56429 170424 170866 171088 171075 171036 171263 171881 172662 173115 172961 172512 172437 173084 174096 174734 174481 173434 172258 171763 172339
56410 172339 173652 174977 175803 176162 176466 177153 178341 179660 180515 180667 180497 180475 180525 180203 179444 178813 178939 179943
56392 179943 181478 183068 184314 185017 185295 185515 186045 187091 188684 190622 192521 194180 195955 198470 201808
56377 201808 205231 207914 209749 211174 212325 212818 212519 212167 212818 214634 216597 217635 217735 217694 218008 218581
56361 218581 219379 220640 222122 222868 222372 221580 221946 223510 224672 224050 222004 220025 219115 219175 219696 220415 221244
56344 221244 221969 222361 222566 223147 224606 226879 229393 231611 233389 234827 236028 237137 238378 239826 241236
56329 241236 242371 243454 245057 247479 250342 252795 254081 254083 253509 253445 254499 256390 258414 260161 261596 262685
56313 262685 263357 263780 264326 265137 265971 266626 267327 268518 270311 272293 273947 275268 276786 278887 281253 283249
$$ packed form
56429A70424M42K22j3l9K27O18P81M53j54m49p5O47J012O38k53j047j176m95N76
56410A72339J313J325Q26L59L04O87J188J319Q55J52j70k2N0l22p59o31J26J004
56392A79943J535J590J246P03K78K20N30J046J593J938J899J659J775K515L338
56377B01808L423K683J835J425J151M93k99l52O51J816J963J038J00m1L14N73
56361B18581P98J261J482P46m96p92L66J564J162o22k046j979r10O0N21P19Q29
56344B21244P25L92K05N81J459K273K514K218J778J438J201J109J241J448J410
56329B41236J135J083J603K422K863K453J286Kn74o4J054J891K024J747J435J089
56313B62685O72M23N46Q11Q34O55P01J191J793J982J654J321J518K101K366J996
$$ plain form
56297 283249 284746 286126 287465 288262 288270 288094 288497 289441 290274 290660 290830 291104 291615 292432 293519 294688 295924
56280 295924 297665 300296 303522 306638 309336 311824 314287 316763 319500 322856 326746 330665 334364 338108
56266 338108 342155 346393 350585 354623 358516 362473 367057 372836 379752 387192 394809 402983 412429 423609
56252 423609 436547 450867 466027 481830 498759 517528 538437 561494 586914 614878 644852
56241 644852 675845 707431 739842 772940 805790 837531 867971 896890 923250 945634 963131
56230 963131 975458 982509 984240 980781 972375 959380 942502 922744 900871 877143 851766 825363
56218 825363 798760 772562 747124 722727 699608 677971 658052 639947 623324 607610 592574
56207 592574 578499 565762 554558 544983 536915 529742 522718 515781 509627 504768 500964 497714 494865
$$ packed form
56297B83249J497J380J339P97Qj76M03R44Q33L86J70K74N11Q17J087J169J236
56280B95924J741K631L226L116K698K488K463K476K737L356L890L919L699L744
56266C38108M047M238M192M038L893L957M584N779O916P440P617Q174R446J1180
56252D23609J2938J4320J5160J5803J6929J8769K0909K3057K5420K7964K9974
56241F44852L0993L1586L2411L3098L2850L1741L0440K8919K6360K2384J7497
56230I63131J2327P051J731l459q406j2995j6878j9758k1873k3728k5377k6403
56218H25363k6603k6198k5438k4397k3119k1637j9919j8105j6623j5714j5036
56207E92574j4075j2737j1204r575q068p173p024o937o154m859l804l250k849
$$ plain form
56194 494865 492505 490674 489409 488655 487920 486512 484449 482619 481692 481293 480731 480124 480264 481546 483556 485692
56178 485692 487797 490114 492835 495857 498978 502241 505872 509720 513104 515645 518016 521298 525687 530448
56164 530448 535093 539887 545120 550674 556556 563131 570438 577945 585388 593330 602513 613116 624985 637970
56150 637970 651621 665089 677908 690639 704466 720509 739750 763039 790788 823075 860427
56139 860427 904071 955222 1014599 1082783 1160257 1246494 1339433 1435968 1532283 1623547 1704730
56128 1704730 1773015 1829264 1876588 1917855 1954877 1988771 2019537 2045283 2062871 2069814 2065616 2051874
56116 2051874 2031623 2008041 1982783 1955273 1923663 1886041 1840505 1785048 1718607 1642442 1560137
56105 1560137 1476365 1395759 1322115 1257654 1202854 1157206 1119970 1090196 1066758 1048858 1036068
$$ packed form
56194D94865k360j831j265p54p35j408k063j830r27l99n62o07J40J282K010K136
56178D85692K105K317K721L022L121L263L631L848L384K541K371L282M389M761
56164E30448M645M794N233N554N882O575P307P507P443P942R183J0603J1869J2985
56150F37970J3651J3468J2819J2731J3827J6043J9241K3289K7749L2287L7352
56139H60427M3644N1151N9377O8184P7474Q6237R2939R6535R6315R1264Q1183
56128A704730O8285N6249M7324M1267L7022L3894L0766K5746J7588O943m198j3742
56116B051874k0251k3582k5258k7510l1610l7622m5536n5457o6441p6165q2305
56105A560137q3772q0606p3644o4461n4800m5648l7236k9774k3438j7900j2790
$$ plain form
56094 1036068 1027583 1022058 1018548 1016935 1016997 1017916 1019307 1021877 1026176 1031379 1036204 1040522 1045134 1050429 1056198
56079 1056198 1062373 1069094 1076278 1083790 1091770 1100263 1109061 1118452 1129389 1142141 1155471 1168111 1180479
56066 1180479 1193900 1208625 1223696 1238521 1253580 1269757 1287684 1307441 1328126 1348155 1366702
56055 1366702 1384503 1402603 1420894 1438688 1456038 1473547 1491415 1509652 1528753 1549195 1570671
56044 1570671 1592714 1615608 1639859 1665320 1691687 1719249 1748303 1778469 1809450 1841729 1875636
56033 1875636 1910507 1945723 1981753 2019207 2057841 2097464 2138717 2181762 2225396 2268841 2313232
56022 2313232 2359956 2408804 2459458 2513361 2572110 2635011 2700230 2767412 2837224 2909406 2983498
56011 2983498 3060547 3141868 3226974 3314916 3406612 3503524 3605087 3710115 3819763 3936288
$$ packed form
56094A036068q485n525l510j613O2R19J391K570M299N203M825M318M612N295N769
56079A056198O175O721P184P512P980Q493Q798R391J0937J2752J3330J2640J2368
56066A180479J3421J4725J5071J4825J5059J6177J7927J9757K0685K0029J8547
56055A366702J7801J8100J8291J7794J7350J7509J7868J8237J9101K0442K1476
56044A570671K2043K2894K4251K5461K6367K7562K9054L0166L0981L2279L3907
56033A875636L4871L5216L6030L7454L8634L9623M1253M3045M3634M3445M4391
56022B313232M6724M8848N0654N3903N8749O2901O5219O7182O9812P2182P4092
56011B983498P7049Q1321Q5106Q7942R1696R6912J01563J05028J09648J16525
$$ plain form
56001 3936288 4059684 4188391 4322552 4463635 4611640 4765825 4927547 5099055 5280095
55992 5280095 5469173 5667705 5879220 6104830 6343352 6595851 6866047 7155982 7465267
55983 7465267 7795138 8149466 8531320 8942281 9385684 9866820 10389612 10956936 11574538
55974 11574538 12250712 12992139 13804572 14697962 15686516 16783931 18004053 19367023 20899986
55965 20899986 22632359 24597489 26841014 29423193 32414926 35901563 39995249 44840239
55957 44840239 50609226 57505632 65771427 75682758 87536168 101649895 118378125 138102582
55949 138102582 161186223 187899906 218288622 251899724 287393545 322255104 352899420
55942 352899420 375298555 385987658 383104264 367036790 340344782 306927088 270837185
$$ packed form
56001C936288J23396J28707J34161J41083J48005J54185J61722J71508J81040
55992E280095J89078J98532K11515K25610K38522K52499K70196K89935L09285
55983G465267L29871L54328L81854M10961M43403M81136N22792N67324O17602
55974A1574538O76174P41427Q12433Q93390R88554J097415J220122J362970J532963
55965B0899986J732373J965130K243525K582179K991733L486637M093686M844990
55957D4840239N768987O896406Q265795R911331J1853410J4113727J6728230J9724457
55949A38102582K3083641K6713683L0388716L3611102L5493821L4861559L0644316
55942C52899420K2399135J0689103k883394j6067474k6692008l3417694l6089903
$$ plain form
55935 270837185 235333765 202509710 173407540 148318498 127064619 109225237 94306444
55928 94306444 81834825 71386492 62595803 55164112 48854884 43474460 38860265 34882111
55920 34882111 31439193 28447754 25834531 23540293 21519872 19734646 18149292 16735867
55912 16735867 15474020 14344675 13328078 12408751 11576814 10822652 10134790 9504229 8926279
55903 8926279 8396444 7908439 7457476 7041672 6658727 6304500 5975879 5671782 5390353
55894 5390353 5128456 4884855 4660700 4455813 4267434 4093511 3934292 3789751 3658315
55885 3658315 3539121 3432822 3339230 3256659 3184246 3122137 3068414 3018331 2967459 2913187 2852698
55874 2852698 2782555 2701651 2612245 2517047 2417632 2316499 2217808 2124405 2036210 1952809 1875491
$$ packed form
55935B70837185l5503420l2824055k9102170k5089042k1253879j7839382j4918793
55928I4306444j2471619j0448333q790689p431691o309228n380424m614195l978154
55920C4882111l442918k991439k613223k294238k020421j785226j585354j413425
55912A6735867j261847j129345j016597r19327q31937p54162o87862o30561n77950
55903H926279n29835m88005m50963m15804l82945l54227l28621l04097k81429
55894E390353k61897k43601k24155k04887j88379j73923j59219j44541j31436
55885C658315j19194j06299r3592q2571p2413o2109n3723n0083n0872n4272o0489
55874B852698p0143q0904q9406r5198r9415j01133r8691r3403q8195q3401p7318
$$ plain form
55863 1875491 1805249 1740801 1680288 1623347 1570227 1520385 1473288 1429201 1387964 1348340 1309645
55852 1309645 1272699 1238230 1205665 1174477 1145206 1118073 1091844 1065241 1038400 1012061 986446
55841 986446 961761 938633 917204 896826 877281 859072 841880 824260 805701 787629 771366
55830 771366 756394 741618 727103 713476 700807 689142 679060 670556 662354 653369 643849 634081
55818 634081 623028 609628 594675 580134 567079 555346 544682 535133 526584 518858 512097 506484
55806 506484 501871 498091 495210 493102 491430 490469 491252 494361 499147 504572 510142 515620 520588 524887 528774
55791 528774 532205 534588 535738 536314 536807 536743 535225 531466 524475 513311 498456 482150 466704 453063
55777 453063 441468 432617 427420 426200 428724 434351 441539 447802 450746 448861 441419 428638 412368
$$ packed form
55863A875491p0242o4448o0513n6941n3120m9842m7097m4087m1237l9624l8695
55852A309645l6946l4469l2565l1188k9271k7133k6229k6603k6841k6339k5615
55841I86446k4685k3128k1429k0378j9545j8209j7192j7620j8559j8072j6263
55830G71366j4972j4776j4515j3627j2669j1665j0082q504q202q985r520r768
55818F34081j1053j3400j4953j4541j3055j1733j0664r549q549p726o761n613
55806E06484m613l780k881k108j672r61P83L109M786N425N570N478M968M299L887
55791E28774L431K383J150N76M93o4j518l759o991j1164j4855j6306j5446j3641
55777D53063j1595q851n197j220K524N627P188O263K944j885p442j2781j6270
$$ plain form
55764 412368 395503 380014 366225 354216 344693 337843 332519 327465 322479 317679 312658 307249 302076
55751 302076 297376 292178 285729 278913 273145 268592 264480 260531 257009 253938 251298 249494 248634 247834 246119
55736 246119 243452 240103 235803 230577 225650 222238 220008 217977 216348 215987 216396 215741 213004 208940 204833
55721 204833 201393 198936 197550 196828 196235 195952 196691 198686 201478 204614 207882 210926 213281 214702 214916
55706 214916 213354 209932 205855 202747 201034 199812 198109 195483 191664 186615 180979 175572 170403 164867
55692 164867 158894 153142 148157 144123 141350 140122 140008 140149 140319 140910 141873 142574 142864 143394 144593 146104
55676 146104 147508 148916 150522 152136 153438 154144 153777 151946 149117 146450 144540 142919 141079 139323 138121
55661 138121 137214 135999 134508 133436 133275 133816 134503 135040 135732 137308 140306 144473 148881 152714 155889 158878
$$ packed form
55764D12368j6865j5489j3789j2009r523o850n324n054m986m800n021n409n173
55751C02076m700n198o449o816n768m553m112l949l522l071k640j804q60q00j715
55736B46119k667l349m300n226m927l412k230k031j629l61M09o55k737m064m107
55721B04833l440k457j386p22n93k83P39J995K792L136L268L044K355J421K14
55706B14916j562l422m077l108j713j222j703k626l819n049n636n407n169n536
55692A64867n973n752m985m034k773j228j14J41J70N91R63P01K90N30J199J511
55676A46104J404J408J606J614J302P06l67j831k829k667j910j621j840j756j202
55661A38121r07j215j491j072j61N41O87N37O92J576K998M167M408L833L175K989
$$ plain form
55645 158878 162062 165334 168213 170251 171244 170934 168729 164209 158005 151611 145959 140689 135232 130082 126269
55630 126269 123951 122357 120935 119690 118456 116773 114768 113326 112941 112945 112315 110843 109133 107732 106640
55615 106640 105490 103933 101934 99818 97940 96316 94763 93374 92490 92143 91852 91109 89802 88068 86023
55600 86023 83840 81854 80314 79121 77994 76887 76086 75907 76382 77292 78391 79502 80411 80954 81334 82076
55584 82076 83369 84678 85488 86208 87670 89826 91798 93408 95748 99732 104867 110083 115082 120154 125173
55569 125173 129601 133037 135036 134850 132298 128563 125158 122243 118838 114545 110045 105920 102025 98230
55555 98230 94866 92061 89425 86712 84186 82024 79952 77810 75931 74672 74025 73897 74248 74687 74539 73672
55539 73672 72827 72707 73101 73244 72753 71857 70971 70369 70120 70101 70128 70113 69982 69520 68593 67523 66864 66747 66768 66552
$$ packed form
55645A58878L184L272K879K038R93l10k205m520o204o394n652n270n457n150l813
55630A26269k318j594j422j245j234j683k005j442l85Mo30j472j710j401j092
55615A06640j150j557j999k116j878j624j553j389q84l47k91p43j307j734k045
55600H6023k183j986j540j193j127j107q01j79M75R10J099J111R09N43L80P42
55584H2076J293J309Q10P20J462K156J972J610K340L984N135N216M999N072N019
55569A25173M428L436J999j86k552l735l405k915l405m293m500m125l895l795
55555I8230l364k805k636k713k526k162k072k142j879j259o47j28L51M39j48q67
55539G3672q45j20L94J43m91q96q86o02k49j9K7j5j31m62r27j070o59j17K1k16
$$ plain form
55519 66552 66111 65634 65244 65002 64787 64193 62965 61526 60642 60545 60791 60966 61042 61044 60893 60704 60697 60742 60449 59877 59558
55498 59558 59703 59943 60030 60136 60181 59546 57958 56218 55504 56177 57636 59037 59821 59776 59049 57991 56831 55665
55480 55665 54813 54763 55498 56234 56217 55562 55038 55225 56116 57320 58368 58997 59356 59778 60219 60244 59758 59409 59867
55461 59867 60938 61772 61891 61607 61418 61317 60898 59994 59004 58493 58555 58777 58822 58776 58755 58548 58018 57619 57983 59025
55441 59025 59926 60041 59461 58637 57869 57233 56660 56001 55253 54688 54506 54506 54539 54996 56236 57683 58352 58290 58659 60127
55421 60127 62054 63665 65163 67016 68791 69562 69204 68572 68433 68768 69108 69141 68864 68377 67621 66332 64376
55404 64376 62106 60162 58873 58100 57604 57263 56939 56539 56228 56193 56238 56089 56057 56780 58224 59588 60306 60482
55386 60482 60218 59376 58297 57905 58562 59529 60073 60368 60771 60973 60605 60055 59803 59477 58438 56938 55798 55198
$$ packed form
55519F6552m41m77l90k42k15n94j228j439q84r7K46J75P6Kj51j89pM5k93n72l19
55498E9558J45K40Q7J06M5o35j588j740p14O73J459J401P84m5p27j058j160j166
55480E5665q52n0P35P36j7o55n24J87Q91J204J048O29L59M22M41K5m86l49M58
55461E9867J071Q34J19k84j89j01m19r04r90n11O2K22M5m6k1k07n30l99L64J042
55441E9025R01J15n80q24p68o36n73o59p48n65j82%L3M57J240J447O69o2L69J468
55421F0127J927J611J498J853J775P71l58o32j39L35L40L3k77m87p56j289j956
55404F4376k270j944j289p73m96l41l24m00l11l5M5j49l2P23J444J364P18J76
55386F0482k64q42j079l92O57R67N44K95M03K02l68n50k52l26j039j500j140o00
$$ plain form
55368 55198 54675 54137 53999 54352 54740 54861 54845 54846 54876 55024 55292 55310 54757 53991 53669 53858 54105 54311 54845 55798 56824
55347 56824 57813 59022 60326 61017 60639 59572 58457 57441 56341 55224 54448 54263 54613 55245 55906 56483 57011
55330 57011 57492 57771 57657 57152 56428 55758 55498 55902 56747 57406 57529 57361 57181 56840 56255 55917 56301 57072 57519
55311 57519 57551 57574 57519 56854 55596 54519 54146 54189 54236 54303 54391 54155 53500 53069 53570 54811 55859 56054 55582 55134
55291 55134 55219 55811 56488 56911 57099 57177 57019 56469 55798 55538 55804 56198 56501 57040 58117 59415 60271 60380 60041
55272 60041 59823 60125 60932 61940 63005 64355 66092 67603 67960 67017 65680 64875 64685 64705 64793 65013 65174 64920
55254 64920 64197 63251 62256 61263 60431 59924 59551 58841 57630 56330 55531 55451 55814 56140 56080 55694 55455 55895 57061
55235 57061 58389 59243 59565 59799 60200 60466 60215 59637 59321 59411 59366 58791 58242 58786 60745 63172 64710 64877
$$ packed form
55368E5198n23n38j38L53L88J21j6JL0J48K68J8n53p66l22J89K47K06N34R53J026
55347E6824R89J209J304O91l78j067j115j016j100j117p76j85L50O32O61N77N28
55330E7011M81K79j14n05p24o70k60M04Q45O59J23j68j80l41n85l38L84P71M47
55311E7519L2K3n5o65j258j077l73M3M7O7Q8k36o55m31N01J241J048J95m72m48
55291E5134Q5N92O77M23J88P8j58n50o71k60K66L94L03N39J077J298Q56J09l39
55272F0041k18L02Q07J008J065J350J737J511L57r43j337q05j90K0Q8K20J61k54
55254F4920p23r46r95r93q32n07l73p10j211j300p99q0L63L26o0l86k39M40J166
55235E7061J328Q54L22K34M01K66k51n78l16R0m5n75n49N44J959K427J538J67
$$ plain form
55217 64877 64365 64170 64579 65065 65088 64733 64494 64607 64897 65160 65320 65231 64741 64112 63959 64477 65039 64885 64012 63051
55197 63051 62487 62301 62237 62076 61789 61682 62203 63298 64199 64262 63796 63638 64036 64498 64667 64760 65098 65667 66297 66827
55177 66827 67003 66617 65927 65592 66035 67065 68154 68750 68364 66897 65084 64191 64921 66773 68593 69528 69421
55160 69421 68678 67966 67770 68064 68587 69373 70579 71757 71936 70692 68651 66651 64936 63561 62934 63237 63728
55143 63728 63439 62474 61831 61886 61894 61261 60574 60815 61956 62989 63249 63124 63364 64134 64981 65527 65898 66503 67563
55124 67563 68845 69727 69606 68440 66939 66048 66139 66784 67350 67641 67865 68203 68658 69175 69695 70081 70223 70197 70175
55105 70175 70201 70189 70064 69782 69289 68630 68039 67773 67932 68536 69600 70882 71813 72080 72154 72776 73883 74509 73892
55086 73892 72327 70776 69935 69924 70556 71626 72983 74474 75830 76687 76957 77085 77631 78542 79179 79131 78671 78275
$$ packed form
55217F4877n12j95M09M86K3l55k39J13K90K63J60q9m90o29j53N18N62j54q73r61
55197F3051n64j86o4j61k87j07N21J095R01O3m66j58L98M62J69R3L38N69O30N30
55177F6827J76l86o90l35M43J030J089N96l86j467j813q93P30J852J820R35j07
55160F9421p43p12j96K94N23P86J206J178J79j244k041k000j715j375o27L03M91
55143F3728k89r65o43N5Qo33o87K41J141J033K60j25K40P70Q47N46L71O05J060
55124F7563J282Q82j21j166j501q91R1O45N66K91K24L38M55N17N20L86J42k6k2
55105G0175K6j2j25k82m93o59n91k66J59O04J064J282R31K67P4O22J107O26o17
55086G3892j565j551q41j1O32J070J357J491J356Q57K70J28N46R11O37m8m60l96
$$ plain form
55068 78275 78074 77941 77717 77099 75735 73863 72529 72622 73796 74826 74967 74456 73681 72501 70794 69168 68519
55051 68519 68937 69584 69813 69963 70719 71979 72905 73064 72984 73361 74151 74777 74883 74497 73705 72681 71933 71983 72781
55032 72781 73837 74940 76306 77944 79364 80127 80270 79966 79120 77630 75820 74262 73270 72703 72233 71726
55016 71726 71439 71793 72783 73771 74235 74610 75791 77722 79154 79128 78123 77318 77144 77196 77199 77392 77961 78647 78998
54997 78998 78740 77953 77207 77318 78550 80080 80668 79953 78799 78372 79182 81009 83237 85111 86016 85864 85124
54980 85124 84344 83742 83275 82947 82857 83043 83368 83586 83495 83132 82767 82630 82636 82551 82443 82825 84209 86493 88842 90246
54960 90246 90296 89465 88578 88034 87660 87252 86938 86855 86792 86525 86351 86862 88166 89710 90976 91981 92897 93519 93511
54941 93511 93015 92643 92822 93405 94013 94485 94876 95246 95652 96202 96858 97274 97186 96966 97379 98663 100150 101138 101870
$$ packed form
55068G8275k01j33k24o18j364j872j334R3J174J030J41n11p75j180j707j626o49
55051F8519M18O47K29J50P56J260R26J59q0L77P90O26J06l86p92j024p48N0P98
55032G2781J056J103J366J638J420P63J43l04q46j490j810j558r92n67m70n07
55016G1726k87L54R90R88M64L75J181J931J432k6j005q05j74N2LJ93N69O86L51
54997G8998k58p87p46J11J232J530N88p15j154m27Q10J827K228J874R05j52p40
54980H5124p80o02m67l28r0J86L25K18r1l63l65j37Oq5j08L82J384K284K349J404
54960I0246N0q31q87n44l74m08l14q3o3k67j74N11J304J544J266J005R16O22q
54941I3511m96l72J79N83O08M72L91L70M06N50O56M16q8k20M13J284J487R88P32
$$ plain form
54922 101870 103254 105754 109026 112675 116820 121642 126758 131493 135641 139537 143319 146450 148156 148170 146725
54907 146725 143949 139650 133892 127504 121579 116564 112200 108348 105268 102920 100594 97769 95018 93398
54893 93398 93116 93381 93484 93435 93465 93574 93749 94150 94782 95393 95937 96782 98225 100134 102347 105045 108443 112409
54875 112409 116728 121427 126492 131484 135811 139282 142097 144367 145867 146191 144987 142223 138351 134032
54861 134032 129532 124661 119484 114721 111046 108243 105541 102686 100240 98775 98151 97694 96836 95461 93820
54846 93820 92248 90953 90045 89677 89935 90527 90819 90382 89441 88602 88293 88571 89328 90407 91541 92360 92545 92028
54828 92028 91143 90512 90478 90612 90074 88599 86851 85694 85439 85920 86908 88142 89321 90423 91725 93189 94151
54811 94151 94108 93543 93429 94010 94553 94319 93332 92123 91061 90124 89151 88239 87839 88305 89317 90014 89848 89042
$$ packed form
54922A01870J384K500L272L649M145M822N116M735M148L896L782L131J706J4j445
54907A46725k776m299n758o388n925n015m364l852l080k348k326k825k751j620
54893I3398k82K65J03m9L0J09J75M01O32O11N44Q45J443J909K213K698L398L966
54875A12409M319M699N065M992M327L471K815K270J500L24j204k764l872m319
54861A34032m500m871n177m763l675k803k702k855k446j465o24m57q58j375j641
54846I3820j572j295r08l68K58N92K92m37r41q39l09K78P57J079J134Q19J85n17
54828I2028q85o31l4J34n38j475j748j157k55M81R88J234J179J102J302J464R62
54811I4151m3n65j14N81N43k34r87j209j062r37r73r12m00M66J012O97j66q06
$$ plain form
54793 89042 88063 87105 86355 86271 87071 88281 89262 89917 90433 90708 90659 90715 91265 91832 91637 90823 90272 90351 90856 92171
54773 92171 95304 100328 105828 110443 114160 117485 120284 122371 124595 128186 133201 138521 143318 147678
54759 147678 151767 155211 157575 158800 158825 157307 154079 149605 144641 139675 134956 130771 127277 124211 121178
54744 121178 118257 116006 114731 114056 113394 112596 111821 110933 109497 107462 105479 104271 103944 104139 104596 105211
54728 105211 105719 105886 106084 107223 109861 113612 117667 121697 125981 130764 135763 140319 143918 146528 148479
54713 148479 149994 150792 150189 147645 143237 137666 131854 126485 121746 117413 113215 109177 105612 102828 100874
54698 100874 99533 98542 97857 97702 98263 99324 100391 101222 101946 102562 102615 101757 100367 99182 98377 97492 96293
54681 96293 95184 94600 94407 94226 94018 94032 94326 94706 95055 95418 95734 95760 95376 94807 94439 94436 94681 95053 95684 96797
$$ packed form
54793H9042r79r58p50q4Q00J210R81O55N16K75m9N6N50N67j95q14n51P9N05J315
54773I2171L133N024N500M615L717L325K799K087K224L591N015N320M797M360
54759A47678M089L444K364J225K5j518l228m474m964m966m719m185l494l066l033
54744A21178k921k251j275o75o62p98p75q88j436k035j983j208l27J95M57O15
54728A05211N08J67J98J139K638L751M055M030M284M783M999M556L599K610J951
54713A48479J515P98o03k544m408n571n812n369m739m333m198m038l565k784j954
54698A00874j341r91o85j55N61J061J067Q31P24O16N3q58j390j185q05q85j199
54681I6293j109n84j93j81k08J4K94L80L49L63L16K6l84n69l68lK45L72O31J113
$$ plain form
54661 96797 98323 99794 100705 100911 100629 100139 99564 98878 98032 97087 96318 96129 96816 98348 100316 101991 102612
54644 102612 102013 100997 100720 101476 102414 102662 102347 102153 102231 102100 101479 100625 99857 99242 98824 98735 98975 99409 100025
54625 100025 100819 101459 101542 101291 101449 102234 102860 102503 101384 100529 100654 101636 102796 103356 102737 100959 98815 97383
54607 97383 97222 98099 99410 100618 101383 101612 101574 101765 102451 103384 104109 104478 104682 104846 104876 104831 105166 106233 107676
54588 107676 108680 108904 108789 108882 109191 109432 109523 109524 109361 108979 108593 108411 108217 107618 106660 105857 105652 106094 106981 107993
54568 107993 108788 109276 109802 110750 111936 112720 112698 112094 111511 111499 112171 112994 113130 112379 111611 111847 113033 114240
54550 114240 114935 115456 116187 116958 117497 117947 118614 119564 120707 121945 122998 123330 122545 120813 118897 117801 118197
54533 118197 119855 121776 123204 124316 125542 126560 126697 126066 125438 124977 124122 122907 122309 122774 123313 122804
$$ packed form
54661I6797J526J471R11K06k82m90n75o86q46r45p69j89O87J532J968J675O21
54644A02612n99j016k77P56R38K48l15j94P8j31o21q54p68o15m18q9K40M34O16
54625A00025P94O40Q3k51J58P85O26l57j119q55J25R82J160N60o19j778k144j432
54607I7383j61Q77J311J208P65K29l8J91O86R33P25L69K04J64L0m5L35J067J443
54588A07676J004K24j15R3L09K41R1Jj63l82l86j82j94n99r58q03k05M42Q87J012
54568A07993P95M88N26R48J186P84k2o04n83j2O72Q23J36p51p68K36J186J207
54550A14240O95N21P31P71N39M50O67R50J143J238J053L32p85j732j916j096L96
54533A18197J658J921J428J112J226J018J37o31o28m61q55j215n98M65N39n09
$$ plain form
54517 122804 121550 120763 120954 121593 122087 122401 122886 123945 125682 127483 128288 127789 126996 127025 127591 127386 125809
54500 125809 123676 122193 121825 122267 123038 123821 124470 124921 125145 125219 125419 125963 126631 127006 127262 128211 130236 132560
54482 132560 134052 134466 134465 134738 135586 137071 138947 140562 141440 141886 142531 143359 143749 143466 143048 143060 143447 143794
54464 143794 143842 143586 143086 142392 141542 140652 140091 140407 141753 143483 144662 144942 144702 144443 144392 144607 145004 145223
54446 145223 144840 143817 142524 141230 139854 138211 136336 134481 133002 132191 132012 132059 132014 132071 132588 133405 133843
54429 133843 133471 132531 131518 130638 129842 129221 129098 129708 130842 131893 132345 132230 131997 132014 132355 133011 133868 134459
54411 134459 134254 133463 133050 133524 134232 134382 134350 135190 137046 138869 139773 139949 140090 140511 141191 142174 143435 144590
54393 144590 145061 144571 143409 142236 141636 141648 141764 141485 140811 140088 139555 139248 139181 139323 139521 139767 140388 141626
$$ packed form
54517A22804j254p87J91O39M94L14M85J059J737J801Q05m99p93K9N66k05j577
54500A25809k133j483l68M42P71P83O49M51K24P4K00N44O68L75K56R49K025K324
54482A32560J492M14jK73Q48J485J876J615Q78M46O45Q28L90k83m18J2L87L47
54464A43794M8k56n00o94q50q90n61L16J346J730J179K80k40k59n1K15L97K19
54446A45223l83j023j293j294j376j643j875j855j479q11j79M7m5N7N17Q17M38
54429A33843l72r40j013q80p96o21j23O10J134J051M52j15k33J7L41O56Q57N91
54411A34459k05p91m13M74P08J50l2Q40J856J823R04J76J41M21O80R83J261J155
54393A44590M71m90j162j173o00J2J16k79o74p23n33l07o7J42J98K46O21J238
$$ plain form
54375 141626 143119 144164 144420 144090 143526 142988 142629 142357 141860 141145 140841 141482 142699 143692 144327 145067 145906 146196
54357 146196 145670 144865 144309 143966 143770 143976 144522 144662 143847 142546 141592 141023 140164 138791 137624 137544 138612 139994
54339 139994 140768 140733 140347 139978 139508 138954 139025 140334 142137 142772 141660 140082 139503 139728 139397 137833 135682
54322 135682 133992 133380 133895 134972 135522 134797 133311 132365 132506 133026 133107 132818 132586 132262 131430 130329 129703 129652
54304 129652 129319 128041 126377 125519 125921 127000 128072 129040 130022 130776 130894 130358 129566 128882 128399 128062 127803
54287 127803 127542 127231 126967 126962 127403 128317 129450 130287 130411 129974 129602 129736 130254 130824 131311 131571 131223 130030 128326
54268 128326 126749 125673 125167 125180 125427 125320 124559 123637 123333 123856 124948 126543 128647 130685 131778 131820 131639
54251 131639 131858 132165 132000 131447 131032 130976 130996 130711 130075 129540 129816 131188 133042 134320 134435 133494 131798 129601
$$ packed form
54375A41626J493J045K56l30n64n38l59k72m97p15l04O41J217R93O35P40Q39K90
54357A46196n26q05n56l43j96K06N46J40q15j301r54n69q59j373j167q0J068J382
54339A39994P74l5l86l69m70n54P1J309J803O35j112j578n79K25l31j564k151
54322A35682j690o12N15J077N50p25j486r46J41N20Q1k89k32l24q32j101o26n1
54304A29652l33j278j664q58M02J079J072R68R82P54J18n36p92o84m83l37k59
54287A27803k61l11k64nM41R14J133Q37J24m37l72J34N18N70M87K60l48j193j704
54268A28326j577j076n06J3K47j07p61r22l04N23J092J595K104K038J093M2j81
54251A31639K19L07j65n53m15n6K0k85o36n35K76J372J854J278J15r41j696k197
$$ plain form
54233 129601 127314 125368 123811 122466 121496 121205 121293 121056 120500 120504 121506 122723 123142 122749 122284 122262 122723 123569
54215 123569 124556 125195 125133 124523 123812 123495 124192 126311 129139 130837 130132 127805 125846 125324 125706 126086 126300
54198 126300 126688 127413 128382 129485 130616 131575 132184 132436 132462 132323 131804 130567 128623 126563 124995 123793 122330
54181 122330 120537 119251 119260 120407 121942 123360 124515 125241 125341 124765 123540 121733 119755 118355 117890 117871
54165 117871 117584 116912 116111 115165 113941 112859 112737 113826 115427 116581 116887 116658 116511 116839 117453 117762 117459
54148 117459 116947 116964 117841 119244 120512 121170 121315 121567 122393 123483 124177 124478 125024 125956 126649 126926 127575 128925
54130 128925 129790 128893 126859 125537 125609 126072 126089 126052 126524 127310 128115 129273 131067 132934 133995 134092 133837 133948
54112 133948 134832 136424 138007 138533 137619 135999 134660 133754 132726 131288 129765 128571 127820 127517 127746 128482
$$ packed form
54233A29601k287j946j557j345r70k91Q8k37n56MJ002J217M19l93m65k2M61Q46
54215A23569R87O39o2o10p11l17O97K119K828J698p05k327j959n22L82L80K14
54198A26300L88P25R69J103J131R59O09K52K6j39n19j237j944k060j568j202j463
54181A22330j793j286RJ147J535J418J155P26J00n76j225j807j978j400m65j9
54165A17871k87o72q01r46j224j082j22J089J601J154L06k29j47L28O14L09l03
54148A17459n12J7Q77J403J268O58J45K52Q26J090O94L01N46R32O93K77O49J350
54130A28925Q65q97k034j322P2M63J7l7M72P86Q05J158J794J867J061R7k55J11
54112A33948Q84J592J583N26r14j620j339r06j028j438j523j194p51l03K29P36
$$ plain form
54096 128482 129373 129890 129737 129111 128577 128616 129229 130026 130668 131155 131664 132195 132496 132288 131554 130649 130113 130315 131262
54077 131262 132668 134104 135059 135105 134230 132902 131659 130712 130061 129770 129833 129895 129562 129000 128921 129756 131113 132260
54059 132260 132983 133753 135029 136656 138059 138953 139661 140733 142462 144910 148098 151847 155634 159044 162360
54044 162360 166270 170990 176194 181909 188883 197806 208657 221061 234785 249465 264331 278557 291381
54031 291381 301467 306756 305769 298844 287604 273666 258458 243643 230565 219304 209188 200166
54019 200166 192846 187247 182536 178160 174300 170939 167390 163251 159084 155591 152698 150045 147892 146859
54005 146859 146981 147554 147834 147529 146782 146017 145727 146061 146571 146535 145606 144159 143006 142742 143268 144028 144675 145264
53987 145264 145702 145526 144635 143817 143872 144469 144620 144119 143623 143315 142491 140779 138892 137656 136999 136491 136339 137139
$$ packed form
54096A28482Q91N17j53o26n34L9O13P97O42M87N09N31L01k08p34r05n36K02R47
54077A31262J406J436R55M6q75j328j243r47o51k91O3O2l33n62p9Q35J357J147
54059A32260P23P70J276J627J403Q94P08J072J729K448L188L749L787L410L316
54044A62360L910M720N204N715O974Q923J0851J2404J3724J4680J4866J4226J2824
54031B91381J0086N289r87o925j1240j3938j5208j4815j3078j1261j0116r022
54019B00166p320n599m711m376l860l361l549m139m167l493k893k653k153j033
54005A46859J22N73K80l05p47p65k90L34N10l6r29j447j153k64N26P60O47N89
53987A45264M38j76q91q18N5N97J51n01m96l08q24j712j887j236o57n08j52Q00
$$ plain form
53969 137139 138915 140986 142677 143810 144616 145461 146514 147517 148062 148166 148241 148399 148255 147656 147168 147490 148693
53952 148693 150291 151826 153149 154410 155935 157873 159865 161447 162766 164392 166299 167709 168237 168513 169347
53937 169347 170862 172868 175466 178759 182495 186530 191099 196095 200651 204117 206945 209902 212858 215153
53923 215153 216749 218222 219876 221684 223827 226370 228694 230264 231863 234969 239692 244281 246957 247421
53909 247421 246337 244198 241171 237406 232965 227883 222583 217726 213319 208538 202861 196926 191840 188058
53895 188058 185365 183513 182322 181537 181215 182100 184989 189750 195462 201549 208346 216491 226197 237220 249001
53880 249001 260440 269811 275434 276510 273106 265480 253991 239918 225759 213871 204755 197210 190286
53867 190286 184439 180441 177874 175466 172563 169480 166559 163752 161271 159811 159669 160149 160270 159705 158767
$$ packed form
53969A37139J776K071J691J133Q06Q45J053J003N45J04P5J58j44n99m88L22J203
53952A48693J598J535J323J261J525J938J992J582J319J626J907J410N28K76Q34
53937A69347J515K006K598L293L736M035M569M996M556L466K828K957K956K295
53923B15153J596J473J654J808K143K543K324J570J599L106M723M589K676M64
53909B47421j084k139l027l765m441n082n300m857m407m781n677n935n086l782
53895A88058k693j852j191p85l22Q85K889M761N712O087O797Q145R706J1023J1781
53880B49001J1439R371N623J076l404p626j1489j4073j4159j1888r116p545o924
53867A90286n847l998k567k408k903l083k921k807k481j460j42M80J21n65r38
$$ plain form
53852 158767 157875 157462 157955 159236 160335 160227 158961 157587 156978 157077 157324 157311 156889 156005 154785 153627 152962
53835 152962 152874 153067 153132 152826 152198 151564 151341 151768 152745 153913 154860 155310 155226 154841 154524 154568 155042 155807 156586 157052
53815 157052 157090 157123 157987 160186 163231 165986 167763 168843 169780 170535 170631 170069 169612 170030 171354 173062 174759
53798 174759 176403 177995 179353 180315 180993 181659 182387 182893 182837 182252 181552 181102 180912 180891 181237 182314 184117 186064
53780 186064 187393 187714 187268 186764 186906 187793 188780 189112 188710 188070 187446 186494 184812 182428 179601 176536 173560
53763 173560 171259 170035 169693 169800 170287 171316 172676 173782 174326 174596 175016 175635 176280 176965 177927 179168 180152
53746 180152 180152 178966 177160 175479 174161 173127 172703 173568 175757 178133 179336 179131 178464 178349 179082 180486
53730 180486 182433 184874 187568 190019 191752 192685 193210 193835 194713 195660 196655 198022 199947 202086 203993 205726
$$ packed form
53852A58767q92m13M93J281J099j08j266j374o09R9K47j3m22q84j220j158o65
53835A52962q8J93O5l06o28o34k23M27R77J168R47M50q4l85l17M4M74P65P79M66
53815A57052L8L3Q64K199L045K755J777J080R37P55R6n62m57M18J324J708J697
53798A74759J644J592J358R62O78O66P28N06n6n85p00m50j90k1L46J077J803J947
53780A86064J329L21m46n04J42Q87R87L32m02o40o24r52j682k384k827l065k976
53763A73560k301j224l42J07M87J029J360J106N44K70M20O19O45O85R62J241R84
53746A80152%j186j806j681j318j034m24Q65K189K376J203k05o67j15P33J404
53730A80486J947K441K694K451J733R33N25O25Q78R47R95J367J925K139J907J733
$$ plain form
53714 205726 207604 209440 210506 210479 210089 210547 212418 215240 218263 221328 224803 228741 232474 235324 237525
53699 237525 239941 242906 245796 247956 249534 251151 253143 255463 257996 260546 262712 264212 265138 265674 265864
53684 265864 265954 266498 267588 268359 267967 266803 266001 265867 265619 264683 263395 262248 261224 260169 259188 258309 257330
53667 257330 256337 255774 255598 254979 253374 251438 250175 249580 248816 247551 246304 245451 244558 243088 241339 240302
53651 240302 240612 241830 242776 242552 241285 239903 239233 239464 240401 241870 243682 245526 247240 249025 251040 252897
53635 252897 253991 254370 254840 256012 257539 258640 259199 260008 261861 264765 268181 271801 275700 279807 283643
53620 283643 286793 289371 291791 294274 296838 299584 302628 305813 308874 311873 315162 318920 323094 327765
53606 327765 333071 338624 343494 347072 349637 351847 354020 356202 358545 361138 363676 365750 367323 368517
$$ packed form
53714B05726J878J836J066k7l90M58J871K822L023L065L475L938L733K850K201
53699B37525K416K965K890K160J578J617J992K320K533K550K166J500R26N36J90
53684B65864R0N44J090P71l92j164q02j34k48r36j288j147j024j055r81q79r79
53667B57330r93n63j76o19j605j936j263n95p64j265j247q53q93j470j749j037
53651B40302L10J218R46k24j267j382o70K31R37J469J812J844J714J785K015J857
53635B52897J094L79M70J172J527J101N59Q09J853K904L416L620L899M107L836
53620B83643L150K578K420K483K564K746L044L185L061K999L289L758M174M671
53606C27765N306N553M870L578K565K210K173K182K343K593K538K074J573J194
$$ plain form
53592 368517 369078 368618 367382 366243 365755 365684 365653 365866 366789 368391 370068 371288 372051 372723 373633 374828 376052
53575 376052 376938 377331 377402 377293 376752 375311 372799 369417 365308 360460 355240 350618 347343 345029 342554 339440
53559 339440 336330 333972 332230 330566 329126 328737 329835 331888 333987 335665 336960 337984 338729 339233 339764
53544 339764 340770 342683 345699 349702 354402 359476 364613 369630 374752 380611 387750 396085 405087 414434
53530 414434 424319 435109 446911 459449 472217 484831 497475 510935 525910 542317 559571 577492
53518 577492 596449 616536 637172 657932 679420 702725 728173 755053 782648 811023 840560
53507 840560 870978 901208 930246 957919 984794 1011569 1038716 1066491 1094924 1123674 1152185
53496 1152185 1180170 1207842 1235476 1262906 1289619 1315229 1339613 1362760 1384742 1405796 1426147
$$ packed form
53592C68517N61m60j236j139m88p1l1K13R23J602J677J220P63O72R10J195J224
53575C76052Q86L93P1j09n41j441k512l382m109m848n220m622l275k314k475l114
53559C39440l110k358j742j664j440l89J098K053K099J678J295J024P45N04N31
53544C39764J006J913L016M003M700N074N137N017N122N859P139Q335R002R347
53530D14434R885J0790J1802J2538J2768J2614J2644J3460J4975J6407J7254J7921
53518E77492J8957K0087K0636K0760K1488K3305K5448K6880K7595K8375K9537
53507H40560L0418L0230K9038K7673K6875K6775K7147K7775K8433K8750K8511
53496A152185K7985K7672K7634K7430K6713K5610K4384K3147K1982K1054K0351
$$ plain form
53485 1426147 1445748 1464390 1482129 1499462 1517087 1535528 1554762 1573987 1591946 1607747 1621274
53474 1621274 1632692 1641866 1648619 1653093 1655255 1654275 1649141 1639880 1627510 1612835 1596007 1577332 1557585
53461 1557585 1537209 1515938 1493636 1470774 1447570 1423304 1397126 1369152 1340196 1310883 1281569
53450 1281569 1252741 1224788 1197609 1170981 1145083 1120132 1095837 1071846 1048534 1026759 1007030
53439 1007030 989464 974302 961712 951217 942118 934484 929034 925970 924717 924918 926999 931432 938043
53426 938043 946448 956690 969173 984283 1002272 1023078 1045985 1069852 1093988 1118609 1144289 1171316
53414 1171316 1199714 1229498 1260681 1293323 1327677 1363993 1402140 1441930 1483851 1528869 1577275
53403 1577275 1628378 1681715 1737798 1797103 1858925 1922021 1985977 2051127 2117454 2184534 2252461
$$ packed form
53485A426147J9601J8642J7739J7333J7625J8441J9234J9225J7959J5801J3527
53474A621274J1418R174O753M474K162r80n134r261j2370j4675j6828j8675j9747
53461A557585k0376k1271k2302k2862k3204k4266k6178k7974k8956k9313k9314
53450A281569k8828k7953k7179k6628k5898k4951k4295k3991k3312k1775j9729
53439A007030j7566j5162j2590j0495r099p634n450l064j253K01K081M433O611
53426I38043Q405J0242J2483J5110J7989K0806K2907K3867K4136K4621K5680K7027
53414A171316K8398K9784L1183L2642L4354L6316L8147L9790M1921M5018M8406
53403A577275N1103N3337N6083N9305O1822O3096O3956O5150O6327O7080O7927
$$ plain form
53392 2252461 2321775 2392197 2462244 2530571 2597125 2662494 2726488 2787911 2845652 2899694 2951038
53381 2951038 3000703 3048756 3094265 3136293 3174736 3209891 3241412 3268315 3290073 3306997 3319050
53370 3319050 3324703 3321530 3307772 3283019 3247674 3202438 3148380 3087103 3020544 2950566 2878530 2804981
53358 2804981 2729851 2653259 2576084 2499566 2424492 2351025 2279173 2208952 2140185 2072598 2006227
53347 2006227 1941339 1877876 1815332 1753342 1692136 1632392 1574943 1520682 1470221 1423470 1379885
53336 1379885 1339384 1302586 1269930 1241019 1215174 1192195 1172101 1154491 1138688 1124280 1110976
53325 1110976 1098255 1085827 1074250 1064348 1055996 1048237 1040753 1034428 1030206 1028020 1027302 1027969 1030340 1034430
53311 1034430 1039918 1046647 1054581 1063421 1072794 1082947 1094746 1108799 1124849 1142380 1161616 1183480
$$ packed form
53392B252461O9314P0422P0047O8327O6554O5369O3994O1423N7741N4042N1344
53381B951038M9665M8053M5509M2028L8443L5155L1521K6903K1758J6924J2053
53370C319050N653l173j3758k4753l5345m5236n4058o1277o6559o9978p2036p3549
53358B804981p5130p6592p7175p6518p5074p3467p1852p0221o8767o7587o6371
53347B006227o4888o3463o2544o1990o1206n9744n7449n4261n0461m6751m3585
53336A379885m0501l6798l2656k8911k5845k2979k0094j7610j5803j4408j3304
53325A110976j2721j2428j1577r902q352p759p484o325m222k186p18O67K371M090
53311A034430N488O729P934Q840R373J0153J1799J4053J6050J7531J9236K1864
$$ plain form
53299 1183480 1208402 1235492 1263294 1291354 1320625 1352168 1385856 1420709 1456137 1492221 1528857
53288 1528857 1565190 1600074 1632690 1662739 1690505 1716846 1742547 1767441 1790499 1810920 1828599
53277 1828599 1843377 1854529 1861441 1864262 1863326 1858444 1849404 1836769 1821312 1802799 1780105 1752635
53265 1752635 1721034 1686389 1649346 1610238 1569568 1527957 1485811 1443255 1400299 1357038 1313917
53254 1313917 1271852 1231823 1194207 1158596 1124242 1090471 1056780 1022874 988763 954605 920400
53243 920400 885996 851400 816899 782943 750154 719349 691186 665681 642427 621349 602867
53232 602867 587146 573537 561085 549389 538724 529401 521283 513891 506780 499763 492773 485582 477700
53219 477700 468705 458621 447930 437254 427203 418319 410791 404127 397437 390217 382687 375304 368216
$$ packed form
53299A183480K4922K7090K7802K8060K9271L1543L3688L4853L5428L6084L6636
53288A528857L6333L4884L2616L0049K7766K6341K5701K4894K3058K0421J7679
53277A828599J4778J1152O912K821r36m882r040j2635j5457j8513k2694k7470
53265A752635l1601l4645l7043l9108m0670m1611m2146m2556m2956m3261m3121
53254A313917m2065m0029l7616l5611l4354l3771l3691l3906l4111l4158l4205
53243I20400l4404l4596l4501l3956l2789l0805k8163k5505k3254k1078j8482
53232F02867j5721j3609j2452j1696j0665r323q118p392p111p017o990p191p882
53219D77700q995j0084j0691j0676j0051q884p528o664o690p220p530p383p088
$$ plain form
53206 368216 361324 354571 347903 341140 334187 327287 320834 314951 309484 304368 299774 295845 292442 289209
53192 289209 285847 282296 278742 275492 272756 270514 268578 266807 265274 264165 263501 262975 262181 261007 259658
53177 259658 258248 256527 254176 251236 248033 244857 242039 240233 240071 241352 242935 243723 243480 242498 240875
53162 240875 238640 236382 235066 235045 235662 236028 235851 235280 234395 233227 232073 231250 230594 229603 228137 226570 225166
53145 225166 223711 222018 220495 219833 220280 221489 222954 224267 225077 225202 224818 224268 223629 222716 221575 220673
53129 220673 220478 221037 222067 223278 224478 225511 226224 226512 226425 226281 226478 226975 227134 226469 225387 224760 224804 224939
53111 224939 224743 224340 223726 222515 220841 219735 219788 219986 218861 216637 215218 215833 217509 218308 217526 216152
53095 216152 215454 215701 216297 216782 217338 218318 219561 220484 220787 220696 220409 219726 218529 217277 216603 216614 216958 217441
$$ packed form
53206C68216o892o753o668o763o953o900o453n883n467n116m594l929l403l233
53192B89209l362l551l554l250k736k242j936j771j533j109o64n26p94j174j349
53177B59658j410j721k351k940l203l176k818j806j62J281J583P88k43r82j623
53162B40875k235k258j316k1O17L66j77n71q85j168j154q23o56r91j466j567j404
53145B25166j455j693j523o62M47J209J465J313Q10J25l84n50o39r13j141r02
53129B20673j95N59J030J211J200J033P13K88q7j44J97M97J59o65j082o27M4J35
53111B24939j96m03o14j211j674j106N3J98j125k224j419O15J676P99p82j374
53095B16152o98K47N96M85N56R80J243R23L03r1k87o83j197j252o74J1L44M83
$$ plain form
53077 217441 218124 218921 219530 219782 219736 219461 219023 218574 218179 217671 216996 216495 216425 216364 215620 214094 212247 210341 208347
53058 208347 206573 205621 205554 205748 205760 205773 205949 205970 205553 204870 204047 202766 200811 198610 196773 195364 194120 193096
53040 193096 192569 192464 192336 191901 191229 190466 189684 189010 188614 188532 188605 188620 188436 188081 187765 187672 187741 187814 187995 188517 189188
53019 189188 189398 188883 188129 187750 187810 188060 188473 189102 189658 189703 189217 188571 188041 187669 187509 187647 187986 188358 188853
53000 188853 189741 191092 192727 194513 196386 198101 199336 200119 200846 201735 202466 202523 201745 200458 199176 198295
52984 198295 197937 197956 198159 198590 199536 201161 203156 204826 205571 205327 204639 204302 204888 206442 208505 210416 211731
52967 211731 212479 212965 213333 213389 212958 212271 211793 211714 211762 211519 210775 209594 208238 207040 206192 205600 205054 204486 203926
52948 203926 203326 202665 202156 202067 202324 202539 202448 202077 201437 200369 198744 196666 194424 192359 190664 189160 187482
$$ packed form
53077B17441O83P97O09K52m6k75m38m49l95n08o75n01p0o1p44j526j847j906j994
53058B08347j774r52o7J94J2J3J76K1m17o83q23j281j955k201j837j409j244j024
53040A93096n27j05j28m35o72p63p82o74l96q2P3J5j84l55l16r3O9P3J81N22O71
53019A89188K10n15p54l79O0K50M13O29N56M5m86o46n30l72j60J38L39L72M95
53000A88853Q88J351J635J786J873J715J235P83P27Q89P31N7p78j287j282q81
52984A98295l58J9K03M31R46J625J995J670P45k44o88l37N86J554K063J911J315
52967B11731P48M86L68N6m31o87m78p9M8k43p44j181j356j198q48n92n46n68n60
52948B03926o00o61n09q9K57K15r1l71o40j068j625k078k242k065j695j504j678
$$ plain form
52931 187482 185763 184836 185196 186049 186099 185214 184474 184544 184872 184801 184536 184449 184225 183416 182338 181706 181765 182396 183642
52912 183642 185386 186855 187249 186748 186230 186103 186078 185927 185765 185581 185200 184774 184717 185053 185407 185734 186463 187689
52894 187689 188775 189053 188550 187768 187145 186940 187351 188368 189669 190850 191665 192068 192179 192259 192453 192495 191951 190818
52876 190818 189620 188778 188156 187410 186584 186146 186493 187533 188753 189649 190091 190241 190189 189952 189892 190697 192559 194670
52858 194670 196000 196447 196695 197057 197072 196350 195212 194171 193186 191811 189887 187769 185981 184812 184210 183956
52842 183956 183975 184345 184852 184773 183544 181630 180242 180051 180578 180994 180948 180374 179059 177069 175271 174698 175331 176057
52824 176057 176003 175442 175175 175415 175772 176136 176980 178693 181014 183478 186126 189332 193012 196516 199420 201978
52808 201978 204477 206487 207162 206072 203422 199598 194992 190226 186079 182936 180580 178646 177111 176197 175897
$$ packed form
52931A87482j719r27L60Q53N0q85p40P0L28p1k65q7k24q09j078o32N9O31J246
52912A83642J744J469L94n01n18j27k5j51j62j84l81m26n7L36L54L27P29J226
52894A87689J086K78n03p82o23k05M11J017J301J181Q15M03J11Q0J94M2n44j133
52876A90818j198q42o22p46q26m38L47J040J220Q96M42J50n2k37o0Q05J862K111
52858A94670J330M47K48L62J5p22j138j041r85j375j924k118j788j169o02k54
52842A83956J9L70N07p9j229j914j388j91N27M16m6n74j315j990j798n73O33P26
52824A76057n4n61k67K40L57L64Q44J713K321K464K648L206L680L504K904K558
52808B01978K499K010O75j090k650l824m606m766m147l143k356j934j535r14l00
$$ plain form
52793 175897 175778 175250 174076 172624 171519 171022 170916 171034 171534 172432 173221 173381 173109 173060 173476 174023 174393 174566
52775 174566 174405 173622 172402 171606 171974 173296 174658 175307 175105 174301 173210 172164 171589 171908 173128 174531
52759 174531 175031 174169 172635 171568 171453 171904 172339 172415 171959 171050 170257 170302 171337 172844 174279 175422 176083
52742 176083 176081 175735 175816 176636 177613 178083 178177 178449 179007 179530 179957 180614 181670 182926 184126 185103 185572 185199 184064
52723 184064 182810 182075 181914 181925 181858 181857 182116 182442 182337 181532 180306 179279 178931 179295 179948 180239 179764 178793 178139
52704 178139 178416 179528 180959 182345 183524 184294 184527 184477 184596 185037 185613 186215 186929 187754 188542 189235 189830 190128
52686 190128 189820 188854 187436 185798 184314 183685 184331 185566 185993 185022 183512 182665 182726 183027 182879 182110 181068
52669 181068 180462 180888 182185 183541 184476 185442 187133 189536 192010 194066 195639 196723 197207 197150 196951 197090
$$ packed form
52793A75897j19n28j174j452j105m97j06J18N00Q98P89J60k72m9M16N47L70J73
52775A74566j61p83j220p96L68J322J362O49k02q04j091j046n75L19J220J403
52759A74531N00q62j534j067j15M51M35P6m56r09p93M5J035J507J435J143O61
52742A76083kl46Q1Q20R77M70R4K72N58N23M27O57J056J256J200R77M69l73j135
52723A84064j254p35j61J1o7jK59L26j05q05j226j027l48L64O53K91m75r71o54
52704A78139K77J112J431J386J179P70K33n0J19M41N76O02P14Q25P88O93N95K98
52686A90128l08r66j418j638j484o29O46J235M27r71j510q47O1L01j48p69j042
52669A81068o06M26J297J356R35R66J691K403K474K056J573J084M84n7j99J39
$$ plain form
52653 197090 197672 198175 197806 196319 194372 192730 191248 189205 186675 184847 184611 185397 185892 185486 184553 183614
52637 183614 182812 182097 181481 181164 181595 183211 185824 188517 190472 191728 192822 193880 194444 194121 193168 192461
52621 192461 192874 194381 195768 195745 194503 193605 194069 195260 196081 196456 196845 197028 196466 195584 195517 196547 197758
52604 197758 198376 198578 198727 198675 198286 198014 198402 199338 200240 200763 201037 201374 201956 202708 203343 203652 203777 204045 204584
52585 204584 205259 205911 206410 206630 206648 206867 207575 208509 209188 209510 209587 209240 208246 207040 206447 206618 206867 206703 206405
52566 206405 206302 206135 205562 204821 204411 204434 204632 204830 204988 205014 204843 204548 204143 203504 202699 202152 202174 202557 202961 203471
52546 203471 204412 205711 206829 207365 207481 207653 208145 208732 208840 208008 206328 204466 203218 203030 203806 205006 205938
52529 205938 206177 205803 205156 204425 203691 203161 202907 202373 200703 197900 195203 193908 194040 194619 195046 195685 197083
$$ packed form
52653A97090N82N03l69j487j947j642j482k043k530j828k36P86M95m06r33r39
52637A83614q02p15o16l17M31J616K613K693J955J256J094J058N64l23r53p07
52621A92461M13J507J387k3j242q98M64J191Q21L75L89J83n62q82o7J030J211
52604A97758O18K02J49n2l89k72L88R36R02N23K74L37N82P52O35L09J25K68N39
52585B04584O75O52M99K20J8K19P08R34O79L22P7l47r94j206n93J71K49j64k98
52566B06405j03j67n73p41m10K3J98J98J58K6j71k95m05o39q05n47K2L83M04N10
52546B03471R41J299J118N36J16J72M92N87J08q32j680j862j248j88P76J200R32
52529B05938K39l74o47p31p34n30k54n34j670k803k697j295J32N79M27O39J398
$$ plain form
52512 197083 199103 201097 202693 204133 205866 207978 210072 211658 212590 213101 213454 213663 213548 213028 212279 211580
52496 211580 210967 210094 208673 207042 205979 205724 205481 204370 202681 201688 202200 203806 205631 207259 208654 209705
52480 209705 210329 210708 210999 211044 210695 210267 210163 210233 209939 209173 208429 208125 208177 208423 209088 210483 212410 214218 215455
52461 215455 216329 217474 219364 221908 224471 226243 226758 226192 225217 224505 224362 224729 225340 225748 225472 224492 223565
52444 223565 223638 224727 225747 225731 224920 224242 223981 223510 222286 220583 219097 218284 218221 218697 219159 218954 218007 217065
52426 217065 216990 217914 219258 220479 221518 222640 224053 225721 227414 229019 230805 233371 237289 242900 250329
52411 250329 259335 269034 278051 285187 289784 291443 289833 285149 278457 271127 263956 257098 250684 245072
52397 245072 240473 236723 233583 231085 229472 228901 229200 229832 230142 229856 229313 229086 229390 230056 231034 232638 235190
$$ packed form
52512A97083K020J994J596J440J733K112K094J586R32N11L53K09j15n20p49o99
52496B11580o13q73j421j631j063k55k43j111j689r93N12J606J825J628J395J051
52480B09705O24L79K91M5l49m28j04P0k94p66p44l04N2K46O65J395J927J808J237
52461B15455Q74J145J890K544K563J772N15n66r75p12j43L67O11M08k76r80r27
52444B23565P3J089J020j6q11o78k61m71j224j703j486q13o3M76M62k05r47r42
52426B17065p5R24J344J221J039J122J413J668J693J605J786K566L918N611P429
52411B50329R006R699R017P136M597J659j610m684o692p330p171o858o414n612
52397B45072m599l750l140k498j613n71K99O32L10k86n43k27L04O66R78J604K552
$$ plain form
52380 235190 238578 242276 245693 248465 250555 252186 253641 255078 256549 258145 259975 262022 264136 266297
52366 266297 268689 271444 274381 277179 279741 282206 284587 286596 287952 288732 289286 289870 290628 291872 294055
52351 294055 297312 301226 305304 309586 314542 320395 326782 333128 339244 345485 352400 360234 368751 377548
52337 377548 386588 396266 406892 418251 429788 441110 452229 463513 475571 488883 503229 517695
52325 517695 531557 544929 558154 570878 582391 592739 602674 612357 620866 627346 632014 635586 638215
52312 638215 639525 639356 637979 635788 633206 630692 628445 626157 623359 619843 615656 611008 606492 602952
52298 602952 600675 599046 597433 596071 595555 595845 596508 597685 599993 603454 607364 611430 616305 622663 630333
52283 630333 638768 647811 657559 667779 677984 687945 697723 707307 716568 725503 734221 742617 750233 756457
$$ packed form
52380B35190L388L698L417K772K090J631J455J437J471J596J830K047K114K161
52366B66297K392K755K937K798K562K465K381K009J356P80N54N84P58J244K183
52351B94055L257L914M078M282M956N853O387O346O116O241O915P834Q517Q797
52337C77548R040R678J0626J1359J1537J1322J1119J1284J2058J3312J4346J4466
52325E17695J3862J3372J3225J2724J1513J0348R935R683Q509O480M668L572K629
52312F38215J310j69j377k191k582k514k247k288k798l516m187m648m516l540
52298F02952k277j629j613j362n16K90O63J177K308L461L910M066M875O358P670
52283F30333Q435R043R748J0220J0205R961R778R584R261Q935Q718Q396P616O224
$$ plain form
52269 756457 760767 762863 762821 761231 759045 757033 755226 752932 749463 744910 740023 735349 730768 726018 721264
52254 721264 716792 712454 707954 703581 700065 697676 695932 694273 692524 690577 688163 685231 682135 679165
52240 679165 676319 673819 672391 672584 674068 676018 678004 680126 682545 685347 688734 692817 697201 701171
52226 701171 704386 707172 710145 713734 718011 722741 727611 732603 738067 744232 750819 757466 764262 771420
52212 771420 778493 784458 788733 791769 794538 797711 801347 804969 807827 809447 810115 810592 811339 812333 813556
52197 813556 815085 816574 817299 817022 816328 815731 815033 814012 813172 813045 813125 812342 810404 807894 805132 801811 797841
52180 797841 793679 789539 785096 780408 776403 773848 772366 771107 769970 769421 769379 769115 768259 767255 766664 766572
52164 766572 766912 767915 769844 772491 775249 777582 779283 780413 781218 782147 783723 786237 789501 793043 796610
$$ packed form
52269G56457M310K096m2j590k186k012j807k294l469m553m887m674m581m750m754
52254G21264m472m338m500m373l516k389j744j659j749j947k414k932l096k970
52240F79165k846k500j428J93J484J950J986K122K419K802L387M083M384L970
52226G01171L215K786K973L589M277M730M870M992N464O165O587O647O796P158
52212G71420P073N965M275L036K769L173L636L622K858J620O68M77P47R94J223
52197H13556J529J489P25k77o94n97o98j021q40j27Q0p83j938k510k762l321l970
52180G97841m162m140m443m688m005k555j482j259j137n49m2k64q56j004n91r2
52164G66572L40J003J929K647K758K333J701J130Q05R29J576K514L264L542L567
$$ plain form
52149 796610 800400 804637 809048 813120 816900 821150 826500 832795 839465 846170 852758 859002 864876 870861
52135 870861 877410 884245 890756 897045 903958 912042 921028 930510 940543 951320 962756 974752 987388
52122 987388 1000462 1013102 1024341 1033933 1042268 1049526 1055297 1059064 1060838 1061175 1060572 1058923 1055753 1051071
52108 1051071 1045770 1040827 1036252 1031291 1025656 1020004 1015132 1011263 1008354 1006550 1005887 1006003 1006618 1007959 1010264
52093 1010264 1013150 1015986 1018620 1021257 1023847 1026227 1028779 1032342 1037394 1043828 1051594 1061094 1072681 1086015
52079 1086015 1100027 1113405 1125265 1135671 1145464 1155220 1164437 1172101 1177919 1182491 1186270 1188960 1190118
52066 1190118 1189729 1187816 1183949 1177646 1169038 1158789 1147553 1135826 1124093 1112621 1101121 1088966
52054 1088966 1075869 1062205 1048647 1035595 1022815 1009502 994877 979079 963404 949379 937543
$$ packed form
52149G96610L790M237M411M072L780M250N350O295O670O705O588O244N874N985
52135H70861O549O835O511O289O913Q084Q986R482J0033J0777J1436J1996J2636
52122I87388J3074J2640J1239R592Q335P258N771L767J774L37o03j649l170m682
52108A051071n301m943m575m961n635n652m872l869k909j804o63J16O15J341K305
52093A010264K886K836K634K637K590K380K552L563N052O434P766R500J1587J3334
52079A086015J4012J3378J1860J0406R793R756R217P664N818M572L779K690J158
52066A190118l89j913l867o303q608j0249j1236j1727j1733j1472j1500j2155
52054A088966j3097j3664j3558j3052j2780j3313j4625j5798j5675j4025j1836
$$ plain form
52043 937543 927357 918212 910117 903370 898040 894148 891969 891664 892696 894063 895147 895985 896677 896998 896715
52028 896715 895844 894236 891286 886537 880348 873471 866070 857702 848290 838572 829393 820968 813030 805253
52014 805253 797244 788487 778737 768308 757605 746557 734846 722584 710409 698886 688062 677635
52002 677635 667304 656924 646462 635907 625287 614860 605203 596782 589341 582015 574208 566170 558513
51989 558513 551548 545338 540060 535798 532102 528188 523584 518350 512799 507189 501520 495343 488007 479485
51975 479485 470751 462906 456131 449962 444353 439826 436582 434170 432238 431041 430982 432032 433885 436393 439599
51960 439599 443505 447862 451999 454902 455821 454825 452485 449083 444597 439379 434243 429756 425955 422927 421089
51945 421089 420642 421253 422607 424839 428151 432445 437722 444299 452080 459911 466268 470476 472903 474134 474290
$$ packed form
52043I37543j0186r145q095o747n330l892k179l05J032J367J084Q38O92L21k83
52028H96715q71j608k950m749o189o877p401q368r412r718r179q425p938p777
52014H05253q009q757r750j0429j0703j1048j1711j2262j2175j1523j0824j0427
52002F77635j0331j0380j0462j0555j0620j0427r657q421p441p326p807q038p657
51989E58513o965o210n278m262l696l914m604n234n551n610n669o177p336q522
51975D79485q734p845o775o169n609m527l244k412j932j197n9J050J853K508L206
51960D39599L906M357M137K903R19r96k340l402m486n218n136m487l801l028j838
51945D21089m47O11J354K232L312M294N277O577P781P831O357M208K427J231J56
$$ [...]
##END NTUPLES=NMR SPECTRUM
##END=
