##TITLE=AC1582_13IEXT2718_8214273_05kkdScx9Q
##JCAMPDX= 6.0         $$ Bruker NMR JCAMP-DX V2.0
##DATA TYPE= NMR SPECTRUM
##DATA CLASS= NTUPLES
##ORIGIN= BRUKER
##OWNER= Administrator
$$ 1.72 TOPSPIN		Version 2.1
$$ 2013-10-05 00:00:25.373 -0700  Administrator@X
$$ Compression mode = diff/dup
##.OBSERVE FREQUENCY= 400.02188249412
##.OBSERVE NUCLEUS= ^1H
##.ACQUISITION MODE= SIMULTANEOUS (DQD)
##.ACQUISITION SCHEME= undefined
##.AVERAGES= 8
##.DIGITISER RES= 22
##SPECTROMETER/DATA SYSTEM= spect
##.PULSE SEQUENCE= zg30
##.SOLVENT NAME= COFFEE_meoh
##.SHIFT REFERENCE= INTERNAL, COFFEE_meoh, 1, 14.98509
##AUDIT TRAIL= $$ (NUMBER, WHEN, WHO, WHERE, PROCESS, VERSION, WHAT)
$$ ##TITLE= Audit trail, TOPSPIN		Version 2.1
$$ ##JCAMPDX= 5.01
$$ ##ORIGIN= Bruker BioSpin GmbH
$$ ##OWNER= Administrator
$$ $$ E:\/data/COFFEE/nmr/AC1582_13IEXT2718_8214273_05kkdScx9Q/20/pdata/1/auditp.txt
$$ ##AUDIT TRAIL=  $$ (NUMBER, WHEN, WHO, WHERE, PROCESS, VERSION, WHAT)
(   1,<2013-10-05 00:00:19.044 -0700>,<Administrator>,<X>,<go>,<TOPSPIN 2.1>,
      <created by zg
	started at 2013-10-04 23:59:12.201 -0700,
	POWCHK enabled, PULCHK disabled,
       configuration hash MD5:
       C8 4E 4E 5D D3 5C D8 9E 9F 52 82 E0 59 8A DE 15
       data hash MD5: 64K
       2A 84 92 04 6B FD 98 04 F0 F0 05 F5 00 F2 7A AC>)
(   2,<2013-10-05 00:00:21.888 -0700>,<Administrator>,<X>,<proc1d>,<TOPSPIN 2.1>,
      <Start of raw data processing
       efp LB = 0 FT_mod = 6 PKNL = 1 PHC0 = 0 PHC1 = 0 SI = 32K 
       data hash MD5: 32K
       00 AA 87 0A 33 D5 B5 35 0F E8 38 FD 16 AD D1 1F>)
(   3,<2013-10-05 00:00:22.169 -0700>,<Administrator>,<X>,<proc1d>,<TOPSPIN 2.1>,
      <pk PHC0 = 92.91687 PHC1 = 0 
       data hash MD5: 32K
       C1 73 09 CF 67 8E 2B 65 B1 49 D1 03 75 16 DB 58>)
(   4,<2013-10-05 00:00:22.279 -0700>,<Administrator>,<X>,<proc1d>,<TOPSPIN 2.1>,
      <abs ABSG = 1 
       data hash MD5: 32K
       25 05 EB ED 37 0E B2 C6 B2 3B 9C EC 46 54 D4 DE>)
(   5,<2013-10-05 00:00:22.341 -0700>,<Administrator>,<X>,<proc1d>,<TOPSPIN 2.1>,
      <abs ABSG = 2 
       data hash MD5: 32K
       36 D3 2A 0C 8D E4 C9 8A CE 88 57 CC 0B 80 68 BD>)
(   6,<2013-10-05 00:00:22.404 -0700>,<Administrator>,<X>,<proc1d>,<TOPSPIN 2.1>,
      <abs ABSG = 3 
       data hash MD5: 32K
       DE DE C2 96 92 33 0D 91 C1 66 D6 26 6F 16 32 55>)
(   7,<2013-10-05 00:00:22.482 -0700>,<Administrator>,<X>,<proc1d>,<TOPSPIN 2.1>,
      <abs ABSG = 4 
       data hash MD5: 32K
       1C 01 B7 6E 24 E5 5E 73 D2 B5 E6 8E 75 AF 21 3B>)
(   8,<2013-10-05 00:00:22.529 -0700>,<Administrator>,<X>,<proc1d>,<TOPSPIN 2.1>,
      <abs ABSG = 5 
       data hash MD5: 32K
       A7 00 73 2E 9B 17 DC 34 2B FB 22 1F C2 60 75 5A>)
$$ ##END=
$$ 
$$ $$ hash MD5
$$ $$ 65 B9 AB D3 E8 ED 57 35 7F 20 FF FE EF 36 BA 4D
##$RELAX= 
##$RELAX= 
##$RELAX= 
##$RELAX= 
##$RELAX= 
##$RELAX= 
##$RELAX= 
$$ Bruker specific parameters
$$ --------------------------
##$DU= <E:\>
##$EXPNO= 20
##$NAME= <AC1582_13IEXT2718_8214273_05kkdScx9Q>
$$ [...]
150 150 150 150 150 150 150 150
##$TP07= 0
##$TPNAME0= <>
##$TPNAME1= <>
##$TPNAME2= <>
##$TPNAME3= <>
##$TPNAME4= <>
##$TPNAME5= <>
##$TPNAME6= <>
##$TPNAME7= <>
##$TPOAL= (0..7)
0.5 0.5 0.5 0.5 0.5 0.5 0.5 0.5
##$TPOFFS= (0..7)
0 0 0 0 0 0 0 0
##$TUNHIN= 0
##$TUNHOUT= 0
##$TUNXOUT= 0
##$USERA1= <user>
##$USERA2= <user>
##$USERA3= <user>
##$USERA4= <user>
##$USERA5= <user>
##$V9= 5
##$VALIST= <valist>
##$VCLIST= <CCCCCCCCCCCCCCC>
##$VD= 0
##$VDLIST= <DDDDDDDDDDDDDDD>
##$VPLIST= <PPPPPPPPPPPPPPP>
##$VTLIST= <TTTTTTTTTTTTTTT>
##$WBST= 2048
##$WBSW= 25
##$XGAIN= (0..3)
0 0 0 0
##$XL= 0
##$YL= 0
##$YMAX_a= 634851
##$YMIN_a= -539159
##$ZGOPTNS= <>
##$ZL1= 120
##$ZL2= 120
##$ZL3= 120
##$ZL4= 120
##$ABSF1= 14.98509
##$ABSF2= -5.573092
##$ABSG= 5
##$ABSL= 3
##$ALPHA= 0
##$AQORDER= 0
##$ASSFAC= 0
##$ASSFACI= 0
##$ASSFACX= 0
##$ASSWID= 0
##$AUNMP= <proc_prof1d_extract_pilot.lims>
##$AXLEFT= 0
##$AXNAME= <>
##$AXNUC= <1H>
##$AXRIGHT= 0
##$AXTYPE= 0
##$AXUNIT= <>
##$AZFE= 0.1
##$AZFW= 0.1
##$BCFW= 0
##$BC_mod= 0
##$BYTORDP= 0
##$COROFFS= 0
##$CY= 15
##$DATMOD= 1
##$DC= 0
##$DFILT= <>
##$DTYPP= 0
##$F1P= 0
##$F2P= 0
##$FCOR= 0.5
##$FTSIZE= 32768
##$FT_mod= 6
##$GAMMA= 0
##$GB= 0
##$INTBC= 1
##$INTSCL= 1
##$ISEN= 128
##$LB= 0
##$LEV0= 0
##$LPBIN= 0
##$MAXI= 10000
##$MC2= 0
##$MEAN= 0
##$ME_mod= 0
##$MI= 0
##$NCOEF= 0
##$NC_proc= -8
##$NLEV= 6
##$NOISF1= 0
##$NOISF2= 0
##$NSP= 0
##$NTH_PI= 0
##$NZP= 0
##$OFFSET= 14.98509
##$PC= 1
##$PHC0= 92.91687
##$PHC1= 0
##$PH_mod= 1
##$PKNL= yes
##$PPARMOD= 0
##$PPDIAG= 0
##$PPIPTYP= 0
##$PPMPNUM= 2147483647
##$PPRESOL= 1
##$PSCAL= 4
##$PSIGN= 0
##$PYNMP= <proc.py>
##$REVERSE= no
##$SF= 400.02
##$SI= 32768
##$SIGF1= 0
##$SIGF2= 0
##$SINO= 400
##$SIOLD= 32768
##$SPECTYP= <>
##$SREGLST= <1H.CDCl3>
##$SSB= 0
##$STSI= 32768
##$STSR= 0
##$SW_p= 8223.68421052631
##$SYMM= 0
##$S_DEV= 0
##$TDeff= 65536
##$TDoff= 0
##$TI= <>
##$TILT= no
##$TM1= 0
##$TM2= 0
##$TOPLEV= 0
##$USERP1= <user>
##$USERP2= <user>
##$USERP3= <user>
##$USERP4= <user>
##$USERP5= <user>
##$WDW= 1
##$XDIM= 32768
##$YMAX_p= 452142384
##$YMIN_p= -783161
##$CURPLOT= <Network HP LaserJet P1505>
##$CURPRIN= <$Network HP LaserJet P1505>
##$DFORMAT= <normdp>
##$LAYOUT= <+/1D_H.xwp>
##$LFORMAT= <normlp>
##$PFORMAT= <normpl>
##$SURQMSG= 1
$$ End of Bruker specific parameters
$$ ---------------------------------
##NTUPLES= NMR SPECTRUM
##VAR_NAME=  FREQUENCY,     SPECTRUM/REAL,   SPECTRUM/IMAG
##SYMBOL=    X,             R,               I
##VAR_TYPE=  INDEPENDENT,   DEPENDENT,       DEPENDENT
##VAR_FORM=  AFFN,          ASDF,            ASDF
##VAR_DIM=   32768,         32768,           32768
##UNITS=     HZ,            ARBITRARY UNITS, ARBITRARY UNITS
##FACTOR=    0.250966925370066, 1,           1
##FIRST=     8223.43324360094, -114653,      -71542
##LAST=      0,             110568,          -124736
##MIN=       0,             -783161,         0
##MAX=       8223.43324360094, 452142384,    0
$$ Real data points
##PAGE= N=1
##DATA TABLE= (X++(R..R)), XYDATA
$$ [...]
$$ plain form
19549 191450 -149239 45350 42390 -86319 286293 -171274 -48858 -70758 -210765 -110374 -29661
19537 -21995 -33147 145465 -84776 163903 367561 159822 27022 164756 -144987 -190391
19527 -190391 -38092 -24687 -348096 126559 -94744 22914 80249 -175668 376093 157241
19516 -17027 -209045 -264946 77114 -263033 -376286 -121094 -474601 75950 14140 -87935 -82124
19505 -82124 -342057 9663 -96305 170567 -4728 -120289 164046 -173101 -432218 -32737 122685
19493 326909 -242961 -98659 -130575 -114126 125139 -243298 -66754 111737 128273 84979 125655
19482 125655 -291539 83040 44421 -423348 69062 8034 -103921 -103904 -181357 -289488 -331440
19471 -331440 88326 262104 35945 659 -65247 289684 -431704 -178175 148985 171213 -68325
$$ packed form
19549A91450a49239D5350k960h6319B86293a71274d8858k1900j40007J00391b9661
19537b1995j1152A45465h4776A63903K03658A59822B7022J37734a44987m5404
19527a90391c8092J3405l23409A26559i4744B2914N7335a75668C76093A57241
19516a7027j92018n5901G7114b63033j13253a21094l53507G5950A4140h7935N811
19505h2124k59933I663i6305A70567d728j15561A64046a73101k59117c2737A22685
19493C26909b42961i8659l1916J6449A25139b43298f6754A11737J6536m3294M0676
19482A25655b91539H3040l8619d23348F9062H034a03921J7p7453j08131m1952
19471c31440H8326J73778C5945F59f5247B89684d31704a78175A48985K2228f8325
$$ plain form
19459 -2125 147840 -257342 -77300 188287 50187 258220 -177427 -65948 -295226 -148140
19449 -148140 -29914 17775 -144835 136467 157327 -148147 -402664 -144565 291884 32327
19438 -151252 190207 -292133 -174119 -316598 138091 -59627 -10418 -317148 71409 -149636
19427 -205321 320362 -212359 -112320 -112619 -93219 -157517 -108700 -144831 -177409 -361197 -197888
19416 -197888 -9575 -129385 -58187 114031 400094 -290578 105607 -244225 -2911 84416 319940
19405 319940 47147 2992 -238259 -302560 423050 -170328 406713 -55543 -1898 40001 214493
19394 214493 69055 -39228 -25989 -120046 197651 78853 -66845 -6332 75456 23443 -342298
19382 -25947 -143927 -138300 -121004 -282815 -221851 -16994 -95875 104796 -124553 -244689 144082
$$ packed form
19459b125A47840b57342g7300A88287E0187K08033a77427f5948k29278J47086
19449a48140b9914A7775a44835A36467K0860a48147k54517a44565B91884C2327
19438a51252A90207b92133J18014j42479A38091e9627a0418l06730G1409a49636
19427b05321C20362b12359J00039k99J9400o4298M8817l6131l2578j83788J63309
19416a97888i575j19810e8187A14031K86063b90578A05607b44225b911H4416K35524
19405C19940D7147B992b38259o4301D23050a70328D06713e5543a898D0001J74492
19394B14493F9055c9228J3239r4057A97651G8853f6845f332G5456B3443c42298
19382b5947j17980N627J7296j61811O0964a6994p8881A04796a24553j20136A44082
$$ plain form
19370 670 -133704 246008 327797 -116180 239219 117965 -185942 -166757 -142392 -728 228589
19358 -235244 -88821 -126520 -84239 -110837 -53104 25369 -153322 -85699 67353 223644 37155
19346 -5340 -2532 -175097 -135429 201815 115340 -95594 -441494 -147709 -207892 12483 54860
19335 54860 -138822 137730 94237 241496 153472 -16238 -105790 -214001 213302 6410 -253218
19323 -134747 -390347 78689 -55663 21951 -135619 146757 -184358 92735 -48595 -272049
19313 -272049 139412 -5268 -35859 4885 171319 -158744 57621 -423454 51592 -248040 -180669
19302 -180669 21035 -55152 54070 172527 113029 34762 -304117 4163 12784 37687 -133263
19290 -65575 -179880 -194250 9167 279143 -223235 41207 9936 291378 51436 -240875 77768
$$ packed form
19370F70a33704B46008Q1789a16180B39219A17965a85942J9185K4365g28B28589
19358b35244h8821l7699M2281k6598e3104B5369a53322O7623F7353J56291C7155
19346e340b532j72565L9668B01815q6475i5594l45900a47709o0183A2483M2377
19335E4860a38822A37730m3493J47259q8024a6238q9552j08211B13302F410b53218
19323a34747k55600G8689e5663B1951a35619A46757a84358I2735d8595k23454
19313b72049A39412e268l0591D885J66434a58744E7621d23454E1592b48040O7371
19302a80669B1035e5152E4070J18457n9498C4762c04117D163Q621K4903a33263
19290f5575j14305j4370I167K69976b23235D1207I936K81442E1436b40875G7768
$$ plain form
19278 -86692 -175083 -400456 187882 49265 14746 2437 98689 82737 -84891 -76160 -141258 122254
19265 -203241 -32921 -296387 -129217 49031 -285538 -141002 -37090 -57303 -99364 87030 -383691
19253 -20418 -185388 -136106 36637 60690 38804 -184099 37492 -45994 -265805 -158290 -118872
19242 -118872 -21390 94209 -124409 166989 -127780 -183625 75301 347114 -47062 219177
19231 -123972 -304507 114944 9829 -282793 -221945 60401 -386966 -255618 -236243 163364
19220 351250 128306 263567 -169771 287028 270821 -36299 16980 158574 -220362 -53492
19209 -123350 80741 -16708 -35910 -22027 -97009 -241258 -374212 47653 107352 -100145 56050
19197 -84837 -211690 -120655 -193967 11442 -46143 213564 -55994 -243784 -314241 131766 -226019
$$ packed form
19278h6692q8391k25373A87882D9265A4746B437R6252j5952h4891Q731o5098A22254
19265b03241c2921k63466a29217D9031b85538a41002c7090k0213m2061H7030c83691
19253b0418j64970M9282C6637K4053k1886a84099C7492d5994k19811J07515L9418
19242a18872b1390I4209a24409A66989a27780n5845G5301K71813d7062B19177
19231a23972j80535A14944I829b82793O0848F0401c86966J31348J9375A63364
19220C51250A28306J35261a69771B87028j6207c6299A6980J41594b20362e3492
19209a23350H0741a6708j9202J3883p4982j44249j32954D7653N9699a00145E6050
19197h4837j26853R1035p3312A1442d6143B13564e5994j87790p0457A31766b26019
$$ plain form
19185 -55299 26942 -177410 -158967 -196425 3245 59791 -19801 -77376 -243870 -231429 -411273
19174 -411273 -152934 -387574 14247 46393 -96468 -94994 -310255 -291763 -193456 -270714 -5568
19162 -167406 316302 103479 229292 -106648 284082 131897 -97744 47556 1914 -316780
19151 -47673 -187431 -102612 -170645 21751 -473926 -28637 -129315 343 -24366 -40883 -286940
19140 -286940 -145517 129644 -180510 -228148 755 -101768 -129198 126998 27852 27256 -151207
19128 -348336 10839 -166717 -53058 184305 -16128 -83086 87086 63351 -233779 -143847 12199
19116 -95642 -105579 -191224 18478 -137388 300652 259193 -497203 205594 174263 -144616 -549298
19105 -549298 -131996 24501 -100023 -99562 -290774 -156127 -345229 -55937 63936 74809 321600
$$ packed form
19185e5299B6942a77410J8443l7458C245N6546a9801n7575j66494J2441j79844
19174d11273a52934k34640A4247L2146i6468J474k15261J8492R8307p7258e568
19162a67406C16302A03479J25813a06648B84082A31897i7744D7556A914c16780
19151d7673j39758Q4819o8033B1751d73926b8637j00678C43b4366j6517k46057
19140b86940J41423A29644a80510m7638G55a01768k7430A26998B7852n96a51207
19128c48336A0839a66717e3058A84305a6128o6958H7086k3735b33779Q9932A2199
19116i5642r937q5645A8478a37388C00652m1459d97203B05594l1331a44616m04682
19105e49298a31996B4501a00023M61j91212J34647j89102e5937F3936J0873K46791
$$ plain form
19094 321600 -147545 -136873 -169465 -77128 -115156 -55807 -25283 -75157 448076 -318987 75059
19082 -109902 44036 -86335 -116224 36115 -79102 150899 226945 -31366 -230163 42193 -209650
19070 -195868 210062 -236033 -122072 44963 60460 -267771 -201874 -128025 227090 -209778
19059 52298 -84872 110026 -98094 -173438 -93251 1494 159169 99136 -149378 -161685 -96136
19048 -96136 -16496 -73787 -87766 -31174 10378 -50189 -155570 70321 51513 -45198 80412
19036 58457 -116747 126011 148759 -230707 -236841 -276895 -189657 -2716 -125279 112119 -242648
19024 -67846 -294682 -68751 141801 -42611 233661 -43586 -37268 -17614 37800 -153159 -122907
19013 -122907 -97686 -159242 -91468 -267619 71627 12799 -81235 -136912 -142395 93389 88062 -389158
$$ packed form
19094C21600a47545J0672l2592g7128l8028e5807b5283m9874D48076c18987G5059
19082a09902D4036h6335k9889C6115g9102A50899P6046c1366j98797D2193b09650
19070a95868B10062b36033J13961D4963J5497b67771O5897P3849B27090b09778
19059E2298h4872A10026i8094p5344Q0187A494J57675o0033a49378j2307O5549
19048i6136a6496n7291j3979c1174A0378e0189j05381G0321j8808d5198H0412
19036E8457a16747A26011K2748b30707o134m0054Q7238b716j22563A12119b42648
19024f7846k26836f8751A41801d2611B33661d3586O318a7614C7800a53159L0252
19013a22907K5221o1556O7774j76151G1627A2799h1235n5677n483I3389n327c89158
$$ plain form
19000 120566 38796 9935 -227332 111616 85879 -219056 -48191 7584 -286672 -164050 -8595
18988 -292363 -87753 75083 -335846 -1707 186433 211598 302193 -106254 -141644 -97278 332046
18976 147284 -269962 53328 -135238 40667 -271847 49970 374591 -421187 245105 98860
18965 52422 -37788 171590 45241 -195397 -67036 -130002 -5566 -72175 -87165 -3243 -36461 -165199
18953 -165199 27439 -173167 97523 10795 -253290 89681 83533 11065 24893 -178574 -229863
18942 -229863 108440 -89868 -160159 -142743 -23671 -56782 -210299 -22650 66937 -90956 -230587
18931 -230587 62727 10376 -171784 155065 15205 23769 29242 -112202 -550949 21413 15690
18920 15690 75663 -290515 -63536 -207625 81636 -219307 -7629 94242 -9789 233885 12989
$$ packed form
19000A20566C8796I935b27332A11616k5737b19056d8191G584b86672J22622h595
18988b92363h7753G5083c35846a707A86433K5165R0595a06254l5390M4366C32046
18976A47284b69962E3328a35238D0667b71847D9970L24621d21187B45105I8860
18965E2422c7788A71590D5241a95397f7036o2966e566o6609j4990c243l3218j28738
18953a65199B7439a73167I7523A0795b53290H9681o148A1065J3828a78574n1289
18942b29863A08440h9868p0291J7416b3671l3111j53517b2650F6937i0956j39631
18931b30587F2727A0376a71784A55065A5205Q564N473a12202m38747B1413n723
18920A5690N9973b90515f3536j44089H1636b19307g629I4242i789B33885A2989
$$ plain form
18908 281748 -297321 81096 216356 -76514 -153368 -157394 -41751 -276252 -572587 -195422 -28206
18896 -208416 70746 213322 203204 -377478 -293539 43750 218384 194428 56551 87250 45533
18885 45533 -107623 -116601 218275 27578 -159272 -189815 -31868 -65351 -80420 -223868 104902
18873 111121 135120 -52005 -251364 -89758 142571 -447840 170608 210858 -88197 -30312 -185062
18862 -185062 -85822 58206 10050 -5157 -280850 -119918 -119928 -17592 -10799 117582 47976 61577
18850 61577 -334862 -106834 -170337 -106219 -16103 -10608 -147475 -72105 -311064 -59067 -33547
18839 -33547 -56164 -177590 138222 28778 -262879 191212 -61946 -34645 -33593 -175170 -308874
18828 -308874 -69677 -167340 64471 -108152 123566 108265 -132324 -101630 72406 286353 -137981
$$ packed form
18908B81748b97321H1096J35260g6514p6854m026d1751k34501k96335a95422b8206
18896b08416G0746J42576j0118c77478Q3939D3750J74634k3956E6551L0699m1717
18885D5533a07623q978B18275B7578a59272l0543c1868l3483j5069j43448A04902
18873A11121K3999e2005j99359h9758A42571d47840A70608M0250h8197c0312j54750
18862a85062h5822E8206A0050e157k75693a19918j0a7592O793A17582D7976J3601
18850F1577c34862a06834o3503O4118a6103N495j36867g2105k38959e9067K5520
18839c3547k2617j21426A38222B8778b62879A91212f1946K7301J052j41577j33704
18828c08874f9677r7663F4471a08152A23566j5301a32324L0694G2406K13947a37981
$$ plain form
18816 107472 100233 34461 -48779 117294 103906 -151284 302180 -164191 -94476 -52732 90129
18804 177298 127355 5505 -210859 -23914 28933 -241208 271095 42848 -202841 -68848 -158170
18793 -158170 -141683 82443 68106 -39882 -155472 -237965 73629 82676 -271254 -244297 -322061
18782 -322061 -240698 -62767 28234 -226113 -259685 -382383 258825 -121337 -39698 -250193
18772 -250193 47356 44203 -62105 -68749 -49513 89024 11996 -562150 273238 235842 -123042
18760 226376 -160737 6252 -169645 -86752 -34299 -590006 -294438 -70885 -80148 -93705 132972
18748 -187720 132219 240576 55079 -223815 44520 334200 -204267 101365 -405228 -149787
18737 67077 -30879 -194059 -28809 -50322 -176918 104962 268857 -210614 42850 -81543 -56407
$$ packed form
18816A07472p239C4461d8779A17294j3388a51284C02180a64191O9715M1744I0129
18804A77298m9943E505b10859b3914B8933b41208B71095D2848b02841f8848q9322
18793a58170J6487H2443j4337c9882j15590q2493G3629R047b71254K6957p7764
18782c22061Q1363f2767B8234b26113l3572j22698B58825a21337c9698k10495
18772b50193D7356l153f2105o644J9236H9024A1996e62150B73238l7396a23042
18760B26376a60737F252a69645Q2893c4299n55707b94438g0885r263j3557A32972
18748a87720A32219J08357E5079b23815D4520K89680b04267A01365d05228a49787
18737F7077c0879j63180b8809k1513j26596A04962J63895b10614D2850h1543K5136
$$ plain form
18726 -56407 140928 -13236 -198654 -90906 -15313 -39575 114496 44654 -108078 580 120251
18715 120251 -180650 -110803 -390407 -164499 67228 94385 -57444 -40529 -240884 -107211
18704 154311 -237545 -514388 -483463 364867 -143750 -124200 -57713 -111926 36012 43710 -147651
18692 -48302 -92937 -140541 125770 -30687 172147 371053 58992 72727 54656 26348 126441
18681 126441 -129805 -22168 -45285 -120549 -34068 69232 -67390 -237182 -175360 -545453 -7698
18669 144741 -8001 -266302 -99099 277430 186907 -97141 83973 154170 -155518 47101 -273792
18657 -158313 127384 -173438 -39196 -274438 -159104 -300579 109399 -102970 -146885 -263846
18647 -263846 -35692 -113058 193242 -224594 92021 117739 9194 11624 183766 -293380 210453
$$ packed form
18726e6407A40928a3236j85418i0906a5313k4262A14496D4654a08078E80J19671
18715A20251a80650O9847k79604a64499F7228K7157e7444J6915k00355a07211
18704A54311b37545k76843L0925C64867a43750J9550e7713n4213C6012P698a47651
18692d8302m4635m7604A25770c0687A72147J98906E8992J3735j8071B6348J00093
18681A26441a29805b2168k3117p5264c4068F9232f7390j69792O1822l70093g698
18669A44741h001k58301i9099B77430r0523i7141H3973P0197a55518D7101b73792
18657a58313A27384a73438c9196k35242J15334j41475A09399a02970m3915j16961
18647b63846c5692p7366A93242b24594I2021K5718I194K430J72142b93380B10453
$$ plain form
18635 37136 -131310 -11390 55182 -151357 -73033 -10657 237757 -292750 -67663 79171 93579
18624 93579 12326 -186445 -44040 -218034 -140761 5184 -225863 164146 -260097 -245171 48149
18612 -29504 219342 -40536 74462 -88149 8403 -35304 -133034 -342913 302294 -142375 174611
18600 -29110 94363 -119643 -147415 289809 -15671 -294957 -196423 122576 -130397 -131832 59833
18588 42795 -259423 -181537 -174347 194953 -28539 -244145 60252 -41885 -199466 -75654 41794
18576 -90738 389812 -300120 84299 -106694 188197 -335609 300026 49747 23097 -119830
18565 24811 -96901 68543 19670 -1756 134796 294305 -48150 105771 -30493 -474376 166214
18553 395486 73156 -281161 -148262 -165626 -135752 -182134 -8074 -151707 -220159 -167797 -422728
$$ packed form
18635C7136a31310a1390E5182a51357g3033a0657B37757b92750f7663G9171J4408
18624I3579A2326a86445d4040j73994P7273E184b25863A64146b60097J4926D8149
18612b9504B19342d0536G4462h8149H403c5304r7730k09879C02294a42375A74611
18600b9110I4363a19643k7772B89809a5671k79286R8534A22576a30397j435E9833
18588D2795b59423P7886P190A94953b8539k15606F0252d1885j57581g5654D1794
18576i0738C89812c00120H4299a06694A88197c35609C00026D9747B3097a19830
18565B4811i6901F8543A9670a756A34796J59509d8150A05771c0493m43883A66214
18553C95486G3156b81161J32899j7364K9874m6382h074j43633o8452N2362k54931
$$ plain form
18542 -422728 -55883 194240 -271816 -170328 -133210 -258622 193282 -331940 104457 -3205
18531 -36034 -64657 -149896 -121197 -197909 -256653 -85983 -69490 -514566 114137 76924 39967
18520 39967 -21876 -141368 90319 75064 98671 423797 6293 -200251 -128252 174707 -277445
18508 -154830 -212943 -37783 -14408 -216613 -86043 182397 -368296 180513 -139884 -321784
18498 -321784 -99469 -393015 -183738 48085 34021 64993 -19193 -191427 118833 -27030 -31860
18487 -31860 -25052 -105510 -39358 -278703 210225 -58970 267754 128748 -20686 127186 11255
18475 143707 -204720 -91796 285829 286037 63559 -132155 90993 -138893 -184417 204068 -482881
18463 176775 272563 -22387 -328188 70700 -124978 31832 119015 -467682 -228103 -114303
$$ packed form
18542d22728e5883A94240b71816J01488L7118j25412A93282c31940A04457c205
18531c6034k8623q5239K8699p6712n8744h5983J6493m45076A14137l7213l6957
18520C9967b1876j19492I0319j5255K3607L25126F293b00251P1999A74707b77445
18508a54830n8113c7783a4408k02205h6043A82397c68296A80513a39884j81900
18498c21784i9469k93546a83738D8085j4064L0972a9193j72234A18833b7030m830
18487c1860O808q0458c9358k39345B10225e8970B67754A28748b0686A27186A1255
18475A43707b04720i1796B85829K08F3559a32155I0993a38893m5524B04068d82881
18463A76775R5788b2387l05801G0700a24978C1832Q7183d67682b28103J13800
$$ plain form
18453 -114303 -233778 -66612 22728 -67803 -2776 23212 -116518 -154726 188221 84807 49722
18442 49722 99217 -108425 -134857 -101924 299067 33448 -78854 -161163 29402 -58892 -218049
18431 -218049 -242331 82084 -491525 -46052 169749 -227797 221008 72430 -115099 56707
18420 249939 -258154 58008 61269 11815 -145340 -78630 113372 -350172 -95122 -22791 67293
18408 165178 131264 49525 87271 151783 -71766 -68143 -198770 -211985 -53074 302460 195363
18397 195363 124671 -34518 -148511 168376 66910 -128521 -20830 355298 210936 -91483
18386 -124494 133779 -67947 -476066 -174930 185843 82904 -96240 -99757 49898 -228760 254099
18374 154888 -144346 -182749 -26032 -424005 121732 -132066 -91027 -125065 13146 -159294
$$ packed form
18453a14303j19475f6612B2728f7803b776B3212a16518l8208A88221H4807l5085
18442D9722M9495a08425k6432L2933B99067C3448g8854q2309B9402e8892j59157
18431b18049k4282H2084d91525d6052A69749b27797B21008G2430a15099E6707
18420B49939b58154E8008L261A1815a45340O6710A13372c50172i5122b2791F7293
18408A65178l3914D9525L7746O4512g1766L623j30627j3215e3074C02460j07097
18397A95363p0692c4518j13993A68376F6910a28521b0830C55298j44362i1483
18386a24494A33779f7947m08119a74930A85843H2904i6240l517D9898b28760B54099
18374A54888a44346l8403b6032l97973A21732a32066M1039l4038A3146a59294
$$ plain form
18363 -77360 -65243 -72550 -156460 -19924 -21516 78505 106635 -73426 -380893 -3203 146590 -14638
18350 44311 71655 -15732 -67484 -174418 -52426 219479 -219386 88612 203699 -228031 168039
18338 -236568 -134423 -204443 150418 17727 -140534 -148603 -172270 22369 55478 -158881 -103017
18327 -103017 -193189 89190 -125233 -58333 -243101 -86526 3861 -199652 -206125 -8382 41131
18315 -40936 -108000 -77872 -128385 -264931 147724 105525 -235122 -71533 97801 -288406 84820
18303 -119168 110498 -79424 181778 194885 -94780 -291132 -472158 -36252 -140839 -3083 173382
18291 -35902 111754 -61186 -47090 -53064 -340900 -107252 66558 161635 25497 202506 330929
18280 330929 -362543 -343601 344257 -106985 -54114 -27431 -80932 38585 -185965 21242 -122246
$$ packed form
18363g7360J2117p307q3910a9924j592G8505K8130g3426l07467c203A46590a4638
18350D4311K7344a5732n1752j06934e2426B19479b19386H8612J15087b28031A68039
18338b36568J02145p0020A50418A7727a40534q069k3667B2369L3109a58881N5864
18327a03017r0172H9190a25233e8333j84768h6526C861a99652o473h382D1131
18315d0936o7064L0128n0513j36546A47724m2199b35122g1533I7801b88406H4820
18303a19168A10498g9424A81778J3107i4780j96352j81026c6252j04587c083A73382
18291c5902A11754f1186J4096n974k87836a07252F6558R5077B5497J77009J28423
18280C30929c62543J8942C44257a06985N2871K6683n3501C8585a85965B1242a22246
$$ plain form
18268 -363524 263486 10832 -54653 197050 -344784 -349208 184323 -7983 -34333 224993 -174211
18256 -456591 -476094 107386 57304 119119 -62178 300374 -227717 -222421 142466 71829 -52181
18244 -95455 -202477 -117658 -65822 -13088 74294 -133270 -222819 72266 -256080 -81460 -94505
18233 -94505 -17623 -267928 251074 -61164 208080 -132724 -229662 167294 -266060 -35940
18222 68555 -121295 -391713 -57754 -212179 -298393 -308629 -95751 -395558 -192994 -253075 14914
18210 -171670 236041 26108 -31191 -41902 -163101 -360551 -185131 338441 99840 -270684
18199 99871 -203335 -171417 29885 -95742 -93866 124375 980 17472 -361928 287890 232707
18188 232707 -3462 67616 66765 -198532 39212 -52549 80411 121236 -356436 -227726 62726
$$ packed form
18268c63524B63486A0832e4653A97050c44784m424A84323g983k6350B24993a74211
18256d56591j9503A07386n0082O1815f2178C00374b27717N296A42466p0637e2181
18244i5455j07022Q4819N1836a3088G4294a33270q9549G2266b56080h1460j3045
18233i4505a7623k50305B51074f1164B08080a32724r6938A67294b66060c5940
18222F8555a21295k70418e7754j54425q6214j0236i5751k99807a92994o0081A4914
18210a71670B36041B6108c1191j0711j21199j97450J75420C38441I9840b70684
18199I9871b03335L1918B9885i5742J876A24375I80J6492c61928B87890n5183
18188B32707c462F7616q51a98532C9212e2549H0411M0825c56436J28710F2726
$$ plain form
18176 89138 158997 -103563 6340 -8990 -181285 -276161 -353007 105558 164310 40579 -355664
18164 -23766 -173881 -148371 -127651 17245 -28734 -25040 187839 -335449 -34557 152292 -186133
18152 -177737 18729 -96800 168562 191232 -22156 -292185 135885 -61333 -214619 38216 14901
18140 54580 -205054 -29136 -108712 62018 -610632 92794 256417 -231253 -182360 -52950 50340
18128 33931 -21856 302047 -340489 -157209 13951 -68964 12716 -1013 -246342 4571 193668
18117 193668 383083 212647 111877 17965 -153260 112833 -24396 -288194 -236442 -59531
18106 -35294 120897 113285 48211 -250533 -361011 132780 27430 -314802 347890 106152
18095 64820 -49120 -32170 -190005 284687 52768 -8495 -44543 -85513 -110465 220623 231231
$$ packed form
18176H9138O9859a03563F340h990j72295r4876p6846A05558N8752D0579c55664
18164b3766j50115K5510K0720A7245b8734L694A87839c35449c4557A52292a86133
18152a77737A8729i6800A68562K2670b2156k70029A35885f1333j53286C8216A4901
18140E4580b05054b9136p9576F2018f10632I2794J63623b31253M8893e2950E0340
18128C3931b1856C02047c40489a57209A3951f8964A2716a013k45329D571J89097
18117A93668J89415j70436j00770A7965a53260A12833b4396k63798N1752e9531
18106c5294A20897p612D8211b50533j10478A32780B7430c14802C47890A06152
18095F4820d9120J6950j57835B84687E2768h495l6048m0970k4952B20623J0608
$$ plain form
18084 231231 -184925 39831 303532 -185197 24545 -58745 -231781 -89725 433497 85622
18073 213614 95861 292560 -91335 13044 -89212 114280 -140733 36016 -123665 72983 26701
18061 -271754 49206 -324254 142027 -40964 -165543 -4073 159607 -132663 -164624 -11872 -106839
18050 -106839 79567 29790 -15664 -86739 -230350 -288943 -81896 81577 228070 -9592 179995
18038 186548 158652 -55851 -370564 -67312 -194187 -246246 335686 85363 -4251 175245 88223
18027 88223 -75460 -6673 -72082 -336172 -86010 -131198 -158527 -179419 -116947 144405 -279034
18015 39278 64098 251861 16758 -8278 179197 144533 45323 33783 -262646 287050 241690
18004 241690 163719 -75418 -10063 -8428 11021 -308976 -52609 78113 -291019 -67079 -116013
$$ packed form
18084B31231a84925C9831K63701a85197B4545e8745j73036h9725D33497H5622
18073B13614I5861J96699i1335A3044h9212A14280a40733C6016a23665G2983B6701
18061b71754D9206c24254A42027d0964j24579d073A59607a32663l1961a1872r4967
18050a06839G9567B9790a5664p1075j43611n8593h1896H1577J46493i592A79995
18038A86548k7896e5851l14713f7312j26875n2059C35686H5363d251A75245q7022
18027H8223g5460f673o5409k64090h6010m5188k7329k0892O2472A44405b79034
18015C9278K4820J87763A6758h278A79197l4664D5323j1540b62646B87050m5360
18004B41690p7971g5418a0063J635A1021c08976e2609G8113b91019f7079m8934
$$ plain form
17993 -116013 130761 -194763 -31575 -12996 -204692 394518 -90083 71776 -140258 -15603
17982 214195 359098 7222 129626 -82077 -36644 -59750 181429 -57290 119031 -161537 -10440
17970 72063 28095 82326 201455 -101074 -176082 -36700 92292 -8294 138542 -161410 -48866
17958 344683 -159614 1875 -209726 -240780 110558 -41865 -154331 -123449 -181829 65598 267199
17947 267199 140212 39791 139360 169013 -152838 85525 -4957 -226872 -381130 -129268 -234734
17936 -234734 -270676 -123614 49775 -65140 59115 86620 23979 -115017 -60131 -99602 234444
17924 -15266 -100297 159105 -206706 -100882 15883 29318 -57527 137530 209899 -11689 56757
17912 361535 -92651 -29252 -94448 73560 -373480 70767 35981 177210 217873 56810 -88480
$$ packed form
17993a16013A30761a94763c1575a2996j91696C94518i0083G1776a40258a5603
17982B14195J44903G222J22404h2077c6644k3106A81429e7290A19031a61537a0440
17970G2063B8095N4231J19129a01074p5008c6700I2292h294A38542a61410d8866
17958C44683a59614A875b09726l1054A10558d1865j12466L0882n8380F5598K01601
17947B67199j26987C9791R9569K9653a52838H5525d957k21915j54258a29268j05466
17936b34734l5942a23614D9775f5140E9115K7505B3979a15017N4886l9471B34444
17924a5266q5031A59105b06706a00882A5883J3435e7527A37530P2369a1689E6757
17912C61535i2651b9252o5196G3560c73480G0767l4786J41229M0663E6810h8480
$$ plain form
17900 151876 -192529 -344403 -187536 199626 111824 -262004 40694 -335476 211781 117440
17890 117440 -238670 221756 88626 -143861 177485 103535 94268 -232671 11250 87971 215493
17879 215493 -74903 -226671 -178260 291827 -71344 340471 -9362 17306 19945 -67705 -73949
17868 -73949 140870 4739 -111542 30033 145769 -164946 -2683 102754 -92212 -357254 -40014
17856 82912 39737 33046 90599 518886 189692 -24331 254644 -128915 108626 -106419 356218
17844 25747 59684 -102696 -200862 277662 180560 -130771 15380 28178 -226394 173064 31748
17832 -68024 99155 -130282 160702 -83278 -104724 38431 -11353 96410 -230110 95208 -210907
17820 126791 -278067 -19100 -149369 1124 52163 20034 -133464 81231 -180557 -88691 61714
$$ packed form
17900A51876a92529j51874J56867A99626q7802b62004D0694c35476B11781r4341
17890A17440b38670B21756H8626a43861A77485p3950r267b32671A1250P6721J27522
17879B15493g4903j51768M8411B91827g1344C40471i362A7306K639f7705o244
17868g3949A40870D739a11542C0033J15736a64946b683A02754i2212k65042d0014
17856H2912C9737o691N7553M28287A89692b4331B54644a28915A08626a06419C56218
17844B5747L3937a02696r8166B77662r7102a30771A5380J2798b26394A73064C1748
17832f8024I9155a30282A60702h3278k1446C8431a1353I6410b30110I5208b10907
17820A26791b78067a9100j30269A124N1039B0034a33464H1231a80557h8691F1714
$$ plain form
17808 -13148 29287 -270556 166214 -242363 111700 -76593 58914 -62428 226513 -306883
17797 -179150 -52546 -29856 42553 436247 -182116 157314 26996 -75758 239230 -218376
17786 260971 -126325 322567 380861 -458831 -49468 56442 -194386 144286 24758 42491
17776 42491 251116 98830 160990 -69262 159160 131766 -152833 8829 -129987 13933 -5108
17764 65052 -6833 -27305 -280071 485314 -64844 123329 199185 -19054 -70795 -191329 -92029
17752 7463 176780 -20900 25105 -291918 -3211 -35600 215601 -145073 183425 49316 -233280
17740 235171 -110555 238284 312287 354155 -106763 14747 11544 -231273 373603 -271297
17729 -223131 30230 -111430 118527 -74414 -51084 -27395 60306 66200 31151 -272183 -300908
$$ packed form
17808a3148B9287b70556A66214b42363A11700g6593E8914f2428B26513c06883
17797a79150e2546K2690D2553L93694a82116A57314B6996g5758B39230b18376
17786B60971a26325C22567N8294d58831d9468E6442a94386A44286B4758J7733
17776D2491K08625I8830O2160f9262A59160k7394a52833H829a29987A3933e108
17764F5052f833k0472k52766D85314f4844A23329P5856a9054n1741j20534i2029
17752G463J69317b0900B5105b91918c211l2389B15601a45073A83425D9316b33280
17740B35171a10555B38284P4003M1868a06763A4747l203b31273C73603b71297
17729b23131C0230a11430A18527g4414K3330K3689F0306N894C1151b72183k8725
$$ plain form
17718 -300908 2306 -189405 -99107 189527 90308 292569 225391 -28938 151990 -21860 -152293
17707 -152293 178844 113936 -208429 327425 331795 59911 -100705 11712 182315 -35717 117477
17695 243185 175142 -39817 143737 159390 192208 277563 155453 -50041 19710 307281 2222
17683 69716 106138 80997 18588 174374 178315 -55697 12847 -43933 -192841 -2960 -74883 -219889
17671 -219889 233688 -234418 31244 264003 45307 34782 -28540 -69465 -90955 -274592 -31914
17659 -249098 83653 114826 430481 -154673 -227425 136070 -106171 223157 4013 241166
17649 241166 -5754 59396 -328412 147129 359127 83792 173341 329707 -84061 -214250 -423946
17638 -423946 3798 17470 123509 -72398 32415 2503 -128566 71884 78887 147154 -239720
$$ packed form
17718c00908B306a89405R0298A89527I0308K02261o7178b8938A51990b1860j30433
17707a52293A78844o4908b08429C27425M370E9911a00705A1712J70603c5717A17477
17695B43185o8043c9817A43737J5653L2818Q5355j22110e0041A9710K87571B222
17683F9716L6422k5141A8588J55786L941e5697A2847d3933j48908b960p1923j45006
17671b19889B33688b34418C1244K32759D5307j0525b8540m0925k1490j83637c1914
17659b49098H3653L1173L15655a54673p2752A36070a06171B23157D013K37153
17649B41166e754E9396c28412A47129K11998H3792Q9549J56366h4061j30189k09696
17638d23946C798J3672J06039g2398C2415B503a28566G1884P003O8267b39720
$$ plain form
17626 83761 120139 157535 -60331 -96804 -304014 -308012 -217611 16160 252790 123350 85374
17615 85374 -37403 -87621 -3158 -77879 -55398 -210545 -140098 16643 218991 257894 148719
17604 148719 -30637 -10378 226668 6871 132437 109784 107447 -179584 133449 -118327 -157719
17593 -157719 -119006 240097 241158 75068 -255062 -89906 36117 129768 -240426 23567 -50471
17581 174298 -162150 -359635 159120 255264 35169 526326 -128626 -16415 -15916 314369 -14292
17569 -68598 229819 -280284 279786 121027 76435 -49359 -154440 -65672 15901 149832
17559 149832 -13346 387447 263542 21186 -90683 -239320 11175 -152067 42414 221520
17549 221520 732 46398 222243 10859 230822 94103 389676 289710 -113519 -87929 -60224
$$ packed form
17626H3761L6378L7396f0331l6473k07210l998R0401A6160K36630A23350l7976
17615H5374c7403n0218c158p4721K2481j55147P0447A6643K02348L8903j09175
17604A48719c0637a0378B26668F871J25566k2653k337a79584A33449a18327l9392
17593a57719L8713B40097J061G5068b55062h9906C6117R3651b40426B3567e0471
17581A74298a62150j97485A59120R6144C5169M91157a28626a6415M99C14369a4292
17569f8598B29819b80284B79786A21027m4592d9359j05081f5672A5901J33931
17559A49832a3346C87447j23905B1186i0683j48637A1175a52067D2414J79106
17549B21520G32M5666J75845A0859K19963I4103K95573r9966a13519K5590K7705
$$ plain form
17538 -60224 -109749 262382 -73590 15689 1929 10494 144644 92983 34009 -44459 -69271 210753
17525 290105 116181 321134 -54238 69280 302671 285860 -49734 248089 219848 142003 136682
17514 136682 -112376 240194 -11762 369124 -85407 -185663 -250760 34903 209891 196424
17504 196424 -79804 165604 -38538 -105500 233896 26961 41914 136434 261623 161904 180054
17493 180054 177740 172283 175018 22070 9295 8435 -134250 189063 342416 109750 -87977 250338
17480 274257 431151 147319 -244881 9067 83647 52395 337710 6846 81411 278935 79354
17468 232549 238631 -46190 87556 100705 63366 8756 -31139 444134 -285100 29540 -99704
17456 63709 577528 -80142 -115521 290306 320404 390662 432895 273913 130394 124030 398432
$$ packed form
17538f0224m9525B62382g3590A5689A929Q565J34150n1661C4009d4459k4812B10753
17525B90105A16181K04953e4238F9280K33391j6811d9734B48089k8241p7845n321
17514A36682a12376B40194a1762C69124h5407j00256o5097C4903J74988j3467
17504A96424g9804A65604c8538o6962B33896B6961J4953R4520J25189r9719J8150
17493A80054k314n457K735B2070I295q60a34250A89063J53353A09750h7977B50338
17480B74257J56894A47319b44881I067P4580l1252K85315F846P4565J97524G9354
17468B32549O082d6190H7556J3149l7339H756c1139D44134b85100B9540i9704
17456F3709N13819h0142l5379B90306L0098P0258M2233j58982A30394o364K74402
$$ plain form
17445 398432 350472 270932 203945 -203563 -11463 236359 281544 20232 364640 300700 27964
17433 108711 334965 62609 85979 103906 420035 -23292 -16159 141753 165821 286728 307192
17422 307192 216358 304474 141904 234175 360614 199468 257772 485122 483774 -15461 9159
17410 -76945 -44768 339478 110096 -81810 125375 123409 325725 442634 150797 138822 182187
17399 182187 410942 181894 66794 223959 141780 54129 -85824 150895 131142 -12334 402048
17387 -81933 187760 183848 262471 168275 362052 152407 125940 241152 -22011 107978 20775
17375 316851 305054 298597 -42743 253866 217399 163653 296823 40936 47215 -120745 -161052
17364 -161052 -41579 378883 106840 202331 219529 224601 54463 -56178 333147 -6332 -64235
$$ packed form
17445C98432m7960p9540o6987b03563a1463B36359M5185B0232L44408o3940B7964
17433A08711K26254F2609K3370J7927L16129b3292P133A41753K4068J20907K0464
17422C07192r0834Q8116A41904R2271J26439j61146N8304K27350j348a5461I159
17410g6945L2177C39478A10096h1810A25375j966K02316J16909A50797j1975M3365
17399A82187K28755A81894F6794J57165q2179E4129h5824A50895j9753a2334D02048
17387h1933A87760l912P8623r4196J93777A52407k6467J15212b2011A07978B0775
17375C16851j1797o457d2743B53866l6467n3746J33170D0936O279a20745m0307
17364a61052d1579C78883A06840R5491J7198N072E4463e6178C33147f332n7903
$$ plain form
17353 -64235 139704 205426 447468 140274 357493 166053 398608 293852 58680 184756
17343 184756 14115 181291 15570 -31742 274714 358022 -141022 196209 -136756 323197
17332 115571 186935 109528 77139 484124 163549 84370 -161397 80901 232337 227886 531624
17321 531624 143523 126004 117020 13047 340624 292045 149882 73710 -155494 472813 359425
17310 359425 113173 212316 -43532 -193231 173271 357437 445687 316958 -77091 76626
17299 228249 21459 181565 371480 176801 112578 117863 119772 371007 359053 518836 -28591
17287 194168 337520 -118276 8019 36465 219653 -133915 -63027 325554 165157 20746
17276 278037 243075 113330 80651 344648 205436 52073 12289 18134 -129947 -60686 -142280
$$ packed form
17353f4235A39704O5722K42042A40274K17219A66053K32555j04756E8680J26076
17343A84756A4115J67176A5570c1742B74714Q3308a41022A96209a36756C23197
17332A15571P1364p7407l2389M06985A63549p9179a61397H0901J51436m451L03738
17321E31624A43523j7519q984A3047L27577m8579j42163G3710a55494D72813j13388
17310C59425A13173R9143d3532j49699A73271J84166Q8250j28729g7091G6626
17299B28249B1459J60106J89915A76801o4223N285J909K51235j1954J59783b8591
17287A94168J43352a18276H019K8446J83188a33915f3027C25554j60397B0746
17276B78037l4962A13330l2679K63997j39212E2073A2289N845a29947f0686q1594
$$ plain form
17265 -142280 217577 334706 23436 240357 215692 4117 221794 230015 139709 479173 127220
17253 49635 236323 217109 390636 362875 436166 52496 -196214 308808 -42717 157537 178880
17242 178880 40831 355639 179873 90635 203052 -60003 150891 -23976 39859 -43042 -81448
17231 -81448 353677 96026 357917 100084 166388 104051 96902 -67093 441068 -128070 254377
17219 309822 139980 231341 78730 138025 551622 175940 149522 205246 105470 263037 281216
17208 281216 386156 -49368 265140 338322 -5971 425932 472914 201208 38272 395153 3870
17196 330156 220710 407699 103116 275381 410328 553271 44013 454057 367112 585342
17186 585342 437519 136230 -63891 280730 286124 236697 293848 278417 139139 106068 352467
$$ packed form
17265a42280B17577J17129B3436K16921k4665D117K17677Q221r0306L39464A27220
17253D9635J86688j9214J73527k7761P3291E2496a96214C08808d2717A57537K1343
17242A78880D0831L14808j75766q9238J12417f0003A50891b3976C9859d3042l8406
17231h1448C53677I6026K61891A00084O6304o2337p149f7093D41068a28070B54377
17219C09822A39980R1361G8730N9295M13597A75940k6418N5724r9776J57567J8179
17208B81216J04940d9368B65140P3182e971D25932M6982B01208C8272L56881C870
17196C30156j09446J86989A03116J72265J34947J42943D4013M10044q6945K18230
17186E85342j47823A36230f3891B80730N394m9427N7151j5431A39139l3071K46399
$$ plain form
17175 352467 487204 514317 161447 557196 651248 268479 362711 352897 477923 466706 211153
17163 110285 463200 191497 177812 431160 299579 179549 186002 -413 210142 197138 89101
17151 493615 575320 148539 247099 397781 -138687 112181 305511 425465 380038 -98675
17140 104141 49765 406378 546371 199891 432953 406417 130175 215660 563588 276136
17129 393348 428293 73362 237475 275529 625933 569591 315025 119826 240597 83172
17118 -154377 214926 198513 408589 614330 -8168 263614 274799 309594 607733 730824
17108 730824 402564 287340 345116 308694 459935 180138 409713 277261 207855 408232
17098 408232 369286 583322 458876 413536 220434 166356 185916 288901 442114 635124
$$ packed form
17175C52467J34737K7113A61447L95749R4052B68479R4232r814J25026j1217B11153
17163A10285L52915A91497j3685K53348j31581j20030O453d13B10142j3004H9101
17151D93615Q1705A48539R8560J50682a38687A12181J93330J19954m5427i8675
17140A04141D9765L56613J39993A99891K33062k6536A30175Q5485L47928B76136
17129C93348L4945G3362J64113L8054L50404n6342k54566A19826J20771H3172
17118a54377B14926j6413K10076K05741h168B63614J1185L4795K98139J23091
17108G30824l28260j15224N7776l6422J51241A80138K29575j32452o9406K00377
17098D08232l8946K14036j24446m5340j93102n4078J9560J02985J53213J93010
$$ plain form
17088 635124 199525 473165 426457 885970 240646 383715 511833 326475 524281 473301
17078 473301 265725 220917 309810 190897 241535 458900 619107 550281 287533 459408
17068 459408 656713 541217 361290 540266 801958 478671 210874 617052 311410 665775
17058 665775 494230 455886 285543 791694 784512 420817 524016 410998 780638 338953
17047 623207 510377 578546 479519 11978 443014 681503 229006 515081 440779 672650
17037 672650 721886 473961 315874 519430 730028 880637 518678 761609 416273 469401
17027 469401 376151 429261 610620 837655 408839 451202 845541 672440 700875 396140
17017 396140 815518 629817 1287177 402427 617725 828504 820595 846504 516402 362368
$$ packed form
17088F35124A99525K73640m6708M59513B40646J43069J28118j85358J97806n0980
17078D73301k07576m4808Q8893j18913N0638K17365J60207o8826k62748J71875
17068D59408J97305j15496j79927J78976K61692l23287B10874M06178l05642L54365
17058F65775j71545l8344j70343N06151p182l63695J03199j13018L69640C38953
17047F23207j12830O8169r9027A1978M31036K38489B29006K86075p4302K31871
17037F72650M9236k47925j58087K03556K10598J50609l61959K42931l45336N3128
17027D69401r3250N3110J81359K27035D08839M2363L94339j73101K8435l04735
17017C96140M19378j85701O57360D02427K15298K10779p909K5909l30102j54034
$$ plain form
17007 362368 1055536 595710 619307 719294 976515 825981 491427 785667 768571 862014
16997 862014 659880 764105 872010 926669 743550 838179 781055 740353 841931 922188
16987 922188 859918 662154 1060649 930164 659891 790911 933540 1290366 877987 655707
16977 655707 768805 551654 826412 700028 862742 923749 741601 894962 1093268 1046303
16967 1046303 748806 823490 1033046 955634 927189 820993 1125730 996101 1073923 1171189
16957 1171189 765434 1196814 996218 895120 778348 1210579 1141657 903555 945397 822705
16947 822705 1117932 941516 1274546 1208323 1343239 1285339 1325924 1446305 1326264 1248670
16937 1248670 1166616 998972 1069648 1178798 1354756 1485869 1078897 1358080 1044278 1518980
$$ packed form
17007C62368O93168m59826K3597R9987K57221j50534l34554K94240j7096R3443
16997H62014k02134J04225J07905N4659j83119R4629n7124m0702J01578Q0257
16987I22188o2270j97764L98495j30485k70273J31020J42629L56826m12379k22280
16977F55707J13098k17151K74758j26384J62714O1007j82148J53361J98306m6965
16967A046303k97497P4684K09556p7412k8445j06196L04737j29629P7822R7266
16957A171189m05755M31380k00596j01098j16772M32231o8922k38102M1842j22692
16947H22705K95227j76416L33030o6223J34916n7900M0585J20381j20041p7594
16937A248670q2054j67644P0676J09150J75958J31113m06972K79183l13802M74702
$$ plain form
16927 1518980 1181575 1768468 1395168 1386712 1581549 1450910 1432862 1252244 1405647 1372492
16917 1372492 1313269 1423079 1752111 1671648 1796688 1502666 1544003 1633544 1957182 1587575
16907 1587575 1494100 1931097 1946175 1892621 1940532 1951340 1698503 1892811 1544253 1899994
16897 1899994 1943581 2025228 2156792 1834311 1899975 2106508 1824818 2250164 2321842 2074647
16887 2074647 1954432 1981390 2532031 2490637 2597533 2094638 2446168 2656154 2319388 2503104
16877 2503104 2540469 2490621 2365543 3092767 2587927 2743304 2917495 2671301 2853008 2670960
16867 2670960 2857694 2670658 2982385 2854514 2932692 2993855 3135178 3191346 3121884 3357534
16857 3357534 3135896 3388818 3122223 3193660 3370438 3527147 3506952 3547566 3547478 3733180 3726450
$$ packed form
16927A518980l37405N86893l73300q456J94837j30639j8048j80618J53403l3155
16917A372492n9223J09810L29032q0463J25040k94022M1337Q9541L23638l69607
16907A587575r3475M36997J5078n3554M7911J0808k52837J94308l48558L55741
16897A899994M3587Q1647J31564l22481O5664K06533k81690M25346P1678k47195
16887B074647j20215K6958N50641m1394J06896n02895L51530K09986l36766J83716
16877B503104L7365m9848j25078P27224n04840J55377J74191k46194J81707j82048
16867B670960J86734j87036L11727j27871P8178O1163J41323N6168o9462K35650
16857C357534k21638K52922k66595P1437J76778J56709k0195M0614q8J85702o730
$$ plain form
16846 3726450 4007275 3824321 3948102 4291275 4205200 4335837 4295126 4439899 4566215 4665869
16836 4665869 4829917 4756383 4838493 4512416 4562647 5096642 4846247 5135528 5137371 5106115
16826 5106115 5411286 5692371 5847822 6023897 5793142 5757723 6441970 6311628 6820642 6652969
16816 6652969 6765980 6783989 7055872 7179005 7096465 7233650 7555545 7612249 8176594 8032312
16806 8032312 8241246 8410172 8611075 8752686 9295138 9744516 9609290 9970782 9891507 10467372
16796 10467372 10634555 11049516 11452953 11523406 11892873 12079472 12311343 12925777 13085531
16787 13085531 13378602 13798628 14274088 14716428 15253210 15553185 16180866 16883600 16900880
16778 16900880 17356541 18224008 18501118 19251389 20140596 20630569 21568352 22227312 23253544
$$ packed form
16846C726450K80825j82954J23781L43173q6075J30637m0711J44773J26316R9654
16836D665869J64048p3534Q2110l26077N0231N33995k50395K89281J843l1256
16826E106115L05171K81085J55451J76075k30755l5419O84247j30342N09014j67673
16816F652969J13011J8009K71883J23133q2540J37185L21895N6704N64345j44282
16806H032312K08934J68926K00903J41611N42452M49378j35226L61492p9275N75865
16796A0467372J67183M14961M03437P0453L69467J86599K31871O14434J59754
16787A3085531K93071M20026M75460M42340N36782K99975O27681P02734J7280
16778A6900880M55661Q67467K77110P50271Q89207M89973R37783O58960J026232
$$ plain form
16769 23253544 24008210 24770100 25985162 26616737 27983258 28732063 30214036 31102178 32805354
16760 32805354 33836669 35709613 37124580 38699903 40491679 42332780 44459530 46814763
16752 46814763 48334941 51007200 53602730 56568101 59350218 62516074 65505145 69084464
16744 69084464 72190779 76408534 80124127 84551383 89250277 94248398 98774670 104351693
16736 104351693 109846279 115659446 121057019 126768236 132626069 138216099 143915753 149461536
16728 149461536 154324133 159150344 163050869 166184023 168966024 170577654 171735031 171573710
16720 171573710 170710654 168895234 166039375 162789250 158800949 154367588 149250745 143777523
16712 143777523 137793629 132222620 126197597 120891292 114417999 109076915 103493689 98398783
$$ packed form
16769B3253544P54666P61890J215062O31575J366521P48805J481973Q88142J703176
16760C2805354J031315J872944J414967J575323J791776J841101K126750K355233
16752D6814763J520178K672259K595530K965371K782117L165856K989071L579319
16744F9084464L106315M217755L715593M427256M698894M998121M526272N577023
16736A04351693N494586N813167N397573N711217N857833N590030N699654N545783
16728A49461536M862597M826211L900525L133154K782001J611630J157377j61321
16720A71573710q63056j815420k855859l250125l988301m433361n116843n473222
16712A43777523n983894n571009o025023n306305o473293n341084n583226n094906
$$ plain form
16704 98398783 92973906 88552078 84109119 79626651 75693343 71737312 68171309 64509855
16696 64509855 61463608 58370342 55304578 52893518 50261548 47735622 45374203 43714781
16688 43714781 41669417 39840548 38338985 36801584 35109683 33544910 32354263 30834108
16680 30834108 29644093 28256549 27504921 26741432 25247982 24559363 23730565 22842303 21705338
16671 21705338 21281282 20416215 19692784 18965204 18031053 17705197 17415709 16756802 16391805
16662 16391805 16161121 15256730 15019444 14475681 13864599 13464587 13107239 12686275 12124125
16653 12124125 12155980 11910520 11151885 11472521 10884362 10500000 10529222 9880203 9592301 9436835
16643 9436835 9560672 9075112 8509408 8543821 8664493 8312465 7745852 7776407 7812577 7526365
$$ packed form
16704I8398783n424877m421828m442959m482468l933308l956031l566003l661454
16696F4509855l046247l093266l065764k411060k631970k525926k361419j659422
16688D3714781k045364j828869j501563j537401j691901j564773j190647j520155
16680C0834108j190015j387544p51628p63489j493450o88619q28798q88262j136965
16671B1705338m24056q65067p23431p27580r34151l25856k89488o58907l64997
16662A6391805k30684r04391k37286n43763o11082m00012l57348m20964n62150
16653A2124125L1855k45460p58635L20636n88159l84362K9222o49019k87902j55466
16643I436835J23837m85560n65704L4413J20672l52028n66613L0555L6170k86212
$$ plain form
16633 7526365 7310166 7347610 7294829 6698927 6621426 6837915 6415557 6670093 6413243 6254396
16623 6254396 6100181 5969280 6036083 5755180 5437987 5011099 5449308 5052735 5252428 5189583
16613 5189583 5304259 4938443 4767250 5029562 4384860 4223467 4570244 4233254 4220723 4365183
16603 4365183 4156963 4031296 3933201 3895846 4170652 3766200 3967780 3892144 3678364 3732086
16593 3732086 3406765 3507852 3403179 3318422 3012415 3418011 3349314 3078269 2966871 2865585
16583 2865585 2997025 3083180 3238662 3009658 2663577 2810066 2866479 2663020 2724859 2813663
16573 2813663 2550882 2435724 2579957 2516136 2449553 2586389 2538066 2464894 2715205 2400466
16563 2400466 2345524 2418168 2268562 2402987 2403601 2174770 2191581 2099229 2105012 2114954 2088749
$$ packed form
16633G526365k16199L7444n2781n95902p7501K16489m22358K54536k56850j58847
16623F254396j54215j30901O6803k80903l17193m26888M38209l96573J99693o2845
16613E189583J14676l65816j71193K62312o44702j61393L46777l36990j2531J44460
16603D365183k08220j25667r8095l7355K74806m04452K01580p5636k13780N3722
16593C732086l25321J01087j04673q4757l06007M05596o8697k71045j11398j01286
16583B865585J31440Q6155J55482k29004l46081J46489N6413k03459O1839Q8804
16573B813663k62781j15158J44233o3821o6583J36836m8323p3172K50311l14739
16563B400466n4942P2644j49606J34425O14k28831J6811r2352N783R942k6205
$$ plain form
16552 2088749 1946161 1859104 1985569 1722474 2062368 2073689 2239951 1990738 1900908 1884642
16542 1884642 1813539 1767756 1724173 1175648 1731259 1483357 1842522 1719263 1399504 1873168
16532 1873168 1463090 1706441 1660217 1328248 1594362 1556090 1523842 1719535 1232154 1444474
16522 1444474 1577019 1529231 1261989 1326892 1400397 1391064 1553365 1207635 1571965 1159366
16512 1159366 1289887 1174755 1230370 1207849 1508168 1411434 1430481 1568138 1470861 1264618
16502 1264618 1299751 1376328 1004113 1037675 1175254 1147658 1478130 1122925 1115473 992691
16492 992691 993762 1148334 1135507 1048468 1038538 930099 1085618 1065020 1335286 1307868 1144978
16481 1144978 864660 997233 599413 577606 865397 754671 716293 1216070 1137657 974519
$$ packed form
16552B088749j42588q7057J26465k63095L39894J1321J66262k49213q9830j6266
16542A884642p1103m5783m3583n48525N55611k47902L59165j23259l19759M73664
16532A873168m10078K43351m6224l31969K66114l8272l2248J95693m87381K12320
16522A444474J32545m7788k67242O4903P3505r333J62301l45730L64330m12599
16512A159366J30521j15132N5615k2521L00319r6734J9047J37657r7277k06243
16502A264618L5133P6577l72215L3562J37579k7596L30472l55205p452j22782
16492I92691J071J54572j2827q7039r930j08439J55519k0598K70266k7418j62890
16481A144978k80318J32573l97820k1807K87791j10726l8378M99777p8413j63138
$$ plain form
16471 974519 1069386 971067 951154 479115 872289 820219 746861 817320 1110674 428396 1092464
16460 1092464 784706 1172425 942908 639908 1127885 720600 912350 551066 790645
16451 790645 734359 1137995 793965 846019 1079032 1220264 862693 764453 807213 612588
16441 612588 831776 753503 713449 709687 630694 634736 924230 579385 612886 681863 752488
16430 752488 550807 826635 570199 649462 669283 698372 724788 421905 754861 808215
16420 808215 892086 895368 875043 536992 380078 637733 395844 558915 635942 1042118
16410 1042118 902845 957398 470055 609272 355866 731189 451320 759702 337590 628664
16400 628664 541991 597943 292259 754079 555751 545972 524833 803579 434522 810410
$$ packed form
16471I74519R4867r8319j9913m72039L93174n2070p3358P0459K93354D28396O64068
16460A092464l07758L87719k29517l03000M87977m07285J91750l61284K39579
16451G90645n6286M03636l44030N2054K33013J41232l57571r8240M2760j94625
16441F12588K19188p8273m0054l762p8993M042K89494l44845L3501O8977P0625
16430G52488k01681K75828k56436P9263J9821K9089K6416l02883L32956N3354
16420H08215Q3871L282k0325l38051j56914K57655k41889J63071P7027M06176
16410A042118j39273N4553D70055J39217k53406L75323k79869L08382C37590K91074
16400F28664q6673N5952B92259M61820j98328r779k1139K78746l69057L75888
$$ plain form
16390 810410 803227 798820 614218 621061 646113 781388 245630 361887 360588 335403 242122
16379 242122 492808 798484 808739 545229 605844 451060 367814 607459 575949 633942
16369 633942 810017 389724 440515 543867 328781 571031 91454 510810 426044 574176
16359 574176 612522 281335 718372 385875 395048 341330 411757 133136 399795 476687 503704
16348 503704 392442 628038 624277 111212 375034 418534 605072 357339 575414 422289
16338 422289 456937 522773 426766 574085 339155 529199 468677 669224 107707 108250 372709
16327 372709 435001 573911 254793 430305 212820 307321 364599 327078 761596 381602
16317 381602 314456 292226 580349 195207 531969 290825 175821 183423 422072 114949
$$ packed form
16390H10410p183m407j84602O843K5052J35275B45630J16257j299k5185r3281
16379B42122K50686L05676J0255k63510O0615j54784q3246K39645l1510N7993
16369F33942J76075C89724N0791J03352k15086K42250I1454M19356q4766J48132
16359E74176L8346B81335M37037l32497R173n3718P0427A33136K66659P6892K7017
16348E03704j11262K35596l761A11212K63822M3500J86538k47733K18075j53125
16338D22289L4648O5836r6007J47319k34930J90044o0522K00547A07707N43K64459
16327C72709O2292J38910B54793J75512B12820R4501N7278l7521M34518l79994
16317C81602o7146k2230K88123A95207L36762k41144j15004P602K38649A14949
$$ plain form
16306 374620 503172 217911 287321 219387 430494 372409 538225 292949 296545 356491 210222
16295 210222 434264 183405 234073 506997 446533 382185 -83261 245165 259569 421409
16285 421409 162090 199108 197444 -18628 436017 433303 323421 573171 297934 104250 97090
16274 97090 236644 423552 325637 74161 538788 563395 215323 251694 181552 121232 522596
16263 522596 294747 324996 342477 -100077 295137 238830 424082 150170 368015 103522
16252 414758 -56108 174918 526461 273279 393309 242312 250437 76964 449039 267864
16242 267864 288056 441459 315202 142769 25814 46551 -115286 306670 380049 241985
16232 241985 455467 303141 206383 321373 164305 251658 81164 534082 347455 115247
$$ packed form
16306C74620J28552B17911O9410o7934K11107n8085J65816k45276L596N9946j46269
16295B10222K24042A83405N0668K72924o0464o4348h3261B45165J4404J61840
16285D21409A62090L7018j664a8628D36017k714j09882K49750k75237A04250p160
16274I7090J39554J86908r7915G4161M64627K4607B15323L6371p0142o0320M01364
16263E22596k27849L0249J7481a00077B95137n6307J85252A50170K17845A03522
16252D14758e6108A74918L51543k53182J20030j50997Q125G6964L72075j81175
16242B67864K0192J53403j26257A42769B5814K0737a15286C06670P3379j38064
16232B41985K13482j52326r6758J14990j57068Q7353H1164M52918j86627A15247
$$ plain form
16221 167676 207798 233054 125739 321828 356240 112198 -75935 205067 459385 156022
16210 158233 76986 519201 280181 -40991 162505 383787 248411 289422 308653 305101 228231
16199 228231 296373 404366 308596 -52244 153208 -17301 183666 380358 7385 -268208 69714
16187 247389 -57964 286004 367660 153764 227005 260500 -146751 271504 152412 60683
16176 393761 -125105 43360 75484 21770 259719 281365 277868 -79782 407580 -3573 -8630
16165 -8630 53984 123787 112237 -1655 55247 331681 102254 -77223 191296 -143683 352658
16153 -37805 151987 -24820 143148 127554 -117651 -39617 -39298 248664 -30423 169388 90288
16142 90288 243409 -23856 44456 144058 32545 -102980 287158 -119947 -149610 212588 -217464
$$ packed form
16221A67676M0122K5256j07315J96089L4412A12198g5935B05067K54318A56022
16210A58233G6986M42215k39020d0991A62505K21282j35376M1011J9231l552p6870
16199B28231O8142J07993r5770e2244A53208a7301A83666J96692G385b68208F9714
16187B47389e7964B86004Q1656A53764P3241L3495a46751B71504j19092F0683
16176C93761a25105D3360L2124B1770K37949K1646l497g9782D07580c573n057
16165h630E3984O9803j1550a655E5247K76434A02254g7223A91296a43683C52658
16153c7805A51987b4820A43148j5594a17651c9617L19B48664c0423A69388p9100
16142I0288J53121b3856D4456R9602C2545a02980B87158a19947k9663B12588b17464
$$ plain form
16130 396968 302720 9522 415203 39717 192641 45927 185305 4176 239726 442999 92799
16118 -87770 -261609 -130333 255217 343083 -90370 221221 -143220 31579 -162297 -150825
16108 -150825 -98972 48348 -246761 41078 115130 -53609 348919 219148 114694 244078
16098 244078 159368 283365 115464 -116970 471715 -239219 146372 7442 -65326 -281067
16088 -281067 172719 105077 -71344 258032 -28835 95417 -171463 171391 276191 78414
16077 86127 -89492 100923 -201561 195823 67675 -187967 202204 -68742 -67609 -48136 298484
16065 -126146 89273 171482 106657 190761 -253520 -52860 212637 -99650 31633 -90318 188255
16053 -94017 169436 -38187 -53145 -4464 197944 334945 140554 -255986 43430 111854 121450
$$ packed form
16130C96968r4248I522M05681C9717J52924D5927J39378D176K35550K03273I2799
16118h7770j73839a30333B55217Q7866i0370B21221a43220C1579a62297J1472
16108a50825N1853D8348b46761D1078P4052e3609C48919j29771j04454J29384
16098B44078q4710J23997A15464a16970D71715b39219A46372G442f5326k15741
16088b81067A72719o7642g1344B58032b8835I5417a71463A71391J04800G8414
16077H6127h9492A00923b01561A95823F7675a87967B02204f8742J133J9473B98484
16065a26146H9273Q2209o4825Q4104b53520e2860B12637i9650C1633i0318A88255
16053i4017A69436c8187j4958d464A97944J37001A40554b55986D3430O8424R596
$$ plain form
16042 121450 -139830 219613 -22054 -19923 -134427 -45824 -52220 -69950 -121199 -127992 29126
16030 210618 61224 67976 38433 -101085 38791 231937 50102 209606 98638 82237 116379
16019 116379 -36545 132617 36977 -83117 -30616 200054 -226211 101538 -190973 -51956
16008 -118540 64849 327894 19584 -33926 -49888 329981 107831 -311016 -97784 -196767 68843
15996 -153844 65120 173216 -38531 -111057 304704 49015 -139888 -97057 -321962 128933
15985 152360 41879 -10245 104570 53974 94637 256898 -105751 -35704 255975 283872 84938
15973 93490 -232968 -34241 58318 -40900 380514 -219550 209583 55161 -466233 -162920
15962 -42437 -82079 -80439 185680 -18165 252440 312179 -30922 -94070 241155 11117 30158
$$ packed form
16042A21450a39830B19613b2054K131j14504d5824o396j7730n1249o793B9126
16030B10618F1224O752k9543a01085C8791J93146E0102J59504I8638j6401L4142
16019A16379c6545A32617C6977h3117c0616B00054b26211A01538a90973e1956
16008a18540F4849K63045A9584c3926j5962C29981A07831c11016i7784r8983F8843
15996a53844F5120J08096c8531p2526C04704D9015a39888M2831k24905A28933
15985A52360D1879a0245A04570n0596M0663J62261a05751c5704B55975K7897H4938
15973I3490b32968c4241E8318d0900C80514b19550B09583E5161d66233a62920
15962d2437l9642J640A85680a8165B52440N9739c0922o3148B41155A1117J9041
$$ plain form
15951 30158 -119926 142639 -154724 48727 174197 -148661 11100 -82613 158910 -326292
15940 -370957 160897 -34567 170939 -163391 -153821 -15052 -116344 -4615 -140644 -184304 -43754
15928 71820 -75417 14009 -73788 -257586 -19376 -153377 79511 -273906 438674 -147344 -125773
15917 -125773 -120605 196924 -230010 64460 -286420 -200340 176252 81479 174393 -136726 -294862
15906 -294862 96701 36004 -63611 -206077 172729 229598 -44218 -50695 -33478 -14719 -173337
15895 -173337 -73891 -58179 -193004 90716 -291379 -368933 -208050 22128 239584 87778 39829
15883 175876 23507 -119948 125722 -54359 -66434 -79994 73542 -294618 -158568 -148007 -245993
15872 -245993 59511 92293 -116911 -57958 -68962 -11520 -48477 -238643 -201504 95560 -124152
$$ packed form
15951C0158a19926A42639a54724D8727J25470a48661A1100h2613A58910c26292
15940c70957A60897c4567A70939a63391R570a5052j01292d615j36029m3660d3754
15928G1820g5417A4009g3788j83798a9376j34001G9511b73906D38674a47344K1571
15917a25773N168A96924b30010F4460b86420Q6080A76252H1479R2914a36726j58136
15906b94862I6701C6004f3611j42466A72729N6869d4218o477J7217a4719j58618
15895a73337g3891J5712j34825I0716b91379p7554J60883B2128K17456H7778C9829
15883A75876B3507a19948A25722e4359j2075j3560G3542b94618J36050J0561r7986
15872b45993E9511L2782a16911e7958j1004a1520l6957j90166L7139I5560a24152
$$ plain form
15860 -8696 -233720 13394 -4042 -262027 -244451 214871 -36068 12253 21991 -11693 115987
15848 -307307 -181696 -148612 -57097 53075 189035 116708 -103447 -161536 110615 1947 143278
15837 143278 123623 -100550 151875 -33400 267081 64255 -41837 -76849 270952 49247 -286022
15825 306769 -120602 -213269 -205589 -59025 16526 -67518 -74554 125780 -188138 -196643 -231283
15814 -231283 77409 -88828 132056 -171458 163576 -263736 -125564 -66645 -41126 148710
15803 73047 152226 -58898 116823 -102722 -35052 89974 320407 17460 -280804 25446 -115906
15791 140886 -276306 232738 52813 73063 -169659 22226 -217991 -8794 -56406 217857 208045
15780 208045 98900 -118492 287381 190479 -21759 86584 -345381 287823 -135340 -142858 -84563
$$ packed form
15860h696k25024A3394d042k57985J7576B14871c6068A2253R738a1693A15987
15848c07307J25611L3084e7097E3075J35960p2327a03447n8089A10615A947J41331
15837A43278j9655a00550A51875c3400B67081F4255d1837l5012B70952D9247b86022
15825C06769a20602r2667P680e9025A6526f7518p036A25780a88138q505l4640
15814b31283G7409h8828A32056a71458A63576b63736a25564N8919K5519A48710
15803G3047P9179e8898A16823a02722c5052H9974K30433A7460b80804B5446a15906
15791A40886b76306B32738E2813K0250a69659B2226b17991h794m7612B17857r812
15780B08045I8900a18492B87381r6902b1759H6584c45381B87823a35340p518N8295
$$ plain form
15769 -84563 107766 -175766 -83660 139952 -200009 46222 -125883 -327616 -348288 221662
15758 231483 130216 82380 124717 -358078 158069 211196 -115668 190017 -214713 80267
15747 -42462 -94014 -204888 -48955 194237 69205 95369 -265623 -101642 -255907 -280191 -437640
15736 -437640 -340055 38467 -4171 -227889 58731 83757 -158323 -33352 67310 -19200 -73844
15725 -73844 -181810 148690 -376437 527270 -120022 130337 -502111 -381773 -138747 -125328
15715 -125328 -35087 -111762 -205551 84666 63793 27255 -115810 103044 -143889 49443 33522
15704 33522 -87356 -279386 -395372 -237786 -140062 -29853 97783 58294 -219211 -32482 155716
15692 165423 -413494 -196529 -226404 43868 -85658 248348 338940 19435 -68762 23352 204079
$$ packed form
15769h4563A07766a75766h3660A39952b00009D6222a25883k01733k0672B21662
15758B31483j01267m7836M2337c58078A58069N3127a15668A90017b14713H0267
15747d2462n1552j10874d8955A94237F9205K6164b65623a01642j54265k4284j57449
15736d37640R7585C8467d171k23718E8731K5026a58323c3352F7310a9200n4644
15725g3844j07966A48690c76437E27270a20022A30337e02111J20338a38747J3419
15715a25328c5087p6675r3789H4666k0873B7255a15810A03044a43889D9443j5921
15704C3522h7356j92030j15986J57586R7724b9853I7783l9489b19211c2482A55716
15692A65423d13494a96529k9875D3868h5658B48348R0592A9435f8762B3352J80727
$$ plain form
15681 204079 -301060 -217663 -82164 -103909 -22636 82590 -219147 24296 -292647 83483 -3122
15669 123000 267103 292349 -44108 -150226 -67058 162027 -238897 89109 -340958 -91133
15658 -205320 165126 23015 -198003 -143983 -107310 40214 -2480 -107745 371519 146504 -351478
15646 78793 -100793 -224406 -82243 114660 101227 99399 22529 -94679 -30214 80001 129636
15635 129636 -309889 146478 2501 -176352 163062 -115231 364491 158438 41067 43737
15625 43737 76396 35452 48992 198533 -310893 4003 61381 -132104 25715 15760 101235
15614 101235 228453 283820 99353 -105436 -182989 -194499 -209790 -97221 -485344 -84788 113022
15602 -70345 -332776 43335 -97146 -6846 -30530 -269982 109962 -177122 -266033 -26407 45452
$$ packed form
15681B04079c01060Q3397h2164k1745b2636H2590b19147B4296b92647H3483c122
15669A23000J44103K5246d4108j06118f7058A62027b38897H9109c40958i1133
15658b05320A65126B3015a98003N4020L6673D0214b480j05265C71519A46504c51478
15646G8793a00793j23613h2243A14660j3433j828B2529i4679c0214H0001M9635
15635A29636c09889A46478B501a76352A63062a15231C64491A58438D1067K670
15625D3737L2659C5452J3540J49541c10893D003N7378a32104B5715r955Q5475
15614A01235J27218N5367I9353a05436p7553j1510j5291i7221l88123h4788A13022
15602g0345k62431D3335i7146f846k3684k39452A09962a77122q8911b6407D5452
$$ plain form
15590 -384154 18693 -271356 3044 -174202 -184843 256 253354 -1178 29456 -150822 -142715 -88826
15578 -88826 -180588 -153200 41499 121793 85762 269168 5406 67839 -376856 61802 101725
15567 101725 -148403 -446462 88608 187770 -21680 -159382 263963 429439 -222620 3802
15556 -173425 -340354 138852 195473 214924 194921 93954 -296986 -15071 12282 -85952 -221712
15545 -221712 -147063 66444 56348 -89161 163332 -50361 57911 7554 49326 276920 112128
15533 -173434 -58260 -76023 89927 -149223 -384208 372644 -104774 -319982 -3683 -83293 214679
15521 -139841 -248048 -129422 -190499 119068 -135916 7612 180095 -71456 -77410 -80168 71296
15509 167567 -52451 2987 -267168 -155742 -124866 -63904 32053 -71077 -69948 258909 -393830
$$ packed form
15590c84154A8693b71356C044a74202j0641B56K53098a178B9456a50822Q107N3889
15578h8826r1762K7388D1499Q0294l6031J83406E406O2433c76856F1802L9923
15567A01725a48403k98059H8608R9162b1680j37702B63963J65476b22620C802
15556a73425j66929A38852N6621J9451k0003I3954b96986a5071A2282h5952j35760
15545b21712P4649F6444j0096h9161A63332e0361E7911G554M1772K27594A12128
15533a73434e8260j7763H9927a49223k34985C72644a04774k15208c683p9610B14679
15521a39841j08207J18626o1077A19068a35916G612J72483g1456n954k758G1296
15509A67567e2451B987b67168J11426L0876O0962C2053g1077J129B58909c93830
$$ plain form
15497 -8394 11955 64825 -8367 -101691 -14285 87946 -101086 -75292 -121117 39463 95069 -91382
15484 -43059 32765 115861 -132976 10401 418817 123417 221007 -10318 -113413 -13723 -306623
15473 -306623 97556 205778 -122567 -27751 -272777 -17128 -227592 -317216 80356 -359236
15462 313834 2880 123289 -147954 207439 -8367 -89646 -107480 67204 429926 151151 15556
15450 -17363 -243669 -128611 140931 125992 405009 137361 170175 69349 75771 349574 183119
15439 183119 47216 91514 2530 -119618 -17402 -113081 -218684 -128652 -52190 158297 176842
15428 176842 233317 213419 201649 -75422 129223 -55498 -308237 -166212 70340 121815 -328051
15416 -124992 207249 -30889 -184022 -112854 -65960 16303 37491 100044 -161466 -106481 -173756
$$ packed form
15497h394A1955N2870h367r3324a4285H7946a01086K5794m5825C9463N5606i1382
15484d3059C2765Q3096a32976A0401M08416A23417R7590a0318j03095a3723k92900
15473c06623I7556J08222a22567b7751k45026a7128k10464q9624H0356c59236
15462C13834B880J20409a47954B07439h367q1279j7834F7204L62722A51151A5556
15450a7363k26306J15058A40931j4939K79017A37361L2814F9349O422K73803j66455
15439A83119D7216M4298B530a19618a7402r5679j05603R0032e2190A58297J8545
15428A76842N6475j9898j1770g5422A29223e5498k52739J42025G0340N1475c28051
15416a24992B07249c0889j53133P1168M6894A6303K1188O2553a61466N4985o7275
$$ plain form
15405 -173756 171694 -175655 170720 322515 -156363 -110386 -57599 -82311 -331095 -325807
15395 -325807 23136 -39539 94063 -139991 189427 9728 120722 -138879 12497 60682 19026
15383 50753 -145044 -36582 -292323 119275 126395 310177 242640 -76580 -292080 55733 -123048
15371 -279530 188084 332923 -52670 -91142 -61712 -23030 29980 295084 -146008 21367 120579
15360 120579 123769 -4723 164501 35796 -21569 187807 110076 86053 -33897 -133705 -253478
15349 -253478 24342 165113 408020 241354 141996 -29269 155744 -78031 199554 101270
15339 101270 -67811 94693 -78834 11938 179003 -82074 230912 -47532 40627 156178 86651
15328 86651 109083 -65025 -79160 -89536 316721 -171544 240224 343120 -148361 -55820 16186
$$ packed form
15405a73756A71694a75655A70720J51795a56363M5977N2787k4712k48784N288
15395c25807B3136c9539I4063a39991A89427I728J10994a38879A2497M8185A9026
15383E0753a45044c6582k55741A19275P120J83782o7537g6580k15500E5733a23048
15371b79530A88084J44839e2670l8472K9430b3030B9980K65104a46008B1367R9212
15360A20579L190d723A64501C5796b1569A87807p7731k4023c3897r9808j19773
15349b53478B4342J40771K42907j66666r9358b9269A55744g8031A99554r8284
15339A01270f7811I4693g8834A1938J67065h2074B30912d7532D0627J15551o9527
15328H6651K2432f5025j4135j0376C16721a71544B40224J02896a48361e5820A6186
$$ plain form
15316 303003 5751 -491698 -49442 -85677 -20508 312148 -111197 147681 -59753 72827 304926
15305 304926 167888 241176 227434 393225 -73591 191671 -162172 -72558 -107931 17284 -107926
15293 -390669 -143209 154934 -291003 76246 100886 -330475 -100723 -60250 -310476 172566
15282 51093 -106283 87760 -322772 -236330 -188658 387442 88506 -43086 153174 206260 -158025
15270 55722 28368 -302342 157526 118713 72989 185045 -305633 176111 -61644 -258993
15260 -258993 -120445 -306828 59384 104432 -17362 25869 26336 21877 489344 138405 316735
15249 316735 -133364 -46232 289062 323293 -14314 27199 42850 46744 -27003 -102535 11069
15237 387624 339328 -176690 407274 149095 -6863 134075 207475 330420 50922 -239422
$$ packed form
15316C03003E751d91698d9442l6235b0508C12148a11197A47681e9753G2827K32099
15305C04926j37038P3288j3742J65791g3591A91671a62172g2558l5373A7284a07926
15293c90669a43209A54934b91003G6246K4640c30475a00723M0473k50226A72566
15282E1093a06283H7760c22772Q6442M7672C87442H8506d3086A53174N3086a58025
15270E5722k7354c02342A57526l8813m5724J12056c05633A76111f1644j97349
15260b58993a20445j86383E9384M5048a7362B5869M67m459M67467A38405J78330
15249C16735a33364d6232B89062L4231a4314B7199J5651L894b7003p5532A1069
15237C87624m8296a76690D07274A49095f863A34075P3400J22945E0922b39422
$$ plain form
15226 -105524 248839 115810 82756 -91323 47600 121917 -6283 -37568 -85269 38588 -218669
15214 -328055 383150 90307 -27994 20319 131748 -237943 105750 117141 385280 388276 -38958
15202 -51550 -384 236791 -189397 -72114 27342 -67634 -108365 -83945 -297898 -106334 32796
15190 83700 39711 106511 212720 -20331 -50510 71939 -320599 147655 174958 51768 158459
15179 158459 464610 255418 32783 194157 -108846 244658 34884 -363515 -188672 47593
15168 77693 232055 94802 57999 -140288 483095 126993 178904 31374 197658 259921 -129558
15156 -5760 -211242 245528 245913 184274 347072 -81731 76863 200297 187423 -45603 69131
15144 32062 184640 222589 362494 81403 -22731 -105855 291729 -70413 -6359 94517 256466
$$ packed form
15226a05524B48839A15810l3054i1323D7600P4317f283l1285m7701C8588b18669
15214c28055C83150I0307b7994B0319J11429b37943A05750J1391K68139K996c8958
15202e1550c84B36791a89397g2114B7342f7634m0731K4420k13953a06334C2796
15190H3700C9711O6800J06209b0331l0179G1939c20599A47655K7303E1768J06691
15179A58459L06151k09192C2783J61374a08846B44658C4884c63515J74843D7593
15168G7693J54362I4802l6803a40288D83095A26993N1911C1374J66284O2263a29558
15156e760k05482B45528L85o1639J62798h1731G6863J23434j2874d5603F9131
15144C2062J52578L7949J39905H1403b2731q3124B91729g0413f359I4517J61949
$$ plain form
15133 256466 385842 -246537 1217 199505 64013 218008 -24401 80651 -207364 66003 202716
15122 202716 425109 -14701 -894 154460 30989 321802 -53565 123613 66991 119255 438657
15111 438657 -31022 106076 -50307 154594 -39432 55699 -108343 126451 243970 76251
15100 239093 -49100 128287 250109 -15602 283653 185657 -79774 230829 55261 141909 22677
15088 102666 -38601 -173663 37012 297217 209783 127874 240279 843 -192629 322810 308424
15077 308424 378951 273845 181780 208811 -47366 49381 76929 132649 35156 177444 392134
15066 392134 29942 300476 30095 184368 -18978 25869 44544 83295 -113582 89234 422411
15055 422411 115360 -42398 303490 -180401 168819 201597 110617 92984 297740 261313
$$ packed form
15133B56466J29376b46537A217J98288F4013J53995b4401H0651b07364F6003J36713
15122B02716K22393a4701h94A54460C0989K90813e3565A23613n6622N2264L19402
15111D38657c1022A06076e0307A54594c9432E5699a08343A26451J17519G6251
15100B39093d9100A28287J21822a5602B83653r7996g9774B30829E5261Q6648B2677
15088A02666c8601j35062C7012K60205q7434q1909J12405H43a92629C22810j4386
15077C08424P0527j05106r2065K7031d7366D9381K7548N5720C5156J42288K14690
15066C92134B9942K70534C0095J54273a8978B5869J8675L8751a13582H9234L33177
15055D22411A15360d2398C03490a80401A68819L2778r0980j7633K04756l6427
$$ plain form
15045 261313 360833 -80662 56591 127961 118173 221338 50802 38919 117841 445351 250201
15034 250201 111828 290787 -46208 -69474 379228 62443 39990 198642 187409 -54989 346287
15022 28928 -44914 399059 -69975 267438 -73770 45937 434515 395604 -4052 167197 211449
15011 211449 196683 374556 153083 175986 177896 227261 426375 151743 214439 96243 402394
15000 402394 218628 497076 141460 404358 289443 300288 279366 -50440 297681 163786
14990 163786 219145 134484 299012 45367 -45988 176068 581462 355940 206764 278904
14980 278904 -52153 29976 133749 198089 171891 17550 252220 247647 336549 286367 259946
14969 259946 286468 -35249 698288 63551 366893 277895 212613 9780 220726 342273 255586
$$ packed form
15045B61313R9520h0662E6591P1370r788J03165E0802j1883P8922L27510j95150
15034B50201A11828J78959d6208k3266C79228F2443k2453J58652j1233e4989C46287
15022B8928d4914C99059f9975B67438g3770D5937L88578l8911d052A67197M4252
15011B11449j4766J77873A53083K2903J910M9365J99114A51743O2696I6243L06151
15000D02394j83766K78448A41460K62898j14915J0845k0922e0440B97681j33895
14990A63786N5359q4661J64528D5367d5988A76068M05394k25522j49176P2140
14980B78904e2153B9976J03773O4340k6198A7550K34670m573Q8902n0182k6421
14969B59946K6522c5249F98288F3551L03342q8998o5282I780K10946J21547q6687
$$ plain form
14958 255586 -88205 309920 351284 387626 476042 78300 267842 104046 589650 466383
14948 466383 275851 266146 -78899 239233 234492 121877 182613 662144 289204 492696 382871
14937 382871 431172 127312 295730 54799 297759 357197 377078 468863 -86775 394821 -96395
14925 320352 -41185 187299 305432 503391 219834 355091 623578 352765 259784 467080
14915 467080 333660 586150 173807 401416 147811 43507 156480 273069 -132259 389877
14904 436879 408967 501036 286601 262088 566694 419851 239694 644940 440257 199532
14893 505893 403865 98145 178135 278532 213727 538666 530540 455381 301100 649450 500121
14882 500121 395866 349105 395972 290278 635662 125434 47564 488451 166014 347095
$$ packed form
14958B55586h8205C09920M1364L6342Q8416G8300J89542A04046M85604j23267
14948D66383j90532r705g8899B39233m741j12615O0736M79531B89204K03492j09825
14937C82871M8301A27312J68418E4799K42960N9438J9881R1785h6775C94821i6395
14925C20352d1185A87299J18133J97959B19834J35257K68487k70813r2981K07296
14915D67080j33420K52490A73807K27609A47811D3507J12973J16589a32259C89877
14904D36879k7912R2069k14435k4513L04606j46843j80157M05246k04683A99532
14893E05893j02028I8145P9990J00397o4805L24939q126p5159j54281L48350j49329
14882E00121j04255m6761M6867j05694L45384A25434D7564M40887A66014J81081
$$ plain form
14872 347095 -7843 95185 263275 514305 -32829 569926 522573 146555 402849 530568
14862 530568 518557 504201 381783 373429 86313 549476 369485 308611 271742 375743 523730
14851 523730 302170 455440 143543 102385 193913 492909 401212 239029 476081 359657
14841 359657 471876 229313 491665 492307 99933 358424 580410 487815 694891 392530
14831 392530 354735 246821 456970 577386 228205 341928 462548 609099 756348 584447
14821 584447 439555 295764 134742 344942 672362 571639 594497 600743 387075 615923
14811 615923 498505 680936 605386 385934 628874 555743 280774 322738 322836 343358 363585
14800 363585 640499 654506 801670 477963 483792 -22445 303273 416877 181187 431445
$$ packed form
14872C47095g843I5185J68090K51030c2829E69926m7353A46555K56294J27719
14862E30568j2011j4356j22418q354H6313M63163j79991o0874l6869J04001J47987
14851E23730k21560J53270A43543m1158R1528K98996r1697j62183K37052j16424
14841C59657J12219B29313K62352O42I9933K58491K21986r2595K07076l02361
14831C92530l7795j07914K10149J20416B28205J13723J20620J46551J47249j71901
14821E84447j44892j43791A34742K10200L27420j00723K2858O246k13668K28848
14811F15923j17418J82431p5550k19452K42940p3131k74969M1964R8K0522K0227
14800C63585K76914J4007J47164l23707N829b2445C03273J13604A81187K50258
$$ plain form
14790 431445 736774 652315 445082 270969 582389 559494 470083 462224 802901 253344
14779 338255 402361 853096 681695 746699 776136 604153 554985 643989 367498 691883
14769 691883 461892 633408 449750 647783 355053 549079 723609 927468 458756 950325
14759 950325 637774 617974 491686 642540 375055 619564 708946 960153 891347 938045
14749 938045 686523 577010 614621 554917 774030 559465 735830 393218 585445 811720
14739 811720 540030 593615 811546 866795 635913 573331 579697 550624 726239 491129 532270
14728 532270 774203 938081 818413 689819 867491 665224 682505 756257 848456 574834
14718 574834 645511 1113502 609508 731083 798990 674752 729825 824764 809625 597135
$$ packed form
14790D31445L05329q4459k07233j74113L11420k2895q9411p859L40677B53344
14779C38255O4106M50735j71401O5004K9437j71983m9168Q9004k76491L24385
14769F91883k29991J71516j83658J98033k92730J94026J74530K03859D58756M91569
14759I50325l12551j9800j26288J50854k67485K44509Q9382K51207o8806M6698
14749I38045k51522j09513L7611n9704K19113k14565J76365l42612J92227K26275
14739H11720k71690N3585K17931N5249k30882o2582O366k9073J75615k35110M1141
14728E32270K41933J63878j19668j28594J77672k02267J7281P3752R2199k73622
14718E74834P0677M67991n03994J21575O7907j24238N5073R4939j5139k12490
$$ plain form
14708 597135 630745 850290 709156 903303 1029960 773880 853545 829306 573542 618960
14698 618960 896860 910840 1113063 740248 1041488 827323 660310 889152 598642 1042784
14688 1042784 1048524 1102970 1054156 1033735 924207 994689 1002036 795737 994001 579966 792902
14677 792902 1022432 1049645 1021783 1069001 1020819 904592 983261 918500 1098240 901833 1032433
14666 1032433 1214001 993145 926508 820993 1304446 1228795 1076053 924598 898559 1003471
14656 1003471 1263780 1282696 1372522 1245303 1273612 1366583 1390148 1006822 1208379 981713
14646 981713 1345835 1233533 1191358 1297922 923786 1125923 1305408 1112895 971126 1253922
14636 1253922 1004744 1219839 1310365 859857 1029653 1161559 1309115 1307415 1377009 1447367
$$ packed form
14708E97135L3610K19545j41134J94147J26657k56080P9665k4239k55764M5418
14698F18960K77900J3980K02223l72815L01240k14165j67013K28842k90510M44142
14688A042784N740N4446m8814k0421j09528P0482P347k06299J98264m14035K12936
14677G92902K29530K7213k7862M7218m8182j16227P8669o4761J79740j96407J30600
14666A032433J81568k20856o6637j05515M83453p5651j52742j51455k6039J04912
14656A003471K60309J8916Q9826j27219K8309R2971K3565l83326K01557k26666
14646I81713L64122j12302m2175J06564l74136K02137J79485j92513j41769K82796
14636A253922k49178K15095R0526m50508J69796J31906J47556j700O9594P0358
$$ plain form
14626 1447367 1264665 1586510 1611556 1122529 1338560 1570812 1402066 1609973 1407611 1584049
14616 1584049 1374799 1841433 1586610 1313420 1689118 1401926 1844301 1573318 1455467
14607 1455467 1483260 1554376 1577265 1853155 1541689 1717085 1672631 1540326 1700861 1821210
14597 1821210 1583942 1807683 1797576 1756927 1738364 1840887 1906390 1768970 1772693 2055841
14587 2055841 2017774 1806243 2239532 1788950 1597103 1986079 1882395 1941391 1932588 1911150
14577 1911150 1691644 2114854 1969882 2111027 1905052 2040913 2040396 2121530 2573162 2079260
14567 2079260 2284940 2634347 2505413 2652177 2701401 2950682 2760848 2664670 2768956 3030471
14557 3030471 3065546 3087899 3129906 3472840 3629441 4560281 5141007 5692324 7633985 11700889
$$ packed form
14626A447367j82702L21845K5046m89027K16031K32252j68746K07907k02362J76438
14616A584049k09250M66634k54823k73190L75698k87192M42375k70983j17851
14607A455467K7793P1116K2889K75890l11466J75396m4454j32305J60535J20349
14597A821210k37268K23741j0107m0649j8563J02523O5503j37420L723K83148
14587B055841l8067k11531M33289m50582j91847L88976j03684N8996q803k1438
14577A911150k19506M23210j44972J41145k05975J35861n17Q1134M51632m93902
14567B079260K05680L49407j28934J46764M9224K49281j89834r6178J04286K61515
14557C030471L5075K2353M2007L42934J56601R30840N80726N51317J941661M066904
$$ plain form
14547 11700889 20597547 38045333 41515708 19725089 8378537 4904378 3158083 2510625
14539 2510625 2309382 2361224 2381301 2079432 2168578 2037930 2111067 2230024 2325526 2523492
14529 2523492 2307674 2258876 2363905 2307876 2148117 2294213 2558438 2657932 2037340 2348478
14519 2348478 2463690 2834901 2499337 2814017 2410867 2623450 2745444 2635000 2822849
14510 2822849 2781785 2808883 2914632 2948819 2980368 3563972 3380824 2817382 3451990 3256815
14500 3256815 3285654 3544126 3214983 3043372 3282734 3391080 3285587 3395621 3291854 3379106
14490 3379106 3624794 3425568 4144924 3691126 3662490 3721715 3880082 3842932 3766104 3715616
14480 3715616 3515991 4113573 3834441 3972302 4094849 4215864 4074642 3807884 4023319
$$ packed form
14547A1700889Q896658J7447786L470375A9725089H378537l474159j746295o47458
14539B510625k01243N1842K0077l01869Q9146j30648P3137J18957R5502J97966
14529B523492k15818m8798J05029n6029j59759J46096K64225R9494o20592L11138
14519B348478J15212L71211l35564L14680m03150K12583J21994j10444J87849
14510B822849m1064K7098J05749L4187L1549N83604j83148n63442O34608j95175
14500C256815K8839K58472l29143j71611K39362J08346j05493J10034j03767Q7252
14490C379106K45688j99226P19356m53798k8636N9225J58367l7150p6828n0488
14480C715616j99625N97582k79132J37861J22547J21015j41222k66758K15435
$$ plain form
14471 4023319 4466283 4708608 4352776 4262066 4437839 4422033 4545934 4535165 4421996 4723263
14461 4723263 4676854 4719602 4464491 4863811 4681470 5415220 5213831 5237077 5364211 5088020
14451 5088020 5286386 5342894 5461156 5584368 5351322 5580497 6021359 6251105 5988333 6079773
14441 6079773 6018466 6400144 6253571 6110889 6718121 6456389 6674918 6571093 6693016 6849836
14431 6849836 7041296 6793158 7156277 7257957 7075109 7384194 7379374 7934521 7757485 7805929
14421 7805929 7590777 7928397 8139052 8315991 8321766 8390188 8720095 8708380 8880394 9068911
14411 9068911 9157549 9237059 9477057 9708924 9396072 9771127 9572222 9687468 10323460 10096596
14401 10096596 10660545 10880571 11042170 11182239 11233096 11288517 11731211 11909768 11775019 12169458
$$ packed form
14471D023319M42964K42325l55832r0710J75773j5806J23901j0769j13169L01267
14461D723263m6409M2748k55111L99320j82341P33750k01389K3246J27134k76191
14451E088020J98366N6508J18262J23212k33046K29175M40862K29746k62772R1440
14441F079773o1307L81678j46573j42682O07232k61732K18529j03825J21923J56820
14431F849836J91460k48138L63119J01680j82848L09085m820N55147j77036M8444
14421G805929k15152L37620K10655J76939N775O8422L29907j1715J72014J88517
14411I068911Q8638P9510K39998K31867l12852L75055j98905J15246O35992k26864
14401A0096596N63949K20026J61599J40069N0857N5421M42694J78557j34749L94439
$$ plain form
14391 12169458 12444558 12644797 12759287 13090106 13622253 13625957 13714401 14322489 14413506 14642917
14381 14642917 14909718 15033198 15466278 15800858 15922713 16259575 16952074 16970888 17056448 17811889
14371 17811889 17824833 18188801 18342334 19040598 19632089 19865876 20486938 20723665 21124353
14362 21124353 21784203 22147805 22488387 22913625 23627318 24063792 24986863 25009100 26023434
14353 26023434 26398911 27172026 27506328 28162748 29025890 29765556 30151146 31429555 31964251
14344 31964251 32781068 33770182 34941227 35373119 36319416 37770190 38473769 39716141 40711137
14335 40711137 42275705 43114502 44223171 45973114 47120905 48604535 50074791 51859386
14327 51859386 53348216 55133705 56846580 58962513 61208642 63009251 65459577 67541804
$$ packed form
14391A2169458K75100K00239J14490L30819N32147L704Q8444O08088R1017K29411
14381A4642917K66801J23480M33080L34580J21855L36862O92499J8814Q5560P55441
14371A7811889J2944L63968J53533O98264N91491K33787O21062K36727M00688
14362B1124353O59850L63602L40582M25238P13693M36474R23071K2237J014334
14353B6023434L75477P73115L34302O56420Q63142P39666L85590J278409N34696
14344C1964251Q16817R89114J171045M31892R46297J450774P03579J242372R94996
14335D0711137J564568Q38797J108669J749943J147791J483630J470256J784595
14327E1859386J488830J785489J712875K115933K246129J800609K450326K082227
$$ plain form
14319 67541804 69828595 72475560 75573484 77940997 81209084 84185397 87659222 90661789
14311 90661789 94423984 98501895 102589561 106756343 111430147 116144734 121510550 127349873
14303 127349873 132727637 138675757 145433120 152164570 159570743 167032532 174910439 183661533
14295 183661533 192607404 201943732 212520475 222406310 233788013 245452825 257647357
14288 257647357 270248379 283199776 296715884 310404492 324768700 339136418 353319520
14281 353319520 367446834 381289193 394637728 407066342 418630070 429379113 438321168
14274 438321168 445778544 450713194 452142384 451408097 449139439 447315421 442985871 437737850
14266 437737850 430528719 421790788 411032416 399040472 385665136 371864664 356999673
$$ packed form
14319F7541804K286791K646965L097924K367513L268087K976313L473825L002567
14311I0661789L762195M077911M087666M166782M673804M714587N365816N839323
14303A27349873N377764N948120O757363O731450P406173P461789P877907Q751094
14295A83661533Q945871R336328J0576743R885835J1381703J1664812J2194532
14288B57647357J2601022J2951397J3516108J3688608J4364208J4367718J4183102
14281C53319520J4127314J3842359J3348535J2428614J1563728J0749043Q942055
14274D38321168P457376M934650J429190p34287k268658j824018m329550n248021
14266D37737850p209131q737931j0758372j1991944j3375336j3800472j4864991
$$ plain form
14259 356999673 342316632 327532621 312619437 298355590 284197624 270822009 257523401
14252 257523401 245102893 233527453 221795450 211135438 200909440 191549478 182235507
14245 182235507 173867062 165969239 158326979 151003598 143650751 137338784 131297785 125956139
14237 125956139 120523021 115151491 110369102 105551971 101352308 97695497 94495263 90448701
14229 90448701 86901382 83447078 80015612 77228018 74484305 71879108 69209638 66768526
14221 66768526 64694785 62498501 60173089 58650001 56354503 54319788 52907217 51558062
14213 51558062 50040456 48309588 46851990 45121847 43996631 42879449 42061224 40997648
14205 40997648 39548024 38242492 37059791 36344988 35594372 34865782 33864322 32615693
$$ packed form
14259C56999673j4683041j4784011j4913184j4263847j4157966j3375615j3298608
14252B57523401j2420508j1575440j1732003j0660012j0225998r359962r313971
14245A82235507q368445p897823p642260p323381p352847o311967o040999n341646
14237A25956139n433118n371530m782389m817131m199663l656811l200234m046562
14229I0448701l547319l454304l431466k787594k743713k605197k669470k441112
14221F6768526k073741k196284k325412j523088k295498k034715j412571j349155
14213E1558062j517606j730868j457598j730143j125216j117182q18225j063576
14205D0997648j449624j305532j182701p14803p50616p28590j001460j248629
$$ plain form
14197 32615693 31800624 30916095 30548287 29730889 29033357 28135941 27257065 26846725 26256015
14188 26256015 25738785 24945067 24505414 23845218 23644520 22557903 22188837 21805695 21353502
14179 21353502 20799175 20236927 19954530 19589533 19088300 18781029 18118548 18047658 17667468
14170 17667468 17739369 17021373 16766609 16436488 15815995 15909140 15402933 15065473 15066634 14757627
14160 14757627 14513477 14127445 13678937 13884936 13629458 13398424 13258683 12831429 12491389
14151 12491389 12276492 12227029 12078592 11774161 11344910 11621875 11043306 11158656 10949430
14142 10949430 10961330 10882889 10219962 10510281 10165236 9627487 10001186 9690177 9805744 9751459
14132 9751459 9444002 9481715 9095637 9099168 8922798 8347873 8394699 8488254 8285530 8174655
$$ packed form
14197C2615693q15069q84529l67808q17398o97532q97416q78876m10340n90710
14188B6256015n17230p93718m39653o60196k00698j086617l69066l83142m52193
14179B1353502n54327n62248k82397l64997n01233l07271o62481p0890l80190
14170A7667468P1901p17996k54764l30121o20493R3145n06207l37460J161l09007
14160A4757627k44150l86032m48508K05999k55478k31034j39741m27254l40040
14151A2491389k14897m9463j48437l04431m29251K76965n78569J15350k09226
14142A0949430J1900p8441o62927K90319l45045n37749L73699l11009J15567n4285
14132I751459l07457L7713l86078L531j76370n74925M6826R3555k02724j10875
$$ plain form
14122 8174655 7657655 8010838 7861318 7639910 7902126 7654673 7600761 7810325 7396875 7141938
14112 7141938 6748097 7148470 7147691 7070427 6470026 7083611 7008473 6470355 6278636 6686916
14102 6686916 6493826 6176214 6107661 6026989 6373460 6076101 6128348 5718584 5790522 5907957
14092 5907957 5954809 5779541 5271564 5692610 5495607 5384777 5121598 5381530 5397209 5101680
14082 5101680 5206579 5232804 4659181 4707021 4851530 5038779 4697733 4761724 4560133 4496299
14072 4496299 4584940 4428014 4510421 4562871 4059951 4493622 4453564 4291897 4072753 3891349
14062 3891349 4219509 3997984 3829744 4040234 3796992 3871517 3664897 4100554 3652271 3973387
14052 3973387 3651617 3824466 3992206 3549571 3456160 3413125 3476176 3793455 3334123 3425800
$$ packed form
14122H174655n17000L53183j49520k21408K62216k47453n3912K09564m13450k54937
14112G141938l93841M00373p79p7264o00401O13585p5138n38118j91719M08280
14102F686916j93090l17612o8553q0672L46471k97359N2247m09764P1938J17435
14092E907957M6852j75268n07977M21046j97003j10830k63179K59932J5679k95529
14082E101680J04899K6225n73623M7840J44509J87249l41046O3991k01591o3834
14072D496299Q8641j56926Q2407N2450n02920M33671m0058j61667k19144j81404
14062C891349L28160k21525j68240K10490k43242P4525k06620M35657m48283L21116
14052C973387l21770J72849J67740m42635r3411m3035O3051L17279m59332R1677
$$ plain form
14042 3425800 3518218 3021474 3016499 3289328 3505837 3403087 3112066 3281155 3112724 3098380
14032 3098380 2930407 3124251 3244800 3174039 3039886 3061907 3250595 2826221 3085291 3020965
14022 3020965 2806752 2857305 3018402 2768203 2710906 2993760 2458073 2645518 2447685 2634800
14012 2634800 2340713 2212311 2259281 2444361 2546807 2454406 2499981 2226574 2218149 2230691
14002 2230691 2268482 2025480 2488765 2136655 1966178 2096451 2177250 2055424 2189605 1866158
13992 1866158 2339572 2705844 2788352 4095124 6331797 13321539 31210351 43329850
13984 43329850 25783160 13856141 8683391 6253884 5011481 4388044 3650379 3465909
13976 3465909 3497577 3103067 2832369 2781551 2762301 2687503 2661718 2484972 2599516 2589863 2733092
$$ packed form
14042C425800R2418m96744m975K72829K16509j02750k91021J69089j68431j4344
14032C098380j67973J93844J20549p0761j34153K2021J88688m24374K59070o4326
14022C020965k14213N0553J61097k50199n7297K82854n35687J87445j97833J87115
14012B634800k94087j28402M6970J85080J02446r2401M5575k73407q425J2542
14002B230691L7791k43002M63285l52110j70477J30273Q0799j21826J34181l23447
13992A866158M73414L66272Q2508J306772K236673O989742J7888812J2119499
13984D3329850j7546690j1927019n172750k429507j242403o23437p37665j84470
13976C465909L1668l94510k70698n0818j9250p4798k5785j76746J14544r653J43229
$$ plain form
13965 2733092 2665507 2082894 2517315 2208890 2651885 2323191 1982045 2245964 1925130 2033549
13955 2033549 2166693 2106738 2071797 1990208 2099262 1780354 2276019 2352371 2118657 2056005
13945 2056005 1861913 2044389 2090015 1711310 1897505 1427513 1738781 1926998 1940043 1772009
13935 1772009 1647004 1930068 1722429 1472987 1683680 1771427 1560395 1781504 1797403 1706035
13925 1706035 1762097 1605759 1615709 1550801 1589867 1698945 1517854 1391077 1655101 1749378
13915 1749378 1345244 1667891 1352073 1455652 1637694 1469757 1881401 1533140 1509089 1554686
13905 1554686 1516520 1295066 1749035 1321698 1386105 1395396 1552221 1616347 1172059 1583647
13895 1583647 1457715 1346629 1393363 1530938 1274075 1209070 1293546 1065282 1236654 1171812
$$ packed form
13965B733092o7585n82613M34421l08425M42995l28694l41146K63919l20834J08419
13955B033549J33144n9955l4941q1589J09054l18908M95665P6352k33714o2652
13945B056005j94092J82476M5626l78705J86195m69992L11268J88217J3045j68034
13935A772009j25005K83064k07639k49442K10693Q7747k11032K21109J5899r1368
13925A706035N6062j56338R950o4908L9066J09078j81091j26777K64024R4277
13915A749378m04134L22647l15818J03579J82042j67937M11644l48261k4051M5597
13905A554686l8166k21454M53969m27337O4407R291J56825O4126m44288M11588
13895A583647j25932j11086M6734J37575k56863o5005Q4476k28264J71372o4842
$$ plain form
13885 1171812 1356158 1512427 1191737 1414923 1366747 956513 1425868 1101657 1150038 1164265
13875 1164265 1233954 1017758 1365109 1128985 1276838 998315 1066578 1125490 950242 1233838
13865 1233838 1240847 916961 1382488 1201087 993770 1029090 865972 1241937 1146866 1246177
13855 1246177 774789 1152481 1248969 1246956 1385505 1024524 889185 1087403 1095789 985089
13845 985089 1244944 821885 1080134 850240 1031650 1193389 603602 980690 1151327 1076569
13835 1076569 914340 1016464 733004 994454 675680 920255 760464 1146627 923459
13826 923459 946600 735366 862933 1058123 565128 1080370 801428 954840 811450 722412
13816 722412 807069 852946 694892 812578 1186909 851591 1129215 758893 1194723 1054178
$$ packed form
13885A171812J84346J56269l20690K23186m8176m10234M69355l24211M8381J4227
13875A164265O9689k16196L47351k36124J47853k78523O8263N8912j75248K83596
13865A233838P009l23886M65527j81401k07317L5320j63118L75965r5071R9311
13855A246177m71388L77692R6488k013J38549l60981j35339J98218Q386j10700
13845I85089K59855m23059K58249k29894J81410J61739n89787L77088J70637p4758
13835A076569j62229J02124k83460K61450l18774K44575j59791L86163k23168
13826I23459K3141k11234J27567J95190m92995N15242k78942J53412j43390q9038
13816G22412Q4657M5877j58054J17686L74331l35318K77624l70322M35830j40545
$$ plain form
13806 1054178 985847 713810 1006782 910914 636824 633172 719344 705188 967949 700931
13796 700931 790687 664472 1012561 821568 497086 910781 496995 1050771 1047662 770947
13786 770947 949948 848934 710294 507059 894817 968288 1013641 1076775 769729 425197
13776 425197 781026 708226 601342 1007188 901343 692328 713926 423031 770859 857153
13766 857153 775402 726680 787918 855659 796086 683307 634564 822635 923491 517932 840689
13755 840689 775333 847749 555763 822155 691891 732931 534921 630090 515360 705470
13745 705470 714284 492488 568417 328586 546030 806396 713381 526626 384953 613552
13735 613552 480564 590643 567885 596654 775407 550043 657944 716041 633255 523689
$$ packed form
13806A054178o8331k72037K92972r5868k74090l652Q6172j4156K62761k67018
13796G00931Q9756j26215L48089j90993l24482M13695m13786N53776l109k76715
13786G70947J79001j01014j38640k03235L87758P3471M5353O3134l07046l44532
13776D25197L55829p2800j06884M05846j05845k09015K1598k90895L47828Q6294
13766H57153q1751m8722O1238O7741n9573j12779m8743J88071J00856m05559L22757
13755H40689o5356P2416k91986K66392j30264M1040j98010R5169j14730J90110
13745G05470Q814k21796P5929k39831K17444K60366r3015j86755j41673K28599
13735F13552j32988J10079k2758K8769J78753k25364J07901N8097q2786j09566
$$ plain form
13725 523689 603244 656772 564538 790078 1056492 628741 859667 1032365 494990 428557
13715 428557 794259 782909 703826 531333 474413 775370 558280 603503 247745 425372
13705 425372 658745 475731 624319 754900 351777 458631 621396 335134 451764 524116
13695 524116 475881 512248 657303 500190 318334 750955 514463 877711 512025 572960
13685 572960 800205 557838 449688 455912 374994 806240 341876 563912 640926 403375
13675 403375 484845 423042 404564 368425 805423 531788 717383 557096 575351 677707
13665 677707 501897 364333 486382 412588 632676 444168 483319 592891 502164 290290
13655 290290 594420 412321 534487 472697 229535 528533 117880 254018 594471 471551
$$ packed form
13725E23689P9555N3528r2234K25540K66414m27751K30926J72698D94990o6433
13715D28557L65702j1350p9083j72493n6920L00957k17090M5223B47745J77627
13705D25372K33373j83014J48588J30581C51777J06854J62765k86262J16630P2352
13695E24116m8235L6367J45055j57113j81856M32621k36492L63248l65686O0935
13685E72960K27245k42367j08150O224q0918M31246C41876K22036P7014k37551
13675D03375Q1470o1803j8478l6139M36998k73635J85595j60287J8255J02356
13665F77707j75810j37564J22049p3794K20088j88508L9151J09572r0727k11874
13655B90290L04130j82099J22166o1790B29535K98998A17880J36138L40453j22920
$$ plain form
13645 471551 535492 600307 532604 327730 379618 764615 311855 198281 572051 457941
13635 457941 481833 488973 515214 582693 733673 504449 404200 473079 616618 149294 629944
13624 629944 413187 226115 403610 314369 323071 -85837 216510 312590 545046 582221 328400
13613 328400 204545 483605 -42840 634304 471847 51638 504618 516161 353348 431593
13603 431593 316945 345801 460596 228104 495322 328309 299682 396711 745193 396170
13593 396170 151664 98776 234327 280668 515962 428927 467569 278264 378345 463988
13583 463988 270018 139815 696219 113721 576877 629189 555977 535986 657673 525552
13573 525552 370842 35489 364678 248752 459189 306291 211374 300167 300788 511330 547384
$$ packed form
13645D71551O3941O4815o7703k04874N1888L84997C11855j13574L73770j14110
13635D57941K3892P140K6241O7479J50980k29224j00249O8879J43539A49294M80650
13624F29944k16757j87072J77495q9241Q702h5837B16510R6080K32456L7175k53821
13613C28400j23855K79060d2840F34304j62457E1638M52980J1543j62813P8245
13603D31593j14648K8856J14795B28104K67218j67013k8627R7029L48482l49023
13593C96170A51664n2888J35551M6341K35294q7035L8642j89305J00081Q5643
13583D63988j93970j30203N56404A13721M63156N2312p3212j9991J21687j32121
13573E25552j54710C5489L29189j15926K10437j52898r4917Q8793O21K10542L6054
$$ plain form
13562 547384 297357 168958 155326 373788 441088 457244 -81984 -14466 371755 448472 228372
13551 228372 497314 536170 129142 180106 32753 585732 417409 73747 143499 403701
13541 403701 295961 400662 376692 353579 163324 -107505 520147 151563 366277 216670
13531 216670 333902 482991 -35211 297548 360225 269679 306384 27343 254570 217287 76882
13519 231628 461365 -22837 201726 85937 253037 423769 506543 292399 258950 427721
13509 427721 408498 431241 45317 303076 657273 352292 124718 224575 317180 -1139 267313
13497 263447 486848 162922 323296 365948 374721 181648 57134 101011 303552 203309
13487 203309 172224 255265 266526 380080 118972 177722 -568 405075 486481 126548 351861
$$ packed form
13562E47384k50027j28399j3632K18462O7300J6156h1984a4466C71755P6717k20100
13551B28372K68942L8856A29142N0964C2753N52979j68323G3747O9752K60202
13541D03701j07740J04701k3970k3113A63324a07505E20147A51563K14714j49607
13531B16670J17232J49089c5211B97548O2677r0546L6705B7343K27227l7283G6882
13519B31628K29737b2837B01726H5937J67100J70732Q2774k14144l3449J68771
13509D27721j9223K2743D5317K57759L54197l04981A24718R9857R2605a139B67313
13497B63447K23401A62922J60374M2652Q773A81648E7134M3877K02541j00243
13487B03309l1085Q3041J1261J13554A18972N8750e68D05075Q1406A26548K25313
$$ plain form
13476 351861 589665 34139 395270 190528 331200 51025 408916 158570 307588 235364
13466 235364 447133 446429 54444 398800 214536 352624 166787 45298 203142 269356 76534
13454 465528 148648 198004 284918 38970 340412 481620 189449 359867 -259523 213276
13443 250577 16961 310428 397732 -120416 458651 133722 409202 -162231 600906 -58922
13432 195350 311367 55684 358184 -158298 292877 458017 -27549 184974 330734 211302
13422 211302 118208 107986 254253 61733 35927 112344 153080 238206 114663 390093 560436
13411 560436 281750 192908 219067 113746 304002 32227 199165 169424 234069 122721
13401 122721 118662 182325 438793 59668 -26455 143544 238789 191033 -191687 87483 260356
$$ packed form
13476C51861K37804C4139L61131A90528J40672E1025L57891A58570J49018p2224
13466B35364K11769p04E4444L44356j84264J38088A66787D5298J57844O6214G6534
13454D65528A48648M9356Q6914C8970L01442J41208A89449J70418b59523B13276
13443B50577A6961K93467Q7304a20416D58651A33722K75480a62231F00906e8922
13432A95350J16017E5684L02500a58298B92877J65140b7549A84974J45760j19432
13422B11302r3094j0222J46267F1733k5806P6417M0736Q5126A14663K75430J70343
13411E60436k78686q8842K6159j05321J90256C2227J66938k9741O4645j11348
13401A22721m059O3663K56468E9668b6455A43544R5245m7756a91687H7483J72873
$$ plain form
13390 260356 195411 234101 259219 227813 -173792 -133749 258447 161160 325854 51133 564861
13379 564861 611212 113098 338917 127799 370005 658921 227887 227529 233647 407719 493144
13368 493144 5278 140477 -95316 159471 93939 462802 79063 243458 201905 422324 304574
13357 304574 128526 227316 54272 266538 304467 419106 -18980 24622 152250 314165
13347 314165 320154 396818 -116176 437667 357565 228519 316420 118525 194790 558785 273941
13335 321815 218338 197069 310115 8696 -84343 55788 334718 287257 301964 348863 -132166
13323 219130 94249 219858 512675 130065 55535 394715 486144 141617 546579 255995
13312 -38646 -160220 83582 237808 334114 115079 244964 156732 336770 177908 -255710
$$ packed form
13390B60356o4945L8690K5118l1406a73792M0043B58447r7287J64694E1133N13728
13379E64861M6351A13098K25819A27799K42206K88916B27887l58O118J74072Q5425
13368D93144E278J35199i5316A59471o5532L68863G9063J64395m1553K20419j17750
13357C04574A28526R8790E4272K12266L7929J14639a8980B4622J27628J61915
13347C14165N989P6664a16176D37667q0102j29046Q7901A18525P6265L63995B73941
13335C21815j03477k1269J13046H696h4343E5788K78930m7461J4707M6899a32166
13323B19130I4249J25609K92817A30065E5535L39180R1429A41617M04962B55995
13312c8646j21574H3582J54226R6306A15079J29885q8232J80038j58862b55710
$$ plain form
13301 -37563 198256 -27807 477603 539512 123199 362202 254926 345908 170473 126362
13291 126362 355839 -86787 49786 172654 -104862 334330 149490 108779 247176 314630
13281 314630 68127 481362 356681 225338 318875 -58809 218043 128409 224071 101264
13270 147875 108041 101548 82735 66439 217129 230540 3779 79199 553432 172158 -203576
13258 24650 70692 -36389 514946 268413 321629 -114073 -88698 -128416 214363 88441 192542
13247 192542 190629 14024 188832 281394 -132113 196178 333236 163684 180212 112546 340548
13236 340548 -21799 159873 272093 -139415 94664 4702 74240 410867 204403 57241 158608
13225 158608 165720 105264 66973 -38408 47071 -58273 391472 -35347 -67621 270432 132082
$$ packed form
13301c7563A98256b7807D77603O1909A23199K39003j07276R0982A70473m4111
13291A26362K29477h6787D9786J22868a04862C34330A49490m0711J38397O7454
13281C14630F8127M13235j24681j31343R3537e8809B18043q9634R5662A01264
13270A47875l9834o493j8813j6296J50690J3411C779P5420M74233A72158b03576
13258B4650M6042c6389E14946k46533N3216a14073K5375l9718B14363H8441J04101
13247A92542j913A4024J74808R2562a32113A96178J37058A63684J6528o7666K28002
13236C40548b1799A59873J12220a39415I4664D702O9538L36627B04403E7241J01367
13225A58608P112o0456l8291c8408D7071e8273C91472c5347l2274B70432A32082
$$ plain form
13213 5402 -57335 95349 285431 10358 67404 155074 253790 -224826 51078 -46661 -79114
13202 -79114 -322031 81277 32945 -20681 -76407 180456 321237 6249 213828 -89532 58911
13190 -110119 161472 421772 186848 104153 387586 -165388 205022 -62817 186527 253993
13180 253993 -109202 578246 9781 210464 299633 -240409 240051 448019 113548 -17713
13169 83749 221327 106756 176086 -49294 19370 -297852 59699 73322 85768 77374 53528
13158 53528 374919 -69410 -36370 25005 250002 380209 -257238 384365 -493795 -144485
13147 42383 -182582 172959 -420108 -199205 -71500 144973 154227 -14873 443808 128338
13136 -159673 -39208 197558 264703 26320 69214 375762 130239 -323277 202909 47551
$$ packed form
13213E402e7335I5349J90082A0358N7046Q7670R8716b24826E1078d6661l2453
13202g9114k42917H1277C2945b0681n5726A80456J40781F249K07579h9532E8911
13190a10119A61472K60300A86848q2695K83433a65388B05022f2817A86527O7466
13180B53993a09202E78246I781K00683Q9169b40409B40051K07968A13548a7713
13169H3749J37578A06756O9330d9294A9370b97852E9699J3623J2446q394k3846
13158E3528L21391f9410L3040B5005K24997J30207b57238C84365d93795a44485
13147D2383a82582A72959d20108a99205g1500A44973R254a4873D43808A28338
13136a59673c9208A97558O7145B6320M2894L06548A30239c23277B02909D7551
$$ plain form
13125 -167387 113454 -20994 198474 300125 179284 103451 291688 -35341 -77599 107055
13114 299930 235337 -101456 100602 -1218 242010 116258 121339 -509868 -80652 -175945 -88608
13103 -88608 -38437 45458 426120 64359 208171 -182667 17520 21242 71694 224203 138222
13092 138222 -54525 19001 76031 26047 369177 57103 304205 170123 -108538 171224
13081 449638 255145 -268582 316422 2335 124610 218269 -67546 -41328 140757 274528
13071 274528 46527 149749 94889 -45479 53836 91972 188418 -59065 95674 183260 250643
13060 250643 -170148 335723 -26179 116693 -82425 -5840 198998 271670 -172575 295043
13049 150994 -48086 -264201 36054 209873 409392 311569 171796 116208 18831 196914
$$ packed form
13125a67387A13454b0994A98474J01651j20841p5833J88237c5341m2258A07055
13114B99930o4593a01456A00602a218B42010A16258N081e09868h0652r5293Q7337
13103h8608c8437D5458L80662F4359J43812a82667A7520L722N0452J52509q5981
13092A38222e4525A9001N7030B6047L43130E7103K47102j34082a08538A71224
13081D49638j94493b68582C16422B335J22275R3659f7546K6218A40757J33771
13071B74528D6527J03222n4860d5479E3836L8136R6446e9065I5674Q7586O7383
13060B50643a70148C35723b6179A16693h2425e840A98998P2672a72575B95043
13049A50994d8086k16115C6054J73819J99519r7823j39773n5588A8831J78083
$$ plain form
13039 196914 376301 143845 441954 388210 66876 218824 31273 -163282 9814 -45436 -43349
13028 -43349 234149 218500 38066 225991 82486 -26355 173706 169948 13155 405884 -3928
13016 257816 -5753 21929 31786 -167256 223639 131985 2233 -264624 358024 -106132 -4440
13004 57642 -60240 -46166 518833 159616 -170397 -122395 141008 -41778 -109402 260870 461022
12993 461022 126161 308810 -224110 352881 -71248 245190 -155611 185573 413756 209574
12983 209574 19374 -85878 72404 247190 93985 52 354871 -32741 5789 306625 227428 146998
12971 146998 -41299 -80452 -50640 189298 -84030 314806 140677 149535 -35351 -294252 29097
12959 -95382 -211384 379487 52293 -107584 -56982 75479 76863 100481 347052 -48839 -205480
$$ packed form
13039A96914J79387A43845K98109n3744F6876J51948C1273a63282I814d5436K087
13028d3349B34149j5649C8066J87925H2486b6355A73706l758A3155L92729c928
13016B57816e753B1929R857a67256B23639r1654B233b64624C58024a06132d440
13004E7642f0240J4074E18833A59616a70397M8002A41008d1778o7624B60870K00152
12993D61022A26161J82649b24110C52881g1248B45190a55611A85573K28183k04182
12983B09574A9374h5878G2404J74786I3985E2L54819c2741E789L00836p9197q0430
12971A46998d1299l9153K9812A89298h4030C14806A40677Q858c5351k58901B9097
12959i5382j16002C79487E2293a07584N0602G5479J384K3618K46571d8839j56641
$$ plain form
12948 -205480 -9087 71712 -51455 13515 26262 444118 60483 116038 -304920 123262 280467
12937 280467 122890 -180503 159088 34462 -29387 -4967 -7342 388809 194002 299502 144344
12925 -6930 -112215 49760 226760 -245598 -152776 102923 9772 -109691 -28636 9515 -5081
12913 -12769 279753 -190146 99552 204359 -108442 232429 30531 202467 32227 7155 -219868
12901 -257588 -105463 266421 -134995 -50763 60143 50602 -128003 74766 -320088 -306947 4744
12889 2763 -40008 116334 -86674 96314 34905 -30731 87741 59220 53974 -114765 152358
12877 -218266 -10231 253520 -190450 -284908 -72154 -26579 -91190 -100137 227969 -25476 322712
12865 15396 390578 -47060 -70611 9056 -6034 -399784 181712 126059 -122779 155614 -115252
$$ packed form
12948b05480i087G1712e1455A3515J2747M17856F0483N5555c04920A23262J57205
12937B80467A22890a80503A59088C4462b9387d967k375C88809A94002J05500A44344
12925f930j05285D9760J77000b45598R2822A02923I772a09691b8636I515e081
12913a2769B79753a90146I9552J04807a08442B32429C0531J71936C2227G155b19868
12901b57588a05463B66421a34995e0763F0143r541a28003G4766c20088J3141D744
12889B763d0008A16334h6674I6314C4905c0731H7741k8521n246a14765A52358
12877b18266a0231B53520a90450r4458g2154b6579o4611q947B27969b5476C22712
12865A5396L75182d7060k3551I056f034l93750A81712n5653a22779A55614a15252
$$ plain form
12853 16049 162561 -120365 240254 163663 -25626 -312201 -281140 -91281 -27179 97079 114082
12842 114082 -94137 198853 -54839 -125781 6652 -112349 9191 157808 97071 -35514 49460
12830 314605 184035 -124318 80355 -214573 499374 -115505 1603 -50608 -110538 -73356 425906
12818 190468 5516 135858 -174617 164150 83838 -168351 78305 40978 -175759 -72092 -152304
12807 -152304 -55230 153652 397938 308244 -53640 377571 -24214 -85467 -221823 332229
12796 349805 -133729 -37451 -172220 23661 -50167 -22852 -71564 -177217 -65174 169861 93203
12785 93203 127572 188237 -45418 43484 -84634 271446 -38440 176802 102646 -87864 215011
12773 40193 63473 160431 38883 -59100 -113234 363001 -302775 -124275 -161245 -396952 -75612
$$ packed form
12853A6049J46512a20365B40254p6591b5626k86575L1061i1281b7179I7079J7003
12842A14082i4137A98853e4839p0942F652a12349I191J48617o0737c5514D9460
12830C14605j30570a24318H0355b14573D99374a15505A603e0608n9930L7182D25906
12818A90468E516J30342a74617A64150q0312a68351G8305l7327a75759g2092q0212
12807a52304e5230A53652K44286q9694e3640C77571b4214o1253j36356C32229
12796C49805a33729c7451j34769B3661e0167b2852m8712j05653f5174A69861p6658
12785I3203L4369O0665d5418D3484h4634B71446c8440A76802p4156h7864B15011
12773D0193K3280R6958C8883e9100n4134C63001c02775a24275l6970k35707g5612
$$ plain form
12761 61605 45495 -46355 -83759 158029 60459 -151543 -58665 156681 90144 -223121 111449
12749 117288 79955 -98993 164952 -50021 233972 245189 249121 -74676 -44998 248093 227096
12738 227096 -64259 -3611 175086 59733 24334 80974 -64602 1459 -28912 -69732 300160
12726 17378 261238 88333 79343 -170123 226068 -61295 3055 57249 -104751 78454 340203
12715 340203 -72237 -75290 142836 -66816 -15666 179933 26445 362251 295015 348980 127030
12703 111474 126212 257480 -13323 -339295 106654 -260313 -230366 335431 -169377 58059
12692 338676 226433 -13107 68570 -92999 -462190 4628 199590 -39350 -204174 38997 -106402
12680 567478 -161196 -132350 -230331 -27753 -64643 -6632 227185 48127 -143642 168196 53081
$$ packed form
12761F1605j6110d6355l7404A58029F0459a51543e8665A56681o6537b23121A11449
12749A17288l7333i8993A64952e0021B33972J1217L932g4676K9678B48093k0997
12738B27096f4259c611A75086E9733B4334N6640f4602A459b8912m0820C00160
12726A7378K43860H8333q990a70123B26068f1295C055N4194a04751G8454K61749
12715C40203g2237l053A42836f6816a5666A79933B6445L35806o7236N3965A27030
12703A11474J4738J31268a3323l25972A06654b60313K9947C35431a69377E8059
12692C38676j12243a3107F8570i2999l69191D628J94962c9350j64824C8997a06402
12680E67478a61196K8846r7981b7753l6890f632B27185D8127a43642A68196E3081
$$ plain form
12668 289679 40168 -68270 58202 170192 47958 42122 -118469 172029 261474 111082 317130
12657 317130 2826 252882 54322 7209 193287 -47107 101350 78629 227168 245821 301516
12646 301516 133809 67836 143060 -37772 -370294 192242 250980 246506 -44709 160030 188432
12635 188432 130204 238851 447598 380224 -49824 -35751 388451 237120 -109557 497537
12624 279186 359343 34094 247812 57994 179848 173399 135472 60072 24179 -53787 -169300
12613 -169300 -210528 14834 -30986 -171845 -223811 77020 104987 344813 101168 -91404 -116935
12602 -116935 248183 49544 -66571 209941 144250 111991 54335 121872 -162600 -115674 199801
12590 185282 -149446 107150 86269 -429 -137961 39598 148415 -2271 393978 -224340 201986
$$ packed form
12668B89679D0168f8270E8202J11990D7958n836a18469A72029Q9445A11082K06048
12657C17130B826K50056E4322G209J86078d7107A01350k2721J48539J8653N5695
12646C01516A33809o5973P5224c7772l32522A92242N8738m474d4709A60030K8402
12635A88432n8228J08647K08747o7374d9824J4073C88451j51331a09557D97537
12624B79186Q0157C4094K13718E7994J21854o449l7927F0072B4179e3787j15513
12613a69300m1228A4834c0986j40859n1966G7020K7967K39826A01168i1404k5531
12602a16935B48183D9544f6571B09941o5691l2259E4335O7537a62600M6926A99801
12590A85282a49446A07150k0881d29j37532C9598J08817b271C93978b24340B01986
$$ plain form
12578 20288 -24489 65168 82299 286467 173075 -373048 237 -308656 -53194 -148206 -293102
12567 -293102 -1816 -61582 92673 65044 -186105 398145 -97094 160131 -44996 314657 -40490
12555 -45890 316757 -59726 20756 121948 83588 5522 181568 15128 349720 418132 260266
12544 260266 -191363 -107037 31543 21756 350344 226951 -281975 -15118 -241944 156738
12533 137575 -159879 -141020 277233 116777 -83570 -359107 23201 -171955 516531 212285
12522 -117490 223449 302478 -171607 34476 3560 120041 270064 -176619 -81012 169834
12511 -136427 -87458 -24087 200666 -117707 -118890 -115002 -398141 149131 304271 -26226 -113704
12500 -113704 40381 -68898 -233681 -62927 -33327 -105561 -151241 -197514 451865 -125797 -36530
$$ packed form
12578B0288b4489F5168J7131K04168j13392c73048B37c08656e3194r5012j44896
12567b93102a816n9766I2673k7629a86105C98145i7094A60131d4996C14657d0490
12555d5890C16757e9726B0756J01192l8360E522J76046A5128L34592O8412j57866
12544B60266a91363Q4326C1543r787L28588j23393b81975a5118k26826A56738
12533A37575a59879J8859B77233A16777h3570k75537B3201a71955E16531B12285
12522a17490B23449P9029a71607C4476C560J16481J50023a76619h1012A69834
12511a36427M8969b4087B00666a17707j183L888k83139A49131J55140b6226q7478
12500a13704D0381f8898j64783f2927K9600p2234m5680m6273D51865a25797c6530
$$ plain form
12488 -56436 171808 136481 -230881 334716 -253620 433249 56660 -177397 151600 101725
12478 101725 188232 -131790 76445 -110817 -79916 14559 -210496 -1559 147324 48839 -77388
12466 84932 148099 -85543 255001 187560 -144337 108403 -229722 101753 202543 63909
12455 215053 254490 -32502 -37933 -164411 160301 -19522 117504 196078 158752 217223 9400
12443 155810 -84702 -472430 -164128 -140036 240577 241367 319236 -223198 -144801 203201 93958
12431 23984 -17125 -170674 -35398 171886 20664 130885 -82015 78157 200545 -134078 -30049
12419 109312 -261028 149868 -31470 51444 -92283 -202069 -26579 -126324 147745 199581 127642
12408 127642 -171389 42899 96432 53065 100958 -169511 -334762 67129 -137027 246603
$$ packed form
12488e6436A71808l5327b30881C34716b53620D33249E6660a77397A51600m9875
12478A01725Q6507a31790G6445a10817L0901A4559b10496a559A47324D8839g7388
12466H4932O3167h5543B55001o7441a44337A08403b29722A01753J00790F3909
12455B15053L9437c2502n431j26478A60301a9522A17504P8574l7326N8471I400
12443A55810h4702l87728a64128K4092B40577P90P7869b23198P8397B03201I3958
12431B3984a7125j53549c5398A71886B0664J10221h2015G8157J22388a34078c0049
12419A09312b61028A49868c1470E1444i2283j09786b6579r9745A47745N1836p1939
12408A27642a71389D2899N3533m3367M7893a69511j65251F7129a37027B46603
$$ plain form
12397 -115361 -23900 -109775 202797 -316900 382172 63616 102340 243516 -207532 -149751
12387 -149751 -57355 -197344 -124488 105271 102132 184932 224261 -26590 332090 531674 -393853
12375 15999 166031 -69045 12004 37786 -13954 -207479 -77890 288680 178223 205406 -86646
12363 -173174 -50669 -107920 36907 133007 93823 -187761 360541 -151648 -281668 110426
12352 -117870 96484 50078 -114309 -74846 -23282 -80312 -166844 48496 -107728 14282 31834
12341 31834 -94569 434990 -136010 99732 130234 -342667 -165573 63541 141244 110448 106121
12330 106121 233080 193678 -96347 100681 -262960 97740 -58921 153651 -51052 74083 47014
12319 47014 -252006 -60229 -232492 56753 41615 -267903 -35353 -168603 -331238 -157696
$$ packed form
12397a15361b3900q5875B02797c16900C82172F3616L8724J41176b07532N7781
12387a49751e7355j39989P2856A05271l139Q2800L9329b6590C32090J99584c93853
12375A5999J50032f9045A2004K5782a3954j93525g7890B88680j10457K7183h6646
12363a73174e0669n7251C6907R6100l9184a87761C60541a51648j30020A10426
12352a17870I6484m6406a14309L9463b3282n7030q6532D8496a07728A4282J7552
12341C1834i4569D34990a36010I9732L0502c42667a65573F3541P7703l0796m327
12330A06121J26959l9402i6347A00681b62960I7740e8921A53651e1052G4083k7069
12319D7014b52006f0229j72263E6753j5138b67903c5353j33250j62635a57696
$$ plain form
12308 -397295 -369955 4958 -73088 -71464 -62497 230365 157518 -3528 -73925 96862 212693 125714
12296 125714 94863 -114330 158335 234621 -241395 -43645 207094 -10785 56117 -159319
12285 -132508 -270288 -97255 -157578 262421 79492 21038 118513 11808 33501 -85166 368520
12273 -191000 75660 5556 290551 -8459 -18055 -125605 81246 -75665 25628 -384878 -2234 -23443
12261 -23443 128435 200977 -273899 -154637 -35913 205656 225356 49516 -24135 171116 91817
12250 91817 -81137 -230486 415015 652319 -2485 -7899 327186 303357 -138483 428984 142378
12238 19852 91238 11108 -20733 -22451 -16515 150902 -102772 353820 320849 88896 303160
12227 303160 183314 -17556 280375 204147 174563 69314 383484 146142 233683 -35149 2507
$$ packed form
12308c97295K7340D958g3088J624Q967B30365p2847c528p0397I6862J15831q6979
12296A25714l0851a14330A58335P6286b41395d3645B07094a0785E6117a59319
12285a32508j37780i7255o0323B62421G9492B1038R7475A1808K1693h5166C68520
12273a91000G5660E556K84995h459r596j07550H1246g5665B5628c84878b234k1209
12261b3443A28435P2542b73899J19262c5913B05656J9700D9516b4135A71116p9299
12250I1817h1137j49349D15015K37304b485n414C27186k3829a38483D28984A42378
12238A9852P1386A1108b0733j718N936A50902a02772C53820l2971H8896K14264
12227C03160j19846a7556B80375p6228k9584F9314L14170A46142Q7541c5149B507
$$ plain form
12215 28416 270106 178384 135540 -41053 292708 319640 -145899 124348 133817 -70594 -38798
12204 -38798 132754 132410 -2367 325897 245730 114098 52420 277837 93192 255529 -28720
12192 375455 309364 209027 177906 174556 138536 180957 230876 141628 26931 135499 -205059
12180 -129596 -27430 -105944 37472 -19232 -107898 11903 -34121 257917 164276 128423 115393
12169 115393 485020 73604 62103 163459 12514 -120542 69624 67240 76326 48803 -179310
12157 -60793 61659 69117 23897 98400 19905 32005 34728 308157 -51576 26493 201660 -63991
12144 70481 -15567 85069 10006 41606 253389 29306 56005 271447 208646 214654 48694
12132 14237 34667 250230 307015 158129 90971 38780 -45782 -216061 -58918 29548 -103242
$$ packed form
12215B8416K41690r1722m2844d1053B92708K6932a45899A24348R469g0594L1796
12204c8798A32754l44b367C25897q0167A14098E2420K25417I3192J62337b8720
12192C75455o6091j00337l1121l350l6020M2421M9919q9248B6931J08568b05059
12180a29596b7430p8514C7472a9232q8666A1903c4121B57917r3641l5853j3030
12169A15393L69627G3604j1501J01356A2514a20542F9624k384R086k7523a79310
12157f0793F1659P458B3897P4503A9905J2100K723K73429e1576B6493J75167f3991
12144G0481a5567H5069A0006L1600K11783B9306K6699K15442o2801O008D8694
12132A4237K0430K15563N6785j48886o7158C8780d5782j70279e8918B9548a03242
$$ plain form
12120 -187551 -288432 -50538 3889 -46466 138053 -135299 264794 110103 -148599 -16502
12109 -9322 -162579 12438 -187421 155629 -110572 186185 -205224 97621 54244 139892 -141436
12097 -12941 95986 -74760 -309823 141288 -54780 442978 120052 45443 -196474 87496 -61497
12085 -193376 152127 -158855 -107014 -93444 -298565 201318 7402 101966 -184322 -166218 -17055
12073 322734 248493 -127945 102075 240981 126531 757673 1034391 484147 204119 -62473
12062 -18751 139245 294105 -107734 143954 -55337 -60215 -1511 16624 -191713 182015 404217
12051 404217 -197657 -397718 21520 37154 122607 312901 -38698 102665 -58405 160163
12040 -101176 -336170 -65647 -253600 84847 -346632 -13809 112522 -133681 59242 34658
$$ packed form
12120a87551j00881e0538C889d6466A38053a35299B64794A10103a48599a6502
12109i322j53257A2438a87421A55629a10572A86185b05224I7621m3377Q5648a41436
12097a2941I5986g4760k35063A41288e4780D42978A20052D5443a96474H7496f1497
12085a93376A52127a58855N1841J3570k05121B01318G402R4564a84322J8104a7055
12073C22734p4241a27945A02075J38906j14450O31142K76718D84147B04119f2473
12062a8751A39245J54860a07734A43954e5337m878a511A6624a91713A82015K22202
12051D04217a97657k00061B1520J5634Q5453J90294c8698A02665e8405A60163
12040a01176k34994f5647j87953H4847c46632a3809A12522a33681E9242k4584
$$ plain form
12030 34658 -307903 -145618 -298495 111321 156605 50342 158652 -25008 116333 25119
12019 244110 179268 -31952 -47508 -258553 -33303 -1344 40359 350919 171534 227460 78594
12007 -311922 -85457 -212743 173756 -66642 73276 -60249 3816 334774 -42325 -202100 -66994
11995 145413 -11882 62718 93521 -57748 32727 380405 163422 -9229 -237567 433371 -110512
11983 215603 208837 12996 -149075 136130 59175 -69369 -79109 -134521 110831 -225189 90926
11971 104556 -180291 -156186 212768 71566 170388 42696 -164014 -387393 228235 -212735
11960 247660 -361579 16685 32990 -3515 -136761 -181584 141459 190575 55820 -118769 333781
11948 12320 -117726 15503 -260912 -41207 19772 -80654 -97921 8619 341966 117241 -24567
$$ packed form
12030C4658c07903a45618j52877A11321M5284E0342J08310b5008A16333B5119
12019B44110o4842c1952j5556k11045c3303a344D0359L10560A71534N5926G8594
12007c11922h5457j27286A73756f6642G3276f0249C816L30958d2325j59775f6994
11995A45413a1882F2718L0803e7748C2727L47678A63422i229k28338D33371a10512
11983B15603o766A2996a49075A36130E9175f9369r740n5412A10831b25189I0926
11971A04556a80291K4105B12768G1566R8822D2696a64014k23379B28235b12735
11960B47660c61579A6685J6305c515j33246m4823A41459M9116E5820a18769C33781
11948A2320a17726A5503b60912d1207A9772h0654j7267H619L33347A17241b4567
$$ plain form
11936 56944 165671 297239 -131059 -2424 63425 88552 -346794 -85444 -132142 -184118 -240469
11925 -240469 -98031 -206180 103650 328424 37992 44616 154512 -410490 -64802 -80299 -101119
11914 -101119 -247007 101880 -297913 135942 34653 76341 18265 -215780 -160838 111230
11903 -6651 268146 -69393 51814 49435 -120323 -48036 -151527 -98859 131512 119867 -56908
11891 199148 33348 -391114 239927 189320 -229011 -44510 -85803 90500 -81362 111265 6992
11879 -175005 -310106 -215258 -25234 -206410 -184400 -6111 48133 -34655 55353 82449 -59130
11867 -8193 338460 121039 -105042 249252 -415183 -14514 -48581 -300813 -254247 58088 -220030
11855 -159092 43742 -50904 44228 -88892 -178302 71082 104178 -65415 -2589 57977 -446327
$$ packed form
11936E6944J08727J31568a31059b424F3425K5127c46794h5444m6698n1976n6351
11925b40469i8031j08149A03650K24774C7992O624J09896d10490f4802j5497k0820
11914a01119j45888A01880b97913A35942C4653M1688A8265b15780N4942A11230
11903f651B68146f9393E1814k379a20323d8036j03491N2668A31512j1645e6908
11891A99148C3348c91114B39927n0607b29011d4510m1293I0500h1362A11265F992
11879a75005j35101R4848b5234j81176K2010f111D8133c4655E5353K7096e9130
11867h193C38460A21039a05042B49252d15183a4514l4067k52232M6566E8088b20030
11855a59092D3742e0904D4228h8892q9410G1082L3096f5415b589E7977d46327
$$ plain form
11843 11484 349 -8015 197253 53947 -73545 -147427 62419 290271 -172695 192539 -369363
11831 18689 -88658 -67405 11528 111398 -141173 -255222 25963 -147468 -32126 -87285 5233
11819 222176 -77131 -381347 200450 123246 153978 203478 -98437 -90581 -261427 -62901 -12694
11807 -273530 94666 11831 -54351 -33388 -6186 -417072 60649 -106751 330865 -250828 51624
11795 200157 -290476 -37978 -84631 -211455 6106 -166259 97845 188168 152077 -375873 -181484
11783 -218328 99298 87969 63985 99482 -190786 216833 3008 -145660 -122800 164761 -36808
11771 171205 133898 98450 290231 -99892 82069 298668 -86683 -156676 -113826 178313 -9900
11759 -208247 -13013 6781 -190996 -67786 42791 -87555 297002 -208673 81678 -75230 19199
$$ packed form
11843A1484C49h015A97253E3947g3545p3882F2419K27852a72695A92539c69363
11831A8689h8658K1253A1528R9870a41173j14049B5963a47468c2126n5159E233
11819B22176g7131l04216B00450p7204L0732M9500i8437P856j70846f2901a2694
11807b73530I4666A1831e4351K0963f186m10886F0649a06751C30865b50828E1624
11795B00157b90476c7978m6653j26824F106a66259I7845R0323l6091c75873a81484
11783b18328I9298j1329k3984L5497a90786B16833C008a45660K2860A64761c6808
11771A71205l7307l5448J91781i9892H2069K16599h6683o9993M2850A78313i900
11759b08247a3013F781a90996f7786D2791h7555B97002b08673H1678g5230A9199
$$ plain form
11747 -162262 -139852 260921 -70449 -85794 180889 95458 184132 228283 -213041 -199874 -59132
11735 -203297 -27673 -297228 64795 126135 -293953 19475 -73152 -515419 135802 8534 201340
11724 201340 -39308 224618 241295 18229 -111900 112912 128373 -63753 -18093 -26407 276498
11712 34633 9306 -147375 -48846 -179672 -160968 -38129 112548 180756 -72833 -86890 37097
11700 67527 -94164 -93139 -76368 333247 76942 -80407 145341 -54067 107537 114264 -170787
11688 78296 78405 134011 -58240 76372 198458 76471 -165144 -8891 -98007 5793 58014 190653
11676 190653 93556 -215369 -285629 389889 28157 -113435 -109666 -19139 -46270 -11355 77883
11664 295296 -469847 -27769 -94906 79838 95757 -50223 206916 226208 65682 64575 -237605
$$ packed form
11747a62262K2410B60921g0449j5345A80889q5431Q8674M4151b13041J3167e9132
11735b03297b7673k69555F4795O1340b93953A9475g3152m42267A35802H534J92806
11724B01340c9308B24618J6677A8229a11900A12912J5461f3753a8093q314B76498
11712C4633I306a47375d8846j30826J8704c8129A12548O8208g2833j4057C7097
11700F7527i4164J025J6771C33247G6942h0407A45341e4067A07537O727a70787
11688G8296J09N5606e8240G6372J22086G6471a65144h891q9116E793N2221J32639
11676A90653I3556b15369p0260C89889B8157a13435L769a9139k7131a1355G7883
11664B95296d69847b7769o7137G9838J5919e0223B06916J9292F5682j107b37605
$$ plain form
11652 -74801 -212536 186189 -209580 -148672 26958 -15157 -21413 308029 97499 -32561 -8364
11640 214788 -126756 164346 150449 -158288 329217 -125129 96377 -122975 195699 22573
11629 63691 42573 42970 82710 188950 -15288 170507 -68629 122276 26718 64272 91558
11618 91558 -131245 -239482 -134922 117751 -181837 -115079 107178 -180330 -44996 -189913
11608 -189913 356888 286921 -30636 98365 8772 180676 93835 125223 -113491 -4423 -143240
11597 -143240 284993 304329 -70622 99528 -274782 293224 -111689 -21334 113859 134288
11587 134288 2552 3643 6576 -38270 277049 -182294 -309321 149538 -24320 168796 248319
11576 248319 -89201 204919 31147 288399 36295 -444228 -4274 67238 -156962 -273666 -20437
$$ packed form
11652g4801j37735A86189b09580O0908B6958a5157o256C08029I7499c2561h364
11640B14788a26756A64346j3897a58288C29217a25129I6377a22975A95699B2573
11629F3691k1118L97L9740J06240a5288A70507f8629A22276B6718L7554K7286
11618I1558a31245j08237J04560A17751a81837O6758A07178a80330d4996j44917
11608a89913C56888o9967c0636I8365H772J71904q6841L1388a13491d423j38817
11597a43240B84993J9336g0622I9528b74782B93224a11689b1334A13859K0429
11587A34288B552J091K933c8270B77049a82294j27027A49538b4320A68796P9523
11576B48319h9201B04919C1147K57252C6295d44228d274F7238a56962j16704b0437
$$ plain form
11564 19899 129151 -132301 25755 150841 221566 472689 376976 -14736 -352626 -100108
11553 -85285 100128 -33933 -179479 255953 135048 242461 -65530 -91854 277989 93664
11542 -126043 -355632 106388 -220574 34841 -83780 -228335 46964 234382 -51272 212396
11531 -232661 -185368 37914 111139 135294 -5126 -61610 182816 357133 -29197 377944 19819
11519 282210 161232 38190 -71951 -52822 -4365 314994 54513 186133 -113857 304011 49150
11507 141898 -8252 74765 378388 250086 281732 -24824 9984 178171 95775 -97801 -38912
11495 276241 -113830 -120543 189980 359628 309648 404027 -61099 -2517 -295043 134265 19262
11483 589438 479718 492287 254746 284618 12985 354012 -19981 17239 151162 313950
$$ packed form
11564A9899J09252a32301B5755J25086P0725K51123r5713a4736l37890a00108
11553h5285A00128c3933j45546B55953j20905J07413f5530k6324B77989I3664
11542a26043k29589A06388b20574C4841h3780j44555D6964J87418e1272B12396
11531b32661M7293C7914P3225K4155e126n6484A82816J74317b9197C77944A9819
11519B82210j20978C8190g1951J9129d365C14994E4513J31620a13857C04011D9150
11507A41898h252G4765L03623j28302L1646b4824I984J68187q2396i7801c8912
11495B76241a13830o713A89980J69648m9980R4379f1099b517k92526A34265A9262
11483E89438j09720J2569k37541K9872A2985L41027a9981A7239J33923J62788
$$ plain form
11473 313950 4193 164366 182061 129541 206107 -27180 24520 -70627 140143 421125 235463
11462 235463 228923 -95613 204035 213336 91882 307965 9678 -120504 174145 86612 223717
11451 223717 222379 -11738 -114224 351752 284566 133840 226915 -175558 318925 264259 80012
11439 137452 -8834 65273 114074 40155 89599 -10401 111999 263388 -185592 86919 193653
11428 193653 -371903 139366 293591 -296771 109246 -12912 -71782 -194829 46363 -374827
11417 -163232 -134701 -3015 71014 6869 -63507 140110 75452 -46863 292176 198812 -151927
11405 121539 161759 133640 -146364 178983 61189 89877 223257 -269487 -30231 9109 75959
11394 75959 -162413 -141289 126091 184984 -179544 -140270 -132607 -115490 96488 -44824 -345722
$$ packed form
11473C13950D193J60173J7695n2520P6566b7180B4520g0627A40143K80982j85662
11462B35463o540i5613B04035R301I1882K16083I678a20504A74145H6612J37105
11451B23717j338a1738j02486C51752o7186A33840R3075a75558C18925n4666H0012
11439A37452h834F5273M8801D0155M9444a0401A11999J51389a85592H6919J06734
11428A93653c71903A39366J54225b96771A09246a2912n8870j23047D6363c74827
11417a63232K8531c015G1014F869f3507A40110o4658d6863B92176r3364a51927
11405A21539M0220k8119a46364A78983F1189K8688J33380b69487c0231I109O6850
11394G5959a62413K1124A26091N8893a79544L9274P663J7117I6488d4824l00898
$$ plain form
11383 -345722 155671 -291495 382949 -152578 -329392 209914 56121 -40650 -210564 -51882
11372 145926 -162847 37145 108903 -136159 -180666 -74947 -58886 116167 100325 -72014 80785
11360 52942 13210 -136488 -58287 -230625 154494 95138 -4129 12985 105375 131742 -110459
11348 -232066 -60608 251523 -140528 358439 -157111 817 -328299 -221469 125877 -361242
11337 -36971 -1568 215905 -157876 212623 -257702 -235636 -156690 -205461 -48466 -271863 158044
11325 29513 65106 119001 146295 -89586 222098 -363 34016 -106604 -62696 155567 67192
11313 148287 50134 195621 114118 -213726 -128055 184202 245648 123118 295429 152390
11303 152390 87755 244584 -127799 139090 103742 167712 -47672 239100 -204566 -122558
$$ packed form
11383c45722A55671b91495C82949a52578j76814B09914E6121d0650j69914e1882
11372A45926a62847C7145P1758a36159m4507g4947J6061A16167j5842g2014H0785
11360E2942A3210a36488e8287j72338A54494n9356d129A2985R2390K6367a10459
11348b32066f0608B51523a40528C58439a57111H17c28299J06830A25877c61242
11337c6971a568B15905a57876B12623b57702K2066P8946m8771d8466k23397A58044
11325B9513L5593N3895K7294h9586B22098c63C4016a06604M3908A55567F7192
11313A48287E0134J45487q1503b13726Q5671A84202O1446j22530J72311j43039
11303A52390o4635J56829a27799A39090l5348O3970d7672B39100b04566Q2008
$$ plain form
11293 -122558 22549 333030 -107865 338941 101590 -267188 143222 46395 -184425 26742
11282 -61506 -79013 38891 256670 10618 -241332 -166395 -119117 73822 -236140 120098 -223815
11270 103381 -170803 76825 -223320 196274 193969 75380 295602 -239490 341817 -264335
11259 -68598 -216161 -92551 169858 20969 144496 -14882 -70425 -116655 -63820 -318628 65996
11247 -246242 160788 12901 75794 23813 -41279 -121754 63965 -50215 -133589 -1079 -35422
11236 -35422 -108850 -167962 14261 -356934 -95162 -147068 187107 -32076 111573 150829 -134428
11224 165941 -61918 -375596 -196336 -176961 -227648 5053 -63029 -218238 -213651 8418 330569
11213 330569 -66934 -65628 -355188 -115542 109747 116461 -193332 44133 334120 -182993 -338909
$$ packed form
11293a22558B2549L10481a07865C38941A01590b67188A43222D6395a84425B6742
11282f1506j7507C8891K17779A0618b41332P4937M7278G3822b36140A20098b23815
11270A03381a70803G6825b23320A96274k305G5380K20222b39490C41817b64335
11259f8598j47563i2551A69858B0969J23527a4882n5543m6230N2835k54808F5996
11247b46242A60788A2901O2893B3813d1279q0475F3965e0215q3374a079l4343
11236c5422p3428n9112A4261c56934i5162n1906A87107c2076A11573L9256a34428
11224A65941f1918l13678J79260J9375n0687E053f3029j55209M587H418L22151
11213C30569f6934J306k89560a15542A09747O714a93332D4133K89987a82993j55916
$$ plain form
11202 -338909 135394 -14 -96333 176812 -129490 -89925 -25316 -169534 -94931 229681 -25125
11190 376141 20091 39414 68526 134506 -25944 -211173 -156862 227316 -50432 -128992 88272
11178 139871 206463 185408 -193717 67794 -151109 170028 -46833 -173679 -214031 -139122 -106657
11167 -106657 -322746 -76337 -92923 83077 305183 -251988 -187757 -170208 -226616 -347649 127496
11155 111186 -131787 -126985 30938 237424 20821 150662 46044 -359825 144591 7288 -47904
11143 132243 -38331 -73574 -26009 67105 75278 -169962 -16932 246748 -261264 -27822 -93725
11132 -93725 -25309 23887 6293 -88616 79650 365068 -232864 175710 242676 -39173 237238
11120 100819 325051 59241 -24982 -160697 -98956 345856 194984 291800 -126435 183586
$$ packed form
11202c38909A35394a4r6319A76812a29490L9565b5316j44218P4603B29681b5125
11190C76141B0091J9323K9112O5980b5944j85229N4311B27316e0432p8560H8272
11178A39871O6592k1055a93717F7794a51109A70028d6833j26846m0352P4909L2465
11167a06657k16089g6337j6586H3077K22106b51988O4231J7549n6408j21033A27496
11155A11186a31787M802C0938K06486B0821J29841D6044c59825A44591G288d7904
11143A32243c8331l5243b6009F7105Q173a69962a6932B46748b61264b7822o5903
11132i3725b5309B3887F293h8616G9650K85418b32864A75710O6966c9173B37238
11120A00819K24232E9241b4982j35715O1741C45856j50872R6816a26435A83586
$$ plain form
11109 -38510 62470 124736 234316 -35891 253695 241706 160304 206674 232004 79051 450665
11098 450665 401531 486359 84408 437179 -13495 3033 170072 82850 221912 -93125 243225
11086 231700 196783 -20521 375844 202282 167205 441443 546127 229197 265517 344875
11076 344875 268536 564101 524993 -244579 298480 312023 525228 351288 790784 513034
11066 513034 -15291 438033 628731 631945 300511 933687 540798 495560 934294 530977
11056 530977 569176 696804 540490 548486 608989 1094864 697148 580601 528495 843996
11046 843996 851206 889737 783280 1082221 763479 764303 864001 817398 680409 951993 1004401
11035 1004401 960471 943255 593071 866569 510006 980646 428572 710250 513781 939578
$$ packed form
11109c8510F2470O2266J09580c5891B53695j1989q1402M6370K5330G9051L71614
11098D50665m9134Q4828H4408L52771a3495C033J67039H2850J39062i3125B43225
11086B31700l4917b0521C75844j73562l5077K74238J04684B29197L6320P9358
11076C44875p6339K95565l9108b44579B98480J3543K13205j73940M39496k77750
11066E13034a5291D38033J90698L214C00511O33176l92889m5238M38734m03317
11056E30977L8199J27628j56314P996O0503M85875l97716j16547n2106L15501
11046H43996P210L8531j06457K98941l18742Q24R9698m6603j36989K71584N2408
11035A004401m3930j7216l50184K73498l56563M70640D28572K81678j96469M25797
$$ plain form
11025 939578 671820 557807 898614 830908 648085 716597 586657 652837 744030 455967
11015 455967 640042 429441 646292 546698 503822 844771 712729 873499 373861 839070
11005 839070 1002913 707553 794217 448919 571601 485641 833525 1084774 484470 761312
10995 761312 940134 961025 987111 885261 783405 720811 988917 946982 764784 780006
10985 780006 1017251 1275853 1164699 1188770 1281002 1410225 1597505 1820367 1637834 2033480
10975 2033480 2428171 2539054 3051406 3083330 3404142 3116513 3184012 2971498 2568740 2035681
10965 2035681 1872473 1435423 1311863 1605959 1354438 998657 1255794 1343585 1024050 945648
10955 945648 959642 949212 877481 541007 593709 356668 361414 404972 315186 298554 198709
$$ packed form
11025I39578k67758j14013L40807o7706j82823O8512j29940O6180R1193k88063
11015D55967J84075k10601K16851r9594m2876L40949j32042J60770C73861M65209
11005H39070J63843k95360Q6664l45298J22682q5960L47884K51249D84470K76842
10995G61312J78822K0891K6086j01850j01856o2594K68106m1935j82198J5222
10985G80006K37245K58602j11154K4071R2232J29223J87280K22862j82533L95646
10975B033480L94691J10883N12352L1924L20812k87629O7499k12514m02758n33059
10965B035681j63208m37050j23560K94096k51521l55781K57137Q7791l19535p8402
10955I45648J3994j0430p1731l36474N2702k37041M746M3558q9786j6632r9845
$$ plain form
10944 198709 232606 328398 118816 45416 227438 129617 39108 162677 -352922 102221
10933 53707 10781 14248 -27123 15035 -104027 479199 154035 114663 -18447 -27356 207395
10921 -123118 -105459 -23442 105467 -9599 -72072 -104003 48869 -64034 -73474 57000 319100
10910 319100 185047 -26416 -32595 -241970 -99953 -169546 -47927 -94936 11286 -85617 -75411
10899 -75411 -235151 -177195 324053 -131438 244294 -30203 91423 -53208 23507 -58116 -15651
10887 -83384 350354 76331 -236395 166226 88363 48613 -127705 -222673 -66902 -97406 -161385
10876 -161385 -253378 112497 -159609 -167643 18986 62797 -117535 -132848 -139737 -200958 3002
10864 9195 141006 -110965 -116044 -303031 20286 -70640 -69948 -5622 11817 -256106 -60685 -216498
$$ packed form
10944A98709L3897R5792A18816D5416J82022r7821C9108J23569c52922A02221
10933E3707A0781L467b7123A5035a04027D79199A54035l9372a8447q909B07395
10921a23118J7659b3442A05467i599o2473l1931D8869f4034r440E7000K62100
10910C19100j34053b6416o179k09375i9953o9593d7927m7009A1286h5617J0206
10899g5411j59740N7956C24053a31438B44294c0203I1423e3208B3507e8116a5651
10887h3384C50354G6331b36395A66226p7863l9750a27705r4968f6902l0504o3979
10876a61385r1993A12497a59609q034A8986M3811a17535j5313o889o1221C002
10864I195J31811a10965n079j86987B0286g0640O92e622A1817b56106f0685j55813
$$ plain form
10852 -216498 -430573 140030 340102 -57606 63153 -133725 48464 31807 -298361 -109272
10841 110233 19168 135919 -35753 -25275 183685 -22763 11349 -21813 232169 316379 279777
10830 279777 -12134 -94733 16392 136964 12001 219060 -38688 -145305 -167155 162572 -244986
10818 -98109 -83388 -89929 -28407 90276 48723 -124307 -126687 190712 -25858 13746 52812 -40010
10805 -52880 -433854 11786 246741 -290832 -82741 -223070 380 -406477 -78930 48478 333893
10794 333893 -206434 115865 360442 1185 132223 -76042 74975 256408 246047 6631 -194039
10782 -178 -39243 -267942 88647 -97559 59433 -310881 -143405 66972 94617 16469 114992
10771 114992 -330 282195 -172448 115274 -123195 -346496 -33321 -93643 -28316 -488367 -4776
$$ packed form
10852b16498k14075A40030K00072e7606F3153a33725D8464j6657b98361a09272
10841A10233A9168J16751c5753J0478A83685b2763A1349b1813B32169Q4210l6602
10830B79777a2134q2599A6392J20572A2001K07059c8688j06617k1850A62572b44986
10818i8109J4721o541b8407I0276m1553a24307k380A90712b5858A3746L9066d0010
10805e2880l80974A1786K34955b90832h2741j40329C80d06477g8930D8478K85415
10794C33893b06434A15865K44577A185J31038g6042G4975J81433j0361F631a94039
10782a78l9065k28699H8647i7559E9433c10881a43405F6972K7645A6469R8523
10771A14992c30B82195a72448A15274a23195k23301c3321o0322b8316m60051d776
$$ plain form
10759 29111 -187776 -130629 -537630 43201 112157 -120038 -240056 60208 -44334 -18658 31853
10747 -293254 -106410 -208013 43910 144933 60368 -398702 100174 -140515 -206091 -53128
10736 304209 -144966 129485 -154755 168625 -9183 -578181 234041 83025 -63992 173415
10725 48640 21950 -243285 -152245 44481 -164766 -38310 -281096 269443 12677 -16528 62974
10713 -35211 371885 -44336 49946 -216745 -42537 -234545 308337 -47666 -53942 -287203 162102
10701 -116184 -109069 -235180 -74825 71800 -219883 -135447 -354397 20747 434042 -22630 76274
10689 -129843 -116251 -47381 -236941 -100534 -57155 61820 4615 -189195 -209385 144617 135864
10678 135864 101833 -305951 -301234 -124275 22097 -49352 175315 -53657 -68733 27285 193431
$$ packed form
10759B9111a87776N7147m07001D3201O8956a20038j20018F0208d4334a8658C1853
10747b93254a06410j01603D3910J01023F0368c98702A00174a40515o5576e3128
10736C04209a44966A29485a54755A68625i183n68998B34041H3025f3992A73415
10725D8640B1950b43285R1040D4481a64766c8310k42786B69443A2677a6528F2974
10713c5211C71885d4336D9946b16745d2537j92008C08337d7666o276k33261A62102
10701a16184P115j26111g4825G1800b19883Q4436k18950B0747M13295b2630G6274
10689a29843J3592d7381j89560a00534M3379F1820D615a89195k0190A44617q753
10678A35864l4031c05951M717a24275B2097d9352A75315e3657j5076B7285J66146
$$ plain form
10667 193431 37423 -226133 -205625 -248852 -190432 285496 133071 -306333 -157412 -231874
10657 -231874 -65701 250949 243441 292836 -247226 11865 31524 -124608 212157 416474 -139964
10645 -63312 -299733 294228 97357 14492 5319 -244025 103836 62347 -74568 -34840 -20362
10634 -20362 119170 121958 56051 -215800 -259104 -144014 -180620 -20778 -18704 -159211 11493
10622 3112 5303 134701 -282603 -206775 -271187 -200100 -280650 31892 -138443 27269 -28654
10610 -99755 -83657 163405 -68826 248765 62620 109205 200479 -23109 -331649 -27493 55065
10598 100129 -167016 -122663 73411 -133566 -5926 60895 -151986 -37073 -91916 -450114 -270104
10587 -270104 371371 69333 -134911 83126 -136520 49319 -26274 -173490 107651 234892
$$ packed form
10667A93431C7423b26133K0508m3227N8420B85496A33071c06333J48921p4462
10657b31874f5701B50949p508M9395b47226A1865J9659a24608B12157K04317a39964
10645f3312k36421B94228I7357A4492E319b44025A03836m1489g4568c4840J4478
10634b0362A19170K788E6051b15800m3304J15090l6606b0778K074j40507A1493
10622C112K191J29398b82603P5828o4412P1087q0550C1892a38443B7269b8654
10610i9755J6098A63405f8826B48765F2620M6585R1274b3109l08540b7493E5065
10598A00129a67016M4353G3411a33566e926F0895a51986c7073n4843l58198J80010
10587b70104C71371F9333a34911H3126a36520D9319b6274j47216A07651J27241
$$ plain form
10577 234892 -207918 5393 -97587 -290261 172347 -64544 -66063 27054 -78036 -182180 419065
10565 -147546 -138314 91720 30814 -175876 -67443 357191 74245 101858 -276535 -106191 -171820
10554 -171820 -326842 -162984 84891 31922 -145049 43697 28704 -14793 -48476 108958 -72571
10542 -3434 46145 -303256 334642 -45785 -77347 -138812 56348 263571 -67836 6326 -116946
10530 31419 -101552 51550 13402 139743 -93623 69347 216642 -463938 78740 -147903 -96642
10519 -96642 -33603 74218 152059 30697 114697 -29359 49 78774 86371 -230815 94117 2260
10506 -316909 181619 -80576 -19797 109480 -79881 -87826 189892 -108391 -188575 -300667 -281533
10495 -281533 -98883 22346 -187978 -131934 -104380 57249 58810 65032 153505 55324 52691 -101580
$$ packed form
10577B34892b07918E393i7587j92674A72347f4544j519B7054g8036j04144D19065
10565a47546R232I1720C0814a75876f7443C57191G4245K7613b76535a06191o5629
10554a71820j55022a62984H4891C1922a45049D3697j4993a4793l3683A08958g2571
10542c434D6145c03256C34642d5785l1562o1465E6348K07223f7836F326a16946
10530C1419a01552E1550A3402J26341i3623F9347J47295d63938G8740a47903N1261
10519i6642c3603G4218P7841C0697Q4000b9359D9P8725P597b30815I4117B260
10506c16909A81619h0576a9797A09480g9881p945A89892a08391q0184j12092J9134
10495b81533i8883B2346a87978N6044K7554E7249J561O222Q8473E5324k633a01580
$$ plain form
10482 -47091 280168 -113645 58113 290563 118720 -152763 -167302 -161445 279953 19429 -341400
10470 201858 55736 270516 86320 122244 16304 -161966 -126756 -77278 78355 -80549 -93156
10459 -93156 136928 -346991 48739 -3152 -22174 -30197 2306 -19281 -43658 -1658 -215409 57659
10446 78732 -45599 102313 -183848 65768 -231472 -232124 25024 -77273 -442461 -2913 8606 -174082
10433 -128762 -451441 -235099 160488 -129271 125398 138851 131088 -19906 82249 -8346 -185624
10422 -185624 -268822 -6531 180915 -105307 365115 311932 169655 147930 -294611 119254
10411 214554 19422 -142445 203856 30183 200095 26813 -341006 88194 109273 110460 55092
10399 278363 116683 47991 -30841 -48231 -11957 261444 194950 12279 68584 -52254 88371
$$ packed form
10482d7091B80168a13645E8113K32450A18720a52763j4539N857B79953A9429c41400
10470B01858E5736K14780H6320L5924A6304a61966L5210M9478G8355h0549j2607
10459i3156A36928c46991D8739c152j9022q023B306a9281k4377a658k13751E7659
10446G8732d5599A02313a83848F5768b31472o52B5024g7273l65188b913H606a74082
10433a28762l22679K16342A60488a29271A25398J3453p763a9906H2249h346j77278
10422a85624q3198f531A80915a05307C65115n3183j42277k1725b94611A19254
10411B14554A9422a42445B03856C0183J69912B6813c41006H8194K1079J187E5092
10399B78363A16683D7991c0841j7390a1957B61444o6494A2279N6305e2254H8371
$$ plain form
10387 139767 -60808 -3923 1601 69945 -61527 293478 302423 261834 379700 126635 213412
10376 213412 72693 170705 -270547 -39761 220168 238112 319353 488251 603831 432722
10366 432722 631460 548785 314156 272665 363553 -19487 240129 238035 -107759 375036 175669
10354 287547 30426 98633 449661 410153 734580 307227 704525 231004 492723 -198760
10343 430996 210273 -25803 208420 114108 394274 -31853 233628 222418 -139610 299237
10332 278634 39982 267791 -32295 48796 142425 -79509 6090 171056 12830 123751 316773
10321 316773 258002 137266 251747 -24486 -24133 34703 313983 100173 -356888 200752 188108
10310 188108 116513 -41145 147721 -70493 121431 122634 57432 17040 48586 164256 146277
$$ packed form
10387A39767f0808c923A601O8344f1527B93478Q945m0589J17866A26635Q6777
10376B13412G2693R8012b70547c9761B20168J7944Q1241J68898J15580j71109
10366D32722J98738q2675k34629m1491R0888a9487B40129k094a07759C75036A75669
10354B87547C0426O8207L51028l9508L24427C07227L97298B31004K61719a98760
10343D30996B10273b5803B08420r4312K80166c1853B33628j1210a39610B99237
10332B78634C9982K27809c2295D8796R3629g9509F090J64966A2830J10921J93022
10321C16773n8771j20736J14481b4486L53C4703K79280A00173c56888B00752j2644
10310A88108p1595d1145A47721g0493A21431J203E7432A7040L1546J15670j7979
$$ plain form
10299 146277 21320 -99370 -12885 28417 54396 -254535 299015 -75459 -104591 34920 -24559
10287 -113494 -293225 -9283 -395214 23949 406414 -373880 260697 116868 -20641 197171
10276 214414 -93120 -277263 63715 1204 239885 51272 30014 -200097 6716 69998 33094
10264 -10036 102933 -153008 166295 207131 365124 289933 126104 -210676 -274394 -122095
10253 -39641 -32933 -31954 -403160 57156 92520 -446396 -26884 -167672 171 -241348 188293 314075
10241 314075 -26287 -84186 -132823 -101694 -28260 -5940 -66977 197323 45080 148963 25209
10229 -279338 209749 166302 -307526 -238975 94690 -184981 -270569 233381 -232408 -139651
10219 -139651 121823 -216926 -360646 -196229 -249851 -158085 -84539 -330809 31153 140339
$$ packed form
10299A46277B1320i9370a2885B8417K5979b54535B99015g5459k9132C4920b4559
10287a13494j79731i283l85931B3949L82465c73880B60697A16868b0641A97171
10276B14414i3120j84143F3715A204K38681E1272k1258b00097F716O3282C3094
10264a0036A02933a53008A66295M0836J57993p5191A26104b10676o3718a22095
10253c9641O708R79l71206E7156L5364d46396b6884j40788A71b41348A88293J25782
10241C14075b6287n7899m8637L1129b8260e940o1037A97323D5080J03883B5209
10229b79338B09749m3447c07526O8551I4690a84981q5588B33381b32408R2757
10219a39651A21823b16926j43720J64417n3622R1766P3546k46270C1153J09186
$$ plain form
10209 140339 -5565 94434 -295227 -189346 -54169 -101585 -65438 -46157 119356 30256 -141346
10197 255128 -82175 -127791 283299 162687 288920 -292208 -53734 109578 -14933 -142912
10187 -142912 -242914 -174806 -200948 -44422 -26832 -335521 407986 -322678 30994 -123565
10176 -32867 183850 -100855 -137153 -314139 48969 168923 186694 136812 -93314 -12549 133321
10164 203762 -180502 -260864 -178949 -375751 -33916 -120180 -255447 41723 -68048 18776 -292878
10152 74429 99035 204083 25333 -2719 120156 -147514 -593788 -173617 40531 -121411 -98517
10141 -98517 126888 222813 186490 1232 63497 -269839 1190 26477 -230423 -400778 -114692
10129 -74048 -23067 47179 -454481 114436 81822 347206 -258676 -352043 -95938 -198505 -194004
$$ packed form
10209A40339e565I4434b95227J05881e4169m7416L6147J9281A19356C0256a41346
10197B55128h2175m5616B83299j20612J26233b92208e3734A09578a4933j27979
10187a42912j00002O8108k6142d4422J7590l08689D07986c22678C0994a23565
10176c2867A83850a00855l6298j76986D8969J19954J7771m9882i3314a2549A33321
10164B03762a80502q0362Q1915j96802c3916q6264j35267D1723f8048A8776b92878
10152G4429K4606J05048B5333b719A20156a47514m46274a73617D0531a21411K2894
10141i8517A26888R5925l6323A232O2265b69839A190K5287b30423j70355a14692
10129g4048b3067D7179d54481A14436l2614K65384b58676r3367i5938j02567M501
$$ plain form
10118 -194004 219181 -155193 88197 -36756 -30780 -362219 179420 -381771 -265411 -36490
10107 219893 81906 -246819 193183 -278240 -59616 -8054 150074 109731 -91288 -241261 179495
10095 40134 132993 -64830 148968 17608 -239621 -186276 -6441 -91438 -178354 -126991 -332361
10084 -332361 55175 -152367 -15173 -73909 -240515 192633 -16363 -110785 -294360 -168551
10074 -168551 -238767 -52300 202310 -175923 -98832 180741 114076 95882 238861 -187677
10063 179537 61194 85344 -215031 106942 -193860 -148391 102066 -83464 -275761 89735
10052 -215698 51681 -41491 -19979 90539 -234370 93270 75459 -22018 -143319 -2923 -74959
10041 -74959 -239557 -176036 -226097 -151924 -322895 372865 -105262 -149170 -100836 -193451 -105484
$$ packed form
10118a94004B19181a55193H8197c6756N976l31439A79420c81771J16360c6490
10107B19893H1906b46819A93183b78240e9616h054A50074m0343i1288j49973A79495
10095D0134R2859f4830A48968A7608b39621N3345f441q4997q6916N1363k05370
10084c32361E5175a52367a5173n8736j66606A92633a6363r4422j83575J25809
10074a68551p0216e2300B02310a75923P7091A80741o6665j8194J42979a87677
10063A79537F1194K4150b15031A06942a93860M5469A02066h3464j92297H9735
10052b15698E1681d1491a9979I0539b34370I3270j7811b2018j21301b923p2036
10041g4959j64598O3521n0061P4173j70971C72865a05262m3908M8334r2615Q7967
$$ plain form
10030 -105484 160764 -37685 -132710 -52067 135151 -410673 -54252 -227724 72495 -12618 -212524
10019 -212524 -57069 -198414 -122502 262324 328804 -321068 155323 -22521 -437300 -171197
10008 -292006 -82549 -177717 -38477 -78353 -53754 8507 -112728 -54971 -256235 56073 223565
9997 223565 -209694 -71929 203879 -80232 232537 57551 -235406 -171672 -125127 -151470 -46020
9985 -73838 -59412 -65378 258559 59576 -132470 -502711 37006 36258 106417 -190743 13895 -107116
9972 100077 93153 -62594 -28383 -128912 -202615 125242 160896 46947 -19052 245863 -279969
9960 -61831 -123555 -43551 179514 90021 199834 -53290 36580 -102088 -148533 -187279 20212
9948 74199 -51113 3525 -82510 -62861 139569 -118837 159049 -49207 -149792 -55179 124944
$$ packed form
10030a05484A60764c7685r5025e2067A35151d10673e4252j73472G2495a2618j99906
10019b12524e7069j41345P5912B62324O6480c21068A55323b2521m14779a71197
10008b92006h2549r5168c8477l9876K4599H507a12728e4971k01264E6073J67492
9997B23565b09694g1929B03879h0232B32537E7551b35406O3734M6545k6343d6020
9985g3838J4426n966B58559E9576a32470l70241C7006p48P0159a90743A3895a07116
9972A00077o924f2594b8383j00529p3703A25242L5654D6947a9052B45863b79969
9960f1831o1724d3551A79514q9493J09813e3290C6580a02088m6445l8746B0212
9948G4199e1113C525h2510J9649A39569a18837A59049d9207j00585e5179A24944
$$ plain form
9936 -42809 -249901 -522052 51912 130718 -102009 -195107 -287997 -91218 371838 -37153 -133543
9925 -133543 -131581 -138943 -227911 72656 100657 -74933 -139386 -140903 -77778 -227389 91683 127189
9913 127189 -84780 196025 -212770 -211243 50466 -154838 33732 90593 149777 -115239 -227872
9902 -227872 190578 -176522 -46899 10343 303705 119921 -361329 -43737 -156915 258569
9891 -69799 -20120 145239 -85340 191213 -87368 380129 -206622 -201577 206340 -244705 -27641
9879 -3043 116692 -270945 -110216 27684 -277410 13305 36584 -388185 128488 -339570 -383943
9868 -383943 -94132 -307963 -112319 -378705 -134291 -124718 -59990 -226889 -48207 3619 -3939
9856 -112513 331906 1080 -182540 16688 -52764 -108917 68595 -48011 2192 -187364 -29431
$$ packed form
9936d2809k07092k72151E1912P8806a02009r3098r2890i1218C71838c7153r6390
9925a33543J962p362q8968G2656K8001g4933o4453j517O3125j49611I1683L5506
9913A27189h4780A96025b12770J527E0466a54838C3732N6861N9184a15239j12633
9902b27872A90578a76522d6899A0343K93362A19921c61329d3737j13178B58569
9891f9799b0120A45239h5340A91213h7368C80129b06622N045B06340b44705b7641
9879c043A16692b70945a10216B7684b77410A3305K3279c88185A28488c39570m4373
9868c83943i4132k13831a12319k66386a34291R573e9990j66899d8207C619c939
9856a12513C31906A080a82540A6688e2764n6153F8595d8011B192a87364b9431
$$ plain form
9844 -51877 300441 -70831 27239 27773 -119454 -142927 -211533 -305371 -103304 -37805 -266849
9833 -266849 -266598 -134040 34745 97035 112613 -252640 -120284 -195197 -64595 -122445 -321481
9822 -321481 -95322 34797 -349918 114210 -55476 -184031 239324 181857 338788 -71796 -333027
9811 -333027 155406 -380319 -156773 -69636 -168536 110266 -23531 -173514 -143466 -63609 279902
9799 -185449 168441 437197 -232520 -92851 -21241 -421457 183808 -152297 -14200 -45316
9789 -45316 103137 180387 -255234 76849 -387048 216925 -118518 -19406 -34099 5846 -245888
9777 -188964 90759 197766 -55022 194125 86308 -39403 -294193 -53318 286036 55070 38483
9766 38483 -106571 -304768 -232708 217058 -107387 -70801 -111191 -9101 364974 141518 -327546
$$ packed form
9844e1877C00441g0831B7239N34a19454k3473o8606r3838a03304c7805k29044
9833b66849K51J32558C4745O2290J5578b52640a20284p4913f4595n7850j99036
9822c21481i5322C4797c49918A14210e5476j28555B39324n7467J56931g1796k61231
9811c33027A55406c80319a56773f9636r8900A10266b3531j49983L0048f3609B79902
9799a85449A68441K68756b32520i2851b1241m00216A83808a52297a4200l1116
9789d5316A03137P7250b55234G6849c87048B16925a18518a9406j4693E846b45888
9777a88964I0759J07007e5022A94125H6308c9403k54790e3318B86036E5070j6587
9766C8483a06571j98197P2060B17058a07387L6586m0390i101C64974A41518c27546
$$ plain form
9754 -40595 49208 -234588 192039 344041 -30628 -257500 26913 -90343 -49594 204075 37241
9742 -154216 -157500 -61362 -74819 -309177 67510 55763 125200 -36400 -316804 79466 -21061
9730 -281555 -141934 -295366 46851 -184591 -35141 9560 -20885 109543 164055 240064 -156148
9718 -202310 324670 -130925 -160944 -40590 -98667 156112 -175834 163798 78009 21996 53464
9707 53464 164010 -126217 202738 -154174 3808 11397 243269 -120986 -182321 -266295 -130334
9695 -249054 -190303 -141809 -46714 50079 202117 -92938 65298 -252411 204575 22744 -104187
9683 78581 173620 107222 73704 15950 21742 -216095 -129049 48703 88958 -29070 -89862 -228592
9671 -228592 48388 163500 -10043 216105 67146 73103 17216 55880 -58762 -315417 227049
$$ packed form
9754d0595D9208b34588A92039J52002c0628k26872B6913i0343M0749B04075C7241
9742a54216l284f1362j3457k34358F7510j1747O9437c6400k80404G9466b1061
9730b81555J39621j53432D6851a84591c5141I560b0885A09543N4512P6009a56148
9718b02310C24670a30925l0019d0590n8077A56112a75834A63798G8009B1996L1468
9707E3464J10546a26217B02738a54174C808P589K31872a20986o1335q3974a30334
9695b49054N8751M8494d6714E0079J52038i2938F5298b52411B04575B2744a04187
9683G8581R5039o6398l3518A5950N792b16095Q7046D8703M0255b9070o0792j38730
9671b28592D8388J15112a0043B16105F7146N957A7216L8664e8762k56655B27049
$$ plain form
9659 38956 -255213 53526 -147868 -52497 -208867 -151545 -25933 34884 104916 -13970 83741
9647 -63093 -234518 -30472 91053 -25242 180451 -69350 8476 132723 -213215 35846 -39022
9635 47834 -58670 -107582 24988 142762 144511 -76335 163376 90315 10837 -147747 -112726
9624 -112726 -51199 333681 -18130 15604 -29086 372534 5151 -72601 42661 -254232 -71191
9612 -100422 12529 -270469 -252601 -39160 -128721 67576 154855 -373481 -154708 -316630 -323695
9601 -323695 -96990 90532 -139334 78952 -27983 34639 -58027 -249998 97288 -192632 144649
9589 -402600 -88968 160973 -166376 -226692 -84294 -423184 -64109 -558063 -49967 -462167 -37963
9577 -119973 -256236 -281753 13866 -116907 -398505 -152258 191753 94226 -204584 -33346
$$ packed form
9659C8956b55213E3526a47868e2497j56370N7322b5933C4884P0032a3970H3741
9647f3093j71425c0472I1053b5242A80451f9350H476J24247b13215C5846c9022
9635D7834e8670m8912B4988J17774J749g6335A63376p3061A0837a47747L5021
9624a12726e1199C33681a8130A5604b9086C72534E151g2601D2661b54232g1191
9612a00422A2529b70469J7868c9160q9561F7576Q7279c73481a54708j61922p065
9601c23695i6990I0532a39334G8952b7983C4639e8027j91971I7288a92632A44649
9589d02600h8968A60973a66376o0316h4294l38890f4109m93954d9967m12200c7963
9577a19973j36263k5517A3866a16907k81598a52258A91753I4226b04584c3346
$$ plain form
9566 -20040 -373742 -258491 -36989 -428693 -121064 120984 234905 -103169 -129208 -17936
9555 -483 -101129 67701 96199 12303 70092 -12550 118618 -43222 79328 99639 39255 65271
9543 65271 258327 -4893 48991 134467 -298105 73731 -42109 -197617 -73728 -135801 178395
9531 68507 110969 12979 71267 -387472 -401687 130043 156597 233913 -59715 97345 -218802
9519 -149947 -176457 -225532 224301 -9660 21132 -12020 9445 -118333 -186101 -487791 227355
9507 83948 -115106 -60242 158683 373959 -245943 -117727 238609 -59249 -74450 8682 54565
9496 54565 -37640 -12778 -355991 -291881 -98686 -478300 -22550 219160 -402657 -216888 -260655
9485 -260655 -57983 -217119 343928 -273069 -57719 -145465 -107237 -54370 9605 -42412 31517
$$ packed form
9566b0040l53702J15251c6989l91704a21064A20984J13921a03169k6039a7936
9555d83j00646F7701K8498A2303N7789a2550A18618d3222G9328K0311C9255K6016
9543F5271J93056d893D8991Q5476b98105G3731d2109j55508g3728o2073A78395
9531F8507M2462A2979N8288c87472j4215A30043K6554P7316e9715I7345b18802
9519a49947k6510m9075B24301i660B1132a2020I445a18333o7768l01690B27355
9507H3948a15106N4864A58683K15276b45943a17727B38609e9249j5201H682M5883
9496E4565c7640a2778l43213O4110i8686l79614b2550B19160d02657J85769m3767
9485b60655e7983j59136C43928b73069e7719q7746L8228N2867I605d2412C1517
$$ plain form
9473 -16158 -58170 -131525 -344173 32244 -136874 -183422 -66236 -134281 82944 -275561 -71184
9461 38399 377798 -112822 -260341 -83524 -185677 13602 -310204 -95496 89037 -7900 113726
9449 -89286 -30231 -117502 128011 -40994 250709 127691 128417 152495 -40132 -54965 201493
9437 -29844 -69575 -82593 99551 -148206 177554 165238 -103912 62288 -175420 106622 -188218
9425 -47624 -35880 -181756 21695 -90637 -268508 -159599 -103861 320559 -106845 97274 26558
9413 -463657 -103756 -110207 -238287 231003 -165016 -207106 -85170 -360061 283160 -152140
9402 -244248 72576 -170150 16859 -195173 -172945 59509 -31557 -114084 6184 -326773 -318333
9391 -318333 -53509 -207012 -302805 -161502 65467 -88672 -28499 -37368 94944 210263 -101409
$$ packed form
9473a6158m2012p3355k12648C2244a36874m6548f6236o8045H2944b75561g1184
9461C8399L39399a12822j47519h3524j02153A3602c10204i5496H9037g900A13726
9449h9286c0231q7271A28011d0994B50709j23018P26K4078d0132j4833B01493
9437b9844l9731j3018I9551a48206A77554j2316a03912F2288a75420A06622a88218
9425d7624J1744j45876B1695i0637j77871J08909N5738C20559a06845I7274B6558
9413d63657a03756o451j28080B31003a65016m2090h5170k74891B83160a52140
9402b44248G2576a70150A6859a95173K2228E9509c1557q2527F184c26773Q440
9391c18333e3509j53503r5793J41303F5467h8672b8499q869I4944J15319a01409
$$ plain form
9379 -12966 51115 -24302 54164 -82194 -135008 338431 305954 -90294 -39236 -183759 -401916
9368 -401916 -289835 -212217 -211189 182674 -181566 -327402 -66702 -20704 59229 147959 76163
9357 76163 45131 -171282 189369 -128671 139881 7392 79414 54825 -142350 -15716 -35285
9346 -35285 -10940 86922 -41043 -206499 124571 -30920 -264636 -100561 -117368 -98130 -237245
9335 -237245 216202 -331630 11136 122417 -137233 -50316 76004 20128 -403432 76529 -204167
9323 214376 -129132 60457 -70922 -35779 -133465 -14497 43737 149994 -256350 -194577 208047
9311 22936 178481 -235029 -226485 19250 59627 -25462 -61036 235367 -225355 -26339 183355
9299 87728 -9585 -20078 249429 -42112 -958 292542 15192 -73801 -67991 226940 68667 -154103
$$ packed form
9379a2966E1115b4302E4164h2194n2814C38431l2477i0294c9236j44523k18157
9368d01916J12081P7618J028A82674a81566j45836f6702b0704E9229Q8730p1796
9357G6163l1032a71282A89369a28671A39881G392P2022k4589a42350a5716j9569
9346c5285a0940H6922d1043j65456A24571c0920k33716a00561j6807J9238j39115
9335b37245B16202c31630A1136J11281a37233e0316G6004B0128d03432G6529b04167
9323B14376a29132F0457g0922L5143r7686a4497D3737J06257b56350O1773B08047
9311B2936J55545b35029Q544A9250M0377b5462l5574B35367b25355b6339A83355
9299H7728i585j0493B49429d2112i58B92542A5192g3801N810B26940F8667a54103
$$ plain form
9286 -180507 -134956 -96350 35174 -213937 107943 111844 -436577 -218454 156333 17689 -204867
9274 200264 -9051 -200236 274794 -240048 173936 -111859 188594 192222 -167671 -210565 -21359
9262 -353384 -23011 -11226 -120675 -55013 -169523 46130 42943 -203347 -135623 -59296 -229081
9251 -229081 -296325 17053 83783 35970 -96629 -259503 197099 104142 -200038 -177494 167383
9239 -71561 -313130 -309456 -375811 285699 -125215 28877 -262414 -364672 -138439 35931 -74561
9227 -13437 -168551 -17712 -304602 -82560 -101345 -68545 85418 184048 -12405 -136459 -38957
9215 219463 35656 -17768 -113532 -52784 -264441 -443704 -140130 -414988 427332 -285151
9204 2251 96456 218495 -95817 54561 105120 -17686 -254610 116443 -169930 -79528 -114881
$$ packed form
9286a80507M5551L8606C5174b13937A07943L901d36577K18123A56333A7689b04867
9274B00264i051j91185B74794b40048A73936a11859A88594L628a67671m2894b1359
9262c53384b3011a1226j09449e5013j14510D6130l187b03347O7724e9296j69785
9251b29081o7244A7053O6730C5970i6629j62874A97099r2957b00038K2544A67383
9239g1561k41569L674o6355B85699a25215B8877b62414j02258a38439C5931g4561
9227a3437j55114a7712k86890h2560j8785L2800H5418R8630a2405j24054c8957
9215B19463C5656a7768r5764e2784k11657j79263a40130k74858D27332b85151
9204B251R4205J22039i5817E4561N0559a7686k36924A16443a69930g9528l5353
$$ plain form
9193 -114881 -227301 -403902 32008 21630 -517045 -38283 65710 -19944 -89590 72705 -174674
9181 -244080 -31579 144139 89431 -190441 132681 -423968 182933 13332 272020 -43501
9170 -95929 42335 120653 -218409 -313168 -116465 -107195 -349680 -162015 -337743 -285194 -133539
9158 267546 282086 -472002 -37502 -55772 -99073 57716 123257 -14552 -18350 -133119 -270900
9147 -270900 -42643 -202323 -280124 103659 -91163 -9317 39457 -20511 120685 -221913 -281722
9136 -281722 -70127 -33899 -22651 -118012 -230590 -384221 -45027 -213584 -38967 254249 -73331
9124 -151080 -184896 -321778 -239579 -115173 335360 -269648 -35841 -139434 -144327 252012 -53623
9112 33192 -283265 -67377 -104066 -333340 -126617 -61981 -189104 296759 77810 -98482 -222827
$$ packed form
9193a14881j12420j76601C2008j0378e17045c8283F5710a9944o9646G2705a74674
9181b44080c1579A44139n4708a90441A32681d23968A82933A3332K58688d3501
9170i5929D2335P8318b18409r4759a16465R270k42485a62015j75728N2549a33539
9158B67546J4540d72002c7502j8270m3301E7716O5541a4552l798j14769j37781
9147b70900d2643j59680p7801A03659i1163i317C9457b0511A20685b21913n9809
9136b81722g0127c3899J1248r5361j12578j53631d5027j68557c8967B54249g3331
9124a51080l3816j36882Q2199a15173C35360b69648c5841j03593m893B52012e3623
9112C3192b83265f7377l6689k29274a26617f1981j27123B96759G7810i8482j24345
$$ plain form
9101 -222827 -216002 203471 -83260 -221369 -87817 53932 -269614 83750 300813 208262 140960
9090 140960 -208934 -117184 -349152 -44763 127028 -361947 182827 85440 -322609 -4486 338615
9078 -75533 -282963 221073 239873 -160417 266983 103160 -26745 -151788 -128942 -40120 5717
9066 -197687 36365 145098 66123 231080 -50512 -27717 -184685 -48366 -27967 -175129 -151976
9055 -151976 14319 -194350 -105582 87743 43713 122425 -51477 224989 -157419 96887 -87283
9043 238361 -98967 -150010 1737 -99533 45899 32484 17988 98329 6847 17280 -95596 -130447
9031 -130447 -130138 -126261 -308647 101229 -146701 -126187 39402 -153519 -121580 -114387 -252644
9020 -252644 -344906 -47130 56031 -166851 -150341 140437 25278 -66901 47383 121623 -169907
$$ packed form
9101b22827O825B03471h3260j38109h7817E3932b69614H3750K17063r2551o7302
9090A40960b08934R1750k31968d4763A27028c61947A82827H5440c22609d486C38615
9078g5533k07430B21073J8800a60417B66983A03160b6745j25043K2846d0120E717
9066a97687C6365J08733F6123J64957e0512K2795j56968d8366K0399j47162K3153
9055a51976A4319a94350Q8768H7743D3713P8712e1477B24989a57419I6887h7283
9043B38361i8967n1043A737i9533D5899j3415j4496Q0341F847J0433i5596l4851
9031a30447L09L877j82386A01229a46701K0514C9402a53519L1939P193j38257
9020b52644r2262d7130E6031a66851J6510A40437B5278f6901D7383P4240a69907
$$ plain form
9008 -187706 282473 -280447 53938 60263 -294734 35908 -106954 -103446 -33553 -78011 -186900
8997 -186900 -291507 49842 -190342 -42592 -122911 35481 -72586 -213733 67373 186637 5209
8985 -102543 56934 -219271 -129887 10389 -167288 3950 86005 -36558 111165 71903 -81541
8973 386778 184124 93640 -18107 20074 37665 97857 33182 -137121 90943 -247578 123241
8961 -137495 -74424 56981 58404 27936 203102 -303606 -56513 -194152 -174617 -117735 -231719
8950 -231719 -88926 -263925 -297913 -87589 -84647 -167951 -89995 -200683 -141790 -128114 204490
8938 -315097 -26740 -165578 36814 608105 23345 -151433 -185938 -160267 -97312 451582 169098
8926 123905 416488 770114 1476499 5085182 16665820 10236336 2876250 795442 404787
$$ packed form
9008a87706B82473b80447E3938O325b94734C5908a06954L508c3553m4458j08889
8997a86900j04607D9842a90342d2592q0319C5481g2586j41147F7373J19264E209
8985a02543E6934b19271Q9384A0389a67288C950Q2055c6558A11165l9262h1541
8973C86778A84124r0484a8107B0074J7591O0192C3182a37121I0943b47578A23241
8961a37495O3071E6981J423B7936J75166c03606e6513j37639J9535N6882j13984
8950b31719h8926j74999l3988h7589K942q3304P7956j10688N8893J3676B04490
8938c15097b6740j38838C6814N71291B3345a51433l4505K5671O2955D51582A69098
8926A23905K92583L53626P06385L608683J1580638o429484B876250G95442l90655
$$ plain form
8917 404787 204322 226897 113716 157805 -291549 -81171 81006 -51835 469659 396329 170942
8905 -129396 313204 7963 -189292 126802 -147849 -190157 -28842 -179398 271332 150414
8895 150414 -157057 -137058 -129231 -14644 -283955 25384 41763 -2152 -19672 -215290 -17490
8883 -2713 146469 -238900 389734 -457838 16636 167725 -21337 -174875 -36980 -75442 149912
8871 214036 -30939 39386 -271243 -38065 -447067 -55601 -229570 -64658 80026 50702 9389
$$ packed form
8917D04787k00465K2575j13181M4089b91549h1171H1006e1835D69659p3330A70942
8905a29396C13204G963a89292A26802a47849m2308b8842j50556B71332j20918
8895A50414a57057J9999P827a4644k69311B5384J6379b152j7520j95618a7490
8883b713A46469b38900C89734d57838A6636J51089b1337j53538c6980l8462A49912
8871B14036c0939C9386b71243c8065m09002e5601j73969f4658H0026k9324I389
$$ [...]
##END NTUPLES=NMR SPECTRUM
##END=
