##TITLE=AC1582_13IEXT2718_8214273_05kkdScx9Q
##JCAMPDX= 6.0         $$ Bruker NMR JCAMP-DX V2.0
##DATA TYPE= NMR SPECTRUM
##DATA CLASS= NTUPLES
##ORIGIN= BRUKER
##OWNER= Administrator
$$ 1.72 TOPSPIN		Version 2.1
$$ 2013-10-05 00:13:23.187 -0700  Administrator@X
$$ Compression mode = diff/dup
##.OBSERVE FREQUENCY= 400.02188249412
##.OBSERVE NUCLEUS= ^1H
##.ACQUISITION MODE= SIMULTANEOUS (DQD)
##.ACQUISITION SCHEME= undefined
##.AVERAGES= 64
##.DIGITISER RES= 22
##SPECTROMETER/DATA SYSTEM= spect
##.PULSE SEQUENCE= noesygpps1d.comp
##.SOLVENT NAME= COFFEE_meoh
##.SHIFT REFERENCE= INTERNAL, COFFEE_meoh, 1, 14.96079
##AUDIT TRAIL= $$ (NUMBER, WHEN, WHO, WHERE, PROCESS, VERSION, WHAT)
$$ ##TITLE= Audit trail, TOPSPIN		Version 2.1
$$ ##JCAMPDX= 5.01
$$ ##ORIGIN= Bruker BioSpin GmbH
$$ ##OWNER= Administrator
$$ $$ E:\/data/COFFEE/nmr/AC1582_13IEXT2718_8214273_05kkdScx9Q/22/pdata/1/auditp.txt
$$ ##AUDIT TRAIL=  $$ (NUMBER, WHEN, WHO, WHERE, PROCESS, VERSION, WHAT)
(   1,<2013-10-05 00:13:18.499 -0700>,<Administrator>,<X>,<go>,<TOPSPIN 2.1>,
      <created by zg
	started at 2013-10-05 00:01:48.591 -0700,
	POWCHK enabled, PULCHK disabled,
       configuration hash MD5:
       C8 4E 4E 5D D3 5C D8 9E 9F 52 82 E0 59 8A DE 15
       data hash MD5: 64K
       14 BB 83 A4 9F AB 6B EC 49 9C 70 74 BB 8F 4B 1D>)
(   2,<2013-10-05 00:13:21.359 -0700>,<Administrator>,<X>,<proc1d>,<TOPSPIN 2.1>,
      <Start of raw data processing
       efp LB = 0.3 FT_mod = 6 PKNL = 1 PHC0 = 0 PHC1 = 0 SI = 128K 
       data hash MD5: 128K
       A5 97 7A C6 85 C7 A7 45 D4 51 77 61 C4 52 BD 1E>)
(   3,<2013-10-05 00:13:22.249 -0700>,<Administrator>,<X>,<proc1d>,<TOPSPIN 2.1>,
      <pk PHC0 = -85.12756 PHC1 = 0 
       data hash MD5: 128K
       86 6F A1 C5 7F 83 09 3E DD 45 97 89 93 E8 25 95>)
(   4,<2013-10-05 00:13:22.687 -0700>,<Administrator>,<X>,<proc1d>,<TOPSPIN 2.1>,
      <abs ABSG = 1 
       data hash MD5: 128K
       83 A9 63 F1 6F 4E 2D 35 DF 20 EE AF 57 54 0D 0E>)
(   5,<2013-10-05 00:13:22.796 -0700>,<Administrator>,<X>,<proc1d>,<TOPSPIN 2.1>,
      <abs ABSG = 2 
       data hash MD5: 128K
       55 82 BB 95 42 C6 87 00 CF E5 41 78 23 34 DE 92>)
(   6,<2013-10-05 00:13:22.874 -0700>,<Administrator>,<X>,<proc1d>,<TOPSPIN 2.1>,
      <abs ABSG = 3 
       data hash MD5: 128K
       A2 F7 87 3B 08 F0 23 E3 67 C1 4F 09 45 13 6E 6E>)
(   7,<2013-10-05 00:13:22.937 -0700>,<Administrator>,<X>,<proc1d>,<TOPSPIN 2.1>,
      <abs ABSG = 4 
       data hash MD5: 128K
       D1 61 38 44 05 29 3C 26 11 F9 86 2B 55 D1 80 DE>)
(   8,<2013-10-05 00:13:23.031 -0700>,<Administrator>,<X>,<proc1d>,<TOPSPIN 2.1>,
      <abs ABSG = 5 
       data hash MD5: 128K
       77 A7 06 F4 0D 77 3F 93 BD 58 36 CD 0B 7A 73 8C>)
$$ ##END=
$$ 
$$ $$ hash MD5
$$ $$ 65 9B DB 01 C4 E8 51 C8 F6 E8 52 8F 14 9E 87 6D
##$RELAX= 
##$RELAX= 
##$RELAX= 
##$RELAX= 
##$RELAX= 
##$RELAX= 
##$RELAX= 
##$RELAX= 
$$ Bruker specific parameters
$$ --------------------------
##$DU= <E:\>
##$EXPNO= 22
$$ [...]
##$TP07= 0
##$TPNAME0= <>
##$TPNAME1= <>
##$TPNAME2= <>
##$TPNAME3= <>
##$TPNAME4= <>
##$TPNAME5= <>
##$TPNAME6= <>
##$TPNAME7= <>
##$TPOAL= (0..7)
0.5 0.5 0.5 0.5 0.5 0.5 0.5 0.5
##$TPOFFS= (0..7)
0 0 0 0 0 0 0 0
##$TUNHIN= 0
##$TUNHOUT= 0
##$TUNXOUT= 0
##$USERA1= <user>
##$USERA2= <user>
##$USERA3= <user>
##$USERA4= <user>
##$USERA5= <user>
##$V9= 5
##$VALIST= <valist>
##$VCLIST= <CCCCCCCCCCCCCCC>
##$VD= 0
##$VDLIST= <DDDDDDDDDDDDDDD>
##$VPLIST= <PPPPPPPPPPPPPPP>
##$VTLIST= <TTTTTTTTTTTTTTT>
##$WBST= 2048
##$WBSW= 25
##$XGAIN= (0..3)
0 0 0 0
##$XL= 0
##$YL= 0
##$YMAX_a= 6186975
##$YMIN_a= -11030093
##$ZGOPTNS= <>
##$ZL1= 120
##$ZL2= 120
##$ZL3= 120
##$ZL4= 120
##$ABSF1= 14.96079
##$ABSF2= -5.597392
##$ABSG= 5
##$ABSL= 3
##$ALPHA= 0
##$AQORDER= 0
##$ASSFAC= 0
##$ASSFACI= 0
##$ASSFACX= 0
##$ASSWID= 0
##$AUNMP= <proc_prof1d_extract.lims>
##$AXLEFT= 0
##$AXNAME= <>
##$AXNUC= <1H>
##$AXRIGHT= 0
##$AXTYPE= 0
##$AXUNIT= <>
##$AZFE= 0.1
##$AZFW= 0.1
##$BCFW= 0
##$BC_mod= 0
##$BYTORDP= 0
##$COROFFS= 0
##$CY= 15
##$DATMOD= 1
##$DC= 0
##$DFILT= <>
##$DTYPP= 0
##$F1P= 0
##$F2P= 0
##$FCOR= 0.5
##$FTSIZE= 131072
##$FT_mod= 6
##$GAMMA= 0
##$GB= 0
##$INTBC= 1
##$INTSCL= 1
##$ISEN= 128
##$LB= 0.3
##$LEV0= 0
##$LPBIN= 0
##$MAXI= 10000
##$MC2= 0
##$MEAN= 0
##$ME_mod= 0
##$MI= 0
##$NCOEF= 0
##$NC_proc= -2
##$NLEV= 6
##$NOISF1= 0
##$NOISF2= 0
##$NSP= 0
##$NTH_PI= 0
##$NZP= 0
##$OFFSET= 14.96079
##$PC= 1
##$PHC0= -85.12756
##$PHC1= 0
##$PH_mod= 1
##$PKNL= yes
##$PPARMOD= 0
##$PPDIAG= 0
##$PPIPTYP= 0
##$PPMPNUM= 2147483647
##$PPRESOL= 1
##$PSCAL= 4
##$PSIGN= 0
##$PYNMP= <proc.py>
##$REVERSE= no
##$SF= 400.020009720063
##$SI= 131072
##$SIGF1= 0
##$SIGF2= 0
##$SINO= 400
##$SIOLD= 131072
##$SPECTYP= <>
##$SREGLST= <1H.CDCl3>
##$SSB= 0
##$STSI= 131072
##$STSR= 0
##$SW_p= 8223.68421052631
##$SYMM= 0
##$S_DEV= 0
##$TDeff= 65536
##$TDoff= 0
##$TI= <>
##$TILT= no
##$TM1= 0
##$TM2= 0
##$TOPLEV= 0
##$USERP1= <user>
##$USERP2= <user>
##$USERP3= <user>
##$USERP4= <user>
##$USERP5= <user>
##$WDW= 1
##$XDIM= 131072
##$YMAX_p= 348750467
##$YMIN_p= -14204
##$CURPLOT= <Network HP LaserJet P1505>
##$CURPRIN= <$Network HP LaserJet P1505>
##$DFORMAT= <normdp>
##$LAYOUT= <+/1D_H.xwp>
##$LFORMAT= <normlp>
##$PFORMAT= <normpl>
##$SURQMSG= 1
$$ End of Bruker specific parameters
$$ ---------------------------------
##NTUPLES= NMR SPECTRUM
##VAR_NAME=  FREQUENCY,     SPECTRUM/REAL,   SPECTRUM/IMAG
##SYMBOL=    X,             R,               I
##VAR_TYPE=  INDEPENDENT,   DEPENDENT,       DEPENDENT
##VAR_FORM=  AFFN,          ASDF,            ASDF
##VAR_DIM=   131072,        131072,          131072
##UNITS=     HZ,            ARBITRARY UNITS, ARBITRARY UNITS
##FACTOR=    0.0627417313425164, 1,          1
##FIRST=     8223.62146879497, -1733,        -62817
##LAST=      0,             364,             -63227
##MIN=       0,             -14204,          0
##MAX=       8223.62146879497, 348750467,    0
$$ Real data points
##PAGE= N=1
##DATA TABLE= (X++(R..R)), XYDATA
$$ [...]
61774E18177n038m823m041l018k470k711l313l590l233k473j822j739k323l083
61760D74500l258k595j655j188j309j601j742j691j364o45K20O80N32J21k36o29
61744D58140j108j228n04P84J699J548N19n38p99n6J127J905J971J863K234L007
61728D70564L544L550L447L716M278M733M956N175N505N697N466M939M560M529
61714E34659M444L681K112K72j268k436l461m423n268o135p198q241q759q648
61700D89331q408q416q345p600o193m773l880l439l095k690k348k189k125j865
61686D23965j181k87J23m41j508j952j299l57k30r18j447j266q44q06j007r22
61670D09623n31l56p08j362j911k165k127j856j419r11n04m82j017j782j991j140
$$ y = [518177, 513139, 508316, 504275, 501257, 498787, 496076, 492763, 489173, 485940, 483467, 481645, 479906, 477583, 474500, 471242, 468647, 466992, 465804, 464495, 462894, 461152, 459461, 458097, 457452, 457672, 458352, 458884, 459005, 458769, 458140, 457032, 455804, 455300, 456084, 457783, 459331, 459850, 459312, 458513, 458457, 459584, 461489, 463460, 465323, 467557, 470564, 474108, 477658, 481105, 484821, 489099, 493832, 498788, 503963, 509468, 515165, 520631, 525570, 530130, 534659, 539103, 542784, 544896, 545168, 543900, 541464, 538003, 533580, 528312, 522177, 514979, 506738, 497979, 489331, 480923, 472507, 464162, 456562, 450369, 445596, 441716, 438277, 435182, 432492, 430144, 427955, 425830, 423965, 422784, 422497, 422620, 422179, 420671, 418719, 417420, 417063, 416833, 415915, 414468, 413202, 412358, 411552, 410545, 409623, 409092, 408736, 408028, 406666, 404755, 402590, 400463, 398607, 397188, 396277, 395773, 395291, 394274, 392492, 390501, 389361]
61654C89361M06J789K513K707K746L007L824N211O547P040O639O128O160O472
61640D50550O257N102L313J520P7j191k695m399n662n995n774n718n837n553m808
61625D19187m298m252l894k568p91N15J310K215L349M143M197L606K494Q84q91
61610D25206k231k997l751n137p161r173j0364j0407r860r706j0197j0424r482
61597C24316p777o531o166n976n385m725m497m498m215l585k954k568k434k453
61583B60552k443k218j827j489j271j107j180j753k502k529j459o6O21M26j40
61568B41615p55j434j970j918j207m13k30q00j549j659q67J65N41K36J06N70R60
61551B31391O75K83O89J556J707R99O69J500K632K864K277J813J770J775J879
$$ y = [389361, 389767, 391556, 394069, 396776, 399522, 402529, 406353, 411564, 418111, 425151, 431790, 437918, 444078, 450550, 456807, 461909, 465222, 466742, 466819, 465628, 462933, 458534, 452872, 446877, 441103, 435385, 429548, 423995, 419187, 414889, 410637, 406743, 404175, 403384, 403899, 405209, 407424, 410773, 414916, 419113, 422719, 425213, 426097, 425206, 422975, 419978, 416227, 411090, 403929, 394756, 384392, 373985, 364125, 354419, 344222, 333798, 324316, 316539, 310008, 303842, 297866, 292481, 287756, 283259, 278761, 274546, 270961, 268007, 265439, 263005, 260552, 258109, 255891, 254064, 252575, 251304, 250197, 249017, 247264, 244762, 242233, 240774, 240708, 241329, 241755, 241615, 240860, 239426, 237456, 235538, 234331, 233918, 233688, 232888, 231339, 229680, 228813, 228978, 229519, 229755, 229861, 230431, 231391, 232066, 232349, 233038, 234594, 236301, 237300, 237969, 239469, 242101, 244965, 247242, 249055, 250825, 252600, 254479]
61536B54479K673M065M932M475L265K431K172J768P85m29j449k307l068l523l590
61521B66679l649l966m098l445k233j339j172j303j279j202j260j237r63p69j029
61506B37735j427j238k64Q96J483J161J01j148j904j831j258p98o59n98m16j69
61490B29666J07M91R50J301J441J343Q67m5r15r18K40J896L059L209K391R76m27
61473B45632j097p42J48P58P21L32J08K75N67M55k58j013r55QR86J188Q23N61
61455B48497N49N40O73J314K169K355J629Q49Q55J387J583J165O77P60J615L041
61439B69658M605N847O588O968P065O772O261O183O878P610P225N551L531J969
61425C52711Q27l0j41Q55K313L109L001K809L140L513L105J995J156J141J269
$$ y = [254479, 257152, 261217, 266149, 270624, 273889, 276320, 278492, 280260, 281045, 280616, 279167, 276860, 273792, 270269, 266679, 263030, 259064, 254966, 251521, 249288, 247949, 246777, 245474, 244195, 242993, 241733, 240496, 239533, 238764, 237735, 236308, 235070, 234806, 235702, 237185, 238346, 238447, 237299, 235395, 233564, 232306, 231508, 230849, 230251, 229835, 229666, 229773, 230264, 231214, 232515, 233956, 235299, 236166, 236121, 235206, 234288, 234528, 236424, 239483, 242692, 245083, 246059, 245632, 244535, 243793, 243941, 244699, 245420, 245752, 245860, 246135, 246702, 247157, 246899, 245886, 244931, 244939, 245925, 247113, 247936, 248497, 249046, 249586, 250259, 251573, 253742, 256097, 257726, 258575, 259430, 260817, 262400, 263565, 264242, 265002, 266617, 269658, 274263, 280110, 286698, 293666, 300731, 307503, 313764, 319947, 326825, 334435, 341660, 347211, 350742, 352711, 353538, 353508, 353367, 354222, 356535, 359644, 362645, 365454, 368594, 372107, 375212, 377207, 378363, 379504, 380773]
61410C80773M08j572l558m508m561m584m901m996m446l564k961k869l135l479
61396C32047l540l049k280k018k599l264k969j714m88Rmm9q4k44l57j31L73Q22
61378C10461J018J008Q70O33L69J47l3j53j6O11J660K656L083K884K484K330K473
61361C32485K746L200M038N116N910O206O394O834P262P357P514Q468J0204J1956
61347D25690J3172J3982J4545J4665J4164J3179J1880J0387R078Q331P862O958
61335E63893N598M495L762K472J31k272l598m193n202o735p918q355q427q281
61321E25370p698o973o714o664n933m646m075m637m999l996k389j669j884j859
61307D61234j039N1J007K055L196L870L767L311K982K630J830N14j060k680m226
$$ y = [380773, 381181, 379609, 376051, 371543, 366982, 362398, 357497, 352501, 348055, 344491, 341530, 338661, 335526, 332047, 328507, 325458, 323178, 321160, 318561, 315297, 312328, 310614, 310126, 310135, 310131, 310082, 309998, 309754, 309397, 309266, 309639, 310461, 311479, 312487, 313357, 313990, 314359, 314506, 314473, 314320, 314304, 314915, 316575, 319231, 322314, 325198, 327682, 330012, 332485, 335231, 338431, 342469, 347585, 353495, 359701, 366095, 372929, 380191, 387548, 395062, 403530, 413734, 425690, 438862, 452844, 467389, 482054, 496218, 509397, 521277, 531664, 540742, 549073, 556935, 563893, 569491, 573986, 577748, 580220, 580351, 578079, 574481, 570288, 565086, 558351, 550433, 542078, 533651, 525370, 517672, 510699, 503985, 497321, 491388, 486742, 482667, 478030, 473031, 469035, 466646, 464977, 463093, 461234, 460195, 460246, 461253, 463308, 466504, 470374, 474141, 477452, 480434, 483064, 484894, 485408, 484348, 481668, 477442]
61292D77442n410n780n101l744k571k191k304k053j111o3N45R49J553K078K064
61277D54303J918K526L864M900N120N208N850O642O787O353O065O254O705P293
61263E29788Q101R000R786J0675J2104J3948J5508J6366J6717J6710J6071J4674
61251F89448J2913J1068Q746N531J864j323l801o183q863j1411j3209j4175j4561
61238F56044j4461j3987j3597j3684j3921j3486j2097j0379r088q311p637o819
61226E18577n906m930l862k924k537k773l109k970k401j950j921k031j827j203
61212D78233l95L04O74N94K25L0L29Q85J219J344J800K848M040M810N223N815
61196E07978O913Q416J0104J1701J2781J3029J2654J2145J1629J0865R884R140
$$ y = [477442, 472032, 466252, 461151, 457407, 454836, 452645, 450341, 448288, 447177, 447114, 447659, 448608, 450161, 452239, 454303, 456221, 458747, 462611, 467511, 472631, 477839, 483689, 490331, 497118, 503471, 509536, 515790, 522495, 529788, 537889, 546889, 556675, 567350, 579454, 593402, 608910, 625276, 641993, 658703, 674774, 689448, 702361, 713429, 722175, 727706, 729570, 728247, 724446, 718263, 709400, 697989, 684780, 670605, 656044, 641583, 627596, 613999, 600315, 586394, 572908, 560811, 550432, 541344, 533033, 525396, 518577, 512671, 507741, 503879, 500955, 498418, 495645, 492536, 489566, 487165, 485215, 483294, 481263, 479436, 478233, 477838, 478142, 478816, 479410, 479635, 479665, 479994, 480879, 482098, 483442, 485242, 488090, 492130, 496940, 502163, 507978, 514891, 523307, 533411, 545112, 557893, 570922, 583576, 595721, 607350, 618215, 628099, 637239]
61184F37239Q786Q280P118N634M522L841K986J690M73p3r1k03p28j479k276l189
61168F72530m229n094n557n920o740q106r549j0726j1769j2754j3245j2827j1821
61155E54193j0906j0189r207p853o606n754n010m176l568l430l503l582m011n048
61141D71350o225o928p244p505p468o791n995n898o126n350l234j088p4K83J129
61126D02836K669M379O157Q141R818J0438J0361J0852J2282J3478J3387J2602
61114E17400J2493J3329J4132J4195J3829J3428J2664J1152R409Q350Q012P530
61102F55923O378M918L455J538j142l798n381o165p474r779j2035j3290j4034
61089E99114j5225j6618j7005j5894j4182j3040j2732j2656j2180j1235j0300
$$ y = [637239, 646025, 654305, 661423, 667057, 671579, 675420, 678406, 680096, 680569, 680496, 680405, 680202, 679474, 677995, 675719, 672530, 668301, 663207, 657650, 651730, 644990, 636884, 627335, 616609, 604840, 592086, 578841, 566014, 554193, 543287, 533098, 523891, 516038, 509432, 503678, 498668, 494492, 490924, 487494, 483991, 480409, 476398, 471350, 465125, 458197, 450953, 443448, 435980, 429189, 423194, 417296, 411170, 405820, 402586, 401498, 401424, 401707, 402836, 405505, 409884, 416041, 424182, 434000, 444438, 454799, 465651, 477933, 491411, 504798, 517400, 529893, 543222, 557354, 571549, 585378, 598806, 611470, 622622, 632031, 640381, 648393, 655923, 662301, 667219, 670674, 672212, 671070, 667272, 661891, 655726, 648252, 638473, 626438, 613148, 599114, 583889, 567271, 550266, 534372, 520190, 507150, 494418, 481762, 469582, 458347, 448047]
61078D48047r876r901r786r160q303p635p111o474n842n442n014m126k959k128
61064C54290j760j407r70q53j017p20L47J342J404R07R47J881L144M249N184N893
61048C72861O196O340O934Q097R277J0100J0858J1770J2361J2099J1317J0851
61036D89061J0921J1019J0876J0896J1390J1944J2021J1908J2472J3958J5655
61025F22121J6974J8432K1114K5368L0619L6423M3176N1459O1325P2679Q5960
61014A085650J01482J17817J31390J38201J35922J24515J05480Q1201N4945L0689
61004B107292J2292K146l5K334L702j185j4758l5853o1106q6882j10120j28055
60992A689772j38181j39093j31566j18602j03962r0208p7903o6578n6248m7619
$$ y = [448047, 438171, 428270, 418484, 409324, 401021, 393386, 386275, 379801, 373959, 368517, 363503, 359377, 356418, 354290, 352530, 351123, 350153, 349300, 348283, 347563, 347910, 349252, 350656, 351563, 352510, 354391, 357535, 361784, 366968, 372861, 379057, 385397, 392331, 400428, 409705, 419805, 430663, 442433, 454794, 466893, 478210, 489061, 499982, 511001, 521877, 532773, 544163, 556107, 568128, 580036, 592508, 606466, 622121, 639095, 657527, 678641, 704009, 734628, 771051, 814227, 865686, 927011, 999690, 1085650, 1187132, 1304949, 1436339, 1574540, 1710462, 1834977, 1940457, 2021658, 2076603, 2107292, 2119584, 2121730, 2121695, 2124029, 2127731, 2126546, 2111788, 2075935, 2014829, 1927947, 1817827, 1689772, 1551591, 1412498, 1280932, 1162330, 1058368, 968160, 890257, 823679, 767431, 719812]
60982G19812m1008l5735l1037k7067k4351k2538k0477j7675j4936j3208j2377
60971D59403j1688j0843j0070r385q446p179n931m943m085l225k483j994j718
60958C77413j579j476j145l53P14J661K473L421M352M680M403M439N432O737P149
60943D18321O400N259M375L692K918J933O82q03k112k663k398j858j482j203r40
60928D30121r98j690k735l410l218k268j121l58j91l47l94j52K74O99Q26K27j219
60911D14046k833l632l372k706k116j370k77N83N56k5j51N54J414J645J243Q14
60895D04373Q38J246J543J333Q02N56Q29J128R69P32J148K084K547K084J497J789
60879D25498K888M015M867N731O587O946O804P085Q590J0841J2533J2996J2684
$$ y = [719812, 678804, 643069, 612032, 584965, 560614, 538076, 517599, 499924, 484988, 471780, 459403, 447715, 436872, 426802, 417417, 408971, 401792, 395861, 390918, 386833, 383608, 381125, 379131, 377413, 375834, 374358, 373213, 372860, 373574, 375235, 377708, 381129, 385481, 390161, 394564, 399003, 404435, 411172, 418321, 424721, 429980, 434355, 438047, 440965, 442898, 443580, 442777, 440665, 438002, 435604, 433746, 432264, 431061, 430121, 429123, 427433, 424698, 421288, 418070, 415802, 414681, 414323, 414132, 413785, 413391, 413239, 413513, 414212, 415038, 415265, 414046, 411213, 407581, 404209, 401503, 399387, 398017, 397740, 398323, 398879, 398854, 398703, 399257, 400671, 402316, 403559, 404373, 405211, 406457, 408000, 409333, 410135, 410691, 411520, 412648, 413617, 414349, 415497, 417581, 420128, 422212, 423709, 425498, 428386, 432401, 437268, 442999, 449586, 456532, 463336, 470421, 479011, 489852, 502385, 515381, 528065]
60866E28065J2296J1931J1423J0983J1027J1555J2145J2572J3066J3927J5165
60855F64155J6599J7950J8848J9061J8872J8864J9189J9361J8962J8179J7347
60844H67387J6364J4940J3114J1011Q334M682K72m192q354j2307j5870j8444j9903
60831H57034k1020k2521k4132k5024k4968k4490k4075k3688k3100k2261k1179
60820F00576j9809j8220j6706j5523j4593j3650j2578j1451j0270q862p163n476
60808D46275m270l703l492l251k796k097j153j20P00J240J874K883L893M186L574
60793D43743K582J727J039L80j93o23j020j396j530j366j255j456j695j584j257
60778D36096j175j388j557j571j766k334k992l358l351l131k915l085m005n459
$$ y = [528065, 540361, 552292, 563715, 574698, 585725, 597280, 609425, 621997, 635063, 648990, 664155, 680754, 698704, 717552, 736613, 755485, 774349, 793538, 812899, 831861, 850040, 867387, 883751, 898691, 911805, 922816, 931150, 935832, 936104, 931912, 923558, 911251, 895381, 876937, 857034, 836014, 813493, 789361, 764337, 739369, 714879, 690804, 667116, 644016, 621755, 600576, 580767, 562547, 545841, 530318, 515725, 502075, 489497, 478046, 467776, 458914, 451751, 446275, 442005, 438302, 434810, 431559, 428763, 426666, 425513, 425393, 426093, 427333, 429207, 432090, 435983, 440169, 443743, 446325, 448052, 449091, 449471, 449278, 448655, 447635, 446239, 444709, 443343, 442088, 440632, 438937, 437353, 436096, 434921, 433533, 431976, 430405, 428639, 426305, 423313, 419955, 416604, 413473, 410558, 407473, 403468, 398009]
60764C98009o514o407n477m835n027n470n337m649m112m098m177l764k780j576
60750C33786m98K11M23L62O47J642K834L357L081K648K399J928J019L31N86J499
60734C56255K162K275K279K415K364J946J466J136P00j5o16o63m05n25j253k120
60718C67401k684l118l905n069n957n957n247m656m665m841m571m010l905m486
60704C04330n036m732l522k054j017p72j239j896k140j883j582j480j185l61N65
60689B75996Q70N65M00Q17J419J617J391J098Q80N47J7m20l20M74J584K321K211
60672B91467J400N65M23J228K554L507L439K665K272K945M145M711M284L665L789
60657C33059M652N470N646N315N069N322N925O327O079N143L759K228R10J33k58
$$ y = [398009, 391495, 385088, 379611, 374776, 369749, 364279, 358942, 354293, 350181, 346083, 341906, 338142, 335362, 333786, 333288, 333499, 333922, 334284, 334931, 336573, 339407, 342764, 345845, 348493, 350892, 352820, 353839, 354170, 354756, 356255, 358417, 360692, 362971, 365386, 367750, 369696, 371162, 372298, 372998, 372983, 372367, 371704, 371299, 370774, 369521, 367401, 364717, 361599, 357694, 352625, 346668, 340711, 335464, 330808, 326143, 321302, 316731, 312721, 308816, 304330, 299294, 294562, 291040, 288986, 287969, 287197, 285958, 284062, 281922, 280039, 278457, 276977, 275792, 275431, 275996, 276866, 277431, 277831, 278648, 280067, 281684, 283075, 284173, 285053, 285600, 285617, 285197, 284877, 285351, 286935, 289256, 291467, 292867, 293432, 293855, 295083, 297637, 301144, 304583, 307248, 309520, 312465, 316610, 321321, 325605, 329270, 333059, 337711, 343181, 348827, 354142, 359211, 364533, 370458, 376785, 382864, 388007, 391766, 393994, 394904, 395037, 394779]
60642C94779j032k691m585n542n443n489o554p925q271p352o109n277m726m143
60628C19640l651l421l186k466j236j16Q9q78k302k936k173p02K92M39L05L33
60612B98031K99r4o27q99q39o14l27r8r7k49j71K39N61N07M52P84J085N99o19
60593B97923j717k158k118j723p29O71J456Q81l82r14k20R05J621J989K477L082
60577C01044L440L497L588L967M601N418O336P017O995O323N700N610N548M578
60563C73662K586M72r75j882k720l388l321k348r87J64J052K106L697N741P704
60548C81563R030R612R820J0051J0390J0652J0567R789Q067N583K981Q02r37k477
60534D75493l837m863n460n533m967l951l049k509j876p56K95L58n05j208r42
$$ y = [394779, 393747, 391056, 386471, 380929, 375486, 369997, 363443, 355518, 347247, 339895, 333786, 328509, 323783, 319640, 315989, 312568, 309382, 306916, 305680, 305564, 305653, 304775, 302473, 299537, 297364, 296662, 296954, 297393, 297698, 298031, 298330, 298236, 297609, 296710, 295871, 295257, 294930, 294832, 294735, 294486, 294315, 294554, 295115, 295622, 296074, 296858, 297943, 298542, 297923, 296206, 294048, 291930, 290207, 289478, 290149, 291605, 292486, 292104, 291190, 290970, 291875, 293496, 295485, 297962, 301044, 304484, 307981, 311569, 315536, 320137, 325555, 331891, 338908, 345903, 352226, 357926, 363536, 369084, 373662, 376248, 376720, 375745, 373863, 371143, 367755, 364434, 362086, 361099, 361263, 362315, 364421, 368118, 373859, 381563, 390593, 400205, 410025, 420076, 430466, 441118, 451685, 461474, 469541, 475124, 478105, 478907, 477970, 475493, 471656, 466793, 461333, 455800, 450833, 446882, 443833, 441324, 439448, 438692, 438987, 439345, 438840, 437632, 436690]
60519D36690J28J440K561L095K862K489L040M739O688Q141R381J0937J2749J4682
60505E19622J7077K0017K2705K4435K5654K7103K8244K7704K5159K1624J7722
60494G77066J2732N829k461j0685j7768k3423k7632l0402l1936l2573l2409l1153
60482E55185k8596k5189k1966j9690j8031j5979j3166j0411q730q188q145q135
60470C68959p915p003n051k725j388j693k946l988m300m084l773l603l438k913
60456C14139k086j659k136k882k734j484l5Q54J086N74q17k331k507r97P45J302
60440B99032J021R95J209Q43l4m69k23j58p85j400j119q1Q11R42M82N4J04M31
60422C01655L23n70j663k070j690j193j015r16o02j87J03K54K31q7n41o28j67
$$ y = [436690, 436818, 438258, 440819, 443914, 446776, 449265, 452305, 457044, 463732, 471873, 481254, 492191, 504940, 519622, 536699, 556716, 579421, 603856, 629510, 656613, 684857, 712561, 737720, 759344, 777066, 789798, 795627, 793166, 782481, 764713, 741290, 713658, 683256, 651320, 618747, 586338, 555185, 526589, 501400, 479434, 459744, 441713, 425734, 412568, 402157, 393427, 385239, 377094, 368959, 361044, 354041, 348990, 346265, 344877, 343184, 340238, 336250, 331950, 327866, 324093, 320490, 317052, 314139, 312053, 310394, 308258, 305376, 302642, 301158, 301123, 301977, 303063, 303637, 302820, 300489, 297982, 296985, 297730, 299032, 300053, 301048, 302257, 303100, 303066, 302597, 302374, 302216, 301431, 300031, 298912, 298831, 299642, 300584, 301066, 301120, 301224, 301655, 301978, 301408, 299745, 297675, 295985, 294792, 293777, 292861, 292259, 292072, 292175, 292429, 292660, 292573, 292032, 291404, 291237]
60405B91237L42L45M1J18O83R81L32q33j278l95J043J878J984K172K710K823K012
60388C06195J041R00J328J329Q24P01J255J695J455J055J124J382J306J135J437
60373C24162J997J995J221M47M38J115J837K135J947J414P27J84J57P99J756K373
60357C44704K373K157K214K408K273J857J677J792J585P17l20r73j378j812j973
60342C57301j480p72o64j200j664j660j464j253p86j02K18r8n33n46l44l34k48
60325C44371M82J676K424K278J787J720K172K737L193L653M285N136O151P152
60311C89217P869Q315Q990J0398J2317J3844J4251J3492J1778R069N301Q74l528
60298E02187p496j0874j3297j4311j4029j3246j2532j1639j0141q363p121o619
$$ y = [291237, 291579, 291924, 291965, 292083, 292766, 293747, 294079, 293246, 291968, 291573, 292616, 294494, 296478, 298650, 301360, 304183, 306195, 307236, 308136, 309464, 310793, 311617, 312318, 313573, 315268, 316723, 317778, 318902, 320284, 321590, 322725, 324162, 326159, 328154, 329375, 329822, 330260, 331375, 333212, 335347, 337294, 338708, 339435, 339619, 339776, 340575, 342331, 344704, 347077, 349234, 351448, 353856, 356129, 357986, 359663, 361455, 363040, 363757, 363437, 362464, 361086, 359274, 357301, 355821, 355049, 354385, 353185, 351521, 349861, 348397, 347144, 346358, 346256, 346474, 346376, 345843, 345297, 344953, 344619, 344371, 344853, 346529, 348953, 351231, 353018, 354738, 356910, 359647, 362840, 366493, 370778, 375914, 382065, 389217, 397086, 405401, 414391, 424789, 437106, 450950, 465201, 478693, 490471, 499540, 504841, 505715, 502187, 494691, 483817, 470520, 456209, 442180, 428934, 416402, 404763, 394622, 386259, 379138, 372519]
60286C72519o150n039l521k376j950j862j628j212r01p73o04k73j1j01m44o60
60270C45014n97m43l35j19L18P28Q21O87N99N24K30j37o2N83J210J225P76M21
60252C51443K58n7n60p77m34Q1K48R4n3j52l85o09m30J48O00N97M38N61R62J402
60232C53375J843K317K592K424J971J577J238P92M71P32J456J892J579Q17M0p57
60216C74359j545j773r99K91J096J090Q66R68J279J437J431J447J457J320J117
60201C83841J078J241J468J752K232K804K988K490J781J691K301K610J727M6j214
60186D08836j576j681k083k363j908r74l48l45o76j026j166p05N01J778K179J647
60170D00090J022Q67R26Q78Q23Q05N23j8k53J12N67N68L45M15P29R41J075J342
$$ y = [372519, 366369, 361330, 357809, 355433, 353483, 351621, 349993, 348781, 347880, 347107, 346503, 346230, 346219, 346118, 345674, 345014, 344417, 343974, 343639, 343520, 343838, 344566, 345387, 346074, 346673, 347197, 347427, 347290, 347228, 347811, 349021, 350246, 351022, 351443, 351701, 351644, 351084, 350307, 349873, 349954, 350202, 350296, 350243, 350091, 349706, 349097, 348667, 348815, 349415, 350012, 350450, 351011, 351973, 353375, 355218, 357535, 360127, 362551, 364522, 366099, 367337, 368129, 368600, 369332, 370788, 372680, 374259, 375076, 375116, 374359, 372814, 371041, 370042, 370333, 371429, 372519, 373385, 374353, 375632, 377069, 378500, 379947, 381404, 382724, 383841, 384919, 386160, 387628, 389380, 391612, 394416, 397404, 399894, 401675, 403366, 405667, 408277, 410004, 410050, 408836, 407260, 405579, 403496, 401133, 399225, 398251, 397903, 397558, 396882, 395856, 394690, 393985, 394486, 396264, 398443, 400090, 401112, 401979, 402905, 403783, 404606, 405411, 405934, 405916, 405663, 405775, 406342, 406910, 407255, 407670, 408399, 409340, 410415, 411757]
60152D11757J614J779K178L016L701L623L304L732M705N093M753M900O129P285
60138D67569P074N809M696M077L450K611J729O46r15k526l437l669l937m454m725
60123D73998m503m137l752l093k362k363l237l991l825l283l286l625l345k319
60109D26877j463j378j627j477p97K9N29L80l93j116q46O28K425L458L525L243
60093D31997L152L223L259L351L739M403M994N193M965M463L835L213K746K465
60079D84998K194J725J035J46j021k369l353l491l155l303m199n001m911m247
60065D55048l854l937m093m208m494m794m591l895l437l699m230m241l493k356
60051C99726j312o69n10o55q10q46p97n72%P84J379J668J966K423K635K126R65
$$ y = [411757, 413371, 415150, 417328, 420344, 424045, 427668, 430972, 434704, 439409, 444502, 449255, 454155, 460284, 467569, 474643, 480452, 485148, 489225, 492675, 495286, 497015, 497661, 496746, 494220, 490783, 487114, 483177, 478723, 473998, 469495, 465358, 461606, 458513, 456151, 453788, 450551, 446560, 442735, 439452, 436166, 432541, 429196, 426877, 425414, 424036, 422409, 420932, 420135, 420164, 420693, 421073, 420680, 419564, 418718, 419346, 421771, 425229, 428754, 431997, 435149, 438372, 441631, 444982, 448721, 453124, 458118, 463311, 468276, 472739, 476574, 479787, 482533, 484998, 487192, 488917, 489952, 490098, 489077, 486708, 483355, 479864, 476709, 473406, 469207, 464206, 459295, 455048, 451194, 447257, 443164, 438956, 434462, 429668, 425077, 421182, 417745, 414046, 409816, 405575, 402082, 399726, 398414, 397745, 397235, 396580, 395770, 394924, 394127, 393555, 393555, 394339, 395718, 397386, 399352, 401775, 404410, 406536, 407501]
60034D07501l33j329j874k034k095k455l240m136m747m990n026n003n015n084
60020C60140n023m549l687k841k250j699r85l50j45k77m44o62j209k034k686k811
60004C28488k525k216k097j928j211J37J354J508P30K31P82J689J844J306J066
59989C29158J526K024J938J466J158J259J704K240K408J892J093Q45J362J876
59975C51949J628P83Q1l9L62J030J595J599Q90m6n16l01K34O53Q21Q42Q16O52
59957C63033J36p11j367j221l61L86M39R5jK14L12P9l53r40j769k597k806k158
59939C50410j186p08r83j554j755j319n41K6Q3j85m31o13r21j274j264p50j91
59922C36844p9j77K52J403K521K786K278J818J939K396K732K910L226L770M243
$$ y = [407501, 407168, 405839, 403965, 401931, 399836, 397381, 394141, 390005, 385258, 380268, 375242, 370239, 365224, 360140, 355117, 350568, 346881, 344040, 341790, 340091, 339106, 338756, 338611, 338334, 337890, 337228, 336019, 333985, 331299, 328488, 325963, 323747, 321650, 319722, 318511, 318648, 320002, 321510, 322240, 322471, 323253, 324942, 326786, 328092, 329158, 330684, 332708, 334646, 336112, 337270, 338529, 340233, 342473, 344881, 346773, 347866, 348711, 350073, 351949, 353577, 354360, 354441, 354402, 354764, 355794, 357389, 358988, 359878, 359832, 359316, 359015, 359249, 359902, 360723, 361565, 362381, 363033, 363169, 362458, 361091, 359870, 359509, 359895, 360334, 360429, 360428, 360642, 360954, 361033, 360680, 359740, 357971, 355374, 352568, 350410, 349224, 348516, 347533, 345979, 344224, 342905, 342364, 342390, 342473, 342288, 341857, 341244, 340323, 339049, 337785, 337035, 336844, 336765, 336588, 336840, 338243, 340764, 343550, 345828, 347646, 349585, 351981, 354713, 357623, 360849, 364619, 368862]
59907C68862M261L654K578J505R84J209J732J805J146K61o0M53J314J823J810
59892C93337J694J866K133J998J399R12J121J945K801L183L023K538K006J566
59878D21522J166P26L57J52j98j209k725l749l542k659k258k593k839k367j538
59863C98246j010r52j202j681k268k590k391j901j518j263q52j89M79P87M76m20
59847C81751j496k223k398k208j792j120m02j57m86o86p7R99J534J171O20P28
59831C73758J500K293K608K460K113J684J092L03m68r08r92j052j345j738j896
59816C79412j691j268q27n23m04l14J2N01O45O9q95j554j603j274q30l34M8n0
59798C69120p89j874k830l329l204k457j440p38o10o92m92r3k3m65r10q12l33
$$ y = [368862, 373123, 376777, 379355, 380860, 381844, 383053, 384785, 386590, 387736, 387997, 387937, 388390, 389704, 391527, 393337, 395031, 396897, 399030, 401028, 402427, 403339, 404460, 406405, 409206, 412389, 415412, 417950, 419956, 421522, 422688, 423414, 423771, 423923, 423725, 422516, 419791, 416042, 412500, 409841, 407583, 404990, 402151, 399784, 398246, 397236, 396284, 395082, 393401, 391133, 388543, 386152, 384251, 382733, 381470, 380618, 380429, 380908, 381695, 382171, 381751, 380255, 378032, 375634, 373426, 371634, 370514, 370112, 369955, 369469, 368783, 368706, 369705, 371239, 372410, 373030, 373758, 375258, 377551, 380159, 382619, 384732, 386416, 387508, 387811, 387343, 386435, 385443, 384391, 383046, 381308, 379412, 377721, 376453, 375626, 375103, 374699, 374385, 374397, 374898, 375543, 375612, 374717, 373163, 371560, 370286, 369456, 369122, 369170, 369120, 368331, 366457, 363627, 360298, 357094, 354637, 353197, 352459, 351849, 351157, 350665, 350572, 350549, 350084, 349174, 348362, 348029]
59781C48029j64n72r91p37J33R91J474J743J880J617Q95L22N71J478K207K222
59765C61098J747J267R08N28M0m56p93q51o64m59m17m12j84K57O22Q48J314K282
59747C66675L297L527K745J704J313J600J796J437J005J164J664J534M26q19j162
59732C87906n13M65J300J879J922J020n93j888j989j053L6O08O57N55N83P27P67
59715C92389N86L46K63K47P1j59n7M31Q31P78M95L41K42Kj01L48J073J196L55
59696C99677p19j074n80J55N50M36j15q86j509j704j518j087l54O44J368J201
59680C94485L10m55o49p23j143j681j969k246k836l306k934j882j166j383k181
59665C70241k991l542l541k677j340n55o99r13l51N88R97Q81R32J244J194O19
$$ y = [348029, 347865, 347293, 346302, 345565, 345698, 346689, 348163, 349906, 351786, 353403, 354298, 354620, 355191, 356669, 358876, 361098, 362845, 364112, 365020, 365548, 365588, 365132, 364339, 363488, 362824, 362365, 361948, 361536, 361352, 361609, 362231, 363079, 364393, 366675, 369972, 373499, 376244, 377948, 379261, 380861, 382657, 384094, 385099, 386263, 387927, 389461, 389887, 389068, 387906, 387393, 387858, 389158, 391037, 392959, 393979, 393386, 391498, 389509, 388456, 388492, 389100, 389757, 390312, 390895, 391622, 392389, 392975, 393321, 393584, 393831, 393902, 393743, 393686, 394117, 394948, 395726, 396221, 396562, 396804, 396806, 396705, 397053, 398126, 399322, 399677, 398958, 397884, 397304, 397459, 398009, 398445, 398330, 397444, 395935, 394231, 392713, 391626, 391272, 391916, 393284, 394485, 394795, 394340, 393691, 392968, 391825, 390144, 388175, 385929, 383093, 379787, 376853, 374971, 373805, 372422, 370241, 367250, 363708, 360167, 357490, 356150, 355595, 354896, 353983, 353632, 354220, 355217, 356098, 357030, 358274, 359468, 360087]
59649C60087K00M80J165J674J806J641J261Q54O95P44O11J71j60L2N69R02P29
59632C73461K44o3K54J178K009J832M64j267k278k182j429p75p05j146j582j699
59616C66316j802k331k964k758j384L52J500J985K222K228J752J015N78N66N87
59601C67862M49L64M10L43J10K9K21L43J80P8L81P74P06K45J4K41M06Kp90j400
59581C70968j629j744j986k256k329k179k021k134k585l032k901j975q53m54r92
59566C41898j655j490m16Q74J775K170K124J676J071Q04J092J543J651J497J709
59551C56323K647L947M958N475N869O580P632Q653R319R755J0510J1988J3726
59538D57382J4412J3003R833O276L225L36k951o134q035q132o897m958k701p10
$$ y = [360087, 360287, 360767, 361932, 363606, 365412, 367053, 368314, 369168, 369863, 370607, 371218, 371389, 371229, 371261, 371830, 372732, 373461, 373705, 373642, 373896, 375074, 377083, 378915, 379379, 378112, 375834, 373652, 372223, 371448, 370743, 369597, 368015, 366316, 364514, 362183, 359219, 356461, 355077, 355429, 356929, 358914, 361136, 363364, 365116, 366131, 366709, 367275, 367862, 368311, 368675, 369085, 369428, 369538, 369567, 369788, 370131, 370311, 370389, 370770, 371544, 372250, 372495, 372509, 372750, 373156, 373158, 372368, 370968, 369339, 367595, 365609, 363353, 361024, 358845, 356824, 354690, 352105, 349073, 346172, 344197, 343344, 342890, 341898, 340243, 338753, 338337, 339211, 340986, 343156, 345280, 346956, 348027, 348831, 349923, 351466, 353117, 354614, 356323, 358970, 362917, 367875, 373350, 379219, 385799, 393431, 402084, 411403, 421158, 431668, 443656, 457382, 471794, 484797, 494630, 500906, 504131, 504467, 501516, 495382, 487347, 479215, 472318, 467360, 464659, 463949]
59524D63949K63J73j47q3K9l31j020j648k312l239m197m950n845p154q177p958
59508D17353o679n459m874m545m170l958l896l578k935k315j640m95O74O34p36
59493C73381j769j109L29P00j52o61Q8J250J616J130N86N12Q09J206J655K342
59477C81913L379M463N013M798M271L977L888L633L123K511J743P79J20N28K013
59462D26152L618M404M356M172M427N171O034O577O664O561O646O935P099O851
59448E05667O138N008L510J765r8k079m220o321p923q668q535p799o795n754m721
59433D59175l670k733k159j943j711j156l89M04J389K832M537O016P210Q641J0668
59418D87111J3001J5114J6816J8133J8842J8431J6570J3419R405M822j92n292
$$ y = [463949, 464212, 464385, 464238, 464155, 464184, 463853, 462833, 461185, 458873, 455634, 451437, 446487, 440642, 433488, 425311, 417353, 410674, 405215, 400341, 395796, 391626, 387668, 383772, 380194, 377259, 374944, 373304, 372809, 373483, 374117, 373381, 371612, 370503, 370832, 371532, 371380, 370719, 370807, 372057, 373673, 374803, 375389, 375901, 376710, 377916, 379571, 381913, 385292, 389755, 394768, 399566, 403837, 407814, 411702, 415335, 418458, 420969, 422712, 423491, 423611, 424139, 426152, 429770, 434174, 438530, 442702, 447129, 452300, 458334, 464911, 471575, 478136, 484782, 491717, 498816, 505667, 511805, 516813, 520323, 522088, 521990, 519911, 515691, 509370, 501447, 492779, 484244, 476445, 469650, 463896, 459175, 455505, 452772, 450613, 448670, 446959, 445803, 445414, 445818, 447207, 450039, 454576, 460592, 467802, 476443, 487111, 500112, 515226, 532042, 550175, 569017, 587448, 604018, 617437, 626842, 631664, 631472, 626180]
59406F26180r711j2550j3257j1751q325l789L97K649K232m20m383q917j3330j6741
59392E28284j8487j8642j7836j6613j5155j3420j1274q747o318m662l834l098
59380C90198j917o94p6M8K51N53N71M86R89K129L043L146K906L069L598L927L858
59363D16085L743L876M110M154M036M169M897O012O896P235P372P764Q405R099
59349D97853R939J0994J1716J1403J0171Q840P797O667N184L646K223N33j633
59336E85333l727n142o095p251q696r815j0094r701r200q999r085r139q885q311
59322D71193p476o331m955l845l499l690l675l165k588k254j882j234o61o13r90
59307D24335j357j426j035j66P06P83ko48l99J32n0o78n65N23J455J360O64J58
$$ y = [626180, 616469, 603919, 590662, 578911, 570586, 566797, 567194, 569843, 572075, 571655, 567272, 558355, 545025, 528284, 509797, 491155, 473319, 456706, 441551, 428131, 416857, 408110, 401792, 397130, 393296, 390198, 388281, 387587, 387511, 387559, 387810, 388363, 388934, 389420, 390409, 392538, 395581, 398727, 401633, 404702, 408300, 412227, 416085, 419828, 423704, 427814, 431968, 436004, 440173, 445070, 451082, 457978, 465213, 472585, 480349, 488754, 497853, 507792, 518786, 530502, 541905, 552076, 560916, 568713, 575380, 580564, 584210, 586433, 586966, 585333, 581606, 576464, 570369, 563118, 554422, 544607, 534513, 524812, 515612, 506613, 497528, 488389, 479504, 471193, 463717, 457386, 452431, 448586, 445087, 441397, 437722, 434557, 431969, 429715, 427833, 426599, 425938, 425325, 424335, 422978, 421552, 420517, 420351, 421057, 421840, 421838, 421190, 420791, 420923, 420873, 420195, 419630, 420153, 421608, 422968, 423632, 423790]
59289D23790j38n45q59o56j09K07K02L17P86J401K037K792L512L801L756M118
59273D44412N194O110N818M552L571L459L563L231K737K532K271J379N3j019j704
59258D86159k423l308m087m773n599o301o233n456m894n058n254m557l017j433
59244D23766k98M82J183K026L115M221M807M602M032L733L807L770L051J420q70
59229D62847l036m146l875k840j992j869k427l243l732l524k873k416k372k343
59215D22159k093j898j921j703q93N4M24K23M7K46P11J276J798J999J717J194
59199D23340P51L84N0PM20Q72R14P87J002J387J304P39M63R87J918K485K292J493
59181D41595O35L20O13Q48M84k4K71J449K641L285L707M306M842M956M802M719
$$ y = [423790, 423652, 423107, 422248, 421592, 421483, 421690, 421892, 422209, 422995, 424396, 426433, 429225, 432737, 436538, 440294, 444412, 449606, 455716, 461534, 466086, 469657, 473116, 476679, 479910, 482647, 485179, 487450, 488829, 488882, 487863, 486159, 483736, 480428, 476341, 471568, 465969, 459668, 453435, 447979, 443085, 438027, 432773, 428216, 425199, 423766, 423468, 423950, 425133, 427159, 430274, 434495, 439302, 443904, 447936, 451669, 455476, 459246, 462297, 463717, 462847, 459811, 455665, 451790, 448950, 446958, 445089, 442662, 439419, 435687, 432163, 429290, 426874, 424502, 422159, 420066, 418168, 416247, 414544, 413651, 413705, 414129, 414352, 414399, 414645, 415356, 416632, 418430, 420429, 422146, 423340, 424091, 424475, 424525, 424532, 424952, 425824, 426738, 427525, 428527, 429914, 431218, 431957, 432420, 433407, 435325, 437810, 440102, 441595, 442230, 442550, 443163, 444011, 444495, 444471, 444742, 446191, 448832, 452117, 455824, 460130, 464972, 469928, 474730, 479449]
59165D79449M700M548M298M076L748L033J828K94j235k325k717k683k829l377
59151D90808l898l912l522l206l199l312l232k775k008j303j224k051l312l980
59137D49874l369j943r49j076j684j650q11kK16J11j9k75m13M02K351M221M901
59120D49885N021O039Q089R979J1072J1888J2847J3660J4170J4713J5324J5547
59108E88234J5411J5546J6087J6363J6053J5591J5074J3869J1853R926Q599P138
59096G49744M945K806J679J163K31j070j910k133k351k851l459m218n258o231
59082G31087o813p484q892j0670j1944j2708j3627j4545j4469j3139j1540j0554
59070E94702j0056r638r303r058q613p863p143o658o273o016o084o203n732m624
$$ y = [479449, 484149, 488697, 492995, 497071, 500819, 503852, 505680, 505974, 504739, 502414, 499697, 497014, 494185, 490808, 486910, 482998, 479476, 476270, 473071, 469759, 466527, 463752, 461744, 460441, 459217, 457166, 453854, 449874, 446505, 444562, 443613, 442537, 440853, 439203, 438392, 438390, 438606, 438717, 438698, 438423, 438010, 438412, 440763, 444984, 449885, 454906, 460945, 469034, 479013, 490085, 501973, 514820, 528480, 542650, 557363, 572687, 588234, 603645, 619191, 635278, 651641, 667694, 683285, 698359, 712228, 724081, 734007, 742606, 749744, 754689, 757495, 759174, 760337, 760568, 759498, 757588, 755455, 753104, 750253, 746794, 742576, 737318, 731087, 724274, 716790, 707898, 697228, 685284, 672576, 658949, 644404, 629935, 616796, 605256, 594702, 584646, 575008, 565705, 556647, 548034, 540171, 533028, 526370, 520097, 514081, 507997, 501794, 496062, 491438]
59056D91438l588k985k406j625j127j190j286j005p73r05p79K07J342J391L94
59041D77103l50K2J086K034K593K873K983L081L450M210N221O327P450Q406Q986
59026E35475R250R534J0100J0981J2149J3493J4643J5155J4931J4247J3349J2180
59014F85487J0563Q395N727K836K27j664k707l002k628j773q76k59L35J440L051
58999G05152M491N077M701L639K285J069K50m46j666l655n856p561q670r538j0281
58984F78991j0635j0501j0268j0421j0864j0875r826p967o235n175m346l098j644
58971E77136p38l34N71K468M433N248M915M445M439M620M631M542M481M297L803
58956F28957K960J778L13j191k555l941n519o849p225o667n974n586n088m133
$$ y = [491438, 487850, 484865, 482459, 480834, 479707, 478517, 477231, 476226, 475453, 474548, 473769, 473976, 475318, 476709, 477103, 476753, 476775, 477861, 479895, 482488, 485361, 488344, 491425, 494875, 499085, 504306, 510633, 518083, 526489, 535475, 544725, 554259, 564359, 575340, 587489, 600982, 615625, 630780, 645711, 659958, 673307, 685487, 696050, 704445, 710172, 713008, 713235, 711571, 708864, 705862, 703234, 701461, 700585, 700326, 700661, 702101, 705152, 709643, 714720, 719421, 723060, 725345, 726414, 726664, 726218, 724552, 720897, 715041, 707480, 698810, 689272, 678991, 668356, 657855, 647587, 637166, 626302, 615427, 605601, 597634, 591399, 586224, 581878, 578780, 577136, 576398, 576064, 576635, 579103, 583536, 588784, 593699, 598144, 602583, 607203, 611834, 616376, 620857, 625154, 628957, 631917, 633695, 634008, 632817, 630262, 626321, 620802, 613953, 606728, 600061, 594087, 588501, 583413, 579280]
58942E79280l235l088l601m180m636n152n588n569n270n445o424p547p888p264
58928E04393o296n635n341m984m246l326k735k702k951l053k794k062q02P04J806
58913D59976K179K308K843L627L965L785L952N162P023Q584R389R711R913R995
58899E42412R765R218Q618Q297Q357Q592Q796R022R502J0337J1456J2790J4247
58886F71409J5508J6087J5689J4409J2520J0228P630M848K098l75k538m730p320
58873G55463j0122j2445j3904j4888j5816j6341j5830j4429j2989j1998j1177
58862F05524j0173r035p935o983o490o742p341p394o704o147o390o904o806o195
58848E04285n899o146o267n707m755m064l846l718l227k399j811k038k948l774
$$ y = [579280, 576045, 572957, 569356, 565176, 560540, 555388, 549800, 544231, 538961, 533516, 527092, 519545, 511657, 504393, 498097, 492462, 487121, 482137, 477891, 474565, 471830, 469128, 466177, 463124, 460330, 458268, 457466, 458170, 459976, 462155, 464463, 467306, 470933, 474898, 478683, 482635, 487797, 494820, 503404, 512793, 522504, 532417, 542412, 552177, 561395, 570013, 578310, 586667, 595259, 604055, 613077, 622579, 632916, 644372, 657162, 671409, 686917, 703004, 718693, 733102, 745622, 755850, 763480, 768328, 770426, 770051, 767513, 762783, 755463, 745341, 732896, 718992, 704104, 688288, 671947, 656117, 641688, 628699, 616701, 605524, 595351, 586316, 578381, 571398, 564908, 558166, 550825, 543431, 536727, 530580, 524190, 517286, 510480, 504285, 498386, 492240, 485973, 480266, 475511, 471447, 467601, 463883, 460656, 458257, 456446, 454408, 451460, 447686]
58834D47686l883l298k414j534q86p06j006j450j635j358o26K40M88m19j887k497
58818D24815j660l11M37O15Q21J084J159J344J949K412K025J240J068J384J125
58803D39507K04k24K84O11j75j394j914j750j554j334q30m48p04j025l88J026
58787D29892J951J871J644J959K265J828J064J067K163L648M781N407N621N339
58773D70500M454L093J582J71j087k239l211l714l470k684k127k484l583m451
58759D50750m300l269k098j250n81K10J104J798K069J983J835J920K258K552K565
58744D57546K459K570K891L112L231L698M705N686N953N603N385N752O439O958
58730E21988P176P299P555P900P917P117N590M128L395L121K628J966J836K392
$$ y = [447686, 443803, 440505, 438091, 436557, 435671, 434965, 433959, 432509, 430874, 429516, 428890, 429130, 429618, 429199, 427312, 424815, 423155, 422844, 423281, 423896, 424717, 425801, 426960, 428304, 430253, 432665, 434690, 435930, 436998, 438382, 439507, 439711, 439487, 439771, 440382, 440207, 438813, 436899, 435149, 433595, 432261, 431431, 430983, 430279, 429254, 428866, 429892, 431843, 433714, 435358, 437317, 439582, 441410, 442474, 443541, 445704, 449352, 454133, 459540, 465161, 470500, 474954, 478047, 479629, 479800, 478713, 476474, 473263, 469549, 466079, 463395, 461268, 458784, 455201, 450750, 446450, 443181, 441083, 439833, 439252, 439462, 440566, 442364, 444433, 446416, 448251, 450171, 452429, 454981, 457546, 460005, 462575, 465466, 468578, 471809, 475507, 480212, 485898, 491851, 497454, 502839, 508591, 515030, 521988, 529164, 536463, 544018, 551918, 559835, 566952, 572542, 576670, 580065, 583186, 585814, 587780, 589616, 592008]
58716E92008K943L056L256M089N116N489N084M456L847K959J643J37j433l242
58702F29408n345p491r501j1417j3097j4095j4126j3443j2575j1942j1775j1955
58690D92646j1824j0619q457o510n736n808n730n195m587l918k724j111K3K77
58676D20727M19J209K185K482K296K604L627M614N200N930P145Q290Q772Q818
58662D84318Q833Q570P577O020M365K594M64j681l146l778l967l852l254k440
58648E00623k128k517k958k893k581k540k771k905k759k338j578m39Q62J941K465
58633D77484K232J380N77N40J128J446J100Q23J363K315K794K872L465M866O333
58618E10718P207P623P787P360O174M962M605M854M533K946O17j460k754l307
$$ y = [592008, 594951, 598007, 601263, 605352, 610468, 615957, 621041, 625497, 629344, 632303, 633946, 634083, 632650, 629408, 624063, 616572, 607071, 595654, 582557, 568462, 554336, 540893, 528318, 516376, 504601, 492646, 480822, 470203, 461746, 455236, 449500, 443692, 437962, 432767, 428180, 424262, 421538, 420427, 420450, 420727, 421146, 422355, 424540, 427022, 429318, 431922, 435549, 440163, 445363, 451293, 458438, 466728, 475500, 484318, 493151, 501721, 509298, 515318, 519683, 522277, 522741, 521060, 517914, 514136, 510169, 506317, 503063, 500623, 498495, 495978, 493020, 490127, 487546, 485006, 482235, 479330, 476571, 474233, 472655, 472216, 473078, 475019, 477484, 479716, 481096, 481673, 482213, 483341, 484787, 485887, 486710, 488073, 490388, 493182, 496054, 499519, 504385, 510718, 517925, 525548, 533335, 540695, 546869, 551831, 556436, 561290, 565823, 568769, 569386, 567926, 565172, 561865]
58604E61865l408l424l690m241m814n209n488n649n450m767l888l146k486j692
58590E04513q90l53J00R77K368L751M666N199N621N952O084O058N956N785N626
58575E61413N600N529N048M323M153M947N965O167N615N429O474Q617J1214J3627
58561F54121J5212J5490J4730J3906J3753J3993J3743J2463J0339P946N817M160
58549G95673K762J260l71j729k556l243m512o555q720j0208j0906j1287j1584
58536G28024j1389j0346q901p894p447o813n434l686k244j269n43K4N31J445L104
58521F67162N085O594P417P933Q270Q085P237O092N001L915K700J390Mj633l621
58506G31631n764p629q735q773p987p221p177p672p946p570o731n785n073m983
$$ y = [561865, 558457, 555033, 551343, 547102, 542288, 537079, 531591, 525942, 520492, 515725, 511837, 508691, 506205, 504513, 503623, 503270, 503370, 504347, 506715, 510466, 515132, 520331, 525952, 531904, 537988, 544046, 550002, 555787, 561413, 567013, 572542, 577590, 581913, 586066, 591013, 596978, 603145, 608760, 614189, 620663, 629280, 640494, 654121, 669333, 684823, 699553, 713459, 727212, 741205, 754948, 767411, 777750, 785696, 791513, 795673, 798435, 799695, 799324, 797595, 795039, 791796, 787284, 780729, 772009, 761801, 750895, 739608, 728024, 716635, 706289, 697388, 689494, 682047, 675234, 669800, 666114, 663870, 662601, 662058, 662082, 662613, 664058, 667162, 672247, 678841, 686258, 694191, 702461, 710546, 717783, 723875, 728876, 732791, 735491, 736881, 736885, 735252, 731631, 725867, 718238, 709503, 700730, 692743, 685522, 678345, 670673, 662727, 655157, 648426, 642641, 637568, 632585]
58492F32585n545o077n818m886l888k801j090R91K318K472K383K961L890M455
58478F21950M755N304N986O238N943N369M498L114J412n9j049j776k497l300m129
58463F51759m689m535l626k558j920j639j247n00N94J995L381M055L644K721K167
58448F49602K143K147J901J607J423J266J130J208J608K328L342M390M850M344
58434F83289L406L048L622M570N319N915O673P627Q575R413J0190J0942J1618
58421G74207J2069J2076J1417R987P916N663L886K868J973J60k750n597p069p099
58407H19707o695o668o918o945o469n486m083k417p25P86K033L084M032M782N048
58392G93066M766M372M295M212L368J711J00r07j803l198m649n118m343l136k474
$$ y = [632585, 627040, 620963, 615145, 610259, 606371, 603570, 602480, 603471, 605789, 608261, 610644, 613605, 617495, 621950, 626705, 632009, 637995, 644233, 650176, 655545, 660043, 663157, 664569, 664510, 663461, 661685, 659188, 655888, 651759, 647070, 642535, 638909, 636351, 634431, 632792, 631545, 631045, 631639, 633634, 637015, 641070, 644714, 647435, 649602, 651745, 653892, 655793, 657400, 658823, 660089, 661219, 662427, 664035, 666363, 669705, 674095, 678945, 683289, 686695, 689743, 693365, 697935, 703254, 709169, 715842, 723469, 732044, 741457, 751647, 762589, 774207, 786276, 798352, 809769, 819756, 827672, 833335, 837221, 840089, 842062, 842222, 839472, 833875, 826806, 819707, 813012, 806344, 799426, 792481, 786012, 780526, 776443, 774026, 773301, 774087, 776120, 779204, 783236, 788018, 793066, 797832, 802204, 806499, 810711, 814079, 815790, 815890, 814983, 813180, 809982, 805333, 800215, 795872, 792736, 790262]
58377G90262k635l187l359k618j217L8P52J408K547L922M929N550O231P089P850
58362H17562Q429R004R544R766R627R362R097Q728Q157P424O670O187O250O692
58348I32499O961O921P157Q128R447J0577J1705J3250J4853J5699J5708J5658
58336A068563J6111J6846J7338J7210J6284J4733J3180J2088J1098R504P291N148
58324A225394L580K559K007J977K381L030L971N299O666P557Q087Q946J0536J2518
58310A304508J4300J5576J6428J7240J8352J9523K0020J9655J9321J9860K0797
58299A505580K0983K0213J9303J8686J7963J6952J6246J6379J7090J7830J8446
58288A705671J9092J9864K0803K1991K3487K5319K7495K9844L1955L3557L4774
$$ y = [790262, 787627, 784440, 781081, 778463, 777246, 777284, 778036, 779444, 781991, 785913, 790842, 796392, 802623, 809712, 817562, 825991, 834995, 844539, 854305, 863932, 873294, 882391, 891119, 899276, 906700, 913370, 919557, 925807, 932499, 939460, 946381, 953538, 961666, 971113, 981690, 993395, 1006645, 1021498, 1037197, 1052905, 1068563, 1084674, 1101520, 1118858, 1136068, 1152352, 1167085, 1180265, 1192353, 1203451, 1212955, 1220246, 1225394, 1228974, 1231533, 1233540, 1235517, 1237898, 1240928, 1244899, 1250198, 1256864, 1264421, 1272508, 1281454, 1291990, 1304508, 1318808, 1334384, 1350812, 1368052, 1386404, 1405927, 1425947, 1445602, 1464923, 1484783, 1505580, 1526563, 1546776, 1566079, 1584765, 1602728, 1619680, 1635926, 1652305, 1669395, 1687225, 1705671, 1724763, 1744627, 1765430, 1787421, 1810908, 1836227, 1863722, 1893566, 1925521, 1959078, 1993852]
58277A993852L5770L6471L6917L7511L8507L9621M0555M1475M2545M3462M4039
58266B430725M4726M5975M7687M9813N2811N6664O0223O2545O4240O6450O9149
58255C051008P1584P3774P6214P8637Q0443Q2100Q4753Q8704R3472R8970J05289
58244C984948J11782J17816J24051J31412J39297J46468J53354J61599J71493
58235E242220J81872J92482K04422K18054K32486K47448K63803K81883L01099
58226G365769L21635L44707L70754L99126M29953M64561N03667N46942N94735
58217A1341849O48514P09394P78065Q56350R46816J050781J168786J303285J458913
58208B0262753J640344J852510K102486K397861K743180L142046L604491M150204
$$ y = [1993852, 2029622, 2066093, 2103010, 2140521, 2179028, 2218649, 2259204, 2300679, 2343224, 2386686, 2430725, 2475451, 2521426, 2569113, 2618926, 2671737, 2728401, 2788624, 2851169, 2915409, 2981859, 3051008, 3122592, 3196366, 3272580, 3351217, 3431660, 3513760, 3598513, 3687217, 3780689, 3879659, 3984948, 4096730, 4214546, 4338597, 4470009, 4609306, 4755774, 4909128, 5070727, 5242220, 5424092, 5616574, 5820996, 6039050, 6271536, 6518984, 6782787, 7064670, 7365769, 7687404, 8032111, 8402865, 8801991, 9231944, 9696505, 10200172, 10747114, 11341849, 11990363, 12699757, 13477822, 14334172, 15280988, 16331769, 17500555, 18803840, 20262753, 21903097, 23755607, 25858093, 28255954, 30999134, 34141180, 37745671, 41895875]
58200D1895875M804675N594958O547511P683777R016575J0556361J2322640J4342698
58192A12765070J6633376J9179099K1904846K4623496K6968452K8382647K8232174
58185B78689160K6019728K1581076J5154473P306030j216742r614051j7112757
58178C20806917k3035522k6912856k8614457k8395227k6782275k4361709k1607468
58171A41097403j8832282j6220952j3870180j1812396j0040070q530930p258765
58164E4531828o192159n297222m545492l915346l386982k941595k565266k248475
58156B3439291j981352j753239j556756j388170j243431j117305j006486r10010
58148A2482542q26005p51067o83279o23026n70110n22595m79106m40012m05566
$$ y = [41895875, 46700550, 52295508, 58843019, 66526796, 75543371, 86099732, 98422372, 112765070, 129398446, 148577545, 170482391, 195105887, 222074339, 250456986, 278689160, 304708888, 326289964, 341444437, 348750467, 347533725, 337919674, 320806917, 297771395, 270858539, 242244082, 213848855, 187066580, 162704871, 141097403, 122265121, 106044169, 92173989, 80361593, 70321523, 61790593, 54531828, 48339669, 43042447, 38496955, 34581609, 31194627, 28253032, 25687766, 23439291, 21457939, 19704700, 18147944, 16759774, 15516343, 14399038, 13392552, 12482542, 11656537, 10905470, 10222191, 9599165, 9029055, 8506460, 8027354, 7587342, 7181776]
58139G181776l74829l46944l21819k99012k77541k57259k38999k23055k08680
58130D633638j95248j82686j70806j59441j49168j40598j33157j25746j18449
58121C258339j12092j06464j00478r4041q8226q3588p9709p6399p3853p1585o8636
58110B303268o5119o2155o0146n8292n6027n3662n1408m9053m6789m5164m3922
58099A711531m2092l9564l7427l6340l5563l4097l1915k9627k7646k6057k4764
58088A346439k3454k1949k0633k0000j9824j9461j8855j8564j8866j9542k0406
58077A124885k1284k1631k1067k0159j9830k0011j9796j8824j7659j6777j6113
58066I11734j5617j5380j5169j4581j3707j2893j2005j0736r424q660q238p533
$$ y = [7181776, 6806947, 6460003, 6138184, 5839172, 5561631, 5304372, 5065373, 4842318, 4633638, 4438390, 4255704, 4084898, 3925457, 3776289, 3635691, 3502534, 3376788, 3258339, 3146247, 3039783, 2939305, 2845264, 2757038, 2673450, 2593741, 2517342, 2443489, 2371904, 2303268, 2238149, 2175994, 2115848, 2057556, 2001529, 1947867, 1896459, 1847406, 1800617, 1755453, 1711531, 1669439, 1629875, 1592448, 1556108, 1520545, 1486448, 1454533, 1424906, 1397260, 1371203, 1346439, 1322985, 1301036, 1280403, 1260403, 1240579, 1221118, 1202263, 1183699, 1164833, 1145291, 1124885, 1103601, 1081970, 1060903, 1040744, 1020914, 1000903, 981107, 962283, 944624, 927847, 911734, 896117, 880737, 865568, 850987, 837280, 824387, 812382, 801646, 792222, 783562, 775324, 767791]
58054G67791o793o922p976q962r224q986q477p616o698o328o504o732p102q096
58040F61375r307r577q668p630p206p070o952p203p694p517o507n894o609p878
58026E55663q403q074p646p440p276p117o909o264n010l768l243l339l547l770
58012D73857m122m285l763k672j694j266j165q35L5J173J884J775J289J216J762
57997D63189K487L026L348L385L050K531J927Q08j040k674k941k335k486l716
57983D68559m564m202l725m226n002m936m440m650n479n894n591n075m445l389
57969D02941k235j831k303k863k925k658k417k280k175j863r84L63J348J330P71
57954C82219N46O00K29n14o98Q3J089J474J346J401K039L078M054M593M782N141
$$ y = [767791, 760998, 754076, 746100, 737138, 727914, 718928, 710451, 702835, 696137, 689809, 683305, 676573, 669471, 661375, 652068, 642491, 633823, 626193, 618987, 611917, 604965, 597762, 590068, 582551, 576044, 570150, 563541, 555663, 547260, 539186, 531540, 524100, 516824, 509707, 502798, 496534, 491524, 487756, 484513, 481174, 477627, 473857, 469735, 465450, 461687, 459015, 457321, 456055, 454890, 454055, 454090, 455263, 457147, 458922, 460211, 461427, 463189, 465676, 468702, 472050, 475435, 478485, 481016, 482943, 483751, 482711, 480037, 477096, 474761, 472275, 468559, 463995, 459793, 456068, 451842, 446840, 441904, 437464, 432814, 427335, 421441, 415850, 410775, 406330, 402941, 400706, 398875, 396572, 393709, 390784, 388126, 385709, 383429, 381254, 379391, 378407, 378770, 380118, 381448, 382219, 382765, 383365, 383594, 383080, 382382, 382465, 383554, 385028, 386374, 387775, 389814, 392892, 396946, 401539, 406321, 411462]
57938D11462N988O941P456P685Q198Q950R208Q658P899P514P144N962L739J085
57924E07889j264l097m641o072p277q127q831r755j0834j1433j1059r967q839
57911D06693q033p432o889o414n947n303m395l356k372j566r58m48L4L20J47l33
57895C53748m91J8P69J131J132J299J832K439K889L252L494L366K757J872Q84
57880C80391k17j314k051k298k495l184m246m952m841m326m209m715n339n656
57866C30548n897o403o809o411n248m229l928l797k950j354K54J357K054K569
57852B89756K848K814K643K582K529K087J107N7l88k27k31r19j752j912j543j505
57836B97946k016k360k176j949j909j396jJ468K014J796J526J091o4j456j733
$$ y = [411462, 417450, 424391, 431847, 439532, 447730, 456680, 465888, 474546, 482445, 489959, 497103, 503065, 506804, 507889, 506625, 503528, 498887, 492815, 485538, 477411, 468580, 458825, 447991, 436558, 425499, 415532, 406693, 398660, 391228, 384339, 377925, 371978, 366675, 362280, 358924, 356552, 354986, 354028, 353580, 353614, 353934, 354081, 353748, 353257, 353275, 354044, 355175, 356307, 357606, 359438, 361877, 364766, 368018, 371512, 374878, 377635, 379507, 380391, 380174, 378860, 376809, 374511, 372016, 368832, 364586, 359634, 354793, 350467, 346258, 341543, 336204, 330548, 324651, 318248, 311439, 305028, 299780, 295551, 291623, 287826, 284876, 283522, 283776, 285133, 287187, 289756, 292604, 295418, 298061, 300643, 303172, 305259, 306366, 306423, 306035, 305808, 305577, 304658, 302906, 300994, 299451, 297946, 295930, 293570, 291394, 289445, 287536, 286140, 286139, 287607, 289621, 291417, 292943, 294034, 293970, 292514, 290781]
57821B90781m51J358K617L231L394K907J748P03N51R98J023J50j136k134k651
57806C03089k869k900k679k223j813j792k208k734l063l223l386l458l118k260
57792B65363j201m57l81j032k099k974l044k148p35M47R82J165J708K919M258
57777B62771M955M923M699M562M282L822L679M162M846N109M791L905K265K1j918
57762C16874k702k598k540k852l142l268l621m372n174n645n627m951l604k242
57748B64536j763k270k999l426l772m229m467m279m038m006l735k763j489q04
57734B20496j022j690k279k618k750k716k509k144j754j643j898j967j103N68
57720A94971J860J834Q29j71p28r77q61j59Q48J457J393J000N17k13j103j577
$$ y = [290781, 290330, 291688, 294305, 297536, 300930, 303837, 305585, 306288, 306839, 307837, 308860, 309010, 307874, 305740, 303089, 300220, 297320, 294641, 292418, 290605, 288813, 286605, 283871, 280808, 277585, 274199, 270741, 267623, 265363, 264162, 263705, 263324, 262292, 260193, 257219, 254175, 252027, 251292, 251739, 252721, 253886, 255594, 258513, 262771, 267726, 272649, 277348, 281910, 286192, 290014, 293693, 297855, 302701, 307810, 312601, 316506, 318771, 318792, 316874, 314172, 311574, 309034, 306182, 303040, 299772, 296151, 291779, 286605, 280960, 275333, 270382, 266778, 264536, 262773, 260503, 257504, 254078, 250306, 246077, 241610, 237331, 233293, 229287, 225552, 222789, 221300, 220496, 219474, 217784, 215505, 212887, 210137, 207421, 204912, 202768, 201014, 199371, 197473, 195506, 194403, 194971, 196831, 198665, 199494, 199323, 198595, 197618, 196757, 196598, 197446, 198903, 200296, 201296, 201813, 201600, 200497, 198920]
57704A98920j308p00j94M74J703L066L595K996J918R63K2j108k107k581k722k925
57688B00012l025k542j540o11J6P01J593K308K673L228M505O288Q081R961J2381
57673B44029J5454J8997K3068K7751L2435L6018L7870L7940L5794L0342K1082
57662E60780R171l286j4775k4772l2875l8241m0115l8608l4736k9887k5277k1588
57650B65791j8718j5963j2813r647p448o610o388n749m521l284k384j696j282
57637A69288j506k206k498j857r31p08j279j929k123j847j286p09m80o37p07m51
57621A48134m51j169j889j536m45r8r47j590p37R84J896J350J47p24r81q44o19
57604A40481n59p40r47q86m57J95P94J017O87N0m14n34n89p80r27q27n57k17K34
$$ y = [198920, 197612, 196912, 196718, 197192, 198895, 201961, 205556, 208552, 210470, 211433, 211455, 210347, 208240, 205659, 202937, 200012, 196987, 194445, 192905, 192294, 192310, 193011, 194604, 196912, 199585, 202813, 207318, 213606, 221687, 231648, 244029, 259483, 278480, 301548, 329299, 361734, 397752, 435622, 473562, 509356, 539698, 560780, 569951, 566665, 551890, 527118, 494243, 456002, 415887, 377279, 342543, 312656, 287379, 265791, 247073, 231110, 218297, 208650, 201202, 194592, 188204, 182455, 177934, 174650, 172266, 170570, 169288, 167782, 165576, 163078, 161221, 160290, 159582, 158303, 156374, 154251, 152404, 151118, 150409, 149929, 149292, 148585, 148134, 147683, 146514, 144625, 143089, 142644, 142546, 141599, 140009, 139272, 140256, 142152, 143502, 143649, 142925, 141944, 141100, 140481, 139922, 139182, 138235, 137349, 136892, 137087, 137881, 138898, 139585, 139635, 139221, 138687, 138098, 137318, 136391, 135564, 135007, 134790, 135024]
57585A35024O44N77p0p19p90m40j74m2K64O46N68j23q98j270j351j487j579j194
57567A27586k65O40Q45K01q22j594j717j141j09R01J415J311R29O84O82P15N55
57550A30816J35l39m59j0O13P58M19L41R08J499J469J188J383J805J620Q41L29
57533A43316L15N8q14j667k022k273k668k521j299K29Q60N55K93O23J141J302
57517A35428J041O23L70M63O62M20l92j109j069n05j10l6J40N83R29Q24L05l09
57499A38258o02l47J28J19n96j382j621j522j549j533j031k48K44M59Q34J260
57483A30871J108L66j66ML59J43p32j690k058j489k26R49J436J345J079O21j83
57466A31737r23j024p91j120k093k675k097p05P55J902K496K316J686J380J500
$$ y = [135024, 135668, 136245, 136175, 135456, 134666, 134226, 134052, 134010, 134274, 134920, 135488, 135365, 134467, 133197, 131846, 130359, 128780, 127586, 127321, 127961, 128806, 129007, 128185, 126591, 124874, 123733, 123624, 124525, 125940, 127251, 128180, 128864, 129546, 130261, 130816, 130951, 130612, 130153, 130143, 130756, 131514, 131933, 132274, 133182, 134681, 136150, 137338, 138721, 140526, 142146, 142987, 143316, 143631, 143689, 142875, 141208, 139186, 136913, 134245, 131724, 130425, 130654, 131514, 132069, 132362, 132985, 134126, 135428, 136469, 137092, 137462, 137925, 138587, 139007, 138615, 137506, 136437, 135932, 135822, 135786, 135926, 136509, 137438, 138262, 138567, 138258, 137656, 137309, 137437, 137556, 136960, 135578, 133957, 132435, 130886, 129353, 128322, 128074, 128318, 128777, 129611, 130871, 131979, 132345, 132179, 132183, 132542, 132685, 131953, 130263, 128205, 126716, 126490, 127439, 128875, 130220, 131299, 131920, 131737, 130814, 129790, 128999, 127879, 125786, 123111, 121014, 120309, 121064, 122966, 125462, 127778, 129464, 130844, 132344]
57451A32344J253L19l44J42J190J581J159P43O46L57l64r89r94m64K20Q29J254
57434A38882J480J621J704J389L57j058j989j907j057l4P28J064R98P24M47K55
57418A43604K16M56R36J276J142O60J66k55o38p81m59J05M71N97O82N90N0n80
57400A48238n32K29P99N86R4P5M71P43P92Q83R86P99K97k15n06m76J3Q94J626
57381A55796J710J379J322J685J905J639J358J691K507K950K405J185K47K52R19
57366A78950J430J439J326J425J459J148R19J328K023K117J533J185J650K438
57352B00370K853K846K735K608K501K478K194J067o11j459p00N70P73J8j94P83
57336B18832K013K507K350K010J556J055R15J233J386Q66J17J9Q11J976K915L348
$$ y = [132344, 133597, 133916, 133572, 133714, 134904, 136485, 137644, 138387, 139033, 139390, 139026, 138037, 137043, 136579, 136799, 137628, 138882, 140362, 141983, 143687, 145076, 145433, 144375, 142386, 140479, 139422, 139388, 140116, 141180, 142178, 142902, 143349, 143604, 143820, 144276, 145212, 146488, 147630, 148290, 148456, 148201, 147563, 146782, 146323, 146428, 146899, 147496, 148178, 148768, 148818, 148238, 147706, 147935, 148734, 149320, 149414, 149489, 149960, 150703, 151495, 152378, 153364, 154163, 154460, 154245, 153739, 153263, 153276, 154170, 155796, 157506, 158885, 160207, 161892, 163797, 165436, 166794, 168485, 170992, 173942, 176347, 177532, 177779, 178031, 178950, 180380, 181819, 183145, 184570, 186029, 187177, 188096, 189424, 191447, 193564, 195097, 196282, 197932, 200370, 203223, 206069, 208804, 211412, 213913, 216391, 218585, 219652, 219041, 217582, 216882, 217452, 218225, 218243, 218049, 218832, 220845, 223352, 225702, 227712, 229268, 230323, 231238, 232471, 233857, 234723, 234840, 234859, 235670, 237646, 240561, 243909]
57320B43909L286K992K854L006L227L287L187K957K617K484L017M128N050N278
57306B91279N159N180N162M718M171M237M995N749N999N977O124O496O826O869
57292C68941O601O247O172O564P198P624P633P361P055O883O924P243P953R141
57278D69540J0561J1531J1530J0983J0960J1853J2866J3139J2854J2743J2958
57267F01518J3143J3312J3818J4534J4845J4585J4346J4542J4703J4053J2514
57256G55913J0726R269Q169P242O664O891P893Q787Q734Q125Q292R826J1794J2956
57242H81281J3180J3042J2707J1985J1198J1029J1555J2166J2486J2747J3233
57231A016609J4000J5097J6528J7949J9013J9910K0931K1645K1328K0210J9286
$$ y = [243909, 247195, 250187, 253041, 256047, 259274, 262561, 265748, 268705, 271322, 273806, 276823, 280951, 286001, 291279, 296438, 301618, 306780, 311498, 315669, 319906, 324901, 330650, 336649, 342626, 348750, 355246, 362072, 368941, 375542, 381789, 387961, 394525, 401723, 409347, 416980, 424341, 431396, 438279, 445203, 452446, 460399, 469540, 480101, 491632, 503162, 514145, 525105, 536958, 549824, 562963, 575817, 588560, 601518, 614661, 627973, 641791, 656325, 671170, 685755, 700101, 714643, 729346, 743399, 755913, 766639, 775908, 784077, 791319, 797983, 804874, 812767, 821554, 830288, 838413, 846705, 856531, 868325, 881281, 894461, 907503, 920210, 932195, 943393, 954422, 965977, 978143, 990629, 1003376, 1016609, 1030609, 1045706, 1062234, 1080183, 1099196, 1119106, 1140037, 1161682, 1183010, 1203220, 1222506]
57220A222506J8878J8312J7355J6836J7276J7831J7479J6540J6158J6655J7260
57209A413086J7277J6838J6501J6595J7037J7489J7840J8486J9856K1502K2323
57198A614830K1956K1333K1417K1973K2343K2769K4032K5974K7507K8163K8707
57187A881004K9926L1521L2636L3019L3130L3361L3672L3890L4061L4329L4672
57176B245221L4881L4815L4560L4270L3928L3395L2664L1793L0712K9300K7778
57165B603317K6622K6034K5765K5558K5425K5375K5272K5167K5334K5714K5759
57154B885342K5192K4402K3684K2588K0730J8809J7967J8302J8785J8710J8369
57143C112880J8192J8041J7742J7675J8334J9703K1464K3434K5401K6929K7912
$$ y = [1222506, 1241384, 1259696, 1277051, 1293887, 1311163, 1328994, 1346473, 1363013, 1379171, 1395826, 1413086, 1430363, 1447201, 1463702, 1480297, 1497334, 1514823, 1532663, 1551149, 1571005, 1592507, 1614830, 1636786, 1658119, 1679536, 1701509, 1723852, 1746621, 1770653, 1796627, 1824134, 1852297, 1881004, 1910930, 1942451, 1975087, 2008106, 2041236, 2074597, 2108269, 2142159, 2176220, 2210549, 2245221, 2280102, 2314917, 2349477, 2383747, 2417675, 2451070, 2483734, 2515527, 2546239, 2575539, 2603317, 2629939, 2655973, 2681738, 2707296, 2732721, 2758096, 2783368, 2808535, 2833869, 2859583, 2885342, 2910534, 2934936, 2958620, 2981208, 3001938, 3020747, 3038714, 3057016, 3075801, 3094511, 3112880, 3131072, 3149113, 3166855, 3184530, 3202864, 3222567, 3244031, 3267465, 3292866, 3319795, 3347707]
57132C347707K9056L1237L4306L7090L8544L8575L7613L5919L3612L1034K8633
57121C723326K6601K4992K4200K5048K8259L4051M2153N1905O2278P2262Q1607
57110D196682R1118J02132J15881J33400J55467J82097K12454K46114K84516L30733
57100F050594L87752M57443N41129O40328P56367Q89615J039493J204720J382974
57091A3350415J570313J761300J949652K128455K289824K424871K524748K582375
57083C0581953K593464K555422K464384K312973K091476J792441J415808R71760
57075D6779681M80127l3693n45027j034869j489888j898353k247109k523105k717187
57066C4770577k826108k852062k801905k686769k521147k321142k102704j879956
$$ y = [3347707, 3376763, 3408000, 3442306, 3479396, 3517940, 3556515, 3594128, 3630047, 3663659, 3694693, 3723326, 3749927, 3774919, 3799119, 3824167, 3852426, 3886477, 3928630, 3980535, 4042813, 4115075, 4196682, 4287800, 4389932, 4505813, 4639213, 4794680, 4976777, 5189231, 5435345, 5719861, 6050594, 6438346, 6895789, 7436918, 8077246, 8833613, 9723228, 10762721, 11967441, 13350415, 14920728, 16682028, 18631680, 20760135, 23049959, 25474830, 27999578, 30581953, 33175417, 35730839, 38195223, 40508196, 42599672, 44392113, 45807921, 46779681, 47259808, 47226115, 46681088, 45646219, 44156331, 42257978, 40010869, 37487764, 34770577, 31944469, 29092407, 26290502, 23603733, 21082586, 18761444, 16658740, 14778784]
57058A4778784j663525j459877j272506j103682r54818q25782p14987o20477n40446
57049E622684m72966m16021l68092l28155k94957k66888k42647k21615k03408
57040B807935j87490j73330j60454j48290j36425j25061j14716j05395r6616q8244
57030A471914q0751p4380o8752o3489n8671n4346n0199m6122m2602l9987l7812
57019H54803l5332l2494k9882k7955k6709k5825k4789k3087k0799j8755j7671
57008E71505j7268j6722j5799j4973j4460j3764j2435j0803r576q997q674q091
56996D19943p067n745m346k992j686m20O69J420J960K790M357O501Q440R393R117
56981D42334P805N617K571j156n087q714j1718j3835j4750j4376j3101j1497r817
$$ y = [14778784, 13115259, 11655382, 10382876, 9279194, 8324376, 7498594, 6783607, 6163130, 5622684, 5149718, 4733697, 4365605, 4037450, 3742493, 3475605, 3232958, 3011343, 2807935, 2620445, 2447115, 2286661, 2138371, 2001946, 1876885, 1762169, 1656774, 1560158, 1471914, 1391163, 1316783, 1248031, 1184542, 1125871, 1071525, 1021326, 975204, 932602, 892615, 854803, 819471, 786977, 757095, 729140, 702431, 676606, 651817, 628730, 607931, 589176, 571505, 554237, 537515, 521716, 506743, 492283, 478519, 466084, 455281, 445705, 436708, 428034, 419943, 412876, 407131, 402785, 399793, 398107, 397687, 398356, 399776, 401736, 404526, 408883, 415384, 423824, 433217, 442334, 450139, 455756, 458327, 457171, 452084, 443370, 431652, 417817, 403067, 388691, 375590, 364093, 354276]
56968C54276p923n691l243q59J254L059M744O628Q864J1301J3671J5735J6988
56955D18804J6481J3393P934J441m579r386j3007j5591j7058j7329j6675j5555
56943C48873j4093j1925q811n264k174K17K561N488Q905J2364J5661J8546K0288
56930C90636K0175J8302J5317J1405O135o37q072j4727j9451k1940k2758k2716
56918C51669k2073k0495j7958j5269j3228j1698j0131q693q003p864p293n907
56906B03057m522l931l860l499k514j117L87J741K741L443M079M664N128N858
56892B11655P484R893J2131J3684J5129J7070J8995J9847J9225J7305J4020R196
56880C85634L493j594m972o813q030r093r514q438n813k757m72J173L526P500
$$ y = [354276, 346353, 340662, 337419, 336560, 337814, 340873, 345617, 352245, 361109, 372410, 386081, 401816, 418804, 435285, 448678, 456612, 458053, 453474, 444088, 431081, 415490, 398432, 381103, 364428, 348873, 334780, 322855, 314044, 308780, 306606, 306823, 309384, 314872, 323777, 336141, 351802, 370348, 390636, 410811, 429113, 444430, 455835, 461970, 461333, 453261, 438534, 419083, 397143, 374385, 351669, 329596, 309101, 291143, 275874, 262646, 250948, 240817, 232124, 224121, 216257, 208964, 203057, 198535, 194604, 190744, 187245, 184731, 183614, 184001, 185742, 188483, 191926, 196005, 200669, 205797, 211655, 219139, 229032, 241163, 254847, 269976, 287046, 306041, 325888, 345113, 362418, 376438, 385634, 389127, 387533, 382561, 375748, 367718, 358625, 349111, 340673, 334860, 332103, 331631, 332804, 336330, 343830]
56866C43830J2551J7535K1959K5960K9552L2490L4599L5698L5287L2717K7522
56855F49700J9524R058k493j2911k0508k5140k7505k7860k5994k2052j6645j0313
56843D86861l460L402J0001J6782K4323L2365M0053M7049N3542N9016O1796O0227
56831H91957N3812M2994K8405J0936p818k5663m0519n1040n6790n8046n5475n0010
56819F82743m2904l5428k8170k0812j2978n028K448R611J7167K5132L2497L8148
56807F62426M1522M2105L8995L1504K0016N980q678k2115l3030m1003m6239m8806
56795F42677m8354m4775l8879l2138k5801k0282j5246j0156m885J94M815R290
56783D16460J3936J8122K0519K0435J8368J5016J0294L853l916j1932j9284k5426
$$ y = [343830, 356381, 373916, 395875, 421835, 451387, 483877, 518476, 554174, 589461, 622178, 649700, 669224, 678282, 675789, 662878, 642370, 617230, 589725, 561865, 535871, 513819, 497174, 486861, 483401, 486803, 496804, 513586, 537909, 570274, 610327, 657376, 710918, 769934, 831730, 891957, 945769, 988763, 1017168, 1028104, 1020286, 994623, 954104, 903064, 846274, 788228, 732753, 682743, 639839, 604411, 576241, 555429, 542451, 537423, 539871, 549482, 566649, 591781, 624278, 662426, 703948, 746053, 785048, 816552, 836568, 842548, 833870, 811755, 778725, 737722, 691483, 642677, 594323, 549548, 510669, 478531, 452730, 432448, 417202, 407046, 402161, 402355, 407170, 416460, 430396, 448518, 469037, 489472, 507840, 522856, 533150, 537003, 533087, 521155, 501871, 476445]
56771D76445k9727l1565l1075k9348k7456k5517k2990j9768j6625j4402j3058
56760B14914j1746r856p684n968n059m711m492m109l450k658k102k005k128k123
56746A46823k090k359k787k751k021j134o46m92l39k42m60r03j192j186j074j004
56730A26143r60r71j155j444j568j323p22J05R88J645J773J328O13J3k37l3O40
56713A24835J534K108J922J221Q18J209J906J945J034j39p83q06n86k85J16L78
56697A36427Q5p26j468j603j084j59Q72J647J837J499J042O98K67l97r79j074
56681A36884p69m95m86o80j050j630k210k318j700o01N01J329J862K107J968J370
56665A34082M75l17o37m70j20J21K45L92O34R72J395J763J773J291P07O16J035
$$ y = [476445, 446718, 415153, 384078, 354730, 327274, 301757, 278767, 258999, 242374, 227972, 214914, 203168, 193312, 185628, 179660, 174601, 169890, 165398, 161289, 157839, 155181, 153079, 151074, 148946, 146823, 144733, 142374, 139587, 136836, 134815, 133681, 133035, 132543, 132204, 131962, 131502, 130599, 129407, 128221, 127147, 126143, 125183, 124212, 123057, 121613, 120045, 118722, 118000, 118105, 119093, 120738, 122511, 123839, 124452, 124465, 124228, 124195, 124835, 126369, 128477, 130399, 131620, 132438, 133647, 135553, 137498, 138532, 138393, 137610, 136804, 136218, 135933, 136049, 136427, 136512, 135786, 134318, 132715, 131631, 131472, 132344, 133991, 135828, 137327, 138369, 139067, 139334, 138937, 137958, 136884, 136115, 135620, 135134, 134454, 133404, 131774, 129564, 127246, 125546, 124945, 125446, 126775, 128637, 130744, 132712, 134082, 134557, 134240, 133603, 133133, 133013, 133134, 133379, 133771, 134405, 135377, 136772, 138535, 140308, 141599, 142306, 142922, 143957]
56648A43957J282R38N73J079K336L162K779J819J393J573J460O79J0K25R38J148
56632A65351N88n9k37j67l16o40p12l80Oj2n37j289j871k017j685j106p36j000
56614A53181j809k438k173j105m5L66J91k44q31j487j800j373l89N12R17R47R02
56597A43322R21R52Q94O88M62L82L56M5n52q73m48L46P20M82K04L50P50J004R96
56578A51001Q50P16Q02J373K409L418L711K957J524K59j93J8K17J80M66J547K937
56561A74192L717L692L473L522L667L642L509L393L175K676J884R64K46J47P46
56546B12645J516J813J567J099M46m91j317j336n95qk15q50j205j141r65q71q46
56529B09246r12j090j304j432j399j189r88j134j672k140k198k221k642l035k657
$$ y = [143957, 145239, 146177, 146750, 147829, 150165, 153327, 156106, 157925, 159318, 160891, 162351, 163030, 163040, 163265, 164203, 165351, 165939, 165880, 165643, 165476, 165160, 164520, 163808, 163428, 163434, 163422, 162885, 161596, 159725, 157708, 156023, 154917, 154181, 153181, 151372, 148934, 146761, 145656, 145611, 145977, 146168, 145924, 145093, 143606, 141806, 140433, 140044, 140556, 141473, 142420, 143322, 144243, 145195, 146089, 146777, 147239, 147621, 147977, 148022, 147470, 146597, 146149, 146495, 147215, 147697, 147901, 148251, 149001, 150005, 151001, 151851, 152567, 153369, 154742, 157151, 160569, 164280, 167237, 168761, 169020, 168827, 168845, 169062, 169242, 169708, 171255, 174192, 177909, 181601, 185074, 188596, 192263, 195905, 199414, 202807, 205982, 208658, 210542, 211506, 211752, 211899, 212645, 214161, 215974, 217541, 218640, 219086, 218595, 217278, 215942, 215347, 215339, 215124, 214274, 213069, 211928, 210963, 210092, 209246, 208334, 207244, 205940, 204508, 203109, 201920, 200932, 199798, 198126, 195986, 193788, 191567, 188925, 185890, 183233]
56514A83233j761j336j597j761j473j290j366r43K35J062O00m11n49L72J351J622
56498A75988J168K58o47q46j81M61J55p70j232q92l47m6R3J53K7j32K7M79Q26
56479A74542P79L10m67j128j007k0R73J173Q50P01P47O24N07P19Q23K10o17n83
56461A79136L17R66Q00L24o7n53j015q94l05q7l85k76O71J570J642J332J263J071
56443A85510K66n59m98J91M66N2l11pQ40J764K300K090J249M55J89P6l98q94o59
56424A92122K10P85N78Q1j23q4q8j14qJ83L96P88J429J885J567M82n37n87L99
56405A99364J570K051J734J093M77q8n47p24o79o91p11k79P42J765K153K006J835
56388B11071J739J399P87L60N30J207J910K120J612O77l7j49P1J64J77N42J269
$$ y = [183233, 181472, 180136, 178539, 176778, 175305, 174015, 172649, 171706, 171941, 173003, 173603, 173192, 172643, 173015, 174366, 175988, 177156, 177414, 176767, 175921, 175740, 176201, 176356, 175586, 174354, 173462, 173115, 173069, 173162, 173315, 173342, 173210, 173237, 173716, 174542, 175321, 175631, 175164, 174036, 173029, 173009, 173982, 175155, 176005, 176706, 177453, 178077, 178584, 179303, 180126, 180336, 179719, 179136, 179453, 180419, 181219, 181543, 181476, 180923, 179908, 179014, 178709, 178622, 178237, 177961, 178632, 180202, 181844, 183176, 184439, 185510, 185776, 185217, 184719, 184910, 185376, 185428, 185117, 185110, 185950, 187714, 190014, 192104, 193353, 193808, 193997, 194073, 193675, 192781, 192122, 192332, 193117, 193695, 193776, 193653, 193569, 193481, 193367, 193359, 193542, 193938, 194726, 196155, 198040, 199607, 200089, 199552, 198965, 199364, 200934, 202985, 204719, 205812, 206289, 206201, 205654, 204930, 204251, 203560, 202849, 202570, 203312, 205077, 207230, 209236, 211071, 212810, 214209, 214996, 215356, 215886, 217093, 219003, 221123, 222735, 223412, 223375, 223226, 223297, 223461, 223638, 224180, 225449]
56371B25449J702J226j1j141j333m38Q83J735J781J486J410J499J295P23K57K48
56355B36771N13O96P28P48P68O97M63j0p49j448j462m85R11J721J559R24M71L71
56337B43187M72P14J067J385J560J683J788J659J195P21N87O42N22L30M41P66
56321B58719Q24O03O79J245J722J688J555J790K017J588O88J44L32Q76J370J813
56305B77653K289K682K798K503J776Q97M20O15J078J204Q87M89L11M59R81J752
56289B98794K387K659K688K485J819R28P26J564K446K396K010K429L273L053J603
56274C31260N32R77K300L391M031M343M131L551L451M215N044N141M863N051N889
56259C88170P109Q610J0143J1075J1294J1658J2799J4137J4903J5488J6759J8626
$$ y = [225449, 227151, 228377, 228366, 227225, 225892, 225454, 226337, 228072, 229853, 231339, 232749, 234248, 235543, 236266, 236523, 236771, 237284, 237980, 238708, 239456, 240224, 240921, 241384, 241374, 240625, 239177, 237715, 237230, 238141, 239862, 241421, 242345, 242816, 243187, 243659, 244373, 245440, 246825, 248385, 250068, 251856, 253515, 254710, 255431, 256018, 256660, 257182, 257512, 257953, 258719, 259543, 260146, 260825, 262070, 263792, 265480, 267035, 268825, 270842, 272430, 273118, 273262, 273594, 274470, 275840, 277653, 279942, 282624, 285422, 287925, 289701, 290598, 291018, 291633, 292711, 293915, 294802, 295291, 295602, 296061, 297042, 298794, 301181, 303840, 306528, 309013, 310832, 311760, 312486, 314050, 316496, 318892, 320902, 323331, 326604, 329657, 331260, 331792, 332769, 335069, 338460, 342491, 346834, 350965, 354516, 357967, 362182, 367226, 372367, 377230, 382281, 388170, 395279, 403889, 414032, 425107, 436401, 448059, 460858, 474995, 489898, 505386, 522145, 540771]
56247E40771K0399K2107K4325K6887K8934L0176L1122L2027L2474L2091L0869
56236H52182K8739K5557K1683J7866J4359J0712O493J713l403q497j2858j5820
56224I38726j7469j8621j9957k1583k3276k4678k5294k4898k3902k2910k1951
56213F94187k0665j9082j7554j6088j4478j3033j2352j2266j1800j0446q791p537
56201E30095o609n650m753m183l731k977k027j465j612k143k397j938q15N30J586
56186D91911K078K012J549R24L72N8K6K87Q30J516K225L028M018M851M968M376
56170E25029L768L584L520L342L556M596N891O497O366O235O467O793P043P323
56156F00010P633P979Q789J0368J2081J2966J3249J4242J6565J9368K1668K3612
$$ y = [540771, 561170, 583277, 607602, 634489, 663423, 693599, 724721, 756748, 789222, 821313, 852182, 880921, 906478, 928161, 946027, 960386, 971098, 977591, 979304, 975901, 967404, 954546, 938726, 921257, 902636, 882679, 861096, 837820, 813142, 787848, 762950, 739048, 716138, 694187, 673522, 654440, 636886, 620798, 606320, 593287, 580935, 568669, 556869, 546423, 537632, 530095, 523486, 517836, 513083, 508900, 505169, 502192, 500165, 498700, 497088, 494945, 492548, 490610, 489795, 490325, 491911, 493989, 496001, 497550, 498474, 498846, 498904, 498930, 499217, 500047, 501563, 503788, 506816, 510834, 515685, 520653, 525029, 528797, 532381, 535901, 539243, 542799, 547395, 553286, 559783, 566149, 572384, 578851, 585644, 592687, 600010, 607643, 615622, 624411, 634779, 646860, 659826, 673075, 687317, 703882, 723250, 744918, 768530]
56144G68530K6009K9281L3453L8633M4977N2345O0299O8136P4860P9574Q2155
56133A358252Q3052Q2304P9296P3809O6756N9514N2820M6617M0533L4201K7393
56122B004547K0182J2810N299k442j0059j6785k2259k6967l1661l6791m2612m9335
56110A803927n6745o3900o9627p3062p3683p1291o6260n9550n2100m4404l6756
56099A136549k9611k3405j8245j3985j0440p417m824k763j326k88P02J662K438
56086A029047L202M290N495O219O354O442O787P124P352P877Q853R739J0087J0220
56072A129088J0645J1295J1914J2693J3909J5235J6129J6629J7200J7858J8080
56061A290675J7674J7268J7683J8989K0394K1069K1024K0938K1182K1286K0781
$$ y = [768530, 794539, 823820, 857273, 895906, 940883, 993228, 1053527, 1121663, 1196523, 1276097, 1358252, 1441304, 1523608, 1602904, 1676713, 1743469, 1802983, 1855803, 1902420, 1942953, 1977154, 2004547, 2024729, 2037539, 2042838, 2040396, 2030337, 2013552, 1991293, 1964326, 1932665, 1895874, 1853262, 1803927, 1747182, 1683282, 1613655, 1540593, 1466910, 1395619, 1329359, 1269809, 1217709, 1173305, 1136549, 1106938, 1083533, 1065288, 1051303, 1040863, 1033446, 1028622, 1025859, 1024533, 1024245, 1024947, 1026609, 1029047, 1032249, 1036539, 1042034, 1048253, 1054607, 1061049, 1067836, 1074960, 1082312, 1090189, 1099042, 1108781, 1118868, 1129088, 1139733, 1151028, 1162942, 1175635, 1189544, 1204779, 1220908, 1237537, 1254737, 1272595, 1290675, 1308349, 1325617, 1343300, 1362289, 1382683, 1403752, 1424776, 1445714, 1466896, 1488182, 1508963]
56050A508963K0139K0261K1220K2270K3102K4161K5559K6642K7183K8093L0177
56039A777770L2753L4443L5062L5728L7194L8845L9679L9646L9619M0240M1272
56028B192251M2138M2806M3822M5464M7285M8738M9980N1684N4225N7419O0897
56017B736709O4279O7165O9483P1813P4870P8711Q2909Q7358R2248R7368J02129
56006C625042J06381J10618J15311J20619J26722J33792J41553J49448J57256
55997D786742J65085J72902J80778J89410J99556K11143K23623K37066K52012
55988F618317K68481K86212L05594L27355L51542L78036M07724M41648M79305
55979I864214N19535N63014O12104O68123P30768Q00448Q79107R68412J069335
$$ y = [1508963, 1529102, 1549363, 1570583, 1592853, 1615955, 1640116, 1665675, 1692317, 1719500, 1747593, 1777770, 1810523, 1844966, 1880028, 1915756, 1952950, 1991795, 2031474, 2071120, 2110739, 2150979, 2192251, 2234389, 2277195, 2321017, 2366481, 2413766, 2462504, 2512484, 2564168, 2618393, 2675812, 2736709, 2800988, 2868153, 2937636, 3009449, 3084319, 3163030, 3245939, 3333297, 3425545, 3522913, 3625042, 3731423, 3842041, 3957352, 4077971, 4204693, 4338485, 4480038, 4629486, 4786742, 4951827, 5124729, 5305507, 5494917, 5694473, 5905616, 6129239, 6366305, 6618317, 6886798, 7173010, 7478604, 7805959, 8157501, 8535537, 8943261, 9384909, 9864214, 10383749, 10946763, 11558867, 12226990, 12957758, 13758206, 14637313, 15605725, 16675060]
55970A6675060J184349J317937J474227J656479J870089K124185K429521K797430
55962C1529277L242598L784966M447346N252180O219860P365714Q696837J0216308
55954H0755086J1934645J3874862J6061637J8500243K1148088K3866911K6357135
55947B12498607K8122999K8538188K7027892K3289154J7425269R921223J497077
55940C48320409p050262j4938125k1448214k6018570k8389894k8701349k7425064
55933A94348931k5161709k2438828j9623427j6937275j4499353j2356059j0506836
55926G2825444q930099p598059o478901n539024m749318m087031l531758l064106
55918B8847148k668889k335433k053616j812838j605375j427263j274725j142473
$$ y = [16675060, 17859409, 19177346, 20651573, 22308052, 24178141, 26302326, 28731847, 31529277, 34771875, 38556841, 43004187, 48256367, 54476227, 61841941, 70538778, 80755086, 92689731, 106564593, 122626230, 141126473, 162274561, 186141472, 212498607, 240621606, 269159794, 296187686, 319476840, 336902109, 346823332, 348320409, 341270147, 326332022, 304883808, 278865238, 250475344, 221773995, 194348931, 169187222, 146748394, 127124967, 110187692, 95688339, 83332280, 72825444, 63895345, 56297286, 49818385, 44279361, 39530043, 35443012, 31911254, 28847148, 26178259, 23842826, 21789210, 19976372, 18370997, 16943734, 15669009, 14526536]
55910A4526536j026320r24705q36506p59453o91459o31366n77712n28731m84245
55901H066039m45428m11977l81384l51879l24204k99552k77461k56796k37374
55892E079984k19442k02644j86516j71189j56844j43222j30189j17985j06591
55883C645362r5640q5413p7025p1282o8086o7198o8647p2114p6773q2000q7435
55872B793749r2243r5271r6198r5629r3936r0945q6901q2624p8407p3790o8773
55861A839032o4180o0471n7145n3748n0557m7761m4949m1819l8639l5576l2437
55850A311750k9437k7354k6418k5884k5150k4523k4335k4203k3695k2989k2232
55839A035530k1000j9156j7584j7321j8220j9137j9148j8170j6698j5315j4297
$$ y = [14526536, 13500216, 12575511, 11739005, 10979552, 10288093, 9656727, 9079015, 8550284, 8066039, 7620611, 7208634, 6827250, 6475371, 6151167, 5851615, 5574154, 5317358, 5079984, 4860542, 4657898, 4471382, 4300193, 4143349, 4000127, 3869938, 3751953, 3645362, 3549722, 3464309, 3387284, 3316002, 3247916, 3180718, 3112071, 3039957, 2963184, 2881184, 2793749, 2701506, 2606235, 2510037, 2414408, 2320472, 2229527, 2142626, 2060002, 1981595, 1907805, 1839032, 1774852, 1714381, 1657236, 1603488, 1552931, 1505170, 1460221, 1418402, 1379763, 1344187, 1311750, 1282313, 1254959, 1228541, 1202657, 1177507, 1152984, 1128649, 1104446, 1080751, 1057762, 1035530, 1014530, 995374, 977790, 960469, 942249, 923112, 903964, 885794, 869096, 853781, 839484]
55828H39484j3412j2357j1424j1177j1481j1511j0979j0602j1050j2012j2742
55817G10737j2892j2483j1647j0777j0374j0387j0157r310q192p164o103m892
55805E96359l792k960k159j329q12o76l75N17J791L091M230M761M107K565J343
55790F06661J017O84o69k780m785o565q463j0240j1273j1476j1162j0261q456
55777E22232n882k974K1K728M227L779J776q21l674o854r804j1608j2230j2449
55763D68467j2500j1773j0160q626p938p546o425m554k931k401k957m067n202
55750C81387o072o637p095p668q319q663q239o954n252l803l000k861l270m033
55736B99521m713m804m257l554l098k808k501k330k501k833l020l155l616m426
$$ y = [839484, 826072, 813715, 802291, 791114, 779633, 768122, 757143, 746541, 735491, 723479, 710737, 697845, 685362, 673715, 662938, 652564, 642177, 632020, 622710, 614518, 607354, 601251, 596359, 592567, 589607, 587448, 586119, 585307, 584631, 584256, 584773, 586564, 589655, 593885, 598646, 602753, 605318, 606661, 607678, 608362, 607693, 604913, 600128, 593563, 585100, 574860, 563587, 552111, 540949, 530688, 522232, 516350, 513376, 513397, 516125, 520352, 524131, 525907, 525086, 521412, 514558, 504754, 493146, 480916, 468467, 455967, 444194, 434034, 425408, 417470, 409924, 403499, 398945, 396014, 393613, 390656, 386589, 381387, 375315, 368678, 361583, 353915, 345596, 336933, 328694, 321740, 316488, 312685, 309685, 306824, 303554, 299521, 294808, 290004, 285747, 282193, 279095, 276287, 273786, 271456, 268955, 266122, 263102, 259947, 256331, 251905]
55722B51905n043m854l767k291j065k24O32J725K609K763K535K708L211L005J586
55707B55435k50j562k402l166l581l206k493k358k894l356l340l193l348l850
55693B16436m550n135n052m031k641j739j476j386j314j472j660j301m09K99M86
55678A85055O65J348K292K912K895K161P70p79j738j898j843k087k447k534k353
55663A82419k061j601r91n42l44K0P88J466J535J361J705K527L020K813K424K398
55647A96937K540K361J816J195M98n81k058l365l928l943m288n456o794p095n990
55632A61849m320l036k152j214l67k27p66j042l84P24J326J158O23o5j068k257
55616A48782l051l088k666k199j679j010n29o55j217j599j552j416j507j759k013
$$ y = [251905, 246862, 242008, 238241, 235950, 234885, 234661, 235293, 237018, 239627, 242390, 244925, 247633, 250844, 253849, 255435, 255185, 253623, 251221, 248055, 244474, 241268, 238775, 236417, 233523, 230167, 226827, 223634, 220286, 216436, 211886, 206751, 201699, 197668, 195027, 193288, 191812, 190426, 189112, 187640, 185980, 184679, 184270, 184569, 185055, 185720, 187068, 189360, 192272, 195167, 197328, 198098, 197319, 195581, 193683, 191840, 189753, 187306, 184772, 182419, 180358, 178757, 177766, 177224, 176880, 176900, 177688, 179154, 180689, 182050, 183755, 186282, 189302, 192115, 194539, 196937, 199477, 201838, 203654, 204849, 205347, 204766, 202708, 199343, 195415, 191472, 187184, 181728, 174934, 167839, 161849, 157529, 154493, 152341, 151127, 150760, 150533, 149767, 148725, 148341, 149065, 150391, 151549, 152172, 152107, 151039, 148782, 145731, 142643, 139977, 137778, 136099, 135089, 134560, 133905, 132688, 131089, 129537, 128121, 126614, 124855, 122842]
55601A22842k244k269j715o24K53J93o49j439j609j258o97JQ57J690K214K353
55585A17899K286K198K053J756J493J726K699M077N230N831O031O067O033N879
55571A71258N397M268K495P50k96r18k051l892n477n981n791n755n938n768n117
55556A37184m467m157m088m063l905l320k261j327j224j820k210j853j032k47
55542A01210L25N84L43k35n43j88M14N44Pp06j061r87p41m79p2N45J009P88j07
55523A00650r89j323j312j363j353r15k01K49L06K97L23J60j01p3J83L5o87j234
55505I2652q94n0K70l36j209j400o60L20N86j32j095j472j351j472j992k165j395
55488G8205r8Q55J092Q80N71L26P4l77j015j289o06O67J283O63j95k7R69J448
$$ y = [122842, 120598, 118329, 116614, 115990, 116243, 116436, 115787, 114348, 112739, 111481, 110784, 110785, 111642, 113332, 115546, 117899, 120185, 122383, 124436, 126192, 127685, 129411, 132110, 136187, 141417, 147248, 153279, 159346, 165379, 171258, 176655, 180923, 183418, 184168, 183872, 182954, 180903, 177011, 171534, 165553, 159762, 154007, 148069, 142301, 137184, 132717, 128560, 124472, 120409, 116504, 113184, 110923, 109596, 108372, 106552, 104342, 102489, 101457, 101210, 101535, 102119, 102462, 102227, 101684, 101496, 101910, 102454, 102461, 101755, 100694, 99707, 98966, 98487, 98415, 98960, 99969, 100757, 100650, 99661, 98338, 97026, 95663, 94310, 93395, 93194, 93443, 93749, 94046, 94369, 94529, 94428, 94355, 94538, 94573, 93886, 92652, 91758, 91708, 91978, 91642, 90433, 89033, 88373, 88693, 89279, 89147, 88052, 86580, 85229, 83757, 81765, 79600, 78205, 78107, 78962, 80054, 80934, 81505, 81831, 81905, 81528, 80513, 79224, 78618, 79285, 80568, 81231, 81036, 81009, 81978, 83426]
55470H3426Q22n9j89L41P37N76R2l41n67n69m14l33n68r91j085n60J07P9p61j496
55450G8247j226j43Q01J117J094J049R24P57R15J484J893J589P93J11l10p62j278
55433H7055j427r14p5M42L66J24L46J029J439J081N45Q13J792K307J694O91L03
55416I7611M76N52M61N87P97M87l60j006j012q29j086j749k261k232j722j160
55400H7554j022j391j720j348l48M51M63P4Q7O46J016N26n66j320j214p23o49
55383H0516j107j463j284q56o25n10j47M47Q87R55P98O45O03O46O35L64j57n93
55365G9754o46l96r9K08N94R22R28N44n9o33q44m15M28R47O94P1l14m84p42q33
55345G9625k52O93J003K97o76j072q52m74k06j82m60p15l58O36J387J121K03l26
$$ y = [83426, 84248, 84189, 84000, 84341, 85078, 85654, 85746, 85405, 84838, 84269, 83855, 83522, 82954, 81963, 80878, 80318, 80425, 80504, 79743, 78247, 77021, 76878, 77679, 78796, 79890, 80939, 81863, 82620, 83535, 85019, 86912, 88501, 89294, 89405, 89095, 88333, 87055, 85628, 84714, 84639, 85081, 85447, 85571, 85917, 86946, 88385, 89466, 90011, 90824, 92616, 94923, 96617, 97308, 97611, 98087, 98639, 99100, 99687, 100484, 100971, 100611, 99605, 98593, 97764, 96678, 94929, 92668, 90436, 88714, 87554, 86532, 85141, 83421, 82073, 81725, 82176, 82639, 82713, 82800, 83446, 84462, 84988, 84422, 83102, 81888, 81165, 80516, 79409, 77946, 76662, 75806, 75181, 74671, 74524, 74971, 75858, 76813, 77611, 78256, 78859, 79505, 80140, 80504, 80347, 79754, 79108, 78712, 78613, 78821, 79415, 80337, 81265, 81809, 81750, 81117, 80273, 79858, 80286, 81233, 81927, 81998, 81684, 81200, 80458, 79625, 79373, 80066, 81069, 81366, 80690, 79618, 78766, 78292, 78086, 77904, 77444, 76729, 76371, 77007, 78394, 79515, 79718, 79392]
55327G9392l4N26O35J60m86q48p61m27k01k39l77l27L3N56Q76O94K03N2N37R96
55307H0960N42o12j210n59O00J174J051Q32P55O08M08L94M33J33l85n15j33Q4
55289H4560l83j066j096l03O15R21N07k32p79q18l76J77M31L29J91K55L83L46
55271H3662K10J83J57j98q02j094p80l31l05n03k94L44P06K94n98j311j432r05
55253G7003k1O00N04K1n6M02O56L15L4M66J111J005J67n34p65j040j553j622p29
55234G5964M95R63M48k42l35J43O11O27K15k64m43j88L06O01L49l26p91m89M23
55215G8067J183J252Q05L08p2l57l81M8O92R87O71M4m38o16o06n71n59m50j13
55196G9894L63O61O12M23L68M57N88P88J017R15K23o62j014o51p2K92N39Q53J068
$$ y = [79392, 79358, 79884, 80519, 80679, 80193, 79345, 78584, 78157, 77956, 77717, 77340, 77013, 77046, 77602, 78478, 79172, 79375, 79427, 79964, 80960, 81502, 80890, 79680, 79121, 79721, 80895, 81946, 82778, 83533, 84141, 84549, 84943, 85376, 85509, 85124, 84609, 84476, 84560, 84177, 83111, 82015, 81712, 82327, 83248, 83755, 83523, 82744, 81926, 81550, 81727, 82158, 82487, 82678, 82933, 83316, 83662, 83872, 84055, 84212, 84014, 83212, 82118, 81338, 81007, 80702, 80199, 79905, 80249, 80955, 81249, 80651, 79340, 77908, 77003, 76982, 77582, 78086, 78107, 78051, 78453, 79109, 79424, 79458, 79924, 81035, 82040, 82207, 81673, 80908, 79868, 78315, 76693, 75964, 76459, 77422, 77870, 77628, 77293, 77436, 78047, 78674, 78889, 78625, 78182, 77994, 78300, 78901, 79250, 78924, 78133, 77644, 78067, 79250, 80502, 81307, 81615, 81543, 81186, 80805, 80853, 81545, 82532, 83203, 83247, 82809, 82193, 81587, 81016, 80457, 80007, 79894, 80257, 80918, 81530, 81953, 82321, 82778, 83366, 84154, 85171, 86086, 86309, 85647, 84633, 83982, 83910, 84202, 84741, 85594, 86662]
55177H6662Q83L21k63n08l07J21M14M34L90M33L40m6l45o3O03R68P92M76K57m8
55157I1514l93l24K20N72L05m8J64O30N01l20r69p57k5K66m15j498j800q30M47
55138H7240O02m70j425j302o52l54k15L98J146J069J12p46q87o64n49n58o54r10
55120H1181j029n28L97Q68N73K63O00J139J069M46M8K79P71R24M89k57o29r5J057
55101H7566J839J605O98k07q88j407j525r60%O76P86O28N44N67O14O32N27K57
55083I1952k1j23j31k17l07k30j35m39j196j842j718p50M36J014O94l9l94r0M85
55064H6949Q49Q69N95P8m19m57k3K41j01n74m55J16L48l6n29o84n71k78L32J134
55044H7384J550J168K38o53j076q13P5J016J194M40m72o89j70N36J012J146Q86
$$ y = [86662, 87545, 87866, 87603, 87095, 86788, 86909, 87323, 87757, 88147, 88580, 88920, 88874, 88529, 88466, 89069, 90037, 90829, 91305, 91562, 91514, 91121, 90797, 91017, 91589, 91894, 91846, 92010, 92640, 93141, 92821, 91852, 91095, 91070, 91336, 90921, 89423, 87623, 86793, 87240, 87842, 87372, 85947, 84645, 83993, 83639, 83424, 83822, 84968, 86037, 86149, 85403, 84516, 83852, 83303, 82745, 82091, 81181, 80152, 79624, 80021, 80889, 81462, 81725, 82325, 83464, 84533, 84979, 85027, 85306, 86077, 87001, 87490, 87233, 86604, 86509, 87566, 89405, 91010, 91708, 91501, 90613, 89206, 87681, 86721, 86721, 87397, 88183, 88811, 89355, 89922, 90536, 91168, 91695, 91952, 91931, 91808, 91677, 91460, 91153, 90923, 90788, 90349, 89153, 87311, 85593, 84843, 85279, 86293, 86987, 86948, 86554, 86464, 86949, 87798, 88667, 89262, 89340, 88921, 88464, 88441, 88682, 88581, 88007, 87552, 87668, 88016, 87980, 87451, 86767, 86196, 85918, 86250, 87384, 88934, 90102, 90340, 89687, 88611, 87798, 87873, 88889, 90083, 90523, 90051, 89362, 89192, 89728, 90740, 91886, 92772]
55027I2772L06k33l75k10q5o3R9M98Q88R40N28j81p49p06JP94R56L82l90q78j071
55006I3223j123r50m77o7k78j012j359n90Q41J780J720J233R04N39j89q53p77
54989I2565j00L83L47K33L70N59O82R87J435J443P11j96n57l92j64k6J37K16K9
54970I8662k64k93L4N70J209J735J680Q86K6l6O22J077P61N3m36n96o26n42k67
54951A04255M7Q7k34o56q33o55l11j1K17M15M43J46k41k28K56P35Q78Q64Q42N19
54931A06535j60m74K57J555K225J770Q06J62K21J042K398L616M076L982M066M479
54915A36556M556L860K729J631O12k97q33j050j498k457l444l931m041m067l808
54900A24518k970j930j373j406j553j507j341j075n69Q2M63L50k7k64j75J69O17
$$ y = [92772, 93078, 92845, 92470, 92260, 92175, 92112, 92211, 92709, 93597, 94537, 95065, 94884, 94135, 93429, 93430, 94224, 95180, 95562, 95172, 94294, 93223, 92100, 91150, 90673, 90606, 90328, 89316, 87957, 87367, 88208, 89988, 91708, 92941, 93845, 94384, 94195, 93342, 92565, 92465, 92848, 93195, 93428, 93798, 94357, 95039, 96026, 97461, 98904, 99615, 99419, 98862, 98470, 98306, 98280, 98417, 98633, 98662, 98398, 98105, 98139, 98709, 99918, 101653, 103333, 104219, 104245, 104209, 104831, 105908, 106669, 106722, 106286, 105690, 105064, 104522, 104255, 104302, 104389, 104155, 103499, 102666, 102011, 101700, 101689, 101906, 102321, 102764, 102910, 102669, 102441, 102697, 103432, 104310, 105174, 106016, 106535, 106375, 105901, 106158, 107713, 109938, 111708, 112514, 112676, 112897, 113939, 116337, 119953, 124029, 128011, 132077, 136556, 141112, 144972, 147701, 149332, 149944, 149647, 148814, 147764, 146266, 143809, 140365, 136434, 132393, 128326, 124518, 121548, 119618, 118245, 116839, 115286, 113779, 112438, 111363, 110794, 110876, 111339, 111689, 111662, 111398, 111223, 111392, 112009]
54883A12009J076J515J875K032J995K057K498L148L613L874M254M649M381L137
54869A52113J583N68O8n83j612k560k983k960k891l077l495l719l302k439j983
54854A22728k419l093l014k132j279q81n35R5N95M23k64p66o84k91j95o57j254
54837A06377j250m60L94M30l88j222j303n99L78J005Q89J64m78m48N0L16J15j20
54819A03850n4J26J75J75K21J91R1K08N82P92N75L27M73P02L95m22j076j146q55
54800A05330n42k76q7j56n32r39j067r04o01k04L18R14J427J720J706J377Q97
54783A08381O13P92J285J591J355P78M13N54R58J269J485J810K215K462K570K869
54767A31400L452L918L912L645L595L835M013L899L537K923J860L36j299k652
$$ y = [112009, 113085, 114600, 116475, 118507, 120502, 122559, 125057, 128205, 131818, 135692, 139946, 144595, 148976, 152113, 153696, 154264, 154332, 153749, 152137, 149577, 146594, 143634, 140743, 137666, 134171, 130452, 127150, 124711, 122728, 120309, 117216, 114202, 112070, 110791, 109910, 109375, 109470, 110065, 110488, 110224, 109458, 108774, 108483, 108288, 107631, 106377, 105127, 104667, 105061, 105491, 105103, 103881, 102578, 101979, 102357, 103362, 104251, 104415, 103937, 103489, 103539, 103855, 103970, 103850, 103796, 103922, 104097, 104272, 104493, 104684, 104775, 104983, 105565, 106357, 106932, 107259, 107732, 108434, 108829, 108407, 107331, 106185, 105330, 104788, 104512, 104425, 104269, 103737, 102798, 101731, 100827, 100226, 100022, 100340, 101254, 102681, 104401, 106107, 107484, 108381, 108994, 109786, 111071, 112662, 114017, 114795, 115208, 115762, 116720, 117989, 119474, 121284, 123499, 125961, 128531, 131400, 134852, 138770, 142682, 146327, 149922, 153757, 157770, 161669, 165206, 168129, 169989, 170325, 169026, 166374]
54753A66374l627m333m803m967m786m240l334k197j199p89j169k074k877k983
54739A22996k293j342p89p50p09j98O24J209J292J107J026J209J614K115K524
54724A29635K671K607K609K895L387L802L861L389K381J119J03l51m13n62j107
54709A56026j996k985l806m260m337m279m311m313l917l004j890j015n68m61m46
54694A14438k32K35N39J66p47j391j243o78k89QO15J234J075J48m63l6O98N57
54676A14634m30j109q31j96l0k47k53%k4n44j065j049o20k93k72k47P0N30P09
54657A08733L86k43q03j069j056q57m68J09P47J248J595J925K235K259J766Q72
54641A17379j20j003j601j671j179n55k75k00J66P56Q49J61n51m50K49O75N89
$$ y = [166374, 162747, 158414, 153611, 148644, 143858, 139618, 136284, 134087, 132888, 132099, 130930, 128856, 125979, 122996, 120703, 119361, 118572, 117822, 117113, 116915, 117539, 118748, 120040, 121147, 122173, 123382, 124996, 127111, 129635, 132306, 134913, 137522, 140417, 143804, 147606, 151467, 154856, 157237, 158356, 158459, 158108, 157695, 157133, 156026, 154030, 151045, 147239, 142979, 138642, 134363, 130052, 125739, 121822, 118818, 116928, 115913, 115345, 114884, 114438, 114206, 114441, 114980, 115146, 114399, 113008, 111765, 111087, 110798, 110806, 111421, 112655, 113730, 113878, 113415, 113379, 114077, 114634, 114204, 113095, 112264, 112068, 112038, 111791, 111538, 111538, 111514, 110970, 109905, 108856, 108236, 107943, 107671, 107424, 107494, 108024, 108733, 109119, 108876, 108073, 107004, 105948, 105091, 104623, 104732, 105479, 106727, 108322, 110247, 112482, 114741, 116507, 117379, 117259, 116256, 114655, 112984, 111805, 111250, 110975, 110775, 110941, 111697, 112546, 112707, 112156, 111706, 111955, 112630, 113219]
54624A13219N37Q01Q76K78o47j108q19k02J60J5m95j020j177p38J91J120J422
54607A12413Q76N2j36N05J108P98j09n13jP09R04P29O04L73k64r42r08r9O77P50
54587A17526L38Q0K18M48M15J82J62O86J589K336K558K343J924J292M03m43q31
54570A31226p82p31r03j044r16o39m57l95l95m49m45j25M94R23P90L79K23K67
54552A27021j5o46r11l03P21J317J278J017P72M05mN2P52J439J246J91q21j038
54534A32473n74K2M88Q68J039P14m2o60o36o4N63R38J094J072Q14L78Kj78l28
54515A37983o18r84j292j617k011k113j414J9J390J926J647J164R01P41M36J07
54499A36265J20N88J161J427J362J229J077O57l2m48j18O02Q87N44K48M40O13
$$ y = [113219, 113756, 114557, 115433, 115711, 115064, 113956, 113137, 112935, 113095, 113110, 112615, 111595, 110418, 109680, 109871, 110991, 112413, 113289, 113341, 113205, 113710, 114818, 115616, 115507, 114994, 114993, 115702, 116606, 117335, 117939, 118312, 118048, 117106, 116198, 116099, 116776, 117526, 117864, 117944, 118162, 118610, 119025, 119207, 119369, 120055, 121644, 123980, 126538, 128881, 130805, 132097, 132500, 132057, 131226, 130444, 129713, 128810, 127766, 126850, 126211, 125754, 125359, 124964, 124515, 124070, 123945, 124439, 125362, 126152, 126531, 126754, 127021, 127006, 126360, 125449, 125146, 125867, 127184, 128462, 129479, 130251, 130656, 130652, 130704, 131456, 132895, 134141, 134332, 133511, 132473, 131899, 131921, 132409, 133277, 134316, 135030, 134988, 134328, 133692, 133628, 134191, 135129, 136223, 137295, 138109, 138487, 138489, 138311, 137983, 137365, 136381, 135089, 133472, 131461, 129348, 127934, 127953, 129343, 131269, 132916, 134080, 134981, 135722, 136158, 136265, 136385, 136973, 138134, 139561, 140923, 142152, 143229, 143886, 143854, 143406, 143288, 143890, 144777, 145321, 145569, 146009, 146622]
54482A46622J07p18p96K18J469J966J697J347J300J302R69L14l05n69m73l28m42
54465A53680p55q18l03N48J130J112P01K54j45n38p93p30m52l11m42o62q25r59
54447A49692j013p76l43k02n59r00o67j00J74J53L54P56O76r5q42r27n86l15o7
54428A44413L64P02O18L99M90O75M01k56o26m19m7K9k65p79j223j156m50K54J54
54409A43278o25j162r67m21M7N10J071J495J653J787K010J988J475P22N8m78q16
54392A51625o54J6O25O59K69o5j46J7M36R14R91N43P0n2j61o34j057p20L12J270
54372A54258J659J534R67j2j010j414j111n54j01J95J94k80r14j032m45L06O50
54355A52890M72j64j119j817j533m32L64K48k0M54J190R96j88j168j177o74k82
$$ y = [146622, 146729, 146011, 145215, 145433, 146902, 148868, 150565, 151912, 153212, 154514, 155483, 155797, 155492, 154923, 154450, 154122, 153680, 152925, 152107, 151804, 152352, 153482, 154594, 155295, 155549, 155404, 154866, 154073, 153343, 152891, 152580, 152138, 151476, 150651, 149692, 148679, 147903, 147560, 147358, 146799, 145899, 145232, 145132, 145306, 145459, 145813, 146569, 147245, 147150, 146308, 145381, 144795, 144480, 144413, 144777, 145479, 146097, 146496, 146986, 147661, 148062, 147806, 147180, 146761, 146714, 146743, 146478, 145699, 144476, 143320, 142870, 143124, 143278, 142653, 141491, 140524, 140103, 140150, 140660, 141731, 143226, 144879, 146666, 148676, 150664, 152139, 152861, 152919, 152441, 151625, 150971, 150987, 151612, 152271, 152540, 152475, 152329, 152346, 152782, 153696, 154687, 155230, 155300, 155248, 155087, 154453, 153396, 152676, 152988, 154258, 155917, 157451, 158418, 158406, 157396, 155982, 154871, 154317, 154216, 154411, 154605, 154325, 153411, 152379, 151934, 152240, 152890, 153362, 153198, 152079, 150262, 148729, 148297, 148661, 148909, 148889, 149343, 150533, 151529, 151341, 150173, 148996, 148322, 148040]
54338A48040J56Q86J453J305P31M36M73L04j72m65l64k90n67r56j163j265j345
54321A47197j223r45j009j523j709r00L07O75J2o36m97L7K89K70L51M55J72n88
54303A40735j433j868j666j003l65j20q3J75O52R09Q24P71Q78P13P2n19n80m58
54285A37634p32j150r07J58J204J372O63k28o62n16r7K63N23P30O92J80n43q46
54267A37738n50j40K1J42M41P06Q05R47J055N86m33r28j95Q43Q28q7o46m72l22
54248A40339n29n32j73j03n18o50n9N29L67k33n82o45p17p40o62q61j476j801
54230A30954j194j96P5n59j190j050k26P90J558J710J129K76j77j04J3j00j39
54213A31570K30P94J062Q65M75J94K6k14o02r44r73o15n1M73P35N83J07k72k11
$$ y = [148040, 148196, 149082, 150535, 151840, 152571, 153007, 153480, 153784, 153612, 153147, 152783, 152493, 151926, 150970, 149807, 148542, 147197, 145974, 145029, 144020, 142497, 140788, 139888, 140195, 140870, 140882, 140246, 139749, 139786, 140075, 140345, 140696, 141151, 141323, 140735, 139302, 137434, 135768, 134765, 134400, 134280, 134197, 134372, 135024, 135933, 136757, 137528, 138406, 139119, 139191, 138672, 138092, 137634, 136902, 135752, 134845, 135003, 136207, 137579, 138242, 138014, 137352, 136836, 136739, 137002, 137525, 138255, 138947, 139127, 138584, 137738, 137188, 137048, 137069, 137211, 137652, 138358, 139163, 140110, 141165, 141751, 141318, 140390, 140195, 141038, 141866, 141779, 141133, 140661, 140339, 139810, 139278, 139105, 139002, 138484, 137834, 137775, 138304, 138671, 138438, 137856, 137211, 136494, 135754, 135092, 134231, 132755, 130954, 129760, 129564, 129639, 129080, 127890, 126840, 126614, 127404, 128962, 130672, 131801, 132077, 131900, 131796, 131809, 131709, 131570, 131800, 132594, 133656, 134521, 134996, 135190, 135216, 135002, 134400, 133456, 132483, 131868, 131817, 132290, 133025, 133608, 133715, 133443, 133232]
54194A33232L7r9o31q25k25O19Q32M47L05P95J266R12j13r19j018q00q16r51p44
54175A31304k13J21Q2J34N31P19J64o74q67l56kk83p35p85n07k56r8P3L29P71
54155A29452J359J584Q65m33j153q00j59j7pN39J340J624J392J248J201O76l48
54138A38363j072r83m74j44l7R6K92L84K77jk94l32J0M43N23J75k98o37p54n57
54118A34980j5N76Q84J027J370J780J665Q71L8k15o5j04m73q12q44p19o89p47
54100A38508o30k04K87L61j93r79j336r22N7J060J545J258N16Q2L94R59Q81j1
54082A41633r31j133p19k25J74O62J158J242P54J60PK47L07j04o29p86n86l79
54064A40852k36K3L42M01K60M87J337K221K364J778J159J051J500K276L055L448
$$ y = [133232, 133269, 133170, 132539, 131714, 131489, 132108, 132940, 133387, 133692, 134487, 135753, 136665, 136552, 135633, 134615, 133815, 132999, 132048, 131304, 131091, 131212, 131294, 131428, 131959, 132678, 132842, 132168, 131301, 130945, 130943, 130660, 129925, 129140, 128633, 128377, 128279, 128352, 128681, 129452, 130811, 132395, 133260, 132827, 131674, 130874, 130715, 130698, 130691, 131230, 132570, 134194, 135586, 136834, 138035, 138711, 138363, 137291, 136308, 135834, 135690, 135653, 135749, 136041, 136425, 136702, 136701, 136407, 136075, 136085, 136528, 137051, 137226, 136928, 136291, 135537, 134980, 134965, 135541, 136425, 137452, 138822, 140602, 142267, 143138, 143176, 142961, 142896, 142792, 142319, 141507, 140663, 139944, 139255, 138508, 137878, 137674, 137961, 138322, 138129, 137150, 135814, 134892, 134949, 136009, 137554, 138812, 139328, 139410, 139804, 140763, 141644, 141633, 140702, 139569, 138850, 138625, 138799, 139461, 140619, 141861, 142615, 142775, 142782, 143029, 143336, 143232, 142603, 141817, 141231, 140852, 140616, 140639, 140981, 141382, 141642, 142129, 143466, 145687, 148051, 149829, 150988, 152039, 153539, 155815, 158870, 162318]
54048A62318L315L033L111L643M469N623P132Q537R275R557J0259J1700J3004
54035B54976J2988J1320Q584N518K561j69k731n312q011j0562j2294j2525j1218
54022B33125r291p993p741p778p188n990m888m250l816l299k689k012j301q24
54008A64065q44j123j133q28o79q59r66p49n06n03m97k13J11J17j36l87o93j207
53990A52970j675j625j024l63p4r3p8J50M52N50L29o1l93n55m82p6N52R14N61
53971A49979l23j057j199q20j43O85J392J616J310Q23M83L76N44R74J383J441
53955A57464J222J030Q04L47K5M57J326J516P49J23M43R71P41K77P93K193L149
53938A73630L008K431K102J919J782K115L118M161M496M115L489K875K266J746
$$ y = [162318, 165633, 168666, 171777, 175420, 179889, 185512, 192644, 201181, 210456, 220013, 230272, 241972, 254976, 267964, 279284, 287868, 293386, 295947, 295778, 293047, 287735, 279724, 269162, 256868, 244343, 233125, 223834, 215841, 208100, 200322, 193134, 187144, 182256, 178006, 174190, 170891, 168202, 166190, 164889, 164065, 163221, 162098, 160965, 160137, 159458, 158599, 157633, 156884, 156378, 155875, 155378, 155165, 155276, 155393, 155257, 154870, 154177, 152970, 151295, 149670, 148646, 148283, 148209, 148116, 148038, 148188, 148640, 149190, 149519, 149458, 149065, 148510, 148028, 147952, 148504, 149418, 149979, 149656, 148599, 147400, 146580, 146437, 147122, 148514, 150130, 151440, 152263, 152746, 153122, 153666, 154640, 156023, 157464, 158686, 159716, 160520, 160867, 160892, 161349, 162675, 164191, 164940, 165063, 165506, 166477, 167218, 167495, 168288, 170481, 173630, 176638, 179069, 181171, 183090, 184872, 186987, 190105, 194266, 198762, 202877, 206366, 209241, 211507, 213253]
53924B13253J470J474J724K250L015L780M296M509M470M170L537K545J294R9o71
53909B51215j000j342k065k921l419l638m140n018n582n238m283l486l147k902
53895B03034k290j274j75O76J229J754K563L734N144O713Q356R690J0070R064
53881B58288O783L723M23k646n136o945q199r049r472r357q632p387n969m886
53867A91539m403m186l639k625j637j183j200j260j111q18n19k74j34k00n25j014
53851A66811j385j288n42O40J740K240J915R16k59j029j156r01o53n13l25o6J10
53834A66255J18L5o9j56j22R5L32M12M44N98O70L02l49o67l98N1L53P28J381J903
53814A71916J791J235R05J091J511J802J800J424P18N6j21K39Q15J301J491J149
$$ y = [213253, 214723, 216197, 217921, 220171, 223186, 226966, 231262, 235771, 240241, 244411, 247948, 250493, 251787, 251886, 251215, 250215, 248873, 246808, 243887, 240468, 236830, 232690, 227672, 222090, 216852, 212569, 209083, 205936, 203034, 200744, 199470, 199295, 199971, 201200, 202954, 205517, 209251, 214395, 221108, 229464, 239154, 249224, 258288, 265071, 268794, 269217, 266571, 261435, 254490, 246291, 237242, 227770, 218413, 209781, 202394, 196425, 191539, 187136, 182950, 179311, 176686, 175049, 173866, 172666, 171406, 170295, 169477, 168958, 168684, 168550, 168350, 167825, 166811, 165426, 164138, 163596, 164236, 165976, 168216, 170131, 171047, 170788, 169759, 168603, 167702, 167049, 166536, 166211, 166145, 166255, 166373, 166408, 166339, 166183, 166061, 166156, 166488, 166900, 167344, 167942, 168612, 168914, 168565, 167898, 167500, 167551, 167904, 168632, 170013, 171916, 173707, 174942, 175847, 176938, 178449, 180251, 182051, 183475, 184193, 184249, 184128, 184367, 185182, 186483, 187974, 189123]
53798A89123K93m82m57K72Q41P00K52J12K73L31J91M2j10l56m90j92L49N18R3
53779A91303m00l78P7M31M02J12l13q84j482j711j325o86n19j099j794j701p53
53762A79280J23J14m26n05J36P11N92J61R4K94K05j10k1N48Q30L60k78k90K00
53743A82018M39K08N4M49J148J580J460R42M17K64O19J228J602J452R62N99O32
53726A96073Q13O52Q4k46K95J405K073J874J459J479J636J393J104J573K642L229
53710B17538K818K059J694J657J675J922K585L290L562L401K982K261J512J600
53696B50556K877M215M156K868J872J883J988J338N06M79J028J087L00o19r72
53681B73562p78m14j77k86q17j410j501r80l62j53l08m68m55l79m34p61j338j840
$$ y = [189123, 189416, 188934, 188477, 188749, 189590, 190290, 190542, 190654, 190927, 191258, 191449, 191491, 191381, 191025, 190535, 190343, 190692, 191210, 191303, 190903, 190525, 190602, 191033, 191435, 191547, 191234, 190350, 188868, 187157, 185832, 185146, 184627, 183528, 181734, 180033, 179280, 179403, 179517, 179091, 178586, 178722, 179433, 180025, 180186, 180280, 180574, 180779, 180669, 180648, 181196, 182026, 182386, 182108, 181818, 182018, 182457, 182665, 182719, 183168, 184316, 185896, 187356, 188298, 188715, 188979, 189598, 190826, 192428, 193880, 194842, 195441, 196073, 196886, 197538, 197622, 197376, 197671, 199076, 201149, 203023, 204482, 205961, 207597, 208990, 210094, 211667, 214309, 217538, 220356, 222415, 224109, 225766, 227441, 229363, 231948, 235238, 238800, 242201, 245183, 247444, 248956, 250556, 253433, 257648, 261804, 264672, 266544, 268427, 270415, 271753, 272259, 272738, 273766, 274853, 275153, 274534, 273562, 272784, 272370, 272193, 271907, 271090, 269680, 268179, 267199, 266837, 266684, 266376, 265908, 265453, 265074, 264640, 263879, 262541, 260701]
53663B60701j827j271o96n75p00m84K12P98O20l08j345j883j836j520j169p10
53647B48007m0O39R45Q33O62P47J001J165J152R83O70M15O24J353J990J953J565
53630B64664J607K083K189J603J047J213J808K217K526L174L957M238L946L673
53616B99945L696L613L113K546K471L046L990M765M808L982K958K615K954L159
53602C47661K867K688L056L291K549J206M03M07L87j27m28K27J386J891J345N04
53586C69313L02R07J745K152J910J386J210J615K080J848Q50k04q20j440k719
53571C80135m393n426n345m806m513m222l366k274j938k600l265k900j617l24
53557C33146L62N43N95P08P90N83j3o52p21n4Q26J402J860K743M013M923M907
$$ y = [260701, 258874, 257603, 256907, 256332, 255632, 255148, 255360, 256158, 256778, 256470, 255125, 253242, 251406, 249886, 248717, 248007, 247967, 248606, 249551, 250384, 251046, 251793, 252794, 253959, 255111, 256094, 256764, 257179, 257803, 259156, 261146, 263099, 264664, 266271, 268354, 270543, 272146, 273193, 274406, 276214, 278431, 280957, 284131, 288088, 292326, 296272, 299945, 303641, 307254, 310367, 312913, 315384, 318430, 322420, 327185, 331993, 335975, 338933, 341548, 344502, 347661, 350528, 353216, 356272, 359563, 362112, 363318, 363721, 364128, 364515, 364388, 363960, 364187, 365573, 367464, 368809, 369313, 369615, 370522, 372267, 374419, 376329, 377715, 378925, 380540, 382620, 384468, 385318, 385114, 384294, 382854, 380135, 375742, 370316, 364971, 360165, 355652, 351430, 348064, 345790, 343852, 341252, 337987, 335087, 333470, 333146, 333508, 334051, 334646, 335354, 336144, 336727, 336714, 336062, 335341, 335287, 336113, 337515, 339375, 342118, 346131, 351054, 355961]
53540C55961M294L947M352N281O245P059P850Q666R339R847J0519J1518J2361
53527D57239J2434J2018J2139J3230J4527J5226J5706J6912J8877K0604K1413
53516F30325K1641K1946K2520K3238K4100K5073K5835K6035K5740K5430K5606
53505H97489K6401K7437K8053K7885K7263K6847K6877K6991K6817K6367K5849
53494A194276K5369K4929K4407K3509K2047K0375J9107J8338J7604J6833J6674
53483A423468J7432J8233J7926J6620J5523J5337J5438J4811J3149J0817Q203
53472A586957N452K660j16k952o001r249j2407j5008j6754j7820j8745j9864k0940
53459A455213k1554k1775k2146k3037k4336k5727k6968k7812k8009k7602k6921
$$ y = [355961, 360255, 364202, 368554, 373835, 380080, 387139, 394989, 403655, 412994, 422841, 433360, 444878, 457239, 469673, 481691, 493830, 507060, 521587, 536813, 552519, 569431, 588308, 608912, 630325, 651966, 673912, 696432, 719670, 743770, 768843, 794678, 820713, 846453, 871883, 897489, 923890, 951327, 979380, 1007265, 1034528, 1061375, 1088252, 1115243, 1142060, 1168427, 1194276, 1219645, 1244574, 1268981, 1292490, 1314537, 1334912, 1354019, 1372357, 1389961, 1406794, 1423468, 1440900, 1459133, 1477059, 1493679, 1509202, 1524539, 1539977, 1554788, 1567937, 1578754, 1586957, 1592409, 1595069, 1594953, 1592001, 1586000, 1576751, 1564344, 1549336, 1532582, 1514762, 1496017, 1476153, 1455213, 1433659, 1411884, 1389738, 1366701, 1342365, 1316638, 1289670, 1261858, 1233849, 1206247, 1179326]
53448A179326k6252k5649k5138k4711k3983k2325j9690j6996j5207j4211j3081
53437I52083j1304r296p651o368m983l128p34K063M940P488R482J1078J2577J4096
53423I70343J5544J6835J8069J9495K1301K3343K5071K5939K6055K6275K7460
53412A215730K9728L2476L5076L7309L9242M0950M2525M4188M6265M8929N2003
53401A664421N5000N7404N9053O0163O1016O1672O2185O2899O4203O5888O6992
53390B340896O6613O4747O2200N9715N7431N5125N2729N0412M8319M6344M4216
53379B948747M1670L8576L4976L0980K6650K1945J6784J1102M805k251j0190j9007
53367C144787k8484l8122m7116n4598o0175o4212o7416p0085p1896p2481p1984
$$ y = [1179326, 1153074, 1127425, 1102287, 1077576, 1053593, 1031268, 1011578, 994582, 979375, 965164, 952083, 940779, 931483, 923832, 917464, 912481, 909353, 908619, 910682, 915622, 923110, 932592, 943670, 956247, 970343, 985887, 1002722, 1020791, 1040286, 1061587, 1084930, 1110001, 1135940, 1161995, 1188270, 1215730, 1245458, 1277934, 1313010, 1350319, 1389561, 1430511, 1473036, 1517224, 1563489, 1612418, 1664421, 1719421, 1776825, 1835878, 1896041, 1957057, 2018729, 2080914, 2143813, 2208016, 2273904, 2340896, 2407509, 2472256, 2534456, 2594171, 2651602, 2706727, 2759456, 2809868, 2858187, 2904531, 2948747, 2990417, 3028993, 3063969, 3094949, 3121599, 3143544, 3160328, 3171430, 3176235, 3173984, 3163794, 3144787, 3116303, 3078181, 3031065, 2976467, 2916292, 2852080, 2784664, 2714579, 2642683, 2570202, 2498218]
53356B498218p0947o9764o8548o7373o6391o5623o4841o3861o2845o2060o1401
53345A774564o0329n8422n5924n3476n1345m9105m6248m2886l9628l6728l3787
53334A246686l0397k6802k3627k1094j8865j6616j4469j2775j1726j1239j1022
53323A048054j0652r788q428o878n372l904k420r42N62K141L542M274M299M437
53309A018925N600P737R937J1609J3087J4921J7013J8838K0295K1837K3698K5451
53297A208948K6580K7276K8276K9881L1511L2497L2959L3452L3810L3056L0755
53286A549001K7958K6204K5777K5509K4261K2096J9795J7755J5659J2968R467
53275A776450N391J248k584o133r666j3228j6649k0005k3703k7826l1727l4615
$$ y = [2498218, 2427271, 2357507, 2288959, 2221586, 2155195, 2089572, 2024731, 1960870, 1898025, 1835965, 1774564, 1714235, 1655813, 1599889, 1546413, 1495068, 1445963, 1399715, 1356829, 1317201, 1280473, 1246686, 1216289, 1189487, 1165860, 1144766, 1125901, 1109285, 1094816, 1082041, 1070315, 1059076, 1048054, 1037402, 1027614, 1019186, 1012308, 1006936, 1003032, 1000612, 999670, 1000232, 1002373, 1005915, 1010189, 1014488, 1018925, 1024525, 1032262, 1042199, 1053808, 1066895, 1081816, 1098829, 1117667, 1137962, 1159799, 1183497, 1208948, 1235528, 1262804, 1291080, 1320961, 1352472, 1384969, 1417928, 1451380, 1485190, 1518246, 1549001, 1576959, 1603163, 1628940, 1654449, 1678710, 1700806, 1720601, 1738356, 1754015, 1766983, 1776450, 1781841, 1783089, 1780505, 1774372, 1764706, 1751478, 1734829, 1714824, 1691121, 1663295, 1631568, 1596953]
53263A596953l6400l7623l8693l9542l9992m0080l9918l9500l8761l7696l6352
53252A172396l4946l3909l3550l3661l3709l3511l3393l3536l3529l2894l1787
53241H03971l0749k9910k8861k7347k5593k3798k1691j8990j6065j3709j2284
53230E54974j1425j0660r909r263q611p790o989o616o794p320q050r014j0061
53217D42472j0707j0613r964r155q271p206o179n708n935o336o320n850n327n023
53203C39878m919m946n045n058m874m709m852n124n023m473m009l900l633k723
53189B76590j643j212j378j377j084j288k356l483l768l333k791k190j278l70
53175B49039l0j46j36Ok95j088j631j438q89n76o53j053j710k252k114j363q10
$$ y = [1596953, 1560553, 1522930, 1484237, 1444695, 1404703, 1364623, 1324705, 1285205, 1246444, 1208748, 1172396, 1137450, 1103541, 1069991, 1036330, 1002621, 969110, 935717, 902181, 868652, 835758, 803971, 773222, 743312, 714451, 687104, 661511, 637713, 616022, 597032, 580967, 567258, 554974, 543549, 532889, 522980, 513717, 505106, 497316, 490327, 483711, 476917, 469597, 461547, 452533, 442472, 431765, 421152, 411188, 402033, 393762, 386556, 380377, 374669, 368734, 362398, 356078, 350228, 344901, 339878, 334959, 330013, 324968, 319910, 315036, 310327, 305475, 300351, 295328, 290855, 286846, 282946, 279313, 276590, 274947, 273735, 272357, 270980, 269896, 268608, 266252, 262769, 259001, 255668, 252877, 250687, 249409, 249039, 249009, 248863, 248727, 248733, 248438, 247350, 245719, 244281, 243392, 242816, 242163, 241110, 239400, 237148, 235034, 233671, 232861]
53158B32861r45j320j403j372j558j682j366r19q44r62p95m73m09m28r0K98Q5
53141B18678m01o6J229K266K191J608J369J258P02K1j2N33Q52O42L70L49K74j67
53123B31696p92j231j333j145q12n70n68o96p92q71r53p66j27N49N69j48r51j283
53105B19776j218j050q45o02m81n67o24l99P3N92J011J166Q80K89r5P6N07N78
53087B19067rj038j994k276j538j82P44O20L2K4P25J319J321J145J222J222P00
53070B21104n5l68j76l5k55n81p84j051j564k044k058j600j091q54q13p07m33
53053B06635j29j5j92n43q61j058j242j505j676j448q59m82q32j631j937j235
53037A90990q5M98J30p10j351j399p38M00J275J118N5q90r50m13J4J87M05O97
$$ y = [232861, 231916, 230596, 229193, 227821, 226263, 224581, 223215, 222296, 221452, 220490, 219695, 219222, 218813, 218385, 218295, 218593, 218678, 218277, 218211, 219440, 221706, 223897, 225505, 226874, 228132, 228834, 228855, 228843, 229376, 230228, 230870, 231240, 231589, 231863, 231696, 230904, 229673, 228340, 227195, 226383, 225813, 225245, 224549, 223757, 222886, 221933, 221167, 221040, 221589, 222158, 222010, 221059, 219776, 218558, 217508, 216663, 216061, 215580, 215013, 214389, 213990, 214063, 214655, 215666, 216832, 217712, 218001, 217906, 217982, 218489, 219067, 219058, 218020, 216026, 213750, 212212, 212030, 212774, 213394, 213426, 213450, 214175, 215494, 216815, 217960, 219182, 220404, 221104, 221049, 220681, 220505, 220470, 220215, 219634, 218850, 217799, 216235, 214191, 212133, 210533, 209442, 208588, 207775, 207068, 206635, 206506, 206491, 206299, 205756, 204895, 203837, 202595, 201090, 199414, 197966, 197107, 196625, 195793, 194162, 192225, 190990, 190905, 191403, 191533, 190823, 189472, 188073, 187335, 187735, 189010, 190128, 190183, 189293, 188343, 187930, 187944, 188131, 188536, 189233]
53019A89233Q03O75M68J61l16o88o18l18k85m09j2J129K346K911K709J915O53
53002B00357o50j182o27K75O16M63N62J113J501J209M76j44l89l25j13O0kl69
52984B02831q64j177j107p18k75PJ95N11R65J284J240R26O04M69N52P24P55O19
52966B07541O72J145J525R93l48j296j037k09oo05j197j233r01n30j68J72M44
52949B04962P63J187J393J063M98K84L78J97l50o80o06p86j679k697l003k645
52933A98279k277k079j638q34j77q2k41q4L99O03J47m92n06J80P31N21K1Q9O32
52914A93192O75k36j353j721j351r38p98o12q5N30P07K68l66n60j66L39N46O76
52896A88747J123J615J463O18j73m05m10n25l88L76J311J636J332J000Q19M19
$$ y = [189233, 190036, 190711, 191179, 191340, 191024, 190336, 189718, 189400, 189115, 188706, 188694, 189823, 192169, 195080, 197789, 199704, 200357, 199707, 198525, 197898, 198173, 198789, 199252, 199814, 200927, 202428, 203637, 204113, 203969, 203580, 203255, 203142, 203202, 203200, 202831, 201967, 200790, 199683, 198965, 198690, 198697, 198892, 199403, 200368, 201652, 202892, 203818, 204422, 204891, 205443, 206167, 206922, 207541, 208213, 209358, 210883, 211876, 211528, 210232, 209195, 208986, 208980, 208375, 207178, 205945, 205044, 204514, 204346, 204518, 204962, 205725, 206912, 208305, 209368, 209866, 210150, 210528, 210725, 210375, 209695, 209089, 208303, 206624, 203927, 200924, 198279, 196002, 193923, 192285, 191451, 191274, 191192, 190951, 190867, 191266, 191869, 192016, 191524, 191018, 191198, 191929, 192450, 192471, 192560, 193192, 193867, 193631, 192278, 190557, 189206, 188268, 187470, 186858, 186773, 187303, 188010, 188278, 187912, 187352, 187186, 187525, 188071, 188747, 189870, 191485, 192948, 193566, 193393, 192988, 192578, 192053, 191665, 192041, 193352, 194988, 196320, 197320, 198139, 198558]
52880A98558k09m40M3N77L38m84q52k27P56J100O39jl41m52l96Q5R43J457J050
52861B02144J23m93o19n52j60Q13J645J069q51k437k492j710j338j463j525j669
52845A90485k297k828k240p48K78J20n02o65l22R0L48L73Q5l43n05k68P4K55K49
52826A81639P5j77j55L41Q42O62p9n54l70J23P52J818L181L923L492K511J844
52809A99868J459Q29n4p98j354j890k209k008j642j847k681l269k806j486k65
52794A79847Q3l87r44r50n53m04o84q24l84K07K84r2l78m36n41o00j79O32J031
52775A74728N03n00j174j208p93j37N72R83Q20K34k92m48k92q3k1j32k48j34L18
52756A72696R62J518J679J247L73l64l70K89R02R28N74L95N16N78L36j4j18J86
$$ y = [198558, 198349, 197909, 197952, 198529, 198867, 198383, 197531, 197304, 198060, 199160, 199799, 199798, 199457, 199005, 198609, 198694, 199637, 201094, 202144, 202267, 201774, 201155, 200603, 200443, 201256, 202901, 203970, 203119, 200682, 198190, 196480, 195142, 193679, 192154, 190485, 188188, 185360, 183120, 182372, 182650, 182770, 182268, 181603, 181281, 181371, 181719, 182092, 182177, 181834, 181329, 181061, 181135, 181390, 181639, 181714, 181537, 181382, 181723, 182565, 183227, 183148, 182594, 182224, 182347, 183099, 184917, 188098, 192021, 195513, 198024, 199868, 201327, 202156, 202102, 201304, 199950, 198060, 195851, 193843, 192201, 190354, 187673, 184404, 181598, 180112, 179847, 179930, 179543, 178599, 177649, 177096, 176692, 176008, 175184, 174800, 175007, 175291, 175199, 174821, 174385, 173844, 173244, 173065, 173697, 174728, 175231, 174731, 173557, 172349, 171556, 171419, 171991, 172974, 173794, 174028, 173736, 173288, 172996, 172913, 172892, 172760, 172512, 172378, 172696, 173658, 175176, 176855, 178102, 178475, 178111, 177741, 178030, 178932, 179860, 180434, 180829, 181345, 181923, 182259, 182245, 182127, 182313]
52738A82313Q50J621K072J836J041L02J38M03M28k74j471k286j938m95J040J637
52722A87217J259P36N86L78m89j713k331j882q61J1N03P24P58O70N90M87J49m27
52704A86365q25p20l25j01j68k98l04j25K95Q53J190J076Q06P87R16P66L49J22
52686A90659K39L02J8m02o47o92n57j32M93Q73P31L88L22N70Q42R60Q90O25L01
52667A95783K25M48N68L29Q3K98P66R08O18K99J05j71n01n00j35Q6j35m36m09
52648A98229k49l83p99j155j296j287j097o81k79j99l79m16n1O28J343J727J398
52631A95054L33q21j229p17P2M97N35N04N51O61Q43J022R53N23ql06m34o20p72
52612A96641n35M3L99J86k12j65K88N05J45k84n8P96J490J402P85L93O43J305
$$ y = [182313, 183163, 184784, 186856, 188692, 189733, 190035, 190173, 190576, 191004, 190730, 189259, 186973, 185035, 184540, 185580, 187217, 188476, 189212, 189798, 190176, 189687, 187974, 185643, 183761, 182900, 182911, 183414, 184138, 184896, 185566, 186156, 186643, 186792, 186365, 185540, 184820, 184495, 184394, 184226, 183928, 183624, 183499, 183794, 184647, 185837, 186913, 187719, 188506, 189422, 190188, 190537, 190659, 190898, 191200, 191218, 190816, 190169, 189477, 188920, 188788, 189281, 190154, 190885, 191273, 191595, 192165, 193007, 193967, 194857, 195482, 195783, 196008, 196456, 197024, 197353, 197436, 197734, 198500, 199408, 200026, 200325, 200430, 200259, 199758, 199258, 199123, 199209, 199074, 198638, 198229, 197980, 197597, 196798, 195643, 194347, 193060, 191963, 191282, 191003, 190804, 190425, 190009, 189958, 190586, 191929, 193656, 195054, 195387, 194566, 193337, 192620, 192692, 193189, 193724, 194228, 194779, 195440, 196283, 197305, 198258, 198781, 198773, 198467, 198033, 197413, 196641, 196106, 196149, 196548, 196734, 196522, 196357, 196645, 197150, 197295, 197011, 196953, 197749, 199239, 200641, 201426, 201819, 202462, 203767]
52594B03767J907K116J801J062L79L32R77J599J401L29r84j920k273k048j354
52579B07091n32r5k20m98l79K36R14J141P74J45k44j95K2L3k09m84o88q28p51
52560B05233k77L62O33M28K54M95Q56Q36M32L2j45j26N9K86K10l42r42r27j75
52541B07182Q09J460J520J009K75j13O5K41k53j181j647j357r45r01r24o96o24
52524B03920j154j829j795r89k38j10k63n4P14J768K702L181L025K422J878J779
52508B14957K020K133J785J025J95l61n05l30n2J41J46q9n80j232j783j906j492
52491B14072q08l04j59j69j07m3j41k79j27L45P35O91L31J7j74n14j145j698j535
52472B08988m20J107K146K272J809J329J076J050J305J847K315K236J635J039
$$ y = [203767, 205674, 207790, 209591, 210653, 211032, 211364, 212341, 213940, 215341, 215670, 214686, 212766, 210493, 208445, 207091, 206559, 206464, 206244, 205746, 205367, 205603, 206517, 207658, 208432, 208577, 208333, 208138, 208160, 208193, 207984, 207500, 206812, 205984, 205233, 204956, 205318, 205951, 206379, 206633, 207128, 207984, 208820, 209252, 209284, 209139, 209013, 209072, 209358, 209568, 209226, 208284, 207357, 207182, 207991, 209451, 210971, 211980, 212255, 212142, 212207, 212448, 212195, 211014, 209367, 208010, 207065, 206164, 205240, 204544, 203920, 202766, 200937, 199142, 198153, 197915, 197805, 197542, 197488, 198202, 199970, 202672, 205853, 208878, 211300, 213178, 214957, 216977, 219110, 220895, 221920, 222115, 221754, 221249, 220919, 220867, 221008, 221154, 221065, 220485, 219253, 217470, 215564, 214072, 213264, 212960, 212801, 212632, 212525, 212482, 212341, 212062, 211935, 212280, 213015, 213706, 214037, 214054, 213880, 213366, 212221, 210523, 208988, 208568, 209675, 211821, 214093, 215902, 217231, 218307, 219357, 220662, 222509, 224824, 227060, 228695, 229734]
52458B29734P70N77J20m94r11j056j160j383j620j673j487j230j129j210j154
52443B16694o37J93P83Q02N22M48P15J051J147R50O06K79J1k83o34q87q05l39
52425B20616L14R10J297J459J596K038K838L547L748L724M127N035N807O040N997
52410B69093N859N133L374J044r41k270l321m361n241n790n934n479m308k836
52396B44022j772j302r65m58j2K25N66J134J365P58j67l86K74R77J206J439K092
52379B48996K526J907P06L45J295K412K567K118K098K539K529J754R90R48J392
52364B75122J720J863K119K530K857K987K993K854K360J381J77n11Q3J912L842
52349C04289M677M435M210M798N925O920P455P547P438P706Q883J0571J1578J1392
$$ y = [229734, 230504, 231081, 231201, 230707, 229796, 228740, 227580, 226197, 224577, 222904, 221417, 220187, 219058, 217848, 216694, 216057, 216250, 217033, 217835, 218357, 218805, 219520, 220571, 221718, 222668, 223274, 223553, 223564, 223281, 222647, 221760, 220955, 220616, 220930, 221840, 223137, 224596, 226192, 228230, 231068, 234615, 238363, 242087, 246214, 251249, 257056, 263096, 269093, 274952, 280085, 283459, 284503, 283562, 281292, 277971, 273610, 268369, 262579, 256645, 251166, 246858, 244022, 242250, 240948, 239983, 239525, 239513, 239738, 240304, 241438, 242803, 243561, 243394, 243008, 243282, 244259, 245465, 246904, 248996, 251522, 253429, 254135, 254480, 255775, 258187, 260754, 262872, 264970, 267509, 270038, 271792, 272782, 273730, 275122, 276842, 278705, 280824, 283354, 286211, 289198, 292191, 295045, 297405, 298786, 298963, 298452, 298535, 300447, 304289, 308966, 313401, 317611, 322409, 328334, 335254, 342709, 350256, 357694, 365400, 374283, 384854, 396432, 407824]
52335D07824J0912J1186J2014J2457J2255J1976J2019J2232J2371J2328J1968
52324E39542J1290J0654J0360J0180R694Q853P782O359M588L084K456K391J991
52311F29224Q89o42k367m045m951m426k980j945j834j914j520r39o38m91k81k29
52295F00911m78n75k3R87J891K477K958L568M418N505O648P607Q353Q953R232
52280F62432Q960Q408Q195Q436Q540Q062P158O135N081M195L768L604K994J654
52266G47622J21j010j717k160k370k665l577m889n536n091m523m744n158m693
52252F99610l595l020l221l392l172l051l183l004k307j673j389q32L89J499J491
52237F71150O60L49J332L001M214M435L939L234K658K409K655L331L974M072L655
$$ y = [407824, 418736, 429922, 441936, 454393, 466648, 478624, 490643, 502875, 515246, 527574, 539542, 550832, 561486, 571846, 582026, 591720, 600573, 608355, 614714, 619302, 622386, 624842, 627233, 629224, 630113, 629471, 627104, 623059, 618108, 613682, 610702, 608757, 606923, 605009, 603489, 602550, 601912, 601421, 601140, 600911, 600433, 599858, 599835, 600822, 602713, 605190, 608148, 611716, 616134, 621639, 628287, 635894, 644247, 653200, 662432, 671392, 679800, 687995, 696431, 704971, 713033, 720191, 726326, 731407, 735602, 739370, 742974, 745968, 747622, 747743, 746733, 745016, 742856, 740486, 737821, 734244, 729355, 723819, 718728, 714205, 709461, 704303, 699610, 696015, 692995, 689774, 686382, 683210, 680159, 676976, 673972, 671665, 669992, 668603, 667771, 668160, 669659, 671150, 671810, 672159, 673491, 676492, 680706, 685141, 689080, 692314, 694972, 697381, 700036, 703367, 707341, 711413, 715068]
52222G15068L320L567M356N349O253O724O410N436M525M214M183L863L350L168
52208G79786L302L109K292J355R74J290J911K306K166J623J145R46O75K8o04o42
52192H01662l31n03j323k021k054j818j845j941j669j254j425k470l872m785m648
52177G69703l483j946r31r02j550k155k153j427k69P76J258J192R65Q63R02J048
52161G61891J328J656J899K132K497K790K714K490K645L062K954K158J717K589
52147G94522M305N641O114O171O185O154O175O406O541O139N538N683O840Q162
52133H80576Q765Q684Q490Q510Q720Q966R003Q751Q637R195J0154J0524R929R063
52119A007967Q424P396N369L058J623R40q7j670k790k915k824l254l765l655l217
$$ y = [715068, 718388, 721955, 726311, 731660, 737913, 744637, 751047, 756483, 761008, 765222, 769405, 773268, 776618, 779786, 783088, 786197, 788489, 789844, 790818, 792108, 794019, 796325, 798491, 800114, 801259, 802205, 802880, 802908, 802304, 801662, 801331, 800828, 799505, 797484, 795430, 793612, 791767, 789826, 788157, 786903, 785478, 783008, 779136, 774351, 769703, 766220, 764274, 763343, 762441, 760891, 758736, 756583, 755156, 754887, 755663, 756921, 758113, 759078, 759941, 760843, 761891, 763219, 764875, 766774, 768906, 771403, 774193, 776907, 779397, 782042, 785104, 788058, 790216, 791933, 794522, 798827, 804468, 810582, 816753, 822938, 829092, 835267, 841673, 848214, 854353, 859891, 865574, 872414, 880576, 889341, 898025, 906515, 915025, 923745, 932711, 941714, 950465, 959102, 968297, 978451, 988975, 998904, 1007967, 1016391, 1023787, 1029156, 1032214, 1033837, 1034777, 1034690, 1033020, 1030230, 1027315, 1024491, 1021237, 1017472, 1013817, 1010600]
52104A010600l253l798m127l762k828j614m22L65O06P61J372K356L207L775M274
52089A007512M695M826M813N092N763O593P570Q802R924J0363J0346J0752J1665
52076A108716J1940J0722Q701P101O059M800L044J355J47q51k036l444m891o237
52062A145126p407q478r719j1181j2407j2937j3009j3262j3771j3914j3327j2512
52050A003202j2273j2840j3706j4050j3304j1597r730q425p585o593n256m011
52038H83832l144k375j416m91PM0j97o07j135j697k406l520m938o052o456o441
52022H43004o490o640o801p259q216r091r069q343q028q701r734j0328j0549j0890
52008G22865j1350j1532j1373j1167j1003j0669j0154r764r718r914j0089j0003
$$ y = [1010600, 1007347, 1003549, 999422, 995660, 992832, 991218, 990796, 991161, 991767, 992528, 993900, 996256, 999463, 1003238, 1007512, 1012207, 1017033, 1021846, 1026938, 1032701, 1039294, 1046864, 1055666, 1065590, 1075953, 1086299, 1097051, 1108716, 1120656, 1131378, 1140079, 1147180, 1153239, 1158039, 1161083, 1162438, 1162585, 1161734, 1159698, 1156254, 1151363, 1145126, 1137719, 1129241, 1119522, 1108341, 1095934, 1082997, 1069988, 1056726, 1042955, 1029041, 1015714, 1003202, 990929, 978089, 964383, 950333, 937029, 925432, 915702, 907277, 899692, 893099, 887843, 883832, 880688, 878313, 876897, 876406, 876413, 876453, 876256, 875649, 874514, 872817, 870411, 866891, 861953, 855901, 849445, 843004, 836514, 829874, 823073, 815814, 807598, 798507, 789438, 781095, 773067, 764366, 754632, 744304, 733755, 722865, 711515, 699983, 688610, 677443, 666440, 655771, 645617, 635853, 626135, 616221, 606132, 596129]
51996E96129r489q639p830p281o687n709m692m276m367m182l582l514m668o311
51982E14902p152o948o539o599p073p629p941p554o313m936m395m602m487l467
51968D29267k044p62M82J673K249K072K049K852L688L283J670L1r29j494k020
51953D42067k545l201m053m482l715k158j187j304j427m67J287K877L978M785
51939D30455N235N253N225N471N491M520K701R12m78j938l782n645p103q199r026
51924D29092r270q647p457o368n709n324m975m625m252l708k851j798q83k91K10
51909C63144J036K218L293L893M276N012O213P459Q419R193R866J0190J0034R760
51895D54006R728R681R110Q111P166O132M133Q44k812n685p674r308j0533j0754
$$ y = [596129, 586640, 578001, 570171, 562890, 556203, 550494, 545802, 541526, 537159, 532977, 529395, 525881, 521213, 514902, 507750, 500802, 494263, 487664, 480591, 472962, 465021, 457467, 451154, 446218, 441823, 437221, 432734, 429267, 427223, 426461, 426943, 428616, 430865, 432937, 434986, 437838, 441526, 444809, 446479, 446510, 445581, 444087, 442067, 439522, 436321, 432268, 427786, 424071, 421913, 420726, 419422, 417995, 417528, 418815, 421692, 425670, 430455, 435690, 440943, 446168, 451639, 457130, 461650, 464351, 465263, 464785, 462847, 459065, 453420, 446317, 438118, 429092, 419822, 411175, 403718, 397350, 391641, 386317, 381342, 376717, 372465, 368757, 365906, 364108, 363225, 362934, 363144, 364180, 366398, 369691, 373584, 377860, 382872, 389085, 396544, 404963, 414156, 424022, 434212, 444246, 454006, 463734, 473415, 482525, 490636, 497802, 503934, 508067, 508911, 506099, 500414, 492740, 483432, 472899, 462145]
51881D62145r914q638p205n306l048j306n90k58M93J407J624R29j68j351k717
51866D26097m227n602o676p327p222o244n038m382m059l155j547j99J96O2Rj26
51850C70560p36j562k070k263k482k691k586k236k014j947j712j268j010j189
51836C44794j550j678j418q22J2Q85J494J701J703J760J790J438N83m26j207j795
51820C47264k363k617k027p16M42R59J344K096K689K363J464R20O73j99j746k846
51804C47700k971k990l620m208l937l224k922k893k545k126k241k505k072j217
51790C08229j020j456j241O5J176R46l6n36m37m23n72l44K84P23P35O95P59O13
51772C08160K63M43J686L433M608M948N166N701N899M789K456N6j486k336l159
$$ y = [462145, 452231, 443593, 436388, 431082, 428034, 426728, 426138, 425880, 426373, 427780, 429404, 430333, 430165, 428814, 426097, 421870, 416268, 409592, 402265, 395043, 388799, 383761, 379379, 375320, 372165, 370618, 370419, 370615, 370677, 370686, 370560, 369824, 368262, 366192, 363929, 361447, 358756, 356170, 353934, 351920, 349973, 348261, 346993, 345983, 344794, 343244, 341566, 340148, 339326, 339338, 340223, 341717, 343418, 345121, 346881, 348671, 350109, 350692, 350266, 349059, 347264, 344901, 342284, 340257, 339541, 339983, 340942, 342286, 344382, 347071, 349434, 350898, 351818, 352491, 352292, 350546, 347700, 344729, 341739, 338119, 333911, 329974, 326750, 323828, 320935, 318390, 316264, 314023, 311518, 309446, 308229, 307209, 305753, 304512, 304577, 305753, 306699, 306663, 306127, 305690, 305267, 304695, 304351, 304635, 305358, 306093, 306788, 307547, 308160, 308423, 308866, 310552, 313985, 318593, 323541, 328707, 334408, 340307, 345096, 347552, 347608, 346122, 343786, 340627]
51757C40627m089m646m390l351k021j179j446k624l581l267j825k78P29J483K424
51742C12566L475M359N146O099P078P552P184O268N444N007M604L719K390J199
51728C82090M81j27j073k186l042l697m568n584o132n821m850l565k190j086o59
51713C37991p39n64K55J256J925K551L680N084N835N330L865K190R16K99L31Q76
51697C71081J786K829L488L155J780Q7j204k137l156m163m540m128l643l786m263
51682C53186m068k703q25M56P79Q64J556K681L202K549J473J175J862K620K671
51667C67478K255K020K000J633P12j57j50Q68K191K938K765J906P31n91j943l083
51651C81573l767m023m064m013l868l723l760l955m033l837l561l423l323l054
$$ y = [340627, 336538, 331892, 327502, 324151, 322130, 320951, 319505, 316881, 313300, 310033, 308208, 307930, 308659, 310142, 312566, 316041, 320400, 325546, 331645, 338723, 346275, 353459, 359727, 365171, 370178, 374782, 378501, 380891, 382090, 382571, 382444, 381371, 379185, 376143, 372446, 367878, 362294, 356162, 350341, 345491, 341926, 339736, 338650, 337991, 337252, 336688, 336943, 338199, 340124, 342675, 346355, 351439, 357274, 362604, 366469, 368659, 369575, 369874, 370205, 371081, 372867, 375696, 379184, 382339, 384119, 384206, 383002, 380865, 377709, 373546, 369006, 364878, 361235, 357449, 353186, 349118, 346415, 345590, 346046, 346825, 347689, 349245, 351926, 355128, 357677, 359150, 360325, 362187, 364807, 367478, 369733, 371753, 373753, 375386, 376098, 375941, 375791, 376659, 378850, 381788, 384553, 386459, 387190, 386599, 384656, 381573, 377806, 373783, 369719, 365706, 361838, 358115, 354355, 350400, 346367, 342530, 338969, 335546, 332223, 329169]
51637C29169k661k325j958j364o74k77j91N5O91J308J427J200J100J157R74M09
51621C28040k68q90j614k457l028k976k462j923j575j320r91m46M32J654L032
51606C13208M285N184N614N604N306M815M078L122K348K147K225J735L26j338
51592C58659k329k400j926j201k63Q56K031L178M224N081N888P083Q941J1137
51578C98959J2983J3971J4036J3553J3241J3594J4103J3544J1459Q914P211O375
51566E41943N652N149N875Q282J1716J5441J9239K2728K4922K5121K3630K1131
51554G30829J7796J3467Q311K845k455p317j1638j5544j9186k2385k4794k6466
51542F43463k7764k8495k7839k5555k2687k0533j9287j8166j6575j4549j2293
$$ y = [329169, 326508, 324183, 322225, 320861, 320187, 319910, 319719, 319774, 320465, 321773, 323200, 324400, 325500, 326657, 327631, 328040, 327772, 326882, 325268, 322811, 319783, 316807, 314345, 312422, 310847, 309527, 308536, 308090, 308522, 310176, 313208, 317493, 322677, 328291, 333895, 339201, 344016, 348094, 351216, 353564, 355711, 357936, 359671, 359997, 358659, 356330, 353930, 352004, 350803, 350540, 351396, 353427, 356605, 360829, 365910, 371798, 378881, 387822, 398959, 411942, 425913, 439949, 453502, 466743, 480337, 494440, 507984, 519443, 528357, 535568, 541943, 547595, 552744, 558619, 566901, 578617, 594058, 613297, 636025, 660947, 686068, 709698, 730829, 748625, 762092, 770403, 773248, 770793, 763476, 751838, 736294, 717108, 694723, 669929, 643463, 615699, 587204, 559365, 533810, 511123, 490590, 471303, 453137, 436562, 422013, 409720]
51531D09720r948p763o039m815l901l185k628k156j798j834k436l271l707l429
51517C52810k689k009j809k116k477k399j983j843k175k343j731o35J86M95N17
51502C29799K64l74r65p60K42J094J035L78j5K55R25J574J969J990J610R83M42
51485C40446K20J58k88j465k977l925l936l580l550l731l564l106l057l689m339
51470B99617m225l345k275j387o31N0N35P08O65O15O81Q96J336K116L113L799
51454C02268L653K872K416L083M688O379P651Q734R997J1314J2124J2000J1034
51441C98213R694Q288O686M719K762J498R60L07j142l023m557n697o950q334r195
51426C94229r121q431p577o676n787n135m707m078k972j784j199j442k065k377
$$ y = [409720, 399772, 392009, 385970, 381155, 377254, 374069, 371441, 369285, 367487, 365653, 363217, 359946, 356239, 352810, 350121, 348112, 346303, 344187, 341710, 339311, 337328, 335485, 333310, 330967, 329236, 328601, 328787, 329282, 329799, 330063, 329689, 328724, 327964, 328206, 329300, 330335, 330713, 330698, 330953, 331878, 333452, 335421, 337411, 339021, 340004, 340446, 340666, 340824, 340536, 339071, 336094, 332169, 328233, 324653, 321103, 317372, 313808, 310702, 307645, 303956, 299617, 295392, 292047, 289772, 288385, 287754, 287804, 288339, 289047, 289712, 290327, 291008, 291904, 293240, 295356, 298469, 302268, 305921, 308793, 311209, 314292, 318980, 325359, 333010, 341744, 351741, 363055, 375179, 387179, 398213, 407907, 416195, 422881, 427600, 430362, 431860, 432820, 433127, 431985, 428962, 424405, 418708, 411758, 403424, 394229, 385108, 376677, 369100, 362424, 356637, 351502, 346795, 342717, 339745, 337961, 336762, 335320, 333255, 330878]
51412C30878j950r11J61P43Q56Q73R25Q35N63M17N77Q88J182J576K205K930L526
51395C46274L969M408N013N912P088Q322R457J0705J2370J4333J6224J8098K0376
51382D82549K3006K5346K7082K8622L0216L1256L1088K9928K8327K6098K2487
51371G86005J7326J1297N157p36o226j1323j6392k1752k6930l0861l2980l3666
51359F38919l3535l2722l1116k8827k6111k3190k0358j7957j5962j3916j1534
51348C83691r087o928m977l130j850j734k558l331l411l128l065l200l108k688
51334C31496k195j745j173m81M2K48L34L88N8r56k285l125l078k485j945j820
51318C11278k125k619k876k629k075j649j448j205q02m02J0O93J492J703R89M7
$$ y = [330878, 328928, 328017, 328178, 328921, 329777, 330650, 331575, 332410, 332973, 333390, 333967, 334855, 336037, 337613, 339818, 342748, 346274, 350243, 354651, 359664, 365576, 372664, 380986, 390443, 401148, 413518, 427851, 444075, 462173, 482549, 505555, 530901, 557983, 586605, 616821, 648077, 679165, 709093, 737420, 763518, 786005, 803331, 814628, 819785, 819049, 812823, 801500, 785108, 763356, 736426, 705565, 672585, 638919, 605384, 572662, 541546, 512719, 486608, 463418, 443060, 425103, 409141, 395225, 383691, 374604, 367676, 362699, 359569, 357719, 355985, 353427, 350096, 346685, 343557, 340492, 337292, 334184, 331496, 329301, 327556, 326383, 325902, 325944, 326192, 326526, 326914, 326972, 326016, 323731, 320606, 317528, 315043, 313098, 311278, 309153, 306534, 303658, 301029, 298954, 297305, 295857, 294652, 293850, 293448, 293458, 294151, 295643, 297346, 298335, 298382]
51302B98382k07J48K87n7k37L12J361K357L101L655L988M076M093M205M253L886
51286C33603L017J975J210Q13M25l18j261j910k256k939m155m878l952j860m12
51271C17102m99j054p56J67O06L81L02P32J117J024P15M22j35j087j870j850j127
51254C14190l37J07J90j2l49m36Q1J055J869K042J617R77M44J44Q0K18M30M84
51236C22794K19k36m79k65K36O78R74J233J452J534J579J734J784J332M71k11
51220C34829m98q14j395j733j397q26o88p72l65M73Q98N31j6j22M7P3p5j91k37
51201C27722j48L00J077J687J710J252O30Jl60L3J159K067J911J093P76J308J895
51184C44113J795J146M58q7n09p42q09r33j199j374j328j312j564j884j878j495
$$ y = [298382, 298175, 298323, 298610, 298553, 298316, 298628, 299989, 302346, 305447, 309102, 313090, 317166, 321259, 325464, 329717, 333603, 336620, 338595, 339805, 340618, 341043, 340725, 339464, 337554, 335298, 332359, 328204, 323326, 319374, 317514, 317102, 316603, 315549, 314793, 314960, 315566, 315947, 316249, 316981, 318098, 319122, 319837, 320259, 320124, 319037, 317167, 315317, 314190, 313853, 313960, 314150, 314138, 313789, 313353, 313434, 314489, 316358, 318400, 320017, 320994, 321438, 321582, 321662, 321880, 322310, 322794, 323013, 322777, 322298, 322033, 322269, 322947, 323921, 325154, 326606, 328140, 329719, 331453, 333237, 334569, 335040, 334829, 334331, 333517, 332122, 330389, 328992, 328166, 327478, 326706, 326341, 326814, 327712, 328243, 328227, 328105, 328152, 328225, 328150, 327959, 327722, 327574, 327874, 328951, 330638, 332348, 333600, 334230, 334231, 333871, 333904, 335063, 337130, 339041, 340134, 340910, 342218, 344113, 345908, 347054, 347512, 347425, 346916, 346174, 345365, 344432, 343233, 341859, 340531, 339219, 337655, 335771, 333893, 332398]
51168C32398r80n02o8K93N20O44O88N61K82J56M24P62O09M3p1Q24K054K355J371
51149C42363Q6m16j72o7o32j586k385k781k670j937p46L41Q43Q77R01J128J440
51132C34587J725J902J765J196N95O01J231J610R55m08j349j203m60l3j27j83
51116C42404J76N64N08K71N15J199J512J010L07K37Q49J652K326K650K150O82
51100C59012p81q91M60J948K448K149J856J815J690J196L05q28j795k110j763
51085C64711j351j378j700j898j811j435p47J4L04m1m20k23K93M85L59N07J152
51068C56821J902K510L211M175N096N538N360M687L833L282L441M168M875N270
51054D14169N755O821Q306R513J0052J0228J0502J0754J0331Q884O822M814L005
$$ y = [332398, 331418, 330916, 330848, 331141, 331661, 332305, 332993, 333554, 333836, 333992, 334416, 335178, 335787, 335830, 335759, 336583, 338637, 340992, 342363, 342449, 342033, 341861, 341794, 341162, 339576, 337191, 334410, 331740, 329803, 329057, 329398, 330241, 331118, 332019, 333147, 334587, 336312, 338214, 339979, 341175, 341770, 342371, 343602, 345212, 346167, 345759, 344410, 343207, 342747, 342714, 342587, 342404, 342580, 343144, 343652, 343923, 344438, 345637, 347149, 348159, 348466, 348703, 349552, 351204, 353530, 356180, 358330, 359012, 358231, 357340, 357800, 359748, 362196, 364345, 366201, 368016, 369706, 370902, 371207, 370379, 368584, 366474, 364711, 363360, 361982, 360282, 358384, 356573, 355138, 354391, 354405, 354709, 354668, 354248, 354025, 354318, 354803, 355162, 355669, 356821, 358723, 361233, 364444, 368619, 373715, 379253, 384613, 389300, 393133, 396415, 399856, 404024, 408899, 414169, 419924, 426745, 435051, 444564, 454616, 464844, 475346, 486100, 496431, 505315, 512137, 516951, 519956]
51041E19956J141p95k575m259o111p865q871r239r946j1314j2229j1718j0488
51028D25687r788r352p880n285k892j329J74J945K910K385J521J775K925L814
51014D06610M355N351O760P653P782P969Q722R615J0317J1091J1950J2296J1978
51001E22449J1884J2808J4404J5837J6821J7320J6879J5188J2992J1425J0489
50990F78496R121O798M309K565J388o8k118m240n703o154n764m979m120l014j228
50975F65289J326M289P367J0530J3549J5964J7873K0226K3699K7569L0484L2137
50963H70302L3414L4909L6124L6410L5971L5435L4931L4137L2834L1007K8623
50952A244097K5781K2962K0737J9252J8150J6814J4587J1145P057L513J067j070
$$ y = [519956, 521097, 520302, 517727, 513468, 507357, 499492, 490621, 481382, 471436, 460122, 447893, 436175, 425687, 415899, 406547, 398667, 393382, 390490, 389161, 389335, 391280, 394190, 396575, 398096, 399871, 402796, 406610, 410965, 416316, 423076, 430729, 438511, 446480, 455202, 464817, 475134, 486225, 498175, 510471, 522449, 534333, 547141, 561545, 577382, 594203, 611523, 628402, 643590, 656582, 668007, 678496, 687617, 694415, 698724, 701289, 702677, 702609, 700491, 696251, 690548, 684394, 678630, 673651, 669531, 666517, 665289, 666615, 670904, 678271, 688801, 702350, 718314, 736187, 756413, 780112, 807681, 838165, 870302, 903716, 938625, 974749, 1011159, 1047130, 1082565, 1117496, 1151633, 1184467, 1215474, 1244097, 1269878, 1292840, 1313577, 1332829, 1350979, 1367793, 1382380, 1393525, 1400582, 1404095, 1405162, 1404092]
50940A404092l998p615j0736j2483j2993j2908j2839j3360j4773j6751j8717k0615
50928A246304k2774k5035k6857k8359l0338l2801l4444l4253l2899l1659l0602
50917I16283k8871k6463k4478k3427k2354k0090j6795j3662j1566j0395r577q734
50905F99871p852p052o338n585m778m117l743l511l252l111l284l480l066j870
50891F38832m58N62J161J622K000K158K120K052J994J916J990K469L312M180M765
50876F70675N033N062M924M812N064N947P374R004J0516J1772J2759J3531J4300
50863G80773J5475J7427K0132K3174K6223K9372L2885L6684M0429M4106M8185
50852A114865N3005N8217O3188O7699P1890P5623P8399Q0070Q1044Q1499Q0795
$$ y = [1404092, 1400094, 1392479, 1381743, 1369260, 1356267, 1343359, 1330520, 1317160, 1302387, 1285636, 1266919, 1246304, 1223530, 1198495, 1171638, 1143279, 1112941, 1080140, 1045696, 1011443, 978544, 946885, 916283, 887412, 860949, 836471, 813044, 790690, 770600, 753805, 740143, 728577, 718182, 708605, 699871, 692019, 684967, 678629, 673044, 668266, 664149, 660406, 656895, 653643, 650532, 647248, 643768, 640702, 638832, 638374, 638936, 640097, 641719, 643719, 645877, 647997, 650049, 652043, 653959, 655949, 658418, 661730, 665910, 670675, 675708, 680770, 685694, 690506, 695570, 701517, 708891, 717895, 728411, 740183, 752942, 766473, 780773, 796248, 813675, 833807, 856981, 883204, 912576, 945461, 982145, 1022574, 1066680, 1114865, 1167870, 1226087, 1289275, 1356974, 1428864, 1504487, 1582886, 1662956, 1744000, 1825499, 1906294]
50841A906294P8131P3601O8042O1928N4968M6938L8285K9664K1296J3266O118
50830B398531O27k963m988n700m986k853K20L570O637Q888R832R333P581M473
50816B428202n74p803j6409k5136l3428m1463m9226n6154o1768o6034o8825o9535
50804A931847o7654o3485n7899n1587m4776l7517k9854k1859j3834o346K71O354
50792A543661J2393J8157K2735K5554K6867K7117K6301K4278K1254J7543J3189
50781A779049Q260L304j090n010q914j2649j5550j7739k0557k5116l0866l6242
50769A616880m0413m3732m6583m8621m9371m8924m7636m5585m2792l9642l6610
50758A126971l3652l0300k6377k2280j8515j5292j2569j0192p798m908j431K016
$$ y = [1906294, 1984425, 2058026, 2126068, 2187996, 2242964, 2289902, 2328187, 2357851, 2379147, 2392413, 2398531, 2399158, 2396195, 2391207, 2385507, 2380521, 2377668, 2377888, 2381458, 2388095, 2396983, 2406815, 2416148, 2423729, 2428202, 2427628, 2419825, 2403416, 2378280, 2344852, 2303389, 2254163, 2198009, 2136241, 2070207, 2001382, 1931847, 1864193, 1800708, 1742809, 1691222, 1646446, 1608929, 1579075, 1557216, 1543382, 1537036, 1537307, 1543661, 1556054, 1574211, 1596946, 1622500, 1649367, 1676484, 1702785, 1727063, 1748317, 1765860, 1779049, 1787309, 1790613, 1789523, 1784513, 1775599, 1762950, 1747400, 1729661, 1709104, 1683988, 1653122, 1616880, 1576467, 1532735, 1486152, 1437531, 1388160, 1339236, 1291600, 1246015, 1203223, 1163581, 1126971, 1093319, 1063019, 1036642, 1014362, 995847, 980555, 967986, 957794, 949996, 945088, 943657, 945673]
50746I45673M627O314P934J0473J4060J7940K1375K4443K7811L1864L6201M0132
50734A188847M3384M6207M8822N1007N2287N2393N1485M9979M8208M6140M3380
50723A722139L9480L4337K8276K1745J4951P933Q89n697j1318j5676j8604j9859
50711A798596j9213j6810j3245r185m901l64M222Q190J0857J2093J2297J1688
50699A794225R875O258Q94n233j0876j5349j8612k0745k1632k1236j9852j7811
50687A659906j5020j1026n562J071Q232J5443K2680L0278L8493M7157N5731O3789
50675A911172P1256P8008Q3452Q6802Q7734Q6426Q3035P7591P0570O3006N5666
50664B754718M8421M0870L3301K6411K0193J3759O523j003p899j3972j9772k5631
$$ y = [945673, 950300, 956614, 964548, 975021, 989081, 1007021, 1028396, 1052839, 1080650, 1112514, 1148715, 1188847, 1232231, 1278438, 1327260, 1378267, 1430554, 1482947, 1534432, 1584411, 1632619, 1678759, 1722139, 1761619, 1795956, 1824232, 1845977, 1860928, 1868861, 1869750, 1864053, 1852735, 1837059, 1818455, 1798596, 1779383, 1762573, 1749328, 1740143, 1735242, 1734878, 1739100, 1747290, 1758147, 1770240, 1782537, 1794225, 1804100, 1810358, 1811252, 1806019, 1795143, 1779794, 1761182, 1740437, 1718805, 1697569, 1677717, 1659906, 1644886, 1633860, 1628298, 1629369, 1637601, 1653044, 1675724, 1706002, 1744495, 1791652, 1847383, 1911172, 1982428, 2060436, 2143888, 2230690, 2318424, 2404850, 2487885, 2565476, 2636046, 2699052, 2754718, 2803139, 2844009, 2877310, 2903721, 2923914, 2937673, 2944196, 2943193, 2935294, 2921322, 2901550, 2875919]
50652B875919l1179l5770l8999m0701m0769l9208l6183l1787k5945j8840j1398
50641B525140m886J65M410Q744J3083J6475J8332J9106J9498J9369J7760J3702
50629B670898O844k591j3954k6264l8441m9441n8161o3431o4508o1590n5603m7504
50617B196254l8071k8216j8920j0754l822J714N534P733Q849Q956P187K816l473
50604B135787j0153j6591k3507l1519l9905m7269n3018n7551o1136o3202o2990
50593A668946o0591n6985n3152m9362m5362m0959l6219l1295k6324k1486j6970
50582A230241j2810q970n682l385k166j472n70P53K138L194L920M676N896P694
50568A223457R681J1403J3130J5835K0093K5311L0508L5549M0951M6711N2141
$$ y = [2875919, 2844740, 2808970, 2769971, 2729270, 2688501, 2649293, 2613110, 2581323, 2555378, 2536538, 2525140, 2520254, 2520419, 2524829, 2533573, 2546656, 2563131, 2581463, 2600569, 2620067, 2639436, 2657196, 2670898, 2677742, 2675151, 2661197, 2634933, 2596492, 2547051, 2488890, 2425459, 2360951, 2299361, 2243758, 2196254, 2158183, 2129967, 2111047, 2100293, 2096471, 2098185, 2103719, 2111452, 2120301, 2129257, 2136444, 2139260, 2135787, 2125634, 2109043, 2085536, 2054017, 2014112, 1966843, 1913825, 1856274, 1795138, 1731936, 1668946, 1608355, 1551370, 1498218, 1448856, 1403494, 1362535, 1326316, 1295021, 1268697, 1247211, 1230241, 1217431, 1208461, 1202779, 1199394, 1197228, 1195756, 1195186, 1195939, 1198077, 1201271, 1205191, 1209867, 1215763, 1223457, 1233138, 1244541, 1257671, 1273506, 1293599, 1318910, 1349418, 1384967, 1425918, 1472629, 1524770]
50557A524770N6960O1663O6417P0260P2000P1456O9365O6407O2915N9178N5424
50546B236815N1636M7894M4847M3321M3474M4715M6343M7875M8866M9059M8819
50535B753664M8939M9945N1834N4593N8417O3220O8402P3306P7630Q1165Q3461
50524C464576Q4051Q2786P9654P4456O6883N6818M4421L0006J4034k912k0242
50513C974531l7478n4259p0260q5000r7591j06893j12240j13911j12521j08094
50503C076284j00323q9593p6978o3105m7853l1490j5383r40J1511K2158L0598
50492B714886L6004L7946L6191L0102J9233M510j2180k9526m7085o3965p8376
50481B647740q9050r6373j01491j04888j06311j05616j03042r8896r3573q7699
$$ y = [1524770, 1581730, 1643393, 1709810, 1780070, 1852070, 1923526, 1992891, 2059298, 2122213, 2181391, 2236815, 2288451, 2336345, 2381192, 2424513, 2467987, 2512702, 2559045, 2606920, 2655786, 2704845, 2753664, 2802603, 2852548, 2904382, 2958975, 3017392, 3080612, 3149014, 3222320, 3299950, 3381115, 3464576, 3548627, 3631413, 3711067, 3785523, 3852406, 3909224, 3953645, 3983651, 3997685, 3994773, 3974531, 3937053, 3882794, 3812534, 3727534, 3629943, 3523050, 3410810, 3296899, 3184378, 3076284, 2975961, 2886368, 2809390, 2746285, 2698432, 2666942, 2651559, 2650619, 2662130, 2684288, 2714886, 2750890, 2788836, 2825027, 2855129, 2874362, 2878872, 2866692, 2837166, 2790081, 2726116, 2647740, 2558690, 2462317, 2360826, 2255938, 2149627, 2044011, 1940969, 1842073, 1748500, 1660801]
50471A660801q1803p5942o9933o3796n7755n1949m6486m1532l7023l2520k7748
50460A074314k3129j9393j6733j4678j2724j0692q558o374m413l038k260j671
50448I50651q27M25J968L510M646N226N680O623Q059R346J0100J0762J1905J3385
50434A041459J4679J5863J7660K0412K3514K6132K8135K9982L1975L4056L6216
50423A320083L8647M1375M4181M6931M9731N2536N5007N6979N8737O0514O1937
50412A886658O2397O1716O0078N7544N4164N0371M6549M2150L6037K7979J9165
50401B404808J0792K666o289j6461k7118l7379m6999n6054o4248p0676p4329p4887
50389A943826p3108p0137o6325o1049n3888m5485l6812k8084j9089j0325k898
$$ y = [1660801, 1578998, 1503056, 1433123, 1369327, 1311572, 1259623, 1213137, 1171605, 1134582, 1102062, 1074314, 1051185, 1031792, 1015059, 1000381, 987657, 976965, 968407, 962033, 957620, 954582, 952322, 950651, 949824, 950249, 952217, 955727, 960373, 965599, 971279, 977902, 985961, 995307, 1005407, 1016169, 1028074, 1041459, 1056138, 1072001, 1089661, 1110073, 1133587, 1159719, 1187854, 1217836, 1249811, 1283867, 1320083, 1358730, 1400105, 1444286, 1491217, 1540948, 1593484, 1648491, 1705470, 1764207, 1824721, 1886658, 1949055, 2010771, 2070849, 2128393, 2182557, 2232928, 2279477, 2321627, 2357664, 2385643, 2404808, 2415600, 2418266, 2411977, 2395516, 2368398, 2331019, 2284020, 2227966, 2163718, 2093042, 2018713, 1943826, 1870718, 1800581, 1734256, 1673207, 1619319, 1573834, 1537022, 1508938, 1489849, 1479524, 1476626]
50378A476626K805P486J1726J4956J6111J4852J1702P229J519n553j3780k2314
50366A523365k9852l5402l8976m1424m3456m5016m5634m5111m3677m1733l9680
50355A073404l7794l6055l4189l2043k9756k7469k5130k2731k0455j8358j6134
50344G73290j3563j1002r015p639o371m966l796l275l161k711j464K54J648K268
50330G10497K426K786L621M681N783P095Q688J0142J0957J1106J0872J0309R297
50317H08260P954O497M836K887J261R01J931L415M600N693O985P931P813O949
50303H77913O365O418O520O246N944N985O023N418M002K161L22j378l092n100
50289I23747p420r573j0974j1549j1598j1183j0206r074q526q497p978o449m734
$$ y = [1476626, 1479431, 1486917, 1498643, 1513599, 1529710, 1544562, 1556264, 1563493, 1565012, 1559459, 1545679, 1523365, 1493513, 1458111, 1419135, 1377711, 1334255, 1289239, 1243605, 1198494, 1154817, 1113084, 1073404, 1035610, 999555, 965366, 933323, 903567, 876098, 850968, 828237, 807782, 789424, 773290, 759727, 748725, 739710, 732071, 725700, 720734, 716938, 713663, 710502, 707791, 706327, 706581, 708229, 710497, 712923, 715709, 719330, 724011, 729794, 736889, 745577, 755719, 766676, 777782, 788654, 798963, 808260, 816214, 822711, 827547, 830434, 831695, 832596, 834527, 837942, 842542, 848235, 855220, 863151, 870964, 877913, 884278, 890696, 897216, 903462, 909406, 915391, 921414, 926832, 930834, 932995, 933317, 931939, 928847, 923747, 916327, 906754, 895780, 884231, 872633, 861450, 851244, 842170, 833644, 825147, 817169, 810720, 805986]
50276H05986l819l438k719j687j091j015p98k11L74J063K525M615O125O450O563
50261H18923P567R058R845R694R331R091Q536P440O281N616N560N946O529O969
50247I26386P065P106P653R005J1076J3687J6623J9645K2936K7246L2957L9195
50235A140580M4708M9548N4923O1113O6485O9175O9066O7444O5196O2167N8046
50224A808451N3143M8182M3803M0294L7297L3709K8257K0346J0135k197j6693
50213B104727l2911m9369o4195p6263q5274r0870r2403q9846q4462p7909p0894
50202A290331o3299n5435m8346m2706l8226l4614l2311l1619l1640l1079k9778
50191H51278k8571k7719k6543k4579k2204j9764j7045j3994j1161q955p117n453
$$ y = [805986, 802167, 798729, 796010, 794323, 793232, 792217, 791419, 791208, 791582, 792645, 795170, 799785, 805910, 812360, 818923, 826490, 835548, 845393, 855087, 864418, 873509, 882045, 889485, 895766, 901382, 906942, 912888, 919417, 926386, 933451, 940557, 948210, 957215, 968291, 981978, 998601, 1018246, 1041182, 1068428, 1101385, 1140580, 1185288, 1234836, 1289759, 1350872, 1417357, 1486532, 1555598, 1623042, 1688238, 1750405, 1808451, 1861594, 1909776, 1953579, 1993873, 2031170, 2064879, 2093136, 2113482, 2123617, 2121420, 2104727, 2071816, 2022447, 1958252, 1881989, 1796715, 1705845, 1613442, 1523596, 1439134, 1361225, 1290331, 1227032, 1171597, 1123251, 1080545, 1042319, 1007705, 975394, 943775, 912135, 881056, 851278, 822707, 794988, 768445, 743866, 721662, 701898, 684853, 670859, 659698, 650743, 643626, 638173]
50179F38173m417m319m504m090l130k266j602o83N54J678K591L681N090O392P208
50164F40356P588P740P868Q340R458J0886J1847J2123J2368J3155J4104J4353
50152G70186J3592J2250J0879R703Q616P376N865M314L212K865L171L914N078
50139H61021O703Q631J0611J2528J4384J6141J7731J9137K0426K1775K3544K6049
50127A058681K9212L2634L6209M0417M5807N2474O0237O9050P8888Q9396J00078
50116A693083J10666J20907J29992J36644J39892J39648J36597J31832J26478
50107B865739J21241J16220J11285J06407J01112R3840Q2670O6856M7077K4024
50097C736471k282l1297o0875q8373j12327j32286j47538j57310j62035j63189
$$ y = [638173, 633756, 629437, 624933, 620843, 617713, 615447, 613845, 613162, 613716, 615394, 617985, 621666, 626756, 633148, 640356, 647944, 655684, 663552, 671892, 681350, 692236, 704083, 716206, 728574, 741729, 755833, 770186, 783778, 796028, 806907, 816610, 825226, 832602, 838467, 842781, 845993, 848858, 852029, 855943, 861021, 867724, 876355, 886966, 899494, 913878, 930019, 947750, 966887, 987313, 1009088, 1032632, 1058681, 1087893, 1120527, 1156736, 1197153, 1242960, 1295434, 1355671, 1424721, 1503609, 1593005, 1693083, 1803749, 1924656, 2054648, 2191292, 2331184, 2470832, 2607429, 2739261, 2865739, 2986980, 3103200, 3214485, 3320892, 3422004, 3515844, 3598514, 3665370, 3712447, 3736471, 3734189, 3702892, 3642017, 3553644, 3441317, 3309031, 3161493, 3004183, 2842148, 2678959]
50087B678959j61590j56895j49124j39542j29453j19009j07988r7007q6966p7843
50077A453542o9076o0843n4024m8830m4413l9911l5308l1069k7489k4500k1736
50066I96343j8770j5674j3230j2045j1581j0693r130p704p015o708o284n801n440
50053H66268n031m487m131m085l879l124k171j527j099n60j43l99j283k149k531
50038H29669k497k235j748r78k3Q60J318J163P14N25O29M18l33q80n22K49L94
50021H26723j54m26Q1P82J058J235K018L428M841N824O547P474Q875J0707J2835
50006H91848J5331J8506K2594K7514L3110L9383M6357N3826O1436O8819P5453
49995A354177Q0628Q3934Q5554Q5726Q4168Q0531P5210O9156O2916N6472M9998
$$ y = [2678959, 2517369, 2360474, 2211350, 2071808, 1942355, 1823346, 1715358, 1618351, 1531385, 1453542, 1384466, 1323623, 1269599, 1220769, 1176356, 1136445, 1101137, 1070068, 1042579, 1018079, 996343, 977573, 961899, 948669, 936624, 925043, 914350, 905220, 897516, 890501, 883793, 877509, 871708, 866268, 861237, 856750, 852619, 848534, 844655, 841531, 839360, 837833, 836734, 836174, 836031, 835632, 834349, 832200, 829669, 827172, 824937, 823189, 822211, 822188, 823048, 824366, 825529, 826243, 826768, 827397, 827815, 827482, 826602, 826080, 826329, 826723, 826569, 826143, 826224, 827006, 828064, 829299, 831317, 834745, 839586, 845410, 851957, 859431, 868306, 879013, 891848, 907179, 925685, 948279, 975793, 1008903, 1048286, 1094643, 1148469, 1209905, 1278724, 1354177, 1434805, 1518739, 1604293, 1690019, 1774187, 1854718, 1929928, 1999084, 2062000, 2118472, 2168470]
49984B168470M4039L8785L3615K7510J9521Q791n210k2156m0895o0102p8542r4707
49972B039119j06947j14326j16980j15487j10403j02634r3565q4237p4805o5159
49962A054576n5727m7179l9695l3008k6977k1680j7144j3318j0176p589n294l310
49950G73479k112k077k956m120n099n691n965o384p530r293j0830j1683j2435
49937F87304j3705j5041j5557j5275j4886j4484j3472j1766j0076q831p647o173
49925E40391m649l366k139q06L45J018J340J482J312Q27M93O97J249J783K342
49910E42319L156M128M999N821O800P881Q801R418R624R197Q095O701N341L860
49896F36141K096N33k73p45j957m114o179p268p818q807j0377j1781j2434j2426
$$ y = [2168470, 2212509, 2251294, 2284909, 2312419, 2331940, 2340731, 2335521, 2313365, 2272470, 2212368, 2133826, 2039119, 1932172, 1817846, 1700866, 1585379, 1474976, 1372342, 1278777, 1194540, 1119735, 1054576, 998849, 951670, 911975, 878967, 851990, 830310, 813166, 799848, 789672, 782083, 776789, 773479, 771367, 769290, 766334, 762214, 757115, 751424, 745459, 739075, 731545, 722252, 711422, 699739, 687304, 673599, 658558, 643001, 627726, 612840, 598356, 584884, 573118, 563042, 554211, 546564, 540391, 535742, 532376, 530237, 529431, 529776, 530794, 532134, 533616, 534928, 535755, 536248, 536945, 538194, 539977, 542319, 545475, 549603, 554602, 560423, 567223, 575104, 583905, 593323, 602947, 612144, 620239, 626940, 632281, 636141, 638237, 638770, 638497, 637752, 635795, 631681, 625502, 618234, 610416, 601609, 591232, 579451, 567017, 554591]
49882E54591j2086j1559j0860r955q805p537o567o188o036n326l703j627J37J196
49868D65675J591J598J636K146L273M697N933O735P144P363P676Q330R231R887
49854E42915R895R333Q469P220N307K943Q99k31o44j025j873l224m794o109o716
49839E62365o601o304o417o845o862n905m161k295p80L62J282K018K499K766L062
49824E28184L702M848O301P584Q258Q309Q210Q485R165R688R424Q234O537M889
49810F31818L616K694J858P98n73k058l440m794o339q026r437j0160j0081r310
49796E76566q053o699n809n764o388p021p018o188m900l784l215l036k876k655
49782E03160k505k311j749q70k02M3L88J326K506L252L588M112M918N380N112
$$ y = [554591, 542505, 530946, 520086, 510131, 501326, 493789, 487222, 481034, 474998, 469672, 465969, 464342, 464479, 465675, 467266, 468864, 470500, 472646, 475919, 480616, 486549, 493284, 500428, 507791, 515467, 523797, 533028, 542915, 552810, 562143, 570612, 577832, 583139, 586082, 586981, 586750, 586106, 585081, 583208, 579984, 575190, 569081, 562365, 555764, 549460, 543043, 536198, 529336, 523431, 519270, 516975, 516195, 516557, 517839, 519857, 522356, 525122, 528184, 531886, 536734, 543035, 550619, 558877, 567186, 575396, 583881, 593046, 602734, 612158, 620392, 626929, 631818, 635434, 638128, 639986, 640784, 640211, 638153, 634713, 629919, 623580, 615554, 606117, 595957, 585876, 576566, 568513, 561814, 556005, 550241, 543853, 536832, 529814, 523626, 518726, 514942, 511727, 508691, 505815, 503160, 500655, 498344, 496595, 495725, 495523, 495566, 495954, 497280, 499786, 503038, 506626, 510738, 515656, 521036, 526148]
49767E26148M469L921L513L164K961K757K074P95m75j242j891l022m453n544o242
$$ y = [526148, 530617, 534538, 538051, 541215, 544176, 546933, 549007, 549802, 549327, 548085, 546194, 543172, 538719, 533175, 526933]
$$ [...]
##END NTUPLES=NMR SPECTRUM
##END=
