##TITLE=AC1582_13IEXT2718_8214273_05kkdScx9Q
##JCAMPDX= 6.0         $$ Bruker NMR JCAMP-DX V2.0
##DATA TYPE= NMR SPECTRUM
##DATA CLASS= NTUPLES
##ORIGIN= BRUKER
##OWNER= Administrator
$$ 1.72 TOPSPIN		Version 2.1
$$ 2013-10-12 15:39:47.357 -0700  Administrator@X
$$ Compression mode = diff/dup
##.OBSERVE FREQUENCY= 400.02188249412
##.OBSERVE NUCLEUS= ^1H
##.ACQUISITION MODE= SIMULTANEOUS (DQD)
##.ACQUISITION SCHEME= undefined
##.AVERAGES= 8
##.DIGITISER RES= 22
##SPECTROMETER/DATA SYSTEM= spect
##.PULSE SEQUENCE= zg30
##.SOLVENT NAME= COFFEE_meoh
##.SHIFT REFERENCE= INTERNAL, COFFEE_meoh, 1, 14.98509
##AUDIT TRAIL= $$ (NUMBER, WHEN, WHO, WHERE, PROCESS, VERSION, WHAT)
$$ ##TITLE= Audit trail, TOPSPIN		Version 2.1
$$ ##JCAMPDX= 5.01
$$ ##ORIGIN= Bruker BioSpin GmbH
$$ ##OWNER= Administrator
$$ $$ E:\/data/COFFEE/nmr/AC1582_13IEXT2718_8214273_05kkdScx9Q/30/pdata/1/auditp.txt
$$ ##AUDIT TRAIL=  $$ (NUMBER, WHEN, WHO, WHERE, PROCESS, VERSION, WHAT)
(   1,<2013-10-12 15:39:40.953 -0700>,<Administrator>,<X>,<go>,<TOPSPIN 2.1>,
      <created by zg
	started at 2013-10-12 15:38:34.272 -0700,
	POWCHK enabled, PULCHK disabled,
       configuration hash MD5:
       C8 4E 4E 5D D3 5C D8 9E 9F 52 82 E0 59 8A DE 15
       data hash MD5: 64K
       F0 71 2A D6 CF A3 E8 CD 0A 48 D0 8B F0 A5 F8 CA>)
(   2,<2013-10-12 15:39:43.828 -0700>,<Administrator>,<X>,<proc1d>,<TOPSPIN 2.1>,
      <Start of raw data processing
       efp LB = 0 FT_mod = 6 PKNL = 1 PHC0 = 0 PHC1 = 0 SI = 32K 
       data hash MD5: 32K
       6D 7C 58 EB D1 66 B7 AB 23 12 58 B2 28 3A 4D EC>)
(   3,<2013-10-12 15:39:44.170 -0700>,<Administrator>,<X>,<proc1d>,<TOPSPIN 2.1>,
      <pk PHC0 = 97.12463 PHC1 = 0 
       data hash MD5: 32K
       90 17 35 95 C7 0E B3 82 B0 C6 64 B2 3B 37 26 FA>)
(   4,<2013-10-12 15:39:44.264 -0700>,<Administrator>,<X>,<proc1d>,<TOPSPIN 2.1>,
      <abs ABSG = 1 
       data hash MD5: 32K
       4C E2 F9 90 E6 F1 83 F0 C6 1B 62 9D 32 6E 37 3D>)
(   5,<2013-10-12 15:39:44.341 -0700>,<Administrator>,<X>,<proc1d>,<TOPSPIN 2.1>,
      <abs ABSG = 2 
       data hash MD5: 32K
       2D 24 51 13 28 61 EF EA 28 F5 51 94 23 CB 85 A7>)
(   6,<2013-10-12 15:39:44.404 -0700>,<Administrator>,<X>,<proc1d>,<TOPSPIN 2.1>,
      <abs ABSG = 3 
       data hash MD5: 32K
       6E 9B 25 F7 7D 6C 74 8B E7 44 D2 96 06 6E E8 F2>)
(   7,<2013-10-12 15:39:44.450 -0700>,<Administrator>,<X>,<proc1d>,<TOPSPIN 2.1>,
      <abs ABSG = 4 
       data hash MD5: 32K
       E1 78 43 B1 34 77 A4 B9 C8 64 09 BC 1E 4F 61 B6>)
(   8,<2013-10-12 15:39:44.497 -0700>,<Administrator>,<X>,<proc1d>,<TOPSPIN 2.1>,
      <abs ABSG = 5 
       data hash MD5: 32K
       09 10 23 C2 CE 33 FE 82 53 B4 87 BC 1D 45 66 51>)
$$ ##END=
$$ 
$$ $$ hash MD5
$$ $$ 54 B6 83 25 AB 29 EB 1D 3E 25 0B B4 3B 04 26 2F
##$RELAX= 
##$RELAX= 
##$RELAX= 
##$RELAX= 
##$RELAX= 
##$RELAX= 
##$RELAX= 
$$ Bruker specific parameters
$$ --------------------------
##$DU= <E:\>
##$EXPNO= 30
##$NAME= <AC1582_13IEXT2718_8214273_05kkdScx9Q>
$$ [...]
##$TP= (0..7)
150 150 150 150 150 150 150 150
##$TP07= 0
##$TPNAME0= <>
##$TPNAME1= <>
##$TPNAME2= <>
##$TPNAME3= <>
##$TPNAME4= <>
##$TPNAME5= <>
##$TPNAME6= <>
##$TPNAME7= <>
##$TPOAL= (0..7)
0.5 0.5 0.5 0.5 0.5 0.5 0.5 0.5
##$TPOFFS= (0..7)
0 0 0 0 0 0 0 0
##$TUNHIN= 0
##$TUNHOUT= 0
##$TUNXOUT= 0
##$USERA1= <user>
##$USERA2= <user>
##$USERA3= <user>
##$USERA4= <user>
##$USERA5= <user>
##$V9= 5
##$VALIST= <valist>
##$VCLIST= <CCCCCCCCCCCCCCC>
##$VD= 0
##$VDLIST= <DDDDDDDDDDDDDDD>
##$VPLIST= <PPPPPPPPPPPPPPP>
##$VTLIST= <TTTTTTTTTTTTTTT>
##$WBST= 1024
##$WBSW= 4
##$XGAIN= (0..3)
0 0 0 0
##$XL= 0
##$YL= 0
##$YMAX_a= 631046
##$YMIN_a= -536720
##$ZGOPTNS= <>
##$ZL1= 120
##$ZL2= 120
##$ZL3= 120
##$ZL4= 120
##$ABSF1= 14.98509
##$ABSF2= -5.573092
##$ABSG= 5
##$ABSL= 3
##$ALPHA= 0
##$AQORDER= 0
##$ASSFAC= 0
##$ASSFACI= 0
##$ASSFACX= 0
##$ASSWID= 0
##$AUNMP= <proc_prof1d_extract_pilot.lims>
##$AXLEFT= 0
##$AXNAME= <>
##$AXNUC= <1H>
##$AXRIGHT= 0
##$AXTYPE= 0
##$AXUNIT= <>
##$AZFE= 0.1
##$AZFW= 0.1
##$BCFW= 0
##$BC_mod= 0
##$BYTORDP= 0
##$COROFFS= 0
##$CY= 15
##$DATMOD= 1
##$DC= 0
##$DFILT= <>
##$DTYPP= 0
##$F1P= 0
##$F2P= 0
##$FCOR= 0.5
##$FTSIZE= 32768
##$FT_mod= 6
##$GAMMA= 0
##$GB= 0
##$INTBC= 1
##$INTSCL= 1
##$ISEN= 128
##$LB= 0
##$LEV0= 0
##$LPBIN= 0
##$MAXI= 10000
##$MC2= 0
##$MEAN= 0
##$ME_mod= 0
##$MI= 0
##$NCOEF= 0
##$NC_proc= -8
##$NLEV= 6
##$NOISF1= 0
##$NOISF2= 0
##$NSP= 0
##$NTH_PI= 0
##$NZP= 0
##$OFFSET= 14.98509
##$PC= 1
##$PHC0= 97.12463
##$PHC1= 0
##$PH_mod= 1
##$PKNL= yes
##$PPARMOD= 0
##$PPDIAG= 0
##$PPIPTYP= 0
##$PPMPNUM= 2147483647
##$PPRESOL= 1
##$PSCAL= 4
##$PSIGN= 0
##$PYNMP= <proc.py>
##$REVERSE= no
##$SF= 400.02
##$SI= 32768
##$SIGF1= 0
##$SIGF2= 0
##$SINO= 400
##$SIOLD= 32768
##$SPECTYP= <>
##$SREGLST= <1H.CDCl3>
##$SSB= 0
##$STSI= 32768
##$STSR= 0
##$SW_p= 8223.68421052631
##$SYMM= 0
##$S_DEV= 0
##$TDeff= 65536
##$TDoff= 0
##$TI= <>
##$TILT= no
##$TM1= 0
##$TM2= 0
##$TOPLEV= 0
##$USERP1= <user>
##$USERP2= <user>
##$USERP3= <user>
##$USERP4= <user>
##$USERP5= <user>
##$WDW= 1
##$XDIM= 32768
##$YMAX_p= 446550490
##$YMIN_p= -813779
##$CURPLOT= <Network HP LaserJet P1505>
##$CURPRIN= <$Network HP LaserJet P1505>
##$DFORMAT= <normdp>
##$LAYOUT= <+/1D_H.xwp>
##$LFORMAT= <normlp>
##$PFORMAT= <normpl>
##$SURQMSG= 1
$$ End of Bruker specific parameters
$$ ---------------------------------
##NTUPLES= NMR SPECTRUM
##VAR_NAME=  FREQUENCY,     SPECTRUM/REAL,   SPECTRUM/IMAG
##SYMBOL=    X,             R,               I
##VAR_TYPE=  INDEPENDENT,   DEPENDENT,       DEPENDENT
##VAR_FORM=  AFFN,          ASDF,            ASDF
##VAR_DIM=   32768,         32768,           32768
##UNITS=     HZ,            ARBITRARY UNITS, ARBITRARY UNITS
##FACTOR=    0.250966925370066, 1,           1
##FIRST=     8223.43324360094, 163479,       6106
##LAST=      0,             12512,           1909
##MIN=       0,             -813779,         0
##MAX=       8223.43324360094, 446550490,    0
$$ Real data points
##PAGE= N=1
##DATA TABLE= (X++(R..R)), XYDATA
$$ [...]
19534H8570M982b29471e3677B90026a47280a2721E7693a92540a4656A0176i3972
19522F4853e02285R0316A33187k3088a50475B7793K14462f8346j05823A65529
19511b8639j5763p2819C2478h581l24184J59534B9627a41421j26363I546M6577
19500E6123a46534I4129a02864b7752B00769E8704a34020e447j38999k05078I3661
19488H9414e2102j83564i6279j57442N9558c4656q6761j31244B41435B0588a494
19476B33494h9057n6787K2954N0707b6563l2374A53205A6369d2091j72014R0736
19465a23369j10118B82281b29843R2826M4067A65321L033a518A3224b02135D1409
19453A55279F6525c26948j74836a51501n3257A4038a25495b517A32273D8789b55164
$$ y = [88570, 93552, -229471, -53677, 290026, -147280, -12721, 57693, -192540, -14656, 10176, -93972, 64853, -502285, -411969, 133187, 110099, -150475, 27793, 242255, -68346, -174169, 165529, -28639, -44402, -117221, 32478, -8581, -332765, -173231, 29627, -141421, -267784, 9546, 56123, -146534, 94129, -102864, -27752, 200769, 58704, -134020, -5447, -144446, -349524, 93661, 89414, -52102, -235666, -96279, -253721, -194163, -34656, -121417, -252661, 241435, 20588, -1494, 233494, -89057, -145844, -122890, -72183, -26563, -58937, 153205, 16369, -42091, -214105, -123369, -233487, 282281, -229843, -137017, -92950, 165321, 168354, -1518, 13224, -202135, 41409, 155279, 66525, -326948, -501784, -151501, -204758, 14038, -125495, -2517, 132273, 48789, -255164]
19441H6768b30680J1948N1165A59249c40477B97309C4252b82287A75651a44860
19430a85425g4035A20674J22900A16701d9888E3182a40055f9444k07434A85413
19419a15788c3569k770k9354k13611A9422b28914J0968Q154Q7880B405g8550A23599
19406a53509j47759A09470Q6551K5814c10339B3383J23477n2206d6173k28480
19396b74653F5637c04601P3236f9432B1670a0909L532j73107B04921e1894D8089
19384h6194C6727J01008b27087O1222g6923I1021J58171i7813q8203j00494d1426
19372b08202K2302A59853B3170a46456k29947H2320Q4388a54774D4031a12711
19361c08405a45474D3919a56981j80145K0260c2985o6624A22669f4325q3272H6583
$$ y = [86768, -230680, -218732, -167567, 159249, -340477, 297309, 34252, -282287, 175651, -144860, -185425, -74035, 120674, 243574, 116701, -49888, 53182, -140055, -69444, -276878, 185413, -115788, -33569, -36339, -65693, -279304, 19422, -228914, -217946, -209792, -121912, 2405, -78550, 123599, -153509, -301268, 109470, 196021, 221835, -310339, 23383, 146860, 94654, -46173, -274653, 65637, -304601, -231365, -69432, 21670, -10909, -7377, -180484, 204921, -51894, 48089, -86194, 36727, 137735, -227087, -165865, -76923, 91021, 249192, -97813, -186016, -286510, -41426, -208202, -185900, 159853, 23170, -146456, -376403, 82320, 166708, -154774, 44031, -112711, -308405, -145474, 43919, -156981, -337126, -316866, -32985, -99609, 122669, -64325, -147597, 86583]
19349a80541j8146o0558d9275j46237a1678k5291R14j75755n2500P5737j78526
19338c67099A00498b0948j80999M5782G631L6251J83959d4889l19071F1697E546
19326a51155j74596F0813O8818b03428L7255d9216H9880f5035p5067A50996a44318
19314A4561f8837H895a31734o881a9360r7572A15092j5132a131j07710F8469b25730
19301A178J31152a06618o3468A8570b35232A09318R6771a28954N9506k7828c2575
19289A9036f4749A09752a82970A88229a85557A03467g4815o7945E5687g7832B667
19277D9646Q3701J9141b41743B9846M424c72167A51353E7511g4398j13730k0565
19266b08693k00700A31104b21784Q3104j25919h556A55360D8160b45541C5113
$$ y = [-180541, -198687, -259245, -49275, -195512, -11678, -36969, -36055, -211810, -264310, -188573, -367099, 100498, -20948, -201947, -156165, 7631, 43882, 227841, -44889, -363960, 61697, 5546, -151155, -325751, 60813, 129631, -203428, -166173, -49216, 89880, -65035, -140102, 150996, -144318, 14561, -68837, 8895, -131734, -138615, -19360, -116932, 115092, 99960, -1131, -108841, 68469, -225730, 1178, 132330, -106618, -170086, 18570, -235232, 109318, 206089, -128954, -69448, -97276, -32575, 19036, -64749, 109752, -182970, 188229, -185557, 103467, -74815, -142760, 55687, -77832, 2667, 49646, 133347, 152488, -241743, 29846, 34270, -372167, 151353, 57511, -74398, -188128, -208693, -409393, 131104, -221784, -138680, -264599, -8556, 155360, 48160, -245541, 35113]
19255b41360c8429n4158o2663l7930c7165k93310J57588e0050E5648e79640e6955
19243C06835a72362k19559d2533k6594k46963E4398a11970p3122H7498e4451k21963
19232b76414a25342e2701j82066I0441g6947A50850a90314K8904A21227d06283
19221B88035a56080C2896b79487K449g9531A32509a21885H4254J50756a24836
19210d6661B55548a83436f8504j57560L5010f1876j04028B26030b75802Q4180
19200a91622b4271E7804L7593i5059q4666j76215J03687A08231a08703C13339
19189a42256i454F4965J45416O9930a87189K4633b680A6522c47470r1073A10464
19177D6065a14988M0301A31293K7765o9401b90583J14430J588B02448a62636j102
$$ y = [-241360, -38429, -92587, -155250, -193180, -37165, -330475, -172887, -50050, 55648, -579640, -56955, 306835, -172362, -391921, -42533, -69127, -316090, 54398, -111970, -185092, 87498, -54451, -276414, -125342, -52701, -234767, 90441, -76947, 150850, -190314, -161410, 121227, -406283, 288035, -156080, 32896, -279487, -277038, -79531, 132509, -121885, 84254, 235010, -124836, -46661, 255548, -183436, -68504, -226064, -191054, -61876, -165904, 226030, -275802, -191622, -24271, 57804, 95397, -95059, -179725, -355940, -252253, 108231, -108703, 313339, -142256, -9454, 64965, 210381, 280311, -187189, -162556, -2680, 16522, -347470, -438543, 110464, 46065, -114988, -74687, 131293, 159058, 89657, -290583, -176153, -174565, 202448, -162636, -163738]
19166a63738E8463J26349a15747C0501J31979c8880I3815a62942J3632F2123a62324
19154d77310B63869a66746J4829e7260A39525o9057A3457J24589D0947d1815A27745
19142b47476f3692A28207B4012K49334A35595m350B5220h7817k21361a50369F5252
19130B20462i0257E3486b17239D9584b96753a4668j67125h7725B59571Q1658a65696
19118d9559j85116C5144b98487A4491i2104e086k70534G470J30264F4638Q394
19107G3032C324a38615b5800B93766A21003e9059a7579j62508A96182Q6787D0384
19095H2827a51978B4836d4187k17264g2712j37611J01529k20876J62761E047K15311
19084B20358b23820P9625N6338n5244M3139b3547E2165K92347d0399k3672l50605
$$ y = [-163738, 58463, 184812, -115747, 30501, 162480, -38880, 93815, -162942, -149310, 62123, -162324, -477310, 263869, -166746, -151917, -57260, 139525, 70468, 13457, 138046, 40947, -41815, 127745, -247476, -63692, 128207, 24012, 273346, 135595, 131245, 25220, -87817, -309178, -150369, 65252, 220462, -90257, 53486, -217239, 49584, -296753, -14668, -181793, -87725, 259571, 341229, -165696, -49559, -234675, 35144, -298487, 14491, -92104, -5086, -275620, 7470, 137734, 64638, 73032, 3324, -138615, -25800, 293766, 121003, -59059, -17579, -180087, 196182, 282969, 40384, 82827, -151978, 24836, -44187, -261451, -72712, -210323, -108794, -329670, -166909, 5047, 220358, -223820, -144195, -87857, -143101, -99962, -23547, 52165, 344512, -40399, -64071, -414676]
19073d14676b6667a079A4359b01500B22268l6346F908a13787m3372a6956B4646
19061a28783e7115A54963C834b5416q2782d5028G0362a31606a4833C4057J51082
19050A85139F535i3021j6164j22149B18328a96461A40964a49227D7842J4728M49543
19039E12113b61881J27592F9301A6924a20142B37431h5224A02220l3184i403C32123
19027e343l7011B30961g9842A37699b640A12002D0673a77447C12533A09125i5611
19015c80458a1733A00767c20119A56388O158c09066B64732b78415A05258c666
19004a86561j56998a67413B40481E0907b30054a12121M7050K5340p6652D00430
18993c83442k13908A09432B8685a75527B62986i7437j30395B30898c56001a1987
$$ y = [-414676, -26667, -1079, 14359, -201500, 222268, 185922, 6908, -113787, -157159, -16956, 24646, -128783, -57115, 154963, 3834, -25416, -108198, -45028, 70362, -131606, -14833, 34057, 185139, 6535, -93021, -109185, -231334, 218328, -196461, 140964, -149227, 47842, 62570, 512113, -261881, -134289, 69301, 16924, -120142, 237431, -85224, 102220, 69036, -9403, 332123, -5343, -42354, 230961, -79842, 137699, -2640, 112002, 40673, -177447, 312533, 109125, -95611, -380458, -11733, 100767, -320119, 156388, 162546, -309066, 264732, -278415, 105258, -3666, -186561, -343559, -167413, 240481, 50907, -230054, -112121, -65071, -39731, -116383, 400430, -383442, -597350, 109432, 28685, -175527, 262986, -97437, -227832, 230898, -356001, -11987]
18982f8586L2767p0277o4862B8806a64486C19400h0306k5003o7853r4828R1304
18971a76686n4559A82215c63813i0621j43818q8375F0061A0498e2197H7543J1147
18960I8690j4774J08018a68021j1748B30952a28091o1710j10759R3538B76383
18949B72631g2433A16029b74734a498A15460e1100k51511j08635A11452D0149
18938B858b6575l06217a9187l06014A46894a78871a9056o7407A54848i3246l12552
18927d05798J30819b8874I2239d3611m3990j38711h6149j89325J06353L0327f9068
18915B554N2521L7896a48729d2664B42631a461j93006K8981B40892d11939a76597
18903A22224a4602C7403b11650C0428e2156j80289q3231H0600d6202k10925B99690
$$ y = [-68586, -35819, -106096, -170958, 28806, -164486, 319400, -80306, -105309, -173162, -267990, -176686, -231245, 182215, -363813, -90621, -234439, -322814, 60061, 10498, -52197, 87543, 98690, 83916, 191934, -168021, -179769, 230952, -128091, -189801, -300560, -207022, 276383, 272631, -72433, 116029, -274734, -1498, 115460, -51100, -302611, -411246, 111452, 40149, 2858, -26575, -332792, -19187, -325201, 146894, -178871, -19056, -86463, 154848, -93246, -405798, -274979, -28874, 92239, -43611, -87601, -226312, -86149, -275474, -169121, -138794, -69068, 2554, 55075, 92971, -148729, -42664, 242631, -1461, -194467, -165486, 240892, -411939, -176597, 122224, -14602, 37403, -211650, 30428, -52156, -232445, -315676, 80600, -46202, -257127, 299690]
18891A51866k3207c09366i0061k39547B7055J48817e0070C51231a17897k28251
18881c46148C6325a35651o3258C42271I9077b36793G7580a06345c2440r7880L2397
18870i7923h069n4405m6084j5323m6253d6751j0379J8052r0001j1899q3739B49594
18857f0022A5086b8025B18070b1528A5202K1537J5372i3250A2269a6847k67510
18846b84357F8320b7854k80210a31888B42427a52347N6148F965a24000A49260
18835A45464D9339g2289D196d5928j62389h7138a0199D1420a41532O6673A83085
18823A55254r855I685P2118b51009c4593D15271A3899b22580D19094C709J6801
18812B0510f528A59466g5980A35036a01681A71064c72192B8266e9967j21294O3618
$$ y = [151866, 128659, -309366, -90061, -329608, 27055, 175872, -50070, 351231, -117897, -346148, 36325, -135651, -198909, 342271, 99077, -236793, 77580, -106345, -32440, -130320, -97923, -8069, -62474, -108558, -123881, -170134, -46751, -57130, -39078, -129079, -140978, -224717, 249594, -60022, 15086, -28025, 218070, -21528, 15202, 36739, 52111, -93250, 12269, -16847, -284357, 68320, -27854, -308064, -131888, 242427, -152347, -96199, 6965, -124000, 149260, 145464, 49339, -72289, 4196, -45928, -208317, -87138, -10199, 41420, -141532, -74859, 183085, 155254, 145399, 9685, 81803, -251009, -34593, 415271, 13899, -222580, 419094, 3709, 20510, -6528, 159466, -75980, 135036, -101681, 171064, -372192, 28266, -59967, -181261, -117643]
18801a17643I9595c98200B11367H6143b16361a8589j38269j98588J44035a4745
18790G980h2542j5387a9443m36979f8841p2436A14061c77614A62656a7736G2202
18778b03400N1962A16365P4986G4159b18348B73183I9081a67214K7761C4037J53222
18767A87259a50799p1775f1079A81380b7870E5521b05903d9256j32516b936F5008
18755a77124j0344e2342H8500a06501q4757e5622j23673q8782J07054r167j07589
18744b77779L9290N7798A42156D5314b44826k09528a89690A00074c52728b1268
18733a67116D9739a76400E3192P717J12285p0442h770F9629M39089B36177a3348
18721a61218C893a45526A43643b29331F7999a94750F9899a90555c160j81340A06422
$$ y = [-117643, 99595, -398200, 211367, 86143, -216361, -18589, -156858, -355446, -211411, -14745, 7980, -82542, -97929, -19443, -456422, -68841, -141277, 114061, -377614, 162656, -17736, 72202, -203400, -151438, 116365, 191351, 74159, -218348, 273183, 99081, -167214, -139453, 34037, 187259, -150799, -222574, -61079, 181380, -27870, 55521, -205903, -49256, -181772, -2936, 65008, -177124, -187468, -52342, 88500, -106501, -191258, -55622, -179295, -268077, -161023, -170190, -277779, -238489, -180691, 142156, 45314, -244826, -454354, -189690, 100074, -352728, -21268, -167116, 49739, -176400, 53192, 60909, 173194, 102752, -8770, 69629, 508718, 236177, -13348, -161218, 3893, -145526, 143643, -229331, 67999, -194750, 69899, -190555, -3160, -184500, 106422]
18709E3973f0249A04215k0210a63157A19278g1679B89944B6670k109a28527e6929
18697a2589A71175f7069b5313m2482A0704a23449n5437q531P0093l6950f6421
18685B18533E5612F561L6182j2848a6969B91400F560Q221J41955a33177c4056
18673a08686D4572P8801h9457r227k40166I3703R6605a61346p616C7512a05877
18661c2954E6450O4306b59377E5249g9490H3198b02778f9341l0952j34634k799
18650b37726A77098c24388J27980k31869b06270k6815Q6907M2616F3017P3610
18640A36627d1280m0860m06781F9678g1954A0088J88205a24567m3739f454l22322
18629c28776F0559a74466N3710A56208c71074O0729B13605C9526a97272r0649
$$ y = [53973, -60249, 104215, 84005, -163157, 119278, -71679, 289944, 26670, 24561, -128527, -56929, -12589, 171175, -67069, -25313, -67795, 10704, -123449, -178886, -187417, -117324, -154274, -66421, 218533, 55612, 6561, 42743, 29895, -16969, 291400, 6560, 14781, 156736, -133177, -34056, -108686, 44572, 123373, -89457, -98684, -338850, 93703, 190308, -161346, -168962, 37512, -105877, -32954, 56450, 120756, -259377, 55249, -79490, 83198, -202778, -69341, -100293, -234927, -237726, 177098, -324388, -196408, -428277, -206270, -233085, -146178, -103562, 63017, 136627, -41280, -82140, -488921, 69678, -71954, 10088, 198293, -124567, -168306, -6454, -328776, 60559, -174466, -120756, 156208, -371074, -310345, 213605, 39526, -197272, -287921]
18619b87921D8786J96034a76707h6904p9772j17345C7519i3496H2117h0623a0213
18607a24964c3830l1937C2757J6939b23596G213a6400n4994K7196F3306a17503
18595G3922R8385R113f4995j33844G9563a59462d4713F7481g4064j24845Q2447
18584a16462A17879a9682j41724B8966K99136a11429k00448G0245c9993r7192
18574a37185j66D941M3196a88324b4442k06595B71348A13549c9841I3799R7999
18563A91798h5492L7993j49682A76360g174I3236a38199B95113g3411A20965E4357
18551c3460A4596b14656G5942B4687b99906f0063D4870B1000J82677b61389A23728
18539b44910G5551b96148R2907k63395G791a33392A30292b38396h3568A23358
$$ y = [-287921, 48786, 244820, -176707, -86904, -166676, -284021, 37519, -93496, 82117, -80623, -10213, -124964, -33830, -65767, 32757, 49696, -223596, 7213, -16400, -71394, -44198, 63306, -117503, 73922, 172307, 181420, -64995, -198839, 79563, -159462, -44713, 67481, -74064, -198909, -116462, 117879, -19682, -161406, 28966, 328102, -111429, -311877, 70245, -39993, -137185, -137351, 4941, 48137, -188324, -24442, -231037, 271348, 113549, -39841, 93799, 191798, -85492, -47499, -197181, 176360, -7174, 93236, -138199, 295113, -73411, 120965, 54357, -33460, 14596, -214656, 75942, 24687, -299906, -60063, 44870, 21000, 203677, -261389, 123728, -244910, 75551, -296148, -203241, -466636, 7791, -133392, 130292, -238396, -83568, 123358]
18528C1417d2485F4520R9165a7220A62312d5321A3897a82532i399B30a6455A15369
18515a27088I9187J13643I453a25962k71988d0152l6336c7185j2803j85532P437
18504b28083a8920b845j92053B66571L30932a01175r7524g04l06550a12466B7910
18492a29444l8121E9212a16543B98184a09987k4933j68098d2705l8231k8242q6085
18481a95263C10788b11524A39510a99556Q2393q3365h334G7179g6800c1576A19983
18469H5063h8930k47491i1167d3736C1096b34710K4081K4705H491a17948N3665
18458f4283E7091e6359k6115I2774J9544K03760b55783B58609r5499o9366a74218
18446B06279a38509b5342B54034a83397A53417c321G3244c15551a55203A81986
$$ y = [31417, -42485, 64520, 163685, -17220, 162312, -45321, 13897, -182532, -9399, 230, -16455, 115369, -127088, 99187, 212830, 9453, -125962, -397950, -40152, -76488, -37185, -49988, -235520, -228083, -18920, -2845, -194898, 266571, 597503, -101175, -198699, -704, -307254, -112466, 27910, -129444, -167565, 59212, -116543, 298184, -109987, -134920, -303018, -42705, -80936, -109178, -195263, 310788, -211524, 139510, -199556, -117163, -200528, -8334, 77179, -76800, -31576, 119983, 85063, -88930, -336421, -91167, -43736, 31096, -234710, -210629, -185924, 8491, -117948, -64283, 57091, -56359, -82474, 92774, 112318, 316078, -255783, 258609, 163110, 93744, -174218, 206279, -138509, -25342, 254034, -183397, 153417, -3321, 73244, -315551, -155203, 181986]
18435A73974c59885J78191E7072a44344e8391H9997b86287A34780a62080A45869
18424g1644A80475K01111c12095a53486F3484f1676I1866A1678R825M0535a71937
18412G2218c35013J65744A6630b53912e5244j93397B89188d36967a13895B94214
18401h1448k87646b5429B76558i9676B5022M722g018H8974a83818I7715L5901
18390A33616a32093j9290m35898K18097I4246D1930b49333J13169B6166i7989
18379a72930A49482b03556d5764R245A96950a70462B46780G4799b09270d6140
18368H6563a08166b7707M82B42992c26632l9755q7245b3068A40229d14686e7687
18356c71974a46789n73A82204a02151B3899a99147E081P7749b39553J8673C124
$$ y = [173974, -359885, -181694, 57072, -144344, -58391, 89997, -286287, 134780, -162080, 145869, -71644, 180475, 381586, -312095, -153486, 63484, -61676, 91866, 11678, 21503, 62038, -171937, 72218, -335013, -169269, 16630, -253912, -55244, -248641, 289188, -436967, -113895, 294214, -81448, -369094, -25429, 276558, -99676, 25022, 29744, -7018, 88974, -183818, 97715, 133616, -132093, -151383, -587281, -369184, 94246, 41930, -249333, -136164, 26166, -97989, -172930, 149482, -203556, -45764, -36519, 196950, -170462, 246780, 74799, -209270, -46140, 86563, -108166, -27707, -27225, 242992, -326632, -366387, -453632, -23068, 140229, -414686, -57687, -371974, -146789, -147362, 182204, -102151, 23899, -199147, 5081, 82830, -239553, -220880, 3124]
18344C7505K39618b25445c2913B85825K2888e5947E2894O0833c16859I7944d6314
18332F4368a79305Q2192c9353C7052d3769A47792a49353k28964P0318J24508P2603
18321a10888e0866o0064F363M0494L0184C1579a09327A1153J30783a26760h444
18309a4779m3136l4213h384l45395A29935L8417D0784e4393r9473N3375n5482
18298a55973A72202a21171J289d9604A94697b34969i6007A65068a39245A25901
18287H0297c38080l0293E7941a58285f8098A84445B914a31109j01434h5579C0740
18275a86938c348m1192j40871g7460G5381b32408E2666C475M37332b07325A9404
18263B69778a75410D6951J33225J2282a04733M5082K8794l89868J62975f9951
$$ y = [37505, 277123, -225445, -32913, 285825, 308713, -55947, 52894, 113727, -316859, 97944, -46314, 64368, -179305, -97113, -39353, 37052, -43769, 147792, -149353, -378317, -307999, -183491, -110888, -50866, -110930, 6363, 46857, 77041, 31579, -109327, 11153, 141936, -126760, -8444, -14779, -57915, -92128, -8384, -353779, 129935, 168352, 40784, -54393, -153866, -100491, -155973, 172202, -121171, -119882, -49604, 194697, -234969, -96007, 165068, -139245, 125901, 80297, -338080, -368373, 57941, -158285, -68098, 184445, 2914, -131109, -232543, -85579, 30740, -186938, -3348, -44540, -185411, -77460, 75381, -232408, 52666, 3475, 440807, -207325, 19404, 269778, -175410, 46951, 180176, 192458, -104733, -59651, -30857, -420725, -257750, -69951]
18252e1451k60422A60389b85160C8104b23527A81540a71350g4800p0279D2120
18241b23020A49351P927a5703B66205A6273d573A02064Q6124a20155B43999m0187
18230B03812a0290l73841h0646r336k7835e3282n1348K5910F1141a34874A56432
18218H9106J26662a34242j35336A66402e25995G5577f2208r033j15165g9569b3783
18206D03461j31269b37284N8305C9413f3869A16682h5799r7893A0906Q416P158
18195B6480b99023C59250j48006a77105d9986G6309Q0261b61189A29076J37519
18185B66595e03B09337q2259d1652l55478A11724a58269c0959r8945e9679K521
18174e7158A08277b46086g6818A55081A65L7406L2727b34880B40378a78243L1931
$$ y = [-51451, -311873, 160389, -285160, 38104, -223527, 181540, -171350, -74800, -145079, 42120, -223020, 149351, 157278, -15703, 266205, 16273, -4573, 102064, 188188, -120155, 243999, 203812, -10290, -384131, -80646, -89982, -117817, -53282, -104630, -78720, 61141, -134874, 156432, 89106, 215768, -134242, -269578, 166402, -525995, 75577, -62208, -71241, -186406, -79569, -23783, 403461, 272192, -237284, -178979, 39413, -63869, 116682, -85799, -183692, 10906, 19322, 26480, -299023, 359250, 211244, -177105, -49986, 76309, 156570, -261189, 129076, 266595, -503, 209337, 127078, -41652, -397130, 111724, -158269, -30959, -129904, -59679, -57158, 108277, -246086, -76818, 155081, 165, 37571, 70298, -234880, 240378, -178243, -146312]
18163a46312j40376B08394b09892O7270d1367j45864B16420i9739M528A15677
18152e589n2218k53214J06919h5752A13563r332J9178J10131e8924n403m0540
18141a04867k9098e1887n3345H0855i6738C84220D0743b67262g1844a0025j7600
18130b7625j51818j04292m6552a36015m9768d4131l4249k01796f9735p046r2483
18119a69264A28206n0995K83038j31613r2466b90132d6494k1021O362l7883A93022
18107i5635C376d803A61519a62636O8739B83380b52062A35474B3553K30905c9804
18095h9176L1577C24364B8165J4641K286M8327a56649H907c15340Q7227q7219
18084c15332b0857j25684e325A33100b355k92007I4483K1707b2462k48378c5187
$$ y = [-146312, -286688, 208394, -209892, -142622, -41367, -187231, 216420, -99739, -95211, 115677, -5589, -57807, -311021, -204102, -85752, 113563, 104231, 123409, 233540, -58924, -64327, -104867, -133965, -51887, -105232, 80855, -96738, 384220, 40743, -267262, -71844, -10025, -27625, -179443, -283735, -330287, -136015, -185783, -44131, -78380, -280176, -69735, -76781, -169264, 128206, 77211, 360249, 228636, 136170, -290132, -46494, -67515, -61153, -99036, 193022, -95635, 3376, -4803, 161519, -162636, -93897, 283380, -252062, 135474, 23553, 254458, -39804, -89176, -57599, 324364, 28165, 42806, 45092, 93419, -156649, 8907, -315340, -228113, -315332, -20857, -146541, -5325, 133100, -2355, -294362, 94483, 116190, -22462, -270840, -35187]
18072c2739D075O2131M3390m3328l074d2429j70263a4287A48072D0376f0788j67090
18060b27878c628A25788a17968q5949L6249j27174A87878d960j56897d7573j27055
18049a74628A0531a24123l0423p59M5455E2985a7278k08254C0337I569N6183L6581
18037A02333m7938a20477K1193a8748n3145A94683a41070D06803A56247l644o1147
18026I1456O8941a19424B2971a4760A10886a35155m1203F9280f7819h920A15016
18014B28304b25359B1045b0559A55293n6683a75507A30396e56131e7228k8493
18004h5721l0651j74358M240Q2434j29215a20554A69558b13930d9340H7723a6844
17992H9352Q4913b87792B12063K3059b37365B0555a6528H5128j7996B838b93683
$$ y = [-32739, 4075, 66206, 109596, 66268, 63194, -42429, -212692, -14287, 148072, 40376, -60788, -227878, -3628, 125788, -117968, -203917, -167668, -294842, 187878, -4960, -161857, -47573, -174628, 10531, -124123, -154546, -155305, -109850, 52985, -17278, -225532, 30337, 9569, 65752, 102333, 54395, -120477, -99284, -18748, -71893, 194683, -141070, 406803, 156247, 152603, 91456, 160397, -119424, 22971, -14760, 110886, -135155, -176358, 69280, -67819, -8920, 115016, 228304, -225359, 21045, -20559, 155293, 98610, -175507, 130396, -556131, -57228, -85721, -116372, -290730, -286490, -204056, -333271, -120554, 169558, -213930, -49340, 87723, -16844, 89352, 174265, -287792, 212063, 235122, -237365, 20555, -16528, 85128, 67132, 2838, -293683]
17980h3841k14681Q6859h5480A75183q4796b07021E5010k212g1321H6490b60433
17968A93006J23519i8548j55639Q1264O0149M4092b9073o6383B59863j18742a27391
17956a19277d7050Q709J1988k13967E8155e4351A35739l6319c33676i0456b7378
17944d3876k63004J19548J3509I6159h9536B04696a36993A12516a63173B82130
17933F6374e3073E5600m0R3190J496L4559G1541b1561A25728J83569b55520a12151
17920c7427p1407j12166O0391H4850a13691D2339A11J6234b45639B98102B4675
17908a28449A3797J50244g9749B2869I529K34030b3156A58590a28229r1381f475
17896A20008C9819b4478B46051o4946a45978j75557J34516c1230B37768e8001
$$ y = [-83841, -298522, -211663, -85480, 175183, 90387, -207021, 55010, 52798, -71321, 86490, -260433, 193006, 316525, -98548, -254187, -172923, -112774, -68682, -29073, -95456, 259863, 141121, -127391, -119277, -47050, -38341, -26353, -240320, 58155, -54351, 135739, 99420, -333676, -90456, -27378, -43876, -306880, -187332, -173823, 96159, -89536, 204696, -136993, 112516, -163173, 282130, 66374, -53073, 55600, 55560, 148750, 150246, 184805, 71541, -21561, 125728, 309297, -255520, -112151, -37427, -108834, -221000, -160609, 84850, -113691, 42339, 111, 16345, -245639, 298102, 24675, -128449, 13797, 164041, -79749, 22869, 9529, 243559, -23156, 158590, -128229, -219610, -6475, 120008, 39819, -24478, 246051, 181105, -145978, -321535, -187019, -31230, 237768, -58001]
17885A48172a77338B35384J670g9135k40467J08744A35587J47774a20363D12947
17874a03535j44955B9255M2627c18432D9874d0482j71777j63780D64067b59221
17863c04530B9885J27873K7661q5627c71108J49418J02505G7277a03560A37731
17852A68920a32613A45590b4011j72084i4310C07465c6848p218D31400j61422
17842B69978h0639c4040l65498A56869Q8601J30217a49244A47438F7965r241N4225
17831A12949J38216B0677i0961j74950d5184A88523a04460n449B96233A06691
17820G4362a10411d9656A9740P3499D2089b78211F5983c99300J51834J16141B86862
17808d8346J6465C3843c55912A33930L9208p0809b05735a6495F7358k8610E70
$$ y = [148172, -177338, 235384, 237054, -79135, -319602, -210858, 135587, 283361, -120363, 412947, -103535, -248490, 29255, 71882, -318432, 49874, -40482, -212259, -376039, 464067, -259221, -304530, 29885, 157758, 185419, 99792, -371108, -221690, -119185, 77277, -103560, 137731, 168920, -132613, 145590, -24011, -196095, -94310, 307465, -36848, -44066, 431400, 269978, -80639, -34040, -399538, 156869, 245470, 375687, -149244, 147438, 67965, 58724, 112949, 251165, 20677, -90961, -265911, -45184, 188523, -104460, -109909, 296233, 106691, 74362, -110411, -49656, 19740, 93239, 42089, -278211, 65983, -399300, -247466, -131325, 286862, -48346, -31881, 33843, -355912, 133930, 173138, 102329, -205735, -16495, 67358, 38748, 570]
17796H13K21691J1489a18286d124j4847g745j87860A7856c0946A33675F1883c54830
17783a78119A33960a12818A18767c51561d922j69090B50507b20069Q0665c0316
17772a09576A66577c8614k00226a5788B56587a83815Q016A57360n6592h5061A40664
17760B83782b86068B58113g8228D1147a2713l7449j0406E4417h1656C16926c0486
17748a87886B41425B1992a23484m406A98349a91146A24755B2498a72231j1376
17738a83607j28277a02427k39338A88966j1833m8121a80807A65501p3756b11983
17727B29329B6174c27562C52628a17838A8693J02346j4117b11053o2220J28449
17717a44824C22071a00401a5561a163D69109H4581i1274n6698j38147E0058A064
$$ y = [813, 222504, 233993, -118286, -4124, -18971, -7745, -195605, 17856, -30946, 133675, 61883, -354830, -178119, 133960, -112818, 118767, -351561, -4922, -174012, 250507, -220069, -139404, -30316, -109576, 166577, -38614, -238840, -15788, 256587, -183815, -175799, 157360, 100768, -85061, 140664, 283782, -286068, 258113, -78228, 41147, -12713, -50162, -60568, 54417, -81656, 316926, -30486, -187886, 241425, 21992, -123484, -127890, 198349, -191146, 124755, 22498, -172231, -183607, -311884, -102427, -341765, 188966, 177133, 129012, -180807, 165501, 91745, -211983, 229329, 26174, -327562, 352628, -117838, 18693, 121039, 106922, -211053, -273273, -144824, 322071, -100401, -15561, -1163, 469109, 84581, -91274, -147972, -286119, 50058, 1064]
17705g0801D86878A528J54783b95382F5784J5729l7675c99406a32559A78087D2088
17693b87122A04022J04780A9961b03529f2707k77898A35775A9595N9495c3933
17682b85678I0414J20510a68978k35166E9680c3397o7383D460J8850J13110i9206
17670E9330O2941a73188C27235a48574F3334e271C8766L5749L1969P638A033f7255
17657d5507j29494r9048A28966D315K87825I5679b85303I0605a05599E2005f4471
17645b45073e2625p8323A50211a24103Q025J3646A45590R0035I6595M7514b78561
17633H1694i8152B58990D9188P2486E6171O6274e8503G1716b91184B69092e5368
17621C9218K28455E8963a17007M9625j19864a7876B06780D673b30806c5948A08004
$$ y = [-70801, 486878, 1528, 156311, -295382, 65784, 81513, 43838, -399406, -132559, 178087, 42088, -287122, 104022, 208802, 19961, -203529, -62707, -340605, 135775, 19595, 79090, -33933, -285678, 90414, 210924, -168978, -404144, 59680, -33397, -100780, 4460, 23310, 136420, -99206, 59330, 122271, -173188, 327235, -148574, 63334, -5271, 38766, 74515, 106484, 114122, 1033, -67255, -45507, -175001, -274049, 128966, 4315, 292140, 95679, -285303, 90605, -105599, 52005, -64471, -245073, -52625, -130948, 150211, -124103, -116078, -102432, 145590, 235625, 96595, 144109, -278561, 81694, -98152, 258990, 49188, 121674, 56171, 122445, -58503, 71716, -291184, 269092, -55368, 39218, 267673, 58963, -117007, -67382, -187246, -17876, 206780, 4673, -230806, -35948, 108004]
17609A26290L9106a05355A30480a47398k5795A66354D071a93927E3083L19504
17599C72587A77085l8889g6933n9574E2437J0937h240A95819R2771b85573B2935
17587A39944k0173M3827p8036h2737k3144l1050k56760B8520R8779R7463b73580
17575h6997A10645c266C24435l0232M8705j05657c30703A14742e9047a7443A28973
17563C50198H295a26622a2373B20417i6427k13146A33396k5012M602i019E3097
17551A57734C52P1489K68289A46775l1624b23555A51404K01959b39633R7307C7031
17539D4279J34562J4527C425a05416A60983c2019A83272N8877l9231J68052A35392
17527A57323e318A30819K39054j67348p7263a01941l8709A33351o3797D505c02554
$$ y = [126290, 165396, -105355, 130480, -147398, -173193, 166354, 4071, -193927, 53083, 372587, 177085, 138196, -76933, -136507, 52437, 63374, -8240, 195819, 288590, -285573, 22935, 139944, 119771, 163598, 85562, -82737, -105881, -136931, -393691, 28520, 127299, 224762, -273580, -86997, 110645, -3266, 324435, 294203, 342908, 237251, -330703, 114742, -59047, -17443, 128973, 350198, 8295, -126622, -12373, 220417, -96427, -309573, 133396, 108384, 112986, -9019, 53097, 157734, 352, 71841, 340130, 146775, 115151, -223555, 151404, 353363, -239633, -142326, 37031, 44279, 178841, 193368, 3425, -105416, 160983, -32019, 183272, 242149, 202918, 370970, 135392, 157323, -5318, 130819, 369873, 202525, 125262, -101941, -140650, 133351, 69554, 4505, -302554]
17515A46098a6968j2665k05058f9759A76065j4396P2290H327K08170K50540E7904
17503A12792K22571f1945J6597K1738i51D68445k06338A0069a54352C9330a91168
17491G1116J022b2878A15484N5928D5088K08234c6085C88625A62221a78229a608
17479A56041J5955a405A82298n2778j9336K73181a3866E7698a2013A88253H9329
17467a04005C4714L97287H5296b34412B40872j01961p349a55878A51585b07996
17456A75082J38977h7252k60261D27224a72564A07093N1120L16004I2661i9814
17445D92631j91181d674C25752J2589l2375J13627o9025j49482K89258F8190J05487
17434A73677Q8934l9841F7481P4515b4190A55424J0017O300J50881J07454A28217
$$ y = [146098, -16968, -29633, -234691, -69759, 176065, 161669, 233959, 8327, 216497, 467037, 57904, 112792, 335363, -61945, -45348, -23610, -951, 468445, 262107, 10069, -154352, 39330, -191168, 71116, 72138, -22878, 115484, 171412, 45088, 253322, -36085, 388625, 162221, -178229, -1608, 156041, 171996, -1405, 182298, 129520, 110184, 383365, -13866, 57698, -12013, 188253, 89329, -104005, 34714, 432001, 85296, -234412, 240872, 138911, 131562, -155878, 151585, -207996, 175082, 314059, -87252, -347513, 427224, -172564, 107093, 158213, 474217, 92661, -99814, 492631, 301450, -4674, 325752, 338341, 305966, 419593, 350568, 201086, 490344, 68190, 173677, 262611, 222770, 67481, 141996, -24190, 155424, 165441, 171741, 322622, 430076, 128217]
17422b7991A46602a46823B87127K1566N2684A49875J66536l1544A37287J23753
17412B61040k398C7879H827L51064G0824e6321C15914P2382a18411B08045o2203
17401A45842K5901D3793K09141A20967K54962A06464i2927B72400j35467R0261
17391B27194E0332J24710F3535b8205Q581C56438b22522A11913F097K62045a47569
17379H4413K63676e7993K2865B54770J15727B7403N7349i8768B98605A12476R3900
17368B06376e5989A34905n2005J18104N3163a74334A07012J59856h7621E487a4740
17356B20414a593A71330Q8519a66740p1654D5251J82044L00553e1546H8530k2506
17345F6024a54469C97415g9054B89349I5175k1340B3518c02219C36211b7085E3609
$$ y = [-27991, 146602, -146823, 287127, 308693, 361377, 149875, 316411, 284867, 137287, 261040, 258642, 37879, 8827, 359891, 70824, -56321, 315914, 388296, -118411, 208045, 145842, 171743, 43793, 252934, 120967, 375929, 106464, -92927, 272400, 136933, 227194, 50332, 175042, 63535, -28205, -19624, 356438, -222522, 111913, 6097, 268142, -147569, 84413, 348089, -57993, -35128, 254770, 370497, 27403, 84752, -98768, 298605, 112476, 206376, -55989, 134905, 82900, 201004, 254167, -174334, 107012, 266868, -87621, 5487, -14740, 220414, -1593, 171330, 259849, -166740, -238394, 45251, 227295, 527848, -51546, 88530, 66024, -154469, 397415, -79054, 289349, 95175, 73835, 23518, -302219, 336211, -27085, 53609]
17333I7552a95837A43390O5848A00751K039J52761Q3482A46434F4897J28639j2528
17322A81008n7697P2542q1685J32812p5345J14833j31276h2574M441A51349J67625
17311C18974b8031A94430I415J70542A7663b1493A27058E7034J68528I8804k6878
17300G1926l0686c5221I3195a15512C51214A09415J75638i6773I0384J98930E1892
17288B10597j9655k1263G0141J08783L43204k01816E0950Q0753G495K8632N4525
17277I0652J28611K09565a1632I7259J40878A5281J81718O8832j8862p1388J46433
17266C22014j48420k2128P9727r8108b9508o221E2829J68172k5593a58195A77919
17254D66289k21085a89159D10439k03973C4507L36104A42322o5972Q70K37601
$$ y = [97552, -195837, 143390, 209238, 100751, 102790, 255551, 339033, 146434, 64897, 193536, 181008, 123311, 195853, 114168, 246980, 171635, 286468, 155192, -82574, -78133, 151349, 318974, -28031, 194430, 9415, 179957, 17663, -21493, 127058, 57034, 225562, 98804, 71926, 41240, -35221, 93195, -115512, 351214, 109415, 285053, -96773, 90384, 289314, 51892, 210597, 190942, 169679, 70141, 178924, 522128, 320312, 50950, 131703, 7495, 36127, 90652, 219263, 428828, -11632, 97259, 238137, 15281, 196999, 265831, 246969, 175581, 322014, 173594, 151466, 231193, 133085, -29508, -35729, 52829, 221001, 195408, -158195, 177919, 466289, 245204, -189159, 410439, 206466, 34507, 370611, 142322, 76350, 77220, 314821]
17244C14821A47762k4151l1161J99101J11153A91792a0132B61174l8197a81170
17233F5844K79812f3268k69338C72246A06116c2260A59953M40658A17766k1712
17223I6054K57918A41062J05454m2237L3572J08363j3579G7194L76353k05640
17213B47907J35149A88383K18003p8485J0304j68815L47433k45280J40479a90577
17202E03508J4259a5414B93835F0107j5148J44017B0227K82406q0137L6065n52
17191B58009K8407g505A60947L81107A09687J3926M2191M49561j59394A28530
17180C92213I4289K21441A04944L57014j81630K4970K33516j90300A72750o2916
17170A09834m6862K94267A64oJ71017F0319P2460b3728A66769a34314C42117j36284
$$ y = [314821, 147762, 123611, 92450, 291551, 402704, 191792, -10132, 261174, 222977, -181170, 65844, 345656, -63268, -332606, 372246, 106116, -32260, 159953, 600611, 117766, 96054, 353972, 141062, 246516, 204279, 237851, 346214, 332635, 77194, 453547, 247907, 383056, 188383, 406386, 327901, 338205, 169390, 516823, 271543, 412022, -190577, 503508, 517767, -15414, 293835, 60107, 44959, 188976, 20227, 302633, 222496, 258561, 258009, 286416, -7505, 160947, 542054, 109687, 123613, 165804, 615365, 455971, 128530, 392213, 94289, 315730, 104944, 461958, 280328, 305298, 538814, 348514, 172750, 109834, 62972, 357239, 164, 158, 171175, 60319, 132779, -23728, 166769, -134314, 342117, 205833]
17158B05833J62464A42954M81924A56471J54602J93796J61812B05818K29293A85097
17147b8099B57971E2245M63000p8725p3769j65065J25656j0271J9190k1517j05894
17136B04850K25740c10362C06659K70501j26087A46511K40652l2920J59395j90163
17126C23475J75629k7598J51730G647M30601A44949M85933B48724J60564A88094
17115E60143a54768D88422c8614E01038q6408m7439n208l9901Q5780A92275R3218
17104B85493K24837k12075m2839O8748K50332Q648j86498L7548j11333j39269
17094A83592L73512B18158J83290k8661Q6424j68553R0781M75655D25960l2862
17084C93098J44174k05557Q8538J0095N2177j54318Q5523n3482R8972r4186l6464
$$ y = [205833, 368297, 142954, 624878, 156471, 311073, 504869, 666681, 205818, 435111, 185097, -28099, 257971, 52245, 515245, 436520, 362751, 197686, 323342, 313071, 332261, 310744, 204850, 430590, -310362, 306659, 577160, 451073, 146511, 387163, 354243, 513638, 323475, 499104, 471506, 623236, 7647, 438248, 144949, 630882, 248724, 409288, 188094, 560143, -154768, 488422, -38614, 501038, 414630, 367191, 361983, 322082, 407862, 192275, 285493, 510330, 298255, 255416, 324164, 574496, 583144, 396646, 434194, 322861, 183592, 557104, 218158, 401448, 372787, 459211, 290658, 381439, 857094, 425960, 393098, 537272, 331715, 420253, 430348, 482525, 328207, 413730, 360248, 459220, 365034, 328570]
17073C28570K9190K39742k03198j33476J60945q8608R4426H4764Q41738l83303
17063E43199k65773J70231J31457A20265N11513j55947n8746L37256C57711L22873
17053F80584l25157K99347B27572o7363L97014n1856L64027k68931j76767r6049
17043C27647J86669j39936A06364M35879n7007j64892j17080l155N06128j99622
17033E06615L1518J24147K5696j08541j89615L19034D5097M99620R198O5221j67109
17022D52027K03255l09130K52910L3969M8888N6043j50605j08870J01758N25797
17012A106042m41987J44744B06079P10365l51310J17430j08696J74867k63687
17003D85048N1355P1865r9290K85110J53442p4039J04030k75291l5859l1509L27239
$$ y = [328570, 357760, 597502, 394304, 260828, 421773, 333165, 427591, 84764, 926502, 543199, 277426, 447657, 579114, 120265, 631778, 475831, 417085, 754341, 357711, 680584, 355427, 654774, 227572, 160209, 557223, 505367, 869394, 600463, 423696, 327647, 514316, 374380, 106364, 542243, 485236, 320344, 203264, 200109, 706237, 506615, 538133, 662280, 687976, 579435, 389820, 708854, 45097, 544717, 553915, 619136, 452027, 655282, 346152, 599062, 633031, 681919, 737962, 587357, 478487, 580245, 1106042, 664055, 808799, 206079, 916444, 565134, 682564, 573868, 748735, 485048, 536403, 608268, 508978, 794088, 947530, 873491, 977521, 702230, 666371, 634862, 962101]
16992I62101N2190k41416J24210k89665L16737m43072J93347j55190L23289J51498
16982I94029l81929K99884J36719r0156q5576K14853k17646M3077l254K17927
16972A127928j4189j75292L11509m53301J01318R4135j95293j08461M24560m9823
16962A063091l14019R5271K73722k46282j3962j9322L31639k0994l47216L25479
16952A127407J61301m98134J07089m634R8185j4130j21003K05647J89398r6196
16942A154930k07133K27646J4876q8741J20932P7332n07721N22371o0449J59256
16932A413299K8381K62531l55535j46677L04849l46060K36007l4638O201k0602
16922A347756J48349j56382K12667k25973M11694q7990m03735K38141l33576M57710
$$ y = [962101, 1014291, 772875, 897085, 607420, 924157, 481085, 674432, 519242, 842531, 994029, 612100, 911984, 1048703, 958547, 872971, 1087824, 870178, 913255, 910001, 1127928, 1113739, 938447, 1249956, 796655, 897973, 992108, 796815, 688354, 1112914, 1063091, 749072, 844343, 1118065, 871783, 857821, 838499, 1170138, 1149144, 801928, 1127407, 1288708, 790574, 897663, 893029, 991214, 977084, 856081, 1061728, 1251126, 1154930, 947797, 1175443, 1190319, 1101578, 1222510, 1299842, 792121, 1314492, 1254043, 1413299, 1441680, 1704211, 1348676, 1201999, 1506848, 1160788, 1396795, 1362157, 1368358, 1347756, 1496105, 1339723, 1552390, 1326417, 1738111, 1650121, 1246386, 1484527, 1150951, 1608661]
16912A608661q8496J19070n7145q4337R9714j53026L07025l34338P6038J39456
16902A632622j07176M9879L37347l11203L56702q8618O5579k4533P2240k17618
16892A765221M50525k54282m3104M2796j57326J95518O8143M6596K76974r3981
16882B297080l32461M33407l32278P8942K37458l35266O98805n57502N976K66272
16872B460433M6423l6353q769K31537k38187J98607J16745k21428O82649n85363
16862B646294J93821p17P8358R7958N6593j78841L32275k62753L16338j0380m906
16851C264040j44959J70613K29686k44150J72090l2032K8301M94252k82673J40813
16841C795981K88330l60141L09123k82959N07308J99266j64378P1385J34222J15182
$$ y = [1608661, 1520165, 1639235, 1582090, 1497753, 1597467, 1444441, 1751466, 1417128, 1493166, 1632622, 1525446, 1575325, 1912672, 1601469, 1958171, 1869553, 1935132, 1910599, 1982839, 1765221, 2215746, 1961464, 1918360, 1961156, 1803830, 1999348, 2067491, 2114087, 2391061, 2297080, 1964619, 2398026, 2065748, 2144690, 2382148, 2046882, 2745687, 2188185, 2194161, 2460433, 2506856, 2470503, 2461734, 2693271, 2455084, 2653691, 2770436, 2549008, 3231657, 2646294, 2840115, 2839398, 2917756, 3015714, 3072307, 2893466, 3225741, 2962988, 3279326, 3268946, 3264040, 3119081, 3289694, 3519380, 3275230, 3447320, 3415288, 3443589, 3937841, 3655168, 3795981, 4084311, 3724170, 4033293, 3750334, 4257642, 4456908, 4292530, 4363915, 4498137, 4613319]
16831D613319k79146L03706K79330l98563L42149L01763L03582l94169O7776K28203
16821E367950L20956j6353Q1780K35582o2900K47946l6193j02861L51077K72241
16811F659225j03034M80260Q3371L9057N75233l39517K07734M41469l29126M20252
16801H134924L98291L5890J68365J69673M18654J02693M91272L253K96187K46497
16791A0465699M26642J53274J39393N02482O17640k40906O03441N45904J27641
16782A3341210L98487K45956K57089O19881O16647K81114M55779O49300O33817
16773A7499280Q29602L66569Q78006N43251R95371K86886J154972P14101P73925
16764B4041963P69316P84933J066746J217774R21522J227010J260565J573303
$$ y = [4613319, 4334173, 4637879, 4917209, 4518646, 4860795, 5162558, 5466140, 5071971, 5139747, 5367950, 5688906, 5672553, 5754333, 5989915, 5927015, 6174961, 6138768, 6035907, 6386984, 6659225, 6556191, 7036451, 7119822, 7158879, 7734112, 7394595, 7602329, 8043798, 7714672, 8134924, 8533215, 8569105, 8737470, 8907143, 9325797, 9428490, 9919762, 9923015, 10219202, 10465699, 10892341, 11045615, 11185008, 11687490, 12305130, 12064224, 12667665, 13213569, 13341210, 13739697, 13985653, 14242742, 14862623, 15479270, 15760384, 16216163, 16865463, 17499280, 18328882, 18695451, 19573457, 20116708, 21112079, 21398965, 22553937, 23268038, 24041963, 24811279, 25596212, 26662958, 27880732, 28802254, 30029264, 31289829, 32863132]
16756C2863132J174211J353441J485582J871682J823387J764193J924673K141401
16748D6401702K475937J942548K549017K698634K781372L154026L234418L160739
16740F8398393L962858L623858M346053M364596M323972M944604M897199N434436
16732A04295969N118516N676526O006549N728103N765883N956068N571033N130019
16724A49248666N274504M514086L710334L085862K381394J662590O40752l29205
16716A70188983r82455k532446k733599l743081m259033m819900n560682n242585
16708A40315202n832937n998771o101923n714353n827271n674837n169972n243375
16700I4751763m980715m837070m576278l698293m523031m045276l247200l085956
$$ y = [32863132, 34037343, 35390784, 36876366, 38748048, 40571435, 42335628, 44260301, 46401702, 48877639, 50820187, 53369204, 56067838, 58849210, 62003236, 65237654, 68398393, 72361251, 75985109, 80331162, 84695758, 89019730, 93964334, 98861533, 104295969, 109414485, 115091011, 121097560, 126825663, 132591546, 138547614, 144118647, 149248666, 154523170, 159037256, 162747590, 165833452, 168214846, 169877436, 170518188, 170188983, 169206528, 166674082, 163940483, 160197402, 155938369, 151118469, 145557787, 140315202, 134482265, 128483494, 122381571, 116667218, 110839947, 105165110, 99995138, 94751763, 89771048, 84933978, 80357700, 76659407, 72136376, 68091100, 64843900, 61757944]
16692F1757944l085967k804387l055014k699807k460037k497556j717602j829786
16684D1607788k029071j746434j901115j140357j596619j374126j181175j502714
16676B9136177r94795j282510j160380r48448j018449r36258p44677p40775o76751
16667B0633134n55932l81565q51572o96352r02804m80650m99989l14525r53256
16658A4996489k59949l42474O023q05119n04179m28802k55786j64207n04834k56320
16648A1480842j23377m28542j34263l73562k94982j79148l71850n11452j27026
16639H936640j50969l5746o8461n69931n3480j77984k07866j57961k66757p0406
16629G177079q144j82208j05106k79431j63327l45389K45186j60959j91687k28769
$$ y = [61757944, 58671977, 55867590, 52812576, 50112769, 47652732, 45155176, 43437574, 41607788, 39578717, 37832283, 35931168, 34790811, 33194192, 31820066, 30638891, 29136177, 28141382, 26858872, 25698492, 24750044, 23731595, 22795337, 22050660, 21309885, 20633134, 20077202, 19695637, 18844065, 18147713, 17244909, 16764259, 16264270, 15949745, 14996489, 14736540, 14394066, 14400089, 13594970, 13090791, 12661989, 12406203, 12241996, 11737162, 11480842, 11357465, 10928923, 10794660, 10421098, 10126116, 9946968, 9575118, 9063666, 8936640, 8785671, 8749925, 8681464, 8111533, 8058053, 7880069, 7672203, 7514242, 7247485, 7177079, 7168935, 6986727, 6881621, 6602190, 6438863, 6093474, 6338660, 6177701, 5986014, 5757245]
16619E757245n1537L8281l07084k9668k26744q1981K49362k82523L3809j49464
16609D949696l57029k7853j6564J6325k15183o6216R4005m20635J74673k95931
16599C835288N5780J55895k46247M7522L8689l33991j91773J37303l4807l11941
16589C151718r3494J57123P1127j74317Q0594J31227n04444J97598M50880o08757
16579B859255k04304j7186J29808M4619j11634K69291l92650Q0472n4380K2458
16569B625749j01898K05003j72489l61438K26234k28799O8523K75534k3446j9844
16559B493129l38802l77300L36957M4014j14105k26817K71692p8476j16506J61571
16549B055357k32321r9597K77320K55696p9099o27936L41629k5224Q5526k37236
$$ y = [5757245, 5705708, 5743989, 5436905, 5407237, 5180493, 5098512, 5347874, 5065351, 5099160, 4949696, 4592667, 4564814, 4548250, 4564575, 4349392, 4283176, 4377181, 3956546, 4131219, 3835288, 3891068, 4046963, 3800716, 3848238, 3886927, 3552936, 3361163, 3498466, 3463659, 3151718, 3058224, 3215347, 3286474, 3112157, 3192751, 3323978, 2819534, 3017132, 3468012, 2859255, 2654951, 2637765, 2767573, 2812192, 2700558, 2969849, 2577199, 2657671, 2603291, 2625749, 2523851, 2728854, 2556365, 2194927, 2421161, 2192362, 2260885, 2536419, 2512973, 2493129, 2154327, 1777027, 2113984, 2157998, 2043893, 1817076, 2088768, 2010292, 1893786, 2055357, 1823036, 1723439, 2000759, 2256455, 2177356, 1549420, 1891049, 1865825, 1951351, 1714115]
16539A714115M9206k8173L58601J9840n86060K8254P8855j89514j44311K70313
16529A571126k32063L1859J27498j9742k93839M15605p3759m1879j52383r2668
16519A239755q743K90005k11732l0411O0737k79701L62018k21281M0697l25562
16509I15782K33530q632J98027N1969l43917j51207K41126K33941l08237p7111
16499I85271Q4987J93418p7453j43660M77858l24216r0133N39004G94696N4417
16489H49113L54833l26690J04129J78344j03666r9958p5689N63457m95743N3094
16479A001224R747m3273r1023J14258j6446j94708M32195F02233K40600j25665
16469G17168J65084k17692K51571O0707l58341K10645J73922j62999K22476l24595
$$ y = [1714115, 1763321, 1735148, 2093749, 2113589, 1527529, 1555783, 1634638, 1445124, 1300813, 1571126, 1339063, 1370922, 1498420, 1478678, 1184839, 1600444, 1526685, 1484806, 1332423, 1239755, 1231012, 1521017, 1309285, 1278874, 1339611, 1059910, 1421928, 1200647, 1241344, 915782, 1149312, 1140680, 1338707, 1390676, 1046759, 895552, 1136678, 1370619, 1062382, 985271, 1070258, 1263676, 1186223, 1042563, 1520421, 1196205, 1106072, 1645076, 794696, 849113, 1203946, 877256, 981385, 1159729, 1056063, 956105, 880416, 1443873, 948130, 1001224, 1010971, 967698, 876675, 990933, 974487, 779779, 1211974, 602233, 842833, 717168, 882252, 664560, 916131, 976838, 618497, 829142, 1003064, 840065, 1062541, 737946]
16459G37946P9321q567o5631K01057J20494m6804j81626p5451o4521K15422r3195
16448H18445j04136o718K39286l81935J8713K55933L2615M9546j80483j63957
16438E77309J9206l424j78822N27788m50236P0028P0725J56509j95274j69125
16428D24684K29574J23436k02623L42342k59954k74917L82442m7871p1145j9589
16418F26379J11842P5441l03115K76466l09948j61672R9222L0934K80993p7274
16408F49268j19870K04365n2574K58626m19955K81547j58835r6972P067r0120
16398D62547J06863j48110J09880m2017k3043J59384j42135L56890n7025J81369
16388I64603D74954M8879J62409B43068J39768J54880k67162N4449J77723k02504
$$ y = [737946, 817267, 808700, 743069, 944126, 1064620, 1017816, 836190, 760739, 696218, 911640, 818445, 714309, 707591, 946877, 564942, 583655, 839588, 872203, 921749, 741266, 577309, 596515, 593091, 414269, 942057, 491821, 561849, 632574, 789083, 593809, 424684, 654258, 777694, 575071, 917413, 657459, 382542, 764984, 717113, 645968, 626379, 738221, 813662, 510547, 787013, 477065, 315393, 414615, 445549, 726542, 649268, 529398, 733763, 681189, 939815, 519860, 801407, 642572, 545600, 552667, 462547, 569410, 421300, 531180, 489163, 466120, 625504, 483369, 840259, 783234, 964603, 474954, 523833, 686242, 243068, 382836, 537716, 270554, 325003, 502726, 300222]
16378C00222J0133j29802K57746j51951R3422l4182j25434J04778A01340M60545
16368E61885k76914J2800q8754L39446j71468K1656J44221q0054a08910D79538
16357C11338R9286A74607M492L05451J89629j20714l6925l6469n6989J33735A25892
16345B16375K70782j99042p6097K34919A64096K15620j68133J59411K2735A28706
16334E33802Q3665k03647j18669J62943D0589L46132j28308m165j12306K69348
16324D11290I4760P4693f0326F41856k90975K09262A81386C6930K33183P2733
16314C42846Q5373q9685l4543R8426A16687J62219m4737K49244J18996l2363k60917
16303C09129J07311r0124J16953A30572K45874m3809K59616j09976j85572L3812
$$ y = [300222, 310355, 180553, 438299, 286348, 379770, 345588, 220154, 324932, 101340, 561885, 284971, 297771, 209017, 548463, 376995, 398651, 542872, 462818, -108910, 479538, 311338, 410624, 174607, 179099, 484550, 674179, 553465, 516540, 480071, 423082, 556817, 125892, 216375, 487157, 288115, 212018, 446937, 164096, 379716, 211583, 370994, 393729, 128706, 533802, 617467, 413820, 295151, 458094, 40589, 386721, 258413, 254248, 141942, 411290, 94760, 169453, -60326, 641856, 350881, 560143, 181386, 36930, 270113, 342846, 428219, 338534, 303991, 402417, 116687, 278906, 234169, 483413, 602409, 570046, 309129, 416440, 326316, 443269, 130572, 376446, 332637, 592253, 482277, 296705, 330517]
16293C30517j63194M5404O4551n8459L77917k40968K0907R0682k00212J36925
16283D04070j9625e060D48331J52220B35658K66311B46148D9210J05598c9464
16272C61827Q134A06696p738J93919O8425j14834J20869I9704J03610m2793K91295
16261D51816J2030r2115A40036J68229r9060a90660g4337n6796B02407R0008K75627
16250E68042A35275m5878M06925j96266A15134N9504A1537K36107o5486c7393
16239B17306J15224j18343E5900K45784K98634E3501R0363a15791a9394C75918
16228b7589C85077C9187M27179B18447q6347J31553a68185C74645p6424j18212
16218A80009J38089A27946K46248d8211I3124K857K93290A11276J14235J21794
$$ y = [330517, 167323, 212727, 277278, 218819, 596736, 355768, 376675, 467357, 267145, 404070, 384445, -5060, 448331, 600551, 235658, 501969, 246148, 49210, 154808, -39464, 361827, 369961, 106696, 98958, 292877, 361302, 246468, 367337, 99704, 203314, 160521, 451816, 463846, 371731, 140036, 308265, 209205, -190660, -74337, -131133, 202407, 292415, 568042, 135275, 89397, 496322, 300056, 115134, 174638, 11537, 247644, 182158, -37393, 217306, 332530, 214187, 55900, 301684, 600318, 53501, 143864, -115791, -19394, 375918, -27589, 385077, 39187, 466366, 218447, 132100, 263653, -168185, 374645, 298221, 180009, 318098, 127946, 374194, -48211, 93124, 95981, 389271, 111276, 225511, 347305]
16208C47305J3479A65234D4863L16029f3138l4930G5946J48523b40391B87770
16197I8863A9156J09159l7538l6926M7568K26624b40811a05577N1754o9812A3981
16185B12446K37780h5156J4393F01612A05756D4745J08750a5554l0820D88520
16174A02123J24725K40494a7233C0020O9208J53536H949h285j8884F2777k9670
16163C3107J02052i1774j8568b7598j818C16108b09854B26525M0580E8133O9536
16152A27669C4617a36156C01299G5321O7751J17659H755K62547h8846A93339O0838
16141B54177H8434O6857J87733e5544A25748a71823D2314O3766A6633L11593m5902
16130B82324a40613C21802A31295C2471K7158M790h9760A49983a57933B07794
$$ y = [347305, 360784, 165234, 44863, 360892, -63138, -98068, 75946, 224469, -240391, 287770, 98863, 19156, 128315, 90777, 53851, 101419, 328043, -240811, -105577, -53823, -123635, 13981, 212446, 450226, -85156, -70763, 601612, 105756, 44745, 153495, -15554, -46374, 488520, 102123, 226848, 467342, -17233, 30020, 99228, 252764, 8949, -8285, -27169, 62777, 33107, 135159, -91774, -110342, -27598, -29416, 316108, -209854, 226525, 267105, 58133, 127669, 34617, -136156, 301299, 75321, 143072, 260731, 8755, 271302, -88846, 193339, 254177, 88434, 155291, 343024, -55544, 125748, -171823, 42314, 106080, 16633, 328226, 282324, -140613, 321802, 131295, 32471, 59629, 64419, -89760, 149983, -157933, 207794]
16119h934E0277J52564E3581c6714D8958J34893F6569d7436G1356J03243A5562
16107C5408h4754I3657d5306E10116A34685J09033c9370A34587N3694J80361j46264
16096B22378o7210c2398C38364L7823c67002C04485j48731i205A37532J55456
16086B92988e8181B90791d08595f9470C64183I955h1644A10360a0521j35215D1591
16074B38566B2389J47506a45052l2523D41619d2475d499k20983i6247F7837g9259
16062a01888B39757p6310a2390A39835e2522C60676i3473d1985r8099E03474a04937
16050d0747G8464R8326E2490c22948F7700J38396R3783A11797g4562j28424H2185
16038A65605b42051A00404k7958a5901j67167D6595J69716a13856m4543g8244
$$ y = [-8934, 50277, 202841, 53581, -36714, 48958, 183851, 66569, -47436, 71356, 174599, 15562, 35408, -84754, 93657, -45306, 510116, 134685, 243718, -39370, 134587, 188281, 368642, 222378, 155168, -32398, 338364, 376187, -367002, 304485, 155754, -9205, 137532, 292988, -58181, 290791, -408595, -69470, 364183, 9955, -81644, 110360, -10521, -145736, 41591, 238566, 22389, 169895, -145052, -177575, 441619, -42475, -4499, -225482, -96247, 67837, -79259, -101888, 239757, 163447, -12390, 139835, -52522, 360676, -93473, -41985, -140084, 503474, -104937, -40747, 78464, 176790, 52490, -322948, 67700, 206096, 299879, 111797, -74562, -202986, 82185, 165605, -242051, 100404, 72446, -15901, -183068, 46595, 216311, -113856, -158399, -78244]
16027A88588a84200E7728b71853P3655g7909B57398a34699r0340B71306o9652
16017B01654b39576B34453P247E2038a22544B7205E609K8483d0197A29969J49145
16006B79114a99012C8924h4875D6103i3532I2081k2126h3760A31395a9786m37543
15995d57329A30431G616e4439A34601O7603a34431A12689L22700E5098B7113a90222
15983D19477j01654e4316a5021f19B88219B6138J40863k002J20876C0364b44477
15971A41008b09496P785A62796b53409G7856R4700B6876L34874G8106a26673M1136
15960h5537K5334K8924I0053C5928a02871J1182G9515J8796i9194c8983k19013
15949b57996C6190c39582A54508l4472a83741N751j90624A43612B1406J60433
$$ y = [188588, -184200, 57728, -271853, -198198, -77909, 257398, -134699, -225039, 271306, 201654, -239576, 234453, 241700, 52038, -122544, 27205, 5609, 34092, -40197, 129969, 279114, -199012, 38924, -84875, 46103, -93532, 92081, 69955, -83760, 131395, -19786, -457329, 130431, 7616, -54439, 134601, 202204, -134431, 112689, 435389, 55098, 27113, -190222, 419477, 317823, -54316, -15021, -619, 288219, 26138, 167001, 164999, 285875, 30364, -244477, 141008, -209496, -201711, 162796, -253409, 77856, 172556, 26876, 361750, 78106, -126673, -85537, -60203, -31279, 90053, 35928, -102871, -91689, 79515, 98311, -99194, -38983, -257996, 36190, -339582, 154508, 120036, -183741, -177990, -368614, 143612, 21406, 181839]
15939A81839G1321L5226M0671c0730C00226c063k63571f1865j5161A2799J8359
15928C1158b15508a7911k15572b8383k44616C191J65053f433D1202b6745n6740
15917h3485j44955A98689G1048d997H7677a561B42601C0091J53875o7822b27953
15905d2650b0003A87062b8798o6590A08J52674e8129E6038b27362K975D5378N7563
15893A02941g9910j35048C2400d2556J3206m9490B18447k6550j5377H1973J52195
15882B34168I6495b43943i3989l49532f9426A05090c11529g0638m2083A62464
15871c8089I6819f3418j93093q4107R0943C74221a37135C98516A46875n5822H285
15859A25752D5273c28196O6659f6322j69217c7027b285M36j09439k7945J1851
$$ y = [181839, 71321, 106547, 147218, -30730, 300226, -3063, -266634, -61865, -77026, 12799, 31158, -215508, -17911, -233483, -28383, -272999, 3191, 168244, -6433, 41202, -26745, -83485, -228440, 198689, 71048, -4997, 87677, -1561, 242601, 30091, 183966, 116144, -227953, -42650, -20003, 187062, -28798, -95388, 108, 152782, -58129, 56038, -227362, -224387, 45378, 102941, -79910, -214958, 32400, -42556, -29350, -78840, 218447, 191897, 176520, 81973, 234168, 96495, -243943, -93989, -443521, -69426, 105090, -311529, -70638, -112721, 162464, -38089, 96819, -63418, -256511, -340618, -249675, 374221, -137135, 398516, 146875, 91053, 8285, 125752, 45273, -328196, -261537, -66322, -235539, -37027, -2285, -1849, -111288, -139233, -127382]
15848a27382e4832B78901c74967g2711J128j27314a0150A43696k9000d1055k96345
15837c37400C0146e8584A14060L120E350c49583C2539e0161A70430a17904q5698
15826b03602a9651A06173A8369J87156c42356c1578H8407J4176B546b53040J10341
15815a42699A04118J52630a92880j3812A72437a59289N3176p2700A52045E5340
15804b31141b7503k33601P722A17791k6661f86056D9328c02609a16569D9945L95984
15793D45929H4766b1959G7478I931b02801r0619A23879J38532e9429j53773O7897
15782a45305c1748A00928J8668C683L8047b9546B41425a02149E8203l215k1650
15771C3338a9271k25274G5051J09498b18774A97139n2618J8700a53575j2249D0374
$$ y = [-127382, -54832, 278901, -374967, -72711, -71583, -198897, -10150, 143696, 114696, -41055, -337400, 30146, -58584, 114060, 117180, 5350, -349583, 32539, -50161, 170430, -117904, -203602, -19651, 106173, 18369, 205525, -342356, -31578, 88407, 102583, 2546, -253040, -142699, 104118, 256748, -192880, -206692, 172437, -159289, -106113, -178813, 152045, 55340, -231141, -27503, -261104, -253382, 117791, 91130, -686056, 49328, -302609, -116569, 49945, 445929, 84766, -21959, 77478, 9931, -202801, -293420, 123879, 262411, -59429, -213202, -145305, -31748, 100928, 119596, 3683, 41730, -29546, 241425, -102149, 58203, 54988, 33338, -19271, -244545, 75051, 184549, -218774, 197139, 144521, 163221, -153575, -165824, 40374]
15759a18470A39238b12892d8510D36572a49861j97544d7233j73597b5398q8198
15749a13596F2184J16092a6948o2222A42416c08168C82652b28305P057A06497
15738b55612k4965b6642D9165c233j11519j74022d9481o4217j93395a46582E4280
15726a48542p5866f6830A57489a90929H1971b45249G9217a57274G8285a76472
15715A09066D4327J87171r1508b17298H3286J03378h0619C13182a86212j00779
15705b86991C24762j42980q2867b61264r0887a75584A52611a30716e5372r7312
15695a52684Q292l0605o0363A98075h2115B5940d4252E0916a83331B18938e6065
15683e2352A04516f0133F9659a49916C1325c12450E6525b58960a07361l5849G5053
$$ y = [-118470, 139238, -212892, -48510, 436572, -149861, -347405, -47233, -220830, -25398, -113596, 62184, 178276, -16948, -79170, 142416, -308168, 382652, -228305, -221248, 106497, -255612, -280577, -26642, 49165, -3233, -114752, -288774, -49481, -113698, -307093, -146582, 54280, -148542, -224408, -66830, 157489, -190929, 81971, -245249, 79217, -157274, 78285, -176472, 109066, 44327, 231498, 139990, -217298, 83286, 186664, -80619, 313182, -186212, -286991, 324762, 181782, 98915, -261264, -352151, -175584, 152611, -130716, -55372, -152684, -144392, -174997, -235360, 198075, -82115, 25940, -44252, 50916, -183331, 218938, -56065, -52352, 104516, -60133, 69659, -149916, 31325, -312450, 56525, -258960, -107361, -143210, 75053]
15671A72341a08648B1058i6606C17456a96378A0167J17836D8838a58739J6403
15661a42336H8498a65339k7288J0060k4665b2963k17215A66571k7774J99020m9187
15650B88630b65197F0535a54844g2537m5268B10013B819K29441B5782a64711B86526
15638b28314A31998O9061F0248L30386j89371d3930I3132J68556K71613a22822
15627B25579b87829A24077a34973l39269A48822J6956b24130B1227a12151h654
15616g2189A85886H6009c2135D7923c33730F1462b22279A34031a22150B33398
15605a0289B17191c37317B317h3817c6909k64063a30223n0919O7625R031A00759
15593A89301c44620A15769d9434m568C74568f1914A92935G42J76478E2156j5042
$$ y = [172341, -108648, 21058, -96606, 317456, -196378, 10167, 128003, 48838, -158739, -142336, 88498, -165339, -192627, -182567, -207232, -22963, -240178, 166571, 138797, 337817, 288630, -265197, 60535, -154844, -72537, -117805, 210013, 2819, 232260, 25782, -164711, 286526, -228314, 131998, 201059, 60248, 390634, 201263, -43930, 93132, 261688, 533301, -122822, 225579, -287829, 124077, -134973, -474242, 148822, 165778, -224130, 21227, -112151, -8654, -72189, 185886, 86009, -32135, 47923, -333730, 61462, -222279, 134031, -122150, 233398, -10289, 217191, -337317, 2317, -83817, -36909, -300972, -130223, -181142, -113517, -104486, 100759, 189301, -344620, 115769, -49434, -54002, 374568, -61914, 192935, 742, 177220, 52156, 37114]
15582C7114e2026b0350k0746j34086D17207j56444a59050L4377K4441l14936B67853
15570I6044R9529A4491N4710a05330C8219a55793C2873J52459g3931a5896E5672
15558C01198g6527j4827m1176b1060o8977A36648B386J08030b99632g6399K5615
15547e0784B66861b60057a5657D1682b39906I9503j0881K41709A18860a37288
15536c76761B67339a45252O2841j8195j52142A33403l0667b73164I1939a11807
15525H2715a07758m008B82587m0457c211H2798c6299m642H1314a14871A32550
15513b24869A96427A100J0116C803K11601b70720M9667O8091A19423J86649b0234
15501H3653i7449A62307L105L88b24274N7250k03029A3844J49166c68109A00157
$$ y = [37114, -52026, -20350, -41096, -175182, 417207, 260763, -159050, -124673, -100232, -415168, 267853, 96044, 195573, 14491, 69201, -105330, 38219, -155793, 32873, 185332, -73931, -15896, 55672, 301198, -76527, -91354, -132530, -21060, -90037, 136648, 2386, 110416, -299632, -76399, -50784, 266861, -260057, -15657, 41682, -239906, 99503, 88622, 330331, 118860, -137288, -376761, 267339, -145252, -82411, -100606, -252748, 133403, 102736, -273164, 91939, -111807, 82715, -107758, -111766, 282587, 242130, -3211, 82798, -36299, -40941, 81314, -114871, 132550, -224869, 196427, 1100, 11216, 3803, 215404, -270720, -221053, -152962, 119423, 306072, -20234, 83653, -97449, 162307, 165412, 165800, -224274, -167024, -370053, 13844, 163010, -368109, 100157]
15489A21200a49583b2815A23403D22e6245q1306c0549D0568J72506J0405k4529
15478A98950a36986K740e9666B29349c4368k4177k28019F0200c074A22279i3305
15466A191K15658C1988i5934j5562B31863J33013G6014J4850B6553L79509j95287
15455B10775a61227A49168J30695a02336j2827J4383B88516a14704B27522h8111
15444B31026O7810J3976c09833a10273E7662a96745H3817J06117P8735a28734
15433B23786a60747D6780J12842k7069b70717E8069h3375a5571F1951b52766D93945
15421e6445F4682h4064M1110k08823J7746C3265K2512P4065D5038d01377J73169
15410b28208A81831a50346C61294G7529a09225A66123a01168K8906E1974O961
$$ y = [121200, -149583, -22815, 123403, 422, -56245, -137551, -30549, 40568, 213074, 223479, 198950, -136986, -134246, -59666, 229349, -34368, -58545, -286564, 60200, -3074, 122279, -93305, 1191, 216849, 31988, -95934, -111496, 231863, 364876, 76014, 90864, 26553, 406062, 210775, -161227, 149168, 279863, -102336, -115163, -100780, 288516, -114704, 227522, -88111, 231026, 298836, 312812, -309833, -110273, 57662, -196745, 83817, 189934, 268669, -128734, 223786, -160747, 46780, 159622, 132553, -270717, 58069, -83375, -15571, 61951, -252766, 493945, -56445, 64682, -84064, -42954, -251777, -234031, 33265, 55777, 129842, 45038, -401377, -228208, 181831, -150346, 361294, 77529, -109225, 166123, -101168, -72262, 51974, 58935]
15400E8935f373A67365N0479J6883D4050A788J28270a12875A76953a92053j0026
15389b02079A9391N3681a25967d8303k4261I7961b50909A29880M512m5570b54714
15377e3632k52993J14747A4709g1796j70976C04597A10199P9512J65529m9341
15367C05899g3456C4509a02541H7860P0018i0941j32263C74941d3479l75607B84153
15355d5024e899A11046h8634C3742b9415A34171k3038K72665E8094a80778A30392
15343b53358G5379e2462q6499B33589n5694A7240b96434C15156f352G764c4782
15331D4494a75317c2193J4000A97163b35682O7689A49049C540K62954b11911A1207
15319C20612C6601J85927D7557R2744b18903F6896l1307a94056B12806R8283c6590
$$ y = [58935, -6373, 167365, 217844, 234727, 44050, 1788, 130058, -112875, 176953, -192053, -202079, 19391, 73072, -125967, -48303, -72564, 97961, -250909, 129880, 134392, 88822, -254714, -53632, -306625, -191878, 14709, -71796, -242772, 304597, 110199, 189711, 355240, 305899, -73456, 34509, -102541, 87860, 157878, -90941, -223204, 374941, -43479, -419086, 284153, -45024, -5899, 111046, -88634, 33742, -29415, 134171, 111133, 383798, 58094, -180778, 130392, -253358, 75379, -52462, -138961, 233589, 177895, 17240, -296434, 315156, -6352, 7764, -34782, 44494, -175317, -32193, -18193, 197163, -235682, -167993, 149049, 3540, 266494, -211911, 11207, 320612, 36601, 222528, 47557, 140301, -218903, 66896, 35589, -194056, 212806, 311089, -36590]
15307i7664p4832A76648m6987i9565j04584r2352A04476a4407q1914H561a82710
15295a97450a8840j70825A24494A2251E167L05672L5152c25015A51261F7777j5120
15284E2657d2506B41820a38433j8461L8202L9440A24782r607P5392a72594A96361
15272B09150J7357F1401k643a64615E4218J20182K9978M751c452j8558p9894H1612
15259a56286B29912d9999b3762c079B72941N2772e8118C1236M260K80875c9277
15247C92190A6523b04673A15743b54072A43133a86028n4628C2202i7685E355J70489
15236A75844F0473b23053C74630a18150l9489A79931N1814b64723g0115A29533
15225b51037L3813d3237M319B2489J8399L87180F9693A6437h2829D04644j53143
$$ y = [-97664, -172496, 176648, 129661, -99565, -204149, -296501, 104476, -14407, -96321, 8561, -182710, -197450, -18840, -189665, 124494, 12251, 5167, 310839, 345991, -325015, 151261, 67777, 52657, -42506, 241820, -138433, -156894, -118692, -79252, 124782, 115175, 190567, -172594, 196361, 209150, 226507, 61401, 58758, -164615, 54218, 174400, 204378, 209129, -3452, -22010, -101904, 81612, -156286, 229912, -49999, -23762, -3079, 272941, 325713, -58118, 31236, 35496, 316371, -39277, 392190, 16523, -204673, 115743, -254072, 143133, -186028, -240656, 32202, -97685, 5355, 175844, 60473, -223053, 374630, -118150, -157639, 179931, 231745, -264723, -70115, 129533, -251037, -217224, -43237, -38918, 22489, 40888, 428068, 69693, 16437, -82829, 404644, 251501]
15214B51501H1922L8999J07468h0953A80919M6047b01874A94367p1740a34000
15203D92000j68901c3640F5644B9398L5604O7493K03296c35527e9236A79892o333
15192A73559a80244G6717J66561a16140L4215l3440B44926A17510m5600J82885
15182B54795a35529A85874J1305C6554c3165A57303g8661A4833L0129Q0262c024
15170a26245B9887J11727a19583J796B75297b70810e1654A65272C9628h4375B5975
15158D52823d4281C18178g3310A70900F3716d9704A25766J62630F7799A1478J40174
15147A51652J65416q4271c1846E0141a79472A6291J7264K61628a41087B48907
15136a26550a9709E29811a07088n6777B72314A10590K49640c6875E06549C9896
$$ y = [251501, 81922, 120921, 228389, -80953, 180919, 226966, -201874, 194367, 122627, -134000, 492000, 323099, -33640, 65644, 29398, 65002, 132495, 335791, -335527, -59236, 179892, 173559, -180244, 76717, 243278, -116140, -81925, -115365, 244926, 117510, 71910, 254795, -135529, 185874, 197179, 36554, -33165, 157303, -78661, 14833, 44962, 125224, -3024, -126245, 29887, 141614, -119583, -117787, 275297, -270810, -51654, 165272, 39628, -84375, 25975, 452823, -44281, 318178, -73310, 170900, 63716, -49704, 125766, 288396, 67799, 11478, 151652, 317068, 232797, -31846, 50141, -179472, 16291, 33555, 295183, -141087, 248907, -126550, -19709, 529811, -107088, -163865, 272314, 110590, 360230, -36875, 506549, 39896]
15125B5530d8560C0796J42538m5902J13401p6915J6247N2700C7893e160m4391
15114d9551H1409K87909b6452j12896q2494F7433a43406B14263g8937A00702L83081
15103D83783D2845p655J22624m7359K34369A69132J60500A05201a38207A28738
15092A29682K69116j03854q6182a03612d3939A19166l8063J78412b70895A50343
15081A41313M7405B2740J37903K75134F4659K41400j37751J23733p0610l2869
15071A88562o5318K6427J0273A2170K72588a8292G2800L23744a37928A54376C3698
15059B07430J39547m9784a98877H1167a13530B27333H5481d2657C13377A49892
15048C58733j02551j22623K923a89231L6410K0765b68B60097j12108j2949Q8818
$$ y = [25530, -48560, 30796, 173334, 127432, 240833, 163918, 180165, 232865, 37893, -5160, -49551, 81409, 369318, -26452, -139348, -221842, 67433, -143406, 214263, -78937, 100702, 483783, 42845, 35190, 157814, 110455, 344824, 169132, 329632, 105201, -138207, 128738, 129682, 398798, 294944, 208762, -103612, -43939, 119166, 81103, 259515, -270895, 150343, 141313, 188718, 22740, 160643, 435777, 64659, 306059, 168308, 292041, 221431, 188562, 123244, 149671, 159944, 12170, 284758, -18292, 72800, 396544, -137928, 154376, 33698, 207430, 346977, 297193, -198877, 81167, -113530, 227333, 85481, -42657, 313377, 149892, 358733, 256182, 133559, 136482, -189231, -152821, -132056, -268, 260097, 147989, 135040, 223858]
15037B23858O8379F5097L8020J78548j22043j9079K28370A48797M0034O796J86496
15026C82123A54277a0553k0053A57738G2305J72573m7253N7178d3920A40792L74115
15015E14907j37905J09693A59586m0671J56424K24953C6198f1729A82229l1992
15005A50237E1118J56418p1894c8432j26806A78732j9623n0235K03549i4808L5636
14994e9172j944G51223A64391a00723F8025C172K1362R9712O9940a27908m521
14983a32429F1087K02809g6428I2976J78373N9833j13942K8204K41840H8252J70740
14972B58992K50761q6439A50402J05077a12672D26801A62892o9764K07099f3279
14961B50519D0856K13272J51698j98719P7457A05291D9617N9948R1210J57507
$$ y = [223858, 292237, 65097, 103117, 281665, 159622, 140543, 368913, 148797, 188831, 195627, 382123, 154277, -10553, -30606, 157738, 72305, 244878, 197625, 254803, -43920, 140792, 514907, 377002, 486695, 159586, 118915, 275339, 500292, 36198, -61729, 182229, 150237, 51118, 207536, 135642, -38432, -165238, 178732, 159109, 108874, 312423, -94808, -59172, -61116, 751223, 164391, -100723, 68025, 3172, 24534, 124246, 194186, -127908, -132429, 61087, 263896, -76428, 92976, 271349, 331182, 217240, 245444, 487284, 88252, 258992, 509753, 423314, 150402, 255479, -112672, 426801, 162892, 93128, 300227, -63279, 250519, 40856, 254128, 405826, 207107, 284564, 105291, 49617, 109565, 200775, 358282]
14951C58282j3484m5455A46663a0793C25184A27571M19301I8644M2607Q2024L76755
14940F00030j78007k09697I8804g7914C99323A09588K1516J47713A01474K4821
14930A26295J44027J00480A31934L95843c19847A46481K79102r6484a45403A25917
14919D30386j47338J10458A08058K9150L43306j28797l9446j9277l148A03117
14908E98588A31873K77603j16981K90298A27099L8404R0379j0885q428L5085k4926
14897B46728k0121J33709j17019l4024J93250j74471o1486J62083L28269j64495
14887D92423k14572k982p2827r2209R5093J69579L4485j18947M67962B75969M5851
14876C21820K2528K66073O8944B52822G9049K41711m7618k0637J75077N2698B21245
$$ y = [358282, 344798, 299343, 146663, -10793, 325184, 127571, 546872, 98644, 141251, 223275, 600030, 422023, 212326, 98804, -77914, 399323, 109588, 131104, 278817, 101474, 126295, 270322, 370802, 131934, 527777, -319847, 146481, 425583, 329099, -145403, 125917, 430386, 283048, 393506, 108058, 137208, 480514, 351717, 312271, 292994, 289846, 103117, 598588, 131873, 409476, 292495, 582793, 127099, 165503, 255882, 244997, 236569, 271654, 246728, 226607, 360316, 243297, 209273, 402523, 228052, 166566, 328649, 656918, 492423, 277851, 274869, 202042, 109833, 204926, 374505, 408990, 290043, 758005, 275969, 321820, 344348, 610421, 679365, 252822, 79049, 320760, 273142, 252505, 427582, 480280, 221245]
14864D68436A50656j2601R9047J41919J51787F4525K46241J56289G1541N26699
14854E98240B61932J28292R1545j08126J53550A79285M38703D6495L21898n7019
14844C11374M57268B77313N3504A334P46591C66083k6058G7070L18548j53200
14834B42418R113J81688m563K49031l38566K11813O1102D8326Q77638m50977J449
14823D76436N2393j81287O4403J72054e1742C26146N9830Q0257J91424l12906
14813C44751J18883J91956B84530K50911k1640j66412N1452l1032K53894k98538
14803C23165J86555j78147n4800J01816j34144J67126K70319j45307k08977J74757
14793E02363N5610j6666J10904j16858j46262J16537Q0519J38125n2748j96380
$$ y = [468436, 150656, 138055, 237102, 379021, 530808, 64525, 310766, 467055, 71541, 598240, 261932, 390224, 481769, 373643, 527193, 179285, 617988, 46495, 368393, 311374, 768642, 277313, 330817, 1334, 747925, 366083, 340025, 77070, 395618, 242418, 251531, 433219, 428656, 677687, 339121, 550934, 612036, 48326, 925964, 474987, 476436, 528829, 347542, 411945, 583999, -51742, 326146, 385976, 466233, 657657, 344751, 463634, 655590, 284530, 535441, 513801, 347389, 398841, 367809, 621703, 323165, 509720, 331573, 276773, 378589, 244445, 411571, 681890, 536583, 327606, 502363, 557973, 541307, 652211, 535353, 389091, 505628, 586147, 724272, 671524, 475144]
14783D75144Q4121B63016K63467J86620j73680j72725m2378R9485L27700L884
14773G55389C73271N5214J87125k1340j05864O6485q63j96854J81380A40200N62515
14762G02715j52879r0371J90333j80115K41220k70165K04940J34647r5062K97924
14752I83187B73842M54562j39455J19437j68123k40659K82301k26903J82926L84303
14742I22231k62183L2518A68146N89852j94275J30606j08771L32218l48956L04296
14732H73116B76327L69493R0491J04649r8139j74782L7127k04165K78351P6901
14722G56253l6928k9568K908o2897j08408J94860J69291R6749l19145J24262k70802
14711E16575J26047m5703j4216O7299k8048J5990L76792L292k3309l83706J93624
$$ y = [475144, 559265, 263016, 526483, 713103, 539423, 366698, 324320, 423805, 751505, 755389, 373271, 428485, 615610, 594270, 488406, 554891, 554028, 357174, 538554, 140200, 702715, 549836, 459465, 649798, 469683, 710903, 440738, 645678, 780325, 685263, 983187, 273842, 728404, 588949, 708386, 540263, 299604, 581905, 355002, 537928, 922231, 660048, 692566, 168146, 757998, 563723, 694329, 585558, 917776, 568820, 873116, 276327, 645820, 736311, 840960, 742821, 568039, 605166, 401001, 679352, 756253, 719325, 689757, 692665, 629768, 521360, 716220, 885511, 982260, 663115, 787377, 516575, 642622, 596919, 582703, 650002, 621954, 637944, 1014736, 1018028, 994719, 611013, 804637]
14700H04637j80593Q7850k2505K42489j95759M62515n37023M74210L1204l19389
14690H47636j06748R0373K45182r6570J15637k30598j43829K64423n0884J57759
14680A092381n1240j12369J39138m1777j70349o3796j10264J44022K12470J7857
14670A056073k39208j73923L62888p1185k14232P2714J45176P3836j25334K05582
14660A092387l23717K06135J73558j21311p8442K99138l33102n8448K25531O8956
14650A150685j45904q9219J49940n4775P8496K71686O2975r3694k6872m19304
14640H84014J67164J49588K19540N8930o10543L4359O96579q4495k59467J00616
14630A356285j75366j26525J33667L19425l8638l91601k1628J55957j858K65375
$$ y = [804637, 624044, 711894, 689389, 931878, 736119, 1198634, 661611, 1135821, 1167025, 847636, 740888, 831261, 1076443, 979873, 1095510, 864912, 721083, 985506, 934622, 1092381, 1041141, 928772, 1067910, 1026133, 855784, 791988, 681724, 825746, 1038216, 1056073, 816865, 642942, 1005830, 934645, 720413, 793127, 938303, 1012139, 886805, 1092387, 768670, 974805, 1148363, 1027052, 948610, 1247748, 914646, 856198, 1081729, 1150685, 1004781, 915562, 1065502, 1010727, 1089223, 1360909, 1423884, 1330190, 1303318, 884014, 1051178, 1200766, 1420306, 1479236, 868693, 903052, 1599631, 1515136, 1255669, 1356285, 1180919, 1054394, 1188061, 1507486, 1468848, 1077247, 1055619, 1211576, 1209718, 1475093]
14620A475093k00135L4820J82483k11356M31231j32195l80456L94088j48913J02979
14610A547639j37935m7511M07285l27041O6161r9003L5705L14319l54811J68380
14600A573188k22669K62064J24444l85890M03957l4684l35078L84778J18150q1805
14590A806455k60614J20197j81716J4408L84148N4806J29861l95690J28073k4635
14580A775293K51648k56312K8228j7667J90726K0801l2665L3746L5942K04082
14570B233822p2056K29628l70886K50988M4538K6615P4990k94927K71001K75315
14560B669028j51009L77460J75141J2891L00254j11779K1159j90600N58952J221832
14550D883329Q78178J919920M251717R678734J4299520J621286j8437012H670968
$$ y = [1475093, 1274958, 1309778, 1492261, 1280905, 1712136, 1579941, 1199485, 1593573, 1444660, 1547639, 1409704, 1362193, 1769478, 1442437, 1508598, 1409595, 1445300, 1759619, 1404808, 1573188, 1350519, 1612583, 1737027, 1351137, 1755094, 1720410, 1385332, 1770110, 1888260, 1806455, 1545841, 1666038, 1484322, 1498730, 1882878, 1937684, 2067545, 1671855, 1799928, 1775293, 2026941, 1770629, 1798857, 1781190, 1971916, 1992717, 1960052, 1993798, 2029740, 2233822, 2161766, 2391394, 2020508, 2271496, 2316034, 2342649, 2417639, 2122712, 2393713, 2669028, 2518019, 2895479, 3070620, 3083511, 3383765, 3271986, 3293145, 3102545, 3661497, 4883329, 5761507, 7681427, 11933144, 21611878, 35911398, 37532684, 19095672, 8670968]
14541E048061j651954m35457m09355n49942L45911l42555n4615k29860K23311
14532A943545J09656L2955K21517k69767J16706J21486j46198N4054K4467N16452
14522B724873k42496k77454J38917J36069K48281r9548k10981k67418N12524j97223
14512B465544M53180k53471r4002M53756j64086k6975Q262j62595K55577j79082
14502B756108L72801L5448j05649K79162n78582K48177K48984j07898L49799o5080
14492C433270J79519k22300j68458J46194m972L71866k86746j61932O39629q3177
14482C842893m60744L76333k42209K51683K90435k64327L35793j01011k26948
14473C801898J94317J14701N721K01793n939k68960K79462l40055K92725J67118
$$ y = [5048061, 3396107, 2960650, 2551295, 2001353, 2347264, 2004709, 1950094, 1720234, 1943545, 2053201, 2086156, 2307673, 2037906, 2154612, 2276098, 2129900, 2183954, 2208421, 2724873, 2482377, 2204923, 2343840, 2479909, 2728190, 2628642, 2417661, 2150243, 2662767, 2465544, 2918724, 2665253, 2571251, 3025007, 2860921, 2833946, 2842208, 2679613, 2935190, 2756108, 3128909, 3164357, 3058708, 3337870, 2759288, 3007465, 3256449, 3148551, 3498350, 3433270, 3612789, 3390489, 3222031, 3368225, 3363253, 3735119, 3448373, 3286441, 3926070, 3842893, 3382149, 3758482, 3516273, 3767956, 4058391, 3794064, 4129857, 4028846, 3801898, 3996215, 4110916, 4116637, 4318430, 4312491, 4043531, 4322993, 3982938, 4275663, 4442781]
14463D442781L6276K79394j43286k2273N0966Q9593P8857L16042l7162j3571N1469
14452E129086m705k58686M44903k51784M44519L727j44387M78389j78322o3473
14442E599267L24170Q8900j38380L95091j40842L9776Q0820k4950K49940J95214
14432F669006q4683j7215N62584n23781M78552J5494L4058m8863L45673M8753
14422G479578m7498J03789L75373R3177j89078L57474N6812J67083J35854J53266
14412H685830L96425j23191R1048J67706J18864q6926Q1608N93700k0595J38728
14402A0043197j54025O02469m86725J64128N79662K50911K46301j75944K76930
14393A1346904M28010J77403R1577M01185r048j80902P79001J21832q2090N59717
$$ y = [4442781, 4479057, 4758451, 4615165, 4592892, 4643858, 4733451, 4812308, 5128350, 5091188, 5077617, 5129086, 5124381, 4865695, 5310598, 5058814, 5503333, 5507060, 5362673, 5841062, 5662740, 5599267, 5923437, 6012337, 5873957, 6269048, 6128206, 6167982, 6248802, 6223852, 6473792, 6669006, 6584323, 6567108, 7129692, 6605911, 7084463, 7099957, 7134015, 7085152, 7430825, 7479578, 7432080, 7535869, 7911242, 8004419, 7815341, 8172815, 8229627, 8396710, 8532564, 8685830, 9082255, 8959064, 9050112, 9217818, 9336682, 9249756, 9331364, 9925064, 9904469, 10043197, 9889172, 10491641, 10004916, 10169044, 10748706, 10999617, 11245918, 11069974, 11346904, 11774914, 11952317, 12043894, 12445079, 12436031, 12255129, 13034130, 13155962, 13073872, 13633589]
14383A3633589O7266R7683M42259K89562K51116L65194J05132N38155m343N87702
14373A6373315P99383l02165K71319N34531q7451Q69294J39939L52641N49556
14364A9500362M29311M54543M90792N50090L27554K24478P82112M02207L64323
14355B3525772O18098P05961O60871O02417J71758R31849O32079O02132Q66188
14346B9317125O77988P15216J073703P33041O71875J209171O99661R42854J130063
14337C7170697J171720J211158O17782J173182J189229J341174J356578J541263
14329D6772783J635062J401021J655793J258095K029704K078696J733549K017732
14321F0582435J659474K770843J852678K462226K344681K559679K905382L101975
$$ y = [13633589, 13700855, 13798538, 14240797, 14530359, 14781475, 15146669, 15251801, 15789956, 15785613, 16373315, 17172698, 16870533, 17141852, 17676383, 17588932, 18458226, 18598165, 18950806, 19500362, 19929673, 20384216, 20875008, 21425098, 21752652, 21977130, 22759242, 23161449, 23525772, 24143870, 24849831, 25510702, 26113119, 26284877, 27216726, 27848805, 28450937, 29317125, 29995113, 30710329, 31784032, 32517073, 33188948, 34398119, 35097780, 36040634, 37170697, 38342417, 39553575, 40171357, 41344539, 42533768, 43874942, 45231520, 46772783, 48407845, 49808866, 51464659, 52722754, 54752458, 56831154, 58564703, 60582435, 62241909, 65012752, 66865430, 69327656, 71672337, 74232016, 77137398, 80239373]
14313H0239373L377197K891423L614951L679854L568252M186009M507568M028429
14305A10093056M940702M924493N302828N633732N772087O606210O657600P350742
14297A57281450P261880P832289Q441034Q727664R721030R869830J0212176J0877181
14289B30224534J1584489J2140543J2657577J2799878J3482319J3973685J3727559
14282C20590584J4677848J4350461J4879315J3821726J4092319J3071073J2212483
14275D17695809J1080582R160705O141957K471437j357540j06040j001258j697300
14267D42388352m731814n814654p365993q465769j0740618j1831333j3231228
14260C80206943j4334248j4820671j5119060j5141737j4950122j4129260j4401298
$$ y = [80239373, 83616570, 86507993, 90122944, 93802798, 97371050, 101557059, 106064627, 110093056, 115033758, 119958251, 125261079, 130894811, 136666898, 143273108, 149930708, 157281450, 164543330, 172375619, 180816653, 189544317, 199265347, 209135177, 219347353, 230224534, 241809023, 253949566, 266607143, 279407021, 292889340, 306863025, 320590584, 335268432, 349618893, 364498208, 378319934, 392412253, 405483326, 417695809, 428776391, 437937096, 444079053, 446550490, 445192950, 445086910, 444085652, 442388352, 437656538, 431841884, 424475891, 416010122, 405269504, 393438171, 380206943, 365872695, 351052024, 335932964, 320791227, 305841105, 291711845, 277310547]
14253B77310547j3502343j2836229j2500179j2011265j1048390j0965100j0043933
14246A94403108r546663q653496q320176q042824p693520o793779o695191o210531
14238A32446928n799958n297355n241740n148998m801194m864735l655715l459738
14230I4177495l877389l641133l796746l360390k495139l197989k413074k418518
14222F8977117k596655k265235j966336k148709k367263j724518j820320j688029
14214E2400052j512972j152785j553017k072279j254365j220618r42805p61758
14206D1929453j449315j455048r03291j291630o31787j096882n57406j039405
14198C3504689q67437q33690j348215n26009o80303p26683k07885q63295p04230
$$ y = [277310547, 263808204, 250971975, 238471796, 226460531, 215412141, 204447041, 194403108, 184856445, 176202949, 167882773, 159839949, 152146429, 145352650, 138657459, 132446928, 126646970, 121349615, 116107875, 110958877, 106157683, 101292948, 97637233, 94177495, 90300106, 86658973, 82862227, 79501837, 77006698, 73808709, 71395635, 68977117, 66380462, 64115227, 62148891, 60000182, 57632919, 55908401, 54088081, 52400052, 50887080, 49734295, 48181278, 46108999, 44854634, 43634016, 42691211, 41929453, 40480138, 39025090, 38121799, 36830169, 36198382, 35101500, 34544094, 33504689, 32637252, 31803562, 30455347, 29929338, 29249035, 28522352, 28314467, 27451172, 26746942]
14189B6746942r35525l11788r22556m87267n91244k83345o19512m99410o4796
14180B2031499p73338n42300k9586n81796n66755l40605m53499k48953n25278
14171A7969389l29599n03566k57328l39325k27931n71200l34199K03737k77966
14162A5332012p61339J95207l27391n19126k47356p795j42763k18561n01388r0573
14152A2710927m57441r9052k00807j44533k51022r3868l13268j01620J030k47314
14142A0803032J29875m30195j45633P6337l32981K5510l80251n08422K05753n6851
14132I386174k72366k84964J87573J70626l33509j74772p7820o04681J43361J36900
14122H276522l3508j78174l14872k9943q7708j2741q2505j85235j65419m31793
$$ y = [26746942, 25811417, 25499629, 24577073, 24089806, 23498562, 23215217, 22595705, 22096295, 22031499, 21258161, 20715861, 20686275, 20104479, 19537724, 19197119, 18743620, 18494667, 17969389, 17639790, 17136224, 16878896, 16539571, 16311640, 15740440, 15406241, 15609978, 15332012, 14570673, 14765880, 14438489, 13919363, 13672007, 13664212, 13521449, 13302888, 12801500, 12710927, 12253486, 12154434, 11953627, 11809094, 11558072, 11464204, 11150936, 11049316, 11050346, 10803032, 10932907, 10502712, 10357079, 10433416, 10100435, 10125945, 9745694, 9237272, 9443025, 9386174, 9113808, 8828844, 9016417, 9187043, 8853534, 8678762, 8600942, 7996261, 8139622, 8276522, 8243014, 8064840, 7749968, 7720025, 7632317, 7619576, 7537071, 7351836, 7186417, 6754624]
14112F754624L15064m6624l1815k17124q5157J56466k69381k28637r6766K75996
14102F526646l81348k75493J54568O0840k39680k26185k3109M87426l85532j75364
14092E522769j52209k0514K57909j05388k45225K0425P1326j71627j93109J18747
14082E103104j49102q1095n8056Q6142M4782k98040J77707l86026L55947o12352
14072D183011r288L34991J41517j60015k65292k06026K27165k24131J08560j35889
14062C994603j11349J49167K842r6836N0474l13005Q1839n2323J20496q0555J7370
14051C762723l01479J52568l00264m477K85859k41901Q7410k67338K60612m5174
14041C388539m8442l95983M31970n51715L92035l63024N33819p31003N3732L01027
$$ y = [6754624, 7069688, 7023064, 6991249, 6774125, 6688968, 6845434, 6576053, 6347416, 6250650, 6526646, 6145298, 5869805, 6024373, 6085213, 5845533, 5619348, 5596239, 6083665, 5698133, 5522769, 5370560, 5350046, 5607955, 5502567, 5257342, 5277767, 5349093, 5177466, 4984357, 5103104, 4954002, 4872907, 4814851, 4900993, 4945775, 4647735, 4825442, 4439416, 4795363, 4183011, 4173723, 4508714, 4650231, 4490216, 4224924, 4018898, 4246063, 4021932, 4130492, 3994603, 3883254, 4032421, 4035263, 3938427, 3988901, 3675896, 3757735, 3705412, 3825908, 3745353, 3762723, 3461244, 3613812, 3313548, 3309071, 3594930, 3353029, 3440439, 3173101, 3433713, 3388539, 3340097, 2944114, 3376084, 2824369, 3216404, 2853380, 3387199, 2656196, 2709928, 3010955]
14031C010955J59035j77561p7650p9149k5893j08148J90465J4721l94654J78987
14021B691108j11274J95357q2916j39084J26295j93265j12605K46192R3744k42423
14011B471129K9065k31836P4867j1173l04492n9148O44219l87068j9221m5803
14001B160539j0951j9807J54818n176j79399K37791k07599R2373Q677J48359j07555
13990B272070P13616Q14405L356179Q020060J5076489R824425j4799267j1594042
13982A3683935m867317k721454j140584o13795n86151N0194l43270m82131j34020
13973B845407K1159m6387k23777l7664m1229N8649m06605j23099K44489r7950
13963B192993L43764o2727j20240j49328j91053J63239j97142l2235o5226J52178
$$ y = [3010955, 3169990, 2992429, 2914779, 2835630, 2809737, 2701589, 2892054, 2906775, 2512121, 2691108, 2579834, 2775191, 2692275, 2553191, 2679486, 2486221, 2373616, 2619808, 2713552, 2471129, 2500194, 2268358, 2343225, 2332052, 2027560, 1968412, 2612631, 2225563, 2206342, 2160539, 2149588, 2129781, 2284599, 2279423, 2100024, 2337815, 2130216, 2222589, 2231266, 2379625, 2272070, 2985686, 3800091, 7156270, 15176330, 30252819, 40077244, 25277977, 13683935, 8816618, 6095164, 4954580, 4340785, 3754634, 3804828, 3461558, 2979427, 2845407, 2866566, 2820179, 2596402, 2558738, 2517509, 2576158, 2169553, 2046454, 2290943, 2192993, 2536757, 2474030, 2353790, 2204462, 2013409, 2176648, 1979506, 1947271, 1882045, 2034223]
13953B034223j45628J64653o8594M2967m43531m4388P8849M03392k84613K59778
13943A997108n6691m4282l2569k73312K38821k31222M83557j69520k62778j01163
13933A547949K11345q2258K72760n65928L39693K54371j84697m10667L53413J2530
13923A748511k82416J06063J45694n40551N03712j4801m3476P7754k30801K48779
13913A718468J89469l08677j76876k37978M57289K2524k10781j01074J36931m8433
13903A440862J00922m79939L96002j46910J44540j22490k7849Q5670J37897l90131
13893A138574R6530J01272N0540j85382L60931k85230j7656j24078M5044j62893
13883A017652K45167j23495J76645j31131j16924K45152K388j66216l4165O5774
$$ y = [2034223, 1888595, 2053248, 1984654, 2027621, 1584090, 1539702, 1618551, 2021943, 1737330, 1997108, 1940417, 1896135, 1863566, 1590254, 1829075, 1597853, 2081410, 1911890, 1649112, 1547949, 1759294, 1677036, 1949796, 1383868, 1723561, 1977932, 1793235, 1382568, 1735981, 1748511, 1466095, 1572158, 1717852, 1177301, 1681013, 1666212, 1622736, 1700490, 1469689, 1718468, 1907937, 1599260, 1422384, 1184406, 1641695, 1664219, 1453438, 1352364, 1489295, 1440862, 1541784, 1061845, 1457847, 1310937, 1455477, 1332987, 1305138, 1390808, 1528705, 1138574, 1235104, 1336376, 1386916, 1201534, 1562465, 1277235, 1259579, 1135501, 1180545, 1017652, 1262819, 1139324, 1315969, 1184838, 1067914, 1313066, 1315454, 1149238, 1115073, 1180847]
13873A180847R2964k48901L01509m31819K40389O7544k24838k6692R8647J2050
13863A061700J33887r2575j0267j3566m70288L73563J55461j84660J59923l1699
13853A081479k46387N05255l47287k75614L71951N2180j76856l11076P44973m44893
13843I53725L76567j31498l83794j30198K67469L229J76425j89691K12516K9519
13833A184269Q358j89428m70202L65287l5071R0722K02343l20356n6995K52178
13823A031105J23029l8117l3288k50090L14621m48751L19126j78885j52651N9546
13813G45645K53783j69676J44292r2063m5964R6827p0409O7606j3556k93193K79104
13802I02396j35974L07851j84967M530k06356L36226l24665n6964L13825j42746
$$ y = [1180847, 1273811, 1024910, 1326419, 894600, 1134989, 1202533, 977695, 951003, 1049650, 1061700, 1195587, 1103012, 1092745, 1079179, 608891, 982454, 1137915, 953255, 1113178, 1081479, 835092, 1340347, 993060, 717446, 1089397, 1141577, 964721, 653645, 1398618, 953725, 1330292, 1198794, 815000, 684802, 952271, 955500, 1131925, 942234, 1154750, 1184269, 1192627, 1003199, 532997, 898284, 863213, 953935, 1156278, 835922, 778927, 1031105, 1154134, 1116017, 1082729, 832639, 1147260, 698509, 1017635, 838750, 686099, 745645, 999428, 829752, 974044, 881981, 836017, 932844, 862435, 930041, 916485, 623292, 902396, 766422, 1074273, 889306, 893836, 687480, 1023706, 699041, 642077, 955902, 813156]
13792H13156p0587J68697l80889j6527K22679J15622J41907j74753J51018l7528
13782I32795L9697j91783M053O7229P0093m35860J87226k1861o2296K83286j67959
13771G04620J8815l25299N73052m14379J61676j45965J11953L7755K47947j99559
13761G70616m4937j84103L05025J79673m53731J58238J68656j16650K8754j71323
13751F40218P6236Q9503k20195K33205j28831M1411M709p0403p0287k40359K73850
13740F29057j63345N2331K80623k67451Q679o8847k20474M44044k57351L21048
13730G58314j99001M8249J29273k13121j66731J84340Q3748J12305k03647L20763
13720H54492B54974M23737j72579O3608J29810k7707j78685L50271j35935k55170
$$ y = [813156, 742569, 911266, 530377, 513850, 736529, 852151, 994058, 819305, 970323, 932795, 972492, 780709, 784762, 851991, 922084, 486224, 673450, 651589, 589293, 872579, 704620, 723435, 398136, 971188, 556809, 718485, 572520, 684473, 722228, 970175, 770616, 725679, 541576, 846601, 1026274, 572543, 730781, 899437, 782787, 811541, 640218, 716454, 805957, 585762, 818967, 690136, 731547, 736256, 665853, 595566, 355207, 629057, 465712, 518043, 798666, 531215, 539894, 471047, 250573, 694617, 437266, 758314, 559313, 607562, 736835, 523714, 356983, 541323, 625071, 737376, 533729, 854492, 254974, 678711, 506132, 569740, 699550, 671843, 493158, 843429, 707494, 452324]
13710D52324J86453j59192o6682R4900o9591K09394j85424J65129l03835L74247
13700F97723J14578j80973j68824l7334j69498L11908J03833A55198M27465A38339
13689C91694r320P1385L46516l01880M47176l58481J56442k75660l8800j54232
13679B74840K14434J39949k26162r4897M97667j44810k12974J15842L9866k56254
13669C47501K03190J33469j67068k45998A21670M50965j7225j28845n4994L3107
13659D04678M289l7596N804j0451J43827j5165n6895J4997J2748n273l5754n9785
13647C65424k582O7797L05009A69430K52596n6941L4880J2576j67239M29428B11551
13635D43013J6818P5302Q1881j5479k94894F6004L98502r8910J62973B01169K50172
$$ y = [452324, 638777, 479585, 412903, 507803, 438212, 647606, 462182, 627311, 323476, 697723, 812301, 631328, 462504, 425170, 255672, 567580, 671413, 155198, 582663, 138339, 391694, 382374, 453759, 800275, 498395, 945571, 587090, 743532, 467872, 429072, 274840, 489274, 629223, 403061, 308164, 805831, 661021, 448047, 563889, 603755, 347501, 550691, 684160, 517092, 271094, 121670, 572635, 555410, 426565, 371571, 404678, 408967, 371371, 377175, 366724, 510551, 495386, 438491, 453488, 466236, 460963, 425209, 365424, 362842, 430639, 735648, 169430, 422026, 365085, 399965, 412541, 245302, 674730, 211551, 443013, 459831, 535133, 617014, 601535, 306641, 66004, 464506, 365596, 528569, 201169, 451341]
13624D51341j98461N59371l90167J18544j88653j03326m2231J61435n2329K7654
13614C43178K8994A81854K62703j7881G1546L10162K68292C04628L14429A38436
13603E23451k30527N8899j15865Q6488b9106m6737C34418A50344L17103J26146
13593E93593N3764o3791l0367k9775o5182J6538J3803J01093k68401M0673Q5051
13582D46999B00900M2453N66501l53611n5661j33232M60902B97257J88329A21470
13571D21743L48487l16627j37210l3965J90665p7469E5723L73855R5445A42513
13560F50126B10573J34944A53885m8798L65082J96663j03644B14742J20439J280
13550C36461r0087J81702p9041j73221l3909J34495D1137K00249J6417L96061
$$ y = [451341, 252880, 812251, 422084, 540628, 351975, 248649, 206418, 367853, 315524, 343178, 372172, 181854, 444557, 426676, 71546, 381708, 650000, 304628, 619057, 138436, 523451, 292924, 351823, 235958, 322446, -29106, -75843, 334418, 150344, 467447, 593593, 647357, 583566, 553199, 523424, 458242, 474780, 488583, 589676, 321275, 361948, 446999, 200900, 243353, 809854, 456243, 400582, 267350, 728252, 297257, 485586, 121470, 421743, 770230, 453603, 316393, 282428, 473093, 395624, 55723, 429578, 525023, 142513, 650126, 210573, 345517, 153885, 105087, 470169, 666832, 563188, 214742, 335181, 336461, 246374, 428076, 349035, 175814, 141905, 276400, 41137, 241386, 257803, 653864]
13540F53864B92947I7859P7464K52882f9959H8185L04516Q87L081P2292j59361
13529C09600p8966J03342K05768I7497M71872B68694K887h0144C3523R3123K9118
13518A55764L15799J87094A45596J13130J67244j07099A27861J22725J78097A47223
13507B75765K84444l8044B26626a333D40848A17317J55834M23525B77689L5554
13497C13243J95673B39199J23219j65713J33513r0839K23126B02015M9641J26023
13487C77679j36507K21243B14801q2467L69504B31504J80334l9446R56M9083k10171
13476B12260O8548j06219J97846A08457J97561Q5336p9984K6252m4728j296m1647
13465B49951F5097N8251N08146j33607o4922E2135O4591f1030B68085B4528L77449
$$ y = [653864, 292947, 97859, 175323, 428205, -69959, 88185, 392701, 393588, 396669, 468961, 309600, 230634, 333976, 539744, 97497, 569369, 268694, 271581, -80144, 33523, 126646, 155764, 471563, 658657, 145596, 258726, 425970, 318871, 127861, 250586, 428683, 147223, 275765, 560209, 522165, 226626, -1333, 440848, 117317, 273151, 696676, 277689, 313243, 508916, 239199, 362418, 196705, 330218, 239379, 462505, 202015, 251656, 377679, 241172, 462415, 214801, 132334, 501838, 231504, 411838, 372392, 373348, 422431, 212260, 280808, 174589, 372435, 108457, 306018, 391354, 311370, 337622, 292894, 291598, 249951, 65097, 123348, 631494, 497887, 432965, 52135, 116726, -61030, 268085, 24528, 401977]
13454D01977n3511p3624j05612k5592J40855r4776G3442K60826I0975K83932F622
13442C08891K34207L05445F089K30972I3821K59184J07215e844B23214o5524K02291
13431C59981A15314N44215B16481J69486j39510j02140j7283P2682J16410J23270
13421D39396A69795M3388l2037L5911C1457K06111J75829d9578q9866B04639J26961
13410C31600I6058M2740J31231B9124L6821N1099a09072B02854P602k2812K45985
13399D33629o8986j22805p684K89385B03987M5560K87699j96655j09667G415M73457
13388D80872j81057d9237I8754a04577A98601h8427D5373K5569L07110C772J83783
13377A87555C7591K08288j13540L41090f966A48444J68751a785B47930b3526B57176
$$ y = [401977, 348466, 274842, 169230, 143638, 284493, 189717, 73442, 334268, 90975, 374907, 6622, 308891, 543098, 848543, 6089, 237061, 93821, 353005, 460220, -5844, 223214, 157690, 359981, 115314, 659529, 216481, 385967, 246457, 144317, 127034, 199716, 316126, 439396, 169795, 213183, 181146, 217057, 31457, 237568, 413397, -49578, -139444, 204639, 331600, 96058, 138798, 270029, 29124, 65945, 117044, -109072, 202854, 210456, 187644, 433629, 364643, 241838, 234154, 523539, 203987, 249547, 537246, 340591, 230924, 7415, 480872, 299815, -49237, 98754, -104577, 198601, -88427, 45373, 70942, 378052, 3772, 187555, 37591, 245879, 132339, 473429, -6966, 148444, 317195, -1785, 247930, -23526, 257176]
13365D38694B8718R4841J13197I6207J2040J70565N2422A44907L22740M609B7203
13353C16270q8761J22623A52140J82772P3902D6168J7293J16063j9161K17237
13343C77600A73180o4529K14068J22794A59604J63956K72661A61190K99348m9677
13333D10861A80040R8648q5998P604K26521b1012D00135I9064K30946H0649N4223
13322A34872K64574J76905f0234A89962L37889c2053C29540A20604N97965B44877
13311B35188n1927m8227K40990A74013a26058B46971J81283B5132i8962B60855
13300C3775J33225B2527R4868J10764A05640J86538p250K65545I8362K6806K69039
13289C94207f8379B20030N8452D5346h5966A0608K28574N6250M56528A60942O4440
$$ y = [438694, 28718, 123559, 236756, 96207, 108247, 278812, 331234, 144907, 467647, 472256, 27203, 316270, 227509, 350132, 152140, 334912, 408814, 46168, 63461, 179524, 160363, 377600, 173180, 108651, 322719, 445513, 159604, 323560, 596221, 161190, 460538, 410861, 180040, 278688, 192690, 200294, 426815, -21012, 400135, 99064, 330010, 80649, 134872, 399446, 576351, -60234, 189962, 527851, -32053, 329540, 120604, 718569, 244877, 235188, 183261, 135034, 376024, 174013, -126058, 246971, 428254, 25132, -98962, 260855, 33775, 167000, 22527, 117395, 228159, 105640, 292178, 284928, 550473, 98362, 125168, 394207, -68379, 220030, 278482, 45346, -85966, 10608, 239182, 295432, 751960, 160942, 225382]
13278B25382f1095A07982J99222J8505g7577B97304I876O3470J59292F2403e1866
13266A74162J39076G8800j0664K39185k4147j15699K24880A1396a69590A48438
13255F9773J43073P2970J22935a37117B18041E5444R6608L2391Q680j8954q3522
13244I0647R3960H1816f580D33413A60507J11980j04788F9277a64882j2835A44505
13232I1603j2998o538K53203a3186A13108J60283j19423P9066I4376m0968L64135
13221D17543e7220C10704n1321B1669M96069a77451a4588A3154b4197B81134E3991
13209F9389K76493j01358I5101a60933g085A47776b60016F03142B06995P032m3901
13198A70126k489p9649J01883Q6793j10866J09352J68332H9581O0861J27021j05427
$$ y = [225382, -61095, 107982, 307204, 325709, -77577, 297304, 9876, 73346, 232638, 62403, -51866, 174162, 313238, 78800, 68136, 307321, 283174, 167475, 392355, 11396, -169590, 148438, 69773, 212846, 285816, 408751, -137117, 218041, 55444, 152052, 184443, 193123, 174169, 90647, 184607, 81816, -6580, 433413, 160507, 272487, 167699, 69277, -164882, -177717, 144505, 91603, 78605, 72067, 325270, -13186, 113108, 273391, 153968, 233034, 94376, 53408, 417543, -57220, 310704, 259383, 21669, 517738, -177451, -14588, 13154, -24197, 281134, 53991, 69389, 345882, 244524, 95101, -160933, -7085, 147776, -260016, 603142, 206995, 214027, 170126, 167637, 87988, 189871, 276664, 165798, 275150, 443482, 89581, 150442, 277463, 172036]
13187A72036l1364B3115D373c0463a4719m631D54993c41638B0306J75125A5153
13175D24800g5322D5763L77756C0382M0953J66899a89152e6359G7825R439J44729
13164B31993a44710i494F4597M9184B2305h0269H9678d212C51844D7268a75119
13152A43402M263g8167G64P0444K47382L9159a09687C14773I7788a45939A71542
13140a08938B08745C4646b98950f1086B88684E0286O1433M5732J47956e0106A90485
13128g682A99914M2001i3354a0252q3172A34921D4455K36642a39208e7282J0579
13117d6703I4679L8266g3684G3238a12836A45957g595r4709A56779c7891l1113
13106f9004C2548J17597n4552a27273a8007j25109E6180J80427o7463o8881K56964
$$ y = [172036, 140672, 23115, 4373, -30463, -14719, -19350, 454993, -341638, 20306, 195431, 15153, 424800, -75322, 45763, 423519, 30382, 71335, 238234, -189152, -56359, 77825, 87264, 231993, -144710, -9494, 64597, 113781, 22305, -80269, 89678, -4212, 351844, 47268, -175119, 143402, 147665, -78167, 764, 71208, 318590, 357749, -109687, 314773, 97788, -145939, 171542, -108938, 208745, 34646, -298950, -61086, 288684, 50286, 111719, 157451, 305407, -50106, 190485, -7682, 199914, 241915, -93354, -10252, -93424, 134921, 44455, 281097, -139208, -57282, -46703, 94679, 132945, -73684, 73238, -112836, 145957, -7595, -102304, 156779, -37891, -69004, 32548, 150145, 95593, -127273, -18007, -143116, 56180, 236607, 169144, 100263, 357227]
13095C57227A39332o6195l762J92388d9111A68161J55915j04107D1670L23589
13085C65259a1050d379A126J08610P6179A9292J81709C9300b52214C34750n1620
13074B83130B9593K06821j03165a54238B24639l2824I1924P6506J4430a02157
13063B06400c8705P756D9833K4344J0961P9555M9220F2524L7791b55969c8233
13051A97364a1684m4419j00923B608J95625n0993R9055E3664a83599A56495J46975
13040C03470j09793b5833B59202c3037H0087J27279K26389j84146a26126j11459
13030b37585A3604K50604Q4927A54413a39224d6950A85047a6605m9093l3223k8630
13019a27551K9158B19545f4669B08983q1960c981F4408K33018F7137J48416o2158
$$ y = [357227, 139332, 73137, 69375, 261763, -49111, 168161, 324076, 219969, 41670, 365259, -11050, -4379, 1126, 109736, 185915, 19292, 201001, 39300, -252214, 334750, 283130, 29593, 236414, 133249, -154238, 224639, 191815, 91924, 168430, 182860, -102157, 206400, -38705, -30949, 49833, 74177, 85138, 164693, 213913, 62524, 100315, -255969, -38233, 197364, -11684, -56103, -157026, 2608, 198233, 147240, 246295, 53664, -183599, 156495, 303470, 193677, -25833, 259202, -33037, 80087, 207366, 433755, 249609, -126126, -237585, 13604, 264208, 349135, 154413, -139224, -46950, 185047, -16605, -65698, -98921, -127551, -98393, 219545, -64669, 208983, 127023, -3981, 64408, 297426, 67137, 215553, 153395]
13008A53395i002G2737P0467a14355CR8563M26727d3665k11233G1931J91253c220
12995B12940A9906L23626D3556P01K2664N99981B76436a80842A88186J11912E7018
12983B78665i8877p1714A14138a32272A37222A8849J47766J0765b03760E5991
12972A23735J06440A09660a66789D044J31497C9914j4373M62083A83353p7998
12962A05355l2062C6620J84679o267D4120N8260Q8209r4174M02861b27699m1782
12951b69481P0482A4401J41653o7589c2019A71429a17425I7993k1282g9150D9034
12939d1132E3397a09666A50779b7610A15690j0052J15692h5135A61043c05954
12928a25869B03262G3697d9993c330j66456C08307a79621L7478A52706F7698g9069
$$ y = [153395, -9002, 72737, 143204, -114355, 3, 98566, 525293, -43665, -254898, 71931, 263184, -3220, 212940, 19906, 343532, 43556, 44257, 66921, 666902, 276436, -180842, 188186, 300098, 57018, 278665, -98877, -170591, 114138, -132272, 137222, 18849, 166615, 177380, -203760, 55991, 123735, 230175, 109660, -166789, 4044, 135541, 39914, 25541, 487624, 183353, 105355, 73293, 36620, 221299, 215032, 44120, 102380, 190589, 96415, 499276, -227699, -269481, -198999, 14401, 156054, 88465, -32019, 171429, -117425, 97993, 76711, -79150, 49034, -41132, 53397, -109666, 150779, -27610, 115690, 105638, 221330, -85135, 161043, -305954, -125869, 203262, 73697, -49993, -3330, -169786, 308307, -179621, -142143, 152706, 67698, -79069]
12916b1028A79174b0396B23206J91762H5199b02084E1114b66707A75629a5195
12905e8315C04217b16744F9945h4068n0075f2178l6729J912A38868a77892Q8574
12894h9318G1504a31206b6644r6180o3201A79826d1467I6026b34189D9168b0287
12882h6289D06786A88035b7811J2463k07797A18057K00372a88776q0910A79624
12871b6443A0683d2621H0597J57704c12282A84455o0446B2789g1990r7184G0910
12859B01072I0689l3486A2989b63669O409h0190k6165a6788K636n8314k48049
12848c20515J54998E3208a30306A46996l7673d4259m8454C18318o1588o8439b44336
12836b54993f1667A55479a50750D5239c36150J59446A08787J42556K09020A93241
$$ y = [-21028, 179174, -20396, 223206, 414968, 85199, -202084, 51114, -266707, 175629, -15195, -58315, 304217, -216744, 69945, -84068, -134143, -62178, -98907, -96995, 138868, -177892, -89318, 71504, -131206, -26644, -122824, -186025, 179826, -41467, 96026, -234189, 49168, -20287, -86289, 406786, 188035, -27811, -15348, -223145, 118057, 318429, -188776, -269686, 179624, -26443, 10683, -42621, 80597, 238301, -312282, 184455, 124009, 22789, -71990, -169174, 70910, 201072, 90689, 57203, 12989, -263669, -257260, -80190, -106355, -16788, -14152, -72466, -320515, -165517, 53208, -130306, 146996, 109323, -44259, -92713, 318318, 256730, 188291, -244336, -254993, -61667, 155479, -150750, 45239, -336150, -176704, 108787, 251343, 460363, 193241]
12825B65342a10468A25753a70333I5240a05139C86570I469a59728H8900R4438
12815A83338e2699B40778K34193A76793f2074C26347g0643j6396D4990L62041
12805D07031a48346k42258I964b36017h7169M2041l326C8460j500H786b2001G6686
12792B92572k1590a00688j68300e2457n6863K0784C3420K11894F8200a29852c7136
12780h4277p5155E5558J55885a85535D5944a49559A81690c63338g3355B16115
12769A79323k6937c13371C17200a12296o3785j76146a61676B96094g646E9508
12758A48284J0347R8924b9011A64927g985B70690H408J84076E4289c18125A58798
12746A07710c2072B12372a17461R364A18928a65565b5023B048J8799b9226F1694
$$ y = [265342, -110468, 125753, -170333, 95240, -105139, 386570, 9469, -159728, 88900, 183338, -52699, 240778, 474971, 176793, -62074, 326347, -70643, -87039, 44990, 407031, -148346, -390604, 9964, -236017, -87169, -45128, -48454, 38460, 36960, 8786, -22001, 76686, 292572, 270982, -100688, -268988, -52457, -109320, -88536, 33420, 245314, 68200, -129852, -37136, -84277, -159432, 55558, 211443, -185535, 45944, -149559, 181690, -363338, -73355, 216115, 179323, 152386, -313371, 317200, -112296, -176081, -352227, -161676, 296094, -7646, 59508, 148284, 158631, 257555, -29011, 164927, -7985, 270690, 8408, 192484, 54289, -318125, 158798, 107710, -32072, 212372, -117461, -108097, 118928, -165565, -25023, 2048, 20847, -29226, 61694]
12734e0301j71284B85788E0061L7863K81780E4221J10280a67989c1069A28862
12723a6994j71564I5685R3264a84641B0981B281i4490A00559f7491E3185O3368
12712A16553R5113q2291K5757A7500M57588B34888b75225B73389k2515o9592p302
12701A73980J18703c40721A54037A8608J75123H0575O169i5653A23798c64632
12690A33376H697a31501A88825D3169J37006b09009i3429K5687A70875b17032
12679C2391R7770E219d8173A84877h8558B66324D2031c6895e768l6537F0997E843
12666B07887B2096g8696A08330a77906D913c10027A07516a4032k15415A18807
12655D73373d4122A58333a27741B52700k3181h8021A58027a13847e2925K3873
$$ y = [-50301, -221585, 285788, 50061, 87924, 369704, 54221, 164501, -167989, -31069, 128862, -16994, -188558, 95685, 188949, -184641, 20981, 2281, -94490, 100559, -67491, 53185, 116553, 211666, 129375, 155132, 17500, 475088, 234888, -275225, 273389, 250874, 181282, 173980, 292683, -340721, 154037, 18608, 193731, 80575, 86744, -95653, 123798, -364632, 133376, 8697, -131501, 188825, 43169, 180175, -209009, -93429, -67742, 170875, -217032, 32391, 130161, 5219, -48173, 184877, -88558, 266324, 42031, -36895, -5768, -42305, 60997, 5843, 207887, 22096, -78696, 108330, -177906, 4913, -310027, 107516, -14032, -229447, 118807, 473373, -44122, 158333, -127741, 252700, 229519, -88021, 158027, -113847, -52925, -29052]
12645b9052C40798A08896d4732B67113j14802M6730R082L4431a44962d2419l3468
12634g5887A7990L60945j27495G0887K13028J15917b5249m0479B19479J53949
12624C73428A00432a90668A57804m0469J1879a31692B11161B8153J58716k4265
12614A62604a23329d5664G3486k3128J95734A08190a75764A20304C0951a07381
12603e7413C82660A083J88450M3616p2232m5303b06902G4553i224B12980j4903
12592A98077p4280d9919I8650M5205A5913a53597A55427D4367J4928G013b4931
12580B72167a36244R032M9430I0277b2876B62632A16406a73342F1825k186J9406
12569G9045a18515e7335A64695a43962f456k09205R9319C45057e9205A1084L56796
$$ y = [-29052, 340798, 108896, -44732, 267113, 152311, 199041, 208123, 242554, -144962, -42419, -75887, 17990, 378935, 251440, 70887, 283915, 399832, -25249, -65728, 219479, 373428, 100432, -190668, 157804, 117335, 129214, -131692, 211161, 28153, 186869, 162604, -123329, -45664, 73486, 50358, 246092, 108190, -175764, 120304, 30951, -107381, -57413, 382660, 1083, 189533, 233149, 160917, 115614, -206902, 74553, -9224, 212980, 198077, 123797, -49919, 98650, 143855, 15913, -153597, 155427, 44367, 59295, 7013, -24931, 272167, -136244, -127212, -77782, 90277, -22876, 262632, 116406, -173342, 61825, 59639, 79045, -118515, -57335, 164695, -143962, -6456, -215661, -116342, 345057, -59205, 11084, 367880]
12558C67880A50075c05759I1999J22114H8744K8571M1056J7929b91682B46355
12547a82667E9316R6346B9403a5349j28839G5029E946J36579n1860J30239J34795
12536C55699A27421a94376c1097A50215k5397L41933c44374G8973f1441A77687
12525A46974K73590D8292h7157G3817J19956a49263k25532A88040I530b2522G3120
12513D21567i631r5628A39143F5469J6465a20603A02345a45426F7272J47114C7382
12501a01231A76244F3359A8168J77283C4006a54368B20243n632a58934J6081e0972
12489C3032O7318A6894b43424a6076A65604b68483B01812P6812C298a22646e6149
12477b25810a00621j58137D6674a19935k12515J29678K9767J4935J1151A0971
$$ y = [367880, 150075, -305759, 91999, 214113, 88744, 117315, 158371, 176300, -291682, 246355, -182667, 59316, 155662, 29403, -15349, -144188, 75029, 5946, 142525, 90665, 220904, 355699, 127421, -194376, -31097, 150215, 124818, 466751, -344374, 78973, -61441, 177687, 146974, 420564, 48292, -87157, 73817, 193773, -149263, -374795, 188040, 9530, -22522, 73120, 421567, -9631, -105259, 139143, 65469, 81934, -120603, 102345, -145426, 67272, 214386, 37382, -101231, 176244, 63359, 18168, 195451, 34006, -154368, 220243, 214611, -158934, -142853, -50972, 33032, 100350, 16894, -243424, -16076, 165604, -268483, 201812, 278624, 3298, -122646, -56149, -225810, -100621, -258758, 46674, -119935, -332450, -202772, -173005, -158070, -146919, 10971]
12466C56979b94943A253a32579f1568k7009j22527B61489H9739e8832B54304a13287
12454g4881E8566J1360K50066C9538Q3969g7562o3572O7713J7999E4053a9302
12442b78934C00157j18854a16393f698A47938k1419k7864a24448d2138A6290K54676
12431B70966a14449m8279B07671H9452P1307b96059a16814B92563h8157j46881
12421b35038B19261k3779d13549J06908a23713L7295A93409g8500D9278p779N2698
12410I4197d1747j1545p5615A22093a74818P1888L2130G936K19226l6136j6416
12399A74610l0833I759c28094J02266h0895m7565N8639k7897a5548m11654b007
12387a38318d3994N983j87538Q2235A03279c2454F1471f5391m2692D13579E7430
$$ y = [356979, -294943, 1253, -132579, -61568, -88577, -211104, 261489, 89739, -58832, 254304, -113287, -74881, 58566, 69926, 319992, 39538, 123507, -77562, -141134, -73421, -55422, 54053, -19302, -278934, 300157, 181303, -116393, -6698, 147938, 126519, 98655, -124448, -42138, 16290, 270966, -114449, -162728, 207671, 89452, 160759, -296059, -116814, 292563, -88157, -235038, 219261, 195482, -413549, -306641, -123713, -86418, 193409, -78500, 49278, 41499, 94197, -41747, -53292, -128907, 122093, -174818, -102930, -70800, 7936, 227162, 191026, 174610, 143777, 9759, -328094, -225828, -80895, -128460, -69821, -97718, -15548, -427202, -2007, -138318, -43994, -38011, -225549, -143314, 103279, -32454, 61471, -65391, -108083, 413579, 57430]
12375B5782J3604b00557C72063g4810E0612d9520j05758M5890k00699J48316m2256
12364b04027c8012j46386A68394b45705D3882a29320l4247g6788l7313C66991
12353A12793a39765d0391l2281B29126p6114B1045b210n1677j47569a8568E2289
12341b65069B29682c8208E8062a63521n9443H6574c7244e655A86883A2911b30332
12329h1566H4857D0783b93380A85288L8375J433a11246B68070A05344D1448K84228
12318C25676A11899a48578k18200a40266E3815B3934b66927B08944D2481J02369
12308A44850j6066D1256b34792p9521B26615o9243K6861G561P4210J05695J19515
12297C06981a62723n7059B87244j19304P7691K5105c09A58360J36014j44385b27175
$$ y = [25782, 39386, -200557, 372063, -74810, 50612, -49520, -155278, -109388, -310087, -161771, -204027, -38012, -184398, 168394, -245705, 43882, -129320, -163567, -76788, -114101, 366991, 112793, -139765, -40391, -72672, 229126, 153012, 21045, -2210, -53887, -201456, -18568, 52289, -265069, 229682, -38208, 58062, -163521, -222964, 86574, -37244, -5655, 186883, 12911, -230332, -81566, 84857, 40783, -293380, 185288, 223663, 225096, -111246, 268070, 105344, 41448, 325676, 111899, -148578, -366778, -140266, 53815, 23934, -266927, 208944, 42481, 144850, 128784, 41256, -234792, -314313, 226615, 157372, 184233, 7561, 81771, 187466, 306981, -162723, -219782, 287244, 167940, 245631, 270736, -309, 158360, 294374, 149989, -227175]
12285a73075A53807J7558J56016N9472a65441E3528c1090a5525B53042R4954j05074
12274B42922a09258A69207a14000A48217d95485E4291B1756i4157A01678J25975
12264B27653b8169D64676j91948a12742H6343f8239A03541J42957o7707J7763
12254A96554c59828C14217h6706B34041l0221b45647O4309C52932E5238a49417
12243e4336F6918J00802L7977E7292K73994B246L44474J26187j71970F4258i0444
12231A12873d2051j42419E0685N6239L52499A60515l7438K48999j63737K80063
12221D88402j94770A45678L75767A78005K10721A23529A4390J6543N9377a10157
12210d0806F538C160J63043Q1266A0070J88721c8559H7112K00257I4627J4963
$$ y = [-173075, 153807, 171365, 327381, 386853, -165441, 53528, -31090, -15525, 253042, 347996, 242922, -109258, 169207, -114000, 148217, -495485, 54291, 21756, -94157, 101678, 227653, -28169, 464676, 272728, -112742, 86343, -68239, 103541, 246498, 178791, 196554, -359828, 314217, -86706, 234041, 203820, -245647, -181338, 352932, 55238, -149417, -54336, 66918, 167720, 205697, 57292, 331286, 2246, 346720, 472907, 300937, 64258, -90444, 112873, -42051, -184470, 50685, 106924, 459423, 160515, 123077, 372076, 208339, 488402, 293632, 145678, 521445, 178005, 388726, 123529, 14390, 30933, 90310, -110157, -40806, 6538, 3160, 166203, 247469, 10070, 198791, -38559, 87112, 287369, 94627, 109590]
12199A09590Q5402a32434C59943J59231B01187L8079F7146R5888o1849K8607n1732
12188G8060M2978C3895K0949Q7983A7753L55091h8032A09193J45973a19314A86523
12176B57552b6364O866k00433A98298j4186J94012a00430B67171Q726d8785D66019
12164D25610k06122m984r75M2589b27539c9397D762K16170a33406G5223K67343
12153C42566n4337c9510B8339b23653A41125F4915c54735J77350A52676J349d1571
12141c43737D28913I2684a17539a8730j50088g4383D2037L29018c4024l7935F5091
12129B40190a48803a2850E6420J6491K1474c23603B07489f9884o3867A60488b20024
12117A70869G0096K56845A02096c63519F4924a54361N5566k48086a24414a8320
$$ y = [109590, 194992, -132434, 359943, 519174, 201187, 239266, 67146, 163034, 101185, 129792, 78060, 121038, 33895, 54844, 142827, 17753, 372844, -88032, 109193, 255166, -119314, 186523, 257552, -26364, -19498, -219931, 198298, 184112, 378124, -100430, 267171, 275897, -48785, 466019, 425610, 219488, 214504, 213529, 256118, -227539, -39397, 4762, 220932, -133406, 75223, 342566, 288229, -39510, 28339, -223653, 141125, 64915, -354735, -177385, 152676, 154025, -41571, -343737, 428913, 92684, -117539, -18730, -168818, -74383, 42037, 371055, -34024, -71959, 65091, 240190, -148803, -12850, 56420, 72911, 94385, -323603, 207489, -69884, -133751, 160488, -220024, 170869, 70096, 326941, 102096, -363519, 64924, -154361, -98795, -346881, -124414, -18320]
12106B10241p0327K17163a09000C62858E9876e2025b061F366g1492C03910H4881
12094A20757m7126N142J20181d21641a22790p5186a7055k8878q121A17294c8815
12082c5997l5888j72036R6846C1117c8886n8206B1260K4118d595B00057N067J86756
12070C91880j84646K7223O80687M22447C74633j84974p5203l2909A7127h2602
12059b17473C6503J4731b5721q5643d7680p9446H9170k1791a98353a8510j7255
12048c5765A39641A2335b43116A80772f2541I251a32383F6172N1231a91493I1822
12036c2434A30182e6373A70182a67503p873A75342O0998c08890G1023P1471B949
12024g4973a6992j14168A28768A0013a76731B75707E0965b13277B20676a7535
$$ y = [210241, 139914, 357077, -109000, 362858, 59876, -52025, -2061, 6366, -71492, 303910, 84881, 120757, 73631, 78773, 198954, -421641, -122790, -197976, -17055, -45933, -54054, 117294, -38815, -35997, -71885, -243921, -147075, 31117, -38886, -97092, 21260, 45378, -4595, 200057, 205124, 391880, 207234, 234457, 915144, 1337591, 374633, 189659, 114456, 81547, 17127, -82602, -217473, 36503, 51234, -25721, -111364, -47680, -127126, 89170, 67379, -198353, -18510, -35765, 139641, 12335, -243116, 180772, -62541, 9251, -132383, 66172, 117403, -191493, 91822, -32434, 130182, -56373, 170182, -167503, -175376, 175342, 236340, -308890, 71023, 142494, 2949, -74973, -16992, -131160, 128768, 10013, -176731, 275707, 50965, -213277, 220676, -17535]
12013E6917b84927a00612M0570F6119J7996f530B20087a97216d9016B70910a33141
12001a37472K5266B01807F2918j5652L06937C0699J05615g2339B80435a57700
11990a76492f6255j50411d7882B8384d1451B40075b7719A5158M332N1977B6276
11978A75494h7614h77l15049J56616A22781f0295n2813H0890C4052J08797a97639
11966a94566b4835r4928j17074M1535D29642F7682b08698A8915d938k1585A3019
11954G1505j2268i2080J9855k90754f1210N417l2320B47899i5554A18158k9438
11943H8720Q9940A4358R114b82529O7899e4724A91774e8323j60771G1728b06368
11931A54052f7428A508a47458j68764B57955I199J62665l9515g0174j579N550
$$ y = [56917, -284927, -100612, -60042, 66119, 84115, -6530, 220087, -197216, -49016, 270910, -133141, -137472, -112206, 201807, 62918, 47266, 354203, 30699, 136314, -72339, 280435, -157700, -176492, -66255, -216666, -47882, 28384, -41451, 240075, -27719, 15158, 19490, 71467, 26276, 175494, -87614, -877, -315926, -159310, 122781, -60295, -113108, 80890, 34052, 142849, -197639, -194566, -24835, -119763, -236837, -195302, 429642, 67682, -208698, 18915, -4938, -26523, 13019, 71505, 59237, -92080, -72225, -362979, -61210, -55793, -88113, 247899, -95554, 118158, 88720, 178660, 14358, 23472, -282529, -214630, -54724, 191774, -58323, -219094, 71728, -206368, 154052, -67428, 1508, -147458, -316222, 257955, 9199, 171864, 132349, -70174, -71753, -66203]
11920f6203A79166i0344d926A64592C9519K64059a91427A11530K48065f1607j183
11909f2790l5704A18893l2431K0140B5617J83306b48429i8401H8540b03576A77321
11897C9742J26877i8815j00033k6167E593d1538a8155C90072d8636J6539l52146
11886c84243a86140B10292f9595j72019a20146B61359a72019p9758R6314A32932
11875B3400M9014Q5738J1972C7507h2365k6873B2076b15625B59085F0092a4492
11863D2484J39660b7051D9571J5823b02388A83066N412n0019m7431J1640O189
11852A08857c91371G7311K2549b04781c1156B10125h9871a3223j19281d3315A72598
11840a80276B08185I561e9955k22700D0312e8892A21741a67935c6709k33237c9608
$$ y = [-66203, 179166, -90344, -4926, 164592, 39519, 303578, -191427, 111530, 359595, -61607, -62790, -98494, 118893, 86462, 106602, 25617, 208923, -248429, -98401, 88540, -203576, 177321, 39742, 166619, -98815, -198848, -225015, 5593, -41538, -18155, 390072, -48636, -32097, -384243, -186140, 210292, -69595, -241614, -120146, 261359, -172019, -251777, -155463, 132932, 23400, 72414, 158152, 170124, 37507, -82365, -109238, 22076, -215625, 259085, 60092, -14492, 42484, 182144, -27051, 49571, 65394, -202388, 183066, 188478, 138459, 91028, 102668, 108857, -391371, 77311, 99860, -204781, -31156, 210125, -89871, -13223, -132504, -43315, 172598, -180276, 208185, 9561, -59955, -282655, 40312, -58892, 121741, -167935, -36709, -269946, -39608]
11828A28658K21343a59869L8656o2310M2406N0473m516L6359K6370k26443p1259
11817c30133A3420K19941a16242a9518j09142j54711M2582j96751B93512e1650
11806A65621J28165a77720b6260k84650a08903a7010A28743b56040G9795B9214
11795A49887a75900a6817l05590f9072j19869B9909g7848j6855b5085l8400b7378
11783a36562G8472P8826n8542g3698q7j81711J15311A56726K8099c65647C53169
11771a21920K2878A44941a13829C05409A34459A2142a05226F7416K97930a19870
11760e8821k12707E5634J1225a9398B09212C6890J47512O0300l2206l6962F9689
11748d0214R060p074j14520H2522L38987a20663j03176A79545D9394a25599B07799
$$ y = [128658, 350001, -159869, -121213, -183523, -141117, -90644, -95160, -58801, -32431, -258874, -330133, 13420, 233361, -116242, -19518, -128660, -283371, -240789, -437540, 293512, -51650, 165621, 293786, -177720, -26260, -310910, -108903, -17010, 128743, -256040, 79795, 29214, 149887, -175900, -16817, -322407, -69072, -188941, 29909, -77848, -94703, -25085, -63485, -27378, -136562, 78472, 157298, 98756, -73698, -73785, -255496, -140185, 156726, 184825, -365647, 353169, -121920, -99042, 144941, -113829, 305409, 134459, 12142, -105226, 67416, 365346, -119870, -58821, -271528, 55634, 66859, -19398, 209212, 36890, 184402, 244702, 212496, 175534, 69689, -40214, -31154, -38228, -152748, 82522, 421509, -120663, -223839, 179545, 49394, -125599, 207799]
11736D65152A03904f7256o8310l1204A38921J744J17810j17924J26478b45120
11725b09048A16183P963J5046J5538a7398A75231a39481E02119b67725k04951
11715d72676D3279f6666B36281o4942a29297M6575J0565A91647b12047c5316j57263
11704a92579P3803B40848g5481M482A26309C0769L9426L59550A57538b8566C01539
11692C25166f2040b8610p1689l2874A20675J92625I0515J19196a22811B45567
11681A60998b1702I7885a76202L8813A2825b07527H939K29188A11475e1439H0689
11669b78150A650O3449c9563e634F5564Q5729o7939a2634E7244a73724H3193a34254
11656a95874f8733j73049E4545J34176F8933A1894K17616C2705a04391A61921
$$ y = [465152, 103904, -67256, -135566, -166770, 138921, 140665, 258475, 140551, 267029, -245120, -209048, 116183, 124146, 139192, 154730, -17398, 175231, -139481, 502119, -267725, -472676, 43279, -66666, 236281, 171339, -129297, -82722, -72157, 191647, -212047, -35316, -192579, -118776, 240848, -75481, -70999, 126309, 30769, 70195, 429745, 157538, -28566, 301539, 325166, -62040, -28610, -100299, -133173, 120675, 313300, 90515, 209711, -122811, 245567, 160998, -21702, 97885, -176202, -137389, 12825, -207527, 8939, 238127, 111475, -51439, 80689, -278150, 1650, 65099, -39563, -5634, 65564, 151293, 83354, -12634, 57244, -173724, 83193, -134254, -195874, -68733, -241782, 54545, 188721, 68933, 11894, 229510, 32705, -104391, 161921]
11645B4062a71586e4651B73663p8166h8612b6350I6272h3037k55053c6423A2656
11633B40622d968D0474a41011j8170g4866J0875A21412a87796Q929h0942A78658
11621i1064j36393D543L82283E3168g3485G5189r707K63881j09569o1158c4177
11609E5094a27237c2738A65771c74431b2400A00520a03200k53222a24129l6742
11599a60871c9276B79037b72899E457d4069C26637b56691A59478J72095c10842
11588A76345a61697C1378Q0713b8422A68440b3767A29008D2333q878K47961B0894
11576b50418a10959k2355Q174L9608r223B26749a84964J5574A53089d4286A99090
11564C17803a68101j61365a9426A5605J84375e0781j20324A7104a59469e7606
$$ y = [24062, -171586, -54651, 273663, 195497, -88612, -26350, 96272, -83037, -338090, -36423, 12656, 240622, -4968, 40474, -141011, -159181, -74866, -63991, 121412, -187796, -178867, -80942, 178658, -91064, -227457, 4543, 386826, 53168, -73485, 75189, 65482, 329363, 219794, 158636, -34177, 55094, -127237, -32738, 165771, -374431, -22400, 100520, -103200, -356422, -124129, -160871, -39276, 279037, -272899, 5457, -44069, 326637, -256691, 159478, 331573, -310842, 176345, -161697, 31378, 112091, -28422, 168440, -23767, 129008, 42333, 33455, 281416, 20894, -250418, -110959, -133314, -125140, -85532, -94755, 226749, -184964, -169390, 153089, -44286, 199090, 317803, -168101, -329466, -19426, 15605, 199980, -50781, -171105, 17104, -159469, -57606]
11553a02228l2975K3586I2674d9101C97912A71521a32163j53981B64695F5871
11542F8628J27938p7940c5601A40538h2005C4981e277q3730K6167B38987a47680
11530a42868B55387a8315I750M5427e9585a5713I2560J75397b30354C43169n9540
11519B83629b81872C11961f1353j23795c6309A45518N6485m5756R212p2058Q9957
11508A83358a07013B32254A109P9244j8124C0049K63096A11739L46183E0682M62527
11497E13209A62021R6819l3927m2047M4302q3035C7177M4376K75539P5080J38538
11486E70710C1524L1750C353N66527A30106Q8180A4279M86874A57390j4509K02970
11475C45851l7076e4954l6154A80862L24738a51618B86913R0753j71147f5139
$$ y = [-102228, -135203, -111617, 92674, -49101, 397912, 171521, -132163, -286144, 264695, 65871, 68628, 196566, 118626, -35601, 140538, -82005, 34981, -5277, -89007, -62840, 238987, -147680, -142868, 255387, -18315, 9750, 55177, -59585, -15713, 92560, 267957, -230354, 343169, 283629, -281872, 311961, -61353, -185148, -36309, 145518, 202003, 156247, 165459, 93401, 183358, -107013, 232254, 1109, 80353, 62229, 30049, 293145, 111739, 457922, 50682, 513209, 162021, 258840, 224913, 182866, 227168, 144133, 37177, 81553, 357092, 432172, 570710, 31524, 63274, 3353, 569880, 130106, 218286, 14279, 501153, 157390, 142881, 345851, 308775, -54954, -91108, 180862, 505600, -151618, 286913, 377666, 206519, -65139]
11464c1563A12387n1835A1057K29774L9023J2448b42078a09781F9716g3143j02985
11453a76128D6192J39963f852H3605J43684f0018A17668J19261q1797c3372D013
11441A76007k8444a66152D0094a03877q8530A87033a01567I0659k1347a85984
11430B15064d65449B001a42217N8110F8244J66509e5254j1438j36894F2721J18924
11419A81645a0762j5078C3423b15739D7878a56765F9224J21248b747A50003f7573
11407B11629N845H8204i5001C43639c6727B29055b33673B84016a81819p4895k7938
11396b84652F9756J12622a11158D9138J68929d56355a3587j66343a7709r6356
11386a14065K3009J4776j42283B9337a02210C50828a83447j03427B05825d7061
$$ y = [-31563, 112387, 60552, 11057, 240831, 279854, 292302, -242078, -109781, 69716, -73143, -176128, 46192, 186155, -6852, 83605, 227289, -60018, 117668, 236929, 155132, -33372, 4013, 176007, 147563, -166152, 40094, -103877, -192407, 187033, -101567, 90659, 69312, -185984, 215064, -465449, 2001, -142217, -84107, 68244, 234753, -55254, -66692, -203586, 62721, 181645, -10762, -25840, 33423, -215739, 47878, -156765, 69224, 190472, -2747, 150003, -67573, 211629, 217474, 88204, -95001, 343639, -36727, 229055, -233673, 284016, -181819, -256714, -284652, 69756, 182378, -111158, 49138, 218067, -456355, -13587, -179930, -17709, -114065, -91056, -76280, -218563, 29337, -102210, 350828, -183447, -286874, 205825, -47061]
11375A93716e8910k13950c9794c74k40219J01090G0860H641a08575C0066a54624
11363c10374j12065R0098A7293c4525B7722f6684j22931A57416M0760c661l79043
11352c82704A0627J70661J46495a19272C8914K87910n5450B7333J31725b952A69975
11340a41203M1934D0675J89473i0918A06348B1632a74925j2035A7370a19240e2283
11328B26834d88516g762C5790Q9551J56856I6727a34588E6295f4315p6573N6115
11317h4773J1761K2641r2545M7303C39220h3781n4643H6084B354M0752a69314
11305a47727j260j66523G4571a43959o0325a5465A98292m7004a09852L8389a6451
11293a36459a8304p6513A36344d4709R257E1765b19433A57113i0484B30276b43002
$$ y = [193716, -58910, -272860, -39794, -374, -240593, -139503, 70860, 8641, -108575, 30066, -154624, -310374, -422439, -332341, 17293, -34525, 27722, -66684, -189615, 157416, 198176, -3661, -382704, 10627, 181288, 327783, -119272, 38914, 326824, 271374, 27333, 159058, -2952, 169975, -141203, -99269, 40675, 230148, -90918, 106348, 21632, -174925, -186960, 17370, -119240, -52283, 226834, -488516, -7762, 35790, 125341, 282197, 96727, -134588, 56295, -64315, -140888, -84773, -73012, -50371, -142916, -95613, 339220, -83781, -138424, 86084, 2354, 43106, -169314, -147727, -148987, -315510, 74571, -143959, -204284, -15465, 198292, 151288, -109852, -71463, -16451, -136459, -18304, -94817, 136344, -44709, -35452, 51765, -219433, 157113, -90484, 230276, -243002]
11281H5159a41518O8536C8542L03470A0616P954b55207A32512b03966F0476J22434
11270A82910L3592A9810b62688I3626i955j50166N9429d6052k23707a18715C23749
11258A72856q2320M18665j79802a77648Q5329n4693I8084b31531a08690k20287
11248c28977K5606e7938F3277b16499i5050a777n0237r4122o5173O5343E3464
11236H2993b35586A8970g2406j25129b9917k50168d4946B74264a79442A4048b39383
11224a82183C22615I9183h027C4995J99130d34126C9617a2795j54161m4318m6189
11213b57463j4969I5517b4574A55881b63469J22879j14310B20246b15549B7643
11202a38320c5068r4613A90685o5305j2495h6077j0907A17587J3166K12433e87602
$$ y = [85159, -141518, -72982, 38542, 342012, 10616, 18570, -255207, 132512, -203966, 60476, 182910, 216502, 19810, -262688, 93626, -9955, -160121, -100692, -46052, -269759, -118715, 323749, 172856, 90536, 509201, 329399, -177648, -92319, -147012, 98084, -231531, -108690, -328977, -303371, -57938, 63277, -216499, -95050, -1777, -52014, -146136, -211309, -145966, 53464, 82993, -235586, 18970, -72406, -197535, -29917, -280085, -44946, 274264, -179442, 14048, -239383, -182183, 322615, 99183, -8027, 34995, 234125, -434126, 39617, -12795, -166956, -211274, -257463, -272432, 95517, -24574, 155881, -263469, -140590, -254900, 220246, -215549, 27643, -138320, -35068, -129681, 190685, 125380, 112885, -86077, -96984, 117587, 130753, 343186, -587602]
11190g547j4805j5022p1211C5846a15876k5182k50601a12393b4139l9625k04158
11179b67922E0586h4943j2703J3104A18221K18237a73500M5457A85181a47217
11168d8500B64943c84822A2715J0927f4789j86498h5448B33436i3827q9261N6899
11157a26189D47447e2122k63202a40186b7085o2429j04180J8571m5111B18358
11146A65704n0726f6974j60898F7605h227H5364a97934b796j12852C35950l7903
11135B98047A16795J7023D6960R5731a51944d2306B68293D6733K4774J55221E3470
11123E6762J64410n0654l1873d7754B51339A07826a03169D7525M816Q6680O5366
11112B04387a63605C56274A44312J06667g554G3456K9558O63J17790b0302G9172
$$ y = [-7547, -22352, -37374, -108585, 35846, -115876, -141058, -391659, -112393, -24139, -63764, -267922, 50586, -84943, -97646, -84542, 118221, 336458, -173500, -128043, 185181, -147217, -48500, 264943, -384822, 12715, 23642, -64789, -251287, -85448, 233436, -93827, -183088, -126189, 447447, -52122, -315324, -140186, -27085, -89514, -193694, -175123, -220234, 218358, 165704, 114978, -66974, -227872, 67605, -8227, 85364, -197934, -2796, -115648, 335950, 298047, 116795, 133818, 46960, 142691, -151944, -42306, 268293, 46733, 71507, 226728, 53470, 56762, 221172, 170518, 138645, -47754, 251339, 107826, -103169, 47525, 52341, 139021, 204387, -163605, 356274, 144312, 250979, -7554, 73456, 103014, 103677, 221467, -20302, 79172]
11100B04818E4985O6944L0938d783C02041j39004j940d3832C48789g2797C67123
11088B13072M1798R2553A11338Q6171r5752D1513J65665J05134C8131L47151J42380
11077E27662E2567K52916j16461Q2336L2343J16465A86022J54784L32010A97093
11066A10805J55626Q5398Q8345o6464K21250j45044O2431J89122K08854l133j91728
11055G15462j74181N4020J56646J15587j07722k2087C26540N43389l64676K89642
11045G94895J63761j44117k9221j40529J19639o4031K42510r3872M4119j07676
11035G85478k0153r9745j2866L3995k39085L26688L0444k14424J36070m7185K48088
11024I27305K94C39747J61607N2231M18094D41007M33588k33257j33649P8197
$$ y = [204818, 54985, 121929, 152867, -4783, 302041, 163037, 161097, -43832, 348789, -72797, 367123, 213072, 254870, 347423, 111338, 197509, 101757, 41513, 207178, 312312, 38131, 385282, 527662, 52567, 305483, 189022, 271358, 303701, 420166, 186022, 340806, 672816, 197093, 110805, 266431, 351829, 440174, 373710, 594960, 449916, 512347, 701469, 910323, 907190, 715462, 541281, 595301, 751947, 867534, 759812, 737725, 326540, 869929, 505253, 794895, 958656, 814539, 785318, 644789, 764428, 700397, 942907, 849035, 893154, 785478, 765325, 665580, 652714, 686709, 447624, 774312, 804756, 590332, 726402, 679217, 927305, 927599, 339747, 501354, 553585, 971679, 441007, 874595, 641338, 507689, 585886]
11014E85886j31654J12356L5822L82932o7663B10959N24729j93320J03475j49403
11004D96440j6701o8986N0094L39632q2759j97475O9121J67421C59681L60203
10994G19884j15011J9962J21764k16111K12793J08378K11019j05099J18954j94198
10984H82335K84654l29704O01770R4968p7205J93103n4586N30385Q7309L27522
10974B540551K56043L40740q971K72530m63952k36054k59210j76289j11432o52268
10964A501688j20903J09777k38132j03771p498r0045L05489K816k80796k17615
10954H61010j00949J31823l64081O0784j68424Q4760J42832B64476p2522M3060
10944B35014j09974k5881K792J95206G3952C4738J23952g075B04735p1441K31418
$$ y = [585886, 454232, 566588, 602410, 985342, 917679, 210959, 735688, 542368, 645843, 496440, 479739, 410753, 460847, 800479, 717720, 520245, 589366, 756787, 359681, 719884, 604873, 624835, 746599, 530488, 743281, 851659, 1062678, 957579, 1076533, 882335, 1166989, 837285, 1439055, 1534023, 1456818, 1649921, 1595335, 2125720, 2213029, 2540551, 2796594, 3137334, 3128363, 3400893, 2936941, 2700887, 2441677, 2265388, 2153956, 1501688, 1380785, 1490562, 1252430, 1148659, 1141161, 1051116, 1356605, 1359421, 1078625, 861010, 760061, 891884, 527803, 588587, 420163, 504923, 647755, 264476, 191954, 235014, 125040, 99159, 101951, 297157, 73952, 34738, 158690, -7075, 204735, 133294, 364712]
10933C64712j46149a79169H880c99235A08226d10623B15576o4476p4706M7752
10923A24146j5495i3144A7242K21247O778a6984B6156J38319D1244J5582B2831
10911G0045k8130f4315J7077D132a30949m3246B41982F472L01301a54852F2812
10899c9917A20620d4025k98855A23050b0519C1954Q6133g8924A26345f9201j32163
10888b01364C7272a29718A8242a37579e2646k23056A30917a37674j29344H7321
10877A51303a21676l3114a7028m2141k92010b7371m17356D489j02b02789h2555
10865F7587L1193b15073I6535g4347A10116J46702j27515d37743d3560m2595F6208
10853b92747b3486o4097B93245a0446G3917K9974A0112P9465L2508E5996PJ00719
$$ y = [364712, 218563, -179169, 8880, -399235, 108226, -410623, 215576, 151100, 76394, 124146, 108651, -93144, 17242, 238489, 245267, -16984, 26156, 164475, 41244, 56826, 22831, 70045, 41915, -64315, -47238, 4132, -130949, -174195, 241982, 6472, 307773, -154852, 62812, -39917, 120620, -44025, -342880, 123050, -20519, 31954, 118087, -78924, 126345, -69201, -201364, 37272, -129718, 18242, -137579, -52646, -275702, 130917, -137674, -267018, 87321, 151303, -121676, -154790, -17028, -59169, -351179, -27371, -444727, 4489, 4387, -202789, -82555, 67587, 98780, -215073, 96535, -74347, 110116, 256818, 129303, -437743, -43560, -86155, 66208, -292747, -23486, -87583, 293245, -10446, 73917, 103891, 10112, 89577, 122085, 55996, 56003, 156722]
10841A56722a89915f9747B58287n7040a45053k83599a4206j91891C14030A15933
10830G5732K2829a7797j91609C01247A20275a78598P6012A31457c85242Q3524
10820c01718P0129A51563J47582P534g7376j27810K9167A21235b43262a18829
10809c41809a51519K8035E5312Q5739a98550D008a12981B95383j24392O5180j7875
10798B18296b19368K7992I2624k6464b08465Q5993b6661F7179k9797g8989c0808
10786a26076a6623A70428A3342L6194K7312a93118A90016h2385b5531k68163f8951
10774a30946a1439A08225b35797A01703J04773a40898I6888K752D3843f8949k26629
10763b95578a11617j22357B75497m05d00966e1313j15652A88869b9666l19038
$$ y = [156722, -189915, -69747, 258287, 201247, -145053, -428652, -14206, -206097, 314030, 115933, 75732, 98561, -17797, -209406, 301247, 120275, -178598, -102586, 131457, -385242, -301718, -231589, 151563, 299145, 306679, -77376, -205186, -176019, 121235, -243262, -118829, -341809, -151519, -123484, 55312, 141051, -198550, 4008, -112981, 295383, 170991, 236171, 218296, -219368, -191376, 92624, 66160, -208465, -122472, -26661, 67179, 37382, -78989, -30808, -126076, -16623, 170428, 13342, 49536, 76848, -193118, 190016, -82385, -25531, -293694, -68951, -130946, -11439, 108225, -235797, 101703, 206476, -140898, 96888, 99640, 43843, -68949, -295578, -111617, -233974, 275497, 275092, -400966, -51313, -166965, 188869, -29666, -348704]
10753c48704A01695B1587K7952O1123b33929D6N4588O9575e4889l21126J75021
10742b00994N9592n9557P2230L2374b5377k86445B02732p8116a32182A12065d05958
10730A12037K02046A46638a55194b676k5518J0614l55911H2213b09450g0320F8580
10718A69764d1649k52481A28568b39073g0003b9265R904C9386a50595A94294d9788
10706f6291A73918c31436d2722N699I4793a05997B74907h0111K7086j73365O9968
10695a56422I3957K13619F0138d2720k22467C29192c6463H6135d9313A37188b23258
10683B1191f7029C0429N4452b48073f0597j62370a5288j26924O014A31663D4219
10671F8183a6448q333B32695d16942f6608j77109A26994i5838A43120b90308g907
$$ y = [-348704, 101695, 21587, 49539, 110662, -233929, 46, 54634, 124209, -54889, -376015, -200994, -141402, -200959, -128729, -96355, -25377, -311822, 202732, 124616, -132182, 112065, -405958, 112037, 314083, 146638, -155194, -2676, -28194, -17580, -373491, 82213, -209450, -70320, 68580, 169764, -41649, -294130, 128568, -239073, -70003, -29265, -19361, 39386, -150595, 194294, -49788, -66291, 173918, -331436, -42722, -37023, 94793, -105997, 274907, -80111, -53025, -226390, -156422, 93957, 307576, 60138, -42720, -265187, 329192, -36463, 86135, -49313, 137188, -223258, 21191, -67029, 30429, 84881, -248073, -60597, -222967, -15288, -142212, -136198, 131663, 44219, 68183, -16448, -24781, 232695, -416942, -66608, -243717, 126994, -95838, 143120, -290308, -7907]
10659i3286B12824b96969f6756j23601j8345D972a20252G0226b55935M6479L2469
10648a76987O5152A78297a21173B2656e9138A20846a99783d1877p5535c6454G2293
10636A32965J81690j53423a68981B31938j12940d50624e6163m0989f054j24093
10626a30147N2858j44575A73539d3484I9545a2729m9783j70726A48458d7609D2867
10614a60912D346L6687O5175c1546A55897l6823a04363A17283c5987j24366C2439
10602a99524g8390k3173J2871D9287A0561b33787f2545H3168f7189k61167J9157
10591c09199C22434G8636h5484j1927d8109j78429A08273J43909j01864a77253
10580F505J50724C0161a44382D9916d2295o8729g152j03772C49148a59155g951
$$ y = [-93286, 212824, -296969, -66756, -190357, -208702, 4972, -120252, 70226, -255935, -209456, -176987, -111835, 178297, -121173, 22656, -59138, 120846, -199783, -41877, -117412, -36454, 72293, 132965, 314655, 161232, -168981, 231938, 118998, -450624, -56163, -97152, -6054, -130147, -77289, -221864, 173539, -43484, 99545, -12729, -62512, -233238, 148458, -47609, 42867, -160912, 4346, 41033, 106208, -31546, 155897, 119074, -104363, 117283, -35987, -160353, 32439, -199524, -78390, -101563, -88692, 49287, 10561, -233787, -62545, 83168, -67189, -328356, -309199, 322434, 78636, -85484, -97411, -48109, -226538, 108273, 252182, 150318, -177253, 6505, 157229, 30161, -144382, 49916, -42295, -111024, -7152, -110924, 349148, -159155, -7951]
10568F3788B5013b44605l7929a12842j47455A46879c6717j1288A15525D1648a13022
10556g8315b3267p91r195F569M6407b0719j19161A41437a67390N9877H2146e215
10543d252r7629q23G5442g0077j52309P5401J9648E6050c7464B22346a13806R307
10531a04499b4815A91840q6915b5792j84767B24486e2240q8986j14987D0874e2219
10519d3127a109p4506A19307c951B90736a55181c6186A30364C8852d5101k21637
10508b66738g4969a3950j87339B52987C0039Q1968a11656L8527o1250e3374C577
10496a27257K4406E094c1505A31347f0509A36312o3021b0861j53692K0114N6167
10485i8272F2575J68249J61707o3134b04776L9200O075K4107B19035K62241D3799
$$ y = [63788, 25013, -244605, -282534, -112842, -260297, 146879, -36717, -48005, 115525, 41648, -113022, -78315, -23267, -24058, -33253, 6569, 52976, -20719, -139880, 141437, -167390, -107513, 82146, -5215, -4252, -101881, -102704, 75442, -70077, -222386, -146985, -127337, 56050, -37464, 222346, -113806, -104499, -24815, 191840, 104925, -25792, -210559, 224486, -52240, -141226, -256213, 40874, -52219, -43127, -1109, -75615, 119307, -3951, 290736, -155181, -36186, 130364, 38852, -45101, -266738, -74969, -13950, -201289, 252987, 30039, 112007, -111656, -73129, -134379, -53374, 3577, -127257, -102851, 5094, -31505, 131347, -60509, 136312, 73291, -20861, -174553, -154439, -98272, 62575, 230824, 392531, 329397, -204776, -165576, -159501, -135394, 219035, 481276, 43799]
10473i9897H8206C1222A4260J74740q1536J33710b75767P2174M4340B33625n5643
10462A77982a76239A13091A8907P6414L9590b06303J8524N6649C9135d8874B75410
10450d01289B8911N6591b13244F7191a10924G5770b6200m4326B46374f445I6871
10438b25513M4177E4814d91517D932c28700H1753a99018E7714a86243F2010a70122
10426b27704A9175R4650i7442b7802B5961J03060A0963J14170A8511J85853N3888
10415B58252d0837k5820j16607j30349A5544Q7718a25014A33112d42159B1945
10404b5619j83770C6314P3543a57686H2010a60479N8103M3574I2906A7790R9174
10393A16964c54930D51844j04481j51495K03106A31880k1695c674A54088D9579
$$ y = [-99897, 88206, 31222, 14260, 189000, 107464, 241174, -275767, -203593, -159253, 233625, 177982, -176239, 113091, 18907, 95321, 134911, -206303, -187779, -131130, 39135, -48874, 275410, -401289, 28911, 85502, -213244, 67191, -110924, 75770, -26200, -70526, 246374, -6445, 96871, -225513, -181336, 54814, -491517, 4932, -328700, 81753, -199018, 57714, -186243, 62010, -170122, -227704, 19175, 113825, -97442, -27802, 25961, 129021, 10963, 125133, 18511, 204364, 258252, -40837, -66657, -183264, -313613, 15544, 103262, -125014, 133112, -442159, 21945, -25619, -209389, 36314, 109857, -157686, 82010, -160479, -102376, -58802, 92906, 17790, 116964, -354930, 451844, 347363, 195868, 398974, 131880, 110185, -3674, 154088, 49579]
10382A76168i9708l292G52K97381K898e5547A47662J07598L20187a73097D57163
10370B24403L40895J01523j27411k46970J88309B18378m81J22740E922J70451
10360A76373J52954j05859c11345J30803C58684I2293K20338P2880J42286K3996
10350E51793K76530B23176K1430g1249A76354M26717r0458K7848A13781M894J09344
10339B28019A08515R2941n2675h899C44226A7283R5136C2545J54911o9110a55867
10327B66809j08633g7364F7209B1324L76194l462B1787M7731J12628h7818D23455
10315a21623d0373A31680i1808A79279b3411j2096D0230a37093r4523c5043B347
10303A22028L9584a84548o0869c6189H4434b50458B28084E5573b03552L3327A64512
$$ y = [176168, -99708, -103000, 752, 298133, 301031, -55547, 147662, 255260, 575447, -173097, 457163, 224403, 565298, 666821, 539410, 292440, 480749, 218378, 217897, 340637, 5922, 176373, 329327, 223468, -311345, -180542, 358684, 92293, 312631, 385511, 527797, 551793, 828323, 223176, 244606, -71249, 176354, 603071, 512613, 540461, 113781, 118675, 228019, 108515, 201456, 148781, -8899, 344226, 17283, 112419, 32545, 187456, 118346, -155867, 266809, 158176, -77364, 67209, 21324, 397518, 394056, 21787, 69518, 182146, -87818, 423455, -121623, -40373, 131680, -91808, 179279, -23411, -35507, 40230, -137093, -231616, -35043, 2347, 122028, 161612, -184548, -245417, -36189, 84434, -250458, 228084, 55573, -203552, -170225, 164512]
10291G8010f3936q9760M6058L479I7453J47805c36062K3170d3889a7659m7793
10280f5452m4137N3635h247I2707c25717C7050N1901b0522m9796C01124a36604
10268a2473A52183J4711b79710A28635R1929k1389n0860J56539J12358A76595
10257E106h7298F5223Q4052a65304D50618i3647A89663c73716a82095L1000l07819
10246d58914A18353b28979A20343N7405B4311a34642C30384c53532a52581j68838
10236c21419C26513b365p5196k08464A41554a01534j0877M9353L0344j5285F0092
10224I3376K38571b8365A94638D4488A7719Q8647e0596n4756F0706J29984g6307
10212a49442f1493B63567e6j17948j27112i4060A03990e7181K699k6548B47380
$$ y = [78010, -63936, -153696, -107638, -104159, 97453, 245258, -336062, -312892, -43889, -17659, -65452, -109589, -55954, -8247, 92707, -325717, 37050, 88951, -20522, -70318, 301124, -136604, -12473, 152183, 166894, -279710, 128635, 220564, 199175, 148315, 304854, 417212, 176595, 5106, -87298, 65223, 149275, -165304, 450618, -93647, 189663, -373716, -182095, -151095, -458914, 118353, -228979, 120343, 177748, 24311, -134642, 330384, -353532, -152581, -321419, 326513, -2365, -77561, -286025, 141554, -101534, -112411, -63058, -32714, -47999, 60092, 93376, 331947, -28365, 194638, 44488, 17719, 106366, -50596, -105352, 60706, 190690, -76307, -149442, -61493, 263567, -56, -118004, -245116, -94060, 103990, -57181, -54482, -81030, 247380]
10200a36958m7588L1402A52052a74267h5420l2189A06801a29460C0523c13539
10189i4555j40136H3373P6165o0574a94076b4398A75693g4492j13292j5263F1350
10177b0356k33154b8169l0641A97125b99531J0899A24616A9460K22513a41823
10166A71790i1249F1436J43224O844I9657b18546K2215Q3882l2010A2569f3551
10154B43829a84661K5194F8700B9592J40040I414J43739a6940j25564g827l1300
10143c9127n6140o6313C67740d3254I7052m3812a9680F0562c53651a18006C5935
10131a20499j66965A1642c2355j3873A59680c52764J35496A0169b53128A14488
10120f620j6764A18110h7088k4246F2789f5242p2356J5098Q861p8726p9369a17305
$$ y = [-136958, -184546, -153144, 152052, -174267, -85420, -117609, 106801, -129460, 30523, -313539, -94555, -234691, 83373, 159538, 98964, -194076, -24398, 175693, -74492, -187784, -203047, 61350, -20356, -253510, -28169, -58810, 197125, -299531, -288632, 124616, 19460, 241973, -141823, 171790, -91249, 61436, 204660, 211504, 99657, -218546, -196331, -112449, -144459, 12569, -63551, 243829, -184661, -159467, 68700, 29592, 169632, 9414, 153153, -16940, -142504, -7827, -39127, -95267, -161580, 367740, -43254, 97052, 53240, -19680, 60562, -353651, -118006, 35935, -120499, -287464, 11642, -32355, -46228, 159680, -352764, -217268, 10169, -253128, 114488, -6620, -23384, 118110, -87088, -111334, 62789, -65242, -137598, -122500, -113639, -192365, -271734, -117305]
10107b18064j25079A76621g3438k01377n7447h5950E5070J07849C4129c07593
10096C0594a51504j5226C5334j3394a85362d7227m1561n4104n8584h58k88539
10085b89397I3876c6036A51811a02611C4877a39933E6770J24809J46274F7713
10074i6018b0974k34597A04924a40051A02544B0557C500K55053c7487B97151c8487
10062B48057A06993K99104d4814k12733P4256F2076b28025G387a25815o2643a1632
10050g9450l222b5480B0841i9672k52844J1259K8831D5943b78999a3094q5851
10039i8945A22570i8138r0388d1505k91887a30410J0553E2184J18771o5842a06734
10027a59353e5552j32841a9761C466Q3553e8104j1757E9196J51355b15386b6767
$$ y = [-218064, -343143, 176621, -73438, -274815, -332262, -85950, 55070, 162919, 34129, -307593, 30594, -151504, -166730, 35334, 21940, -185362, -47227, -88788, -142892, -201476, -858, -289397, 93876, -36036, 151811, -102611, 34877, -139933, 56770, 181579, 327853, 67713, -96018, -20974, -255571, 104924, -140051, 102544, 20557, 3500, 258553, -37487, 297151, -38487, 248057, 106993, 406097, -44814, -257547, -183291, 62076, -228025, 7387, -125815, -188458, -11632, -79450, -82672, -25480, 20841, -99672, -352516, -341257, -312426, 45943, -278999, -13094, -98945, 122570, -98138, -188526, -41505, -333392, -130410, -119857, 52184, 170955, 105113, -106734, -159353, -55552, -188393, -19761, 3466, 87019, -58104, -69861, 59196, 210551, -215386, -26767]
10015B32761j09207J25931a9413I7520b4235C52642a45351c9211D0035J00021
10005A40056c10529g1897j83102c4811o8011J7738k6949A56473b3541k01057A63271
9993a81343A32630a76910q4556d5070D20999b077j66881r5455h855C12425f2893
9981b85426F3255a66443c6043j66594I9942f3489j22992A273J42970a11588j51037
9970b62625a01388A49246F7125a21152A85092b11914A85f1596r6598D136K1677
9959B5813J60896b47872A18961m5694a78632r5111B03286a28178l2080B82212
9948d13407A59652b38105B79845a87779N3002A5730c36804Q9186i0733B20670
9937h4773l52550A99333a99493A8034J40274b82712a10999m15344C9485K939c57272
$$ y = [232761, 123554, 249485, -19413, 97520, -24235, 352642, -145351, -39211, 40035, 140056, -310529, -71897, -254999, -34811, -102822, -85084, -112033, 156473, -23541, -224598, 163271, -181343, 132630, -176910, -261466, -45070, 420999, -2077, -168958, -264413, -8855, 312425, -62893, -285426, 63255, -166443, -36043, -202637, 99942, -63489, -186481, 1273, 144243, -111588, -262625, -101388, 149246, 67125, -121152, 185092, -211914, 185, -61596, -158194, 4136, 25813, 186709, -247872, 118961, 73267, -178632, -273743, 203286, -128178, -160258, 282212, -413407, 159652, -238105, 279845, -187779, -134777, 15730, -336804, -247618, -90733, 220670, -84773, -437323, 199333, -199493, 18034, 158308, -282712, -110999, -526343, 39485, 42424, -357272]
9925a82360A05968d3537p4368E4600a11698r6653a5218D8765f1753D1691a62018
9913A45351C1129d3235j82466e0880j86395A99089a06302L4999k7321I7170b40246
9901B53314E0481h4298D695a57906A9488P751Q8628b50029R1846l5579F1530O360
9889F7890g4901j06474o5299B90751e2125F4818M67837d46629A18681d3022k82205
9878c25227D4974i4436Q563b3574A96850E1776D164e8659J7671H532a58287n7848
9866b16135m0721A59371i6153k04635b9952A75780c46553e4178C9943a48070B75526
9854A08719n2800P4695d945j49241p980A09005C0529h0408B00087B9042g4610
9842c24956j05691B22365A09347m4125f6754k21841C4085a41364D0104a22529
$$ y = [-182360, 105968, -43537, -117905, 54600, -111698, -208351, -15218, 48765, -61753, 41691, -162018, 145351, 31129, -43235, -225701, -50880, -237275, 199089, -106302, -71303, -98624, 97170, -240246, 253314, 50481, -84298, 4695, -157906, 19488, 27239, 115867, -250029, -158183, -193762, 61530, 67890, -74901, -181375, -246674, 290751, -52125, 64818, 532655, -446629, 118681, -43022, -325227, 44974, -94436, -85873, -23574, 196850, 51776, 4164, -58659, -40988, 8532, -158287, -216135, -256856, 159371, -96153, -300788, -29952, 175780, -346553, -54178, 39943, -148070, 275526, 108719, 55919, 130614, -4945, -154186, -162166, 109005, 30529, -80408, 200087, 29042, -74610, -324956, -430647, 222365, 109347, 65222, -66754, -288595, 34085, -141364, 40104, -122529]
9831A64061p9449h2030j93610A02934K06114a61618e2245j39268m4236h8711J3172
9820g5539L3661j3208G123a14873b7423B076N7342d843G3028P1746c77104J70928
9808b06176E5553a30431l51614A93630c816j89251J6997F300c36503A17718a75462
9796a28388j66410A61645a79129B0643L1485c3198j66425f2410K7252l06772E5229
9784A66525c65199M6280A17039n2590c00504B22151K86306A4832b59967a18753
9773A98498m7820a71517P9393j87761l9703D5882i7299j66290I2462a0062j49738
9762a59800d1582D4709h5779D43123b1598k3431a2849A6861L980J84211a7900
9750a02237k8130c3680o2525l6492A50862g2089j09585b2545j69841a0999E2600
$$ y = [164061, 84612, -82030, -275640, 102934, 309048, -161618, -52245, -191513, -235749, -88711, -75539, -41878, -55086, 7123, -114873, -27423, 2076, 59418, -4843, 73028, 144774, -377104, -206176, 55553, -130431, -482045, 193630, -3816, -193067, -176070, 6300, -336503, 117718, -175462, -128388, -294798, 161645, -179129, 20643, 52128, -33198, -199623, -62410, -35158, -341930, 55229, 166525, -365199, -318919, 117039, 64449, -300504, 222151, 508457, 14832, -259967, -118753, 198498, 150678, -171517, -92124, -279885, -319588, 45882, -97299, -263589, 92462, -10062, -159800, -41582, 44709, -85779, 443123, -21598, -45029, -12849, 16861, 20841, 205052, -17900, -102237, -130367, -33680, -96205, -132697, 150862, -72089, -181674, -22545, -192386, -10999, 52600]
9738b9311J276r9701n6309A35619C7629J2497e7435G4564h3671n9775a2827F8533
9725h337j01637q4390J8546f2735l3633D6303i2193L6795k49663h40l83325Q0676
9713c03489e1117m7468H1614b63636c4562p1946q787k0327p7693k92224D2798
9701c9869a4631B76988c82454g5775A68420a47661k30646a38074H6127a77061
9690h3351A26704c40162g4452m1224j02066o0926a10176A62163J76902b19552
9679a57605A23255d00679B45847c6448E5320P5079a07369D3096N2144a86427c78
9667a26768J8216A31931b64107A02647O2401d1006l1837j19943A1732h6169j75685
9656b61854M5493R7419A12036A2404c0464j51501Q7599D0067K474J49721J8953
$$ y = [-29311, -28035, -127736, -184045, 135619, 37629, 50126, -57435, 74564, -83671, -143446, -12827, 68533, -8337, -109974, -194364, -175818, -62735, -96368, 46303, -92193, -55398, -305061, -840, -384165, -303489, -51117, -98585, 81614, -263636, -34562, -106508, -115295, -135622, -213315, -505539, 42798, -39869, -14631, 276988, -382454, -75775, 168420, -147661, -378307, -138074, 86127, -177061, -83351, 126704, -340162, -74452, -115676, -217742, -278668, -110176, 162163, 339065, -219552, -157605, 123255, -400679, 245847, -36448, 55320, 130399, -107369, 43096, 95240, -186427, -378, -126768, -108552, 131931, -264107, 102647, 165048, -41006, -72843, -192786, 11732, -86169, -261854, -216361, -118942, 112036, 12404, -30464, -181965, -94366, 40067, 42541, 192262, 211215]
9645B11215c13555g0123A35828J02061I3117c8402l30439E5114O5776b59421J26658
9634a32763M8273A71133p6792b07628N8500n1189G2077d7944B21052a21025D6374
9622A16840a79708k23481J16611P9754g9562a9593F7434d980A64998N4431O445
9611B25874a10605b7686j46947f5768k4724a1361B5709b79370P9351k16316A08903
9599f0641A74493e3041A78476h2583j22385J02380k4434D34452C5586M3993O8540
9588A48119h5265j63679M9802h5354B2645J19624a12383B7510M0083c14283A43403
9576a99225j51663A76422g5640D1183a55205p811B88806G5986g8475B2869a24244
9564A9711J90040a60540N6290B8552b30035H4859c2468j45507F2149b00325g7677
$$ y = [211215, -313555, -70123, 135828, 237889, 93117, -38402, -368841, 55114, 120890, -259421, -132763, -84490, 171133, 94341, -207628, -149128, -200317, 72077, -47944, 221052, -121025, 46374, 116840, -179708, -403189, -286578, -206824, -79562, -19593, 67434, -4980, 164998, 219429, 225874, -110605, -27686, -174633, -65768, -90492, -11361, 25709, -279370, -200019, -416335, 108903, -60641, 174493, -53041, 178476, -82583, -204968, -102588, -127022, 434452, 35586, 79579, 148119, -85265, -248944, -199142, -85354, 22645, 142269, -112383, 27510, 67593, -314283, 143403, -199225, -350888, 176422, -75640, 41183, -155205, -163016, 288806, 75986, -78475, 22869, -124244, 19711, 209751, -160540, -104250, 28552, -230035, 84859, -32468, -177975, 62149, -200325, -77677]
9552e3060A60596c25042G0572a65613f3109b6366q0439j76720C8110e1651C41451
9540G5948i9635b7318r4167j81000b7786j53484J83a1290k02861e1015A69700
9528d04330G5238a15611p2749q3972L8221g362n6977j07373A14493j4325b80022
9516b46937A21771c19454i2383j78838e0569A87683a76911B79125f0175B26370
9505B72369c6375n04k35236E0037A6167L0943c96708C1906Q1943A3532i2321k7814
9493a20135A30180A8360a4839A7708M2995a45269K2418k92203J66718b0318A5049
9481e0084I0530b4697j70607o2797b8459A96438r3071J99919a67943L0516Q642
9470a28785B62115o2004h1213j50108Q7200d8937k57553g8919B7925b00960B8171
$$ y = [-53060, 160596, -325042, 70572, -165613, -63109, -26366, -106805, -283525, 38110, -51651, 341451, 75948, -99635, -27318, -121485, -302485, -27786, -181270, -181087, -11290, -214151, -51015, 169700, -404330, 75238, -115611, -188360, -272332, -234111, -7362, -64339, -171712, 114493, 100168, -280022, -246937, 121771, -319454, -92383, -271221, -50569, 187683, -176911, 279125, -60175, 226370, 272369, -36375, -36879, -272115, 50037, 16167, 47110, -396708, 31906, 113849, 13532, -92321, -120135, 130180, 18360, -14839, 17708, 60703, -145269, -122851, -415054, -248336, -20318, 15049, -50084, 90530, -24697, -195304, -258101, -28459, 196438, 103367, 303286, -167943, -137427, -128785, 262115, 200111, -81213, -231321, -144121, -48937, -306490, -78919, 27925, -200960, 28171]
9458A01402g9666E6778a17556j66389R3852p951D1517c5232j73651C7567R2498
9447A30065e1097p7956M6448C391J00280m641h0458j5253o2352A51539c2996k0428
9435e3424r5962l4444D4394b52416A90473G7599i1963A03692f9895o9442E1356
9423a63033k26826j47597e5690A43067K49146F5322a47947q5661J05137B75386
9412A3893a15232C8311N1962C6157b6783k1790j85551e3791j12050d0055A19464
9400a10560J7155L9737A44762Q9035f7752m2720k4308j34772K9277i2933M541
9389h8392k43911B4648L7170a57580C1118b61412A70544e17319f6703H126f2036
9377B5450b20589e2124A71553b11845G268a60720P305e4290j58876L1645c4412
$$ y = [101402, -79666, 56778, -117556, -283945, -190093, -198044, 41517, -35232, -208883, 37567, 130065, -51097, -129053, -82605, 3391, 103671, 99030, -80458, -95711, -158063, 151539, -32996, -53424, -149386, -183830, 44394, -252416, 190473, 77599, -91963, 103692, -69895, -139337, 51356, -163033, -389859, -537456, -55690, 143067, 392213, 65322, -147947, -233608, -128471, 275386, 13893, -115232, 38311, 90273, 36157, -26783, -48573, -234124, -53791, -165841, -40055, 119464, -110560, -93405, -53668, 144762, 233797, -67752, -110472, -134780, -269552, -240275, -92933, -88392, -332303, 24648, 61818, -157580, 31118, -261412, 170544, -517319, -66703, 8126, -62036, 25450, -220589, -52124, 171553, -211845, 7268, -160720, -153415, -54290, -213166, -181521, -34412]
9365a08559j86572A16713f5149k33209l3989d9767F3060a95284o6953J29440A59547
9353a23023D6931a59285k5132B0861a42555B5458d74901e3236A44046g5861j58921
9342b34782A46635b04537j8843J07220A643K41632M6972b11061F5514B0222J10848
9331A31070b41171d3213H2611i9633j64843C8401i1165a5328C28236a69231A55222
9319C75079j74448a70423P8797k44045a07368n5717F1759M2813b97091I4285a23183
9307C1425K67068B0193P986a73270b0925K623j40312F3237a71137d1743A77538
9295a71469c2605C43339j47936a85855A40089b9656J2084C8816b35528G9360J15534
9284A94894a13542a2797F0367K7900c02188J02930B30562b53883j84820h9402
$$ y = [-108559, -295131, 116713, -65149, -298358, -332347, -49767, 63060, -195284, -262237, -132797, 159547, -123023, 46931, -159285, -184417, 20861, -142555, 25458, -474901, -53236, 144046, -75861, -234782, 146635, -204537, -223380, -116160, 1643, 243275, 290247, -211061, 65514, 20222, 131070, -241171, -43213, 82611, -99633, -264476, 38401, -91165, -15328, 328236, -169231, 155222, 375079, 200631, -170423, -91626, -335671, -107368, -163085, 61759, 104572, -297091, 94285, -123183, 31425, 298493, 20193, 28179, -173270, -20925, -18302, -158614, 63237, -171137, -41743, 177538, -171469, -32605, 343339, 195403, -185855, 140089, -29656, -17572, 38816, -235528, 79360, 194894, -113542, -12797, 60367, 88267, -302188, -199258, 230562, -253883, -438703, -89402]
9273b2263o5374j21658f4715C28737A61757B2012J17257o5993b34417A04159O6613
9262A70772m547n6450m2271J9789Q1226d04910A58296b06281F7926b16759f1753
9250c26523g4728m7088d2400G980P1558K36646d5421A91565g2788j84150R8557
9239a58381n70G2092c3909j01141j18651B39356a29021L223B5277b89547A77434
9227a4926l40653A25279D0214P7930m1798d3532n9053J1752A12238a61603B90521
9215a38360o8452k61522K13645B5426a47286n649K6656a1090m1749m0042k00098
9204b92979i1440K6483E309J40993b03379B7811K51485a36209A86697d1381A2726
9192c61556f0684j58581j20538e2278l52285A91441a05101B7928b37106b0673
$$ y = [-22263, -87637, -209295, -64715, 328737, 161757, 22012, 139269, 73276, -234417, 104159, 170772, 166225, 109775, 67504, 87293, 168519, -404910, 158296, -206281, 67926, -216759, -61753, -326523, -74728, -121816, -42400, 7980, 79538, 316184, -45421, 191565, -72788, -256938, -158381, -158951, 72092, -33909, -135050, -253701, 239356, -129021, -125798, 25277, -289547, 177434, -14926, -355579, 125279, 40214, 118144, 76346, -43532, -102585, -90833, 112238, -161603, 290521, -138360, -206812, -468334, -254689, 25426, -147286, -152935, -126279, -11090, -52839, -92881, -292979, -91440, -64957, 5309, 146302, -203379, 27811, 279296, -136209, 186697, -41381, 12726, -361556, -60684, -219265, -339803, -52278, -404563, 191441, -105101, 27928, -237106, -20673]
9181b65750K9908C71665i8230Q135m9101f5445j93430G191c92727E2088a30608
9169e7701A38225n3641K80937F3590g1200A60236b7537k33677A87558F7887d08887
9157a913A3644b78333G5563i8930C27a45324c5725A27458Q2756e3668C35108b56172
9144F8912d68242b06792m1579A84044L518b27006g0107b4207l96290J8740g9111
9132I4042b02834O8307D9110a07369A29788i1961l999A0520b70050i3478C02639
9120b25479o3134F9088a38650C64158A102J42296c1208A55719L937D4411a99867
9108f6280A33825j3934c2693a4682D5763a80246j54522L9105b6071j1039D6786
9096g0047A9713a06736q9915L5324j20086a03830k07214a30115j66962n7332Q9550
$$ y = [-265750, -235842, 371665, -98230, -90095, -139196, -65445, -258875, 7191, -392727, 52088, -130608, -57701, 138225, 84584, 365521, 63590, -71200, 160236, -27537, -261214, 187558, 67887, -408887, -1913, 13644, -278333, 75563, -98930, 327, -145324, -35725, 127458, 210214, -53668, 335108, -256172, 68912, -468242, -206792, -248371, 184044, 187562, -227006, -70107, -24207, -420497, -401757, -79111, 94042, -202834, -134527, 49110, -107369, 129788, -91961, -95960, 10520, -270050, -93478, 302639, -225479, -288613, 69088, -138650, 364158, 1102, 143398, -31208, 155719, 159656, 44411, -199867, -66280, 133825, 119891, -32693, -14682, 45763, -180246, -334768, -295663, -26071, -37110, 46786, -70047, 19713, -106736, -196651, -161327, -281413, -103830, -311044, -130115, -297077, -354409, -264859]
9085b64859B7991a21106k51282a1717A6310f3609a9098k86215B8931i551q0206
9074h9757E4467b04678a8750k01339C308J42926d82788B0768J52689h0283F1072
9062b43584B60696h3203F7461B8985b36065a16227A75916b16460j67424a16046
9051a62160K2417C0091a3605H6771a49321k50915Q4874A02646b5565j62831j44243
9040c32639C40554b72488h7556A58927a74886N878L6460M6927E3303R4635c89688
9028b44606N9288f7385r896G7003c21703J26776B2581R4798a74754H467K33844
9017B42311h8777j17824A4515g9029Q229D2862c3164C0251i4610j20951a02568
9005C25121b67730A24392D143b81567f2463j26512A49801F9639a49211D2300c1346
$$ y = [-264859, 27991, -121106, -372388, -11717, 16310, -63609, -19098, -305313, 28931, -9551, -89757, 54467, -204678, -18750, -220089, 3308, 146234, -482788, 20768, 173457, -80283, 61072, -243584, 260696, -83203, 67461, 28985, -236065, -116227, 175916, -216460, -383884, -116046, -162160, -139743, 30091, -13605, 86771, -149321, -400236, -315362, 102646, -25565, -188396, -332639, 340554, -272488, -87556, 158927, -174886, -169008, -132548, -85621, 53303, 147938, -389688, -244606, -185318, -67385, -77281, 77003, -321703, -194927, 22581, 117379, -174754, 8467, 242311, -88777, -206601, 14515, -79029, -70800, 42862, -33164, 30251, -94610, -215561, -102568, 325121, -267730, 124392, 4143, -281567, -62463, -188975, 149801, 69639, -149211, 42300, -31346]
8993c3840A8963f3030B65803r0579a33315j34738G6604a52863c5145B394J94657
8982A97051a92315Q5410G9962i2836A90220d5110m231p6971l5008k25003a69986
8970A9638b91174c5158j4160l88318C3665E461b80328C3018b63690M6512M9296
8959a67882L3238f2193j3256j0567A08365a06194j8249A30076B0195J43639a3290
8947G8342j5035P7770a82322p8110k411B9270a45091C5474a63148A17687K3349
8936A41036R6862J76986j92624H4110J7181i0974A03364r010K74716L9178j43270
8925B64978O20139J541711L869736R854544G633483B361824A101870k56518A43099
8915C82965A31439b6379k97646g8941D1017L57583J37610j12024A94298d2246
$$ y = [-33840, 18963, -63030, 265803, 175224, -133315, -268053, 76604, -152863, -35145, 2394, 197051, -192315, -106905, 79962, -92836, 190220, -45110, -49341, -126312, -161320, -386323, -169986, 19638, -291174, -35158, -49318, -437636, 33665, 5461, -280328, 33018, -263690, -217178, -167882, -134644, -62193, -75449, -86016, 108365, -106194, -124443, 130076, 20195, 163834, -13290, 78342, 63307, 141077, -182322, -260432, -262843, 29270, -145091, 35474, -163148, 117687, 141036, 237898, 414884, 222260, 84110, 101291, -90974, 103364, 94354, 369070, 408248, 264978, 885117, 2426828, 6296564, 16151108, 7633483, 2361824, 1101870, 845352, 143099, 382965, 131439, -26379, -324025, -78941, 41017, 398600, 536210, 424186, 194298, -42246]
8904A40059N7585p7028n1171a94963G0598j0639g383n6834p7162b0813m5745n3962
8892a20520p7181N6962l2461A40535A8650Q6370a14001j7630F6393M673c5273
8880c58758F2274J23426b3862o4799D24916C3540L25900B7966M6111a3297j66233
8869a79530l2380O3232k43768a70906j10091J07021e4106G7587a32164E3404b575
8857a6378k98280a56666N0403J1340D4886R4552a71802O7547o1875c7808B05897
$$ y = [140059, 197644, 120616, 69445, -194963, 70598, 59959, -7383, -64217, -141379, -20813, -66558, -120520, -197701, -140739, -173200, 140535, 18650, 105020, -114001, -131631, 66393, 71066, -35273, -358758, 62274, 185700, -23862, -88661, 424916, 33540, 359440, 27966, 74077, -13297, -179530, -211910, -148678, -392446, -170906, -280997, -173976, -54106, 77587, -132164, 53404, -2575, -16378, -314658, -156666, -106263, -94923, 44886, 139438, -171802, -104255, -166130, -37808, 205897]
$$ [...]
##END NTUPLES=NMR SPECTRUM
##END=
